{
  "_class": "shapePath",
  "booleanOperation": -1,
  "do_objectID": "36559EF0-7105-4417-944D-E245E4DBCB3B",
  "edited": true,
  "exportOptions": {
    "_class": "exportOptions",
    "exportFormats": [
    ],
    "includedLayerIds": [
    ],
    "layerOptions": 0,
    "shouldTrim": false
  },
  "frame": {
    "_class": "rect",
    "constrainProportions": false,
    "height": 12.24441964285714,
    "width": 13.7142857142857,
    "x": 1.142857142857142,
    "y": 1.285714285714286
  },
  "isFlippedHorizontal": false,
  "isFlippedVertical": false,
  "isLocked": false,
  "isVisible": true,
  "layerListExpandedType": 0,
  "name": "Path",
  "nameIsFixed": false,
  "path": {
    "_class": "path",
    "isClosed": true,
    "pointRadiusBehaviour": 0,
    "points": [
      {
        "_class": "curvePoint",
        "cornerRadius": 0,
        "curveFrom": "{0.41145789062500049, 0}",
        "curveMode": 2,
        "curveTo": "{0.58854210937499996, 0}",
        "hasCurveFrom": true,
        "hasCurveTo": true,
        "point": "{0.50000000000000022, 0}"
      },
      {
        "_class": "curvePoint",
        "cornerRadius": 0,
        "curveFrom": "{0.17458728841145837, 0.095023433141919439}",
        "curveMode": 2,
        "curveTo": "{0.32866791992187477, 0.019004458572600452}",
        "hasCurveFrom": true,
        "hasCurveTo": true,
        "point": "{0.2516276041666668, 0.057013945857259947}"
      },
      {
        "_class": "curvePoint",
        "cornerRadius": 0,
        "curveFrom": "{0.022677724609375276, 0.27536264150943396}",
        "curveMode": 2,
        "curveTo": "{0.11338998372395837, 0.14629445447087777}",
        "hasCurveFrom": true,
        "hasCurveTo": true,
        "point": "{0.068033854166666824, 0.21082854799015588}"
      },
      {
        "_class": "curvePoint",
        "cornerRadius": 0,
        "curveFrom": "{0, 0.48126910582444621}",
        "curveMode": 3,
        "curveTo": "{0, 0.34509123051681706}",
        "hasCurveFrom": true,
        "hasCurveTo": true,
        "point": "{0, 0.42001640689089426}"
      },
      {
        "_class": "curvePoint",
        "cornerRadius": 0,
        "curveFrom": "{0.077582620442708458, 0.65067022559474974}",
        "curveMode": 2,
        "curveTo": "{0.015516337890625044, 0.5396497087776867}",
        "hasCurveFrom": true,
        "hasCurveTo": true,
        "point": "{0.046549479166666748, 0.59515996718621822}"
      },
      {
        "_class": "curvePoint",
        "cornerRadius": 0,
        "curveFrom": "{0.17773437500000006, 0.73913043478260854}",
        "curveMode": 4,
        "curveTo": "{0.1213104817708332, 0.69865990155865454}",
        "hasCurveFrom": false,
        "hasCurveTo": true,
        "point": "{0.17773437500000006, 0.73913043478260854}"
      },
      {
        "_class": "curvePoint",
        "cornerRadius": 0,
        "curveFrom": "{0.23437500000000022, 0.78014766201804764}",
        "curveMode": 1,
        "curveTo": "{0.23437500000000022, 0.78014766201804764}",
        "hasCurveFrom": false,
        "hasCurveTo": false,
        "point": "{0.23437500000000022, 0.78014766201804764}"
      },
      {
        "_class": "curvePoint",
        "cornerRadius": 0,
        "curveFrom": "{0.20638015625000025, 0.90866855619360143}",
        "curveMode": 4,
        "curveTo": "{0.21679687499999994, 0.85890073831009017}",
        "hasCurveFrom": true,
        "hasCurveTo": false,
        "point": "{0.21679687499999994, 0.85890073831009017}"
      },
      {
        "_class": "curvePoint",
        "cornerRadius": 0,
        "curveFrom": "{0.23719651041666684, 0.96554535684987697}",
        "curveMode": 4,
        "curveTo": "{0.19118933593750009, 0.95570117309269897}",
        "hasCurveFrom": true,
        "hasCurveTo": true,
        "point": "{0.17122395833333326, 1}"
      },
      {
        "_class": "curvePoint",
        "cornerRadius": 0,
        "curveFrom": "{0.35026041666666657, 0.85972108285479898}",
        "curveMode": 4,
        "curveTo": "{0.29687473307291695, 0.91878618539786705}",
        "hasCurveFrom": false,
        "hasCurveTo": true,
        "point": "{0.35026041666666657, 0.85972108285479898}"
      },
      {
        "_class": "curvePoint",
        "cornerRadius": 0,
        "curveFrom": "{0.37825520833333298, 0.82854799015586555}",
        "curveMode": 1,
        "curveTo": "{0.37825520833333298, 0.82854799015586555}",
        "hasCurveFrom": false,
        "hasCurveTo": false,
        "point": "{0.37825520833333298, 0.82854799015586555}"
      },
      {
        "_class": "curvePoint",
        "cornerRadius": 0,
        "curveFrom": "{0.44531264973958373, 0.83784525020508605}",
        "curveMode": 4,
        "curveTo": "{0.41536458333333365, 0.83347005742411806}",
        "hasCurveFrom": true,
        "hasCurveTo": false,
        "point": "{0.41536458333333365, 0.83347005742411806}"
      },
      {
        "_class": "curvePoint",
        "cornerRadius": 0,
        "curveFrom": "{0.58854210937499996, 0.8400328137817884}",
        "curveMode": 3,
        "curveTo": "{0.4735241731770839, 0.8400328137817884}",
        "hasCurveFrom": true,
        "hasCurveTo": true,
        "point": "{0.50000000000000022, 0.8400328137817884}"
      },
      {
        "_class": "curvePoint",
        "cornerRadius": 0,
        "curveFrom": "{0.82541271158854157, 0.74500938063986866}",
        "curveMode": 2,
        "curveTo": "{0.67133208007812573, 0.82102835520918782}",
        "hasCurveFrom": true,
        "hasCurveTo": true,
        "point": "{0.74837239583333359, 0.78301886792452813}"
      },
      {
        "_class": "curvePoint",
        "cornerRadius": 0,
        "curveFrom": "{0.97732227539062522, 0.56467017227235439}",
        "curveMode": 2,
        "curveTo": "{0.88661001627604208, 0.69373835931091055}",
        "hasCurveFrom": true,
        "hasCurveTo": true,
        "point": "{0.93196614583333315, 0.62920426579163236}"
      },
      {
        "_class": "curvePoint",
        "cornerRadius": 0,
        "curveFrom": "{1, 0.34509123051681706}",
        "curveMode": 2,
        "curveTo": "{1, 0.49494158326497117}",
        "hasCurveFrom": true,
        "hasCurveTo": true,
        "point": "{1, 0.42001640689089426}"
      },
      {
        "_class": "curvePoint",
        "cornerRadius": 0,
        "curveFrom": "{0.88661001627604208, 0.14629445447087777}",
        "curveMode": 2,
        "curveTo": "{0.97732227539062522, 0.27536264150943396}",
        "hasCurveFrom": true,
        "hasCurveTo": true,
        "point": "{0.93196614583333315, 0.21082854799015588}"
      },
      {
        "_class": "curvePoint",
        "cornerRadius": 0,
        "curveFrom": "{0.67133208007812573, 0.019004458572600452}",
        "curveMode": 2,
        "curveTo": "{0.82541271158854157, 0.095023433141919439}",
        "hasCurveFrom": true,
        "hasCurveTo": true,
        "point": "{0.74837239583333359, 0.057013945857259947}"
      }
    ]
  },
  "resizingConstraint": 63,
  "resizingType": 0,
  "rotation": 0,
  "shouldBreakMaskChain": false
}