{
  "_class": "group",
  "do_objectID": "DFDD03E4-A6D3-42C2-8246-C779031D8A93",
  "exportOptions": {
    "_class": "exportOptions",
    "exportFormats": [
    ],
    "includedLayerIds": [
    ],
    "layerOptions": 0,
    "shouldTrim": false
  },
  "frame": {
    "_class": "rect",
    "constrainProportions": false,
    "height": 50,
    "width": 110,
    "x": 0,
    "y": 0
  },
  "hasClickThrough": false,
  "isFlippedHorizontal": false,
  "isFlippedVertical": false,
  "isLocked": false,
  "isVisible": true,
  "layerListExpandedType": 0,
  "layers": [
    {
      "class": "shapeGroup",
      "id": "6D20E912-D902-4738-BCBB-9A001EC069F9"
    },
    {
      "class": "shapeGroup",
      "id": "CCBFC5F8-539E-4E37-9BE4-B5152B736351"
    },
    {
      "class": "group",
      "id": "28319B78-3C8F-4ED1-A2AE-E92BEC878949"
    },
    {
      "class": "text",
      "id": "B2154F3E-F389-4DE6-AAF1-C957200584AF"
    }
  ],
  "name": "tab-discussions",
  "nameIsFixed": true,
  "resizingConstraint": 63,
  "resizingType": 0,
  "rotation": 0,
  "shouldBreakMaskChain": false,
  "style": {
    "_class": "style",
    "endDecorationType": 0,
    "miterLimit": 10,
    "startDecorationType": 0
  }
}