{
  "_class": "group",
  "do_objectID": "40D2C727-CE94-42A4-A7E1-44A501D930EE",
  "exportOptions": {
    "_class": "exportOptions",
    "exportFormats": [
    ],
    "includedLayerIds": [
    ],
    "layerOptions": 0,
    "shouldTrim": false
  },
  "frame": {
    "_class": "rect",
    "constrainProportions": false,
    "height": 625,
    "width": 1448,
    "x": 11,
    "y": 0
  },
  "hasClickThrough": false,
  "isFlippedHorizontal": false,
  "isFlippedVertical": false,
  "isLocked": false,
  "isVisible": true,
  "layerListExpandedType": 2,
  "layers": [
    {
      "class": "shapeGroup",
      "id": "5CAF5605-CC13-4C9D-8DAA-45F70332FA2E"
    },
    {
      "class": "shapeGroup",
      "id": "5A94CBEF-8066-4975-BD79-D767ADB53AF4"
    },
    {
      "class": "shapeGroup",
      "id": "4F25CE45-CFBB-4699-BAFA-4639702AB0D6"
    }
  ],
  "name": "timeline-unit-weekendday-bg",
  "nameIsFixed": true,
  "resizingConstraint": 63,
  "resizingType": 0,
  "rotation": 0,
  "shouldBreakMaskChain": false,
  "style": {
    "_class": "style",
    "endDecorationType": 0,
    "miterLimit": 10,
    "startDecorationType": 0
  }
}