{
  "_class": "group",
  "do_objectID": "DC012C01-AAFA-4A1A-9F20-874B1E1B0F6C",
  "exportOptions": {
    "_class": "exportOptions",
    "exportFormats": [
    ],
    "includedLayerIds": [
    ],
    "layerOptions": 0,
    "shouldTrim": false
  },
  "frame": {
    "_class": "rect",
    "constrainProportions": false,
    "height": 24,
    "width": 373,
    "x": 66,
    "y": 128
  },
  "hasClickThrough": false,
  "isFlippedHorizontal": false,
  "isFlippedVertical": false,
  "isLocked": false,
  "isVisible": true,
  "layerListExpandedType": 0,
  "layers": [
    {
      "class": "shapeGroup",
      "id": "7F24239F-0762-4081-A6CA-34F49A5D65BA"
    },
    {
      "class": "text",
      "id": "4D886FDE-131A-449D-A628-6A3DE5F45A68"
    }
  ],
  "name": "gitlab-org$03 · Setu Copy 2",
  "nameIsFixed": false,
  "resizingConstraint": 63,
  "resizingType": 0,
  "rotation": 0,
  "shouldBreakMaskChain": false,
  "style": {
    "_class": "style",
    "endDecorationType": 0,
    "miterLimit": 10,
    "startDecorationType": 0
  }
}