{
  "_class": "group",
  "do_objectID": "CDF6B0BB-7850-4430-A135-5F977EB58334",
  "exportOptions": {
    "_class": "exportOptions",
    "exportFormats": [
    ],
    "includedLayerIds": [
    ],
    "layerOptions": 0,
    "shouldTrim": false
  },
  "frame": {
    "_class": "rect",
    "constrainProportions": false,
    "height": 69,
    "width": 1274,
    "x": 3,
    "y": 0
  },
  "hasClickThrough": false,
  "isFlippedHorizontal": false,
  "isFlippedVertical": false,
  "isLocked": false,
  "isVisible": true,
  "layerListExpandedType": 0,
  "layers": [
    {
      "class": "symbolInstance",
      "id": "EE3A0EF3-12EC-4E10-86E2-9D652A3843A4"
    },
    {
      "class": "symbolInstance",
      "id": "3779DDF5-06C5-4BFA-A2B9-5BE0FE78324D"
    },
    {
      "class": "symbolInstance",
      "id": "FF108EF5-2BC1-4563-9253-2119FE35B583"
    },
    {
      "class": "symbolInstance",
      "id": "DB2A31DA-9CC4-412A-BE11-D912BA15BB6A"
    },
    {
      "class": "symbolInstance",
      "id": "BE589684-3B1E-4D53-8942-9E77C9E4C4D6"
    },
    {
      "class": "symbolInstance",
      "id": "3396FAD5-01C4-4477-8BB7-E07607D3ED7F"
    },
    {
      "class": "symbolInstance",
      "id": "6A6438DA-4425-409E-8EAE-774E7489B63A"
    },
    {
      "class": "symbolInstance",
      "id": "4FEF5B08-7DF6-4AE6-9B4B-93C378AFBACF"
    },
    {
      "class": "symbolInstance",
      "id": "074D4723-4CA1-4088-A5E3-97077D227F1A"
    },
    {
      "class": "symbolInstance",
      "id": "1DE72982-22B1-4DB4-ACC8-E0D176BCA042"
    },
    {
      "class": "symbolInstance",
      "id": "6105DFA9-ED9F-47ED-B1D1-9F3DD39A3AEF"
    },
    {
      "class": "symbolInstance",
      "id": "7BC9A846-A1E3-44AD-BC73-C4E2E48DBC5D"
    },
    {
      "class": "symbolInstance",
      "id": "5B831C54-E80F-43EA-AFF3-BCFC076AB75D"
    },
    {
      "class": "symbolInstance",
      "id": "D2BEFF45-2478-4319-8DCF-2F8300600103"
    }
  ],
  "name": "Group 2",
  "nameIsFixed": false,
  "resizingConstraint": 63,
  "resizingType": 0,
  "rotation": 0,
  "shouldBreakMaskChain": false,
  "style": {
    "_class": "style",
    "endDecorationType": 0,
    "miterLimit": 10,
    "startDecorationType": 0
  }
}