{
  "_class": "group",
  "do_objectID": "24F78266-9A52-46CD-BF48-5A222CEA5D1B",
  "exportOptions": {
    "_class": "exportOptions",
    "exportFormats": [
    ],
    "includedLayerIds": [
    ],
    "layerOptions": 0,
    "shouldTrim": false
  },
  "frame": {
    "_class": "rect",
    "constrainProportions": false,
    "height": 24,
    "width": 742,
    "x": 0,
    "y": 96
  },
  "hasClickThrough": false,
  "isFlippedHorizontal": false,
  "isFlippedVertical": false,
  "isLocked": false,
  "isVisible": true,
  "layerListExpandedType": 0,
  "layers": [
    {
      "class": "shapeGroup",
      "id": "A7DF5C8F-BD0C-4E44-8FB1-026046CB8E64"
    },
    {
      "class": "text",
      "id": "768DA59B-5537-4873-A01F-277508B9BA5F"
    }
  ],
  "name": "gitlab-org$03 · Setu",
  "nameIsFixed": false,
  "resizingConstraint": 63,
  "resizingType": 0,
  "rotation": 0,
  "shouldBreakMaskChain": false,
  "style": {
    "_class": "style",
    "endDecorationType": 0,
    "miterLimit": 10,
    "startDecorationType": 0
  }
}