{
  "_class": "shapePath",
  "booleanOperation": -1,
  "do_objectID": "10B54EE3-C941-4EC9-A937-A2D238A53C12",
  "edited": true,
  "exportOptions": {
    "_class": "exportOptions",
    "exportFormats": [
    ],
    "includedLayerIds": [
    ],
    "layerOptions": 0,
    "shouldTrim": false
  },
  "frame": {
    "_class": "rect",
    "constrainProportions": false,
    "height": 15.38347894324259,
    "width": 8.294938306825244,
    "x": 0,
    "y": 0
  },
  "isFlippedHorizontal": false,
  "isFlippedVertical": false,
  "isLocked": false,
  "isVisible": true,
  "layerListExpandedType": 0,
  "name": "path14-path",
  "nameIsFixed": false,
  "path": {
    "_class": "path",
    "isClosed": true,
    "pointRadiusBehaviour": 1,
    "points": [
      {
        "_class": "curvePoint",
        "cornerRadius": 0,
        "curveFrom": "{0.24699794826222538, 1}",
        "curveMode": 1,
        "curveTo": "{0.24699794826222538, 1}",
        "hasCurveFrom": false,
        "hasCurveTo": false,
        "point": "{0.24699794826222538, 1}"
      },
      {
        "_class": "curvePoint",
        "cornerRadius": 0,
        "curveFrom": "{0, 1}",
        "curveMode": 1,
        "curveTo": "{0, 1}",
        "hasCurveFrom": false,
        "hasCurveTo": false,
        "point": "{0, 1}"
      },
      {
        "_class": "curvePoint",
        "cornerRadius": 0,
        "curveFrom": "{0.00078445571267796231, 0}",
        "curveMode": 1,
        "curveTo": "{0.00078445571267796231, 0}",
        "hasCurveFrom": false,
        "hasCurveTo": false,
        "point": "{0.00078445571267796231, 0}"
      },
      {
        "_class": "curvePoint",
        "cornerRadius": 0,
        "curveFrom": "{1, 0}",
        "curveMode": 1,
        "curveTo": "{1, 0}",
        "hasCurveFrom": false,
        "hasCurveTo": false,
        "point": "{1, 0}"
      },
      {
        "_class": "curvePoint",
        "cornerRadius": 0,
        "curveFrom": "{1, 0.12366041363574193}",
        "curveMode": 1,
        "curveTo": "{1, 0.12366041363574193}",
        "hasCurveFrom": false,
        "hasCurveTo": false,
        "point": "{1, 0.12366041363574193}"
      },
      {
        "_class": "curvePoint",
        "cornerRadius": 0,
        "curveFrom": "{0.24778240361284684, 0.12366041363574193}",
        "curveMode": 1,
        "curveTo": "{0.24778240361284684, 0.12366041363574193}",
        "hasCurveFrom": false,
        "hasCurveTo": false,
        "point": "{0.24778240361284684, 0.12366041363574193}"
      },
      {
        "_class": "curvePoint",
        "cornerRadius": 0,
        "curveFrom": "{0.24699794826222538, 1}",
        "curveMode": 1,
        "curveTo": "{0.24699794826222538, 1}",
        "hasCurveFrom": false,
        "hasCurveTo": false,
        "point": "{0.24699794826222538, 1}"
      }
    ]
  },
  "resizingConstraint": 63,
  "resizingType": 0,
  "rotation": 0,
  "shouldBreakMaskChain": false
}