{
  "_class": "group",
  "do_objectID": "28118978-3F3D-456D-8481-32AC792C3BC8",
  "exportOptions": {
    "_class": "exportOptions",
    "exportFormats": [
    ],
    "includedLayerIds": [
    ],
    "layerOptions": 0,
    "shouldTrim": false
  },
  "frame": {
    "_class": "rect",
    "constrainProportions": false,
    "height": 51,
    "width": 102,
    "x": 212,
    "y": 0
  },
  "hasClickThrough": false,
  "isFlippedHorizontal": false,
  "isFlippedVertical": false,
  "isLocked": false,
  "isVisible": true,
  "layerListExpandedType": 0,
  "layers": [
    {
      "class": "shapeGroup",
      "id": "70B5B5EC-6274-4CD7-83F7-24DCDEFF0B74"
    },
    {
      "class": "shapeGroup",
      "id": "C58244C1-88D9-46C6-9D13-517365CA155B"
    },
    {
      "class": "shapeGroup",
      "id": "34019D20-EEF5-489C-9583-81BF59072CEA"
    },
    {
      "class": "shapeGroup",
      "id": "0BF9146C-5526-45E2-8EFA-2126112113AA"
    },
    {
      "class": "shapeGroup",
      "id": "F18F8B5A-6ECD-4C47-9CC5-606B6125686E"
    },
    {
      "class": "group",
      "id": "68E2C09D-C303-4B7F-A23C-2E33C9E26C44"
    },
    {
      "class": "text",
      "id": "9FC9C087-35EF-4400-BD93-6298A3ED18FA"
    }
  ],
  "name": "pipelines",
  "nameIsFixed": true,
  "resizingConstraint": 44,
  "resizingType": 1,
  "rotation": 0,
  "shouldBreakMaskChain": false,
  "style": {
    "_class": "style",
    "endDecorationType": 0,
    "miterLimit": 10,
    "startDecorationType": 0
  }
}