{
  "_class": "shapePath",
  "booleanOperation": -1,
  "do_objectID": "48461A6E-89D6-4020-92FC-437637DDA483",
  "edited": true,
  "exportOptions": {
    "_class": "exportOptions",
    "exportFormats": [
    ],
    "includedLayerIds": [
    ],
    "layerOptions": 0,
    "shouldTrim": false
  },
  "frame": {
    "_class": "rect",
    "constrainProportions": false,
    "height": 7.930422966002135,
    "width": 7.359,
    "x": 4.094000000000001,
    "y": 2.467577033997864
  },
  "isFlippedHorizontal": false,
  "isFlippedVertical": false,
  "isLocked": false,
  "isVisible": true,
  "layerListExpandedType": 0,
  "name": "Path",
  "nameIsFixed": false,
  "path": {
    "_class": "path",
    "isClosed": true,
    "pointRadiusBehaviour": 1,
    "points": [
      {
        "_class": "curvePoint",
        "cornerRadius": 0,
        "curveFrom": "{0.33238211713548022, 1}",
        "curveMode": 1,
        "curveTo": "{0.33238211713548022, 1}",
        "hasCurveFrom": false,
        "hasCurveTo": false,
        "point": "{0.33238211713548022, 1}"
      },
      {
        "_class": "curvePoint",
        "cornerRadius": 0,
        "curveFrom": "{0.6363414021634739, 0.97642382582439258}",
        "curveMode": 4,
        "curveTo": "{0.63582008425057734, 1}",
        "hasCurveFrom": true,
        "hasCurveTo": false,
        "point": "{0.63582008425057734, 1}"
      },
      {
        "_class": "curvePoint",
        "cornerRadius": 0,
        "curveFrom": "{0.64669112651175431, 0.90820161760338025}",
        "curveMode": 2,
        "curveTo": "{0.6386572652967234, 0.95291129574994837}",
        "hasCurveFrom": true,
        "hasCurveTo": true,
        "point": "{0.64275037369207777, 0.92963805305314029}"
      },
      {
        "_class": "curvePoint",
        "cornerRadius": 0,
        "curveFrom": "{0.6689767631471667, 0.85246688543400384}",
        "curveMode": 2,
        "curveTo": "{0.65267019975540164, 0.88853053566124729}",
        "hasCurveFrom": true,
        "hasCurveTo": true,
        "point": "{0.66082348145128411, 0.87049871054762573}"
      },
      {
        "_class": "curvePoint",
        "cornerRadius": 0,
        "curveFrom": "{0.70756896317434448, 0.80240650382485812}",
        "curveMode": 2,
        "curveTo": "{0.67984780540834355, 0.83519164039507965}",
        "hasCurveFrom": true,
        "hasCurveTo": true,
        "point": "{0.69370838429134396, 0.81879907210996894}"
      },
      {
        "_class": "curvePoint",
        "cornerRadius": 0,
        "curveFrom": "{0.78067672238075836, 0.73822329415469412}",
        "curveMode": 4,
        "curveTo": "{0.72469085473569783, 0.78563564550239884}",
        "hasCurveFrom": true,
        "hasCurveTo": true,
        "point": "{0.74534583503193386, 0.76848649714259087}"
      },
      {
        "_class": "curvePoint",
        "cornerRadius": 0,
        "curveFrom": "{0.87468677028253394, 0.65658547792051791}",
        "curveMode": 2,
        "curveTo": "{0.8138334012773476, 0.70959934799530855}",
        "hasCurveFrom": true,
        "hasCurveTo": true,
        "point": "{0.84495175974996628, 0.6823624653062017}"
      },
      {
        "_class": "curvePoint",
        "cornerRadius": 0,
        "curveFrom": "{0.94931376545726331, 0.56912764745982181}",
        "curveMode": 2,
        "curveTo": "{0.90188178501956973, 0.62839600023397346}",
        "hasCurveFrom": true,
        "hasCurveTo": true,
        "point": "{0.92621280065226264, 0.59812988365655606}"
      },
      {
        "_class": "curvePoint",
        "cornerRadius": 0,
        "curveFrom": "{0.99347737464329389, 0.47102443110739012}",
        "curveMode": 2,
        "curveTo": "{0.96725098518820496, 0.53798176771811146}",
        "hasCurveFrom": true,
        "hasCurveTo": true,
        "point": "{0.98043212392988177, 0.5045661477523089}"
      },
      {
        "_class": "curvePoint",
        "cornerRadius": 0,
        "curveFrom": "{1, 0.32651763684018364}",
        "curveMode": 3,
        "curveTo": "{1, 0.43294323401428692}",
        "hasCurveFrom": true,
        "hasCurveTo": true,
        "point": "{1, 0.39019645979388284}"
      },
      {
        "_class": "curvePoint",
        "cornerRadius": 0,
        "curveFrom": "{0.9443266503708343, 0.1743632081326513}",
        "curveMode": 2,
        "curveTo": "{0.98872129365402905, 0.27040461463345861}",
        "hasCurveFrom": true,
        "hasCurveTo": true,
        "point": "{0.96602799293382258, 0.22185739317370773}"
      },
      {
        "_class": "curvePoint",
        "cornerRadius": 0,
        "curveFrom": "{0.82497621959505363, 0.066758477860737603}",
        "curveMode": 2,
        "curveTo": "{0.91062933855050887, 0.13241135537307661}",
        "hasCurveFrom": true,
        "hasCurveTo": true,
        "point": "{0.86778094849843723, 0.099543614430958938}"
      },
      {
        "_class": "curvePoint",
        "cornerRadius": 0,
        "curveFrom": "{0.64353424580758445, 0.0077319619829621196}",
        "curveMode": 4,
        "curveTo": "{0.77279521674140506, 0.042043528753955318}",
        "hasCurveFrom": true,
        "hasCurveTo": true,
        "point": "{0.71123793993749151, 0.025272670431495926}"
      },
      {
        "_class": "curvePoint",
        "cornerRadius": 0,
        "curveFrom": "{0.43307514607963044, 5.3334608248754194e-05}",
        "curveMode": 4,
        "curveTo": "{0.57348088871956149, -0.00075996418043731593}",
        "hasCurveFrom": true,
        "hasCurveTo": true,
        "point": "{0.50319336866422071, 5.3334608248754194e-05}"
      },
      {
        "_class": "curvePoint",
        "cornerRadius": 0,
        "curveFrom": "{0.24895764950698282, 0.03811463885942494}",
        "curveMode": 4,
        "curveTo": "{0.36757711645604024, 0.0079974253925716443}",
        "hasCurveFrom": true,
        "hasCurveTo": true,
        "point": "{0.30683516782171488, 0.023759510282101149}"
      },
      {
        "_class": "curvePoint",
        "cornerRadius": 0,
        "curveFrom": "{0.10313901345291472, 0.13195046096383167}",
        "curveMode": 2,
        "curveTo": "{0.19491506947075826, 0.063446534799841262}",
        "hasCurveFrom": true,
        "hasCurveTo": true,
        "point": "{0.14811795080853374, 0.098156550960680378}"
      },
      {
        "_class": "curvePoint",
        "cornerRadius": 0,
        "curveFrom": "{0.014268242967794475, 0.28024015560452514}",
        "curveMode": 2,
        "curveTo": "{0.067400462019296045, 0.17507552522158434}",
        "hasCurveFrom": true,
        "hasCurveTo": true,
        "point": "{0.040766408479412937, 0.22765784041305473}"
      },
      {
        "_class": "curvePoint",
        "cornerRadius": 0,
        "curveFrom": "{0, 0.41680285908740877}",
        "curveMode": 4,
        "curveTo": "{0.00067944014132353492, 0.34328849516264315}",
        "hasCurveFrom": false,
        "hasCurveTo": true,
        "point": "{0, 0.41680285908740877}"
      },
      {
        "_class": "curvePoint",
        "cornerRadius": 0,
        "curveFrom": "{0.35955972278842246, 0.38855720296537188}",
        "curveMode": 4,
        "curveTo": "{0.35874439461883417, 0.41680285908740877}",
        "hasCurveFrom": true,
        "hasCurveTo": false,
        "point": "{0.35874439461883417, 0.41680285908740877}"
      },
      {
        "_class": "curvePoint",
        "cornerRadius": 0,
        "curveFrom": "{0.38103003125424667, 0.32361741322051035}",
        "curveMode": 2,
        "curveTo": "{0.36417991574942254, 0.36434664057505456}",
        "hasCurveFrom": true,
        "hasCurveTo": true,
        "point": "{0.37260497350183464, 0.34391897855822434}"
      },
      {
        "_class": "curvePoint",
        "cornerRadius": 0,
        "curveFrom": "{0.41752851990764855, 0.28172798400451693}",
        "curveMode": 2,
        "curveTo": "{0.39190107351542347, 0.30697265157716713}",
        "hasCurveFrom": true,
        "hasCurveTo": true,
        "point": "{0.40494632422883547, 0.2942368869864273}"
      },
      {
        "_class": "curvePoint",
        "cornerRadius": 0,
        "curveFrom": "{0.46704715314580802, 0.25930810687123013}",
        "curveMode": 2,
        "curveTo": "{0.43293406323549655, 0.27195364842812519}",
        "hasCurveFrom": true,
        "hasCurveTo": true,
        "point": "{0.45006114961271926, 0.2656129408270419}"
      },
      {
        "_class": "curvePoint",
        "cornerRadius": 0,
        "curveFrom": "{0.54925941024595759, 0.2562817865724405}",
        "curveMode": 3,
        "curveTo": "{0.48471259682022028, 0.2562817865724405}",
        "hasCurveFrom": true,
        "hasCurveTo": true,
        "point": "{0.50305748063595612, 0.2562817865724405}"
      },
      {
        "_class": "curvePoint",
        "cornerRadius": 0,
        "curveFrom": "{0.62970512297866588, 0.31617770915265264}",
        "curveMode": 2,
        "curveTo": "{0.58363908139692922, 0.26826097108848285}",
        "hasCurveFrom": true,
        "hasCurveTo": true,
        "point": "{0.60674004620192978, 0.29221934012056777}"
      },
      {
        "_class": "curvePoint",
        "cornerRadius": 0,
        "curveFrom": "{0.6412556053811661, 0.44643557867972439}",
        "curveMode": 2,
        "curveTo": "{0.6412556053811661, 0.35375451952929088}",
        "hasCurveFrom": true,
        "hasCurveTo": true,
        "point": "{0.6412556053811661, 0.40507586792959893}"
      },
      {
        "_class": "curvePoint",
        "cornerRadius": 0,
        "curveFrom": "{0.56964261448566389, 0.55412214264498993}",
        "curveMode": 2,
        "curveTo": "{0.6268514743851068, 0.48451677577282765}",
        "hasCurveFrom": true,
        "hasCurveTo": true,
        "point": "{0.598179100421253, 0.51931945920890876}"
      },
      {
        "_class": "curvePoint",
        "cornerRadius": 0,
        "curveFrom": "{0.45182769398016048, 0.65159487560184037}",
        "curveMode": 4,
        "curveTo": "{0.53037097431716285, 0.59056408290958207}",
        "hasCurveFrom": true,
        "hasCurveTo": true,
        "point": "{0.48090773202880849, 0.62864528000268527}"
      },
      {
        "_class": "curvePoint",
        "cornerRadius": 0,
        "curveFrom": "{0.38959097703492346, 0.72624410963865194}",
        "curveMode": 2,
        "curveTo": "{0.42791140100557168, 0.67580543799215764}",
        "hasCurveFrom": true,
        "hasCurveTo": true,
        "point": "{0.40875118902024754, 0.70102477381540473}"
      },
      {
        "_class": "curvePoint",
        "cornerRadius": 0,
        "curveFrom": "{0.35129837220632981, 0.81562340104175457}",
        "curveMode": 2,
        "curveTo": "{0.37437151786927597, 0.75398537904422391}",
        "hasCurveFrom": true,
        "hasCurveTo": true,
        "point": "{0.36309281152330503, 0.78387029199477187}"
      },
      {
        "_class": "curvePoint",
        "cornerRadius": 0,
        "curveFrom": "{0.33438771993808292, 0.92107165173359251}",
        "curveMode": 2,
        "curveTo": "{0.34327867185230249, 0.84847745338864367}",
        "hasCurveFrom": true,
        "hasCurveTo": true,
        "point": "{0.33917651854871605, 0.88184741166808711}"
      },
      {
        "_class": "curvePoint",
        "cornerRadius": 0,
        "curveFrom": "{0.33238211713548071, 1}",
        "curveMode": 4,
        "curveTo": "{0.33211890831745577, 0.96052560052331626}",
        "hasCurveFrom": false,
        "hasCurveTo": true,
        "point": "{0.33238211713548071, 1}"
      }
    ]
  },
  "resizingConstraint": 63,
  "resizingType": 0,
  "rotation": 0,
  "shouldBreakMaskChain": false
}