{
  "_class": "shapeGroup",
  "clippingMaskMode": 0,
  "do_objectID": "7A888817-D7A0-4341-BEA3-DA3FFE13F6AE",
  "exportOptions": {
    "_class": "exportOptions",
    "exportFormats": [
    ],
    "includedLayerIds": [
    ],
    "layerOptions": 0,
    "shouldTrim": false
  },
  "frame": {
    "_class": "rect",
    "constrainProportions": false,
    "height": 32,
    "width": 32,
    "x": 0,
    "y": 0
  },
  "hasClickThrough": false,
  "hasClippingMask": false,
  "isFlippedHorizontal": false,
  "isFlippedVertical": false,
  "isLocked": false,
  "isVisible": true,
  "layerListExpandedType": 0,
  "layers": [
    {
      "class": "rectangle",
      "id": "09EFC10E-D9C9-498C-9063-6E9BFECF0EE4"
    }
  ],
  "name": "label-fill/green",
  "nameIsFixed": true,
  "resizingConstraint": 63,
  "resizingType": 0,
  "rotation": 0,
  "shouldBreakMaskChain": false,
  "style": {
    "sharedObjectID": "F5A6BE91-D4F1-4F69-8531-CD814AB409DB"
  },
  "windingRule": 1
}