<svg xmlns="http://www.w3.org/2000/svg" viewBox="0 0 32 32" enable-background="new 0 0 32 32"><path d="M11.778,0H3.222C1.445,0,0,1.512,0,3.369v25.262C0,30.488,1.445,32,3.222,32h8.557
		C13.555,32,15,30.488,15,28.631V3.369C15,1.512,13.555,0,11.778,0z M13,28.631C13,29.386,12.452,30,11.778,30H3.222
		C2.548,30,2,29.386,2,28.631V3.369C2,2.614,2.548,2,3.222,2h8.557C12.452,2,13,2.614,13,3.369V28.631z"/><path d="M28.778,0h-8.557C18.445,0,17,1.512,17,3.369v25.262C17,30.488,18.445,32,20.222,32h8.557
		C30.555,32,32,30.488,32,28.631V3.369C32,1.512,30.555,0,28.778,0z M30,28.631C30,29.386,29.452,30,28.778,30h-8.557
		C19.548,30,19,29.386,19,28.631V3.369C19,2.614,19.548,2,20.222,2h8.557C29.452,2,30,2.614,30,3.369V28.631z"/></svg>
