<svg xmlns="http://www.w3.org/2000/svg" viewBox="0 0 32 32" enable-background="new 0 0 32 32"><path d="M21.631,24H10.369C8.512,24,7,25.445,7,27.222v1.557C7,30.555,8.512,32,10.369,32h11.262
		C23.488,32,25,30.555,25,28.778v-1.557C25,25.445,23.488,24,21.631,24z M23,28.778C23,29.452,22.386,30,21.631,30H10.369
		C9.614,30,9,29.452,9,28.778v-1.557C9,26.548,9.614,26,10.369,26h11.262C22.386,26,23,26.548,23,27.222V28.778z"/><path d="M28.631,0H3.369C1.512,0,0,1.445,0,3.222v1.557C0,6.555,1.512,8,3.369,8h25.262C30.488,8,32,6.555,32,4.778
		V3.222C32,1.445,30.488,0,28.631,0z M30,4.778C30,5.452,29.386,6,28.631,6H3.369C2.614,6,2,5.452,2,4.778V3.222
		C2,2.548,2.614,2,3.369,2h25.262C29.386,2,30,2.548,30,3.222V4.778z"/><path d="m16 21c.553 0 1-.447 1-1v-5.712l2.904 2.529c.189.165.424.246.657.246.278 0 .557-.116.754-.343.363-.417.319-1.049-.097-1.411l-4.562-3.973c-.377-.328-.938-.328-1.314 0l-4.562 3.973c-.416.362-.46.994-.097 1.411.361.416.995.458 1.411.097l2.906-2.529v5.712c0 .553.447 1 1 1"/></svg>
