<?xml version="1.0" encoding="utf-8"?>
<!-- Generator: Adobe Illustrator 19.2.1, SVG Export Plug-In . SVG Version: 6.00 Build 0)  -->
<svg version="1.1" id="Layer_1" xmlns:sketch="http://www.bohemiancoding.com/sketch/ns"
	 xmlns="http://www.w3.org/2000/svg" xmlns:xlink="http://www.w3.org/1999/xlink" x="0px" y="0px" viewBox="0 0 76 76"
	 style="enable-background:new 0 0 76 76;" xml:space="preserve">
<style type="text/css">
	.st0{fill:none;stroke:#E5E5E4;stroke-width:2;stroke-linecap:round;stroke-linejoin:round;stroke-miterlimit:10;}
	.st1{fill:#8C929D;}
	.st2{fill:#FC6D26;}
	.st3{fill:#E24329;}
	.st4{fill:#FCA326;}
	.st5{fill:#444444;}
	.st6{fill:#554488;}
	.st7{fill:#4887C5;}
	.st8{fill:url(#SVGID_1_);}
	.st9{fill:url(#SVGID_2_);}
	.st10{fill:#FFFFFF;}
	.st11{opacity:0.1;}
	.st12{fill:#5C5C5C;}
	.st13{fill:#787878;}
	.st14{fill:#A1A1A1;}
	.st15{opacity:0.15;}
	.st16{fill:#373D47;}
	.st17{fill:none;stroke:#000000;stroke-miterlimit:10;}
	.st18{fill:none;stroke:#FC6D26;stroke-width:1.8;stroke-linecap:round;stroke-linejoin:round;stroke-miterlimit:10;}
	.st19{fill:none;stroke:#E24329;stroke-width:1.8;stroke-linecap:round;stroke-linejoin:round;stroke-miterlimit:10;}
	.st20{fill:none;stroke:#FCA326;stroke-width:1.8;stroke-linecap:round;stroke-linejoin:round;stroke-miterlimit:10;}
	.st21{fill:none;stroke:#E5E5E4;stroke-width:1.8;stroke-linecap:round;stroke-linejoin:round;stroke-miterlimit:10;}
	.st22{fill:#2B2B2B;}
	.st23{fill:#FFFFFF;stroke:#E5E5E4;stroke-width:2;stroke-linecap:round;stroke-linejoin:round;stroke-miterlimit:10;}
	.st24{fill:#E5E5E4;}
	.st25{fill:none;stroke:#E5E5E4;stroke-width:1.8353;stroke-linecap:round;stroke-linejoin:round;stroke-miterlimit:10;}
	.st26{fill:none;stroke:#E14329;stroke-width:2;stroke-linecap:round;stroke-linejoin:round;stroke-miterlimit:10;}
	.st27{fill:#FFFFFF;stroke:#E14329;stroke-width:2;stroke-linecap:round;stroke-linejoin:round;stroke-miterlimit:10;}
	.st28{fill:none;stroke:#FCA326;stroke-width:2;stroke-linecap:round;stroke-linejoin:round;stroke-miterlimit:10;}
	.st29{fill:#E14329;}
	.st30{fill:none;stroke:#E14329;stroke-width:1.8353;stroke-linecap:round;stroke-linejoin:round;stroke-miterlimit:10;}
	.st31{fill:none;stroke:#E14329;stroke-width:2.055;stroke-linecap:round;stroke-linejoin:round;stroke-miterlimit:10;}
</style>
<path class="st29" d="M69.1,60.1v-35c0-3.8-3.1-6.9-6.9-6.9h-7.7c-0.5-1.7-1.8-3-3.5-3.5v-3.9C51,8.2,48.8,6,46.2,6H23.8
	C21.2,6,19,8.2,19,10.8V18H6.8C3,18,0,21,0,24.8v36.4C0,65,3,68,6.8,68H49c0.6,0,1-0.5,1-1s-0.5-1-1-1H6.8C4.2,66,2,63.8,2,61.2V40
	h27.1c0.5,2.3,2.5,4,4.9,4c2.4,0,4.4-1.7,4.9-4H67v20.1c-4,0.5-7,3.9-7,7.9c0,4.4,3.6,8,8,8c4.4,0,8-3.6,8-8
	C76,64,73,60.6,69.1,60.1z M49.7,16.5c1.7,0,3,1.3,3,3c0,1.7-1.3,3-3,3c-1.7,0-3-1.3-3-3C46.7,17.8,48,16.5,49.7,16.5z M21,10.8
	C21,9.3,22.3,8,23.8,8h22.4c1.5,0,2.8,1.2,2.8,2.8v3.8c-1.9,0.3-3.4,1.6-4,3.4H21V10.8z M34,42c-1.7,0-3-1.3-3-3c0-1.7,1.3-3,3-3
	c1.7,0,3,1.3,3,3C37,40.7,35.7,42,34,42z M38.9,38c-0.5-2.3-2.5-4-4.9-4c-2.4,0-4.4,1.7-4.9,4H2V24.8C2,22.2,4.2,20,6.8,20h38
	c0.3,2.5,2.4,4.5,5,4.5c2.5,0,4.6-1.8,4.9-4.2h7.6c2.7,0,4.8,2.2,4.8,4.8V38H38.9z M68,73.9c-3.2,0-5.9-2.6-5.9-5.9s2.6-5.9,5.9-5.9
	c3.2,0,5.9,2.6,5.9,5.9S71.2,73.9,68,73.9z"/>
</svg>
