<?xml version="1.0" encoding="utf-8"?>
<!-- Generator: Adobe Illustrator 19.2.1, SVG Export Plug-In . SVG Version: 6.00 Build 0)  -->
<svg version="1.1" id="Layer_1" xmlns:sketch="http://www.bohemiancoding.com/sketch/ns"
	 xmlns="http://www.w3.org/2000/svg" xmlns:xlink="http://www.w3.org/1999/xlink" x="0px" y="0px" viewBox="0 0 76 76"
	 style="enable-background:new 0 0 76 76;" xml:space="preserve">
<style type="text/css">
	.st0{fill:#E14329;}
</style>
<path class="st0" d="M43.8,18.9c0-0.4-0.3-0.9-1-1l-1.1-0.1c-0.9-0.1-1.7-0.2-2.6-0.3c-0.5-0.1-0.6-0.3-0.7-0.5
	c-0.3-1-0.7-1.9-1.2-2.9c-0.1-0.2-0.2-0.5,0.1-0.8c0.5-0.6,1-1.3,1.5-1.9l0.6-0.8c0.5-0.7,0.5-1.1,0-1.8c0,0-0.1-0.1-0.1-0.1
	c-0.9-1.1-1.8-2.1-2.9-3c-0.3-0.3-0.6-0.5-0.9-0.8l-0.3-0.3c-0.5-0.5-1.1-0.3-1.5,0c-0.7,0.6-1.5,1.1-2.2,1.7l-0.7,0.5
	c-0.3,0.3-0.6,0.3-1,0.1c-0.9-0.5-1.8-0.8-2.7-1.1c-0.4-0.1-0.5-0.3-0.6-0.7c-0.1-0.4-0.1-0.9-0.2-1.3l-0.3-2.5
	c-0.1-0.5-0.4-0.8-0.9-0.9c-2.2-0.3-4.3-0.3-6.5,0C18.3,0.2,18,0.6,17.9,1l-0.1,1.1c-0.1,0.9-0.2,1.8-0.4,2.7
	c-0.1,0.5-0.3,0.6-0.5,0.7c-1,0.4-1.9,0.8-2.9,1.2c-0.3,0.1-0.5,0.1-0.8-0.1c-0.5-0.4-1.1-0.8-1.6-1.2l-1.5-1.1C9.7,4,9,4,8.7,4.5
	C8.4,4.9,8.5,5.5,8.9,5.9L10.4,7c0.5,0.4,1.1,0.8,1.6,1.2c0.8,0.6,1.9,0.7,2.8,0.3c0.9-0.4,1.8-0.8,2.8-1.1c1-0.4,1.6-1.2,1.8-2.3
	c0.1-0.9,0.2-1.8,0.4-2.7l0-0.3c1.5-0.1,3-0.1,4.5,0l0.2,1.7c0.1,0.4,0.1,0.9,0.2,1.3c0.2,1.1,0.8,2,1.9,2.4c0.8,0.3,1.6,0.6,2.5,1
	c1,0.5,2.1,0.4,3-0.3l0.7-0.5c0.6-0.4,1.1-0.9,1.7-1.3c0.2,0.2,0.5,0.4,0.7,0.6c0.9,0.8,1.7,1.6,2.5,2.6L37.3,10
	c-0.5,0.6-1,1.3-1.5,1.9c-0.7,0.9-0.8,1.9-0.3,2.9c0.4,0.9,0.8,1.8,1.1,2.7c0.4,1,1.2,1.7,2.3,1.8c0.9,0.1,1.7,0.2,2.6,0.3l0.5,0.1
	c0.1,1.5,0.1,3,0,4.5l-3,0.4c-1.2,0.2-2,0.9-2.4,2c-0.3,0.8-0.6,1.6-1,2.4c-0.5,1.1-0.4,2.2,0.3,3.1l1.8,2.3c-0.9,1.1-1.9,2-3,3
	c-0.1,0.1-0.1,0.1-0.2,0.2l-1.1-0.9c-0.5-0.4-0.9-0.7-1.4-1c-0.9-0.6-1.9-0.7-2.9-0.3c-0.8,0.4-1.7,0.8-2.7,1.1
	c-1,0.4-1.7,1.2-1.8,2.3c-0.1,0.9-0.2,1.8-0.4,2.7l0,0.3c-1.5,0.1-3,0.1-4.5,0l-0.1-0.8c-0.1-0.7-0.2-1.5-0.3-2.2
	c-0.2-1.2-0.8-2-2-2.4c-0.9-0.3-1.7-0.6-2.3-1c-1.1-0.6-2.3-0.5-3.3,0.4c-0.6,0.4-1.1,0.9-1.7,1.3l-0.6,0.4
	c-0.7-0.6-1.3-1.1-1.8-1.7c-0.4-0.4-0.8-0.9-1.2-1.3l-0.2-0.2C7,33.7,7.6,32.8,8.2,32c0.7-0.9,0.8-1.9,0.3-2.9
	c-0.4-0.8-0.8-1.7-1.1-2.6c-0.4-1-1.2-1.7-2.3-1.9c-0.8-0.1-1.6-0.2-2.5-0.3l-0.6-0.1c-0.1-1.5-0.1-3,0-4.5l1.2-0.2
	c0.6-0.1,1.2-0.2,1.8-0.2c1.1-0.2,2-0.8,2.4-1.9c0.3-0.9,0.6-1.7,1-2.5c0.5-1.1,0.4-2.2-0.4-3.1C7.6,11.1,7,10.4,6.5,9.7L6.3,9.5
	c0.2-0.3,0.5-0.6,0.8-0.9l9.2,9.2c-2.1,2.8-1.9,6.7,0.7,9.2c1.4,1.4,3.2,2.1,5,2.1s3.6-0.7,5-2.1c2.8-2.8,2.8-7.2,0-10
	c-2.5-2.5-6.5-2.7-9.2-0.7L7.9,6.5c-0.4-0.4-1-0.4-1.4,0c0,0,0,0,0,0c0,0,0,0,0,0C5.9,7.1,4.6,8.3,4.2,9c-0.2,0.3-0.2,0.6,0,0.9
	c0,0.1,0.1,0.2,0.1,0.2l0.6,0.8c0.5,0.7,1.1,1.4,1.6,2.1c0.3,0.4,0.3,0.7,0.1,1c-0.4,0.9-0.8,1.8-1.1,2.7c-0.1,0.4-0.3,0.5-0.7,0.6
	c-0.6,0.1-1.2,0.2-1.8,0.2l-2,0.3c-0.5,0.1-0.8,0.4-0.9,0.9c-0.3,2.2-0.3,4.4,0,6.5c0.1,0.4,0.4,0.8,0.9,0.9l1.3,0.2
	c0.8,0.1,1.6,0.2,2.4,0.3c0.5,0.1,0.6,0.3,0.7,0.6c0.3,1,0.7,1.9,1.2,2.8c0.1,0.3,0.1,0.6-0.1,0.9c-0.7,0.9-1.4,1.9-2.1,2.8
	l-0.1,0.1c-0.4,0.5-0.4,1.1,0,1.6L5,36c0.4,0.5,0.8,0.9,1.2,1.4c0.7,0.7,1.5,1.5,2.5,2.3c0.6,0.5,1.1,0.3,1.5,0l1.1-0.8
	c0.6-0.4,1.2-0.9,1.7-1.3c0.5-0.4,0.8-0.3,1.2-0.1c0.8,0.4,1.6,0.7,2.6,1.1c0.4,0.1,0.6,0.3,0.6,0.8c0.1,0.7,0.2,1.4,0.3,2.2
	l0.2,1.6c0.1,0.5,0.4,0.8,0.9,0.9c1.1,0.1,2.2,0.2,3.3,0.2c1.1,0,2.2-0.1,3.2-0.2c0.4-0.1,0.8-0.4,0.9-0.8l0.1-1.1
	c0.1-0.9,0.2-1.8,0.4-2.7c0.1-0.5,0.3-0.6,0.5-0.7c1-0.4,1.9-0.8,2.8-1.2c0.3-0.1,0.5-0.1,0.8,0.1c0.5,0.3,0.9,0.7,1.3,1l1.7,1.3
	c0.3,0.2,0.7,0.3,1,0.1c0.1,0,0.2-0.1,0.3-0.2l0.2-0.2c0.2-0.1,0.4-0.3,0.5-0.4c1.4-1.2,2.6-2.5,3.6-3.8c0.4-0.4,0.4-1,0-1.4
	l-2.2-2.9c-0.3-0.4-0.3-0.7-0.1-1c0.4-0.9,0.8-1.8,1.1-2.6c0.1-0.4,0.4-0.6,0.8-0.6l3.7-0.5c0.4,0,0.7-0.3,0.8-0.7
	c0-0.1,0-0.2,0.1-0.2C44.1,23.1,44.1,21,43.8,18.9z M18.5,18.5c1-1,2.2-1.4,3.5-1.4s2.5,0.5,3.5,1.4c1.9,1.9,1.9,5.1,0,7
	c-1.9,1.9-5.1,1.9-7,0C16.6,23.6,16.6,20.4,18.5,18.5z"/>
<path class="st0" d="M75.5,57.7l-3.4-1.8c-0.4-0.2-0.5-0.5-0.5-0.7c0-1.1,0-2.1-0.1-3.2c0-0.3,0.1-0.5,0.4-0.7
	c0.6-0.4,1.1-0.7,1.7-1.1l1.7-1c0.5-0.3,0.6-1,0.3-1.4c-0.3-0.5-1-0.6-1.4-0.3l-1.7,1c-0.6,0.4-1.2,0.7-1.7,1.1
	c-0.9,0.6-1.4,1.5-1.3,2.6c0.1,1,0.1,2,0.1,3c0,1.1,0.5,2,1.6,2.6l2.7,1.5c-0.4,1.4-1,2.9-1.6,4.2L70.5,63c-0.5-0.1-0.9-0.2-1.4-0.3
	c-1.2-0.3-2.2,0.1-3,1c-0.6,0.7-1.2,1.3-1.9,2c-0.9,0.8-1.1,1.9-0.8,3.1l0.2,0.8c0.2,0.7,0.4,1.4,0.6,2.1c-0.3,0.1-0.5,0.3-0.8,0.4
	c-1,0.5-2.1,1-3.3,1.4l-0.2-0.4c-0.5-0.8-0.9-1.5-1.4-2.3c-0.6-1-1.6-1.5-2.7-1.4c-1,0.1-2,0.1-3,0.1c-1.1,0-2,0.5-2.6,1.5
	c-0.4,0.8-0.9,1.6-1.3,2.4l-0.2,0.3c-1.5-0.4-2.9-1-4.2-1.6l0.7-3c0.3-1.2-0.1-2.3-1-3.1c-0.7-0.5-1.3-1.2-1.9-1.8
	c-0.8-0.9-2-1.2-3.2-0.8l-2.9,0.9c-0.7-1.2-1.3-2.5-1.8-3.9c0-0.1,0-0.1-0.1-0.2l1.2-0.7c0.5-0.3,1-0.6,1.5-0.9
	c0.9-0.6,1.4-1.6,1.3-2.7c-0.1-1-0.1-1.9-0.1-2.9c0-1.1-0.5-2.1-1.6-2.6c-0.8-0.4-1.6-0.9-2.4-1.3l-0.4-0.2c0.4-1.4,1-2.9,1.6-4.2
	l0.8,0.2c0.7,0.2,1.4,0.3,2.1,0.5c1.2,0.3,2.3-0.1,3-1c0.7-0.8,1.2-1.4,1.8-1.9c1-0.9,1.3-2,0.9-3.3c-0.2-0.7-0.4-1.4-0.6-2.1
	l-0.2-0.7c0.8-0.5,1.5-0.8,2.3-1.1c0.6-0.2,1.1-0.4,1.7-0.6l0.2-0.1c0.5,0.9,1.1,1.8,1.6,2.7c0.6,1,1.6,1.5,2.7,1.4
	c0.9-0.1,1.9-0.1,2.9-0.1c1.1,0,2.1-0.5,2.7-1.6c0.4-0.7,0.8-1.4,1.1-2.1l0.3-0.6c1.4,0.4,2.9,1,4.2,1.6l-0.3,1.3
	c-0.1,0.6-0.3,1.1-0.4,1.7c-0.3,1.2,0.1,2.2,1,3c0.7,0.6,1.4,1.2,2,1.9c0.8,0.9,1.9,1.2,3.1,0.8c0.8-0.3,1.7-0.5,2.5-0.8l0.3-0.1
	c0.2,0.3,0.4,0.8,0.6,1.3l-12.2,5.6c-0.8-1.4-2.1-2.6-3.6-3.2c-1.8-0.7-3.7-0.6-5.4,0.1c-1.7,0.8-3,2.2-3.7,3.9
	c-0.7,1.8-0.6,3.7,0.1,5.4c0.8,1.7,2.2,3,3.9,3.7c0.8,0.3,1.7,0.5,2.5,0.5c1,0,1.9-0.2,2.9-0.6c1.7-0.8,3-2.2,3.7-3.9
	c0.5-1.4,0.6-2.8,0.3-4.2l13.2-6.1c0.4-0.2,0.6-0.6,0.5-0.9c0-0.2,0-0.3-0.1-0.5c-0.3-0.7-1.1-2.3-1.6-3c-0.2-0.3-0.5-0.4-0.9-0.4
	c-0.1,0-0.2,0-0.3,0l-1,0.3c-0.9,0.3-1.7,0.5-2.6,0.8c-0.5,0.2-0.8,0-1-0.2c-0.7-0.7-1.4-1.4-2.2-2.1c-0.3-0.3-0.4-0.5-0.3-0.9
	c0.1-0.6,0.3-1.1,0.4-1.7l0.5-2.1c0.1-0.5-0.1-1-0.5-1.2c-2-1-4.1-1.8-6.2-2.4c-0.5-0.1-0.9,0.1-1.2,0.5L57,33.8
	c-0.4,0.7-0.8,1.4-1.1,2.1c-0.2,0.4-0.5,0.5-0.8,0.5c-1,0-2.1,0-3.1,0.1c-0.3,0-0.6-0.1-0.8-0.4c-0.6-1-1.3-2.1-1.9-3.1l-0.1-0.1
	c-0.3-0.6-0.9-0.8-1.5-0.5l-0.8,0.3c-0.6,0.2-1.2,0.4-1.8,0.7c-1,0.4-2,0.9-3.1,1.6c-0.7,0.4-0.7,1-0.6,1.4l0.4,1.3
	c0.2,0.7,0.4,1.4,0.6,2.1c0.2,0.6,0,0.9-0.3,1.1c-0.6,0.6-1.3,1.2-2,2.1c-0.3,0.3-0.5,0.4-0.9,0.3c-0.7-0.2-1.4-0.3-2.1-0.5
	l-1.6-0.4c-0.5-0.1-0.9,0.1-1.2,0.5c-1,2-1.8,4.1-2.4,6.2c-0.1,0.5,0.1,0.9,0.5,1.2l1.1,0.6c0.8,0.4,1.6,0.8,2.3,1.3
	c0.4,0.2,0.5,0.5,0.5,0.7c0,1.1,0,2.1,0.1,3.1c0,0.3-0.1,0.5-0.4,0.7c-0.5,0.3-1,0.6-1.5,0.9l-1.9,1.2c-0.3,0.2-0.5,0.6-0.5,1
	c0,0.1,0,0.2,0.1,0.3l0.1,0.3c0.1,0.2,0.1,0.5,0.2,0.7c0.6,1.7,1.4,3.4,2.3,4.9c0.3,0.5,0.8,0.7,1.4,0.6l3.5-1c0.5-0.2,0.8,0,1,0.2
	c0.7,0.7,1.4,1.4,2.1,2c0.3,0.3,0.4,0.5,0.3,1l-0.9,3.7c-0.1,0.4,0.1,0.8,0.4,1.1c0.1,0,0.1,0.1,0.2,0.1c1.9,1,3.9,1.8,6,2.3
	c0.1,0,0.2,0,0.3,0c0.4,0,0.8-0.2,1.1-0.7l0.5-0.9c0.4-0.8,0.9-1.6,1.3-2.4c0.2-0.4,0.5-0.4,0.7-0.4c1,0,2.1,0,3.2-0.1
	c0.2,0,0.5,0,0.7,0.4c0.5,0.8,0.9,1.5,1.4,2.3l0.5,0.8c0.4,0.7,0.9,0.9,1.8,0.7c0.1,0,0.1,0,0.2-0.1c1.4-0.4,2.7-1,3.9-1.6
	c0.4-0.2,0.7-0.4,1.1-0.6l0.4-0.2c0.7-0.4,0.7-1,0.6-1.4c-0.3-0.9-0.6-1.9-0.8-2.8l-0.2-0.8c-0.1-0.4-0.1-0.7,0.2-0.9
	c0.8-0.7,1.5-1.5,2.1-2.2c0.3-0.3,0.5-0.4,0.9-0.3c0.5,0.1,0.9,0.2,1.4,0.3l2.4,0.6c0.5,0.1,1-0.1,1.2-0.5c1-2,1.8-4.1,2.4-6.2
	C76.1,58.5,75.9,58,75.5,57.7z M58.6,55.8C58.1,57,57.2,58,56,58.5c0,0,0,0,0,0c-1.2,0.5-2.5,0.6-3.8,0.1C51,58.1,50,57.2,49.5,56
	c-0.5-1.2-0.6-2.5-0.1-3.8c0.5-1.2,1.4-2.2,2.6-2.7c0.6-0.3,1.3-0.4,2-0.4c0.6,0,1.2,0.1,1.8,0.3c1.2,0.5,2.2,1.4,2.7,2.6
	C59.1,53.2,59.1,54.5,58.6,55.8z"/>
</svg>
