<svg xmlns="http://www.w3.org/2000/svg" width="191" height="143.365" viewBox="0 0 191 143.365">
  <g id="Group_143948" data-name="Group 143948" transform="translate(-871 -1812.635)">
    <line id="Line_3" data-name="Line 3" x2="190" transform="translate(871.5 1955.5)" fill="none" stroke="#707070" stroke-linecap="round" stroke-width="1"/>
    <g id="Safety_Guarantee-01" data-name="Safety Guarantee-01" transform="translate(911.848 1808.561)">
      <path id="Path_12597" data-name="Path 12597" d="M41.423,130.2C26.285,119.459,15.16,105.623,8.6,88.142,4.258,76.6,3.077,64.553,2.886,52.368c-.146-10.039.044-20.091-.076-30.136,0-2.146.578-3.092,2.743-3.727C21.027,13.946,36.464,9.234,51.906,4.535a7.048,7.048,0,0,1,4.324-.222q24.65,7.505,49.319,14.954a2.381,2.381,0,0,1,.216.914c.14,13.823,1.2,27.653.483,41.47A87.589,87.589,0,0,1,87.49,112.259,86.858,86.858,0,0,1,57.729,136.5a6.414,6.414,0,0,1-6.585.064C47.76,134.654,43.944,133.429,41.423,130.2Z" fill="#0d579a"/>
      <path id="Path_12598" data-name="Path 12598" d="M94.016,78.951c0-3.13-1.683-5.715-4.629-5.962-4.045-.356-4-2.6-3.734-5.454a16.167,16.167,0,0,0,0-2.54C85.095,56.25,78.669,49.462,70.3,48.8c-9.163-.724-16.5,4.546-18.491,13.341-.6,2.61-.273,5.264-.267,7.893,0,1.626-.26,2.362-2.178,2.54-4.089.3-6.432,2.705-6.483,6.794q-.2,15.69,0,31.387c.07,4.6,2.635,6.877,7.27,6.928,6.128.063,12.255,0,18.414,0,6.235,0,12.471.057,18.706,0,4.14-.057,6.737-2.47,6.762-6.35Q94.092,95.095,94.016,78.951ZM74.789,96.4c-2.076,1.9-2.3,3.9-2.038,6.2.33,2.915-.635,4.216-3.632,3.327-3.118.908-3.9-.533-3.607-3.378.235-2.286.038-4.305-1.9-6.261-2.343-2.337-1.473-6.445,1.162-8.756a6.731,6.731,0,0,1,9.207.114C76.573,90.075,77.272,94.146,74.789,96.4Zm-1.74-23.939H59.715c-1.13,0-2.127-.051-2.07-1.606.083-2.629-.3-5.3.394-7.874A10.849,10.849,0,0,1,69.7,55.291a11.044,11.044,0,0,1,9.677,10.115C79.945,72.461,79.945,72.461,73.049,72.461Z" transform="translate(-14.59 -16.302)" fill="#ffb600"/>
    </g>
  </g>
</svg>
