{
  "title": "vinculacao-processual",
  "type": "object",
  "properties": {
    "numero-processo": {
      "type": "string",
      "pattern": "\\d{20}"
    },
    "vinculo": {
      "type": "string",
      "description": "Valores possíveis:\nAP - apenso;\nAR - ação rescisória; \nCD - competência delegada;\nCT - continência;\nCX - conexão;\nDP - dependência;\nOG - originário;\nPU - precedente de uniformização\nRG - repercussão geral;\nRR - recurso repetitivo;\nOR - outro tipo de vinculação",
      "enum": [
        "AP",
        "AR",
        "CD",
        "CT",
        "CX",
        "DP",
        "OG",
        "PU",
        "RG",
        "RR",
        "OR"
      ]
    }
  },
  "required": [
    "numero-processo",
    "vinculo"
  ]
}