{
  "title": "endereco",
  "type": "object",
  "properties": {
    "logradouro": {
      "type": "string"
    },
    "numero": {
      "type": "string"
    },
    "complemento": {
      "type": "string"
    },
    "bairro": {
      "type": "string"
    },
    "cep": {
      "type": "string",
      "description": "código de endereçamento postal do endereço no diretório nacional de endereços da ECT. O valor deverá ser uma sequência de 8 dígitos, sem qualquer separador. O atributo é opcional para permitir a apresentação de endereços desprovidos de CEP e de endereços internacionais",
      "pattern": "\\d{8}"
    },
    "cidade": {
      "$ref": "./cidade.v1.json"
    }
  }
}