{
  "title": "orgao-julgador",
  "type": "object",
  "properties": {
    "codigo": {
      "type": "string",
      "description": "Código do órgão julgador de acordo com o sistema Corporativo (https://www.cnj.jus.br/corporativo)"
    },
    "nome": {
      "type": "string"
    },
    "jurisdicao": {
      "$ref": "./jurisdicao.v1.json"
    }
  },
  "required": [
    "codigo",
    "nome",
    "jurisdicao"
  ]
}