{
  "title": "documento-identificacao",
  "type": "object",
  "properties": {
    "numero": {
      "type": "string"
    },
    "emissor": {
      "type": "string"
    },
    "tipo": {
      "type": "string",
      "description": "Valores possíveis:\nCI - carteira de identidade; \nCNH - carteira nacional de habilitação; \nTE - título de eleitor; \nCN - certidão de nascimento; \nCC - certidão de casamento; \nPAS - passaporte; \nCT - carteira de trabalho; \nRIC - registro individual do cidadão; \nCMF - cadastro no Ministério da Fazenda Brasileiro; \nPIS_PASEP - número no programa de integração social; \nCEI - cadastro específico do INSS; \nNIT - número de identificação do trabalho; \nCP - cadastro em conselhos profissionais; \nIF - identidade funcional; \nOAB - número de cadastro na Ordem dos Advogados do Brasil; \nRJC - número de inscrição empresarial; \nRGE - registro de identificação do estrangeiro;\nRJI - registro judiciário individual",
      "enum": [
        "CI",
        "CNH",
        "TE",
        "CN",
        "CC",
        "PAS",
        "CT",
        "RIC",
        "CMF",
        "PIS_PASEP",
        "CEI",
        "INT",
        "CP",
        "IF",
        "OAB",
        "RJC",
        "RGE",
        "RJI"
      ]
    }
  },
  "required": [
    "numero",
    "emissor",
    "tipo"
  ]
}