{
  "prepare_queue": {
    "installed": [],
    "uninstalled": []
  },
  "config_munge": {
    "files": {}
  },
  "installed_plugins": {
    "cordova-plugin-whitelist": {
      "PACKAGE_NAME": "io.cordova.hellocordova"
    },
    "cordova-plugin-device-motion": {
      "PACKAGE_NAME": "io.cordova.hellocordova"
    },
    "cordova-plugin-device-orientation": {
      "PACKAGE_NAME": "io.cordova.hellocordova"
    },
    "cordova-plugin-gyroscope": {
      "PACKAGE_NAME": "io.cordova.hellocordova"
    },
    "cordova-plugin-magnetometer": {
      "PACKAGE_NAME": "io.cordova.hellocordova"
    },
    "cordova-plugin-indooratlas": {
      "PACKAGE_NAME": "io.cordova.hellocordova"
    },
    "cordova-plugin-sensors": {
      "PACKAGE_NAME": "io.cordova.hellocordova"
    },
    "cordova-plugin-file": {
      "PACKAGE_NAME": "io.cordova.hellocordova"
    },
    "cordovarduino": {
      "PACKAGE_NAME": "io.cordova.hellocordova"
    }
  },
  "dependent_plugins": {},
  "modules": [
    {
      "file": "plugins/cordova-plugin-device-motion/www/Acceleration.js",
      "id": "cordova-plugin-device-motion.Acceleration",
      "pluginId": "cordova-plugin-device-motion",
      "clobbers": [
        "Acceleration"
      ]
    },
    {
      "file": "plugins/cordova-plugin-device-motion/www/accelerometer.js",
      "id": "cordova-plugin-device-motion.accelerometer",
      "pluginId": "cordova-plugin-device-motion",
      "clobbers": [
        "navigator.accelerometer"
      ]
    },
    {
      "file": "plugins/cordova-plugin-device-motion/src/browser/AccelerometerProxy.js",
      "id": "cordova-plugin-device-motion.AccelerometerProxy",
      "pluginId": "cordova-plugin-device-motion",
      "runs": true
    },
    {
      "file": "plugins/cordova-plugin-device-orientation/www/CompassError.js",
      "id": "cordova-plugin-device-orientation.CompassError",
      "pluginId": "cordova-plugin-device-orientation",
      "clobbers": [
        "CompassError"
      ]
    },
    {
      "file": "plugins/cordova-plugin-device-orientation/www/CompassHeading.js",
      "id": "cordova-plugin-device-orientation.CompassHeading",
      "pluginId": "cordova-plugin-device-orientation",
      "clobbers": [
        "CompassHeading"
      ]
    },
    {
      "file": "plugins/cordova-plugin-device-orientation/www/compass.js",
      "id": "cordova-plugin-device-orientation.compass",
      "pluginId": "cordova-plugin-device-orientation",
      "clobbers": [
        "navigator.compass"
      ]
    },
    {
      "file": "plugins/cordova-plugin-device-orientation/src/browser/CompassProxy.js",
      "id": "cordova-plugin-device-orientation.CompassProxy",
      "pluginId": "cordova-plugin-device-orientation",
      "runs": true
    },
    {
      "file": "plugins/cordova-plugin-gyroscope/www/Orientation.js",
      "id": "cordova-plugin-gyroscope.Orientation",
      "pluginId": "cordova-plugin-gyroscope",
      "clobbers": [
        "Orientation"
      ]
    },
    {
      "file": "plugins/cordova-plugin-gyroscope/www/gyroscope.js",
      "id": "cordova-plugin-gyroscope.gyroscope",
      "pluginId": "cordova-plugin-gyroscope",
      "clobbers": [
        "navigator.gyroscope"
      ]
    },
    {
      "file": "plugins/cordova-plugin-magnetometer/www/magnetometer.js",
      "id": "cordova-plugin-magnetometer.main",
      "pluginId": "cordova-plugin-magnetometer",
      "clobbers": [
        "cordova.plugins.magnetometer"
      ]
    },
    {
      "file": "plugins/cordova-plugin-indooratlas/www/Coordinates.js",
      "id": "cordova-plugin-indooratlas.Coordinates",
      "pluginId": "cordova-plugin-indooratlas",
      "clobbers": [
        "IndoorAtlas.Coordinates"
      ]
    },
    {
      "file": "plugins/cordova-plugin-indooratlas/www/Orientation.js",
      "id": "cordova-plugin-indooratlas.Orientation",
      "pluginId": "cordova-plugin-indooratlas",
      "clobbers": [
        "IndoorAtlas.Orientation"
      ]
    },
    {
      "file": "plugins/cordova-plugin-indooratlas/www/CurrentStatus.js",
      "id": "cordova-plugin-indooratlas.CurrentStatus",
      "pluginId": "cordova-plugin-indooratlas",
      "clobbers": [
        "IndoorAtlas.CurrentStatus"
      ]
    },
    {
      "file": "plugins/cordova-plugin-indooratlas/www/Position.js",
      "id": "cordova-plugin-indooratlas.Position",
      "pluginId": "cordova-plugin-indooratlas",
      "clobbers": [
        "IndoorAtlas.Position"
      ]
    },
    {
      "file": "plugins/cordova-plugin-indooratlas/www/FloorPlan.js",
      "id": "cordova-plugin-indooratlas.FloorPlan",
      "pluginId": "cordova-plugin-indooratlas",
      "clobbers": [
        "IndoorAtlas.FloorPlan"
      ]
    },
    {
      "file": "plugins/cordova-plugin-indooratlas/www/Venue.js",
      "id": "cordova-plugin-indooratlas.Venue",
      "pluginId": "cordova-plugin-indooratlas",
      "clobbers": [
        "IndoorAtlas.Venue"
      ]
    },
    {
      "file": "plugins/cordova-plugin-indooratlas/www/CoordinateTransforms.js",
      "id": "cordova-plugin-indooratlas.CoordinateTransforms",
      "pluginId": "cordova-plugin-indooratlas"
    },
    {
      "file": "plugins/cordova-plugin-indooratlas/www/RegionChangeObserver.js",
      "id": "cordova-plugin-indooratlas.RegionChangeObserver",
      "pluginId": "cordova-plugin-indooratlas"
    },
    {
      "file": "plugins/cordova-plugin-indooratlas/www/RoutingLeg.js",
      "id": "cordova-plugin-indooratlas.RoutingLeg",
      "pluginId": "cordova-plugin-indooratlas",
      "clobbers": [
        "IndoorAtlas.RoutingLeg"
      ]
    },
    {
      "file": "plugins/cordova-plugin-indooratlas/www/RoutingPoint.js",
      "id": "cordova-plugin-indooratlas.RoutingPoint",
      "pluginId": "cordova-plugin-indooratlas",
      "clobbers": [
        "IndoorAtlas.RoutingPoint"
      ]
    },
    {
      "file": "plugins/cordova-plugin-indooratlas/www/Route.js",
      "id": "cordova-plugin-indooratlas.Route",
      "pluginId": "cordova-plugin-indooratlas",
      "clobbers": [
        "IndoorAtlas.Route"
      ]
    },
    {
      "file": "plugins/cordova-plugin-indooratlas/www/Geofence.js",
      "id": "cordova-plugin-indooratlas.Geofence",
      "pluginId": "cordova-plugin-indooratlas",
      "clobbers": [
        "IndoorAtlas.Geofence"
      ]
    },
    {
      "file": "plugins/cordova-plugin-indooratlas/www/POI.js",
      "id": "cordova-plugin-indooratlas.POI",
      "pluginId": "cordova-plugin-indooratlas",
      "clobbers": [
        "IndoorAtlas.POI"
      ]
    },
    {
      "file": "plugins/cordova-plugin-indooratlas/www/IndoorAtlas.js",
      "id": "cordova-plugin-indooratlas.IndoorAtlas",
      "pluginId": "cordova-plugin-indooratlas",
      "merges": [
        "IndoorAtlas"
      ]
    },
    {
      "file": "plugins/cordova-plugin-sensors/www/sensors.js",
      "id": "cordova-plugin-sensors.sensors",
      "pluginId": "cordova-plugin-sensors",
      "clobbers": [
        "sensors"
      ]
    },
    {
      "file": "plugins/cordova-plugin-file/www/DirectoryEntry.js",
      "id": "cordova-plugin-file.DirectoryEntry",
      "pluginId": "cordova-plugin-file",
      "clobbers": [
        "window.DirectoryEntry"
      ]
    },
    {
      "file": "plugins/cordova-plugin-file/www/DirectoryReader.js",
      "id": "cordova-plugin-file.DirectoryReader",
      "pluginId": "cordova-plugin-file",
      "clobbers": [
        "window.DirectoryReader"
      ]
    },
    {
      "file": "plugins/cordova-plugin-file/www/Entry.js",
      "id": "cordova-plugin-file.Entry",
      "pluginId": "cordova-plugin-file",
      "clobbers": [
        "window.Entry"
      ]
    },
    {
      "file": "plugins/cordova-plugin-file/www/File.js",
      "id": "cordova-plugin-file.File",
      "pluginId": "cordova-plugin-file",
      "clobbers": [
        "window.File"
      ]
    },
    {
      "file": "plugins/cordova-plugin-file/www/FileEntry.js",
      "id": "cordova-plugin-file.FileEntry",
      "pluginId": "cordova-plugin-file",
      "clobbers": [
        "window.FileEntry"
      ]
    },
    {
      "file": "plugins/cordova-plugin-file/www/FileError.js",
      "id": "cordova-plugin-file.FileError",
      "pluginId": "cordova-plugin-file",
      "clobbers": [
        "window.FileError"
      ]
    },
    {
      "file": "plugins/cordova-plugin-file/www/FileReader.js",
      "id": "cordova-plugin-file.FileReader",
      "pluginId": "cordova-plugin-file",
      "clobbers": [
        "window.FileReader"
      ]
    },
    {
      "file": "plugins/cordova-plugin-file/www/FileSystem.js",
      "id": "cordova-plugin-file.FileSystem",
      "pluginId": "cordova-plugin-file",
      "clobbers": [
        "window.FileSystem"
      ]
    },
    {
      "file": "plugins/cordova-plugin-file/www/FileUploadOptions.js",
      "id": "cordova-plugin-file.FileUploadOptions",
      "pluginId": "cordova-plugin-file",
      "clobbers": [
        "window.FileUploadOptions"
      ]
    },
    {
      "file": "plugins/cordova-plugin-file/www/FileUploadResult.js",
      "id": "cordova-plugin-file.FileUploadResult",
      "pluginId": "cordova-plugin-file",
      "clobbers": [
        "window.FileUploadResult"
      ]
    },
    {
      "file": "plugins/cordova-plugin-file/www/FileWriter.js",
      "id": "cordova-plugin-file.FileWriter",
      "pluginId": "cordova-plugin-file",
      "clobbers": [
        "window.FileWriter"
      ]
    },
    {
      "file": "plugins/cordova-plugin-file/www/Flags.js",
      "id": "cordova-plugin-file.Flags",
      "pluginId": "cordova-plugin-file",
      "clobbers": [
        "window.Flags"
      ]
    },
    {
      "file": "plugins/cordova-plugin-file/www/LocalFileSystem.js",
      "id": "cordova-plugin-file.LocalFileSystem",
      "pluginId": "cordova-plugin-file",
      "clobbers": [
        "window.LocalFileSystem"
      ],
      "merges": [
        "window"
      ]
    },
    {
      "file": "plugins/cordova-plugin-file/www/Metadata.js",
      "id": "cordova-plugin-file.Metadata",
      "pluginId": "cordova-plugin-file",
      "clobbers": [
        "window.Metadata"
      ]
    },
    {
      "file": "plugins/cordova-plugin-file/www/ProgressEvent.js",
      "id": "cordova-plugin-file.ProgressEvent",
      "pluginId": "cordova-plugin-file",
      "clobbers": [
        "window.ProgressEvent"
      ]
    },
    {
      "file": "plugins/cordova-plugin-file/www/fileSystems.js",
      "id": "cordova-plugin-file.fileSystems",
      "pluginId": "cordova-plugin-file"
    },
    {
      "file": "plugins/cordova-plugin-file/www/requestFileSystem.js",
      "id": "cordova-plugin-file.requestFileSystem",
      "pluginId": "cordova-plugin-file",
      "clobbers": [
        "window.requestFileSystem"
      ]
    },
    {
      "file": "plugins/cordova-plugin-file/www/resolveLocalFileSystemURI.js",
      "id": "cordova-plugin-file.resolveLocalFileSystemURI",
      "pluginId": "cordova-plugin-file",
      "merges": [
        "window"
      ]
    },
    {
      "file": "plugins/cordova-plugin-file/www/browser/isChrome.js",
      "id": "cordova-plugin-file.isChrome",
      "pluginId": "cordova-plugin-file",
      "runs": true
    },
    {
      "file": "plugins/cordova-plugin-file/www/browser/Preparing.js",
      "id": "cordova-plugin-file.Preparing",
      "pluginId": "cordova-plugin-file",
      "runs": true
    },
    {
      "file": "plugins/cordova-plugin-file/src/browser/FileProxy.js",
      "id": "cordova-plugin-file.browserFileProxy",
      "pluginId": "cordova-plugin-file",
      "runs": true
    },
    {
      "file": "plugins/cordova-plugin-file/www/fileSystemPaths.js",
      "id": "cordova-plugin-file.fileSystemPaths",
      "pluginId": "cordova-plugin-file",
      "merges": [
        "cordova"
      ],
      "runs": true
    },
    {
      "file": "plugins/cordova-plugin-file/www/browser/FileSystem.js",
      "id": "cordova-plugin-file.firefoxFileSystem",
      "pluginId": "cordova-plugin-file",
      "merges": [
        "window.FileSystem"
      ]
    },
    {
      "file": "plugins/cordovarduino/www/serial.js",
      "id": "cordovarduino.Serial",
      "pluginId": "cordovarduino",
      "clobbers": [
        "window.serial"
      ]
    }
  ],
  "plugin_metadata": {
    "cordova-plugin-whitelist": "1.3.4",
    "cordova-plugin-device-motion": "2.0.1",
    "cordova-plugin-device-orientation": "2.0.1",
    "cordova-plugin-gyroscope": "0.1.4",
    "cordova-plugin-magnetometer": "1.0.0",
    "cordova-plugin-indooratlas": "3.3.0",
    "cordova-plugin-sensors": "0.7.0",
    "cordova-plugin-file": "6.0.2",
    "cordovarduino": "0.0.10"
  }
}
