{
  "cordova-plugin-whitelist": {
    "source": {
      "type": "registry",
      "id": "cordova-plugin-whitelist@^1.3.4"
    },
    "is_top_level": true,
    "variables": {}
  },
  "cordova-plugin-device-motion": {
    "source": {
      "type": "registry",
      "id": "cordova-plugin-device-motion@^2.0.1"
    },
    "is_top_level": true,
    "variables": {}
  },
  "cordova-plugin-device-orientation": {
    "source": {
      "type": "registry",
      "id": "cordova-plugin-device-orientation"
    },
    "is_top_level": true,
    "variables": {}
  },
  "cordova-plugin-gyroscope": {
    "source": {
      "type": "registry",
      "id": "cordova-plugin-gyroscope@0.1.4"
    },
    "is_top_level": true,
    "variables": {}
  },
  "cordova-plugin-magnetometer": {
    "source": {
      "type": "registry",
      "id": "https://github.com/sdesalas/cordova-plugin-magnetometer"
    },
    "is_top_level": true,
    "variables": {}
  },
  "cordova-plugin-indooratlas": {
    "source": {
      "type": "registry",
      "id": "https://github.com/IndoorAtlas/cordova-plugin"
    },
    "is_top_level": true,
    "variables": {}
  },
  "cordova-plugin-sensors": {
    "source": {
      "type": "registry",
      "id": "https://github.com/fabiorogeriosj/cordova-plugin-sensors.git"
    },
    "is_top_level": true,
    "variables": {}
  },
  "cordova-plugin-file": {
    "source": {
      "type": "registry",
      "id": "cordova-plugin-file@6.0.2"
    },
    "is_top_level": true,
    "variables": {}
  },
  "cordovarduino": {
    "source": {
      "type": "registry",
      "id": "cordovarduino"
    },
    "is_top_level": true,
    "variables": {}
  }
}