﻿{
  "$schema": "http://json.schemastore.org/launchsettings.json",
  "profiles": {
    "UricoService": {
      "commandName": "Project",
      "dotnetRunMessages": true,
      "environmentVariables": {
        "DOTNET_ENVIRONMENT": "Development"
      }
    }
  }
}
