%!PS-Adobe-3.0 EPSF-3.0
%%Creator: (MATLAB, The Mathworks, Inc. Version 9.7.0.1261785 \(R2019b\) Update 3. Operating System: Windows 10)
%%Title: C:/Users/Clarissa/Documents/decid_eye/analysis/manip1&2/1_pipeline/fixations/3_f_fixation_behav/plots/lvl2_agent/choiceAsFunctionOfValueDiff_lastFix.eps
%%CreationDate: 2021-05-03T22:50:28
%%Pages: (atend)
%%BoundingBox:    17    17   574   361
%%LanguageLevel: 3
%%EndComments
%%BeginProlog
%%BeginResource: procset (Apache XML Graphics Std ProcSet) 1.2 0
%%Version: 1.2 0
%%Copyright: (Copyright 2001-2003,2010 The Apache Software Foundation. License terms: http://www.apache.org/licenses/LICENSE-2.0)
/bd{bind def}bind def
/ld{load def}bd
/GR/grestore ld
/GS/gsave ld
/RM/rmoveto ld
/C/curveto ld
/t/show ld
/L/lineto ld
/ML/setmiterlimit ld
/CT/concat ld
/f/fill ld
/N/newpath ld
/S/stroke ld
/CC/setcmykcolor ld
/A/ashow ld
/cp/closepath ld
/RC/setrgbcolor ld
/LJ/setlinejoin ld
/GC/setgray ld
/LW/setlinewidth ld
/M/moveto ld
/re {4 2 roll M
1 index 0 rlineto
0 exch rlineto
neg 0 rlineto
cp } bd
/_ctm matrix def
/_tm matrix def
/BT { _ctm currentmatrix pop matrix _tm copy pop 0 0 moveto } bd
/ET { _ctm setmatrix } bd
/iTm { _ctm setmatrix _tm concat } bd
/Tm { _tm astore pop iTm 0 0 moveto } bd
/ux 0.0 def
/uy 0.0 def
/F {
  /Tp exch def
  /Tf exch def
  Tf findfont Tp scalefont setfont
  /cf Tf def  /cs Tp def
} bd
/ULS {currentpoint /uy exch def /ux exch def} bd
/ULE {
  /Tcx currentpoint pop def
  gsave
  newpath
  cf findfont cs scalefont dup
  /FontMatrix get 0 get /Ts exch def /FontInfo get dup
  /UnderlinePosition get Ts mul /To exch def
  /UnderlineThickness get Ts mul /Tt exch def
  ux uy To add moveto  Tcx uy To add lineto
  Tt setlinewidth stroke
  grestore
} bd
/OLE {
  /Tcx currentpoint pop def
  gsave
  newpath
  cf findfont cs scalefont dup
  /FontMatrix get 0 get /Ts exch def /FontInfo get dup
  /UnderlinePosition get Ts mul /To exch def
  /UnderlineThickness get Ts mul /Tt exch def
  ux uy To add cs add moveto Tcx uy To add cs add lineto
  Tt setlinewidth stroke
  grestore
} bd
/SOE {
  /Tcx currentpoint pop def
  gsave
  newpath
  cf findfont cs scalefont dup
  /FontMatrix get 0 get /Ts exch def /FontInfo get dup
  /UnderlinePosition get Ts mul /To exch def
  /UnderlineThickness get Ts mul /Tt exch def
  ux uy To add cs 10 mul 26 idiv add moveto Tcx uy To add cs 10 mul 26 idiv add lineto
  Tt setlinewidth stroke
  grestore
} bd
/QT {
/Y22 exch store
/X22 exch store
/Y21 exch store
/X21 exch store
currentpoint
/Y21 load 2 mul add 3 div exch
/X21 load 2 mul add 3 div exch
/X21 load 2 mul /X22 load add 3 div
/Y21 load 2 mul /Y22 load add 3 div
/X22 load /Y22 load curveto
} bd
/SSPD {
dup length /d exch dict def
{
/v exch def
/k exch def
currentpagedevice k known {
/cpdv currentpagedevice k get def
v cpdv ne {
/upd false def
/nullv v type /nulltype eq def
/nullcpdv cpdv type /nulltype eq def
nullv nullcpdv or
{
/upd true def
} {
/sametype v type cpdv type eq def
sametype {
v type /arraytype eq {
/vlen v length def
/cpdvlen cpdv length def
vlen cpdvlen eq {
0 1 vlen 1 sub {
/i exch def
/obj v i get def
/cpdobj cpdv i get def
obj cpdobj ne {
/upd true def
exit
} if
} for
} {
/upd true def
} ifelse
} {
v type /dicttype eq {
v {
/dv exch def
/dk exch def
/cpddv cpdv dk get def
dv cpddv ne {
/upd true def
exit
} if
} forall
} {
/upd true def
} ifelse
} ifelse
} if
} ifelse
upd true eq {
d k v put
} if
} if
} if
} forall
d length 0 gt {
d setpagedevice
} if
} bd
/RE { % /NewFontName [NewEncodingArray] /FontName RE -
  findfont dup length dict begin
  {
    1 index /FID ne
    {def} {pop pop} ifelse
  } forall
  /Encoding exch def
  /FontName 1 index def
  currentdict definefont pop
  end
} bind def
%%EndResource
%%BeginResource: procset (Apache XML Graphics EPS ProcSet) 1.0 0
%%Version: 1.0 0
%%Copyright: (Copyright 2002-2003 The Apache Software Foundation. License terms: http://www.apache.org/licenses/LICENSE-2.0)
/BeginEPSF { %def
/b4_Inc_state save def         % Save state for cleanup
/dict_count countdictstack def % Count objects on dict stack
/op_count count 1 sub def      % Count objects on operand stack
userdict begin                 % Push userdict on dict stack
/showpage { } def              % Redefine showpage, { } = null proc
0 setgray 0 setlinecap         % Prepare graphics state
1 setlinewidth 0 setlinejoin
10 setmiterlimit [ ] 0 setdash newpath
/languagelevel where           % If level not equal to 1 then
{pop languagelevel             % set strokeadjust and
1 ne                           % overprint to their defaults.
{false setstrokeadjust false setoverprint
} if
} if
} bd
/EndEPSF { %def
count op_count sub {pop} repeat            % Clean up stacks
countdictstack dict_count sub {end} repeat
b4_Inc_state restore
} bd
%%EndResource
%FOPBeginFontDict
%%IncludeResource: font Courier-Oblique
%%IncludeResource: font Courier-BoldOblique
%%IncludeResource: font Courier-Bold
%%IncludeResource: font ZapfDingbats
%%IncludeResource: font Symbol
%%IncludeResource: font Helvetica
%%IncludeResource: font Helvetica-Oblique
%%IncludeResource: font Helvetica-Bold
%%IncludeResource: font Helvetica-BoldOblique
%%IncludeResource: font Times-Roman
%%IncludeResource: font Times-Italic
%%IncludeResource: font Times-Bold
%%IncludeResource: font Times-BoldItalic
%%IncludeResource: font Courier
%FOPEndFontDict
%%BeginResource: encoding WinAnsiEncoding
/WinAnsiEncoding [
/.notdef /.notdef /.notdef /.notdef /.notdef
/.notdef /.notdef /.notdef /.notdef /.notdef
/.notdef /.notdef /.notdef /.notdef /.notdef
/.notdef /.notdef /.notdef /.notdef /.notdef
/.notdef /.notdef /.notdef /.notdef /.notdef
/.notdef /.notdef /.notdef /.notdef /.notdef
/.notdef /.notdef /space /exclam /quotedbl
/numbersign /dollar /percent /ampersand /quotesingle
/parenleft /parenright /asterisk /plus /comma
/hyphen /period /slash /zero /one
/two /three /four /five /six
/seven /eight /nine /colon /semicolon
/less /equal /greater /question /at
/A /B /C /D /E
/F /G /H /I /J
/K /L /M /N /O
/P /Q /R /S /T
/U /V /W /X /Y
/Z /bracketleft /backslash /bracketright /asciicircum
/underscore /quoteleft /a /b /c
/d /e /f /g /h
/i /j /k /l /m
/n /o /p /q /r
/s /t /u /v /w
/x /y /z /braceleft /bar
/braceright /asciitilde /bullet /Euro /bullet
/quotesinglbase /florin /quotedblbase /ellipsis /dagger
/daggerdbl /circumflex /perthousand /Scaron /guilsinglleft
/OE /bullet /Zcaron /bullet /bullet
/quoteleft /quoteright /quotedblleft /quotedblright /bullet
/endash /emdash /asciitilde /trademark /scaron
/guilsinglright /oe /bullet /zcaron /Ydieresis
/space /exclamdown /cent /sterling /currency
/yen /brokenbar /section /dieresis /copyright
/ordfeminine /guillemotleft /logicalnot /sfthyphen /registered
/macron /degree /plusminus /twosuperior /threesuperior
/acute /mu /paragraph /middot /cedilla
/onesuperior /ordmasculine /guillemotright /onequarter /onehalf
/threequarters /questiondown /Agrave /Aacute /Acircumflex
/Atilde /Adieresis /Aring /AE /Ccedilla
/Egrave /Eacute /Ecircumflex /Edieresis /Igrave
/Iacute /Icircumflex /Idieresis /Eth /Ntilde
/Ograve /Oacute /Ocircumflex /Otilde /Odieresis
/multiply /Oslash /Ugrave /Uacute /Ucircumflex
/Udieresis /Yacute /Thorn /germandbls /agrave
/aacute /acircumflex /atilde /adieresis /aring
/ae /ccedilla /egrave /eacute /ecircumflex
/edieresis /igrave /iacute /icircumflex /idieresis
/eth /ntilde /ograve /oacute /ocircumflex
/otilde /odieresis /divide /oslash /ugrave
/uacute /ucircumflex /udieresis /yacute /thorn
/ydieresis
] def
%%EndResource
%FOPBeginFontReencode
/Courier-Oblique findfont
dup length dict begin
  {1 index /FID ne {def} {pop pop} ifelse} forall
  /Encoding WinAnsiEncoding def
  currentdict
end
/Courier-Oblique exch definefont pop
/Courier-BoldOblique findfont
dup length dict begin
  {1 index /FID ne {def} {pop pop} ifelse} forall
  /Encoding WinAnsiEncoding def
  currentdict
end
/Courier-BoldOblique exch definefont pop
/Courier-Bold findfont
dup length dict begin
  {1 index /FID ne {def} {pop pop} ifelse} forall
  /Encoding WinAnsiEncoding def
  currentdict
end
/Courier-Bold exch definefont pop
/Helvetica findfont
dup length dict begin
  {1 index /FID ne {def} {pop pop} ifelse} forall
  /Encoding WinAnsiEncoding def
  currentdict
end
/Helvetica exch definefont pop
/Helvetica-Oblique findfont
dup length dict begin
  {1 index /FID ne {def} {pop pop} ifelse} forall
  /Encoding WinAnsiEncoding def
  currentdict
end
/Helvetica-Oblique exch definefont pop
/Helvetica-Bold findfont
dup length dict begin
  {1 index /FID ne {def} {pop pop} ifelse} forall
  /Encoding WinAnsiEncoding def
  currentdict
end
/Helvetica-Bold exch definefont pop
/Helvetica-BoldOblique findfont
dup length dict begin
  {1 index /FID ne {def} {pop pop} ifelse} forall
  /Encoding WinAnsiEncoding def
  currentdict
end
/Helvetica-BoldOblique exch definefont pop
/Times-Roman findfont
dup length dict begin
  {1 index /FID ne {def} {pop pop} ifelse} forall
  /Encoding WinAnsiEncoding def
  currentdict
end
/Times-Roman exch definefont pop
/Times-Italic findfont
dup length dict begin
  {1 index /FID ne {def} {pop pop} ifelse} forall
  /Encoding WinAnsiEncoding def
  currentdict
end
/Times-Italic exch definefont pop
/Times-Bold findfont
dup length dict begin
  {1 index /FID ne {def} {pop pop} ifelse} forall
  /Encoding WinAnsiEncoding def
  currentdict
end
/Times-Bold exch definefont pop
/Times-BoldItalic findfont
dup length dict begin
  {1 index /FID ne {def} {pop pop} ifelse} forall
  /Encoding WinAnsiEncoding def
  currentdict
end
/Times-BoldItalic exch definefont pop
/Courier findfont
dup length dict begin
  {1 index /FID ne {def} {pop pop} ifelse} forall
  /Encoding WinAnsiEncoding def
  currentdict
end
/Courier exch definefont pop
%FOPEndFontReencode
%%EndProlog
%%Page: 1 1
%%PageBoundingBox: 0 0 600 375
%%BeginPageSetup
[1 0 0 -1 0 375] CT
%%EndPageSetup
GS
[0.375 0 0 0.375 0 0] CT
1 GC
N
0 0 1600 1000 re
f
GR
GS
[0.375 0 0 0.375 0 0] CT
1 GC
N
0 0 1600 1000 re
f
GR
GS
[0.375 0 0 0.375 0 0] CT
1 GC
N
130 881 M
1153 881 L
1153 40 L
130 40 L
cp
f
GR
GS
[0.375 0 0 0.375 0 0] CT
2 setlinecap
1 LJ
1.333 LW
N
130 881 M
1153 881 L
S
GR
GS
[0.375 0 0 0.375 0 0] CT
2 setlinecap
1 LJ
1.333 LW
N
176.5 881 M
176.5 870.77 L
S
GR
GS
[0.375 0 0 0.375 0 0] CT
2 setlinecap
1 LJ
1.333 LW
N
1106.5 881 M
1106.5 870.77 L
S
GR
GS
[0.375 0 0 0.375 66.1875 334.37501] CT
/Helvetica 26.667 F
GS
[1 0 0 1 0 0] CT
-36.5 27 moveto 
1 -1 scale
(Max L) t 
GR
GR
GS
[0.375 0 0 0.375 414.9375 334.37501] CT
/Helvetica 26.667 F
GS
[1 0 0 1 0 0] CT
-39.5 27 moveto 
1 -1 scale
(Max G) t 
GR
GR
GS
[0.375 0 0 0.375 240.56266 347.74999] CT
/Helvetica 26.667 F
GS
[1 0 0 1 0 0] CT
-22.5 27 moveto 
1 -1 scale
(G-L) t 
GR
GR
GS
[0.375 0 0 0.375 0 0] CT
2 setlinecap
1 LJ
1.333 LW
N
130 881 M
130 40 L
S
GR
GS
[0.375 0 0 0.375 0 0] CT
2 setlinecap
1 LJ
1.333 LW
N
130 842.773 M
140.23 842.773 L
S
GR
GS
[0.375 0 0 0.375 0 0] CT
2 setlinecap
1 LJ
1.333 LW
N
130 766.318 M
140.23 766.318 L
S
GR
GS
[0.375 0 0 0.375 0 0] CT
2 setlinecap
1 LJ
1.333 LW
N
130 689.864 M
140.23 689.864 L
S
GR
GS
[0.375 0 0 0.375 0 0] CT
2 setlinecap
1 LJ
1.333 LW
N
130 613.409 M
140.23 613.409 L
S
GR
GS
[0.375 0 0 0.375 0 0] CT
2 setlinecap
1 LJ
1.333 LW
N
130 536.955 M
140.23 536.955 L
S
GR
GS
[0.375 0 0 0.375 0 0] CT
2 setlinecap
1 LJ
1.333 LW
N
130 460.5 M
140.23 460.5 L
S
GR
GS
[0.375 0 0 0.375 0 0] CT
2 setlinecap
1 LJ
1.333 LW
N
130 384.045 M
140.23 384.045 L
S
GR
GS
[0.375 0 0 0.375 0 0] CT
2 setlinecap
1 LJ
1.333 LW
N
130 307.591 M
140.23 307.591 L
S
GR
GS
[0.375 0 0 0.375 0 0] CT
2 setlinecap
1 LJ
1.333 LW
N
130 231.136 M
140.23 231.136 L
S
GR
GS
[0.375 0 0 0.375 0 0] CT
2 setlinecap
1 LJ
1.333 LW
N
130 154.682 M
140.23 154.682 L
S
GR
GS
[0.375 0 0 0.375 0 0] CT
2 setlinecap
1 LJ
1.333 LW
N
130 78.227 M
140.23 78.227 L
S
GR
GS
[0.375 0 0 0.375 44.75 316.03976] CT
/Helvetica 26.667 F
GS
[1 0 0 1 0 0] CT
-15 10.5 moveto 
1 -1 scale
(0) t 
GR
GR
GS
[0.375 0 0 0.375 44.75 287.36932] CT
/Helvetica 26.667 F
GS
[1 0 0 1 0 0] CT
-38 10.5 moveto 
1 -1 scale
(0.1) t 
GR
GR
GS
[0.375 0 0 0.375 44.75 258.69887] CT
/Helvetica 26.667 F
GS
[1 0 0 1 0 0] CT
-38 10.5 moveto 
1 -1 scale
(0.2) t 
GR
GR
GS
[0.375 0 0 0.375 44.75 230.0284] CT
/Helvetica 26.667 F
GS
[1 0 0 1 0 0] CT
-38 10.5 moveto 
1 -1 scale
(0.3) t 
GR
GR
GS
[0.375 0 0 0.375 44.75 201.35795] CT
/Helvetica 26.667 F
GS
[1 0 0 1 0 0] CT
-38 10.5 moveto 
1 -1 scale
(0.4) t 
GR
GR
GS
[0.375 0 0 0.375 44.75 172.6875] CT
/Helvetica 26.667 F
GS
[1 0 0 1 0 0] CT
-38 10.5 moveto 
1 -1 scale
(0.5) t 
GR
GR
GS
[0.375 0 0 0.375 44.75 144.01704] CT
/Helvetica 26.667 F
GS
[1 0 0 1 0 0] CT
-38 10.5 moveto 
1 -1 scale
(0.6) t 
GR
GR
GS
[0.375 0 0 0.375 44.75 115.34659] CT
/Helvetica 26.667 F
GS
[1 0 0 1 0 0] CT
-38 10.5 moveto 
1 -1 scale
(0.7) t 
GR
GR
GS
[0.375 0 0 0.375 44.75 86.67613] CT
/Helvetica 26.667 F
GS
[1 0 0 1 0 0] CT
-38 10.5 moveto 
1 -1 scale
(0.8) t 
GR
GR
GS
[0.375 0 0 0.375 44.75 58.00569] CT
/Helvetica 26.667 F
GS
[1 0 0 1 0 0] CT
-38 10.5 moveto 
1 -1 scale
(0.9) t 
GR
GR
GS
[0.375 0 0 0.375 44.75 29.33523] CT
/Helvetica 26.667 F
GS
[1 0 0 1 0 0] CT
-15 10.5 moveto 
1 -1 scale
(1) t 
GR
GR
GS
[0 -0.375 0.375 0 27.5 172.68736] CT
/Helvetica 26.667 F
GS
[1 0 0 1 0 0] CT
-57.5 -6 moveto 
1 -1 scale
(P\(accept\)) t 
GR
GR
GS
[0.375 0 0 0.375 0 0] CT
1 LJ
4 LW
N
176.5 634.318 M
176.5 563.3 L
S
GR
GS
[0.375 0 0 0.375 0 0] CT
1 LJ
4 LW
N
161.969 563.3 M
191.031 563.3 L
S
GR
GS
[0.375 0 0 0.375 0 0] CT
1 LJ
4 LW
N
161.969 634.318 M
191.031 634.318 L
S
GR
GS
[0.375 0 0 0.375 0 0] CT
1 LJ
4 LW
N
409 572.539 M
409 489.636 L
S
GR
GS
[0.375 0 0 0.375 0 0] CT
1 LJ
4 LW
N
394.469 489.636 M
423.531 489.636 L
S
GR
GS
[0.375 0 0 0.375 0 0] CT
1 LJ
4 LW
N
394.469 572.539 M
423.531 572.539 L
S
GR
GS
[0.375 0 0 0.375 0 0] CT
1 LJ
4 LW
N
641.5 465.518 M
641.5 389.744 L
S
GR
GS
[0.375 0 0 0.375 0 0] CT
1 LJ
4 LW
N
626.969 389.744 M
656.031 389.744 L
S
GR
GS
[0.375 0 0 0.375 0 0] CT
1 LJ
4 LW
N
626.969 465.518 M
656.031 465.518 L
S
GR
GS
[0.375 0 0 0.375 0 0] CT
1 LJ
4 LW
N
874 317.985 M
874 260.501 L
S
GR
GS
[0.375 0 0 0.375 0 0] CT
1 LJ
4 LW
N
859.469 260.501 M
888.531 260.501 L
S
GR
GS
[0.375 0 0 0.375 0 0] CT
1 LJ
4 LW
N
859.469 317.985 M
888.531 317.985 L
S
GR
GS
[0.375 0 0 0.375 0 0] CT
1 LJ
4 LW
N
1106.5 248.788 M
1106.5 188.991 L
S
GR
GS
[0.375 0 0 0.375 0 0] CT
1 LJ
4 LW
N
1091.969 188.991 M
1121.031 188.991 L
S
GR
GS
[0.375 0 0 0.375 0 0] CT
1 LJ
4 LW
N
1091.969 248.788 M
1121.031 248.788 L
S
GR
GS
[0.375 0 0 0.375 0 0] CT
1 LJ
4 LW
N
176.5 590.625 M
176.5 516.455 L
S
GR
GS
[0.375 0 0 0.375 0 0] CT
1 LJ
4 LW
N
161.969 516.455 M
191.031 516.455 L
S
GR
GS
[0.375 0 0 0.375 0 0] CT
1 LJ
4 LW
N
161.969 590.625 M
191.031 590.625 L
S
GR
GS
[0.375 0 0 0.375 0 0] CT
1 LJ
4 LW
N
409 451.991 M
409 372.691 L
S
GR
GS
[0.375 0 0 0.375 0 0] CT
1 LJ
4 LW
N
394.469 372.691 M
423.531 372.691 L
S
GR
GS
[0.375 0 0 0.375 0 0] CT
1 LJ
4 LW
N
394.469 451.991 M
423.531 451.991 L
S
GR
GS
[0.375 0 0 0.375 0 0] CT
1 LJ
4 LW
N
641.5 306.635 M
641.5 246.686 L
S
GR
GS
[0.375 0 0 0.375 0 0] CT
1 LJ
4 LW
N
626.969 246.686 M
656.031 246.686 L
S
GR
GS
[0.375 0 0 0.375 0 0] CT
1 LJ
4 LW
N
626.969 306.635 M
656.031 306.635 L
S
GR
GS
[0.375 0 0 0.375 0 0] CT
1 LJ
4 LW
N
874 265.755 M
874 205.998 L
S
GR
GS
[0.375 0 0 0.375 0 0] CT
1 LJ
4 LW
N
859.469 205.998 M
888.531 205.998 L
S
GR
GS
[0.375 0 0 0.375 0 0] CT
1 LJ
4 LW
N
859.469 265.755 M
888.531 265.755 L
S
GR
GS
[0.375 0 0 0.375 0 0] CT
1 LJ
4 LW
N
1106.5 206.893 M
1106.5 162.88 L
S
GR
GS
[0.375 0 0 0.375 0 0] CT
1 LJ
4 LW
N
1091.969 162.88 M
1121.031 162.88 L
S
GR
GS
[0.375 0 0 0.375 0 0] CT
1 LJ
4 LW
N
1091.969 206.893 M
1121.031 206.893 L
S
GR
GS
[0.375 0 0 0.375 447.375 162.91219] CT
/Helvetica-Bold 32 F
GS
[1 0 0 1 0 0] CT
0 12.5 moveto 
1 -1 scale
(Last fix to G\(2\) or L\(1\)) t 
GR
GR
GS
[0.375 0 0 0.375 0 0] CT
1 LJ
8 LW
N
1193 500.746 M
1227.286 500.746 L
S
GR
GS
[0.375 0 0 0.375 466.66072 187.77976] CT
/Helvetica 26.667 F
GS
[1 0 0 1 0 0] CT
0 10.5 moveto 
1 -1 scale
(1) t 
GR
GR
GS
[0.375 0 0 0.375 0 0] CT
1 LJ
8 LW
N
1193 567.06 M
1227.286 567.06 L
S
GR
GS
[0.375 0 0 0.375 466.66072 212.64734] CT
/Helvetica 26.667 F
GS
[1 0 0 1 0 0] CT
0 10.5 moveto 
1 -1 scale
(2) t 
GR
GR
%%Trailer
%%Pages: 1
%%EOF
