%!PS-Adobe-3.0 EPSF-3.0
%%Creator: (MATLAB, The Mathworks, Inc. Version 9.7.0.1261785 \(R2019b\) Update 3. Operating System: Windows 10)
%%Title: C:/Users/Clarissa/Documents/decid_eye/analysis/manip1&2/1_pipeline/fixations/3_f_fixation_behav/plots/lvl2_all/choiceAsFunctionOfValueDiff_TimeAdv_PSE.eps
%%CreationDate: 2021-04-19T12:26:51
%%Pages: (atend)
%%BoundingBox:    17    15   346   361
%%LanguageLevel: 3
%%EndComments
%%BeginProlog
%%BeginResource: procset (Apache XML Graphics Std ProcSet) 1.2 0
%%Version: 1.2 0
%%Copyright: (Copyright 2001-2003,2010 The Apache Software Foundation. License terms: http://www.apache.org/licenses/LICENSE-2.0)
/bd{bind def}bind def
/ld{load def}bd
/GR/grestore ld
/GS/gsave ld
/RM/rmoveto ld
/C/curveto ld
/t/show ld
/L/lineto ld
/ML/setmiterlimit ld
/CT/concat ld
/f/fill ld
/N/newpath ld
/S/stroke ld
/CC/setcmykcolor ld
/A/ashow ld
/cp/closepath ld
/RC/setrgbcolor ld
/LJ/setlinejoin ld
/GC/setgray ld
/LW/setlinewidth ld
/M/moveto ld
/re {4 2 roll M
1 index 0 rlineto
0 exch rlineto
neg 0 rlineto
cp } bd
/_ctm matrix def
/_tm matrix def
/BT { _ctm currentmatrix pop matrix _tm copy pop 0 0 moveto } bd
/ET { _ctm setmatrix } bd
/iTm { _ctm setmatrix _tm concat } bd
/Tm { _tm astore pop iTm 0 0 moveto } bd
/ux 0.0 def
/uy 0.0 def
/F {
  /Tp exch def
  /Tf exch def
  Tf findfont Tp scalefont setfont
  /cf Tf def  /cs Tp def
} bd
/ULS {currentpoint /uy exch def /ux exch def} bd
/ULE {
  /Tcx currentpoint pop def
  gsave
  newpath
  cf findfont cs scalefont dup
  /FontMatrix get 0 get /Ts exch def /FontInfo get dup
  /UnderlinePosition get Ts mul /To exch def
  /UnderlineThickness get Ts mul /Tt exch def
  ux uy To add moveto  Tcx uy To add lineto
  Tt setlinewidth stroke
  grestore
} bd
/OLE {
  /Tcx currentpoint pop def
  gsave
  newpath
  cf findfont cs scalefont dup
  /FontMatrix get 0 get /Ts exch def /FontInfo get dup
  /UnderlinePosition get Ts mul /To exch def
  /UnderlineThickness get Ts mul /Tt exch def
  ux uy To add cs add moveto Tcx uy To add cs add lineto
  Tt setlinewidth stroke
  grestore
} bd
/SOE {
  /Tcx currentpoint pop def
  gsave
  newpath
  cf findfont cs scalefont dup
  /FontMatrix get 0 get /Ts exch def /FontInfo get dup
  /UnderlinePosition get Ts mul /To exch def
  /UnderlineThickness get Ts mul /Tt exch def
  ux uy To add cs 10 mul 26 idiv add moveto Tcx uy To add cs 10 mul 26 idiv add lineto
  Tt setlinewidth stroke
  grestore
} bd
/QT {
/Y22 exch store
/X22 exch store
/Y21 exch store
/X21 exch store
currentpoint
/Y21 load 2 mul add 3 div exch
/X21 load 2 mul add 3 div exch
/X21 load 2 mul /X22 load add 3 div
/Y21 load 2 mul /Y22 load add 3 div
/X22 load /Y22 load curveto
} bd
/SSPD {
dup length /d exch dict def
{
/v exch def
/k exch def
currentpagedevice k known {
/cpdv currentpagedevice k get def
v cpdv ne {
/upd false def
/nullv v type /nulltype eq def
/nullcpdv cpdv type /nulltype eq def
nullv nullcpdv or
{
/upd true def
} {
/sametype v type cpdv type eq def
sametype {
v type /arraytype eq {
/vlen v length def
/cpdvlen cpdv length def
vlen cpdvlen eq {
0 1 vlen 1 sub {
/i exch def
/obj v i get def
/cpdobj cpdv i get def
obj cpdobj ne {
/upd true def
exit
} if
} for
} {
/upd true def
} ifelse
} {
v type /dicttype eq {
v {
/dv exch def
/dk exch def
/cpddv cpdv dk get def
dv cpddv ne {
/upd true def
exit
} if
} forall
} {
/upd true def
} ifelse
} ifelse
} if
} ifelse
upd true eq {
d k v put
} if
} if
} if
} forall
d length 0 gt {
d setpagedevice
} if
} bd
/RE { % /NewFontName [NewEncodingArray] /FontName RE -
  findfont dup length dict begin
  {
    1 index /FID ne
    {def} {pop pop} ifelse
  } forall
  /Encoding exch def
  /FontName 1 index def
  currentdict definefont pop
  end
} bind def
%%EndResource
%%BeginResource: procset (Apache XML Graphics EPS ProcSet) 1.0 0
%%Version: 1.0 0
%%Copyright: (Copyright 2002-2003 The Apache Software Foundation. License terms: http://www.apache.org/licenses/LICENSE-2.0)
/BeginEPSF { %def
/b4_Inc_state save def         % Save state for cleanup
/dict_count countdictstack def % Count objects on dict stack
/op_count count 1 sub def      % Count objects on operand stack
userdict begin                 % Push userdict on dict stack
/showpage { } def              % Redefine showpage, { } = null proc
0 setgray 0 setlinecap         % Prepare graphics state
1 setlinewidth 0 setlinejoin
10 setmiterlimit [ ] 0 setdash newpath
/languagelevel where           % If level not equal to 1 then
{pop languagelevel             % set strokeadjust and
1 ne                           % overprint to their defaults.
{false setstrokeadjust false setoverprint
} if
} if
} bd
/EndEPSF { %def
count op_count sub {pop} repeat            % Clean up stacks
countdictstack dict_count sub {end} repeat
b4_Inc_state restore
} bd
%%EndResource
%FOPBeginFontDict
%%IncludeResource: font Courier-Oblique
%%IncludeResource: font Courier-BoldOblique
%%IncludeResource: font Courier-Bold
%%IncludeResource: font ZapfDingbats
%%IncludeResource: font Symbol
%%IncludeResource: font Helvetica
%%IncludeResource: font Helvetica-Oblique
%%IncludeResource: font Helvetica-Bold
%%IncludeResource: font Helvetica-BoldOblique
%%IncludeResource: font Times-Roman
%%IncludeResource: font Times-Italic
%%IncludeResource: font Times-Bold
%%IncludeResource: font Times-BoldItalic
%%IncludeResource: font Courier
%FOPEndFontDict
%%BeginResource: encoding WinAnsiEncoding
/WinAnsiEncoding [
/.notdef /.notdef /.notdef /.notdef /.notdef
/.notdef /.notdef /.notdef /.notdef /.notdef
/.notdef /.notdef /.notdef /.notdef /.notdef
/.notdef /.notdef /.notdef /.notdef /.notdef
/.notdef /.notdef /.notdef /.notdef /.notdef
/.notdef /.notdef /.notdef /.notdef /.notdef
/.notdef /.notdef /space /exclam /quotedbl
/numbersign /dollar /percent /ampersand /quotesingle
/parenleft /parenright /asterisk /plus /comma
/hyphen /period /slash /zero /one
/two /three /four /five /six
/seven /eight /nine /colon /semicolon
/less /equal /greater /question /at
/A /B /C /D /E
/F /G /H /I /J
/K /L /M /N /O
/P /Q /R /S /T
/U /V /W /X /Y
/Z /bracketleft /backslash /bracketright /asciicircum
/underscore /quoteleft /a /b /c
/d /e /f /g /h
/i /j /k /l /m
/n /o /p /q /r
/s /t /u /v /w
/x /y /z /braceleft /bar
/braceright /asciitilde /bullet /Euro /bullet
/quotesinglbase /florin /quotedblbase /ellipsis /dagger
/daggerdbl /circumflex /perthousand /Scaron /guilsinglleft
/OE /bullet /Zcaron /bullet /bullet
/quoteleft /quoteright /quotedblleft /quotedblright /bullet
/endash /emdash /asciitilde /trademark /scaron
/guilsinglright /oe /bullet /zcaron /Ydieresis
/space /exclamdown /cent /sterling /currency
/yen /brokenbar /section /dieresis /copyright
/ordfeminine /guillemotleft /logicalnot /sfthyphen /registered
/macron /degree /plusminus /twosuperior /threesuperior
/acute /mu /paragraph /middot /cedilla
/onesuperior /ordmasculine /guillemotright /onequarter /onehalf
/threequarters /questiondown /Agrave /Aacute /Acircumflex
/Atilde /Adieresis /Aring /AE /Ccedilla
/Egrave /Eacute /Ecircumflex /Edieresis /Igrave
/Iacute /Icircumflex /Idieresis /Eth /Ntilde
/Ograve /Oacute /Ocircumflex /Otilde /Odieresis
/multiply /Oslash /Ugrave /Uacute /Ucircumflex
/Udieresis /Yacute /Thorn /germandbls /agrave
/aacute /acircumflex /atilde /adieresis /aring
/ae /ccedilla /egrave /eacute /ecircumflex
/edieresis /igrave /iacute /icircumflex /idieresis
/eth /ntilde /ograve /oacute /ocircumflex
/otilde /odieresis /divide /oslash /ugrave
/uacute /ucircumflex /udieresis /yacute /thorn
/ydieresis
] def
%%EndResource
%FOPBeginFontReencode
/Courier-Oblique findfont
dup length dict begin
  {1 index /FID ne {def} {pop pop} ifelse} forall
  /Encoding WinAnsiEncoding def
  currentdict
end
/Courier-Oblique exch definefont pop
/Courier-BoldOblique findfont
dup length dict begin
  {1 index /FID ne {def} {pop pop} ifelse} forall
  /Encoding WinAnsiEncoding def
  currentdict
end
/Courier-BoldOblique exch definefont pop
/Courier-Bold findfont
dup length dict begin
  {1 index /FID ne {def} {pop pop} ifelse} forall
  /Encoding WinAnsiEncoding def
  currentdict
end
/Courier-Bold exch definefont pop
/Helvetica findfont
dup length dict begin
  {1 index /FID ne {def} {pop pop} ifelse} forall
  /Encoding WinAnsiEncoding def
  currentdict
end
/Helvetica exch definefont pop
/Helvetica-Oblique findfont
dup length dict begin
  {1 index /FID ne {def} {pop pop} ifelse} forall
  /Encoding WinAnsiEncoding def
  currentdict
end
/Helvetica-Oblique exch definefont pop
/Helvetica-Bold findfont
dup length dict begin
  {1 index /FID ne {def} {pop pop} ifelse} forall
  /Encoding WinAnsiEncoding def
  currentdict
end
/Helvetica-Bold exch definefont pop
/Helvetica-BoldOblique findfont
dup length dict begin
  {1 index /FID ne {def} {pop pop} ifelse} forall
  /Encoding WinAnsiEncoding def
  currentdict
end
/Helvetica-BoldOblique exch definefont pop
/Times-Roman findfont
dup length dict begin
  {1 index /FID ne {def} {pop pop} ifelse} forall
  /Encoding WinAnsiEncoding def
  currentdict
end
/Times-Roman exch definefont pop
/Times-Italic findfont
dup length dict begin
  {1 index /FID ne {def} {pop pop} ifelse} forall
  /Encoding WinAnsiEncoding def
  currentdict
end
/Times-Italic exch definefont pop
/Times-Bold findfont
dup length dict begin
  {1 index /FID ne {def} {pop pop} ifelse} forall
  /Encoding WinAnsiEncoding def
  currentdict
end
/Times-Bold exch definefont pop
/Times-BoldItalic findfont
dup length dict begin
  {1 index /FID ne {def} {pop pop} ifelse} forall
  /Encoding WinAnsiEncoding def
  currentdict
end
/Times-BoldItalic exch definefont pop
/Courier findfont
dup length dict begin
  {1 index /FID ne {def} {pop pop} ifelse} forall
  /Encoding WinAnsiEncoding def
  currentdict
end
/Courier exch definefont pop
%FOPEndFontReencode
%%EndProlog
%%Page: 1 1
%%PageBoundingBox: 0 0 375 375
%%BeginPageSetup
[1 0 0 -1 0 375] CT
%%EndPageSetup
GS
[0.375 0 0 0.375 0 0] CT
1 GC
N
0 0 1000 1000 re
f
GR
GS
[0.375 0 0 0.375 0 0] CT
1 GC
N
0 0 1000 1000 re
f
GR
GS
[0.375 0 0 0.375 0 0] CT
1 GC
N
146 916 M
920 916 L
920 40 L
146 40 L
cp
f
GR
GS
[0.375 0 0 0.375 0 0] CT
2 setlinecap
1 LJ
1.333 LW
N
146 916 M
920 916 L
S
GR
GS
[0.375 0 0 0.375 0 0] CT
2 setlinecap
1 LJ
1.333 LW
N
404 916 M
404 907.24 L
S
GR
GS
[0.375 0 0 0.375 0 0] CT
2 setlinecap
1 LJ
1.333 LW
N
662 916 M
662 907.24 L
S
GR
GS
[0.375 0 0 0.375 151.5 347.50001] CT
/Helvetica 26.667 F
GS
[1 0 0 1 0 0] CT
-90.5 27 moveto 
1 -1 scale
(Time adv gains) t 
GR
GR
GS
[0.375 0 0 0.375 248.25 347.50001] CT
/Helvetica 26.667 F
GS
[1 0 0 1 0 0] CT
-96.5 27 moveto 
1 -1 scale
(Time adv losses) t 
GR
GR
GS
[0.375 0 0 0.375 0 0] CT
2 setlinecap
1 LJ
1.333 LW
N
146 916 M
146 40 L
S
GR
GS
[0.375 0 0 0.375 0 0] CT
2 setlinecap
1 LJ
1.333 LW
N
146 908.755 M
154.76 908.755 L
S
GR
GS
[0.375 0 0 0.375 0 0] CT
2 setlinecap
1 LJ
1.333 LW
N
146 789.117 M
154.76 789.117 L
S
GR
GS
[0.375 0 0 0.375 0 0] CT
2 setlinecap
1 LJ
1.333 LW
N
146 669.48 M
154.76 669.48 L
S
GR
GS
[0.375 0 0 0.375 0 0] CT
2 setlinecap
1 LJ
1.333 LW
N
146 549.842 M
154.76 549.842 L
S
GR
GS
[0.375 0 0 0.375 0 0] CT
2 setlinecap
1 LJ
1.333 LW
N
146 430.204 M
154.76 430.204 L
S
GR
GS
[0.375 0 0 0.375 0 0] CT
2 setlinecap
1 LJ
1.333 LW
N
146 310.566 M
154.76 310.566 L
S
GR
GS
[0.375 0 0 0.375 0 0] CT
2 setlinecap
1 LJ
1.333 LW
N
146 190.928 M
154.76 190.928 L
S
GR
GS
[0.375 0 0 0.375 0 0] CT
2 setlinecap
1 LJ
1.333 LW
N
146 71.29 M
154.76 71.29 L
S
GR
GS
[0.375 0 0 0.375 50.75 340.78329] CT
/Helvetica 26.667 F
GS
[1 0 0 1 0 0] CT
-54 10.5 moveto 
1 -1 scale
(-800) t 
GR
GR
GS
[0.375 0 0 0.375 50.75 295.91906] CT
/Helvetica 26.667 F
GS
[1 0 0 1 0 0] CT
-54 10.5 moveto 
1 -1 scale
(-600) t 
GR
GR
GS
[0.375 0 0 0.375 50.75 251.05483] CT
/Helvetica 26.667 F
GS
[1 0 0 1 0 0] CT
-54 10.5 moveto 
1 -1 scale
(-400) t 
GR
GR
GS
[0.375 0 0 0.375 50.75 206.19061] CT
/Helvetica 26.667 F
GS
[1 0 0 1 0 0] CT
-54 10.5 moveto 
1 -1 scale
(-200) t 
GR
GR
GS
[0.375 0 0 0.375 50.75 161.32638] CT
/Helvetica 26.667 F
GS
[1 0 0 1 0 0] CT
-15 10.5 moveto 
1 -1 scale
(0) t 
GR
GR
GS
[0.375 0 0 0.375 50.75 116.46216] CT
/Helvetica 26.667 F
GS
[1 0 0 1 0 0] CT
-45 10.5 moveto 
1 -1 scale
(200) t 
GR
GR
GS
[0.375 0 0 0.375 50.75 71.59793] CT
/Helvetica 26.667 F
GS
[1 0 0 1 0 0] CT
-45 10.5 moveto 
1 -1 scale
(400) t 
GR
GR
GS
[0.375 0 0 0.375 50.75 26.73371] CT
/Helvetica 26.667 F
GS
[1 0 0 1 0 0] CT
-45 10.5 moveto 
1 -1 scale
(600) t 
GR
GR
GS
[0 -0.375 0.375 0 27.5 179.24984] CT
/Helvetica 26.667 F
GS
[1 0 0 1 0 0] CT
-345.5 -6 moveto 
1 -1 scale
(PSE \(= point of subjective equality, where P\(accept\) = 0.5\)) t 
GR
GR
GS
[0.375 0 0 0.375 151.5 29.93182] CT
N
6.667 0 M
6.667 -3.682 3.682 -6.667 0 -6.667 C
-3.682 -6.667 -6.667 -3.682 -6.667 0 C
-6.667 3.682 -3.682 6.667 0 6.667 C
3.682 6.667 6.667 3.682 6.667 0 C
cp
f
GR
GS
[0.375 0 0 0.375 248.25 328.56818] CT
N
/f640454831{6.667 0 M
6.667 -3.682 3.682 -6.667 0 -6.667 C
-3.682 -6.667 -6.667 -3.682 -6.667 0 C
-6.667 3.682 -3.682 6.667 0 6.667 C
3.682 6.667 6.667 3.682 6.667 0 C
cp}def
f640454831
f
GR
GS
[0.375 0 0 0.375 0 0] CT
1 LJ
4 LW
N
404 79.818 M
662 876.182 L
S
GR
GS
[0.375 0 0 0.375 151.5 159.77333] CT
N
f640454831
f
GR
GS
[0.375 0 0 0.375 248.25 156.92677] CT
N
f640454831
f
GR
GS
[0.375 0 0 0.375 0 0] CT
1 LJ
4 LW
N
404 426.062 M
662 418.471 L
S
GR
GS
[0.375 0 0 0.375 151.5 170.2234] CT
N
f640454831
f
GR
GS
[0.375 0 0 0.375 248.25 70.33131] CT
N
f640454831
f
GR
GS
[0.375 0 0 0.375 0 0] CT
1 LJ
4 LW
N
404 453.929 M
662 187.55 L
S
GR
GS
[0.375 0 0 0.375 151.5 162.24002] CT
N
f640454831
f
GR
GS
[0.375 0 0 0.375 248.25 162.75481] CT
N
f640454831
f
GR
GS
[0.375 0 0 0.375 0 0] CT
1 LJ
4 LW
N
404 432.64 M
662 434.013 L
S
GR
GS
[0.375 0 0 0.375 151.5 161.26263] CT
N
f640454831
f
GR
GS
[0.375 0 0 0.375 248.25 159.17822] CT
N
f640454831
f
GR
GS
[0.375 0 0 0.375 0 0] CT
1 LJ
4 LW
N
404 430.034 M
662 424.475 L
S
GR
GS
[0.375 0 0 0.375 151.5 160.88589] CT
N
f640454831
f
GR
GS
[0.375 0 0 0.375 248.25 159.88351] CT
N
f640454831
f
GR
GS
[0.375 0 0 0.375 0 0] CT
1 LJ
4 LW
N
404 429.029 M
662 426.356 L
S
GR
GS
[0.375 0 0 0.375 151.5 154.03907] CT
N
f640454831
f
GR
GS
[0.375 0 0 0.375 248.25 151.94555] CT
N
f640454831
f
GR
GS
[0.375 0 0 0.375 0 0] CT
1 LJ
4 LW
N
404 410.771 M
662 405.188 L
S
GR
GS
[0.375 0 0 0.375 151.5 165.91888] CT
N
f640454831
f
GR
GS
[0.375 0 0 0.375 248.25 166.21048] CT
N
f640454831
f
GR
GS
[0.375 0 0 0.375 0 0] CT
1 LJ
4 LW
N
404 442.45 M
662 443.228 L
S
GR
GS
[0.375 0 0 0.375 151.5 158.06071] CT
N
f640454831
f
GR
GS
[0.375 0 0 0.375 248.25 161.17126] CT
N
f640454831
f
GR
GS
[0.375 0 0 0.375 0 0] CT
1 LJ
4 LW
N
404 421.495 M
662 429.79 L
S
GR
GS
[0.375 0 0 0.375 151.5 163.75188] CT
N
f640454831
f
GR
GS
[0.375 0 0 0.375 248.25 165.13831] CT
N
f640454831
f
GR
GS
[0.375 0 0 0.375 0 0] CT
1 LJ
4 LW
N
404 436.672 M
662 440.369 L
S
GR
GS
[0.375 0 0 0.375 151.5 159.90522] CT
N
f640454831
f
GR
GS
[0.375 0 0 0.375 248.25 158.73402] CT
N
f640454831
f
GR
GS
[0.375 0 0 0.375 0 0] CT
1 LJ
4 LW
N
404 426.414 M
662 423.291 L
S
GR
GS
[0.375 0 0 0.375 151.5 160.74002] CT
N
f640454831
f
GR
GS
[0.375 0 0 0.375 248.25 160.42065] CT
N
f640454831
f
GR
GS
[0.375 0 0 0.375 0 0] CT
1 LJ
4 LW
N
404 428.64 M
662 427.788 L
S
GR
GS
[0.375 0 0 0.375 151.5 166.19869] CT
N
f640454831
f
GR
GS
[0.375 0 0 0.375 248.25 165.73072] CT
N
f640454831
f
GR
GS
[0.375 0 0 0.375 0 0] CT
1 LJ
4 LW
N
404 443.197 M
662 441.949 L
S
GR
GS
[0.375 0 0 0.375 151.5 160.796] CT
N
f640454831
f
GR
GS
[0.375 0 0 0.375 248.25 161.46576] CT
N
f640454831
f
GR
GS
[0.375 0 0 0.375 0 0] CT
1 LJ
4 LW
N
404 428.789 M
662 430.575 L
S
GR
GS
[0.375 0 0 0.375 151.5 161.82273] CT
N
f640454831
f
GR
GS
[0.375 0 0 0.375 248.25 161.65376] CT
N
f640454831
f
GR
GS
[0.375 0 0 0.375 0 0] CT
1 LJ
4 LW
N
404 431.527 M
662 431.077 L
S
GR
GS
[0.375 0 0 0.375 151.5 166.45801] CT
N
f640454831
f
GR
GS
[0.375 0 0 0.375 248.25 184.254] CT
N
f640454831
f
GR
GS
[0.375 0 0 0.375 0 0] CT
1 LJ
4 LW
N
404 443.888 M
662 491.344 L
S
GR
GS
[0.375 0 0 0.375 151.5 163.13546] CT
N
f640454831
f
GR
GS
[0.375 0 0 0.375 248.25 159.20575] CT
N
f640454831
f
GR
GS
[0.375 0 0 0.375 0 0] CT
1 LJ
4 LW
N
404 435.028 M
662 424.549 L
S
GR
GS
[0.375 0 0 0.375 151.5 161.73082] CT
N
f640454831
f
GR
GS
[0.375 0 0 0.375 248.25 159.09901] CT
N
f640454831
f
GR
GS
[0.375 0 0 0.375 0 0] CT
1 LJ
4 LW
N
404 431.282 M
662 424.264 L
S
GR
GS
[0.375 0 0 0.375 151.5 160.61118] CT
N
f640454831
f
GR
GS
[0.375 0 0 0.375 248.25 142.99323] CT
N
f640454831
f
GR
GS
[0.375 0 0 0.375 0 0] CT
1 LJ
4 LW
N
404 428.296 M
662 381.315 L
S
GR
GS
[0.375 0 0 0.375 151.5 156.9799] CT
N
f640454831
f
GR
GS
[0.375 0 0 0.375 248.25 164.81712] CT
N
f640454831
f
GR
GS
[0.375 0 0 0.375 0 0] CT
1 LJ
4 LW
N
404 418.613 M
662 439.512 L
S
GR
GS
[0.375 0 0 0.375 151.5 161.37981] CT
N
f640454831
f
GR
GS
[0.375 0 0 0.375 248.25 161.52302] CT
N
f640454831
f
GR
GS
[0.375 0 0 0.375 0 0] CT
1 LJ
4 LW
N
404 430.346 M
662 430.728 L
S
GR
GS
[0.375 0 0 0.375 151.5 172.79259] CT
N
f640454831
f
GR
GS
[0.375 0 0 0.375 248.25 171.28737] CT
N
f640454831
f
GR
GS
[0.375 0 0 0.375 0 0] CT
1 LJ
4 LW
N
404 460.78 M
662 456.766 L
S
GR
GS
[0.375 0 0 0.375 151.5 166.59104] CT
N
f640454831
f
GR
GS
[0.375 0 0 0.375 248.25 164.7249] CT
N
f640454831
f
GR
GS
[0.375 0 0 0.375 0 0] CT
1 LJ
4 LW
N
404 444.243 M
662 439.266 L
S
GR
GS
[0.375 0 0 0.375 151.5 170.0758] CT
N
f640454831
f
GR
GS
[0.375 0 0 0.375 248.25 166.61853] CT
N
f640454831
f
GR
GS
[0.375 0 0 0.375 0 0] CT
1 LJ
4 LW
N
404 453.535 M
662 444.316 L
S
GR
GS
[0.375 0 0 0.375 151.5 161.33601] CT
N
f640454831
f
GR
GS
[0.375 0 0 0.375 248.25 162.40662] CT
N
f640454831
f
GR
GS
[0.375 0 0 0.375 0 0] CT
1 LJ
4 LW
N
404 430.229 M
662 433.084 L
S
GR
GS
[0.375 0 0 0.375 151.5 161.69234] CT
N
f640454831
f
GR
GS
[0.375 0 0 0.375 248.25 162.94979] CT
N
f640454831
f
GR
GS
[0.375 0 0 0.375 0 0] CT
1 LJ
4 LW
N
404 431.18 M
662 434.533 L
S
GR
GS
[0.375 0 0 0.375 151.5 160.21359] CT
N
f640454831
f
GR
GS
[0.375 0 0 0.375 248.25 157.58818] CT
N
f640454831
f
GR
GS
[0.375 0 0 0.375 0 0] CT
1 LJ
4 LW
N
404 427.236 M
662 420.235 L
S
GR
GS
[0.375 0 0 0.375 151.5 163.18984] CT
N
f640454831
f
GR
GS
[0.375 0 0 0.375 248.25 162.44999] CT
N
f640454831
f
GR
GS
[0.375 0 0 0.375 0 0] CT
1 LJ
4 LW
N
404 435.173 M
662 433.2 L
S
GR
GS
[0.375 0 0 0.375 151.5 163.598] CT
N
f640454831
f
GR
GS
[0.375 0 0 0.375 248.25 163.31781] CT
N
f640454831
f
GR
GS
[0.375 0 0 0.375 0 0] CT
1 LJ
4 LW
N
404 436.261 M
662 435.514 L
S
GR
GS
[0.375 0 0 0.375 151.5 160.20108] CT
N
f640454831
f
GR
GS
[0.375 0 0 0.375 248.25 160.31839] CT
N
f640454831
f
GR
GS
[0.375 0 0 0.375 0 0] CT
1 LJ
4 LW
N
404 427.203 M
662 427.516 L
S
GR
GS
[0.375 0 0 0.375 151.5 170.61153] CT
N
f640454831
f
GR
GS
[0.375 0 0 0.375 248.25 167.86374] CT
N
f640454831
f
GR
GS
[0.375 0 0 0.375 0 0] CT
1 LJ
4 LW
N
404 454.964 M
662 447.637 L
S
GR
GS
[0.375 0 0 0.375 151.5 165.48643] CT
N
f640454831
f
GR
GS
[0.375 0 0 0.375 248.25 165.21989] CT
N
f640454831
f
GR
GS
[0.375 0 0 0.375 0 0] CT
1 LJ
4 LW
N
404 441.297 M
662 440.586 L
S
GR
GS
[0.375 0 0 0.375 151.5 159.56811] CT
N
f640454831
f
GR
GS
[0.375 0 0 0.375 248.25 160.03001] CT
N
f640454831
f
GR
GS
[0.375 0 0 0.375 0 0] CT
1 LJ
4 LW
N
404 425.515 M
662 426.747 L
S
GR
GS
[0.375 0 0 0.375 151.5 164.67344] CT
N
f640454831
f
GR
GS
[0.375 0 0 0.375 248.25 170.63975] CT
N
f640454831
f
GR
GS
[0.375 0 0 0.375 0 0] CT
1 LJ
4 LW
N
404 439.129 M
662 455.039 L
S
GR
GS
[0.375 0 0 0.375 151.5 163.95428] CT
N
f640454831
f
GR
GS
[0.375 0 0 0.375 248.25 162.21878] CT
N
f640454831
f
GR
GS
[0.375 0 0 0.375 0 0] CT
1 LJ
4 LW
N
404 437.211 M
662 432.583 L
S
GR
GS
[0.375 0 0 0.375 151.5 163.35523] CT
N
f640454831
f
GR
GS
[0.375 0 0 0.375 248.25 163.5314] CT
N
f640454831
f
GR
GS
[0.375 0 0 0.375 0 0] CT
1 LJ
4 LW
N
404 435.614 M
662 436.084 L
S
GR
GS
[0.375 0 0 0.375 151.5 147.36018] CT
N
f640454831
f
GR
GS
[0.375 0 0 0.375 248.25 155.85315] CT
N
f640454831
f
GR
GS
[0.375 0 0 0.375 0 0] CT
1 LJ
4 LW
N
404 392.96 M
662 415.608 L
S
GR
GS
[0.375 0 0 0.375 151.5 160.0733] CT
N
f640454831
f
GR
GS
[0.375 0 0 0.375 248.25 160.79829] CT
N
f640454831
f
GR
GS
[0.375 0 0 0.375 0 0] CT
1 LJ
4 LW
N
404 426.862 M
662 428.795 L
S
GR
%%Trailer
%%Pages: 1
%%EOF
