%!PS-Adobe-3.0 EPSF-3.0
%%Creator: (MATLAB, The Mathworks, Inc. Version 9.7.0.1261785 \(R2019b\) Update 3. Operating System: Windows 10)
%%Title: C:/Users/Clarissa/Documents/decid_eye/analysis/manip1&2/1_pipeline/fixations/2_f_remove_data/plots/percentYes.eps
%%CreationDate: 2021-05-05T12:04:30
%%Pages: (atend)
%%BoundingBox:    20     3   386   295
%%LanguageLevel: 3
%%EndComments
%%BeginProlog
%%BeginResource: procset (Apache XML Graphics Std ProcSet) 1.2 0
%%Version: 1.2 0
%%Copyright: (Copyright 2001-2003,2010 The Apache Software Foundation. License terms: http://www.apache.org/licenses/LICENSE-2.0)
/bd{bind def}bind def
/ld{load def}bd
/GR/grestore ld
/GS/gsave ld
/RM/rmoveto ld
/C/curveto ld
/t/show ld
/L/lineto ld
/ML/setmiterlimit ld
/CT/concat ld
/f/fill ld
/N/newpath ld
/S/stroke ld
/CC/setcmykcolor ld
/A/ashow ld
/cp/closepath ld
/RC/setrgbcolor ld
/LJ/setlinejoin ld
/GC/setgray ld
/LW/setlinewidth ld
/M/moveto ld
/re {4 2 roll M
1 index 0 rlineto
0 exch rlineto
neg 0 rlineto
cp } bd
/_ctm matrix def
/_tm matrix def
/BT { _ctm currentmatrix pop matrix _tm copy pop 0 0 moveto } bd
/ET { _ctm setmatrix } bd
/iTm { _ctm setmatrix _tm concat } bd
/Tm { _tm astore pop iTm 0 0 moveto } bd
/ux 0.0 def
/uy 0.0 def
/F {
  /Tp exch def
  /Tf exch def
  Tf findfont Tp scalefont setfont
  /cf Tf def  /cs Tp def
} bd
/ULS {currentpoint /uy exch def /ux exch def} bd
/ULE {
  /Tcx currentpoint pop def
  gsave
  newpath
  cf findfont cs scalefont dup
  /FontMatrix get 0 get /Ts exch def /FontInfo get dup
  /UnderlinePosition get Ts mul /To exch def
  /UnderlineThickness get Ts mul /Tt exch def
  ux uy To add moveto  Tcx uy To add lineto
  Tt setlinewidth stroke
  grestore
} bd
/OLE {
  /Tcx currentpoint pop def
  gsave
  newpath
  cf findfont cs scalefont dup
  /FontMatrix get 0 get /Ts exch def /FontInfo get dup
  /UnderlinePosition get Ts mul /To exch def
  /UnderlineThickness get Ts mul /Tt exch def
  ux uy To add cs add moveto Tcx uy To add cs add lineto
  Tt setlinewidth stroke
  grestore
} bd
/SOE {
  /Tcx currentpoint pop def
  gsave
  newpath
  cf findfont cs scalefont dup
  /FontMatrix get 0 get /Ts exch def /FontInfo get dup
  /UnderlinePosition get Ts mul /To exch def
  /UnderlineThickness get Ts mul /Tt exch def
  ux uy To add cs 10 mul 26 idiv add moveto Tcx uy To add cs 10 mul 26 idiv add lineto
  Tt setlinewidth stroke
  grestore
} bd
/QT {
/Y22 exch store
/X22 exch store
/Y21 exch store
/X21 exch store
currentpoint
/Y21 load 2 mul add 3 div exch
/X21 load 2 mul add 3 div exch
/X21 load 2 mul /X22 load add 3 div
/Y21 load 2 mul /Y22 load add 3 div
/X22 load /Y22 load curveto
} bd
/SSPD {
dup length /d exch dict def
{
/v exch def
/k exch def
currentpagedevice k known {
/cpdv currentpagedevice k get def
v cpdv ne {
/upd false def
/nullv v type /nulltype eq def
/nullcpdv cpdv type /nulltype eq def
nullv nullcpdv or
{
/upd true def
} {
/sametype v type cpdv type eq def
sametype {
v type /arraytype eq {
/vlen v length def
/cpdvlen cpdv length def
vlen cpdvlen eq {
0 1 vlen 1 sub {
/i exch def
/obj v i get def
/cpdobj cpdv i get def
obj cpdobj ne {
/upd true def
exit
} if
} for
} {
/upd true def
} ifelse
} {
v type /dicttype eq {
v {
/dv exch def
/dk exch def
/cpddv cpdv dk get def
dv cpddv ne {
/upd true def
exit
} if
} forall
} {
/upd true def
} ifelse
} ifelse
} if
} ifelse
upd true eq {
d k v put
} if
} if
} if
} forall
d length 0 gt {
d setpagedevice
} if
} bd
/RE { % /NewFontName [NewEncodingArray] /FontName RE -
  findfont dup length dict begin
  {
    1 index /FID ne
    {def} {pop pop} ifelse
  } forall
  /Encoding exch def
  /FontName 1 index def
  currentdict definefont pop
  end
} bind def
%%EndResource
%%BeginResource: procset (Apache XML Graphics EPS ProcSet) 1.0 0
%%Version: 1.0 0
%%Copyright: (Copyright 2002-2003 The Apache Software Foundation. License terms: http://www.apache.org/licenses/LICENSE-2.0)
/BeginEPSF { %def
/b4_Inc_state save def         % Save state for cleanup
/dict_count countdictstack def % Count objects on dict stack
/op_count count 1 sub def      % Count objects on operand stack
userdict begin                 % Push userdict on dict stack
/showpage { } def              % Redefine showpage, { } = null proc
0 setgray 0 setlinecap         % Prepare graphics state
1 setlinewidth 0 setlinejoin
10 setmiterlimit [ ] 0 setdash newpath
/languagelevel where           % If level not equal to 1 then
{pop languagelevel             % set strokeadjust and
1 ne                           % overprint to their defaults.
{false setstrokeadjust false setoverprint
} if
} if
} bd
/EndEPSF { %def
count op_count sub {pop} repeat            % Clean up stacks
countdictstack dict_count sub {end} repeat
b4_Inc_state restore
} bd
%%EndResource
%FOPBeginFontDict
%%IncludeResource: font Courier-Oblique
%%IncludeResource: font Courier-BoldOblique
%%IncludeResource: font Courier-Bold
%%IncludeResource: font ZapfDingbats
%%IncludeResource: font Symbol
%%IncludeResource: font Helvetica
%%IncludeResource: font Helvetica-Oblique
%%IncludeResource: font Helvetica-Bold
%%IncludeResource: font Helvetica-BoldOblique
%%IncludeResource: font Times-Roman
%%IncludeResource: font Times-Italic
%%IncludeResource: font Times-Bold
%%IncludeResource: font Times-BoldItalic
%%IncludeResource: font Courier
%FOPEndFontDict
%%BeginResource: encoding WinAnsiEncoding
/WinAnsiEncoding [
/.notdef /.notdef /.notdef /.notdef /.notdef
/.notdef /.notdef /.notdef /.notdef /.notdef
/.notdef /.notdef /.notdef /.notdef /.notdef
/.notdef /.notdef /.notdef /.notdef /.notdef
/.notdef /.notdef /.notdef /.notdef /.notdef
/.notdef /.notdef /.notdef /.notdef /.notdef
/.notdef /.notdef /space /exclam /quotedbl
/numbersign /dollar /percent /ampersand /quotesingle
/parenleft /parenright /asterisk /plus /comma
/hyphen /period /slash /zero /one
/two /three /four /five /six
/seven /eight /nine /colon /semicolon
/less /equal /greater /question /at
/A /B /C /D /E
/F /G /H /I /J
/K /L /M /N /O
/P /Q /R /S /T
/U /V /W /X /Y
/Z /bracketleft /backslash /bracketright /asciicircum
/underscore /quoteleft /a /b /c
/d /e /f /g /h
/i /j /k /l /m
/n /o /p /q /r
/s /t /u /v /w
/x /y /z /braceleft /bar
/braceright /asciitilde /bullet /Euro /bullet
/quotesinglbase /florin /quotedblbase /ellipsis /dagger
/daggerdbl /circumflex /perthousand /Scaron /guilsinglleft
/OE /bullet /Zcaron /bullet /bullet
/quoteleft /quoteright /quotedblleft /quotedblright /bullet
/endash /emdash /asciitilde /trademark /scaron
/guilsinglright /oe /bullet /zcaron /Ydieresis
/space /exclamdown /cent /sterling /currency
/yen /brokenbar /section /dieresis /copyright
/ordfeminine /guillemotleft /logicalnot /sfthyphen /registered
/macron /degree /plusminus /twosuperior /threesuperior
/acute /mu /paragraph /middot /cedilla
/onesuperior /ordmasculine /guillemotright /onequarter /onehalf
/threequarters /questiondown /Agrave /Aacute /Acircumflex
/Atilde /Adieresis /Aring /AE /Ccedilla
/Egrave /Eacute /Ecircumflex /Edieresis /Igrave
/Iacute /Icircumflex /Idieresis /Eth /Ntilde
/Ograve /Oacute /Ocircumflex /Otilde /Odieresis
/multiply /Oslash /Ugrave /Uacute /Ucircumflex
/Udieresis /Yacute /Thorn /germandbls /agrave
/aacute /acircumflex /atilde /adieresis /aring
/ae /ccedilla /egrave /eacute /ecircumflex
/edieresis /igrave /iacute /icircumflex /idieresis
/eth /ntilde /ograve /oacute /ocircumflex
/otilde /odieresis /divide /oslash /ugrave
/uacute /ucircumflex /udieresis /yacute /thorn
/ydieresis
] def
%%EndResource
%FOPBeginFontReencode
/Courier-Oblique findfont
dup length dict begin
  {1 index /FID ne {def} {pop pop} ifelse} forall
  /Encoding WinAnsiEncoding def
  currentdict
end
/Courier-Oblique exch definefont pop
/Courier-BoldOblique findfont
dup length dict begin
  {1 index /FID ne {def} {pop pop} ifelse} forall
  /Encoding WinAnsiEncoding def
  currentdict
end
/Courier-BoldOblique exch definefont pop
/Courier-Bold findfont
dup length dict begin
  {1 index /FID ne {def} {pop pop} ifelse} forall
  /Encoding WinAnsiEncoding def
  currentdict
end
/Courier-Bold exch definefont pop
/Helvetica findfont
dup length dict begin
  {1 index /FID ne {def} {pop pop} ifelse} forall
  /Encoding WinAnsiEncoding def
  currentdict
end
/Helvetica exch definefont pop
/Helvetica-Oblique findfont
dup length dict begin
  {1 index /FID ne {def} {pop pop} ifelse} forall
  /Encoding WinAnsiEncoding def
  currentdict
end
/Helvetica-Oblique exch definefont pop
/Helvetica-Bold findfont
dup length dict begin
  {1 index /FID ne {def} {pop pop} ifelse} forall
  /Encoding WinAnsiEncoding def
  currentdict
end
/Helvetica-Bold exch definefont pop
/Helvetica-BoldOblique findfont
dup length dict begin
  {1 index /FID ne {def} {pop pop} ifelse} forall
  /Encoding WinAnsiEncoding def
  currentdict
end
/Helvetica-BoldOblique exch definefont pop
/Times-Roman findfont
dup length dict begin
  {1 index /FID ne {def} {pop pop} ifelse} forall
  /Encoding WinAnsiEncoding def
  currentdict
end
/Times-Roman exch definefont pop
/Times-Italic findfont
dup length dict begin
  {1 index /FID ne {def} {pop pop} ifelse} forall
  /Encoding WinAnsiEncoding def
  currentdict
end
/Times-Italic exch definefont pop
/Times-Bold findfont
dup length dict begin
  {1 index /FID ne {def} {pop pop} ifelse} forall
  /Encoding WinAnsiEncoding def
  currentdict
end
/Times-Bold exch definefont pop
/Times-BoldItalic findfont
dup length dict begin
  {1 index /FID ne {def} {pop pop} ifelse} forall
  /Encoding WinAnsiEncoding def
  currentdict
end
/Times-BoldItalic exch definefont pop
/Courier findfont
dup length dict begin
  {1 index /FID ne {def} {pop pop} ifelse} forall
  /Encoding WinAnsiEncoding def
  currentdict
end
/Courier exch definefont pop
%FOPEndFontReencode
%%EndProlog
%%Page: 1 1
%%PageBoundingBox: 0 0 420 315
%%BeginPageSetup
[1 0 0 -1 0 315] CT
%%EndPageSetup
GS
[0.375 0 0 0.375 0 0] CT
1 GC
N
0 0 1120 840 re
f
GR
GS
[0.375 0 0 0.375 0 0] CT
1 GC
N
0 0 1120 840 re
f
GR
GS
[0.375 0 0 0.375 0 0] CT
1 GC
N
146 748 M
1014 748 L
1014 63 L
146 63 L
cp
f
GR
GS
[0.375 0 0 0.375 0 0] CT
2 setlinecap
1 LJ
1.333 LW
N
146 748 M
1014 748 L
S
GR
GS
[0.375 0 0 0.375 0 0] CT
2 setlinecap
1 LJ
1.333 LW
N
146 748 M
146 739.32 L
S
GR
GS
[0.375 0 0 0.375 0 0] CT
2 setlinecap
1 LJ
1.333 LW
N
254.5 748 M
254.5 739.32 L
S
GR
GS
[0.375 0 0 0.375 0 0] CT
2 setlinecap
1 LJ
1.333 LW
N
363 748 M
363 739.32 L
S
GR
GS
[0.375 0 0 0.375 0 0] CT
2 setlinecap
1 LJ
1.333 LW
N
471.5 748 M
471.5 739.32 L
S
GR
GS
[0.375 0 0 0.375 0 0] CT
2 setlinecap
1 LJ
1.333 LW
N
580 748 M
580 739.32 L
S
GR
GS
[0.375 0 0 0.375 0 0] CT
2 setlinecap
1 LJ
1.333 LW
N
688.5 748 M
688.5 739.32 L
S
GR
GS
[0.375 0 0 0.375 0 0] CT
2 setlinecap
1 LJ
1.333 LW
N
797 748 M
797 739.32 L
S
GR
GS
[0.375 0 0 0.375 0 0] CT
2 setlinecap
1 LJ
1.333 LW
N
905.5 748 M
905.5 739.32 L
S
GR
GS
[0.375 0 0 0.375 0 0] CT
2 setlinecap
1 LJ
1.333 LW
N
1014 748 M
1014 739.32 L
S
GR
GS
[0.375 0 0 0.375 54.75 284.50001] CT
/Helvetica 26.667 F
GS
[1 0 0 1 0 0] CT
-7.5 27 moveto 
1 -1 scale
(0) t 
GR
GR
GS
[0.375 0 0 0.375 95.4375 284.50001] CT
/Helvetica 26.667 F
GS
[1 0 0 1 0 0] CT
-7.5 27 moveto 
1 -1 scale
(5) t 
GR
GR
GS
[0.375 0 0 0.375 136.125 284.50001] CT
/Helvetica 26.667 F
GS
[1 0 0 1 0 0] CT
-15 27 moveto 
1 -1 scale
(10) t 
GR
GR
GS
[0.375 0 0 0.375 176.8125 284.50001] CT
/Helvetica 26.667 F
GS
[1 0 0 1 0 0] CT
-15 27 moveto 
1 -1 scale
(15) t 
GR
GR
GS
[0.375 0 0 0.375 217.5 284.50001] CT
/Helvetica 26.667 F
GS
[1 0 0 1 0 0] CT
-15 27 moveto 
1 -1 scale
(20) t 
GR
GR
GS
[0.375 0 0 0.375 258.1875 284.50001] CT
/Helvetica 26.667 F
GS
[1 0 0 1 0 0] CT
-15 27 moveto 
1 -1 scale
(25) t 
GR
GR
GS
[0.375 0 0 0.375 298.875 284.50001] CT
/Helvetica 26.667 F
GS
[1 0 0 1 0 0] CT
-15 27 moveto 
1 -1 scale
(30) t 
GR
GR
GS
[0.375 0 0 0.375 339.5625 284.50001] CT
/Helvetica 26.667 F
GS
[1 0 0 1 0 0] CT
-15 27 moveto 
1 -1 scale
(35) t 
GR
GR
GS
[0.375 0 0 0.375 380.25 284.50001] CT
/Helvetica 26.667 F
GS
[1 0 0 1 0 0] CT
-15 27 moveto 
1 -1 scale
(40) t 
GR
GR
GS
[0.375 0 0 0.375 217.50016 297.87499] CT
/Helvetica 29.333 F
GS
[1 0 0 1 0 0] CT
-56.5 30 moveto 
1 -1 scale
(Subjects) t 
GR
GR
GS
[0.375 0 0 0.375 0 0] CT
2 setlinecap
1 LJ
1.333 LW
N
146 748 M
146 63 L
S
GR
GS
[0.375 0 0 0.375 0 0] CT
2 setlinecap
1 LJ
1.333 LW
N
146 748 M
154.68 748 L
S
GR
GS
[0.375 0 0 0.375 0 0] CT
2 setlinecap
1 LJ
1.333 LW
N
146 662.375 M
154.68 662.375 L
S
GR
GS
[0.375 0 0 0.375 0 0] CT
2 setlinecap
1 LJ
1.333 LW
N
146 576.75 M
154.68 576.75 L
S
GR
GS
[0.375 0 0 0.375 0 0] CT
2 setlinecap
1 LJ
1.333 LW
N
146 491.125 M
154.68 491.125 L
S
GR
GS
[0.375 0 0 0.375 0 0] CT
2 setlinecap
1 LJ
1.333 LW
N
146 405.5 M
154.68 405.5 L
S
GR
GS
[0.375 0 0 0.375 0 0] CT
2 setlinecap
1 LJ
1.333 LW
N
146 319.875 M
154.68 319.875 L
S
GR
GS
[0.375 0 0 0.375 0 0] CT
2 setlinecap
1 LJ
1.333 LW
N
146 234.25 M
154.68 234.25 L
S
GR
GS
[0.375 0 0 0.375 0 0] CT
2 setlinecap
1 LJ
1.333 LW
N
146 148.625 M
154.68 148.625 L
S
GR
GS
[0.375 0 0 0.375 0 0] CT
2 setlinecap
1 LJ
1.333 LW
N
146 63 M
154.68 63 L
S
GR
GS
[0.375 0 0 0.375 50.75 280.5] CT
/Helvetica 26.667 F
GS
[1 0 0 1 0 0] CT
-30 10.5 moveto 
1 -1 scale
(20) t 
GR
GR
GS
[0.375 0 0 0.375 50.75 248.39063] CT
/Helvetica 26.667 F
GS
[1 0 0 1 0 0] CT
-30 10.5 moveto 
1 -1 scale
(30) t 
GR
GR
GS
[0.375 0 0 0.375 50.75 216.28125] CT
/Helvetica 26.667 F
GS
[1 0 0 1 0 0] CT
-30 10.5 moveto 
1 -1 scale
(40) t 
GR
GR
GS
[0.375 0 0 0.375 50.75 184.17188] CT
/Helvetica 26.667 F
GS
[1 0 0 1 0 0] CT
-30 10.5 moveto 
1 -1 scale
(50) t 
GR
GR
GS
[0.375 0 0 0.375 50.75 152.0625] CT
/Helvetica 26.667 F
GS
[1 0 0 1 0 0] CT
-30 10.5 moveto 
1 -1 scale
(60) t 
GR
GR
GS
[0.375 0 0 0.375 50.75 119.95313] CT
/Helvetica 26.667 F
GS
[1 0 0 1 0 0] CT
-30 10.5 moveto 
1 -1 scale
(70) t 
GR
GR
GS
[0.375 0 0 0.375 50.75 87.84375] CT
/Helvetica 26.667 F
GS
[1 0 0 1 0 0] CT
-30 10.5 moveto 
1 -1 scale
(80) t 
GR
GR
GS
[0.375 0 0 0.375 50.75 55.73438] CT
/Helvetica 26.667 F
GS
[1 0 0 1 0 0] CT
-30 10.5 moveto 
1 -1 scale
(90) t 
GR
GR
GS
[0.375 0 0 0.375 50.75 23.625] CT
/Helvetica 26.667 F
GS
[1 0 0 1 0 0] CT
-45 10.5 moveto 
1 -1 scale
(100) t 
GR
GR
GS
[0 -0.375 0.375 0 30.875 152.06237] CT
/Helvetica 29.333 F
GS
[1 0 0 1 0 0] CT
-128 -7 moveto 
1 -1 scale
(% of yes responses) t 
GR
GR
GS
[0.375 0 0 0.375 62.8875 118.94971] CT
N
0 -7.333 M
4.05 -7.333 7.333 -4.05 7.333 0 C
7.333 0 L
7.333 4.05 4.05 7.333 0 7.333 C
-4.05 7.333 -7.333 4.05 -7.333 0 C
-7.333 -4.05 -4.05 -7.333 0 -7.333 C
cp
0 -8.667 M
-4.786 -8.667 -8.667 -4.786 -8.667 0 C
-8.667 4.786 -4.786 8.667 0 8.667 C
4.786 8.667 8.667 4.786 8.667 0 C
8.667 0 L
8.667 -4.786 4.786 -8.667 0 -8.667 C
cp
f
GR
GS
[0.375 0 0 0.375 71.025 229.32568] CT
N
/f733055226{0 -7.333 M
4.05 -7.333 7.333 -4.05 7.333 0 C
7.333 0 L
7.333 4.05 4.05 7.333 0 7.333 C
-4.05 7.333 -7.333 4.05 -7.333 0 C
-7.333 -4.05 -4.05 -7.333 0 -7.333 C
cp
0 -8.667 M
-4.786 -8.667 -8.667 -4.786 -8.667 0 C
-8.667 4.786 -4.786 8.667 0 8.667 C
4.786 8.667 8.667 4.786 8.667 0 C
8.667 0 L
8.667 -4.786 4.786 -8.667 0 -8.667 C
cp}def
f733055226
f
GR
GS
[0.375 0 0 0.375 79.1625 52.05517] CT
N
f733055226
f
GR
GS
[0.375 0 0 0.375 87.3 151.56079] CT
N
f733055226
f
GR
GS
[0.375 0 0 0.375 95.4375 200.89549] CT
N
f733055226
f
GR
GS
[0.375 0 0 0.375 103.575 220.96385] CT
N
f733055226
f
GR
GS
[0.375 0 0 0.375 111.7125 276.15186] CT
N
f733055226
f
GR
GS
[0.375 0 0 0.375 119.85 90.51954] CT
N
f733055226
f
GR
GS
[0.375 0 0 0.375 127.9875 234.34277] CT
N
f733055226
f
GR
GS
[0.375 0 0 0.375 136.125 120.62208] CT
N
f733055226
f
GR
GS
[0.375 0 0 0.375 144.2625 256.0835] CT
N
f733055226
f
GR
GS
[0.375 0 0 0.375 152.4 210.92967] CT
N
f733055226
f
GR
GS
[0.375 0 0 0.375 160.5375 111.42407] CT
N
f733055226
f
GR
GS
[0.375 0 0 0.375 168.675 185.84423] CT
N
f733055226
f
GR
GS
[0.375 0 0 0.375 176.8125 177.48243] CT
N
f733055226
f
GR
GS
[0.375 0 0 0.375 184.95 165.77588] CT
N
f733055226
f
GR
GS
[0.375 0 0 0.375 193.08751 184.17188] CT
N
f733055226
f
GR
GS
[0.375 0 0 0.375 201.22499 200.89549] CT
N
f733055226
f
GR
GS
[0.375 0 0 0.375 209.3625 210.92967] CT
N
f733055226
f
GR
GS
[0.375 0 0 0.375 217.5 204.24023] CT
N
f733055226
f
GR
GS
[0.375 0 0 0.375 225.6375 187.51661] CT
N
f733055226
f
GR
GS
[0.375 0 0 0.375 233.77501 45.36573] CT
N
f733055226
f
GR
GS
[0.375 0 0 0.375 241.91249 60.417] CT
N
f733055226
f
GR
GS
[0.375 0 0 0.375 250.05 67.10644] CT
N
f733055226
f
GR
GS
[0.375 0 0 0.375 258.1875 134.00098] CT
N
f733055226
f
GR
GS
[0.375 0 0 0.375 266.325 118.94971] CT
N
f733055226
f
GR
GS
[0.375 0 0 0.375 274.46251 150.72461] CT
N
f733055226
f
GR
GS
[0.375 0 0 0.375 282.59999 142.3628] CT
N
f733055226
f
GR
GS
[0.375 0 0 0.375 290.7375 77.14062] CT
N
f733055226
f
GR
GS
[0.375 0 0 0.375 298.875 220.96385] CT
N
f733055226
f
GR
GS
[0.375 0 0 0.375 307.0125 43.69336] CT
N
f733055226
f
GR
GS
[0.375 0 0 0.375 315.15001 128.98389] CT
N
f733055226
f
GR
GS
[0.375 0 0 0.375 323.28749 154.06934] CT
N
f733055226
f
GR
GS
[0.375 0 0 0.375 331.425 134.00098] CT
N
f733055226
f
GR
GS
[0.375 0 0 0.375 339.5625 141.52661] CT
N
f733055226
f
GR
GS
[0.375 0 0 0.375 347.7 189.18896] CT
N
f733055226
f
GR
GS
[0.375 0 0 0.375 355.83751 259.42822] CT
N
f733055226
f
GR
GS
[0.375 0 0 0.375 363.97499 181.66333] CT
N
f733055226
f
GR
%%Trailer
%%Pages: 1
%%EOF
