%!PS-Adobe-3.0 EPSF-3.0
%%Creator: (MATLAB, The Mathworks, Inc. Version 9.7.0.1261785 \(R2019b\) Update 3. Operating System: Windows 10)
%%Title: C:/Users/Clarissa/Documents/decid_eye/analysis/manip1&2/1_pipeline/fixations/3_f_fixation_behav/plots/lvl2/nFixByUtil.eps
%%CreationDate: 2021-04-13T11:17:28
%%Pages: (atend)
%%BoundingBox:    17    14   346   361
%%LanguageLevel: 3
%%EndComments
%%BeginProlog
%%BeginResource: procset (Apache XML Graphics Std ProcSet) 1.2 0
%%Version: 1.2 0
%%Copyright: (Copyright 2001-2003,2010 The Apache Software Foundation. License terms: http://www.apache.org/licenses/LICENSE-2.0)
/bd{bind def}bind def
/ld{load def}bd
/GR/grestore ld
/GS/gsave ld
/RM/rmoveto ld
/C/curveto ld
/t/show ld
/L/lineto ld
/ML/setmiterlimit ld
/CT/concat ld
/f/fill ld
/N/newpath ld
/S/stroke ld
/CC/setcmykcolor ld
/A/ashow ld
/cp/closepath ld
/RC/setrgbcolor ld
/LJ/setlinejoin ld
/GC/setgray ld
/LW/setlinewidth ld
/M/moveto ld
/re {4 2 roll M
1 index 0 rlineto
0 exch rlineto
neg 0 rlineto
cp } bd
/_ctm matrix def
/_tm matrix def
/BT { _ctm currentmatrix pop matrix _tm copy pop 0 0 moveto } bd
/ET { _ctm setmatrix } bd
/iTm { _ctm setmatrix _tm concat } bd
/Tm { _tm astore pop iTm 0 0 moveto } bd
/ux 0.0 def
/uy 0.0 def
/F {
  /Tp exch def
  /Tf exch def
  Tf findfont Tp scalefont setfont
  /cf Tf def  /cs Tp def
} bd
/ULS {currentpoint /uy exch def /ux exch def} bd
/ULE {
  /Tcx currentpoint pop def
  gsave
  newpath
  cf findfont cs scalefont dup
  /FontMatrix get 0 get /Ts exch def /FontInfo get dup
  /UnderlinePosition get Ts mul /To exch def
  /UnderlineThickness get Ts mul /Tt exch def
  ux uy To add moveto  Tcx uy To add lineto
  Tt setlinewidth stroke
  grestore
} bd
/OLE {
  /Tcx currentpoint pop def
  gsave
  newpath
  cf findfont cs scalefont dup
  /FontMatrix get 0 get /Ts exch def /FontInfo get dup
  /UnderlinePosition get Ts mul /To exch def
  /UnderlineThickness get Ts mul /Tt exch def
  ux uy To add cs add moveto Tcx uy To add cs add lineto
  Tt setlinewidth stroke
  grestore
} bd
/SOE {
  /Tcx currentpoint pop def
  gsave
  newpath
  cf findfont cs scalefont dup
  /FontMatrix get 0 get /Ts exch def /FontInfo get dup
  /UnderlinePosition get Ts mul /To exch def
  /UnderlineThickness get Ts mul /Tt exch def
  ux uy To add cs 10 mul 26 idiv add moveto Tcx uy To add cs 10 mul 26 idiv add lineto
  Tt setlinewidth stroke
  grestore
} bd
/QT {
/Y22 exch store
/X22 exch store
/Y21 exch store
/X21 exch store
currentpoint
/Y21 load 2 mul add 3 div exch
/X21 load 2 mul add 3 div exch
/X21 load 2 mul /X22 load add 3 div
/Y21 load 2 mul /Y22 load add 3 div
/X22 load /Y22 load curveto
} bd
/SSPD {
dup length /d exch dict def
{
/v exch def
/k exch def
currentpagedevice k known {
/cpdv currentpagedevice k get def
v cpdv ne {
/upd false def
/nullv v type /nulltype eq def
/nullcpdv cpdv type /nulltype eq def
nullv nullcpdv or
{
/upd true def
} {
/sametype v type cpdv type eq def
sametype {
v type /arraytype eq {
/vlen v length def
/cpdvlen cpdv length def
vlen cpdvlen eq {
0 1 vlen 1 sub {
/i exch def
/obj v i get def
/cpdobj cpdv i get def
obj cpdobj ne {
/upd true def
exit
} if
} for
} {
/upd true def
} ifelse
} {
v type /dicttype eq {
v {
/dv exch def
/dk exch def
/cpddv cpdv dk get def
dv cpddv ne {
/upd true def
exit
} if
} forall
} {
/upd true def
} ifelse
} ifelse
} if
} ifelse
upd true eq {
d k v put
} if
} if
} if
} forall
d length 0 gt {
d setpagedevice
} if
} bd
/RE { % /NewFontName [NewEncodingArray] /FontName RE -
  findfont dup length dict begin
  {
    1 index /FID ne
    {def} {pop pop} ifelse
  } forall
  /Encoding exch def
  /FontName 1 index def
  currentdict definefont pop
  end
} bind def
%%EndResource
%%BeginResource: procset (Apache XML Graphics EPS ProcSet) 1.0 0
%%Version: 1.0 0
%%Copyright: (Copyright 2002-2003 The Apache Software Foundation. License terms: http://www.apache.org/licenses/LICENSE-2.0)
/BeginEPSF { %def
/b4_Inc_state save def         % Save state for cleanup
/dict_count countdictstack def % Count objects on dict stack
/op_count count 1 sub def      % Count objects on operand stack
userdict begin                 % Push userdict on dict stack
/showpage { } def              % Redefine showpage, { } = null proc
0 setgray 0 setlinecap         % Prepare graphics state
1 setlinewidth 0 setlinejoin
10 setmiterlimit [ ] 0 setdash newpath
/languagelevel where           % If level not equal to 1 then
{pop languagelevel             % set strokeadjust and
1 ne                           % overprint to their defaults.
{false setstrokeadjust false setoverprint
} if
} if
} bd
/EndEPSF { %def
count op_count sub {pop} repeat            % Clean up stacks
countdictstack dict_count sub {end} repeat
b4_Inc_state restore
} bd
%%EndResource
%FOPBeginFontDict
%%IncludeResource: font Courier-Oblique
%%IncludeResource: font Courier-BoldOblique
%%IncludeResource: font Courier-Bold
%%IncludeResource: font ZapfDingbats
%%IncludeResource: font Symbol
%%IncludeResource: font Helvetica
%%IncludeResource: font Helvetica-Oblique
%%IncludeResource: font Helvetica-Bold
%%IncludeResource: font Helvetica-BoldOblique
%%IncludeResource: font Times-Roman
%%IncludeResource: font Times-Italic
%%IncludeResource: font Times-Bold
%%IncludeResource: font Times-BoldItalic
%%IncludeResource: font Courier
%FOPEndFontDict
%%BeginResource: encoding WinAnsiEncoding
/WinAnsiEncoding [
/.notdef /.notdef /.notdef /.notdef /.notdef
/.notdef /.notdef /.notdef /.notdef /.notdef
/.notdef /.notdef /.notdef /.notdef /.notdef
/.notdef /.notdef /.notdef /.notdef /.notdef
/.notdef /.notdef /.notdef /.notdef /.notdef
/.notdef /.notdef /.notdef /.notdef /.notdef
/.notdef /.notdef /space /exclam /quotedbl
/numbersign /dollar /percent /ampersand /quotesingle
/parenleft /parenright /asterisk /plus /comma
/hyphen /period /slash /zero /one
/two /three /four /five /six
/seven /eight /nine /colon /semicolon
/less /equal /greater /question /at
/A /B /C /D /E
/F /G /H /I /J
/K /L /M /N /O
/P /Q /R /S /T
/U /V /W /X /Y
/Z /bracketleft /backslash /bracketright /asciicircum
/underscore /quoteleft /a /b /c
/d /e /f /g /h
/i /j /k /l /m
/n /o /p /q /r
/s /t /u /v /w
/x /y /z /braceleft /bar
/braceright /asciitilde /bullet /Euro /bullet
/quotesinglbase /florin /quotedblbase /ellipsis /dagger
/daggerdbl /circumflex /perthousand /Scaron /guilsinglleft
/OE /bullet /Zcaron /bullet /bullet
/quoteleft /quoteright /quotedblleft /quotedblright /bullet
/endash /emdash /asciitilde /trademark /scaron
/guilsinglright /oe /bullet /zcaron /Ydieresis
/space /exclamdown /cent /sterling /currency
/yen /brokenbar /section /dieresis /copyright
/ordfeminine /guillemotleft /logicalnot /sfthyphen /registered
/macron /degree /plusminus /twosuperior /threesuperior
/acute /mu /paragraph /middot /cedilla
/onesuperior /ordmasculine /guillemotright /onequarter /onehalf
/threequarters /questiondown /Agrave /Aacute /Acircumflex
/Atilde /Adieresis /Aring /AE /Ccedilla
/Egrave /Eacute /Ecircumflex /Edieresis /Igrave
/Iacute /Icircumflex /Idieresis /Eth /Ntilde
/Ograve /Oacute /Ocircumflex /Otilde /Odieresis
/multiply /Oslash /Ugrave /Uacute /Ucircumflex
/Udieresis /Yacute /Thorn /germandbls /agrave
/aacute /acircumflex /atilde /adieresis /aring
/ae /ccedilla /egrave /eacute /ecircumflex
/edieresis /igrave /iacute /icircumflex /idieresis
/eth /ntilde /ograve /oacute /ocircumflex
/otilde /odieresis /divide /oslash /ugrave
/uacute /ucircumflex /udieresis /yacute /thorn
/ydieresis
] def
%%EndResource
%FOPBeginFontReencode
/Courier-Oblique findfont
dup length dict begin
  {1 index /FID ne {def} {pop pop} ifelse} forall
  /Encoding WinAnsiEncoding def
  currentdict
end
/Courier-Oblique exch definefont pop
/Courier-BoldOblique findfont
dup length dict begin
  {1 index /FID ne {def} {pop pop} ifelse} forall
  /Encoding WinAnsiEncoding def
  currentdict
end
/Courier-BoldOblique exch definefont pop
/Courier-Bold findfont
dup length dict begin
  {1 index /FID ne {def} {pop pop} ifelse} forall
  /Encoding WinAnsiEncoding def
  currentdict
end
/Courier-Bold exch definefont pop
/Helvetica findfont
dup length dict begin
  {1 index /FID ne {def} {pop pop} ifelse} forall
  /Encoding WinAnsiEncoding def
  currentdict
end
/Helvetica exch definefont pop
/Helvetica-Oblique findfont
dup length dict begin
  {1 index /FID ne {def} {pop pop} ifelse} forall
  /Encoding WinAnsiEncoding def
  currentdict
end
/Helvetica-Oblique exch definefont pop
/Helvetica-Bold findfont
dup length dict begin
  {1 index /FID ne {def} {pop pop} ifelse} forall
  /Encoding WinAnsiEncoding def
  currentdict
end
/Helvetica-Bold exch definefont pop
/Helvetica-BoldOblique findfont
dup length dict begin
  {1 index /FID ne {def} {pop pop} ifelse} forall
  /Encoding WinAnsiEncoding def
  currentdict
end
/Helvetica-BoldOblique exch definefont pop
/Times-Roman findfont
dup length dict begin
  {1 index /FID ne {def} {pop pop} ifelse} forall
  /Encoding WinAnsiEncoding def
  currentdict
end
/Times-Roman exch definefont pop
/Times-Italic findfont
dup length dict begin
  {1 index /FID ne {def} {pop pop} ifelse} forall
  /Encoding WinAnsiEncoding def
  currentdict
end
/Times-Italic exch definefont pop
/Times-Bold findfont
dup length dict begin
  {1 index /FID ne {def} {pop pop} ifelse} forall
  /Encoding WinAnsiEncoding def
  currentdict
end
/Times-Bold exch definefont pop
/Times-BoldItalic findfont
dup length dict begin
  {1 index /FID ne {def} {pop pop} ifelse} forall
  /Encoding WinAnsiEncoding def
  currentdict
end
/Times-BoldItalic exch definefont pop
/Courier findfont
dup length dict begin
  {1 index /FID ne {def} {pop pop} ifelse} forall
  /Encoding WinAnsiEncoding def
  currentdict
end
/Courier exch definefont pop
%FOPEndFontReencode
%%EndProlog
%%Page: 1 1
%%PageBoundingBox: 0 0 375 375
%%BeginPageSetup
[1 0 0 -1 0 375] CT
%%EndPageSetup
GS
[0.375 0 0 0.375 0 0] CT
1 GC
N
0 0 1000 1000 re
f
GR
GS
[0.375 0 0 0.375 0 0] CT
1 GC
N
0 0 1000 1000 re
f
GR
GS
[0.375 0 0 0.375 0 0] CT
1 GC
N
107 881 M
920 881 L
920 40 L
107 40 L
cp
f
GR
GS
[0.375 0 0 0.375 0 0] CT
2 setlinecap
1 LJ
1.333 LW
N
107 881 M
920 881 L
S
GR
GS
[0.375 0 0 0.375 0 0] CT
2 setlinecap
1 LJ
1.333 LW
N
143.955 881 M
143.955 872.59 L
S
GR
GS
[0.375 0 0 0.375 0 0] CT
2 setlinecap
1 LJ
1.333 LW
N
328.727 881 M
328.727 872.59 L
S
GR
GS
[0.375 0 0 0.375 0 0] CT
2 setlinecap
1 LJ
1.333 LW
N
513.5 881 M
513.5 872.59 L
S
GR
GS
[0.375 0 0 0.375 0 0] CT
2 setlinecap
1 LJ
1.333 LW
N
698.273 881 M
698.273 872.59 L
S
GR
GS
[0.375 0 0 0.375 0 0] CT
2 setlinecap
1 LJ
1.333 LW
N
883.045 881 M
883.045 872.59 L
S
GR
GS
[0.375 0 0 0.375 53.98295 334.37501] CT
/Helvetica 26.667 F
GS
[1 0 0 1 0 0] CT
-19 27 moveto 
1 -1 scale
(20 ) t 
GR
GR
GS
[0.375 0 0 0.375 123.27272 334.37501] CT
/Helvetica 26.667 F
GS
[1 0 0 1 0 0] CT
-19 27 moveto 
1 -1 scale
(40 ) t 
GR
GR
GS
[0.375 0 0 0.375 192.5625 334.37501] CT
/Helvetica 26.667 F
GS
[1 0 0 1 0 0] CT
-19 27 moveto 
1 -1 scale
(60 ) t 
GR
GR
GS
[0.375 0 0 0.375 261.85226 334.37501] CT
/Helvetica 26.667 F
GS
[1 0 0 1 0 0] CT
-19 27 moveto 
1 -1 scale
(80 ) t 
GR
GR
GS
[0.375 0 0 0.375 331.14205 334.37501] CT
/Helvetica 26.667 F
GS
[1 0 0 1 0 0] CT
-22.5 27 moveto 
1 -1 scale
(100) t 
GR
GR
GS
[0.375 0 0 0.375 192.56264 347.74999] CT
/Helvetica 26.667 F
GS
[1 0 0 1 0 0] CT
-121 27 moveto 
1 -1 scale
(|Utility|, percent rank) t 
GR
GR
GS
[0.375 0 0 0.375 0 0] CT
2 setlinecap
1 LJ
1.333 LW
N
107 881 M
107 40 L
S
GR
GS
[0.375 0 0 0.375 0 0] CT
2 setlinecap
1 LJ
1.333 LW
N
107 858.354 M
115.41 858.354 L
S
GR
GS
[0.375 0 0 0.375 0 0] CT
2 setlinecap
1 LJ
1.333 LW
N
107 698.643 M
115.41 698.643 L
S
GR
GS
[0.375 0 0 0.375 0 0] CT
2 setlinecap
1 LJ
1.333 LW
N
107 538.932 M
115.41 538.932 L
S
GR
GS
[0.375 0 0 0.375 0 0] CT
2 setlinecap
1 LJ
1.333 LW
N
107 379.221 M
115.41 379.221 L
S
GR
GS
[0.375 0 0 0.375 0 0] CT
2 setlinecap
1 LJ
1.333 LW
N
107 219.51 M
115.41 219.51 L
S
GR
GS
[0.375 0 0 0.375 36.125 321.88287] CT
/Helvetica 26.667 F
GS
[1 0 0 1 0 0] CT
-15 10.5 moveto 
1 -1 scale
(1) t 
GR
GR
GS
[0.375 0 0 0.375 36.125 261.99122] CT
/Helvetica 26.667 F
GS
[1 0 0 1 0 0] CT
-15 10.5 moveto 
1 -1 scale
(2) t 
GR
GR
GS
[0.375 0 0 0.375 36.125 202.09957] CT
/Helvetica 26.667 F
GS
[1 0 0 1 0 0] CT
-15 10.5 moveto 
1 -1 scale
(3) t 
GR
GR
GS
[0.375 0 0 0.375 36.125 142.20794] CT
/Helvetica 26.667 F
GS
[1 0 0 1 0 0] CT
-15 10.5 moveto 
1 -1 scale
(4) t 
GR
GR
GS
[0.375 0 0 0.375 36.125 82.31629] CT
/Helvetica 26.667 F
GS
[1 0 0 1 0 0] CT
-15 10.5 moveto 
1 -1 scale
(5) t 
GR
GR
GS
[0 -0.375 0.375 0 27.5 172.68734] CT
/Helvetica 26.667 F
GS
[1 0 0 1 0 0] CT
-178 -6 moveto 
1 -1 scale
(NB of fixations to gains/losses) t 
GR
GR
GS
[0.375 0 0 0.375 53.98295 134.32745] CT
N
6.667 0 M
6.667 -3.682 3.682 -6.667 0 -6.667 C
-3.682 -6.667 -6.667 -3.682 -6.667 0 C
-6.667 3.682 -3.682 6.667 0 6.667 C
3.682 6.667 6.667 3.682 6.667 0 C
cp
f
GR
GS
[0.375 0 0 0.375 123.27272 187.91471] CT
N
/f640454831{6.667 0 M
6.667 -3.682 3.682 -6.667 0 -6.667 C
-3.682 -6.667 -6.667 -3.682 -6.667 0 C
-6.667 3.682 -3.682 6.667 0 6.667 C
3.682 6.667 6.667 3.682 6.667 0 C
cp}def
f640454831
f
GR
GS
[0.375 0 0 0.375 192.5625 146.81498] CT
N
f640454831
f
GR
GS
[0.375 0 0 0.375 261.85226 167.42547] CT
N
f640454831
f
GR
GS
[0.375 0 0 0.375 331.14205 167.42547] CT
N
f640454831
f
GR
GS
[0.375 0 0 0.375 53.98295 216.47358] CT
N
f640454831
f
GR
GS
[0.375 0 0 0.375 123.27272 199.70391] CT
N
f640454831
f
GR
GS
[0.375 0 0 0.375 192.5625 238.03455] CT
N
f640454831
f
GR
GS
[0.375 0 0 0.375 261.85226 228.4519] CT
N
f640454831
f
GR
GS
[0.375 0 0 0.375 331.14205 261.99122] CT
N
f640454831
f
GR
GS
[0.375 0 0 0.375 53.98295 109.10994] CT
N
f640454831
f
GR
GS
[0.375 0 0 0.375 123.27272 135.90355] CT
N
f640454831
f
GR
GS
[0.375 0 0 0.375 192.5625 109.83406] CT
N
f640454831
f
GR
GS
[0.375 0 0 0.375 261.85226 134.32745] CT
N
f640454831
f
GR
GS
[0.375 0 0 0.375 331.14205 151.66452] CT
N
f640454831
f
GR
GS
[0.375 0 0 0.375 53.98295 210.90717] CT
N
f640454831
f
GR
GS
[0.375 0 0 0.375 123.27272 221.4763] CT
N
f640454831
f
GR
GS
[0.375 0 0 0.375 192.5625 219.21149] CT
N
f640454831
f
GR
GS
[0.375 0 0 0.375 261.85226 219.71478] CT
N
f640454831
f
GR
GS
[0.375 0 0 0.375 331.14205 242.61452] CT
N
f640454831
f
GR
GS
[0.375 0 0 0.375 53.98295 163.25094] CT
N
f640454831
f
GR
GS
[0.375 0 0 0.375 123.27272 160.01356] CT
N
f640454831
f
GR
GS
[0.375 0 0 0.375 192.5625 166.48834] CT
N
f640454831
f
GR
GS
[0.375 0 0 0.375 261.85226 224.76128] CT
N
f640454831
f
GR
GS
[0.375 0 0 0.375 331.14205 229.61737] CT
N
f640454831
f
GR
GS
[0.375 0 0 0.375 53.98295 147.06402] CT
N
f640454831
f
GR
GS
[0.375 0 0 0.375 123.27272 149.05269] CT
N
f640454831
f
GR
GS
[0.375 0 0 0.375 192.5625 179.43788] CT
N
f640454831
f
GR
GS
[0.375 0 0 0.375 261.85226 180.47203] CT
N
f640454831
f
GR
GS
[0.375 0 0 0.375 331.14205 213.74517] CT
N
f640454831
f
GR
GS
[0.375 0 0 0.375 53.98295 197.37128] CT
N
f640454831
f
GR
GS
[0.375 0 0 0.375 123.27272 206.82786] CT
N
f640454831
f
GR
GS
[0.375 0 0 0.375 192.5625 203.71827] CT
N
f640454831
f
GR
GS
[0.375 0 0 0.375 261.85226 239.92587] CT
N
f640454831
f
GR
GS
[0.375 0 0 0.375 331.14205 211.55617] CT
N
f640454831
f
GR
GS
[0.375 0 0 0.375 53.98295 241.50197] CT
N
f640454831
f
GR
GS
[0.375 0 0 0.375 123.27272 254.11075] CT
N
f640454831
f
GR
GS
[0.375 0 0 0.375 192.5625 225.13483] CT
N
f640454831
f
GR
GS
[0.375 0 0 0.375 261.85226 224.16492] CT
N
f640454831
f
GR
GS
[0.375 0 0 0.375 331.14205 258.83904] CT
N
f640454831
f
GR
GS
[0.375 0 0 0.375 53.98295 261.99122] CT
N
f640454831
f
GR
GS
[0.375 0 0 0.375 123.27272 252.27908] CT
N
f640454831
f
GR
GS
[0.375 0 0 0.375 192.5625 241.50197] CT
N
f640454831
f
GR
GS
[0.375 0 0 0.375 261.85226 239.32951] CT
N
f640454831
f
GR
GS
[0.375 0 0 0.375 331.14205 249.04166] CT
N
f640454831
f
GR
GS
[0.375 0 0 0.375 53.98295 129.7305] CT
N
f640454831
f
GR
GS
[0.375 0 0 0.375 123.27272 158.97759] CT
N
f640454831
f
GR
GS
[0.375 0 0 0.375 192.5625 117.2531] CT
N
f640454831
f
GR
GS
[0.375 0 0 0.375 261.85226 185.32991] CT
N
f640454831
f
GR
GS
[0.375 0 0 0.375 331.14205 184.63117] CT
N
f640454831
f
GR
GS
[0.375 0 0 0.375 53.98295 236.77368] CT
N
f640454831
f
GR
GS
[0.375 0 0 0.375 123.27272 213.13225] CT
N
f640454831
f
GR
GS
[0.375 0 0 0.375 192.5625 209.77798] CT
N
f640454831
f
GR
GS
[0.375 0 0 0.375 261.85226 213.13225] CT
N
f640454831
f
GR
GS
[0.375 0 0 0.375 331.14205 216.28443] CT
N
f640454831
f
GR
GS
[0.375 0 0 0.375 53.98295 221.5239] CT
N
f640454831
f
GR
GS
[0.375 0 0 0.375 123.27272 211.55617] CT
N
f640454831
f
GR
GS
[0.375 0 0 0.375 192.5625 205.33697] CT
N
f640454831
f
GR
GS
[0.375 0 0 0.375 261.85226 219.43664] CT
N
f640454831
f
GR
GS
[0.375 0 0 0.375 331.14205 227.99867] CT
N
f640454831
f
GR
GS
[0.375 0 0 0.375 53.98295 198.94739] CT
N
f640454831
f
GR
GS
[0.375 0 0 0.375 123.27272 206.09235] CT
N
f640454831
f
GR
GS
[0.375 0 0 0.375 192.5625 217.07249] CT
N
f640454831
f
GR
GS
[0.375 0 0 0.375 261.85226 205.25178] CT
N
f640454831
f
GR
GS
[0.375 0 0 0.375 331.14205 208.57434] CT
N
f640454831
f
GR
GS
[0.375 0 0 0.375 53.98295 165.69485] CT
N
f640454831
f
GR
GS
[0.375 0 0 0.375 123.27272 139.76339] CT
N
f640454831
f
GR
GS
[0.375 0 0 0.375 192.5625 188.00743] CT
N
f640454831
f
GR
GS
[0.375 0 0 0.375 261.85226 169.09806] CT
N
f640454831
f
GR
GS
[0.375 0 0 0.375 331.14205 187.72559] CT
N
f640454831
f
GR
GS
[0.375 0 0 0.375 53.98295 187.12667] CT
N
f640454831
f
GR
GS
[0.375 0 0 0.375 123.27272 199.17803] CT
N
f640454831
f
GR
GS
[0.375 0 0 0.375 192.5625 212.84937] CT
N
f640454831
f
GR
GS
[0.375 0 0 0.375 261.85226 186.03109] CT
N
f640454831
f
GR
GS
[0.375 0 0 0.375 331.14205 197.49252] CT
N
f640454831
f
GR
GS
[0.375 0 0 0.375 53.98295 229.61737] CT
N
f640454831
f
GR
GS
[0.375 0 0 0.375 123.27272 193.19675] CT
N
f640454831
f
GR
GS
[0.375 0 0 0.375 192.5625 234.84034] CT
N
f640454831
f
GR
GS
[0.375 0 0 0.375 261.85226 243.37626] CT
N
f640454831
f
GR
GS
[0.375 0 0 0.375 331.14205 242.30081] CT
N
f640454831
f
GR
GS
[0.375 0 0 0.375 53.98295 138.16121] CT
N
f640454831
f
GR
GS
[0.375 0 0 0.375 123.27272 137.41661] CT
N
f640454831
f
GR
GS
[0.375 0 0 0.375 192.5625 128.44905] CT
N
f640454831
f
GR
GS
[0.375 0 0 0.375 261.85226 175.74725] CT
N
f640454831
f
GR
GS
[0.375 0 0 0.375 331.14205 164.35963] CT
N
f640454831
f
GR
GS
[0.375 0 0 0.375 53.98295 237.56172] CT
N
f640454831
f
GR
GS
[0.375 0 0 0.375 123.27272 226.05624] CT
N
f640454831
f
GR
GS
[0.375 0 0 0.375 192.5625 244.423] CT
N
f640454831
f
GR
GS
[0.375 0 0 0.375 261.85226 250.81144] CT
N
f640454831
f
GR
GS
[0.375 0 0 0.375 331.14205 244.99496] CT
N
f640454831
f
GR
GS
[0.375 0 0 0.375 53.98295 259.62708] CT
N
f640454831
f
GR
GS
[0.375 0 0 0.375 123.27272 258.87996] CT
N
f640454831
f
GR
GS
[0.375 0 0 0.375 192.5625 274.94076] CT
N
f640454831
f
GR
GS
[0.375 0 0 0.375 261.85226 288.43689] CT
N
f640454831
f
GR
GS
[0.375 0 0 0.375 331.14205 291.53776] CT
N
f640454831
f
GR
GS
[0.375 0 0 0.375 53.98295 157.89384] CT
N
f640454831
f
GR
GS
[0.375 0 0 0.375 123.27272 124.24044] CT
N
f640454831
f
GR
GS
[0.375 0 0 0.375 192.5625 112.9925] CT
N
f640454831
f
GR
GS
[0.375 0 0 0.375 261.85226 125.09604] CT
N
f640454831
f
GR
GS
[0.375 0 0 0.375 331.14205 149.69439] CT
N
f640454831
f
GR
GS
[0.375 0 0 0.375 53.98295 216.47358] CT
N
f640454831
f
GR
GS
[0.375 0 0 0.375 123.27272 218.86924] CT
N
f640454831
f
GR
GS
[0.375 0 0 0.375 192.5625 209.28658] CT
N
f640454831
f
GR
GS
[0.375 0 0 0.375 261.85226 207.6159] CT
N
f640454831
f
GR
GS
[0.375 0 0 0.375 331.14205 223.95193] CT
N
f640454831
f
GR
GS
[0.375 0 0 0.375 53.98295 29.33522] CT
N
f640454831
f
GR
GS
[0.375 0 0 0.375 123.27272 104.62887] CT
N
f640454831
f
GR
GS
[0.375 0 0 0.375 192.5625 102.67946] CT
N
f640454831
f
GR
GS
[0.375 0 0 0.375 261.85226 131.84206] CT
N
f640454831
f
GR
GS
[0.375 0 0 0.375 331.14205 144.6036] CT
N
f640454831
f
GR
GS
[0.375 0 0 0.375 53.98295 316.03976] CT
N
f640454831
f
GR
GS
[0.375 0 0 0.375 123.27272 311.40182] CT
N
f640454831
f
GR
GS
[0.375 0 0 0.375 192.5625 306.90994] CT
N
f640454831
f
GR
GS
[0.375 0 0 0.375 261.85226 309.5974] CT
N
f640454831
f
GR
GS
[0.375 0 0 0.375 331.14205 314.39642] CT
N
f640454831
f
GR
GS
[0.375 0 0 0.375 53.98295 252.213] CT
N
f640454831
f
GR
GS
[0.375 0 0 0.375 123.27272 263.18905] CT
N
f640454831
f
GR
GS
[0.375 0 0 0.375 192.5625 239.53185] CT
N
f640454831
f
GR
GS
[0.375 0 0 0.375 261.85226 261.99122] CT
N
f640454831
f
GR
GS
[0.375 0 0 0.375 331.14205 252.213] CT
N
f640454831
f
GR
GS
[0.375 0 0 0.375 53.98295 194.11322] CT
N
f640454831
f
GR
GS
[0.375 0 0 0.375 123.27272 197.24421] CT
N
f640454831
f
GR
GS
[0.375 0 0 0.375 192.5625 197.27197] CT
N
f640454831
f
GR
GS
[0.375 0 0 0.375 261.85226 209.64031] CT
N
f640454831
f
GR
GS
[0.375 0 0 0.375 331.14205 218.21892] CT
N
f640454831
f
GR
GS
[0.375 0 0 0.375 0 0] CT
1 LJ
4 LW
N
143.955 586.883 M
143.955 448.387 L
S
GR
GS
[0.375 0 0 0.375 0 0] CT
1 LJ
4 LW
N
132.406 448.387 M
155.503 448.387 L
S
GR
GS
[0.375 0 0 0.375 0 0] CT
1 LJ
4 LW
N
132.406 586.883 M
155.503 586.883 L
S
GR
GS
[0.375 0 0 0.375 0 0] CT
1 LJ
4 LW
N
328.727 583.398 M
328.727 468.571 L
S
GR
GS
[0.375 0 0 0.375 0 0] CT
1 LJ
4 LW
N
317.179 468.571 M
340.276 468.571 L
S
GR
GS
[0.375 0 0 0.375 0 0] CT
1 LJ
4 LW
N
317.179 583.398 M
340.276 583.398 L
S
GR
GS
[0.375 0 0 0.375 0 0] CT
1 LJ
4 LW
N
513.5 587.341 M
513.5 464.776 L
S
GR
GS
[0.375 0 0 0.375 0 0] CT
1 LJ
4 LW
N
501.952 464.776 M
525.048 464.776 L
S
GR
GS
[0.375 0 0 0.375 0 0] CT
1 LJ
4 LW
N
501.952 587.341 M
525.048 587.341 L
S
GR
GS
[0.375 0 0 0.375 0 0] CT
1 LJ
4 LW
N
698.273 611.566 M
698.273 506.515 L
S
GR
GS
[0.375 0 0 0.375 0 0] CT
1 LJ
4 LW
N
686.724 506.515 M
709.821 506.515 L
S
GR
GS
[0.375 0 0 0.375 0 0] CT
1 LJ
4 LW
N
686.724 611.566 M
709.821 611.566 L
S
GR
GS
[0.375 0 0 0.375 0 0] CT
1 LJ
4 LW
N
883.045 631.792 M
883.045 532.042 L
S
GR
GS
[0.375 0 0 0.375 0 0] CT
1 LJ
4 LW
N
871.497 532.042 M
894.594 532.042 L
S
GR
GS
[0.375 0 0 0.375 0 0] CT
1 LJ
4 LW
N
871.497 631.792 M
894.594 631.792 L
S
GR
%%Trailer
%%Pages: 1
%%EOF
