%!PS-Adobe-3.0 EPSF-3.0
%%Creator: (MATLAB, The Mathworks, Inc. Version 9.7.0.1261785 \(R2019b\) Update 3. Operating System: Windows 10)
%%Title: C:/Users/Clarissa/Documents/decid_eye/analysis/manip1&2/1_pipeline/fixations/2_f_remove_data/plots/dimsPvals.eps
%%CreationDate: 2021-05-05T12:04:32
%%Pages: (atend)
%%BoundingBox:    17    14   721   361
%%LanguageLevel: 3
%%EndComments
%%BeginProlog
%%BeginResource: procset (Apache XML Graphics Std ProcSet) 1.2 0
%%Version: 1.2 0
%%Copyright: (Copyright 2001-2003,2010 The Apache Software Foundation. License terms: http://www.apache.org/licenses/LICENSE-2.0)
/bd{bind def}bind def
/ld{load def}bd
/GR/grestore ld
/GS/gsave ld
/RM/rmoveto ld
/C/curveto ld
/t/show ld
/L/lineto ld
/ML/setmiterlimit ld
/CT/concat ld
/f/fill ld
/N/newpath ld
/S/stroke ld
/CC/setcmykcolor ld
/A/ashow ld
/cp/closepath ld
/RC/setrgbcolor ld
/LJ/setlinejoin ld
/GC/setgray ld
/LW/setlinewidth ld
/M/moveto ld
/re {4 2 roll M
1 index 0 rlineto
0 exch rlineto
neg 0 rlineto
cp } bd
/_ctm matrix def
/_tm matrix def
/BT { _ctm currentmatrix pop matrix _tm copy pop 0 0 moveto } bd
/ET { _ctm setmatrix } bd
/iTm { _ctm setmatrix _tm concat } bd
/Tm { _tm astore pop iTm 0 0 moveto } bd
/ux 0.0 def
/uy 0.0 def
/F {
  /Tp exch def
  /Tf exch def
  Tf findfont Tp scalefont setfont
  /cf Tf def  /cs Tp def
} bd
/ULS {currentpoint /uy exch def /ux exch def} bd
/ULE {
  /Tcx currentpoint pop def
  gsave
  newpath
  cf findfont cs scalefont dup
  /FontMatrix get 0 get /Ts exch def /FontInfo get dup
  /UnderlinePosition get Ts mul /To exch def
  /UnderlineThickness get Ts mul /Tt exch def
  ux uy To add moveto  Tcx uy To add lineto
  Tt setlinewidth stroke
  grestore
} bd
/OLE {
  /Tcx currentpoint pop def
  gsave
  newpath
  cf findfont cs scalefont dup
  /FontMatrix get 0 get /Ts exch def /FontInfo get dup
  /UnderlinePosition get Ts mul /To exch def
  /UnderlineThickness get Ts mul /Tt exch def
  ux uy To add cs add moveto Tcx uy To add cs add lineto
  Tt setlinewidth stroke
  grestore
} bd
/SOE {
  /Tcx currentpoint pop def
  gsave
  newpath
  cf findfont cs scalefont dup
  /FontMatrix get 0 get /Ts exch def /FontInfo get dup
  /UnderlinePosition get Ts mul /To exch def
  /UnderlineThickness get Ts mul /Tt exch def
  ux uy To add cs 10 mul 26 idiv add moveto Tcx uy To add cs 10 mul 26 idiv add lineto
  Tt setlinewidth stroke
  grestore
} bd
/QT {
/Y22 exch store
/X22 exch store
/Y21 exch store
/X21 exch store
currentpoint
/Y21 load 2 mul add 3 div exch
/X21 load 2 mul add 3 div exch
/X21 load 2 mul /X22 load add 3 div
/Y21 load 2 mul /Y22 load add 3 div
/X22 load /Y22 load curveto
} bd
/SSPD {
dup length /d exch dict def
{
/v exch def
/k exch def
currentpagedevice k known {
/cpdv currentpagedevice k get def
v cpdv ne {
/upd false def
/nullv v type /nulltype eq def
/nullcpdv cpdv type /nulltype eq def
nullv nullcpdv or
{
/upd true def
} {
/sametype v type cpdv type eq def
sametype {
v type /arraytype eq {
/vlen v length def
/cpdvlen cpdv length def
vlen cpdvlen eq {
0 1 vlen 1 sub {
/i exch def
/obj v i get def
/cpdobj cpdv i get def
obj cpdobj ne {
/upd true def
exit
} if
} for
} {
/upd true def
} ifelse
} {
v type /dicttype eq {
v {
/dv exch def
/dk exch def
/cpddv cpdv dk get def
dv cpddv ne {
/upd true def
exit
} if
} forall
} {
/upd true def
} ifelse
} ifelse
} if
} ifelse
upd true eq {
d k v put
} if
} if
} if
} forall
d length 0 gt {
d setpagedevice
} if
} bd
/RE { % /NewFontName [NewEncodingArray] /FontName RE -
  findfont dup length dict begin
  {
    1 index /FID ne
    {def} {pop pop} ifelse
  } forall
  /Encoding exch def
  /FontName 1 index def
  currentdict definefont pop
  end
} bind def
%%EndResource
%%BeginResource: procset (Apache XML Graphics EPS ProcSet) 1.0 0
%%Version: 1.0 0
%%Copyright: (Copyright 2002-2003 The Apache Software Foundation. License terms: http://www.apache.org/licenses/LICENSE-2.0)
/BeginEPSF { %def
/b4_Inc_state save def         % Save state for cleanup
/dict_count countdictstack def % Count objects on dict stack
/op_count count 1 sub def      % Count objects on operand stack
userdict begin                 % Push userdict on dict stack
/showpage { } def              % Redefine showpage, { } = null proc
0 setgray 0 setlinecap         % Prepare graphics state
1 setlinewidth 0 setlinejoin
10 setmiterlimit [ ] 0 setdash newpath
/languagelevel where           % If level not equal to 1 then
{pop languagelevel             % set strokeadjust and
1 ne                           % overprint to their defaults.
{false setstrokeadjust false setoverprint
} if
} if
} bd
/EndEPSF { %def
count op_count sub {pop} repeat            % Clean up stacks
countdictstack dict_count sub {end} repeat
b4_Inc_state restore
} bd
%%EndResource
%FOPBeginFontDict
%%IncludeResource: font Courier-Oblique
%%IncludeResource: font Courier-BoldOblique
%%IncludeResource: font Courier-Bold
%%IncludeResource: font ZapfDingbats
%%IncludeResource: font Symbol
%%IncludeResource: font Helvetica
%%IncludeResource: font Helvetica-Oblique
%%IncludeResource: font Helvetica-Bold
%%IncludeResource: font Helvetica-BoldOblique
%%IncludeResource: font Times-Roman
%%IncludeResource: font Times-Italic
%%IncludeResource: font Times-Bold
%%IncludeResource: font Times-BoldItalic
%%IncludeResource: font Courier
%FOPEndFontDict
%%BeginResource: encoding WinAnsiEncoding
/WinAnsiEncoding [
/.notdef /.notdef /.notdef /.notdef /.notdef
/.notdef /.notdef /.notdef /.notdef /.notdef
/.notdef /.notdef /.notdef /.notdef /.notdef
/.notdef /.notdef /.notdef /.notdef /.notdef
/.notdef /.notdef /.notdef /.notdef /.notdef
/.notdef /.notdef /.notdef /.notdef /.notdef
/.notdef /.notdef /space /exclam /quotedbl
/numbersign /dollar /percent /ampersand /quotesingle
/parenleft /parenright /asterisk /plus /comma
/hyphen /period /slash /zero /one
/two /three /four /five /six
/seven /eight /nine /colon /semicolon
/less /equal /greater /question /at
/A /B /C /D /E
/F /G /H /I /J
/K /L /M /N /O
/P /Q /R /S /T
/U /V /W /X /Y
/Z /bracketleft /backslash /bracketright /asciicircum
/underscore /quoteleft /a /b /c
/d /e /f /g /h
/i /j /k /l /m
/n /o /p /q /r
/s /t /u /v /w
/x /y /z /braceleft /bar
/braceright /asciitilde /bullet /Euro /bullet
/quotesinglbase /florin /quotedblbase /ellipsis /dagger
/daggerdbl /circumflex /perthousand /Scaron /guilsinglleft
/OE /bullet /Zcaron /bullet /bullet
/quoteleft /quoteright /quotedblleft /quotedblright /bullet
/endash /emdash /asciitilde /trademark /scaron
/guilsinglright /oe /bullet /zcaron /Ydieresis
/space /exclamdown /cent /sterling /currency
/yen /brokenbar /section /dieresis /copyright
/ordfeminine /guillemotleft /logicalnot /sfthyphen /registered
/macron /degree /plusminus /twosuperior /threesuperior
/acute /mu /paragraph /middot /cedilla
/onesuperior /ordmasculine /guillemotright /onequarter /onehalf
/threequarters /questiondown /Agrave /Aacute /Acircumflex
/Atilde /Adieresis /Aring /AE /Ccedilla
/Egrave /Eacute /Ecircumflex /Edieresis /Igrave
/Iacute /Icircumflex /Idieresis /Eth /Ntilde
/Ograve /Oacute /Ocircumflex /Otilde /Odieresis
/multiply /Oslash /Ugrave /Uacute /Ucircumflex
/Udieresis /Yacute /Thorn /germandbls /agrave
/aacute /acircumflex /atilde /adieresis /aring
/ae /ccedilla /egrave /eacute /ecircumflex
/edieresis /igrave /iacute /icircumflex /idieresis
/eth /ntilde /ograve /oacute /ocircumflex
/otilde /odieresis /divide /oslash /ugrave
/uacute /ucircumflex /udieresis /yacute /thorn
/ydieresis
] def
%%EndResource
%FOPBeginFontReencode
/Courier-Oblique findfont
dup length dict begin
  {1 index /FID ne {def} {pop pop} ifelse} forall
  /Encoding WinAnsiEncoding def
  currentdict
end
/Courier-Oblique exch definefont pop
/Courier-BoldOblique findfont
dup length dict begin
  {1 index /FID ne {def} {pop pop} ifelse} forall
  /Encoding WinAnsiEncoding def
  currentdict
end
/Courier-BoldOblique exch definefont pop
/Courier-Bold findfont
dup length dict begin
  {1 index /FID ne {def} {pop pop} ifelse} forall
  /Encoding WinAnsiEncoding def
  currentdict
end
/Courier-Bold exch definefont pop
/Helvetica findfont
dup length dict begin
  {1 index /FID ne {def} {pop pop} ifelse} forall
  /Encoding WinAnsiEncoding def
  currentdict
end
/Helvetica exch definefont pop
/Helvetica-Oblique findfont
dup length dict begin
  {1 index /FID ne {def} {pop pop} ifelse} forall
  /Encoding WinAnsiEncoding def
  currentdict
end
/Helvetica-Oblique exch definefont pop
/Helvetica-Bold findfont
dup length dict begin
  {1 index /FID ne {def} {pop pop} ifelse} forall
  /Encoding WinAnsiEncoding def
  currentdict
end
/Helvetica-Bold exch definefont pop
/Helvetica-BoldOblique findfont
dup length dict begin
  {1 index /FID ne {def} {pop pop} ifelse} forall
  /Encoding WinAnsiEncoding def
  currentdict
end
/Helvetica-BoldOblique exch definefont pop
/Times-Roman findfont
dup length dict begin
  {1 index /FID ne {def} {pop pop} ifelse} forall
  /Encoding WinAnsiEncoding def
  currentdict
end
/Times-Roman exch definefont pop
/Times-Italic findfont
dup length dict begin
  {1 index /FID ne {def} {pop pop} ifelse} forall
  /Encoding WinAnsiEncoding def
  currentdict
end
/Times-Italic exch definefont pop
/Times-Bold findfont
dup length dict begin
  {1 index /FID ne {def} {pop pop} ifelse} forall
  /Encoding WinAnsiEncoding def
  currentdict
end
/Times-Bold exch definefont pop
/Times-BoldItalic findfont
dup length dict begin
  {1 index /FID ne {def} {pop pop} ifelse} forall
  /Encoding WinAnsiEncoding def
  currentdict
end
/Times-BoldItalic exch definefont pop
/Courier findfont
dup length dict begin
  {1 index /FID ne {def} {pop pop} ifelse} forall
  /Encoding WinAnsiEncoding def
  currentdict
end
/Courier exch definefont pop
%FOPEndFontReencode
%%EndProlog
%%Page: 1 1
%%PageBoundingBox: 0 0 750 375
%%BeginPageSetup
[1 0 0 -1 0 375] CT
%%EndPageSetup
GS
[0.375 0 0 0.375 0 0] CT
1 GC
N
0 0 2000 1000 re
f
GR
GS
[0.375 0 0 0.375 0 0] CT
1 GC
N
0 0 2000 1000 re
f
GR
GS
[0.375 0 0 0.375 0 0] CT
1 GC
N
130 881 M
1551 881 L
1551 40 L
130 40 L
cp
f
GR
GS
[0.375 0 0 0.375 0 0] CT
2 setlinecap
1 LJ
1.333 LW
N
130 881 M
1551 881 L
S
GR
GS
[0.375 0 0 0.375 0 0] CT
2 setlinecap
1 LJ
1.333 LW
N
159.677 881 M
159.677 866.79 L
S
GR
GS
[0.375 0 0 0.375 0 0] CT
2 setlinecap
1 LJ
1.333 LW
N
194.591 881 M
194.591 866.79 L
S
GR
GS
[0.375 0 0 0.375 0 0] CT
2 setlinecap
1 LJ
1.333 LW
N
229.505 881 M
229.505 866.79 L
S
GR
GS
[0.375 0 0 0.375 0 0] CT
2 setlinecap
1 LJ
1.333 LW
N
264.419 881 M
264.419 866.79 L
S
GR
GS
[0.375 0 0 0.375 0 0] CT
2 setlinecap
1 LJ
1.333 LW
N
299.333 881 M
299.333 866.79 L
S
GR
GS
[0.375 0 0 0.375 0 0] CT
2 setlinecap
1 LJ
1.333 LW
N
334.247 881 M
334.247 866.79 L
S
GR
GS
[0.375 0 0 0.375 0 0] CT
2 setlinecap
1 LJ
1.333 LW
N
369.161 881 M
369.161 866.79 L
S
GR
GS
[0.375 0 0 0.375 0 0] CT
2 setlinecap
1 LJ
1.333 LW
N
404.075 881 M
404.075 866.79 L
S
GR
GS
[0.375 0 0 0.375 0 0] CT
2 setlinecap
1 LJ
1.333 LW
N
438.989 881 M
438.989 866.79 L
S
GR
GS
[0.375 0 0 0.375 0 0] CT
2 setlinecap
1 LJ
1.333 LW
N
473.903 881 M
473.903 866.79 L
S
GR
GS
[0.375 0 0 0.375 0 0] CT
2 setlinecap
1 LJ
1.333 LW
N
508.817 881 M
508.817 866.79 L
S
GR
GS
[0.375 0 0 0.375 0 0] CT
2 setlinecap
1 LJ
1.333 LW
N
543.731 881 M
543.731 866.79 L
S
GR
GS
[0.375 0 0 0.375 0 0] CT
2 setlinecap
1 LJ
1.333 LW
N
578.645 881 M
578.645 866.79 L
S
GR
GS
[0.375 0 0 0.375 0 0] CT
2 setlinecap
1 LJ
1.333 LW
N
613.559 881 M
613.559 866.79 L
S
GR
GS
[0.375 0 0 0.375 0 0] CT
2 setlinecap
1 LJ
1.333 LW
N
648.473 881 M
648.473 866.79 L
S
GR
GS
[0.375 0 0 0.375 0 0] CT
2 setlinecap
1 LJ
1.333 LW
N
683.387 881 M
683.387 866.79 L
S
GR
GS
[0.375 0 0 0.375 0 0] CT
2 setlinecap
1 LJ
1.333 LW
N
718.301 881 M
718.301 866.79 L
S
GR
GS
[0.375 0 0 0.375 0 0] CT
2 setlinecap
1 LJ
1.333 LW
N
753.215 881 M
753.215 866.79 L
S
GR
GS
[0.375 0 0 0.375 0 0] CT
2 setlinecap
1 LJ
1.333 LW
N
788.129 881 M
788.129 866.79 L
S
GR
GS
[0.375 0 0 0.375 0 0] CT
2 setlinecap
1 LJ
1.333 LW
N
823.043 881 M
823.043 866.79 L
S
GR
GS
[0.375 0 0 0.375 0 0] CT
2 setlinecap
1 LJ
1.333 LW
N
857.957 881 M
857.957 866.79 L
S
GR
GS
[0.375 0 0 0.375 0 0] CT
2 setlinecap
1 LJ
1.333 LW
N
892.871 881 M
892.871 866.79 L
S
GR
GS
[0.375 0 0 0.375 0 0] CT
2 setlinecap
1 LJ
1.333 LW
N
927.785 881 M
927.785 866.79 L
S
GR
GS
[0.375 0 0 0.375 0 0] CT
2 setlinecap
1 LJ
1.333 LW
N
962.699 881 M
962.699 866.79 L
S
GR
GS
[0.375 0 0 0.375 0 0] CT
2 setlinecap
1 LJ
1.333 LW
N
997.613 881 M
997.613 866.79 L
S
GR
GS
[0.375 0 0 0.375 0 0] CT
2 setlinecap
1 LJ
1.333 LW
N
1032.527 881 M
1032.527 866.79 L
S
GR
GS
[0.375 0 0 0.375 0 0] CT
2 setlinecap
1 LJ
1.333 LW
N
1067.441 881 M
1067.441 866.79 L
S
GR
GS
[0.375 0 0 0.375 0 0] CT
2 setlinecap
1 LJ
1.333 LW
N
1102.355 881 M
1102.355 866.79 L
S
GR
GS
[0.375 0 0 0.375 0 0] CT
2 setlinecap
1 LJ
1.333 LW
N
1137.269 881 M
1137.269 866.79 L
S
GR
GS
[0.375 0 0 0.375 0 0] CT
2 setlinecap
1 LJ
1.333 LW
N
1172.183 881 M
1172.183 866.79 L
S
GR
GS
[0.375 0 0 0.375 0 0] CT
2 setlinecap
1 LJ
1.333 LW
N
1207.097 881 M
1207.097 866.79 L
S
GR
GS
[0.375 0 0 0.375 0 0] CT
2 setlinecap
1 LJ
1.333 LW
N
1242.011 881 M
1242.011 866.79 L
S
GR
GS
[0.375 0 0 0.375 0 0] CT
2 setlinecap
1 LJ
1.333 LW
N
1276.925 881 M
1276.925 866.79 L
S
GR
GS
[0.375 0 0 0.375 0 0] CT
2 setlinecap
1 LJ
1.333 LW
N
1311.839 881 M
1311.839 866.79 L
S
GR
GS
[0.375 0 0 0.375 0 0] CT
2 setlinecap
1 LJ
1.333 LW
N
1346.753 881 M
1346.753 866.79 L
S
GR
GS
[0.375 0 0 0.375 0 0] CT
2 setlinecap
1 LJ
1.333 LW
N
1381.667 881 M
1381.667 866.79 L
S
GR
GS
[0.375 0 0 0.375 0 0] CT
2 setlinecap
1 LJ
1.333 LW
N
1416.581 881 M
1416.581 866.79 L
S
GR
GS
[0.375 0 0 0.375 0 0] CT
2 setlinecap
1 LJ
1.333 LW
N
1451.495 881 M
1451.495 866.79 L
S
GR
GS
[0.375 0 0 0.375 0 0] CT
2 setlinecap
1 LJ
1.333 LW
N
1486.409 881 M
1486.409 866.79 L
S
GR
GS
[0.375 0 0 0.375 59.87884 334.37501] CT
/Helvetica 26.667 F
GS
[1 0 0 1 0 0] CT
-7.5 27 moveto 
1 -1 scale
(0) t 
GR
GR
GS
[0.375 0 0 0.375 72.97159 334.37501] CT
/Helvetica 26.667 F
GS
[1 0 0 1 0 0] CT
-7.5 27 moveto 
1 -1 scale
(1) t 
GR
GR
GS
[0.375 0 0 0.375 86.06434 334.37501] CT
/Helvetica 26.667 F
GS
[1 0 0 1 0 0] CT
-7.5 27 moveto 
1 -1 scale
(2) t 
GR
GR
GS
[0.375 0 0 0.375 99.15709 334.37501] CT
/Helvetica 26.667 F
GS
[1 0 0 1 0 0] CT
-7.5 27 moveto 
1 -1 scale
(3) t 
GR
GR
GS
[0.375 0 0 0.375 112.24984 334.37501] CT
/Helvetica 26.667 F
GS
[1 0 0 1 0 0] CT
-7.5 27 moveto 
1 -1 scale
(4) t 
GR
GR
GS
[0.375 0 0 0.375 125.34259 334.37501] CT
/Helvetica 26.667 F
GS
[1 0 0 1 0 0] CT
-7.5 27 moveto 
1 -1 scale
(5) t 
GR
GR
GS
[0.375 0 0 0.375 138.43534 334.37501] CT
/Helvetica 26.667 F
GS
[1 0 0 1 0 0] CT
-7.5 27 moveto 
1 -1 scale
(6) t 
GR
GR
GS
[0.375 0 0 0.375 151.52811 334.37501] CT
/Helvetica 26.667 F
GS
[1 0 0 1 0 0] CT
-7.5 27 moveto 
1 -1 scale
(7) t 
GR
GR
GS
[0.375 0 0 0.375 164.62086 334.37501] CT
/Helvetica 26.667 F
GS
[1 0 0 1 0 0] CT
-7.5 27 moveto 
1 -1 scale
(8) t 
GR
GR
GS
[0.375 0 0 0.375 177.71361 334.37501] CT
/Helvetica 26.667 F
GS
[1 0 0 1 0 0] CT
-7.5 27 moveto 
1 -1 scale
(9) t 
GR
GR
GS
[0.375 0 0 0.375 190.80636 334.37501] CT
/Helvetica 26.667 F
GS
[1 0 0 1 0 0] CT
-15 27 moveto 
1 -1 scale
(10) t 
GR
GR
GS
[0.375 0 0 0.375 203.89911 334.37501] CT
/Helvetica 26.667 F
GS
[1 0 0 1 0 0] CT
-15 27 moveto 
1 -1 scale
(11) t 
GR
GR
GS
[0.375 0 0 0.375 216.99186 334.37501] CT
/Helvetica 26.667 F
GS
[1 0 0 1 0 0] CT
-15 27 moveto 
1 -1 scale
(12) t 
GR
GR
GS
[0.375 0 0 0.375 230.08461 334.37501] CT
/Helvetica 26.667 F
GS
[1 0 0 1 0 0] CT
-15 27 moveto 
1 -1 scale
(13) t 
GR
GR
GS
[0.375 0 0 0.375 243.17736 334.37501] CT
/Helvetica 26.667 F
GS
[1 0 0 1 0 0] CT
-15 27 moveto 
1 -1 scale
(14) t 
GR
GR
GS
[0.375 0 0 0.375 256.27011 334.37501] CT
/Helvetica 26.667 F
GS
[1 0 0 1 0 0] CT
-15 27 moveto 
1 -1 scale
(15) t 
GR
GR
GS
[0.375 0 0 0.375 269.36286 334.37501] CT
/Helvetica 26.667 F
GS
[1 0 0 1 0 0] CT
-15 27 moveto 
1 -1 scale
(16) t 
GR
GR
GS
[0.375 0 0 0.375 282.45561 334.37501] CT
/Helvetica 26.667 F
GS
[1 0 0 1 0 0] CT
-15 27 moveto 
1 -1 scale
(17) t 
GR
GR
GS
[0.375 0 0 0.375 295.54836 334.37501] CT
/Helvetica 26.667 F
GS
[1 0 0 1 0 0] CT
-15 27 moveto 
1 -1 scale
(18) t 
GR
GR
GS
[0.375 0 0 0.375 308.64111 334.37501] CT
/Helvetica 26.667 F
GS
[1 0 0 1 0 0] CT
-15 27 moveto 
1 -1 scale
(19) t 
GR
GR
GS
[0.375 0 0 0.375 321.73389 334.37501] CT
/Helvetica 26.667 F
GS
[1 0 0 1 0 0] CT
-15 27 moveto 
1 -1 scale
(20) t 
GR
GR
GS
[0.375 0 0 0.375 334.82664 334.37501] CT
/Helvetica 26.667 F
GS
[1 0 0 1 0 0] CT
-15 27 moveto 
1 -1 scale
(21) t 
GR
GR
GS
[0.375 0 0 0.375 347.91939 334.37501] CT
/Helvetica 26.667 F
GS
[1 0 0 1 0 0] CT
-15 27 moveto 
1 -1 scale
(22) t 
GR
GR
GS
[0.375 0 0 0.375 361.01214 334.37501] CT
/Helvetica 26.667 F
GS
[1 0 0 1 0 0] CT
-15 27 moveto 
1 -1 scale
(23) t 
GR
GR
GS
[0.375 0 0 0.375 374.10489 334.37501] CT
/Helvetica 26.667 F
GS
[1 0 0 1 0 0] CT
-15 27 moveto 
1 -1 scale
(24) t 
GR
GR
GS
[0.375 0 0 0.375 387.19762 334.37501] CT
/Helvetica 26.667 F
GS
[1 0 0 1 0 0] CT
-15 27 moveto 
1 -1 scale
(25) t 
GR
GR
GS
[0.375 0 0 0.375 400.29039 334.37501] CT
/Helvetica 26.667 F
GS
[1 0 0 1 0 0] CT
-15 27 moveto 
1 -1 scale
(26) t 
GR
GR
GS
[0.375 0 0 0.375 413.38312 334.37501] CT
/Helvetica 26.667 F
GS
[1 0 0 1 0 0] CT
-15 27 moveto 
1 -1 scale
(27) t 
GR
GR
GS
[0.375 0 0 0.375 426.47589 334.37501] CT
/Helvetica 26.667 F
GS
[1 0 0 1 0 0] CT
-15 27 moveto 
1 -1 scale
(28) t 
GR
GR
GS
[0.375 0 0 0.375 439.56866 334.37501] CT
/Helvetica 26.667 F
GS
[1 0 0 1 0 0] CT
-15 27 moveto 
1 -1 scale
(29) t 
GR
GR
GS
[0.375 0 0 0.375 452.66139 334.37501] CT
/Helvetica 26.667 F
GS
[1 0 0 1 0 0] CT
-15 27 moveto 
1 -1 scale
(30) t 
GR
GR
GS
[0.375 0 0 0.375 465.75417 334.37501] CT
/Helvetica 26.667 F
GS
[1 0 0 1 0 0] CT
-15 27 moveto 
1 -1 scale
(31) t 
GR
GR
GS
[0.375 0 0 0.375 478.84689 334.37501] CT
/Helvetica 26.667 F
GS
[1 0 0 1 0 0] CT
-15 27 moveto 
1 -1 scale
(32) t 
GR
GR
GS
[0.375 0 0 0.375 491.93967 334.37501] CT
/Helvetica 26.667 F
GS
[1 0 0 1 0 0] CT
-15 27 moveto 
1 -1 scale
(33) t 
GR
GR
GS
[0.375 0 0 0.375 505.03239 334.37501] CT
/Helvetica 26.667 F
GS
[1 0 0 1 0 0] CT
-15 27 moveto 
1 -1 scale
(34) t 
GR
GR
GS
[0.375 0 0 0.375 518.12517 334.37501] CT
/Helvetica 26.667 F
GS
[1 0 0 1 0 0] CT
-15 27 moveto 
1 -1 scale
(35) t 
GR
GR
GS
[0.375 0 0 0.375 531.2179 334.37501] CT
/Helvetica 26.667 F
GS
[1 0 0 1 0 0] CT
-15 27 moveto 
1 -1 scale
(36) t 
GR
GR
GS
[0.375 0 0 0.375 544.31067 334.37501] CT
/Helvetica 26.667 F
GS
[1 0 0 1 0 0] CT
-15 27 moveto 
1 -1 scale
(37) t 
GR
GR
GS
[0.375 0 0 0.375 557.4034 334.37501] CT
/Helvetica 26.667 F
GS
[1 0 0 1 0 0] CT
-15 27 moveto 
1 -1 scale
(38) t 
GR
GR
GS
[0.375 0 0 0.375 315.18775 347.74999] CT
/Helvetica 26.667 F
GS
[1 0 0 1 0 0] CT
-51.5 27 moveto 
1 -1 scale
(Subjects) t 
GR
GR
GS
[0.375 0 0 0.375 0 0] CT
2 setlinecap
1 LJ
1.333 LW
N
130 881 M
130 40 L
S
GR
GS
[0.375 0 0 0.375 0 0] CT
2 setlinecap
1 LJ
1.333 LW
N
130 842.773 M
144.21 842.773 L
S
GR
GS
[0.375 0 0 0.375 0 0] CT
2 setlinecap
1 LJ
1.333 LW
N
130 763.905 M
144.21 763.905 L
S
GR
GS
[0.375 0 0 0.375 0 0] CT
2 setlinecap
1 LJ
1.333 LW
N
130 685.037 M
144.21 685.037 L
S
GR
GS
[0.375 0 0 0.375 0 0] CT
2 setlinecap
1 LJ
1.333 LW
N
130 606.169 M
144.21 606.169 L
S
GR
GS
[0.375 0 0 0.375 0 0] CT
2 setlinecap
1 LJ
1.333 LW
N
130 527.301 M
144.21 527.301 L
S
GR
GS
[0.375 0 0 0.375 0 0] CT
2 setlinecap
1 LJ
1.333 LW
N
130 448.432 M
144.21 448.432 L
S
GR
GS
[0.375 0 0 0.375 0 0] CT
2 setlinecap
1 LJ
1.333 LW
N
130 369.564 M
144.21 369.564 L
S
GR
GS
[0.375 0 0 0.375 0 0] CT
2 setlinecap
1 LJ
1.333 LW
N
130 290.696 M
144.21 290.696 L
S
GR
GS
[0.375 0 0 0.375 0 0] CT
2 setlinecap
1 LJ
1.333 LW
N
130 211.828 M
144.21 211.828 L
S
GR
GS
[0.375 0 0 0.375 0 0] CT
2 setlinecap
1 LJ
1.333 LW
N
130 132.96 M
144.21 132.96 L
S
GR
GS
[0.375 0 0 0.375 0 0] CT
2 setlinecap
1 LJ
1.333 LW
N
130 54.092 M
144.21 54.092 L
S
GR
GS
[0.375 0 0 0.375 44.75 316.03976] CT
/Helvetica 26.667 F
GS
[1 0 0 1 0 0] CT
-15 10.5 moveto 
1 -1 scale
(0) t 
GR
GR
GS
[0.375 0 0 0.375 44.75 286.46425] CT
/Helvetica 26.667 F
GS
[1 0 0 1 0 0] CT
-38 10.5 moveto 
1 -1 scale
(0.1) t 
GR
GR
GS
[0.375 0 0 0.375 44.75 256.88873] CT
/Helvetica 26.667 F
GS
[1 0 0 1 0 0] CT
-38 10.5 moveto 
1 -1 scale
(0.2) t 
GR
GR
GS
[0.375 0 0 0.375 44.75 227.31322] CT
/Helvetica 26.667 F
GS
[1 0 0 1 0 0] CT
-38 10.5 moveto 
1 -1 scale
(0.3) t 
GR
GR
GS
[0.375 0 0 0.375 44.75 197.7377] CT
/Helvetica 26.667 F
GS
[1 0 0 1 0 0] CT
-38 10.5 moveto 
1 -1 scale
(0.4) t 
GR
GR
GS
[0.375 0 0 0.375 44.75 168.16217] CT
/Helvetica 26.667 F
GS
[1 0 0 1 0 0] CT
-38 10.5 moveto 
1 -1 scale
(0.5) t 
GR
GR
GS
[0.375 0 0 0.375 44.75 138.58665] CT
/Helvetica 26.667 F
GS
[1 0 0 1 0 0] CT
-38 10.5 moveto 
1 -1 scale
(0.6) t 
GR
GR
GS
[0.375 0 0 0.375 44.75 109.01114] CT
/Helvetica 26.667 F
GS
[1 0 0 1 0 0] CT
-38 10.5 moveto 
1 -1 scale
(0.7) t 
GR
GR
GS
[0.375 0 0 0.375 44.75 79.43562] CT
/Helvetica 26.667 F
GS
[1 0 0 1 0 0] CT
-38 10.5 moveto 
1 -1 scale
(0.8) t 
GR
GR
GS
[0.375 0 0 0.375 44.75 49.86011] CT
/Helvetica 26.667 F
GS
[1 0 0 1 0 0] CT
-38 10.5 moveto 
1 -1 scale
(0.9) t 
GR
GR
GS
[0.375 0 0 0.375 44.75 20.28458] CT
/Helvetica 26.667 F
GS
[1 0 0 1 0 0] CT
-15 10.5 moveto 
1 -1 scale
(1) t 
GR
GR
GS
[0 -0.375 0.375 0 27.5 172.68734] CT
/Helvetica 26.667 F
GS
[1 0 0 1 0 0] CT
-90 -6 moveto 
1 -1 scale
(P-value of beta) t 
GR
GR
GS
[0.375 0 0 0.375 72.97159 229.00937] CT
N
6.667 0 M
6.667 -3.682 3.682 -6.667 0 -6.667 C
-3.682 -6.667 -6.667 -3.682 -6.667 0 C
-6.667 3.682 -3.682 6.667 0 6.667 C
3.682 6.667 6.667 3.682 6.667 0 C
cp
f
GR
GS
[0.375 0 0 0.375 86.06434 316.03976] CT
N
/f640454831{6.667 0 M
6.667 -3.682 3.682 -6.667 0 -6.667 C
-3.682 -6.667 -6.667 -3.682 -6.667 0 C
-6.667 3.682 -3.682 6.667 0 6.667 C
3.682 6.667 6.667 3.682 6.667 0 C
cp}def
f640454831
f
GR
GS
[0.375 0 0 0.375 99.15709 311.84198] CT
N
f640454831
f
GR
GS
[0.375 0 0 0.375 112.24984 316.03976] CT
N
f640454831
f
GR
GS
[0.375 0 0 0.375 125.34259 316.03976] CT
N
f640454831
f
GR
GS
[0.375 0 0 0.375 138.43534 316.03976] CT
N
f640454831
f
GR
GS
[0.375 0 0 0.375 151.52811 31.8169] CT
N
f640454831
f
GR
GS
[0.375 0 0 0.375 164.62086 316.0394] CT
N
f640454831
f
GR
GS
[0.375 0 0 0.375 177.71361 282.78577] CT
N
f640454831
f
GR
GS
[0.375 0 0 0.375 190.80636 316.03976] CT
N
f640454831
f
GR
GS
[0.375 0 0 0.375 203.89911 316.03967] CT
N
f640454831
f
GR
GS
[0.375 0 0 0.375 216.99186 316.03976] CT
N
f640454831
f
GR
GS
[0.375 0 0 0.375 230.08461 298.7515] CT
N
f640454831
f
GR
GS
[0.375 0 0 0.375 243.17736 316.03976] CT
N
f640454831
f
GR
GS
[0.375 0 0 0.375 256.27011 316.03976] CT
N
f640454831
f
GR
GS
[0.375 0 0 0.375 269.36286 175.82199] CT
N
f640454831
f
GR
GS
[0.375 0 0 0.375 282.45561 316.03972] CT
N
f640454831
f
GR
GS
[0.375 0 0 0.375 295.54836 316.03976] CT
N
f640454831
f
GR
GS
[0.375 0 0 0.375 308.64111 194.92772] CT
N
f640454831
f
GR
GS
[0.375 0 0 0.375 321.73389 79.57735] CT
N
f640454831
f
GR
GS
[0.375 0 0 0.375 334.82664 316.03976] CT
N
f640454831
f
GR
GS
[0.375 0 0 0.375 347.91939 292.15556] CT
N
f640454831
f
GR
GS
[0.375 0 0 0.375 361.01214 315.04722] CT
N
f640454831
f
GR
GS
[0.375 0 0 0.375 374.10489 315.78211] CT
N
f640454831
f
GR
GS
[0.375 0 0 0.375 387.19762 316.03214] CT
N
f640454831
f
GR
GS
[0.375 0 0 0.375 400.29039 313.06405] CT
N
f640454831
f
GR
GS
[0.375 0 0 0.375 413.38312 315.62464] CT
N
f640454831
f
GR
GS
[0.375 0 0 0.375 426.47589 316.0359] CT
N
f640454831
f
GR
GS
[0.375 0 0 0.375 439.56866 316.0261] CT
N
f640454831
f
GR
GS
[0.375 0 0 0.375 452.66139 316.03972] CT
N
f640454831
f
GR
GS
[0.375 0 0 0.375 465.75417 315.03799] CT
N
f640454831
f
GR
GS
[0.375 0 0 0.375 478.84689 315.71459] CT
N
f640454831
f
GR
GS
[0.375 0 0 0.375 491.93967 316.03812] CT
N
f640454831
f
GR
GS
[0.375 0 0 0.375 505.03239 293.4351] CT
N
f640454831
f
GR
GS
[0.375 0 0 0.375 518.12517 315.15965] CT
N
f640454831
f
GR
GS
[0.375 0 0 0.375 531.2179 316.03967] CT
N
f640454831
f
GR
GS
[0.375 0 0 0.375 544.31067 304.44834] CT
N
f640454831
f
GR
GS
[0.375 0 0 0.375 557.4034 316.03974] CT
N
f640454831
f
GR
GS
[0.375 0 0 0.375 72.97159 152.2722] CT
N
f640454831
f
GR
GS
[0.375 0 0 0.375 86.06434 315.62819] CT
N
f640454831
f
GR
GS
[0.375 0 0 0.375 99.15709 106.75941] CT
N
f640454831
f
GR
GS
[0.375 0 0 0.375 112.24984 316.00317] CT
N
f640454831
f
GR
GS
[0.375 0 0 0.375 125.34259 316.03976] CT
N
f640454831
f
GR
GS
[0.375 0 0 0.375 138.43534 316.03976] CT
N
f640454831
f
GR
GS
[0.375 0 0 0.375 151.52811 316.03471] CT
N
f640454831
f
GR
GS
[0.375 0 0 0.375 164.62086 316.03699] CT
N
f640454831
f
GR
GS
[0.375 0 0 0.375 177.71361 100.34106] CT
N
f640454831
f
GR
GS
[0.375 0 0 0.375 190.80636 316.03814] CT
N
f640454831
f
GR
GS
[0.375 0 0 0.375 203.89911 316.03976] CT
N
f640454831
f
GR
GS
[0.375 0 0 0.375 216.99186 316.03976] CT
N
f640454831
f
GR
GS
[0.375 0 0 0.375 230.08461 316.02537] CT
N
f640454831
f
GR
GS
[0.375 0 0 0.375 243.17736 316.03976] CT
N
f640454831
f
GR
GS
[0.375 0 0 0.375 256.27011 316.0034] CT
N
f640454831
f
GR
GS
[0.375 0 0 0.375 269.36286 114.24353] CT
N
f640454831
f
GR
GS
[0.375 0 0 0.375 282.45561 316.03965] CT
N
f640454831
f
GR
GS
[0.375 0 0 0.375 295.54836 316.03214] CT
N
f640454831
f
GR
GS
[0.375 0 0 0.375 308.64111 60.03805] CT
N
f640454831
f
GR
GS
[0.375 0 0 0.375 321.73389 156.19406] CT
N
f640454831
f
GR
GS
[0.375 0 0 0.375 334.82664 316.03976] CT
N
f640454831
f
GR
GS
[0.375 0 0 0.375 347.91939 266.54574] CT
N
f640454831
f
GR
GS
[0.375 0 0 0.375 361.01214 315.49452] CT
N
f640454831
f
GR
GS
[0.375 0 0 0.375 374.10489 315.97172] CT
N
f640454831
f
GR
GS
[0.375 0 0 0.375 387.19762 315.13156] CT
N
f640454831
f
GR
GS
[0.375 0 0 0.375 400.29039 254.90071] CT
N
f640454831
f
GR
GS
[0.375 0 0 0.375 413.38312 74.51681] CT
N
f640454831
f
GR
GS
[0.375 0 0 0.375 426.47589 316.03816] CT
N
f640454831
f
GR
GS
[0.375 0 0 0.375 439.56866 315.49809] CT
N
f640454831
f
GR
GS
[0.375 0 0 0.375 452.66139 316.03976] CT
N
f640454831
f
GR
GS
[0.375 0 0 0.375 465.75417 283.78507] CT
N
f640454831
f
GR
GS
[0.375 0 0 0.375 478.84689 236.28314] CT
N
f640454831
f
GR
GS
[0.375 0 0 0.375 491.93967 315.28555] CT
N
f640454831
f
GR
GS
[0.375 0 0 0.375 505.03239 254.21004] CT
N
f640454831
f
GR
GS
[0.375 0 0 0.375 518.12517 316.03432] CT
N
f640454831
f
GR
GS
[0.375 0 0 0.375 531.2179 303.35291] CT
N
f640454831
f
GR
GS
[0.375 0 0 0.375 544.31067 315.82626] CT
N
f640454831
f
GR
GS
[0.375 0 0 0.375 557.4034 316.02633] CT
N
f640454831
f
GR
GS
[0.375 0 0 0.375 72.97159 298.49581] CT
N
f640454831
f
GR
GS
[0.375 0 0 0.375 86.06434 316.03976] CT
N
f640454831
f
GR
GS
[0.375 0 0 0.375 99.15709 135.00467] CT
N
f640454831
f
GR
GS
[0.375 0 0 0.375 112.24984 297.45371] CT
N
f640454831
f
GR
GS
[0.375 0 0 0.375 125.34259 193.83971] CT
N
f640454831
f
GR
GS
[0.375 0 0 0.375 138.43534 52.7149] CT
N
f640454831
f
GR
GS
[0.375 0 0 0.375 151.52811 112.88263] CT
N
f640454831
f
GR
GS
[0.375 0 0 0.375 164.62086 315.9575] CT
N
f640454831
f
GR
GS
[0.375 0 0 0.375 177.71361 316.03947] CT
N
f640454831
f
GR
GS
[0.375 0 0 0.375 190.80636 293.34311] CT
N
f640454831
f
GR
GS
[0.375 0 0 0.375 203.89911 191.77584] CT
N
f640454831
f
GR
GS
[0.375 0 0 0.375 216.99186 246.43643] CT
N
f640454831
f
GR
GS
[0.375 0 0 0.375 230.08461 49.83881] CT
N
f640454831
f
GR
GS
[0.375 0 0 0.375 243.17736 195.77861] CT
N
f640454831
f
GR
GS
[0.375 0 0 0.375 256.27011 285.8083] CT
N
f640454831
f
GR
GS
[0.375 0 0 0.375 269.36286 267.86327] CT
N
f640454831
f
GR
GS
[0.375 0 0 0.375 282.45561 102.25389] CT
N
f640454831
f
GR
GS
[0.375 0 0 0.375 295.54836 127.00039] CT
N
f640454831
f
GR
GS
[0.375 0 0 0.375 308.64111 41.56534] CT
N
f640454831
f
GR
GS
[0.375 0 0 0.375 321.73389 179.93154] CT
N
f640454831
f
GR
GS
[0.375 0 0 0.375 334.82664 125.95481] CT
N
f640454831
f
GR
GS
[0.375 0 0 0.375 347.91939 227.60692] CT
N
f640454831
f
GR
GS
[0.375 0 0 0.375 361.01214 145.64271] CT
N
f640454831
f
GR
GS
[0.375 0 0 0.375 374.10489 315.98346] CT
N
f640454831
f
GR
GS
[0.375 0 0 0.375 387.19762 316.01683] CT
N
f640454831
f
GR
GS
[0.375 0 0 0.375 400.29039 315.92031] CT
N
f640454831
f
GR
GS
[0.375 0 0 0.375 413.38312 316.03976] CT
N
f640454831
f
GR
GS
[0.375 0 0 0.375 426.47589 305.75581] CT
N
f640454831
f
GR
GS
[0.375 0 0 0.375 439.56866 316.03754] CT
N
f640454831
f
GR
GS
[0.375 0 0 0.375 452.66139 315.93423] CT
N
f640454831
f
GR
GS
[0.375 0 0 0.375 465.75417 233.04105] CT
N
f640454831
f
GR
GS
[0.375 0 0 0.375 478.84689 117.31324] CT
N
f640454831
f
GR
GS
[0.375 0 0 0.375 491.93967 316.03915] CT
N
f640454831
f
GR
GS
[0.375 0 0 0.375 505.03239 29.33522] CT
N
f640454831
f
GR
GS
[0.375 0 0 0.375 518.12517 316.03972] CT
N
f640454831
f
GR
GS
[0.375 0 0 0.375 531.2179 308.93495] CT
N
f640454831
f
GR
GS
[0.375 0 0 0.375 544.31067 316.01466] CT
N
f640454831
f
GR
GS
[0.375 0 0 0.375 557.4034 185.96498] CT
N
f640454831
f
GR
GS
[0.375 0 0 0.375 596.625 152.39174] CT
/Helvetica-Bold 32 F
GS
[1 0 0 1 0 0] CT
0 12.5 moveto 
1 -1 scale
(gains/losses/diffculty) t 
GR
GR
GS
[0.375 0 0 0.375 0 0] CT
1 LJ
8 LW
N
1591 469.37 M
1633.857 469.37 L
S
GR
GS
[0.375 0 0 0.375 620.73216 176.01378] CT
/Helvetica 26.667 F
GS
[1 0 0 1 0 0] CT
0 10.5 moveto 
1 -1 scale
(1) t 
GR
GR
GS
[0.375 0 0 0.375 0 0] CT
1 LJ
8 LW
N
1591 532.362 M
1633.857 532.362 L
S
GR
GS
[0.375 0 0 0.375 620.73216 199.63582] CT
/Helvetica 26.667 F
GS
[1 0 0 1 0 0] CT
0 10.5 moveto 
1 -1 scale
(2) t 
GR
GR
GS
[0.375 0 0 0.375 0 0] CT
1 LJ
8 LW
N
1591 595.354 M
1633.857 595.354 L
S
GR
GS
[0.375 0 0 0.375 620.73216 223.25787] CT
/Helvetica 26.667 F
GS
[1 0 0 1 0 0] CT
0 10.5 moveto 
1 -1 scale
(3) t 
GR
GR
%%Trailer
%%Pages: 1
%%EOF
