%!PS-Adobe-3.0 EPSF-3.0
%%Creator: (MATLAB, The Mathworks, Inc. Version 9.7.0.1261785 \(R2019b\) Update 3. Operating System: Windows 10)
%%Title: C:/Users/Clarissa/Documents/decid_eye/analysis/manip1&2/1_pipeline/fixations/3_f_fixation_behav/plots/lvl2_agent/choiceAsFunctionOfValueDiff_lastFix_PSE.eps
%%CreationDate: 2021-04-20T23:12:14
%%Pages: (atend)
%%BoundingBox:    17    15   346   361
%%LanguageLevel: 3
%%EndComments
%%BeginProlog
%%BeginResource: procset (Apache XML Graphics Std ProcSet) 1.2 0
%%Version: 1.2 0
%%Copyright: (Copyright 2001-2003,2010 The Apache Software Foundation. License terms: http://www.apache.org/licenses/LICENSE-2.0)
/bd{bind def}bind def
/ld{load def}bd
/GR/grestore ld
/GS/gsave ld
/RM/rmoveto ld
/C/curveto ld
/t/show ld
/L/lineto ld
/ML/setmiterlimit ld
/CT/concat ld
/f/fill ld
/N/newpath ld
/S/stroke ld
/CC/setcmykcolor ld
/A/ashow ld
/cp/closepath ld
/RC/setrgbcolor ld
/LJ/setlinejoin ld
/GC/setgray ld
/LW/setlinewidth ld
/M/moveto ld
/re {4 2 roll M
1 index 0 rlineto
0 exch rlineto
neg 0 rlineto
cp } bd
/_ctm matrix def
/_tm matrix def
/BT { _ctm currentmatrix pop matrix _tm copy pop 0 0 moveto } bd
/ET { _ctm setmatrix } bd
/iTm { _ctm setmatrix _tm concat } bd
/Tm { _tm astore pop iTm 0 0 moveto } bd
/ux 0.0 def
/uy 0.0 def
/F {
  /Tp exch def
  /Tf exch def
  Tf findfont Tp scalefont setfont
  /cf Tf def  /cs Tp def
} bd
/ULS {currentpoint /uy exch def /ux exch def} bd
/ULE {
  /Tcx currentpoint pop def
  gsave
  newpath
  cf findfont cs scalefont dup
  /FontMatrix get 0 get /Ts exch def /FontInfo get dup
  /UnderlinePosition get Ts mul /To exch def
  /UnderlineThickness get Ts mul /Tt exch def
  ux uy To add moveto  Tcx uy To add lineto
  Tt setlinewidth stroke
  grestore
} bd
/OLE {
  /Tcx currentpoint pop def
  gsave
  newpath
  cf findfont cs scalefont dup
  /FontMatrix get 0 get /Ts exch def /FontInfo get dup
  /UnderlinePosition get Ts mul /To exch def
  /UnderlineThickness get Ts mul /Tt exch def
  ux uy To add cs add moveto Tcx uy To add cs add lineto
  Tt setlinewidth stroke
  grestore
} bd
/SOE {
  /Tcx currentpoint pop def
  gsave
  newpath
  cf findfont cs scalefont dup
  /FontMatrix get 0 get /Ts exch def /FontInfo get dup
  /UnderlinePosition get Ts mul /To exch def
  /UnderlineThickness get Ts mul /Tt exch def
  ux uy To add cs 10 mul 26 idiv add moveto Tcx uy To add cs 10 mul 26 idiv add lineto
  Tt setlinewidth stroke
  grestore
} bd
/QT {
/Y22 exch store
/X22 exch store
/Y21 exch store
/X21 exch store
currentpoint
/Y21 load 2 mul add 3 div exch
/X21 load 2 mul add 3 div exch
/X21 load 2 mul /X22 load add 3 div
/Y21 load 2 mul /Y22 load add 3 div
/X22 load /Y22 load curveto
} bd
/SSPD {
dup length /d exch dict def
{
/v exch def
/k exch def
currentpagedevice k known {
/cpdv currentpagedevice k get def
v cpdv ne {
/upd false def
/nullv v type /nulltype eq def
/nullcpdv cpdv type /nulltype eq def
nullv nullcpdv or
{
/upd true def
} {
/sametype v type cpdv type eq def
sametype {
v type /arraytype eq {
/vlen v length def
/cpdvlen cpdv length def
vlen cpdvlen eq {
0 1 vlen 1 sub {
/i exch def
/obj v i get def
/cpdobj cpdv i get def
obj cpdobj ne {
/upd true def
exit
} if
} for
} {
/upd true def
} ifelse
} {
v type /dicttype eq {
v {
/dv exch def
/dk exch def
/cpddv cpdv dk get def
dv cpddv ne {
/upd true def
exit
} if
} forall
} {
/upd true def
} ifelse
} ifelse
} if
} ifelse
upd true eq {
d k v put
} if
} if
} if
} forall
d length 0 gt {
d setpagedevice
} if
} bd
/RE { % /NewFontName [NewEncodingArray] /FontName RE -
  findfont dup length dict begin
  {
    1 index /FID ne
    {def} {pop pop} ifelse
  } forall
  /Encoding exch def
  /FontName 1 index def
  currentdict definefont pop
  end
} bind def
%%EndResource
%%BeginResource: procset (Apache XML Graphics EPS ProcSet) 1.0 0
%%Version: 1.0 0
%%Copyright: (Copyright 2002-2003 The Apache Software Foundation. License terms: http://www.apache.org/licenses/LICENSE-2.0)
/BeginEPSF { %def
/b4_Inc_state save def         % Save state for cleanup
/dict_count countdictstack def % Count objects on dict stack
/op_count count 1 sub def      % Count objects on operand stack
userdict begin                 % Push userdict on dict stack
/showpage { } def              % Redefine showpage, { } = null proc
0 setgray 0 setlinecap         % Prepare graphics state
1 setlinewidth 0 setlinejoin
10 setmiterlimit [ ] 0 setdash newpath
/languagelevel where           % If level not equal to 1 then
{pop languagelevel             % set strokeadjust and
1 ne                           % overprint to their defaults.
{false setstrokeadjust false setoverprint
} if
} if
} bd
/EndEPSF { %def
count op_count sub {pop} repeat            % Clean up stacks
countdictstack dict_count sub {end} repeat
b4_Inc_state restore
} bd
%%EndResource
%FOPBeginFontDict
%%IncludeResource: font Courier-Oblique
%%IncludeResource: font Courier-BoldOblique
%%IncludeResource: font Courier-Bold
%%IncludeResource: font ZapfDingbats
%%IncludeResource: font Symbol
%%IncludeResource: font Helvetica
%%IncludeResource: font Helvetica-Oblique
%%IncludeResource: font Helvetica-Bold
%%IncludeResource: font Helvetica-BoldOblique
%%IncludeResource: font Times-Roman
%%IncludeResource: font Times-Italic
%%IncludeResource: font Times-Bold
%%IncludeResource: font Times-BoldItalic
%%IncludeResource: font Courier
%FOPEndFontDict
%%BeginResource: encoding WinAnsiEncoding
/WinAnsiEncoding [
/.notdef /.notdef /.notdef /.notdef /.notdef
/.notdef /.notdef /.notdef /.notdef /.notdef
/.notdef /.notdef /.notdef /.notdef /.notdef
/.notdef /.notdef /.notdef /.notdef /.notdef
/.notdef /.notdef /.notdef /.notdef /.notdef
/.notdef /.notdef /.notdef /.notdef /.notdef
/.notdef /.notdef /space /exclam /quotedbl
/numbersign /dollar /percent /ampersand /quotesingle
/parenleft /parenright /asterisk /plus /comma
/hyphen /period /slash /zero /one
/two /three /four /five /six
/seven /eight /nine /colon /semicolon
/less /equal /greater /question /at
/A /B /C /D /E
/F /G /H /I /J
/K /L /M /N /O
/P /Q /R /S /T
/U /V /W /X /Y
/Z /bracketleft /backslash /bracketright /asciicircum
/underscore /quoteleft /a /b /c
/d /e /f /g /h
/i /j /k /l /m
/n /o /p /q /r
/s /t /u /v /w
/x /y /z /braceleft /bar
/braceright /asciitilde /bullet /Euro /bullet
/quotesinglbase /florin /quotedblbase /ellipsis /dagger
/daggerdbl /circumflex /perthousand /Scaron /guilsinglleft
/OE /bullet /Zcaron /bullet /bullet
/quoteleft /quoteright /quotedblleft /quotedblright /bullet
/endash /emdash /asciitilde /trademark /scaron
/guilsinglright /oe /bullet /zcaron /Ydieresis
/space /exclamdown /cent /sterling /currency
/yen /brokenbar /section /dieresis /copyright
/ordfeminine /guillemotleft /logicalnot /sfthyphen /registered
/macron /degree /plusminus /twosuperior /threesuperior
/acute /mu /paragraph /middot /cedilla
/onesuperior /ordmasculine /guillemotright /onequarter /onehalf
/threequarters /questiondown /Agrave /Aacute /Acircumflex
/Atilde /Adieresis /Aring /AE /Ccedilla
/Egrave /Eacute /Ecircumflex /Edieresis /Igrave
/Iacute /Icircumflex /Idieresis /Eth /Ntilde
/Ograve /Oacute /Ocircumflex /Otilde /Odieresis
/multiply /Oslash /Ugrave /Uacute /Ucircumflex
/Udieresis /Yacute /Thorn /germandbls /agrave
/aacute /acircumflex /atilde /adieresis /aring
/ae /ccedilla /egrave /eacute /ecircumflex
/edieresis /igrave /iacute /icircumflex /idieresis
/eth /ntilde /ograve /oacute /ocircumflex
/otilde /odieresis /divide /oslash /ugrave
/uacute /ucircumflex /udieresis /yacute /thorn
/ydieresis
] def
%%EndResource
%FOPBeginFontReencode
/Courier-Oblique findfont
dup length dict begin
  {1 index /FID ne {def} {pop pop} ifelse} forall
  /Encoding WinAnsiEncoding def
  currentdict
end
/Courier-Oblique exch definefont pop
/Courier-BoldOblique findfont
dup length dict begin
  {1 index /FID ne {def} {pop pop} ifelse} forall
  /Encoding WinAnsiEncoding def
  currentdict
end
/Courier-BoldOblique exch definefont pop
/Courier-Bold findfont
dup length dict begin
  {1 index /FID ne {def} {pop pop} ifelse} forall
  /Encoding WinAnsiEncoding def
  currentdict
end
/Courier-Bold exch definefont pop
/Helvetica findfont
dup length dict begin
  {1 index /FID ne {def} {pop pop} ifelse} forall
  /Encoding WinAnsiEncoding def
  currentdict
end
/Helvetica exch definefont pop
/Helvetica-Oblique findfont
dup length dict begin
  {1 index /FID ne {def} {pop pop} ifelse} forall
  /Encoding WinAnsiEncoding def
  currentdict
end
/Helvetica-Oblique exch definefont pop
/Helvetica-Bold findfont
dup length dict begin
  {1 index /FID ne {def} {pop pop} ifelse} forall
  /Encoding WinAnsiEncoding def
  currentdict
end
/Helvetica-Bold exch definefont pop
/Helvetica-BoldOblique findfont
dup length dict begin
  {1 index /FID ne {def} {pop pop} ifelse} forall
  /Encoding WinAnsiEncoding def
  currentdict
end
/Helvetica-BoldOblique exch definefont pop
/Times-Roman findfont
dup length dict begin
  {1 index /FID ne {def} {pop pop} ifelse} forall
  /Encoding WinAnsiEncoding def
  currentdict
end
/Times-Roman exch definefont pop
/Times-Italic findfont
dup length dict begin
  {1 index /FID ne {def} {pop pop} ifelse} forall
  /Encoding WinAnsiEncoding def
  currentdict
end
/Times-Italic exch definefont pop
/Times-Bold findfont
dup length dict begin
  {1 index /FID ne {def} {pop pop} ifelse} forall
  /Encoding WinAnsiEncoding def
  currentdict
end
/Times-Bold exch definefont pop
/Times-BoldItalic findfont
dup length dict begin
  {1 index /FID ne {def} {pop pop} ifelse} forall
  /Encoding WinAnsiEncoding def
  currentdict
end
/Times-BoldItalic exch definefont pop
/Courier findfont
dup length dict begin
  {1 index /FID ne {def} {pop pop} ifelse} forall
  /Encoding WinAnsiEncoding def
  currentdict
end
/Courier exch definefont pop
%FOPEndFontReencode
%%EndProlog
%%Page: 1 1
%%PageBoundingBox: 0 0 375 375
%%BeginPageSetup
[1 0 0 -1 0 375] CT
%%EndPageSetup
GS
[0.375 0 0 0.375 0 0] CT
1 GC
N
0 0 1000 1000 re
f
GR
GS
[0.375 0 0 0.375 0 0] CT
1 GC
N
0 0 1000 1000 re
f
GR
GS
[0.375 0 0 0.375 0 0] CT
1 GC
N
146 916 M
920 916 L
920 40 L
146 40 L
cp
f
GR
GS
[0.375 0 0 0.375 0 0] CT
2 setlinecap
1 LJ
1.333 LW
N
146 916 M
920 916 L
S
GR
GS
[0.375 0 0 0.375 0 0] CT
2 setlinecap
1 LJ
1.333 LW
N
404 916 M
404 907.24 L
S
GR
GS
[0.375 0 0 0.375 0 0] CT
2 setlinecap
1 LJ
1.333 LW
N
662 916 M
662 907.24 L
S
GR
GS
[0.375 0 0 0.375 151.5 347.50001] CT
/Helvetica 26.667 F
GS
[1 0 0 1 0 0] CT
-78 27 moveto 
1 -1 scale
(Last fix gains) t 
GR
GR
GS
[0.375 0 0 0.375 248.25 347.50001] CT
/Helvetica 26.667 F
GS
[1 0 0 1 0 0] CT
-84 27 moveto 
1 -1 scale
(Last fix losses) t 
GR
GR
GS
[0.375 0 0 0.375 0 0] CT
2 setlinecap
1 LJ
1.333 LW
N
146 916 M
146 40 L
S
GR
GS
[0.375 0 0 0.375 0 0] CT
2 setlinecap
1 LJ
1.333 LW
N
146 883.537 M
154.76 883.537 L
S
GR
GS
[0.375 0 0 0.375 0 0] CT
2 setlinecap
1 LJ
1.333 LW
N
146 804.387 M
154.76 804.387 L
S
GR
GS
[0.375 0 0 0.375 0 0] CT
2 setlinecap
1 LJ
1.333 LW
N
146 725.238 M
154.76 725.238 L
S
GR
GS
[0.375 0 0 0.375 0 0] CT
2 setlinecap
1 LJ
1.333 LW
N
146 646.089 M
154.76 646.089 L
S
GR
GS
[0.375 0 0 0.375 0 0] CT
2 setlinecap
1 LJ
1.333 LW
N
146 566.939 M
154.76 566.939 L
S
GR
GS
[0.375 0 0 0.375 0 0] CT
2 setlinecap
1 LJ
1.333 LW
N
146 487.79 M
154.76 487.79 L
S
GR
GS
[0.375 0 0 0.375 0 0] CT
2 setlinecap
1 LJ
1.333 LW
N
146 408.64 M
154.76 408.64 L
S
GR
GS
[0.375 0 0 0.375 0 0] CT
2 setlinecap
1 LJ
1.333 LW
N
146 329.491 M
154.76 329.491 L
S
GR
GS
[0.375 0 0 0.375 0 0] CT
2 setlinecap
1 LJ
1.333 LW
N
146 250.342 M
154.76 250.342 L
S
GR
GS
[0.375 0 0 0.375 0 0] CT
2 setlinecap
1 LJ
1.333 LW
N
146 171.192 M
154.76 171.192 L
S
GR
GS
[0.375 0 0 0.375 0 0] CT
2 setlinecap
1 LJ
1.333 LW
N
146 92.043 M
154.76 92.043 L
S
GR
GS
[0.375 0 0 0.375 50.75 331.32623] CT
/Helvetica 26.667 F
GS
[1 0 0 1 0 0] CT
-54 10.5 moveto 
1 -1 scale
(-350) t 
GR
GR
GS
[0.375 0 0 0.375 50.75 301.64523] CT
/Helvetica 26.667 F
GS
[1 0 0 1 0 0] CT
-54 10.5 moveto 
1 -1 scale
(-300) t 
GR
GR
GS
[0.375 0 0 0.375 50.75 271.96422] CT
/Helvetica 26.667 F
GS
[1 0 0 1 0 0] CT
-54 10.5 moveto 
1 -1 scale
(-250) t 
GR
GR
GS
[0.375 0 0 0.375 50.75 242.28319] CT
/Helvetica 26.667 F
GS
[1 0 0 1 0 0] CT
-54 10.5 moveto 
1 -1 scale
(-200) t 
GR
GR
GS
[0.375 0 0 0.375 50.75 212.60218] CT
/Helvetica 26.667 F
GS
[1 0 0 1 0 0] CT
-54 10.5 moveto 
1 -1 scale
(-150) t 
GR
GR
GS
[0.375 0 0 0.375 50.75 182.92116] CT
/Helvetica 26.667 F
GS
[1 0 0 1 0 0] CT
-54 10.5 moveto 
1 -1 scale
(-100) t 
GR
GR
GS
[0.375 0 0 0.375 50.75 153.24014] CT
/Helvetica 26.667 F
GS
[1 0 0 1 0 0] CT
-39 10.5 moveto 
1 -1 scale
(-50) t 
GR
GR
GS
[0.375 0 0 0.375 50.75 123.55914] CT
/Helvetica 26.667 F
GS
[1 0 0 1 0 0] CT
-15 10.5 moveto 
1 -1 scale
(0) t 
GR
GR
GS
[0.375 0 0 0.375 50.75 93.87812] CT
/Helvetica 26.667 F
GS
[1 0 0 1 0 0] CT
-30 10.5 moveto 
1 -1 scale
(50) t 
GR
GR
GS
[0.375 0 0 0.375 50.75 64.1971] CT
/Helvetica 26.667 F
GS
[1 0 0 1 0 0] CT
-45 10.5 moveto 
1 -1 scale
(100) t 
GR
GR
GS
[0.375 0 0 0.375 50.75 34.51608] CT
/Helvetica 26.667 F
GS
[1 0 0 1 0 0] CT
-45 10.5 moveto 
1 -1 scale
(150) t 
GR
GR
GS
[0 -0.375 0.375 0 27.5 179.24984] CT
/Helvetica 26.667 F
GS
[1 0 0 1 0 0] CT
-345.5 -6 moveto 
1 -1 scale
(PSE \(= point of subjective equality, where P\(accept\) = 0.5\)) t 
GR
GR
GS
[0.375 0 0 0.375 151.5 65.30639] CT
N
6.667 0 M
6.667 -3.682 3.682 -6.667 0 -6.667 C
-3.682 -6.667 -6.667 -3.682 -6.667 0 C
-6.667 3.682 -3.682 6.667 0 6.667 C
3.682 6.667 6.667 3.682 6.667 0 C
cp
f
GR
GS
[0.375 0 0 0.375 248.25 190.91326] CT
N
/f640454831{6.667 0 M
6.667 -3.682 3.682 -6.667 0 -6.667 C
-3.682 -6.667 -6.667 -3.682 -6.667 0 C
-6.667 3.682 -3.682 6.667 0 6.667 C
3.682 6.667 6.667 3.682 6.667 0 C
cp}def
f640454831
f
GR
GS
[0.375 0 0 0.375 0 0] CT
1 LJ
4 LW
N
404 174.15 M
662 509.102 L
S
GR
GS
[0.375 0 0 0.375 151.5 118.84653] CT
N
f640454831
f
GR
GS
[0.375 0 0 0.375 248.25 114.10389] CT
N
f640454831
f
GR
GS
[0.375 0 0 0.375 0 0] CT
1 LJ
4 LW
N
404 316.924 M
662 304.277 L
S
GR
GS
[0.375 0 0 0.375 151.5 151.67737] CT
N
f640454831
f
GR
GS
[0.375 0 0 0.375 248.25 166.7906] CT
N
f640454831
f
GR
GS
[0.375 0 0 0.375 0 0] CT
1 LJ
4 LW
N
404 404.473 M
662 444.775 L
S
GR
GS
[0.375 0 0 0.375 151.5 128.15009] CT
N
f640454831
f
GR
GS
[0.375 0 0 0.375 248.25 123.74479] CT
N
f640454831
f
GR
GS
[0.375 0 0 0.375 0 0] CT
1 LJ
4 LW
N
404 341.734 M
662 329.986 L
S
GR
GS
[0.375 0 0 0.375 151.5 124.18027] CT
N
f640454831
f
GR
GS
[0.375 0 0 0.375 248.25 119.02375] CT
N
f640454831
f
GR
GS
[0.375 0 0 0.375 0 0] CT
1 LJ
4 LW
N
404 331.147 M
662 317.397 L
S
GR
GS
[0.375 0 0 0.375 151.5 122.09417] CT
N
f640454831
f
GR
GS
[0.375 0 0 0.375 248.25 120.70821] CT
N
f640454831
f
GR
GS
[0.375 0 0 0.375 0 0] CT
1 LJ
4 LW
N
404 325.584 M
662 321.889 L
S
GR
GS
[0.375 0 0 0.375 151.5 97.04514] CT
N
f640454831
f
GR
GS
[0.375 0 0 0.375 248.25 106.21667] CT
N
f640454831
f
GR
GS
[0.375 0 0 0.375 0 0] CT
1 LJ
4 LW
N
404 258.787 M
662 283.244 L
S
GR
GS
[0.375 0 0 0.375 151.5 136.71017] CT
N
f640454831
f
GR
GS
[0.375 0 0 0.375 248.25 135.24345] CT
N
f640454831
f
GR
GS
[0.375 0 0 0.375 0 0] CT
1 LJ
4 LW
N
404 364.56 M
662 360.649 L
S
GR
GS
[0.375 0 0 0.375 151.5 114.91721] CT
N
f640454831
f
GR
GS
[0.375 0 0 0.375 248.25 123.14865] CT
N
f640454831
f
GR
GS
[0.375 0 0 0.375 0 0] CT
1 LJ
4 LW
N
404 306.446 M
662 328.396 L
S
GR
GS
[0.375 0 0 0.375 151.5 131.957] CT
N
f640454831
f
GR
GS
[0.375 0 0 0.375 248.25 130.19545] CT
N
f640454831
f
GR
GS
[0.375 0 0 0.375 0 0] CT
1 LJ
4 LW
N
404 351.885 M
662 347.188 L
S
GR
GS
[0.375 0 0 0.375 151.5 119.561] CT
N
f640454831
f
GR
GS
[0.375 0 0 0.375 248.25 116.21544] CT
N
f640454831
f
GR
GS
[0.375 0 0 0.375 0 0] CT
1 LJ
4 LW
N
404 318.829 M
662 309.908 L
S
GR
GS
[0.375 0 0 0.375 151.5 124.46063] CT
N
f640454831
f
GR
GS
[0.375 0 0 0.375 248.25 118.92287] CT
N
f640454831
f
GR
GS
[0.375 0 0 0.375 0 0] CT
1 LJ
4 LW
N
404 331.895 M
662 317.128 L
S
GR
GS
[0.375 0 0 0.375 151.5 141.46755] CT
N
f640454831
f
GR
GS
[0.375 0 0 0.375 248.25 131.00259] CT
N
f640454831
f
GR
GS
[0.375 0 0 0.375 0 0] CT
1 LJ
4 LW
N
404 377.247 M
662 349.34 L
S
GR
GS
[0.375 0 0 0.375 151.5 127.56056] CT
N
f640454831
f
GR
GS
[0.375 0 0 0.375 248.25 121.25435] CT
N
f640454831
f
GR
GS
[0.375 0 0 0.375 0 0] CT
1 LJ
4 LW
N
404 340.161 M
662 323.345 L
S
GR
GS
[0.375 0 0 0.375 151.5 125.62558] CT
N
f640454831
f
GR
GS
[0.375 0 0 0.375 248.25 123.50244] CT
N
f640454831
f
GR
GS
[0.375 0 0 0.375 0 0] CT
1 LJ
4 LW
N
404 335.002 M
662 329.34 L
S
GR
GS
[0.375 0 0 0.375 151.5 133.1467] CT
N
f640454831
f
GR
GS
[0.375 0 0 0.375 248.25 69.01099] CT
N
f640454831
f
GR
GS
[0.375 0 0 0.375 0 0] CT
1 LJ
4 LW
N
404 355.058 M
662 184.029 L
S
GR
GS
[0.375 0 0 0.375 151.5 127.40833] CT
N
f640454831
f
GR
GS
[0.375 0 0 0.375 248.25 122.39068] CT
N
f640454831
f
GR
GS
[0.375 0 0 0.375 0 0] CT
1 LJ
4 LW
N
404 339.756 M
662 326.375 L
S
GR
GS
[0.375 0 0 0.375 151.5 126.83081] CT
N
f640454831
f
GR
GS
[0.375 0 0 0.375 248.25 111.22308] CT
N
f640454831
f
GR
GS
[0.375 0 0 0.375 0 0] CT
1 LJ
4 LW
N
404 338.215 M
662 296.595 L
S
GR
GS
[0.375 0 0 0.375 151.5 84.02182] CT
N
f640454831
f
GR
GS
[0.375 0 0 0.375 248.25 120.95714] CT
N
f640454831
f
GR
GS
[0.375 0 0 0.375 0 0] CT
1 LJ
4 LW
N
404 224.058 M
662 322.552 L
S
GR
GS
[0.375 0 0 0.375 151.5 119.52086] CT
N
f640454831
f
GR
GS
[0.375 0 0 0.375 248.25 328.56818] CT
N
f640454831
f
GR
GS
[0.375 0 0 0.375 0 0] CT
1 LJ
4 LW
N
404 318.722 M
662 876.182 L
S
GR
GS
[0.375 0 0 0.375 151.5 124.83394] CT
N
f640454831
f
GR
GS
[0.375 0 0 0.375 248.25 123.31923] CT
N
f640454831
f
GR
GS
[0.375 0 0 0.375 0 0] CT
1 LJ
4 LW
N
404 332.891 M
662 328.851 L
S
GR
GS
[0.375 0 0 0.375 151.5 29.93182] CT
N
f640454831
f
GR
GS
[0.375 0 0 0.375 248.25 144.13992] CT
N
f640454831
f
GR
GS
[0.375 0 0 0.375 0 0] CT
1 LJ
4 LW
N
404 79.818 M
662 384.373 L
S
GR
GS
[0.375 0 0 0.375 151.5 151.8736] CT
N
f640454831
f
GR
GS
[0.375 0 0 0.375 248.25 137.42331] CT
N
f640454831
f
GR
GS
[0.375 0 0 0.375 0 0] CT
1 LJ
4 LW
N
404 404.996 M
662 366.462 L
S
GR
GS
[0.375 0 0 0.375 151.5 142.89839] CT
N
f640454831
f
GR
GS
[0.375 0 0 0.375 248.25 137.35391] CT
N
f640454831
f
GR
GS
[0.375 0 0 0.375 0 0] CT
1 LJ
4 LW
N
404 381.062 M
662 366.277 L
S
GR
GS
[0.375 0 0 0.375 151.5 131.41109] CT
N
f640454831
f
GR
GS
[0.375 0 0 0.375 248.25 131.41802] CT
N
f640454831
f
GR
GS
[0.375 0 0 0.375 0 0] CT
1 LJ
4 LW
N
404 350.43 M
662 350.448 L
S
GR
GS
[0.375 0 0 0.375 151.5 174.84563] CT
N
f640454831
f
GR
GS
[0.375 0 0 0.375 248.25 137.42729] CT
N
f640454831
f
GR
GS
[0.375 0 0 0.375 0 0] CT
1 LJ
4 LW
N
404 466.255 M
662 366.473 L
S
GR
GS
[0.375 0 0 0.375 151.5 127.23809] CT
N
f640454831
f
GR
GS
[0.375 0 0 0.375 248.25 133.16214] CT
N
f640454831
f
GR
GS
[0.375 0 0 0.375 0 0] CT
1 LJ
4 LW
N
404 339.302 M
662 355.099 L
S
GR
GS
[0.375 0 0 0.375 151.5 129.4972] CT
N
f640454831
f
GR
GS
[0.375 0 0 0.375 248.25 129.91168] CT
N
f640454831
f
GR
GS
[0.375 0 0 0.375 0 0] CT
1 LJ
4 LW
N
404 345.326 M
662 346.431 L
S
GR
GS
[0.375 0 0 0.375 151.5 143.30687] CT
N
f640454831
f
GR
GS
[0.375 0 0 0.375 248.25 137.41334] CT
N
f640454831
f
GR
GS
[0.375 0 0 0.375 0 0] CT
1 LJ
4 LW
N
404 382.152 M
662 366.436 L
S
GR
GS
[0.375 0 0 0.375 151.5 120.88799] CT
N
f640454831
f
GR
GS
[0.375 0 0 0.375 248.25 121.61646] CT
N
f640454831
f
GR
GS
[0.375 0 0 0.375 0 0] CT
1 LJ
4 LW
N
404 322.368 M
662 324.311 L
S
GR
GS
[0.375 0 0 0.375 151.5 159.54702] CT
N
f640454831
f
GR
GS
[0.375 0 0 0.375 248.25 139.79435] CT
N
f640454831
f
GR
GS
[0.375 0 0 0.375 0 0] CT
1 LJ
4 LW
N
404 425.459 M
662 372.785 L
S
GR
GS
[0.375 0 0 0.375 151.5 173.5825] CT
N
f640454831
f
GR
GS
[0.375 0 0 0.375 248.25 138.17608] CT
N
f640454831
f
GR
GS
[0.375 0 0 0.375 0 0] CT
1 LJ
4 LW
N
404 462.887 M
662 368.47 L
S
GR
GS
[0.375 0 0 0.375 151.5 127.67753] CT
N
f640454831
f
GR
GS
[0.375 0 0 0.375 248.25 128.93098] CT
N
f640454831
f
GR
GS
[0.375 0 0 0.375 0 0] CT
1 LJ
4 LW
N
404 340.473 M
662 343.816 L
S
GR
GS
[0.375 0 0 0.375 151.5 146.83415] CT
N
f640454831
f
GR
GS
[0.375 0 0 0.375 248.25 139.81335] CT
N
f640454831
f
GR
GS
[0.375 0 0 0.375 0 0] CT
1 LJ
4 LW
N
404 391.558 M
662 372.836 L
S
GR
GS
[0.375 0 0 0.375 151.5 132.41555] CT
N
f640454831
f
GR
GS
[0.375 0 0 0.375 248.25 128.25555] CT
N
f640454831
f
GR
GS
[0.375 0 0 0.375 0 0] CT
1 LJ
4 LW
N
404 353.108 M
662 342.015 L
S
GR
GS
[0.375 0 0 0.375 151.5 132.86579] CT
N
f640454831
f
GR
GS
[0.375 0 0 0.375 248.25 129.65377] CT
N
f640454831
f
GR
GS
[0.375 0 0 0.375 0 0] CT
1 LJ
4 LW
N
404 354.309 M
662 345.743 L
S
GR
GS
[0.375 0 0 0.375 151.5 109.61366] CT
N
f640454831
f
GR
GS
[0.375 0 0 0.375 248.25 113.3111] CT
N
f640454831
f
GR
GS
[0.375 0 0 0.375 0 0] CT
1 LJ
4 LW
N
404 292.303 M
662 302.163 L
S
GR
GS
[0.375 0 0 0.375 151.5 125.67468] CT
N
f640454831
f
GR
GS
[0.375 0 0 0.375 248.25 123.01591] CT
N
f640454831
f
GR
GS
[0.375 0 0 0.375 0 0] CT
1 LJ
4 LW
N
404 335.132 M
662 328.042 L
S
GR
%%Trailer
%%Pages: 1
%%EOF
