%!PS-Adobe-3.0 EPSF-3.0
%%Creator: (MATLAB, The Mathworks, Inc. Version 9.7.0.1261785 \(R2019b\) Update 3. Operating System: Windows 10)
%%Title: C:/Users/Clarissa/Documents/decid_eye/analysis/manip1&2/1_pipeline/fixations/3_f_fixation_behav/plots/lvl2_agent/choiceAsFunctionOfTimeAdv.eps
%%CreationDate: 2021-04-20T23:12:15
%%Pages: (atend)
%%BoundingBox:    17    14   346   361
%%LanguageLevel: 3
%%EndComments
%%BeginProlog
%%BeginResource: procset (Apache XML Graphics Std ProcSet) 1.2 0
%%Version: 1.2 0
%%Copyright: (Copyright 2001-2003,2010 The Apache Software Foundation. License terms: http://www.apache.org/licenses/LICENSE-2.0)
/bd{bind def}bind def
/ld{load def}bd
/GR/grestore ld
/GS/gsave ld
/RM/rmoveto ld
/C/curveto ld
/t/show ld
/L/lineto ld
/ML/setmiterlimit ld
/CT/concat ld
/f/fill ld
/N/newpath ld
/S/stroke ld
/CC/setcmykcolor ld
/A/ashow ld
/cp/closepath ld
/RC/setrgbcolor ld
/LJ/setlinejoin ld
/GC/setgray ld
/LW/setlinewidth ld
/M/moveto ld
/re {4 2 roll M
1 index 0 rlineto
0 exch rlineto
neg 0 rlineto
cp } bd
/_ctm matrix def
/_tm matrix def
/BT { _ctm currentmatrix pop matrix _tm copy pop 0 0 moveto } bd
/ET { _ctm setmatrix } bd
/iTm { _ctm setmatrix _tm concat } bd
/Tm { _tm astore pop iTm 0 0 moveto } bd
/ux 0.0 def
/uy 0.0 def
/F {
  /Tp exch def
  /Tf exch def
  Tf findfont Tp scalefont setfont
  /cf Tf def  /cs Tp def
} bd
/ULS {currentpoint /uy exch def /ux exch def} bd
/ULE {
  /Tcx currentpoint pop def
  gsave
  newpath
  cf findfont cs scalefont dup
  /FontMatrix get 0 get /Ts exch def /FontInfo get dup
  /UnderlinePosition get Ts mul /To exch def
  /UnderlineThickness get Ts mul /Tt exch def
  ux uy To add moveto  Tcx uy To add lineto
  Tt setlinewidth stroke
  grestore
} bd
/OLE {
  /Tcx currentpoint pop def
  gsave
  newpath
  cf findfont cs scalefont dup
  /FontMatrix get 0 get /Ts exch def /FontInfo get dup
  /UnderlinePosition get Ts mul /To exch def
  /UnderlineThickness get Ts mul /Tt exch def
  ux uy To add cs add moveto Tcx uy To add cs add lineto
  Tt setlinewidth stroke
  grestore
} bd
/SOE {
  /Tcx currentpoint pop def
  gsave
  newpath
  cf findfont cs scalefont dup
  /FontMatrix get 0 get /Ts exch def /FontInfo get dup
  /UnderlinePosition get Ts mul /To exch def
  /UnderlineThickness get Ts mul /Tt exch def
  ux uy To add cs 10 mul 26 idiv add moveto Tcx uy To add cs 10 mul 26 idiv add lineto
  Tt setlinewidth stroke
  grestore
} bd
/QT {
/Y22 exch store
/X22 exch store
/Y21 exch store
/X21 exch store
currentpoint
/Y21 load 2 mul add 3 div exch
/X21 load 2 mul add 3 div exch
/X21 load 2 mul /X22 load add 3 div
/Y21 load 2 mul /Y22 load add 3 div
/X22 load /Y22 load curveto
} bd
/SSPD {
dup length /d exch dict def
{
/v exch def
/k exch def
currentpagedevice k known {
/cpdv currentpagedevice k get def
v cpdv ne {
/upd false def
/nullv v type /nulltype eq def
/nullcpdv cpdv type /nulltype eq def
nullv nullcpdv or
{
/upd true def
} {
/sametype v type cpdv type eq def
sametype {
v type /arraytype eq {
/vlen v length def
/cpdvlen cpdv length def
vlen cpdvlen eq {
0 1 vlen 1 sub {
/i exch def
/obj v i get def
/cpdobj cpdv i get def
obj cpdobj ne {
/upd true def
exit
} if
} for
} {
/upd true def
} ifelse
} {
v type /dicttype eq {
v {
/dv exch def
/dk exch def
/cpddv cpdv dk get def
dv cpddv ne {
/upd true def
exit
} if
} forall
} {
/upd true def
} ifelse
} ifelse
} if
} ifelse
upd true eq {
d k v put
} if
} if
} if
} forall
d length 0 gt {
d setpagedevice
} if
} bd
/RE { % /NewFontName [NewEncodingArray] /FontName RE -
  findfont dup length dict begin
  {
    1 index /FID ne
    {def} {pop pop} ifelse
  } forall
  /Encoding exch def
  /FontName 1 index def
  currentdict definefont pop
  end
} bind def
%%EndResource
%%BeginResource: procset (Apache XML Graphics EPS ProcSet) 1.0 0
%%Version: 1.0 0
%%Copyright: (Copyright 2002-2003 The Apache Software Foundation. License terms: http://www.apache.org/licenses/LICENSE-2.0)
/BeginEPSF { %def
/b4_Inc_state save def         % Save state for cleanup
/dict_count countdictstack def % Count objects on dict stack
/op_count count 1 sub def      % Count objects on operand stack
userdict begin                 % Push userdict on dict stack
/showpage { } def              % Redefine showpage, { } = null proc
0 setgray 0 setlinecap         % Prepare graphics state
1 setlinewidth 0 setlinejoin
10 setmiterlimit [ ] 0 setdash newpath
/languagelevel where           % If level not equal to 1 then
{pop languagelevel             % set strokeadjust and
1 ne                           % overprint to their defaults.
{false setstrokeadjust false setoverprint
} if
} if
} bd
/EndEPSF { %def
count op_count sub {pop} repeat            % Clean up stacks
countdictstack dict_count sub {end} repeat
b4_Inc_state restore
} bd
%%EndResource
%FOPBeginFontDict
%%IncludeResource: font Courier-Oblique
%%IncludeResource: font Courier-BoldOblique
%%IncludeResource: font Courier-Bold
%%IncludeResource: font ZapfDingbats
%%IncludeResource: font Symbol
%%IncludeResource: font Helvetica
%%IncludeResource: font Helvetica-Oblique
%%IncludeResource: font Helvetica-Bold
%%IncludeResource: font Helvetica-BoldOblique
%%IncludeResource: font Times-Roman
%%IncludeResource: font Times-Italic
%%IncludeResource: font Times-Bold
%%IncludeResource: font Times-BoldItalic
%%IncludeResource: font Courier
%FOPEndFontDict
%%BeginResource: encoding WinAnsiEncoding
/WinAnsiEncoding [
/.notdef /.notdef /.notdef /.notdef /.notdef
/.notdef /.notdef /.notdef /.notdef /.notdef
/.notdef /.notdef /.notdef /.notdef /.notdef
/.notdef /.notdef /.notdef /.notdef /.notdef
/.notdef /.notdef /.notdef /.notdef /.notdef
/.notdef /.notdef /.notdef /.notdef /.notdef
/.notdef /.notdef /space /exclam /quotedbl
/numbersign /dollar /percent /ampersand /quotesingle
/parenleft /parenright /asterisk /plus /comma
/hyphen /period /slash /zero /one
/two /three /four /five /six
/seven /eight /nine /colon /semicolon
/less /equal /greater /question /at
/A /B /C /D /E
/F /G /H /I /J
/K /L /M /N /O
/P /Q /R /S /T
/U /V /W /X /Y
/Z /bracketleft /backslash /bracketright /asciicircum
/underscore /quoteleft /a /b /c
/d /e /f /g /h
/i /j /k /l /m
/n /o /p /q /r
/s /t /u /v /w
/x /y /z /braceleft /bar
/braceright /asciitilde /bullet /Euro /bullet
/quotesinglbase /florin /quotedblbase /ellipsis /dagger
/daggerdbl /circumflex /perthousand /Scaron /guilsinglleft
/OE /bullet /Zcaron /bullet /bullet
/quoteleft /quoteright /quotedblleft /quotedblright /bullet
/endash /emdash /asciitilde /trademark /scaron
/guilsinglright /oe /bullet /zcaron /Ydieresis
/space /exclamdown /cent /sterling /currency
/yen /brokenbar /section /dieresis /copyright
/ordfeminine /guillemotleft /logicalnot /sfthyphen /registered
/macron /degree /plusminus /twosuperior /threesuperior
/acute /mu /paragraph /middot /cedilla
/onesuperior /ordmasculine /guillemotright /onequarter /onehalf
/threequarters /questiondown /Agrave /Aacute /Acircumflex
/Atilde /Adieresis /Aring /AE /Ccedilla
/Egrave /Eacute /Ecircumflex /Edieresis /Igrave
/Iacute /Icircumflex /Idieresis /Eth /Ntilde
/Ograve /Oacute /Ocircumflex /Otilde /Odieresis
/multiply /Oslash /Ugrave /Uacute /Ucircumflex
/Udieresis /Yacute /Thorn /germandbls /agrave
/aacute /acircumflex /atilde /adieresis /aring
/ae /ccedilla /egrave /eacute /ecircumflex
/edieresis /igrave /iacute /icircumflex /idieresis
/eth /ntilde /ograve /oacute /ocircumflex
/otilde /odieresis /divide /oslash /ugrave
/uacute /ucircumflex /udieresis /yacute /thorn
/ydieresis
] def
%%EndResource
%FOPBeginFontReencode
/Courier-Oblique findfont
dup length dict begin
  {1 index /FID ne {def} {pop pop} ifelse} forall
  /Encoding WinAnsiEncoding def
  currentdict
end
/Courier-Oblique exch definefont pop
/Courier-BoldOblique findfont
dup length dict begin
  {1 index /FID ne {def} {pop pop} ifelse} forall
  /Encoding WinAnsiEncoding def
  currentdict
end
/Courier-BoldOblique exch definefont pop
/Courier-Bold findfont
dup length dict begin
  {1 index /FID ne {def} {pop pop} ifelse} forall
  /Encoding WinAnsiEncoding def
  currentdict
end
/Courier-Bold exch definefont pop
/Helvetica findfont
dup length dict begin
  {1 index /FID ne {def} {pop pop} ifelse} forall
  /Encoding WinAnsiEncoding def
  currentdict
end
/Helvetica exch definefont pop
/Helvetica-Oblique findfont
dup length dict begin
  {1 index /FID ne {def} {pop pop} ifelse} forall
  /Encoding WinAnsiEncoding def
  currentdict
end
/Helvetica-Oblique exch definefont pop
/Helvetica-Bold findfont
dup length dict begin
  {1 index /FID ne {def} {pop pop} ifelse} forall
  /Encoding WinAnsiEncoding def
  currentdict
end
/Helvetica-Bold exch definefont pop
/Helvetica-BoldOblique findfont
dup length dict begin
  {1 index /FID ne {def} {pop pop} ifelse} forall
  /Encoding WinAnsiEncoding def
  currentdict
end
/Helvetica-BoldOblique exch definefont pop
/Times-Roman findfont
dup length dict begin
  {1 index /FID ne {def} {pop pop} ifelse} forall
  /Encoding WinAnsiEncoding def
  currentdict
end
/Times-Roman exch definefont pop
/Times-Italic findfont
dup length dict begin
  {1 index /FID ne {def} {pop pop} ifelse} forall
  /Encoding WinAnsiEncoding def
  currentdict
end
/Times-Italic exch definefont pop
/Times-Bold findfont
dup length dict begin
  {1 index /FID ne {def} {pop pop} ifelse} forall
  /Encoding WinAnsiEncoding def
  currentdict
end
/Times-Bold exch definefont pop
/Times-BoldItalic findfont
dup length dict begin
  {1 index /FID ne {def} {pop pop} ifelse} forall
  /Encoding WinAnsiEncoding def
  currentdict
end
/Times-BoldItalic exch definefont pop
/Courier findfont
dup length dict begin
  {1 index /FID ne {def} {pop pop} ifelse} forall
  /Encoding WinAnsiEncoding def
  currentdict
end
/Courier exch definefont pop
%FOPEndFontReencode
%%EndProlog
%%Page: 1 1
%%PageBoundingBox: 0 0 375 375
%%BeginPageSetup
[1 0 0 -1 0 375] CT
%%EndPageSetup
GS
[0.375 0 0 0.375 0 0] CT
1 GC
N
0 0 1000 1000 re
f
GR
GS
[0.375 0 0 0.375 0 0] CT
1 GC
N
0 0 1000 1000 re
f
GR
GS
[0.375 0 0 0.375 0 0] CT
1 GC
N
107 881 M
920 881 L
920 40 L
107 40 L
cp
f
GR
GS
[0.375 0 0 0.375 0 0] CT
2 setlinecap
1 LJ
1.333 LW
N
107 881 M
920 881 L
S
GR
GS
[0.375 0 0 0.375 0 0] CT
2 setlinecap
1 LJ
1.333 LW
N
143.955 881 M
143.955 872.59 L
S
GR
GS
[0.375 0 0 0.375 0 0] CT
2 setlinecap
1 LJ
1.333 LW
N
328.727 881 M
328.727 872.59 L
S
GR
GS
[0.375 0 0 0.375 0 0] CT
2 setlinecap
1 LJ
1.333 LW
N
513.5 881 M
513.5 872.59 L
S
GR
GS
[0.375 0 0 0.375 0 0] CT
2 setlinecap
1 LJ
1.333 LW
N
698.273 881 M
698.273 872.59 L
S
GR
GS
[0.375 0 0 0.375 0 0] CT
2 setlinecap
1 LJ
1.333 LW
N
883.045 881 M
883.045 872.59 L
S
GR
GS
[0.375 0 0 0.375 53.98295 334.37501] CT
/Helvetica 26.667 F
GS
[1 0 0 1 0 0] CT
-7.5 27 moveto 
1 -1 scale
(1) t 
GR
GR
GS
[0.375 0 0 0.375 123.27272 334.37501] CT
/Helvetica 26.667 F
GS
[1 0 0 1 0 0] CT
-7.5 27 moveto 
1 -1 scale
(2) t 
GR
GR
GS
[0.375 0 0 0.375 192.5625 334.37501] CT
/Helvetica 26.667 F
GS
[1 0 0 1 0 0] CT
-7.5 27 moveto 
1 -1 scale
(3) t 
GR
GR
GS
[0.375 0 0 0.375 261.85226 334.37501] CT
/Helvetica 26.667 F
GS
[1 0 0 1 0 0] CT
-7.5 27 moveto 
1 -1 scale
(4) t 
GR
GR
GS
[0.375 0 0 0.375 331.14205 334.37501] CT
/Helvetica 26.667 F
GS
[1 0 0 1 0 0] CT
-7.5 27 moveto 
1 -1 scale
(5) t 
GR
GR
GS
[0.375 0 0 0.375 192.56264 347.74999] CT
/Helvetica 26.667 F
GS
[1 0 0 1 0 0] CT
-131.5 27 moveto 
1 -1 scale
(Time advantage gains) t 
GR
GR
GS
[0.375 0 0 0.375 0 0] CT
2 setlinecap
1 LJ
1.333 LW
N
107 881 M
107 40 L
S
GR
GS
[0.375 0 0 0.375 0 0] CT
2 setlinecap
1 LJ
1.333 LW
N
107 842.773 M
115.41 842.773 L
S
GR
GS
[0.375 0 0 0.375 0 0] CT
2 setlinecap
1 LJ
1.333 LW
N
107 78.227 M
115.41 78.227 L
S
GR
GS
[0.375 0 0 0.375 36.125 316.03976] CT
/Helvetica 26.667 F
GS
[1 0 0 1 0 0] CT
-15 10.5 moveto 
1 -1 scale
(0) t 
GR
GR
GS
[0.375 0 0 0.375 36.125 29.33523] CT
/Helvetica 26.667 F
GS
[1 0 0 1 0 0] CT
-15 10.5 moveto 
1 -1 scale
(1) t 
GR
GR
GS
[0 -0.375 0.375 0 27.5 172.68736] CT
/Helvetica 26.667 F
GS
[1 0 0 1 0 0] CT
-56 -6 moveto 
1 -1 scale
(p\(accept\)) t 
GR
GR
GS
[0.375 0 0 0.375 53.98295 48.44886] CT
N
6.667 0 M
6.667 -3.682 3.682 -6.667 0 -6.667 C
-3.682 -6.667 -6.667 -3.682 -6.667 0 C
-6.667 3.682 -3.682 6.667 0 6.667 C
3.682 6.667 6.667 3.682 6.667 0 C
cp
f
GR
GS
[0.375 0 0 0.375 123.27272 105.78977] CT
N
/f640454831{6.667 0 M
6.667 -3.682 3.682 -6.667 0 -6.667 C
-3.682 -6.667 -6.667 -3.682 -6.667 0 C
-6.667 3.682 -3.682 6.667 0 6.667 C
3.682 6.667 6.667 3.682 6.667 0 C
cp}def
f640454831
f
GR
GS
[0.375 0 0 0.375 192.5625 86.67613] CT
N
f640454831
f
GR
GS
[0.375 0 0 0.375 261.85226 48.44886] CT
N
f640454831
f
GR
GS
[0.375 0 0 0.375 331.14205 48.44886] CT
N
f640454831
f
GR
GS
[0.375 0 0 0.375 53.98295 278.31548] CT
N
f640454831
f
GR
GS
[0.375 0 0 0.375 123.27272 233.04634] CT
N
f640454831
f
GR
GS
[0.375 0 0 0.375 192.5625 207.55696] CT
N
f640454831
f
GR
GS
[0.375 0 0 0.375 261.85226 202.86692] CT
N
f640454831
f
GR
GS
[0.375 0 0 0.375 331.14205 142.50807] CT
N
f640454831
f
GR
GS
[0.375 0 0 0.375 53.98295 41.28126] CT
N
f640454831
f
GR
GS
[0.375 0 0 0.375 123.27272 41.28126] CT
N
f640454831
f
GR
GS
[0.375 0 0 0.375 192.5625 40.80341] CT
N
f640454831
f
GR
GS
[0.375 0 0 0.375 261.85226 53.22727] CT
N
f640454831
f
GR
GS
[0.375 0 0 0.375 331.14205 41.28126] CT
N
f640454831
f
GR
GS
[0.375 0 0 0.375 53.98295 196.57956] CT
N
f640454831
f
GR
GS
[0.375 0 0 0.375 123.27272 144.01704] CT
N
f640454831
f
GR
GS
[0.375 0 0 0.375 192.5625 124.9034] CT
N
f640454831
f
GR
GS
[0.375 0 0 0.375 261.85226 132.54887] CT
N
f640454831
f
GR
GS
[0.375 0 0 0.375 331.14205 89.06533] CT
N
f640454831
f
GR
GS
[0.375 0 0 0.375 53.98295 255.68092] CT
N
f640454831
f
GR
GS
[0.375 0 0 0.375 123.27272 248.13606] CT
N
f640454831
f
GR
GS
[0.375 0 0 0.375 192.5625 184.31066] CT
N
f640454831
f
GR
GS
[0.375 0 0 0.375 261.85226 157.59779] CT
N
f640454831
f
GR
GS
[0.375 0 0 0.375 331.14205 82.14923] CT
N
f640454831
f
GR
GS
[0.375 0 0 0.375 53.98295 223.28242] CT
N
f640454831
f
GR
GS
[0.375 0 0 0.375 123.27272 211.78356] CT
N
f640454831
f
GR
GS
[0.375 0 0 0.375 192.5625 197.98496] CT
N
f640454831
f
GR
GS
[0.375 0 0 0.375 261.85226 203.09555] CT
N
f640454831
f
GR
GS
[0.375 0 0 0.375 331.14205 122.09259] CT
N
f640454831
f
GR
GS
[0.375 0 0 0.375 53.98295 260.29166] CT
N
f640454831
f
GR
GS
[0.375 0 0 0.375 123.27272 260.29166] CT
N
f640454831
f
GR
GS
[0.375 0 0 0.375 192.5625 225.93262] CT
N
f640454831
f
GR
GS
[0.375 0 0 0.375 261.85226 260.29166] CT
N
f640454831
f
GR
GS
[0.375 0 0 0.375 331.14205 244.36363] CT
N
f640454831
f
GR
GS
[0.375 0 0 0.375 53.98295 51.9698] CT
N
f640454831
f
GR
GS
[0.375 0 0 0.375 123.27272 83.57663] CT
N
f640454831
f
GR
GS
[0.375 0 0 0.375 192.5625 89.69407] CT
N
f640454831
f
GR
GS
[0.375 0 0 0.375 261.85226 99.07416] CT
N
f640454831
f
GR
GS
[0.375 0 0 0.375 331.14205 104.7838] CT
N
f640454831
f
GR
GS
[0.375 0 0 0.375 53.98295 316.03976] CT
N
f640454831
f
GR
GS
[0.375 0 0 0.375 123.27272 77.11933] CT
N
f640454831
f
GR
GS
[0.375 0 0 0.375 192.5625 144.01704] CT
N
f640454831
f
GR
GS
[0.375 0 0 0.375 261.85226 220.4716] CT
N
f640454831
f
GR
GS
[0.375 0 0 0.375 331.14205 258.69887] CT
N
f640454831
f
GR
GS
[0.375 0 0 0.375 53.98295 101.01137] CT
N
f640454831
f
GR
GS
[0.375 0 0 0.375 123.27272 140.83144] CT
N
f640454831
f
GR
GS
[0.375 0 0 0.375 192.5625 122.32048] CT
N
f640454831
f
GR
GS
[0.375 0 0 0.375 261.85226 101.01137] CT
N
f640454831
f
GR
GS
[0.375 0 0 0.375 331.14205 77.11933] CT
N
f640454831
f
GR
GS
[0.375 0 0 0.375 53.98295 268.25569] CT
N
f640454831
f
GR
GS
[0.375 0 0 0.375 123.27272 228.43561] CT
N
f640454831
f
GR
GS
[0.375 0 0 0.375 192.5625 223.05453] CT
N
f640454831
f
GR
GS
[0.375 0 0 0.375 261.85226 236.39962] CT
N
f640454831
f
GR
GS
[0.375 0 0 0.375 331.14205 204.54355] CT
N
f640454831
f
GR
GS
[0.375 0 0 0.375 53.98295 230.80328] CT
N
f640454831
f
GR
GS
[0.375 0 0 0.375 123.27272 187.77721] CT
N
f640454831
f
GR
GS
[0.375 0 0 0.375 192.5625 199.80821] CT
N
f640454831
f
GR
GS
[0.375 0 0 0.375 261.85226 172.6875] CT
N
f640454831
f
GR
GS
[0.375 0 0 0.375 331.14205 184.31066] CT
N
f640454831
f
GR
GS
[0.375 0 0 0.375 53.98295 98.14433] CT
N
f640454831
f
GR
GS
[0.375 0 0 0.375 123.27272 124.9034] CT
N
f640454831
f
GR
GS
[0.375 0 0 0.375 192.5625 109.6125] CT
N
f640454831
f
GR
GS
[0.375 0 0 0.375 261.85226 112.9574] CT
N
f640454831
f
GR
GS
[0.375 0 0 0.375 331.14205 52.27159] CT
N
f640454831
f
GR
GS
[0.375 0 0 0.375 53.98295 165.14264] CT
N
f640454831
f
GR
GS
[0.375 0 0 0.375 123.27272 142.50807] CT
N
f640454831
f
GR
GS
[0.375 0 0 0.375 192.5625 150.05293] CT
N
f640454831
f
GR
GS
[0.375 0 0 0.375 261.85226 202.86692] CT
N
f640454831
f
GR
GS
[0.375 0 0 0.375 331.14205 210.41178] CT
N
f640454831
f
GR
GS
[0.375 0 0 0.375 53.98295 161.06435] CT
N
f640454831
f
GR
GS
[0.375 0 0 0.375 123.27272 180.65152] CT
N
f640454831
f
GR
GS
[0.375 0 0 0.375 192.5625 153.31557] CT
N
f640454831
f
GR
GS
[0.375 0 0 0.375 261.85226 156.75946] CT
N
f640454831
f
GR
GS
[0.375 0 0 0.375 331.14205 161.06435] CT
N
f640454831
f
GR
GS
[0.375 0 0 0.375 53.98295 124.9034] CT
N
f640454831
f
GR
GS
[0.375 0 0 0.375 123.27272 128.19887] CT
N
f640454831
f
GR
GS
[0.375 0 0 0.375 192.5625 105.78977] CT
N
f640454831
f
GR
GS
[0.375 0 0 0.375 261.85226 167.74433] CT
N
f640454831
f
GR
GS
[0.375 0 0 0.375 331.14205 124.9034] CT
N
f640454831
f
GR
GS
[0.375 0 0 0.375 53.98295 304.09376] CT
N
f640454831
f
GR
GS
[0.375 0 0 0.375 123.27272 224.29431] CT
N
f640454831
f
GR
GS
[0.375 0 0 0.375 192.5625 148.79546] CT
N
f640454831
f
GR
GS
[0.375 0 0 0.375 261.85226 98.14433] CT
N
f640454831
f
GR
GS
[0.375 0 0 0.375 331.14205 53.22727] CT
N
f640454831
f
GR
GS
[0.375 0 0 0.375 53.98295 240.5912] CT
N
f640454831
f
GR
GS
[0.375 0 0 0.375 123.27272 248.13606] CT
N
f640454831
f
GR
GS
[0.375 0 0 0.375 192.5625 192.05942] CT
N
f640454831
f
GR
GS
[0.375 0 0 0.375 261.85226 150.05293] CT
N
f640454831
f
GR
GS
[0.375 0 0 0.375 331.14205 97.23894] CT
N
f640454831
f
GR
GS
[0.375 0 0 0.375 53.98295 180.23235] CT
N
f640454831
f
GR
GS
[0.375 0 0 0.375 123.27272 172.6875] CT
N
f640454831
f
GR
GS
[0.375 0 0 0.375 192.5625 180.23235] CT
N
f640454831
f
GR
GS
[0.375 0 0 0.375 261.85226 201.35795] CT
N
f640454831
f
GR
GS
[0.375 0 0 0.375 331.14205 165.14264] CT
N
f640454831
f
GR
GS
[0.375 0 0 0.375 53.98295 193.1664] CT
N
f640454831
f
GR
GS
[0.375 0 0 0.375 123.27272 181.11999] CT
N
f640454831
f
GR
GS
[0.375 0 0 0.375 192.5625 160.40015] CT
N
f640454831
f
GR
GS
[0.375 0 0 0.375 261.85226 197.98496] CT
N
f640454831
f
GR
GS
[0.375 0 0 0.375 331.14205 184.97484] CT
N
f640454831
f
GR
GS
[0.375 0 0 0.375 53.98295 161.06435] CT
N
f640454831
f
GR
GS
[0.375 0 0 0.375 123.27272 161.06435] CT
N
f640454831
f
GR
GS
[0.375 0 0 0.375 192.5625 161.06435] CT
N
f640454831
f
GR
GS
[0.375 0 0 0.375 261.85226 161.06435] CT
N
f640454831
f
GR
GS
[0.375 0 0 0.375 331.14205 207.55696] CT
N
f640454831
f
GR
GS
[0.375 0 0 0.375 53.98295 62.41653] CT
N
f640454831
f
GR
GS
[0.375 0 0 0.375 123.27272 62.41653] CT
N
f640454831
f
GR
GS
[0.375 0 0 0.375 192.5625 51.38942] CT
N
f640454831
f
GR
GS
[0.375 0 0 0.375 261.85226 29.33523] CT
N
f640454831
f
GR
GS
[0.375 0 0 0.375 331.14205 51.38942] CT
N
f640454831
f
GR
GS
[0.375 0 0 0.375 53.98295 75.82786] CT
N
f640454831
f
GR
GS
[0.375 0 0 0.375 123.27272 51.9698] CT
N
f640454831
f
GR
GS
[0.375 0 0 0.375 192.5625 91.3254] CT
N
f640454831
f
GR
GS
[0.375 0 0 0.375 261.85226 29.33523] CT
N
f640454831
f
GR
GS
[0.375 0 0 0.375 331.14205 37.08399] CT
N
f640454831
f
GR
GS
[0.375 0 0 0.375 53.98295 96.79511] CT
N
f640454831
f
GR
GS
[0.375 0 0 0.375 123.27272 53.9099] CT
N
f640454831
f
GR
GS
[0.375 0 0 0.375 192.5625 46.2002] CT
N
f640454831
f
GR
GS
[0.375 0 0 0.375 261.85226 62.10146] CT
N
f640454831
f
GR
GS
[0.375 0 0 0.375 331.14205 46.2002] CT
N
f640454831
f
GR
GS
[0.375 0 0 0.375 53.98295 109.6125] CT
N
f640454831
f
GR
GS
[0.375 0 0 0.375 123.27272 65.1733] CT
N
f640454831
f
GR
GS
[0.375 0 0 0.375 192.5625 132.54887] CT
N
f640454831
f
GR
GS
[0.375 0 0 0.375 261.85226 136.84943] CT
N
f640454831
f
GR
GS
[0.375 0 0 0.375 331.14205 166.95341] CT
N
f640454831
f
GR
GS
[0.375 0 0 0.375 53.98295 29.33523] CT
N
f640454831
f
GR
GS
[0.375 0 0 0.375 123.27272 70.29302] CT
N
f640454831
f
GR
GS
[0.375 0 0 0.375 192.5625 115.34659] CT
N
f640454831
f
GR
GS
[0.375 0 0 0.375 261.85226 83.94561] CT
N
f640454831
f
GR
GS
[0.375 0 0 0.375 331.14205 29.33523] CT
N
f640454831
f
GR
GS
[0.375 0 0 0.375 53.98295 172.6875] CT
N
f640454831
f
GR
GS
[0.375 0 0 0.375 123.27272 121.08068] CT
N
f640454831
f
GR
GS
[0.375 0 0 0.375 192.5625 128.57911] CT
N
f640454831
f
GR
GS
[0.375 0 0 0.375 261.85226 178.4216] CT
N
f640454831
f
GR
GS
[0.375 0 0 0.375 331.14205 161.6604] CT
N
f640454831
f
GR
GS
[0.375 0 0 0.375 53.98295 153.31557] CT
N
f640454831
f
GR
GS
[0.375 0 0 0.375 123.27272 114.57171] CT
N
f640454831
f
GR
GS
[0.375 0 0 0.375 192.5625 119.8735] CT
N
f640454831
f
GR
GS
[0.375 0 0 0.375 261.85226 137.81803] CT
N
f640454831
f
GR
GS
[0.375 0 0 0.375 331.14205 122.32048] CT
N
f640454831
f
GR
GS
[0.375 0 0 0.375 53.98295 108.42614] CT
N
f640454831
f
GR
GS
[0.375 0 0 0.375 123.27272 49.10795] CT
N
f640454831
f
GR
GS
[0.375 0 0 0.375 192.5625 77.11933] CT
N
f640454831
f
GR
GS
[0.375 0 0 0.375 261.85226 49.10795] CT
N
f640454831
f
GR
GS
[0.375 0 0 0.375 331.14205 98.53978] CT
N
f640454831
f
GR
GS
[0.375 0 0 0.375 53.98295 214.30591] CT
N
f640454831
f
GR
GS
[0.375 0 0 0.375 123.27272 172.6875] CT
N
f640454831
f
GR
GS
[0.375 0 0 0.375 192.5625 158.8147] CT
N
f640454831
f
GR
GS
[0.375 0 0 0.375 261.85226 191.80114] CT
N
f640454831
f
GR
GS
[0.375 0 0 0.375 331.14205 251.30003] CT
N
f640454831
f
GR
GS
[0.375 0 0 0.375 53.98295 57.08084] CT
N
f640454831
f
GR
GS
[0.375 0 0 0.375 123.27272 66.32936] CT
N
f640454831
f
GR
GS
[0.375 0 0 0.375 192.5625 29.33523] CT
N
f640454831
f
GR
GS
[0.375 0 0 0.375 261.85226 38.58377] CT
N
f640454831
f
GR
GS
[0.375 0 0 0.375 331.14205 29.33523] CT
N
f640454831
f
GR
GS
[0.375 0 0 0.375 53.98295 72.3409] CT
N
f640454831
f
GR
GS
[0.375 0 0 0.375 123.27272 104.7838] CT
N
f640454831
f
GR
GS
[0.375 0 0 0.375 192.5625 86.67613] CT
N
f640454831
f
GR
GS
[0.375 0 0 0.375 261.85226 29.33523] CT
N
f640454831
f
GR
GS
[0.375 0 0 0.375 331.14205 72.3409] CT
N
f640454831
f
GR
GS
[0.375 0 0 0.375 53.98295 147.39004] CT
N
f640454831
f
GR
GS
[0.375 0 0 0.375 123.27272 138.95755] CT
N
f640454831
f
GR
GS
[0.375 0 0 0.375 192.5625 164.255] CT
N
f640454831
f
GR
GS
[0.375 0 0 0.375 261.85226 155.82253] CT
N
f640454831
f
GR
GS
[0.375 0 0 0.375 331.14205 122.09259] CT
N
f640454831
f
GR
GS
[0.375 0 0 0.375 53.98295 112.32866] CT
N
f640454831
f
GR
GS
[0.375 0 0 0.375 123.27272 112.32866] CT
N
f640454831
f
GR
GS
[0.375 0 0 0.375 192.5625 137.81803] CT
N
f640454831
f
GR
GS
[0.375 0 0 0.375 261.85226 127.41836] CT
N
f640454831
f
GR
GS
[0.375 0 0 0.375 331.14205 134.96323] CT
N
f640454831
f
GR
GS
[0.375 0 0 0.375 53.98295 132.54887] CT
N
f640454831
f
GR
GS
[0.375 0 0 0.375 123.27272 161.6604] CT
N
f640454831
f
GR
GS
[0.375 0 0 0.375 192.5625 121.08068] CT
N
f640454831
f
GR
GS
[0.375 0 0 0.375 261.85226 117.55201] CT
N
f640454831
f
GR
GS
[0.375 0 0 0.375 331.14205 132.54887] CT
N
f640454831
f
GR
GS
[0.375 0 0 0.375 53.98295 144.01704] CT
N
f640454831
f
GR
GS
[0.375 0 0 0.375 123.27272 201.35795] CT
N
f640454831
f
GR
GS
[0.375 0 0 0.375 192.5625 133.59143] CT
N
f640454831
f
GR
GS
[0.375 0 0 0.375 261.85226 58.00569] CT
N
f640454831
f
GR
GS
[0.375 0 0 0.375 331.14205 115.34659] CT
N
f640454831
f
GR
GS
[0.375 0 0 0.375 53.98295 247.23067] CT
N
f640454831
f
GR
GS
[0.375 0 0 0.375 123.27272 224.29431] CT
N
f640454831
f
GR
GS
[0.375 0 0 0.375 192.5625 244.36363] CT
N
f640454831
f
GR
GS
[0.375 0 0 0.375 261.85226 270.16704] CT
N
f640454831
f
GR
GS
[0.375 0 0 0.375 331.14205 201.35795] CT
N
f640454831
f
GR
GS
[0.375 0 0 0.375 53.98295 172.6875] CT
N
f640454831
f
GR
GS
[0.375 0 0 0.375 123.27272 148.79546] CT
N
f640454831
f
GR
GS
[0.375 0 0 0.375 192.5625 136.84943] CT
N
f640454831
f
GR
GS
[0.375 0 0 0.375 261.85226 172.6875] CT
N
f640454831
f
GR
GS
[0.375 0 0 0.375 331.14205 184.63352] CT
N
f640454831
f
GR
GS
[0.375 0 0 0.375 53.98295 158.12394] CT
N
f640454831
f
GR
GS
[0.375 0 0 0.375 123.27272 143.29915] CT
N
f640454831
f
GR
GS
[0.375 0 0 0.375 192.5625 136.40926] CT
N
f640454831
f
GR
GS
[0.375 0 0 0.375 261.85226 136.97215] CT
N
f640454831
f
GR
GS
[0.375 0 0 0.375 331.14205 126.6726] CT
N
f640454831
f
GR
GS
[0.375 0 0 0.375 0 0] CT
1 LJ
4 LW
N
143.955 490.855 M
143.955 352.473 L
S
GR
GS
[0.375 0 0 0.375 0 0] CT
1 LJ
4 LW
N
132.406 352.473 M
155.503 352.473 L
S
GR
GS
[0.375 0 0 0.375 0 0] CT
1 LJ
4 LW
N
132.406 490.855 M
155.503 490.855 L
S
GR
GS
[0.375 0 0 0.375 0 0] CT
1 LJ
4 LW
N
328.727 438.419 M
328.727 325.843 L
S
GR
GS
[0.375 0 0 0.375 0 0] CT
1 LJ
4 LW
N
317.179 325.843 M
340.276 325.843 L
S
GR
GS
[0.375 0 0 0.375 0 0] CT
1 LJ
4 LW
N
317.179 438.419 M
340.276 438.419 L
S
GR
GS
[0.375 0 0 0.375 0 0] CT
1 LJ
4 LW
N
513.5 409.819 M
513.5 317.697 L
S
GR
GS
[0.375 0 0 0.375 0 0] CT
1 LJ
4 LW
N
501.952 317.697 M
525.048 317.697 L
S
GR
GS
[0.375 0 0 0.375 0 0] CT
1 LJ
4 LW
N
501.952 409.819 M
525.048 409.819 L
S
GR
GS
[0.375 0 0 0.375 0 0] CT
1 LJ
4 LW
N
698.273 424.293 M
698.273 306.225 L
S
GR
GS
[0.375 0 0 0.375 0 0] CT
1 LJ
4 LW
N
686.724 306.225 M
709.821 306.225 L
S
GR
GS
[0.375 0 0 0.375 0 0] CT
1 LJ
4 LW
N
686.724 424.293 M
709.821 424.293 L
S
GR
GS
[0.375 0 0 0.375 0 0] CT
1 LJ
4 LW
N
883.045 395.89 M
883.045 279.698 L
S
GR
GS
[0.375 0 0 0.375 0 0] CT
1 LJ
4 LW
N
871.497 279.698 M
894.594 279.698 L
S
GR
GS
[0.375 0 0 0.375 0 0] CT
1 LJ
4 LW
N
871.497 395.89 M
894.594 395.89 L
S
GR
%%Trailer
%%Pages: 1
%%EOF
