%!PS-Adobe-3.0 EPSF-3.0
%%Creator: (MATLAB, The Mathworks, Inc. Version 9.7.0.1261785 \(R2019b\) Update 3. Operating System: Windows 10)
%%Title: C:/Users/Clarissa/Documents/decid_eye/analysis/manip1&2/1_pipeline/fixations/3_f_fixation_behav/plots/lvl2_all/nFixByUtil.eps
%%CreationDate: 2021-04-19T12:26:47
%%Pages: (atend)
%%BoundingBox:    17    14   346   361
%%LanguageLevel: 3
%%EndComments
%%BeginProlog
%%BeginResource: procset (Apache XML Graphics Std ProcSet) 1.2 0
%%Version: 1.2 0
%%Copyright: (Copyright 2001-2003,2010 The Apache Software Foundation. License terms: http://www.apache.org/licenses/LICENSE-2.0)
/bd{bind def}bind def
/ld{load def}bd
/GR/grestore ld
/GS/gsave ld
/RM/rmoveto ld
/C/curveto ld
/t/show ld
/L/lineto ld
/ML/setmiterlimit ld
/CT/concat ld
/f/fill ld
/N/newpath ld
/S/stroke ld
/CC/setcmykcolor ld
/A/ashow ld
/cp/closepath ld
/RC/setrgbcolor ld
/LJ/setlinejoin ld
/GC/setgray ld
/LW/setlinewidth ld
/M/moveto ld
/re {4 2 roll M
1 index 0 rlineto
0 exch rlineto
neg 0 rlineto
cp } bd
/_ctm matrix def
/_tm matrix def
/BT { _ctm currentmatrix pop matrix _tm copy pop 0 0 moveto } bd
/ET { _ctm setmatrix } bd
/iTm { _ctm setmatrix _tm concat } bd
/Tm { _tm astore pop iTm 0 0 moveto } bd
/ux 0.0 def
/uy 0.0 def
/F {
  /Tp exch def
  /Tf exch def
  Tf findfont Tp scalefont setfont
  /cf Tf def  /cs Tp def
} bd
/ULS {currentpoint /uy exch def /ux exch def} bd
/ULE {
  /Tcx currentpoint pop def
  gsave
  newpath
  cf findfont cs scalefont dup
  /FontMatrix get 0 get /Ts exch def /FontInfo get dup
  /UnderlinePosition get Ts mul /To exch def
  /UnderlineThickness get Ts mul /Tt exch def
  ux uy To add moveto  Tcx uy To add lineto
  Tt setlinewidth stroke
  grestore
} bd
/OLE {
  /Tcx currentpoint pop def
  gsave
  newpath
  cf findfont cs scalefont dup
  /FontMatrix get 0 get /Ts exch def /FontInfo get dup
  /UnderlinePosition get Ts mul /To exch def
  /UnderlineThickness get Ts mul /Tt exch def
  ux uy To add cs add moveto Tcx uy To add cs add lineto
  Tt setlinewidth stroke
  grestore
} bd
/SOE {
  /Tcx currentpoint pop def
  gsave
  newpath
  cf findfont cs scalefont dup
  /FontMatrix get 0 get /Ts exch def /FontInfo get dup
  /UnderlinePosition get Ts mul /To exch def
  /UnderlineThickness get Ts mul /Tt exch def
  ux uy To add cs 10 mul 26 idiv add moveto Tcx uy To add cs 10 mul 26 idiv add lineto
  Tt setlinewidth stroke
  grestore
} bd
/QT {
/Y22 exch store
/X22 exch store
/Y21 exch store
/X21 exch store
currentpoint
/Y21 load 2 mul add 3 div exch
/X21 load 2 mul add 3 div exch
/X21 load 2 mul /X22 load add 3 div
/Y21 load 2 mul /Y22 load add 3 div
/X22 load /Y22 load curveto
} bd
/SSPD {
dup length /d exch dict def
{
/v exch def
/k exch def
currentpagedevice k known {
/cpdv currentpagedevice k get def
v cpdv ne {
/upd false def
/nullv v type /nulltype eq def
/nullcpdv cpdv type /nulltype eq def
nullv nullcpdv or
{
/upd true def
} {
/sametype v type cpdv type eq def
sametype {
v type /arraytype eq {
/vlen v length def
/cpdvlen cpdv length def
vlen cpdvlen eq {
0 1 vlen 1 sub {
/i exch def
/obj v i get def
/cpdobj cpdv i get def
obj cpdobj ne {
/upd true def
exit
} if
} for
} {
/upd true def
} ifelse
} {
v type /dicttype eq {
v {
/dv exch def
/dk exch def
/cpddv cpdv dk get def
dv cpddv ne {
/upd true def
exit
} if
} forall
} {
/upd true def
} ifelse
} ifelse
} if
} ifelse
upd true eq {
d k v put
} if
} if
} if
} forall
d length 0 gt {
d setpagedevice
} if
} bd
/RE { % /NewFontName [NewEncodingArray] /FontName RE -
  findfont dup length dict begin
  {
    1 index /FID ne
    {def} {pop pop} ifelse
  } forall
  /Encoding exch def
  /FontName 1 index def
  currentdict definefont pop
  end
} bind def
%%EndResource
%%BeginResource: procset (Apache XML Graphics EPS ProcSet) 1.0 0
%%Version: 1.0 0
%%Copyright: (Copyright 2002-2003 The Apache Software Foundation. License terms: http://www.apache.org/licenses/LICENSE-2.0)
/BeginEPSF { %def
/b4_Inc_state save def         % Save state for cleanup
/dict_count countdictstack def % Count objects on dict stack
/op_count count 1 sub def      % Count objects on operand stack
userdict begin                 % Push userdict on dict stack
/showpage { } def              % Redefine showpage, { } = null proc
0 setgray 0 setlinecap         % Prepare graphics state
1 setlinewidth 0 setlinejoin
10 setmiterlimit [ ] 0 setdash newpath
/languagelevel where           % If level not equal to 1 then
{pop languagelevel             % set strokeadjust and
1 ne                           % overprint to their defaults.
{false setstrokeadjust false setoverprint
} if
} if
} bd
/EndEPSF { %def
count op_count sub {pop} repeat            % Clean up stacks
countdictstack dict_count sub {end} repeat
b4_Inc_state restore
} bd
%%EndResource
%FOPBeginFontDict
%%IncludeResource: font Courier-Oblique
%%IncludeResource: font Courier-BoldOblique
%%IncludeResource: font Courier-Bold
%%IncludeResource: font ZapfDingbats
%%IncludeResource: font Symbol
%%IncludeResource: font Helvetica
%%IncludeResource: font Helvetica-Oblique
%%IncludeResource: font Helvetica-Bold
%%IncludeResource: font Helvetica-BoldOblique
%%IncludeResource: font Times-Roman
%%IncludeResource: font Times-Italic
%%IncludeResource: font Times-Bold
%%IncludeResource: font Times-BoldItalic
%%IncludeResource: font Courier
%FOPEndFontDict
%%BeginResource: encoding WinAnsiEncoding
/WinAnsiEncoding [
/.notdef /.notdef /.notdef /.notdef /.notdef
/.notdef /.notdef /.notdef /.notdef /.notdef
/.notdef /.notdef /.notdef /.notdef /.notdef
/.notdef /.notdef /.notdef /.notdef /.notdef
/.notdef /.notdef /.notdef /.notdef /.notdef
/.notdef /.notdef /.notdef /.notdef /.notdef
/.notdef /.notdef /space /exclam /quotedbl
/numbersign /dollar /percent /ampersand /quotesingle
/parenleft /parenright /asterisk /plus /comma
/hyphen /period /slash /zero /one
/two /three /four /five /six
/seven /eight /nine /colon /semicolon
/less /equal /greater /question /at
/A /B /C /D /E
/F /G /H /I /J
/K /L /M /N /O
/P /Q /R /S /T
/U /V /W /X /Y
/Z /bracketleft /backslash /bracketright /asciicircum
/underscore /quoteleft /a /b /c
/d /e /f /g /h
/i /j /k /l /m
/n /o /p /q /r
/s /t /u /v /w
/x /y /z /braceleft /bar
/braceright /asciitilde /bullet /Euro /bullet
/quotesinglbase /florin /quotedblbase /ellipsis /dagger
/daggerdbl /circumflex /perthousand /Scaron /guilsinglleft
/OE /bullet /Zcaron /bullet /bullet
/quoteleft /quoteright /quotedblleft /quotedblright /bullet
/endash /emdash /asciitilde /trademark /scaron
/guilsinglright /oe /bullet /zcaron /Ydieresis
/space /exclamdown /cent /sterling /currency
/yen /brokenbar /section /dieresis /copyright
/ordfeminine /guillemotleft /logicalnot /sfthyphen /registered
/macron /degree /plusminus /twosuperior /threesuperior
/acute /mu /paragraph /middot /cedilla
/onesuperior /ordmasculine /guillemotright /onequarter /onehalf
/threequarters /questiondown /Agrave /Aacute /Acircumflex
/Atilde /Adieresis /Aring /AE /Ccedilla
/Egrave /Eacute /Ecircumflex /Edieresis /Igrave
/Iacute /Icircumflex /Idieresis /Eth /Ntilde
/Ograve /Oacute /Ocircumflex /Otilde /Odieresis
/multiply /Oslash /Ugrave /Uacute /Ucircumflex
/Udieresis /Yacute /Thorn /germandbls /agrave
/aacute /acircumflex /atilde /adieresis /aring
/ae /ccedilla /egrave /eacute /ecircumflex
/edieresis /igrave /iacute /icircumflex /idieresis
/eth /ntilde /ograve /oacute /ocircumflex
/otilde /odieresis /divide /oslash /ugrave
/uacute /ucircumflex /udieresis /yacute /thorn
/ydieresis
] def
%%EndResource
%FOPBeginFontReencode
/Courier-Oblique findfont
dup length dict begin
  {1 index /FID ne {def} {pop pop} ifelse} forall
  /Encoding WinAnsiEncoding def
  currentdict
end
/Courier-Oblique exch definefont pop
/Courier-BoldOblique findfont
dup length dict begin
  {1 index /FID ne {def} {pop pop} ifelse} forall
  /Encoding WinAnsiEncoding def
  currentdict
end
/Courier-BoldOblique exch definefont pop
/Courier-Bold findfont
dup length dict begin
  {1 index /FID ne {def} {pop pop} ifelse} forall
  /Encoding WinAnsiEncoding def
  currentdict
end
/Courier-Bold exch definefont pop
/Helvetica findfont
dup length dict begin
  {1 index /FID ne {def} {pop pop} ifelse} forall
  /Encoding WinAnsiEncoding def
  currentdict
end
/Helvetica exch definefont pop
/Helvetica-Oblique findfont
dup length dict begin
  {1 index /FID ne {def} {pop pop} ifelse} forall
  /Encoding WinAnsiEncoding def
  currentdict
end
/Helvetica-Oblique exch definefont pop
/Helvetica-Bold findfont
dup length dict begin
  {1 index /FID ne {def} {pop pop} ifelse} forall
  /Encoding WinAnsiEncoding def
  currentdict
end
/Helvetica-Bold exch definefont pop
/Helvetica-BoldOblique findfont
dup length dict begin
  {1 index /FID ne {def} {pop pop} ifelse} forall
  /Encoding WinAnsiEncoding def
  currentdict
end
/Helvetica-BoldOblique exch definefont pop
/Times-Roman findfont
dup length dict begin
  {1 index /FID ne {def} {pop pop} ifelse} forall
  /Encoding WinAnsiEncoding def
  currentdict
end
/Times-Roman exch definefont pop
/Times-Italic findfont
dup length dict begin
  {1 index /FID ne {def} {pop pop} ifelse} forall
  /Encoding WinAnsiEncoding def
  currentdict
end
/Times-Italic exch definefont pop
/Times-Bold findfont
dup length dict begin
  {1 index /FID ne {def} {pop pop} ifelse} forall
  /Encoding WinAnsiEncoding def
  currentdict
end
/Times-Bold exch definefont pop
/Times-BoldItalic findfont
dup length dict begin
  {1 index /FID ne {def} {pop pop} ifelse} forall
  /Encoding WinAnsiEncoding def
  currentdict
end
/Times-BoldItalic exch definefont pop
/Courier findfont
dup length dict begin
  {1 index /FID ne {def} {pop pop} ifelse} forall
  /Encoding WinAnsiEncoding def
  currentdict
end
/Courier exch definefont pop
%FOPEndFontReencode
%%EndProlog
%%Page: 1 1
%%PageBoundingBox: 0 0 375 375
%%BeginPageSetup
[1 0 0 -1 0 375] CT
%%EndPageSetup
GS
[0.375 0 0 0.375 0 0] CT
1 GC
N
0 0 1000 1000 re
f
GR
GS
[0.375 0 0 0.375 0 0] CT
1 GC
N
0 0 1000 1000 re
f
GR
GS
[0.375 0 0 0.375 0 0] CT
1 GC
N
107 881 M
920 881 L
920 40 L
107 40 L
cp
f
GR
GS
[0.375 0 0 0.375 0 0] CT
2 setlinecap
1 LJ
1.333 LW
N
107 881 M
920 881 L
S
GR
GS
[0.375 0 0 0.375 0 0] CT
2 setlinecap
1 LJ
1.333 LW
N
143.955 881 M
143.955 872.59 L
S
GR
GS
[0.375 0 0 0.375 0 0] CT
2 setlinecap
1 LJ
1.333 LW
N
328.727 881 M
328.727 872.59 L
S
GR
GS
[0.375 0 0 0.375 0 0] CT
2 setlinecap
1 LJ
1.333 LW
N
513.5 881 M
513.5 872.59 L
S
GR
GS
[0.375 0 0 0.375 0 0] CT
2 setlinecap
1 LJ
1.333 LW
N
698.273 881 M
698.273 872.59 L
S
GR
GS
[0.375 0 0 0.375 0 0] CT
2 setlinecap
1 LJ
1.333 LW
N
883.045 881 M
883.045 872.59 L
S
GR
GS
[0.375 0 0 0.375 53.98295 334.37501] CT
/Helvetica 26.667 F
GS
[1 0 0 1 0 0] CT
-19 27 moveto 
1 -1 scale
(20 ) t 
GR
GR
GS
[0.375 0 0 0.375 123.27272 334.37501] CT
/Helvetica 26.667 F
GS
[1 0 0 1 0 0] CT
-19 27 moveto 
1 -1 scale
(40 ) t 
GR
GR
GS
[0.375 0 0 0.375 192.5625 334.37501] CT
/Helvetica 26.667 F
GS
[1 0 0 1 0 0] CT
-19 27 moveto 
1 -1 scale
(60 ) t 
GR
GR
GS
[0.375 0 0 0.375 261.85226 334.37501] CT
/Helvetica 26.667 F
GS
[1 0 0 1 0 0] CT
-19 27 moveto 
1 -1 scale
(80 ) t 
GR
GR
GS
[0.375 0 0 0.375 331.14205 334.37501] CT
/Helvetica 26.667 F
GS
[1 0 0 1 0 0] CT
-22.5 27 moveto 
1 -1 scale
(100) t 
GR
GR
GS
[0.375 0 0 0.375 192.56264 347.74999] CT
/Helvetica 26.667 F
GS
[1 0 0 1 0 0] CT
-121 27 moveto 
1 -1 scale
(|Utility|, percent rank) t 
GR
GR
GS
[0.375 0 0 0.375 0 0] CT
2 setlinecap
1 LJ
1.333 LW
N
107 881 M
107 40 L
S
GR
GS
[0.375 0 0 0.375 0 0] CT
2 setlinecap
1 LJ
1.333 LW
N
107 862.492 M
115.41 862.492 L
S
GR
GS
[0.375 0 0 0.375 0 0] CT
2 setlinecap
1 LJ
1.333 LW
N
107 749.105 M
115.41 749.105 L
S
GR
GS
[0.375 0 0 0.375 0 0] CT
2 setlinecap
1 LJ
1.333 LW
N
107 635.717 M
115.41 635.717 L
S
GR
GS
[0.375 0 0 0.375 0 0] CT
2 setlinecap
1 LJ
1.333 LW
N
107 522.329 M
115.41 522.329 L
S
GR
GS
[0.375 0 0 0.375 0 0] CT
2 setlinecap
1 LJ
1.333 LW
N
107 408.941 M
115.41 408.941 L
S
GR
GS
[0.375 0 0 0.375 0 0] CT
2 setlinecap
1 LJ
1.333 LW
N
107 295.554 M
115.41 295.554 L
S
GR
GS
[0.375 0 0 0.375 36.125 323.43462] CT
/Helvetica 26.667 F
GS
[1 0 0 1 0 0] CT
-15 10.5 moveto 
1 -1 scale
(0) t 
GR
GR
GS
[0.375 0 0 0.375 36.125 280.91423] CT
/Helvetica 26.667 F
GS
[1 0 0 1 0 0] CT
-15 10.5 moveto 
1 -1 scale
(1) t 
GR
GR
GS
[0.375 0 0 0.375 36.125 238.39384] CT
/Helvetica 26.667 F
GS
[1 0 0 1 0 0] CT
-15 10.5 moveto 
1 -1 scale
(2) t 
GR
GR
GS
[0.375 0 0 0.375 36.125 195.87344] CT
/Helvetica 26.667 F
GS
[1 0 0 1 0 0] CT
-15 10.5 moveto 
1 -1 scale
(3) t 
GR
GR
GS
[0.375 0 0 0.375 36.125 153.35305] CT
/Helvetica 26.667 F
GS
[1 0 0 1 0 0] CT
-15 10.5 moveto 
1 -1 scale
(4) t 
GR
GR
GS
[0.375 0 0 0.375 36.125 110.83265] CT
/Helvetica 26.667 F
GS
[1 0 0 1 0 0] CT
-15 10.5 moveto 
1 -1 scale
(5) t 
GR
GR
GS
[0 -0.375 0.375 0 27.5 172.68735] CT
/Helvetica 26.667 F
GS
[1 0 0 1 0 0] CT
-178 -6 moveto 
1 -1 scale
(NB of fixations to gains/losses) t 
GR
GR
GS
[0.375 0 0 0.375 53.98295 272.81511] CT
N
6.667 0 M
6.667 -3.682 3.682 -6.667 0 -6.667 C
-3.682 -6.667 -6.667 -3.682 -6.667 0 C
-6.667 3.682 -3.682 6.667 0 6.667 C
3.682 6.667 6.667 3.682 6.667 0 C
cp
f
GR
GS
[0.375 0 0 0.375 123.27272 278.88945] CT
N
/f640454831{6.667 0 M
6.667 -3.682 3.682 -6.667 0 -6.667 C
-3.682 -6.667 -6.667 -3.682 -6.667 0 C
-6.667 3.682 -3.682 6.667 0 6.667 C
3.682 6.667 6.667 3.682 6.667 0 C
cp}def
f640454831
f
GR
GS
[0.375 0 0 0.375 192.5625 269.31775] CT
N
f640454831
f
GR
GS
[0.375 0 0 0.375 261.85226 266.74077] CT
N
f640454831
f
GR
GS
[0.375 0 0 0.375 331.14205 282.93901] CT
N
f640454831
f
GR
GS
[0.375 0 0 0.375 53.98295 147.75826] CT
N
f640454831
f
GR
GS
[0.375 0 0 0.375 123.27272 188.04073] CT
N
f640454831
f
GR
GS
[0.375 0 0 0.375 192.5625 156.62385] CT
N
f640454831
f
GR
GS
[0.375 0 0 0.375 261.85226 171.25637] CT
N
f640454831
f
GR
GS
[0.375 0 0 0.375 331.14205 171.25637] CT
N
f640454831
f
GR
GS
[0.375 0 0 0.375 53.98295 272.64638] CT
N
f640454831
f
GR
GS
[0.375 0 0 0.375 123.27272 276.31744] CT
N
f640454831
f
GR
GS
[0.375 0 0 0.375 192.5625 279.73311] CT
N
f640454831
f
GR
GS
[0.375 0 0 0.375 261.85226 290.10782] CT
N
f640454831
f
GR
GS
[0.375 0 0 0.375 331.14205 285.63872] CT
N
f640454831
f
GR
GS
[0.375 0 0 0.375 53.98295 207.77916] CT
N
f640454831
f
GR
GS
[0.375 0 0 0.375 123.27272 195.87344] CT
N
f640454831
f
GR
GS
[0.375 0 0 0.375 192.5625 223.0865] CT
N
f640454831
f
GR
GS
[0.375 0 0 0.375 261.85226 214.58242] CT
N
f640454831
f
GR
GS
[0.375 0 0 0.375 331.14205 238.39384] CT
N
f640454831
f
GR
GS
[0.375 0 0 0.375 53.98295 129.85494] CT
N
f640454831
f
GR
GS
[0.375 0 0 0.375 123.27272 148.87721] CT
N
f640454831
f
GR
GS
[0.375 0 0 0.375 192.5625 130.36905] CT
N
f640454831
f
GR
GS
[0.375 0 0 0.375 261.85226 147.75826] CT
N
f640454831
f
GR
GS
[0.375 0 0 0.375 331.14205 160.0668] CT
N
f640454831
f
GR
GS
[0.375 0 0 0.375 53.98295 202.12644] CT
N
f640454831
f
GR
GS
[0.375 0 0 0.375 123.27272 209.63004] CT
N
f640454831
f
GR
GS
[0.375 0 0 0.375 192.5625 209.237] CT
N
f640454831
f
GR
GS
[0.375 0 0 0.375 261.85226 210.88065] CT
N
f640454831
f
GR
GS
[0.375 0 0 0.375 331.14205 224.63722] CT
N
f640454831
f
GR
GS
[0.375 0 0 0.375 53.98295 62.40665] CT
N
f640454831
f
GR
GS
[0.375 0 0 0.375 123.27272 29.33523] CT
N
f640454831
f
GR
GS
[0.375 0 0 0.375 192.5625 55.31992] CT
N
f640454831
f
GR
GS
[0.375 0 0 0.375 261.85226 60.04439] CT
N
f640454831
f
GR
GS
[0.375 0 0 0.375 331.14205 70.67449] CT
N
f640454831
f
GR
GS
[0.375 0 0 0.375 53.98295 205.94405] CT
N
f640454831
f
GR
GS
[0.375 0 0 0.375 123.27272 222.72842] CT
N
f640454831
f
GR
GS
[0.375 0 0 0.375 192.5625 217.70824] CT
N
f640454831
f
GR
GS
[0.375 0 0 0.375 261.85226 221.60948] CT
N
f640454831
f
GR
GS
[0.375 0 0 0.375 331.14205 226.08529] CT
N
f640454831
f
GR
GS
[0.375 0 0 0.375 53.98295 310.49364] CT
N
f640454831
f
GR
GS
[0.375 0 0 0.375 123.27272 312.80452] CT
N
f640454831
f
GR
GS
[0.375 0 0 0.375 192.5625 316.03976] CT
N
f640454831
f
GR
GS
[0.375 0 0 0.375 261.85226 307.48947] CT
N
f640454831
f
GR
GS
[0.375 0 0 0.375 331.14205 314.19106] CT
N
f640454831
f
GR
GS
[0.375 0 0 0.375 53.98295 170.59105] CT
N
f640454831
f
GR
GS
[0.375 0 0 0.375 123.27272 165.99424] CT
N
f640454831
f
GR
GS
[0.375 0 0 0.375 192.5625 171.74024] CT
N
f640454831
f
GR
GS
[0.375 0 0 0.375 261.85226 213.11144] CT
N
f640454831
f
GR
GS
[0.375 0 0 0.375 331.14205 215.40985] CT
N
f640454831
f
GR
GS
[0.375 0 0 0.375 53.98295 156.80065] CT
N
f640454831
f
GR
GS
[0.375 0 0 0.375 123.27272 158.21252] CT
N
f640454831
f
GR
GS
[0.375 0 0 0.375 192.5625 179.78465] CT
N
f640454831
f
GR
GS
[0.375 0 0 0.375 261.85226 180.51885] CT
N
f640454831
f
GR
GS
[0.375 0 0 0.375 331.14205 204.14129] CT
N
f640454831
f
GR
GS
[0.375 0 0 0.375 53.98295 193.63552] CT
N
f640454831
f
GR
GS
[0.375 0 0 0.375 123.27272 199.23031] CT
N
f640454831
f
GR
GS
[0.375 0 0 0.375 192.5625 197.02265] CT
N
f640454831
f
GR
GS
[0.375 0 0 0.375 261.85226 222.72842] CT
N
f640454831
f
GR
GS
[0.375 0 0 0.375 331.14205 203.70614] CT
N
f640454831
f
GR
GS
[0.375 0 0 0.375 53.98295 138.0457] CT
N
f640454831
f
GR
GS
[0.375 0 0 0.375 123.27272 137.40789] CT
N
f640454831
f
GR
GS
[0.375 0 0 0.375 192.5625 132.94326] CT
N
f640454831
f
GR
GS
[0.375 0 0 0.375 261.85226 146.26632] CT
N
f640454831
f
GR
GS
[0.375 0 0 0.375 331.14205 114.23428] CT
N
f640454831
f
GR
GS
[0.375 0 0 0.375 53.98295 223.8474] CT
N
f640454831
f
GR
GS
[0.375 0 0 0.375 123.27272 233.91799] CT
N
f640454831
f
GR
GS
[0.375 0 0 0.375 192.5625 212.22743] CT
N
f640454831
f
GR
GS
[0.375 0 0 0.375 261.85226 211.53884] CT
N
f640454831
f
GR
GS
[0.375 0 0 0.375 331.14205 236.15591] CT
N
f640454831
f
GR
GS
[0.375 0 0 0.375 53.98295 238.39384] CT
N
f640454831
f
GR
GS
[0.375 0 0 0.375 123.27272 231.49864] CT
N
f640454831
f
GR
GS
[0.375 0 0 0.375 192.5625 227.20427] CT
N
f640454831
f
GR
GS
[0.375 0 0 0.375 261.85226 222.30503] CT
N
f640454831
f
GR
GS
[0.375 0 0 0.375 331.14205 229.20023] CT
N
f640454831
f
GR
GS
[0.375 0 0 0.375 53.98295 256.61687] CT
N
f640454831
f
GR
GS
[0.375 0 0 0.375 123.27272 247.14803] CT
N
f640454831
f
GR
GS
[0.375 0 0 0.375 192.5625 250.54253] CT
N
f640454831
f
GR
GS
[0.375 0 0 0.375 261.85226 259.65404] CT
N
f640454831
f
GR
GS
[0.375 0 0 0.375 331.14205 251.75739] CT
N
f640454831
f
GR
GS
[0.375 0 0 0.375 53.98295 144.49463] CT
N
f640454831
f
GR
GS
[0.375 0 0 0.375 123.27272 165.25875] CT
N
f640454831
f
GR
GS
[0.375 0 0 0.375 192.5625 135.63622] CT
N
f640454831
f
GR
GS
[0.375 0 0 0.375 261.85226 183.96774] CT
N
f640454831
f
GR
GS
[0.375 0 0 0.375 331.14205 183.47166] CT
N
f640454831
f
GR
GS
[0.375 0 0 0.375 53.98295 221.60948] CT
N
f640454831
f
GR
GS
[0.375 0 0 0.375 123.27272 203.70614] CT
N
f640454831
f
GR
GS
[0.375 0 0 0.375 192.5625 202.41504] CT
N
f640454831
f
GR
GS
[0.375 0 0 0.375 261.85226 203.70614] CT
N
f640454831
f
GR
GS
[0.375 0 0 0.375 331.14205 205.94405] CT
N
f640454831
f
GR
GS
[0.375 0 0 0.375 53.98295 293.42022] CT
N
f640454831
f
GR
GS
[0.375 0 0 0.375 123.27272 275.91183] CT
N
f640454831
f
GR
GS
[0.375 0 0 0.375 192.5625 280.91423] CT
N
f640454831
f
GR
GS
[0.375 0 0 0.375 261.85226 274.66122] CT
N
f640454831
f
GR
GS
[0.375 0 0 0.375 331.14205 267.15763] CT
N
f640454831
f
GR
GS
[0.375 0 0 0.375 53.98295 238.39384] CT
N
f640454831
f
GR
GS
[0.375 0 0 0.375 123.27272 218.25259] CT
N
f640454831
f
GR
GS
[0.375 0 0 0.375 192.5625 233.79703] CT
N
f640454831
f
GR
GS
[0.375 0 0 0.375 261.85226 226.08529] CT
N
f640454831
f
GR
GS
[0.375 0 0 0.375 331.14205 242.99064] CT
N
f640454831
f
GR
GS
[0.375 0 0 0.375 53.98295 209.66384] CT
N
f640454831
f
GR
GS
[0.375 0 0 0.375 123.27272 202.58718] CT
N
f640454831
f
GR
GS
[0.375 0 0 0.375 192.5625 199.32104] CT
N
f640454831
f
GR
GS
[0.375 0 0 0.375 261.85226 208.18197] CT
N
f640454831
f
GR
GS
[0.375 0 0 0.375 331.14205 215.40985] CT
N
f640454831
f
GR
GS
[0.375 0 0 0.375 53.98295 241.70712] CT
N
f640454831
f
GR
GS
[0.375 0 0 0.375 123.27272 237.25996] CT
N
f640454831
f
GR
GS
[0.375 0 0 0.375 192.5625 248.59872] CT
N
f640454831
f
GR
GS
[0.375 0 0 0.375 261.85226 244.54811] CT
N
f640454831
f
GR
GS
[0.375 0 0 0.375 331.14205 256.85664] CT
N
f640454831
f
GR
GS
[0.375 0 0 0.375 53.98295 193.63552] CT
N
f640454831
f
GR
GS
[0.375 0 0 0.375 123.27272 198.70814] CT
N
f640454831
f
GR
GS
[0.375 0 0 0.375 192.5625 207.06301] CT
N
f640454831
f
GR
GS
[0.375 0 0 0.375 261.85226 198.11135] CT
N
f640454831
f
GR
GS
[0.375 0 0 0.375 331.14205 200.47023] CT
N
f640454831
f
GR
GS
[0.375 0 0 0.375 53.98295 228.75588] CT
N
f640454831
f
GR
GS
[0.375 0 0 0.375 123.27272 227.47643] CT
N
f640454831
f
GR
GS
[0.375 0 0 0.375 192.5625 227.47643] CT
N
f640454831
f
GR
GS
[0.375 0 0 0.375 261.85226 237.25996] CT
N
f640454831
f
GR
GS
[0.375 0 0 0.375 331.14205 245.86363] CT
N
f640454831
f
GR
GS
[0.375 0 0 0.375 53.98295 172.52891] CT
N
f640454831
f
GR
GS
[0.375 0 0 0.375 123.27272 152.48528] CT
N
f640454831
f
GR
GS
[0.375 0 0 0.375 192.5625 185.86864] CT
N
f640454831
f
GR
GS
[0.375 0 0 0.375 261.85226 172.44383] CT
N
f640454831
f
GR
GS
[0.375 0 0 0.375 331.14205 186.51896] CT
N
f640454831
f
GR
GS
[0.375 0 0 0.375 53.98295 185.24334] CT
N
f640454831
f
GR
GS
[0.375 0 0 0.375 123.27272 196.91052] CT
N
f640454831
f
GR
GS
[0.375 0 0 0.375 192.5625 204.59557] CT
N
f640454831
f
GR
GS
[0.375 0 0 0.375 261.85226 184.46553] CT
N
f640454831
f
GR
GS
[0.375 0 0 0.375 331.14205 196.96371] CT
N
f640454831
f
GR
GS
[0.375 0 0 0.375 53.98295 228.05104] CT
N
f640454831
f
GR
GS
[0.375 0 0 0.375 123.27272 199.89565] CT
N
f640454831
f
GR
GS
[0.375 0 0 0.375 192.5625 229.88976] CT
N
f640454831
f
GR
GS
[0.375 0 0 0.375 261.85226 234.94624] CT
N
f640454831
f
GR
GS
[0.375 0 0 0.375 331.14205 237.2289] CT
N
f640454831
f
GR
GS
[0.375 0 0 0.375 53.98295 150.48006] CT
N
f640454831
f
GR
GS
[0.375 0 0 0.375 123.27272 149.95142] CT
N
f640454831
f
GR
GS
[0.375 0 0 0.375 192.5625 143.58485] CT
N
f640454831
f
GR
GS
[0.375 0 0 0.375 261.85226 177.16446] CT
N
f640454831
f
GR
GS
[0.375 0 0 0.375 331.14205 169.07977] CT
N
f640454831
f
GR
GS
[0.375 0 0 0.375 53.98295 227.76373] CT
N
f640454831
f
GR
GS
[0.375 0 0 0.375 123.27272 217.98404] CT
N
f640454831
f
GR
GS
[0.375 0 0 0.375 192.5625 232.1575] CT
N
f640454831
f
GR
GS
[0.375 0 0 0.375 261.85226 239.5277] CT
N
f640454831
f
GR
GS
[0.375 0 0 0.375 331.14205 231.49864] CT
N
f640454831
f
GR
GS
[0.375 0 0 0.375 53.98295 241.75072] CT
N
f640454831
f
GR
GS
[0.375 0 0 0.375 123.27272 238.39384] CT
N
f640454831
f
GR
GS
[0.375 0 0 0.375 192.5625 254.48264] CT
N
f640454831
f
GR
GS
[0.375 0 0 0.375 261.85226 267.1089] CT
N
f640454831
f
GR
GS
[0.375 0 0 0.375 331.14205 271.27627] CT
N
f640454831
f
GR
GS
[0.375 0 0 0.375 53.98295 235.55914] CT
N
f640454831
f
GR
GS
[0.375 0 0 0.375 123.27272 242.3624] CT
N
f640454831
f
GR
GS
[0.375 0 0 0.375 192.5625 242.41603] CT
N
f640454831
f
GR
GS
[0.375 0 0 0.375 261.85226 247.58743] CT
N
f640454831
f
GR
GS
[0.375 0 0 0.375 331.14205 257.66975] CT
N
f640454831
f
GR
GS
[0.375 0 0 0.375 53.98295 164.48934] CT
N
f640454831
f
GR
GS
[0.375 0 0 0.375 123.27272 140.59692] CT
N
f640454831
f
GR
GS
[0.375 0 0 0.375 192.5625 132.61139] CT
N
f640454831
f
GR
GS
[0.375 0 0 0.375 261.85226 141.20437] CT
N
f640454831
f
GR
GS
[0.375 0 0 0.375 331.14205 161.85712] CT
N
f640454831
f
GR
GS
[0.375 0 0 0.375 53.98295 208.34608] CT
N
f640454831
f
GR
GS
[0.375 0 0 0.375 123.27272 210.0469] CT
N
f640454831
f
GR
GS
[0.375 0 0 0.375 192.5625 203.81058] CT
N
f640454831
f
GR
GS
[0.375 0 0 0.375 261.85226 202.0277] CT
N
f640454831
f
GR
GS
[0.375 0 0 0.375 331.14205 214.83524] CT
N
f640454831
f
GR
GS
[0.375 0 0 0.375 53.98295 160.0668] CT
N
f640454831
f
GR
GS
[0.375 0 0 0.375 123.27272 133.47337] CT
N
f640454831
f
GR
GS
[0.375 0 0 0.375 192.5625 143.28242] CT
N
f640454831
f
GR
GS
[0.375 0 0 0.375 261.85226 163.42367] CT
N
f640454831
f
GR
GS
[0.375 0 0 0.375 331.14205 149.99617] CT
N
f640454831
f
GR
GS
[0.375 0 0 0.375 53.98295 73.21845] CT
N
f640454831
f
GR
GS
[0.375 0 0 0.375 123.27272 126.67359] CT
N
f640454831
f
GR
GS
[0.375 0 0 0.375 192.5625 125.2896] CT
N
f640454831
f
GR
GS
[0.375 0 0 0.375 261.85226 145.99374] CT
N
f640454831
f
GR
GS
[0.375 0 0 0.375 331.14205 155.05386] CT
N
f640454831
f
GR
GS
[0.375 0 0 0.375 53.98295 305.80421] CT
N
f640454831
f
GR
GS
[0.375 0 0 0.375 123.27272 293.67034] CT
N
f640454831
f
GR
GS
[0.375 0 0 0.375 192.5625 289.41831] CT
N
f640454831
f
GR
GS
[0.375 0 0 0.375 261.85226 295.08769] CT
N
f640454831
f
GR
GS
[0.375 0 0 0.375 331.14205 302.17442] CT
N
f640454831
f
GR
GS
[0.375 0 0 0.375 53.98295 221.03856] CT
N
f640454831
f
GR
GS
[0.375 0 0 0.375 123.27272 218.43528] CT
N
f640454831
f
GR
GS
[0.375 0 0 0.375 192.5625 215.88304] CT
N
f640454831
f
GR
GS
[0.375 0 0 0.375 261.85226 234.92278] CT
N
f640454831
f
GR
GS
[0.375 0 0 0.375 331.14205 230.42125] CT
N
f640454831
f
GR
GS
[0.375 0 0 0.375 53.98295 234.05502] CT
N
f640454831
f
GR
GS
[0.375 0 0 0.375 123.27272 242.64587] CT
N
f640454831
f
GR
GS
[0.375 0 0 0.375 192.5625 224.22038] CT
N
f640454831
f
GR
GS
[0.375 0 0 0.375 261.85226 240.16553] CT
N
f640454831
f
GR
GS
[0.375 0 0 0.375 331.14205 233.18726] CT
N
f640454831
f
GR
GS
[0.375 0 0 0.375 53.98295 204.46925] CT
N
f640454831
f
GR
GS
[0.375 0 0 0.375 123.27272 203.38401] CT
N
f640454831
f
GR
GS
[0.375 0 0 0.375 192.5625 205.04297] CT
N
f640454831
f
GR
GS
[0.375 0 0 0.375 261.85226 212.34693] CT
N
f640454831
f
GR
GS
[0.375 0 0 0.375 331.14205 216.95826] CT
N
f640454831
f
GR
GS
[0.375 0 0 0.375 0 0] CT
1 LJ
4 LW
N
143.955 594.499 M
143.955 496.004 L
S
GR
GS
[0.375 0 0 0.375 0 0] CT
1 LJ
4 LW
N
132.406 496.004 M
155.503 496.004 L
S
GR
GS
[0.375 0 0 0.375 0 0] CT
1 LJ
4 LW
N
132.406 594.499 M
155.503 594.499 L
S
GR
GS
[0.375 0 0 0.375 0 0] CT
1 LJ
4 LW
N
328.727 590.199 M
328.727 494.516 L
S
GR
GS
[0.375 0 0 0.375 0 0] CT
1 LJ
4 LW
N
317.179 494.516 M
340.276 494.516 L
S
GR
GS
[0.375 0 0 0.375 0 0] CT
1 LJ
4 LW
N
317.179 590.199 M
340.276 590.199 L
S
GR
GS
[0.375 0 0 0.375 0 0] CT
1 LJ
4 LW
N
513.5 594.291 M
513.5 499.272 L
S
GR
GS
[0.375 0 0 0.375 0 0] CT
1 LJ
4 LW
N
501.952 499.272 M
525.048 499.272 L
S
GR
GS
[0.375 0 0 0.375 0 0] CT
1 LJ
4 LW
N
501.952 594.291 M
525.048 594.291 L
S
GR
GS
[0.375 0 0 0.375 0 0] CT
1 LJ
4 LW
N
698.273 609.74 M
698.273 522.777 L
S
GR
GS
[0.375 0 0 0.375 0 0] CT
1 LJ
4 LW
N
686.724 522.777 M
709.821 522.777 L
S
GR
GS
[0.375 0 0 0.375 0 0] CT
1 LJ
4 LW
N
686.724 609.74 M
709.821 609.74 L
S
GR
GS
[0.375 0 0 0.375 0 0] CT
1 LJ
4 LW
N
883.045 622.624 M
883.045 534.487 L
S
GR
GS
[0.375 0 0 0.375 0 0] CT
1 LJ
4 LW
N
871.497 534.487 M
894.594 534.487 L
S
GR
GS
[0.375 0 0 0.375 0 0] CT
1 LJ
4 LW
N
871.497 622.624 M
894.594 622.624 L
S
GR
%%Trailer
%%Pages: 1
%%EOF
