%!PS-Adobe-3.0 EPSF-3.0
%%Creator: (MATLAB, The Mathworks, Inc. Version 9.7.0.1261785 \(R2019b\) Update 3. Operating System: Windows 10)
%%Title: C:/Users/Clarissa/Documents/decid_eye/analysis/manip1&2/1_pipeline/fixations/3_f_fixation_behav/plots/lvl2/choiceAsFunctionOfValueDiff_TimeAdv_PSE.eps
%%CreationDate: 2021-04-13T11:17:32
%%Pages: (atend)
%%BoundingBox:    17    15   346   361
%%LanguageLevel: 3
%%EndComments
%%BeginProlog
%%BeginResource: procset (Apache XML Graphics Std ProcSet) 1.2 0
%%Version: 1.2 0
%%Copyright: (Copyright 2001-2003,2010 The Apache Software Foundation. License terms: http://www.apache.org/licenses/LICENSE-2.0)
/bd{bind def}bind def
/ld{load def}bd
/GR/grestore ld
/GS/gsave ld
/RM/rmoveto ld
/C/curveto ld
/t/show ld
/L/lineto ld
/ML/setmiterlimit ld
/CT/concat ld
/f/fill ld
/N/newpath ld
/S/stroke ld
/CC/setcmykcolor ld
/A/ashow ld
/cp/closepath ld
/RC/setrgbcolor ld
/LJ/setlinejoin ld
/GC/setgray ld
/LW/setlinewidth ld
/M/moveto ld
/re {4 2 roll M
1 index 0 rlineto
0 exch rlineto
neg 0 rlineto
cp } bd
/_ctm matrix def
/_tm matrix def
/BT { _ctm currentmatrix pop matrix _tm copy pop 0 0 moveto } bd
/ET { _ctm setmatrix } bd
/iTm { _ctm setmatrix _tm concat } bd
/Tm { _tm astore pop iTm 0 0 moveto } bd
/ux 0.0 def
/uy 0.0 def
/F {
  /Tp exch def
  /Tf exch def
  Tf findfont Tp scalefont setfont
  /cf Tf def  /cs Tp def
} bd
/ULS {currentpoint /uy exch def /ux exch def} bd
/ULE {
  /Tcx currentpoint pop def
  gsave
  newpath
  cf findfont cs scalefont dup
  /FontMatrix get 0 get /Ts exch def /FontInfo get dup
  /UnderlinePosition get Ts mul /To exch def
  /UnderlineThickness get Ts mul /Tt exch def
  ux uy To add moveto  Tcx uy To add lineto
  Tt setlinewidth stroke
  grestore
} bd
/OLE {
  /Tcx currentpoint pop def
  gsave
  newpath
  cf findfont cs scalefont dup
  /FontMatrix get 0 get /Ts exch def /FontInfo get dup
  /UnderlinePosition get Ts mul /To exch def
  /UnderlineThickness get Ts mul /Tt exch def
  ux uy To add cs add moveto Tcx uy To add cs add lineto
  Tt setlinewidth stroke
  grestore
} bd
/SOE {
  /Tcx currentpoint pop def
  gsave
  newpath
  cf findfont cs scalefont dup
  /FontMatrix get 0 get /Ts exch def /FontInfo get dup
  /UnderlinePosition get Ts mul /To exch def
  /UnderlineThickness get Ts mul /Tt exch def
  ux uy To add cs 10 mul 26 idiv add moveto Tcx uy To add cs 10 mul 26 idiv add lineto
  Tt setlinewidth stroke
  grestore
} bd
/QT {
/Y22 exch store
/X22 exch store
/Y21 exch store
/X21 exch store
currentpoint
/Y21 load 2 mul add 3 div exch
/X21 load 2 mul add 3 div exch
/X21 load 2 mul /X22 load add 3 div
/Y21 load 2 mul /Y22 load add 3 div
/X22 load /Y22 load curveto
} bd
/SSPD {
dup length /d exch dict def
{
/v exch def
/k exch def
currentpagedevice k known {
/cpdv currentpagedevice k get def
v cpdv ne {
/upd false def
/nullv v type /nulltype eq def
/nullcpdv cpdv type /nulltype eq def
nullv nullcpdv or
{
/upd true def
} {
/sametype v type cpdv type eq def
sametype {
v type /arraytype eq {
/vlen v length def
/cpdvlen cpdv length def
vlen cpdvlen eq {
0 1 vlen 1 sub {
/i exch def
/obj v i get def
/cpdobj cpdv i get def
obj cpdobj ne {
/upd true def
exit
} if
} for
} {
/upd true def
} ifelse
} {
v type /dicttype eq {
v {
/dv exch def
/dk exch def
/cpddv cpdv dk get def
dv cpddv ne {
/upd true def
exit
} if
} forall
} {
/upd true def
} ifelse
} ifelse
} if
} ifelse
upd true eq {
d k v put
} if
} if
} if
} forall
d length 0 gt {
d setpagedevice
} if
} bd
/RE { % /NewFontName [NewEncodingArray] /FontName RE -
  findfont dup length dict begin
  {
    1 index /FID ne
    {def} {pop pop} ifelse
  } forall
  /Encoding exch def
  /FontName 1 index def
  currentdict definefont pop
  end
} bind def
%%EndResource
%%BeginResource: procset (Apache XML Graphics EPS ProcSet) 1.0 0
%%Version: 1.0 0
%%Copyright: (Copyright 2002-2003 The Apache Software Foundation. License terms: http://www.apache.org/licenses/LICENSE-2.0)
/BeginEPSF { %def
/b4_Inc_state save def         % Save state for cleanup
/dict_count countdictstack def % Count objects on dict stack
/op_count count 1 sub def      % Count objects on operand stack
userdict begin                 % Push userdict on dict stack
/showpage { } def              % Redefine showpage, { } = null proc
0 setgray 0 setlinecap         % Prepare graphics state
1 setlinewidth 0 setlinejoin
10 setmiterlimit [ ] 0 setdash newpath
/languagelevel where           % If level not equal to 1 then
{pop languagelevel             % set strokeadjust and
1 ne                           % overprint to their defaults.
{false setstrokeadjust false setoverprint
} if
} if
} bd
/EndEPSF { %def
count op_count sub {pop} repeat            % Clean up stacks
countdictstack dict_count sub {end} repeat
b4_Inc_state restore
} bd
%%EndResource
%FOPBeginFontDict
%%IncludeResource: font Courier-Oblique
%%IncludeResource: font Courier-BoldOblique
%%IncludeResource: font Courier-Bold
%%IncludeResource: font ZapfDingbats
%%IncludeResource: font Symbol
%%IncludeResource: font Helvetica
%%IncludeResource: font Helvetica-Oblique
%%IncludeResource: font Helvetica-Bold
%%IncludeResource: font Helvetica-BoldOblique
%%IncludeResource: font Times-Roman
%%IncludeResource: font Times-Italic
%%IncludeResource: font Times-Bold
%%IncludeResource: font Times-BoldItalic
%%IncludeResource: font Courier
%FOPEndFontDict
%%BeginResource: encoding WinAnsiEncoding
/WinAnsiEncoding [
/.notdef /.notdef /.notdef /.notdef /.notdef
/.notdef /.notdef /.notdef /.notdef /.notdef
/.notdef /.notdef /.notdef /.notdef /.notdef
/.notdef /.notdef /.notdef /.notdef /.notdef
/.notdef /.notdef /.notdef /.notdef /.notdef
/.notdef /.notdef /.notdef /.notdef /.notdef
/.notdef /.notdef /space /exclam /quotedbl
/numbersign /dollar /percent /ampersand /quotesingle
/parenleft /parenright /asterisk /plus /comma
/hyphen /period /slash /zero /one
/two /three /four /five /six
/seven /eight /nine /colon /semicolon
/less /equal /greater /question /at
/A /B /C /D /E
/F /G /H /I /J
/K /L /M /N /O
/P /Q /R /S /T
/U /V /W /X /Y
/Z /bracketleft /backslash /bracketright /asciicircum
/underscore /quoteleft /a /b /c
/d /e /f /g /h
/i /j /k /l /m
/n /o /p /q /r
/s /t /u /v /w
/x /y /z /braceleft /bar
/braceright /asciitilde /bullet /Euro /bullet
/quotesinglbase /florin /quotedblbase /ellipsis /dagger
/daggerdbl /circumflex /perthousand /Scaron /guilsinglleft
/OE /bullet /Zcaron /bullet /bullet
/quoteleft /quoteright /quotedblleft /quotedblright /bullet
/endash /emdash /asciitilde /trademark /scaron
/guilsinglright /oe /bullet /zcaron /Ydieresis
/space /exclamdown /cent /sterling /currency
/yen /brokenbar /section /dieresis /copyright
/ordfeminine /guillemotleft /logicalnot /sfthyphen /registered
/macron /degree /plusminus /twosuperior /threesuperior
/acute /mu /paragraph /middot /cedilla
/onesuperior /ordmasculine /guillemotright /onequarter /onehalf
/threequarters /questiondown /Agrave /Aacute /Acircumflex
/Atilde /Adieresis /Aring /AE /Ccedilla
/Egrave /Eacute /Ecircumflex /Edieresis /Igrave
/Iacute /Icircumflex /Idieresis /Eth /Ntilde
/Ograve /Oacute /Ocircumflex /Otilde /Odieresis
/multiply /Oslash /Ugrave /Uacute /Ucircumflex
/Udieresis /Yacute /Thorn /germandbls /agrave
/aacute /acircumflex /atilde /adieresis /aring
/ae /ccedilla /egrave /eacute /ecircumflex
/edieresis /igrave /iacute /icircumflex /idieresis
/eth /ntilde /ograve /oacute /ocircumflex
/otilde /odieresis /divide /oslash /ugrave
/uacute /ucircumflex /udieresis /yacute /thorn
/ydieresis
] def
%%EndResource
%FOPBeginFontReencode
/Courier-Oblique findfont
dup length dict begin
  {1 index /FID ne {def} {pop pop} ifelse} forall
  /Encoding WinAnsiEncoding def
  currentdict
end
/Courier-Oblique exch definefont pop
/Courier-BoldOblique findfont
dup length dict begin
  {1 index /FID ne {def} {pop pop} ifelse} forall
  /Encoding WinAnsiEncoding def
  currentdict
end
/Courier-BoldOblique exch definefont pop
/Courier-Bold findfont
dup length dict begin
  {1 index /FID ne {def} {pop pop} ifelse} forall
  /Encoding WinAnsiEncoding def
  currentdict
end
/Courier-Bold exch definefont pop
/Helvetica findfont
dup length dict begin
  {1 index /FID ne {def} {pop pop} ifelse} forall
  /Encoding WinAnsiEncoding def
  currentdict
end
/Helvetica exch definefont pop
/Helvetica-Oblique findfont
dup length dict begin
  {1 index /FID ne {def} {pop pop} ifelse} forall
  /Encoding WinAnsiEncoding def
  currentdict
end
/Helvetica-Oblique exch definefont pop
/Helvetica-Bold findfont
dup length dict begin
  {1 index /FID ne {def} {pop pop} ifelse} forall
  /Encoding WinAnsiEncoding def
  currentdict
end
/Helvetica-Bold exch definefont pop
/Helvetica-BoldOblique findfont
dup length dict begin
  {1 index /FID ne {def} {pop pop} ifelse} forall
  /Encoding WinAnsiEncoding def
  currentdict
end
/Helvetica-BoldOblique exch definefont pop
/Times-Roman findfont
dup length dict begin
  {1 index /FID ne {def} {pop pop} ifelse} forall
  /Encoding WinAnsiEncoding def
  currentdict
end
/Times-Roman exch definefont pop
/Times-Italic findfont
dup length dict begin
  {1 index /FID ne {def} {pop pop} ifelse} forall
  /Encoding WinAnsiEncoding def
  currentdict
end
/Times-Italic exch definefont pop
/Times-Bold findfont
dup length dict begin
  {1 index /FID ne {def} {pop pop} ifelse} forall
  /Encoding WinAnsiEncoding def
  currentdict
end
/Times-Bold exch definefont pop
/Times-BoldItalic findfont
dup length dict begin
  {1 index /FID ne {def} {pop pop} ifelse} forall
  /Encoding WinAnsiEncoding def
  currentdict
end
/Times-BoldItalic exch definefont pop
/Courier findfont
dup length dict begin
  {1 index /FID ne {def} {pop pop} ifelse} forall
  /Encoding WinAnsiEncoding def
  currentdict
end
/Courier exch definefont pop
%FOPEndFontReencode
%%EndProlog
%%Page: 1 1
%%PageBoundingBox: 0 0 375 375
%%BeginPageSetup
[1 0 0 -1 0 375] CT
%%EndPageSetup
GS
[0.375 0 0 0.375 0 0] CT
1 GC
N
0 0 1000 1000 re
f
GR
GS
[0.375 0 0 0.375 0 0] CT
1 GC
N
0 0 1000 1000 re
f
GR
GS
[0.375 0 0 0.375 0 0] CT
1 GC
N
131 916 M
920 916 L
920 40 L
131 40 L
cp
f
GR
GS
[0.375 0 0 0.375 0 0] CT
2 setlinecap
1 LJ
1.333 LW
N
131 916 M
920 916 L
S
GR
GS
[0.375 0 0 0.375 0 0] CT
2 setlinecap
1 LJ
1.333 LW
N
394 916 M
394 907.24 L
S
GR
GS
[0.375 0 0 0.375 0 0] CT
2 setlinecap
1 LJ
1.333 LW
N
657 916 M
657 907.24 L
S
GR
GS
[0.375 0 0 0.375 147.75 347.49998] CT
/Helvetica 26.667 F
GS
[1 0 0 1 0 0] CT
-90.5 27 moveto 
1 -1 scale
(Time adv gains) t 
GR
GR
GS
[0.375 0 0 0.375 246.375 347.49998] CT
/Helvetica 26.667 F
GS
[1 0 0 1 0 0] CT
-96.5 27 moveto 
1 -1 scale
(Time adv losses) t 
GR
GR
GS
[0.375 0 0 0.375 0 0] CT
2 setlinecap
1 LJ
1.333 LW
N
131 916 M
131 40 L
S
GR
GS
[0.375 0 0 0.375 0 0] CT
2 setlinecap
1 LJ
1.333 LW
N
131 904.477 M
139.76 904.477 L
S
GR
GS
[0.375 0 0 0.375 0 0] CT
2 setlinecap
1 LJ
1.333 LW
N
131 812.053 M
139.76 812.053 L
S
GR
GS
[0.375 0 0 0.375 0 0] CT
2 setlinecap
1 LJ
1.333 LW
N
131 719.63 M
139.76 719.63 L
S
GR
GS
[0.375 0 0 0.375 0 0] CT
2 setlinecap
1 LJ
1.333 LW
N
131 627.206 M
139.76 627.206 L
S
GR
GS
[0.375 0 0 0.375 0 0] CT
2 setlinecap
1 LJ
1.333 LW
N
131 534.782 M
139.76 534.782 L
S
GR
GS
[0.375 0 0 0.375 0 0] CT
2 setlinecap
1 LJ
1.333 LW
N
131 442.359 M
139.76 442.359 L
S
GR
GS
[0.375 0 0 0.375 0 0] CT
2 setlinecap
1 LJ
1.333 LW
N
131 349.935 M
139.76 349.935 L
S
GR
GS
[0.375 0 0 0.375 0 0] CT
2 setlinecap
1 LJ
1.333 LW
N
131 257.512 M
139.76 257.512 L
S
GR
GS
[0.375 0 0 0.375 0 0] CT
2 setlinecap
1 LJ
1.333 LW
N
131 165.088 M
139.76 165.088 L
S
GR
GS
[0.375 0 0 0.375 0 0] CT
2 setlinecap
1 LJ
1.333 LW
N
131 72.665 M
139.76 72.665 L
S
GR
GS
[0.375 0 0 0.375 45.125 339.17876] CT
/Helvetica 26.667 F
GS
[1 0 0 1 0 0] CT
-39 10.5 moveto 
1 -1 scale
(-25) t 
GR
GR
GS
[0.375 0 0 0.375 45.125 304.51991] CT
/Helvetica 26.667 F
GS
[1 0 0 1 0 0] CT
-39 10.5 moveto 
1 -1 scale
(-20) t 
GR
GR
GS
[0.375 0 0 0.375 45.125 269.86109] CT
/Helvetica 26.667 F
GS
[1 0 0 1 0 0] CT
-39 10.5 moveto 
1 -1 scale
(-15) t 
GR
GR
GS
[0.375 0 0 0.375 45.125 235.20225] CT
/Helvetica 26.667 F
GS
[1 0 0 1 0 0] CT
-39 10.5 moveto 
1 -1 scale
(-10) t 
GR
GR
GS
[0.375 0 0 0.375 45.125 200.54343] CT
/Helvetica 26.667 F
GS
[1 0 0 1 0 0] CT
-24 10.5 moveto 
1 -1 scale
(-5) t 
GR
GR
GS
[0.375 0 0 0.375 45.125 165.88458] CT
/Helvetica 26.667 F
GS
[1 0 0 1 0 0] CT
-15 10.5 moveto 
1 -1 scale
(0) t 
GR
GR
GS
[0.375 0 0 0.375 45.125 131.22575] CT
/Helvetica 26.667 F
GS
[1 0 0 1 0 0] CT
-15 10.5 moveto 
1 -1 scale
(5) t 
GR
GR
GS
[0.375 0 0 0.375 45.125 96.56692] CT
/Helvetica 26.667 F
GS
[1 0 0 1 0 0] CT
-30 10.5 moveto 
1 -1 scale
(10) t 
GR
GR
GS
[0.375 0 0 0.375 45.125 61.90809] CT
/Helvetica 26.667 F
GS
[1 0 0 1 0 0] CT
-30 10.5 moveto 
1 -1 scale
(15) t 
GR
GR
GS
[0.375 0 0 0.375 45.125 27.24926] CT
/Helvetica 26.667 F
GS
[1 0 0 1 0 0] CT
-30 10.5 moveto 
1 -1 scale
(20) t 
GR
GR
GS
[0 -0.375 0.375 0 27.5 179.24984] CT
/Helvetica 26.667 F
GS
[1 0 0 1 0 0] CT
-345.5 -6 moveto 
1 -1 scale
(PSE \(= point of subjective equality, where P\(accept\) = 0.5\)) t 
GR
GR
GS
[0.375 0 0 0.375 147.75 117.89394] CT
N
6.667 0 M
6.667 -3.682 3.682 -6.667 0 -6.667 C
-3.682 -6.667 -6.667 -3.682 -6.667 0 C
-6.667 3.682 -3.682 6.667 0 6.667 C
3.682 6.667 6.667 3.682 6.667 0 C
cp
f
GR
GS
[0.375 0 0 0.375 246.375 29.93182] CT
N
/f640454831{6.667 0 M
6.667 -3.682 3.682 -6.667 0 -6.667 C
-3.682 -6.667 -6.667 -3.682 -6.667 0 C
-6.667 3.682 -3.682 6.667 0 6.667 C
3.682 6.667 6.667 3.682 6.667 0 C
cp}def
f640454831
f
GR
GS
[0.375 0 0 0.375 0 0] CT
1 LJ
4 LW
N
394 314.384 M
657 79.818 L
S
GR
GS
[0.375 0 0 0.375 147.75 194.11709] CT
N
f640454831
f
GR
GS
[0.375 0 0 0.375 246.375 210.02451] CT
N
f640454831
f
GR
GS
[0.375 0 0 0.375 0 0] CT
1 LJ
4 LW
N
394 517.646 M
657 560.065 L
S
GR
GS
[0.375 0 0 0.375 147.75 163.91479] CT
N
f640454831
f
GR
GS
[0.375 0 0 0.375 246.375 99.50419] CT
N
f640454831
f
GR
GS
[0.375 0 0 0.375 0 0] CT
1 LJ
4 LW
N
394 437.106 M
657 265.345 L
S
GR
GS
[0.375 0 0 0.375 147.75 152.27323] CT
N
f640454831
f
GR
GS
[0.375 0 0 0.375 246.375 121.29822] CT
N
f640454831
f
GR
GS
[0.375 0 0 0.375 0 0] CT
1 LJ
4 LW
N
394 406.062 M
657 323.462 L
S
GR
GS
[0.375 0 0 0.375 147.75 240.83524] CT
N
f640454831
f
GR
GS
[0.375 0 0 0.375 246.375 283.67752] CT
N
f640454831
f
GR
GS
[0.375 0 0 0.375 0 0] CT
1 LJ
4 LW
N
394 642.227 M
657 756.473 L
S
GR
GS
[0.375 0 0 0.375 147.75 121.96915] CT
N
f640454831
f
GR
GS
[0.375 0 0 0.375 246.375 85.77768] CT
N
f640454831
f
GR
GS
[0.375 0 0 0.375 0 0] CT
1 LJ
4 LW
N
394 325.251 M
657 228.74 L
S
GR
GS
[0.375 0 0 0.375 147.75 147.76517] CT
N
f640454831
f
GR
GS
[0.375 0 0 0.375 246.375 137.89642] CT
N
f640454831
f
GR
GS
[0.375 0 0 0.375 0 0] CT
1 LJ
4 LW
N
394 394.04 M
657 367.724 L
S
GR
GS
[0.375 0 0 0.375 147.75 149.49538] CT
N
f640454831
f
GR
GS
[0.375 0 0 0.375 246.375 170.19146] CT
N
f640454831
f
GR
GS
[0.375 0 0 0.375 0 0] CT
1 LJ
4 LW
N
394 398.654 M
657 453.844 L
S
GR
GS
[0.375 0 0 0.375 147.75 181.22222] CT
N
f640454831
f
GR
GS
[0.375 0 0 0.375 246.375 176.00095] CT
N
f640454831
f
GR
GS
[0.375 0 0 0.375 0 0] CT
1 LJ
4 LW
N
394 483.259 M
657 469.336 L
S
GR
GS
[0.375 0 0 0.375 147.75 221.78716] CT
N
f640454831
f
GR
GS
[0.375 0 0 0.375 246.375 100.35491] CT
N
f640454831
f
GR
GS
[0.375 0 0 0.375 0 0] CT
1 LJ
4 LW
N
394 591.432 M
657 267.613 L
S
GR
GS
[0.375 0 0 0.375 147.75 178.38214] CT
N
f640454831
f
GR
GS
[0.375 0 0 0.375 246.375 97.05658] CT
N
f640454831
f
GR
GS
[0.375 0 0 0.375 0 0] CT
1 LJ
4 LW
N
394 475.686 M
657 258.818 L
S
GR
GS
[0.375 0 0 0.375 147.75 167.53563] CT
N
f640454831
f
GR
GS
[0.375 0 0 0.375 246.375 171.96096] CT
N
f640454831
f
GR
GS
[0.375 0 0 0.375 0 0] CT
1 LJ
4 LW
N
394 446.762 M
657 458.563 L
S
GR
GS
[0.375 0 0 0.375 147.75 328.56818] CT
N
f640454831
f
GR
GS
[0.375 0 0 0.375 246.375 270.90255] CT
N
f640454831
f
GR
GS
[0.375 0 0 0.375 0 0] CT
1 LJ
4 LW
N
394 876.182 M
657 722.407 L
S
GR
GS
[0.375 0 0 0.375 147.75 166.1823] CT
N
f640454831
f
GR
GS
[0.375 0 0 0.375 246.375 199.26519] CT
N
f640454831
f
GR
GS
[0.375 0 0 0.375 0 0] CT
1 LJ
4 LW
N
394 443.153 M
657 531.374 L
S
GR
GS
[0.375 0 0 0.375 147.75 177.19304] CT
N
f640454831
f
GR
GS
[0.375 0 0 0.375 246.375 216.0498] CT
N
f640454831
f
GR
GS
[0.375 0 0 0.375 0 0] CT
1 LJ
4 LW
N
394 472.515 M
657 576.133 L
S
GR
GS
[0.375 0 0 0.375 147.75 131.4981] CT
N
f640454831
f
GR
GS
[0.375 0 0 0.375 246.375 50.37016] CT
N
f640454831
f
GR
GS
[0.375 0 0 0.375 0 0] CT
1 LJ
4 LW
N
394 350.662 M
657 134.32 L
S
GR
GS
[0.375 0 0 0.375 147.75 223.46752] CT
N
f640454831
f
GR
GS
[0.375 0 0 0.375 246.375 200.60536] CT
N
f640454831
f
GR
GS
[0.375 0 0 0.375 0 0] CT
1 LJ
4 LW
N
394 595.913 M
657 534.948 L
S
GR
GS
[0.375 0 0 0.375 147.75 236.08006] CT
N
f640454831
f
GR
GS
[0.375 0 0 0.375 246.375 227.42187] CT
N
f640454831
f
GR
GS
[0.375 0 0 0.375 0 0] CT
1 LJ
4 LW
N
394 629.547 M
657 606.458 L
S
GR
GS
[0.375 0 0 0.375 147.75 131.11141] CT
N
f640454831
f
GR
GS
[0.375 0 0 0.375 246.375 134.73655] CT
N
f640454831
f
GR
GS
[0.375 0 0 0.375 0 0] CT
1 LJ
4 LW
N
394 349.63 M
657 359.297 L
S
GR
GS
[0.375 0 0 0.375 147.75 294.43469] CT
N
f640454831
f
GR
GS
[0.375 0 0 0.375 246.375 286.1981] CT
N
f640454831
f
GR
GS
[0.375 0 0 0.375 0 0] CT
1 LJ
4 LW
N
394 785.159 M
657 763.195 L
S
GR
GS
[0.375 0 0 0.375 147.75 111.55186] CT
N
f640454831
f
GR
GS
[0.375 0 0 0.375 246.375 125.82549] CT
N
f640454831
f
GR
GS
[0.375 0 0 0.375 0 0] CT
1 LJ
4 LW
N
394 297.472 M
657 335.535 L
S
GR
GS
[0.375 0 0 0.375 147.75 247.08978] CT
N
f640454831
f
GR
GS
[0.375 0 0 0.375 246.375 193.46063] CT
N
f640454831
f
GR
GS
[0.375 0 0 0.375 0 0] CT
1 LJ
4 LW
N
394 658.906 M
657 515.895 L
S
GR
GS
[0.375 0 0 0.375 147.75 228.5782] CT
N
f640454831
f
GR
GS
[0.375 0 0 0.375 246.375 234.02209] CT
N
f640454831
f
GR
GS
[0.375 0 0 0.375 0 0] CT
1 LJ
4 LW
N
394 609.542 M
657 624.059 L
S
GR
GS
[0.375 0 0 0.375 147.75 127.16289] CT
N
f640454831
f
GR
GS
[0.375 0 0 0.375 246.375 149.56607] CT
N
f640454831
f
GR
GS
[0.375 0 0 0.375 0 0] CT
1 LJ
4 LW
N
394 339.101 M
657 398.843 L
S
GR
%%Trailer
%%Pages: 1
%%EOF
