%!PS-Adobe-3.0 EPSF-3.0
%%Creator: (MATLAB, The Mathworks, Inc. Version 9.7.0.1261785 \(R2019b\) Update 3. Operating System: Windows 10)
%%Title: C:/Users/Clarissa/Documents/decid_eye/analysis/manip1&2/1_pipeline/fixations/3_f_fixation_behav/plots/lvl2_all/choiceAsFunctionOfValueDiff_lastFix_PSE.eps
%%CreationDate: 2021-04-19T12:26:49
%%Pages: (atend)
%%BoundingBox:    17    15   346   361
%%LanguageLevel: 3
%%EndComments
%%BeginProlog
%%BeginResource: procset (Apache XML Graphics Std ProcSet) 1.2 0
%%Version: 1.2 0
%%Copyright: (Copyright 2001-2003,2010 The Apache Software Foundation. License terms: http://www.apache.org/licenses/LICENSE-2.0)
/bd{bind def}bind def
/ld{load def}bd
/GR/grestore ld
/GS/gsave ld
/RM/rmoveto ld
/C/curveto ld
/t/show ld
/L/lineto ld
/ML/setmiterlimit ld
/CT/concat ld
/f/fill ld
/N/newpath ld
/S/stroke ld
/CC/setcmykcolor ld
/A/ashow ld
/cp/closepath ld
/RC/setrgbcolor ld
/LJ/setlinejoin ld
/GC/setgray ld
/LW/setlinewidth ld
/M/moveto ld
/re {4 2 roll M
1 index 0 rlineto
0 exch rlineto
neg 0 rlineto
cp } bd
/_ctm matrix def
/_tm matrix def
/BT { _ctm currentmatrix pop matrix _tm copy pop 0 0 moveto } bd
/ET { _ctm setmatrix } bd
/iTm { _ctm setmatrix _tm concat } bd
/Tm { _tm astore pop iTm 0 0 moveto } bd
/ux 0.0 def
/uy 0.0 def
/F {
  /Tp exch def
  /Tf exch def
  Tf findfont Tp scalefont setfont
  /cf Tf def  /cs Tp def
} bd
/ULS {currentpoint /uy exch def /ux exch def} bd
/ULE {
  /Tcx currentpoint pop def
  gsave
  newpath
  cf findfont cs scalefont dup
  /FontMatrix get 0 get /Ts exch def /FontInfo get dup
  /UnderlinePosition get Ts mul /To exch def
  /UnderlineThickness get Ts mul /Tt exch def
  ux uy To add moveto  Tcx uy To add lineto
  Tt setlinewidth stroke
  grestore
} bd
/OLE {
  /Tcx currentpoint pop def
  gsave
  newpath
  cf findfont cs scalefont dup
  /FontMatrix get 0 get /Ts exch def /FontInfo get dup
  /UnderlinePosition get Ts mul /To exch def
  /UnderlineThickness get Ts mul /Tt exch def
  ux uy To add cs add moveto Tcx uy To add cs add lineto
  Tt setlinewidth stroke
  grestore
} bd
/SOE {
  /Tcx currentpoint pop def
  gsave
  newpath
  cf findfont cs scalefont dup
  /FontMatrix get 0 get /Ts exch def /FontInfo get dup
  /UnderlinePosition get Ts mul /To exch def
  /UnderlineThickness get Ts mul /Tt exch def
  ux uy To add cs 10 mul 26 idiv add moveto Tcx uy To add cs 10 mul 26 idiv add lineto
  Tt setlinewidth stroke
  grestore
} bd
/QT {
/Y22 exch store
/X22 exch store
/Y21 exch store
/X21 exch store
currentpoint
/Y21 load 2 mul add 3 div exch
/X21 load 2 mul add 3 div exch
/X21 load 2 mul /X22 load add 3 div
/Y21 load 2 mul /Y22 load add 3 div
/X22 load /Y22 load curveto
} bd
/SSPD {
dup length /d exch dict def
{
/v exch def
/k exch def
currentpagedevice k known {
/cpdv currentpagedevice k get def
v cpdv ne {
/upd false def
/nullv v type /nulltype eq def
/nullcpdv cpdv type /nulltype eq def
nullv nullcpdv or
{
/upd true def
} {
/sametype v type cpdv type eq def
sametype {
v type /arraytype eq {
/vlen v length def
/cpdvlen cpdv length def
vlen cpdvlen eq {
0 1 vlen 1 sub {
/i exch def
/obj v i get def
/cpdobj cpdv i get def
obj cpdobj ne {
/upd true def
exit
} if
} for
} {
/upd true def
} ifelse
} {
v type /dicttype eq {
v {
/dv exch def
/dk exch def
/cpddv cpdv dk get def
dv cpddv ne {
/upd true def
exit
} if
} forall
} {
/upd true def
} ifelse
} ifelse
} if
} ifelse
upd true eq {
d k v put
} if
} if
} if
} forall
d length 0 gt {
d setpagedevice
} if
} bd
/RE { % /NewFontName [NewEncodingArray] /FontName RE -
  findfont dup length dict begin
  {
    1 index /FID ne
    {def} {pop pop} ifelse
  } forall
  /Encoding exch def
  /FontName 1 index def
  currentdict definefont pop
  end
} bind def
%%EndResource
%%BeginResource: procset (Apache XML Graphics EPS ProcSet) 1.0 0
%%Version: 1.0 0
%%Copyright: (Copyright 2002-2003 The Apache Software Foundation. License terms: http://www.apache.org/licenses/LICENSE-2.0)
/BeginEPSF { %def
/b4_Inc_state save def         % Save state for cleanup
/dict_count countdictstack def % Count objects on dict stack
/op_count count 1 sub def      % Count objects on operand stack
userdict begin                 % Push userdict on dict stack
/showpage { } def              % Redefine showpage, { } = null proc
0 setgray 0 setlinecap         % Prepare graphics state
1 setlinewidth 0 setlinejoin
10 setmiterlimit [ ] 0 setdash newpath
/languagelevel where           % If level not equal to 1 then
{pop languagelevel             % set strokeadjust and
1 ne                           % overprint to their defaults.
{false setstrokeadjust false setoverprint
} if
} if
} bd
/EndEPSF { %def
count op_count sub {pop} repeat            % Clean up stacks
countdictstack dict_count sub {end} repeat
b4_Inc_state restore
} bd
%%EndResource
%FOPBeginFontDict
%%IncludeResource: font Courier-Oblique
%%IncludeResource: font Courier-BoldOblique
%%IncludeResource: font Courier-Bold
%%IncludeResource: font ZapfDingbats
%%IncludeResource: font Symbol
%%IncludeResource: font Helvetica
%%IncludeResource: font Helvetica-Oblique
%%IncludeResource: font Helvetica-Bold
%%IncludeResource: font Helvetica-BoldOblique
%%IncludeResource: font Times-Roman
%%IncludeResource: font Times-Italic
%%IncludeResource: font Times-Bold
%%IncludeResource: font Times-BoldItalic
%%IncludeResource: font Courier
%FOPEndFontDict
%%BeginResource: encoding WinAnsiEncoding
/WinAnsiEncoding [
/.notdef /.notdef /.notdef /.notdef /.notdef
/.notdef /.notdef /.notdef /.notdef /.notdef
/.notdef /.notdef /.notdef /.notdef /.notdef
/.notdef /.notdef /.notdef /.notdef /.notdef
/.notdef /.notdef /.notdef /.notdef /.notdef
/.notdef /.notdef /.notdef /.notdef /.notdef
/.notdef /.notdef /space /exclam /quotedbl
/numbersign /dollar /percent /ampersand /quotesingle
/parenleft /parenright /asterisk /plus /comma
/hyphen /period /slash /zero /one
/two /three /four /five /six
/seven /eight /nine /colon /semicolon
/less /equal /greater /question /at
/A /B /C /D /E
/F /G /H /I /J
/K /L /M /N /O
/P /Q /R /S /T
/U /V /W /X /Y
/Z /bracketleft /backslash /bracketright /asciicircum
/underscore /quoteleft /a /b /c
/d /e /f /g /h
/i /j /k /l /m
/n /o /p /q /r
/s /t /u /v /w
/x /y /z /braceleft /bar
/braceright /asciitilde /bullet /Euro /bullet
/quotesinglbase /florin /quotedblbase /ellipsis /dagger
/daggerdbl /circumflex /perthousand /Scaron /guilsinglleft
/OE /bullet /Zcaron /bullet /bullet
/quoteleft /quoteright /quotedblleft /quotedblright /bullet
/endash /emdash /asciitilde /trademark /scaron
/guilsinglright /oe /bullet /zcaron /Ydieresis
/space /exclamdown /cent /sterling /currency
/yen /brokenbar /section /dieresis /copyright
/ordfeminine /guillemotleft /logicalnot /sfthyphen /registered
/macron /degree /plusminus /twosuperior /threesuperior
/acute /mu /paragraph /middot /cedilla
/onesuperior /ordmasculine /guillemotright /onequarter /onehalf
/threequarters /questiondown /Agrave /Aacute /Acircumflex
/Atilde /Adieresis /Aring /AE /Ccedilla
/Egrave /Eacute /Ecircumflex /Edieresis /Igrave
/Iacute /Icircumflex /Idieresis /Eth /Ntilde
/Ograve /Oacute /Ocircumflex /Otilde /Odieresis
/multiply /Oslash /Ugrave /Uacute /Ucircumflex
/Udieresis /Yacute /Thorn /germandbls /agrave
/aacute /acircumflex /atilde /adieresis /aring
/ae /ccedilla /egrave /eacute /ecircumflex
/edieresis /igrave /iacute /icircumflex /idieresis
/eth /ntilde /ograve /oacute /ocircumflex
/otilde /odieresis /divide /oslash /ugrave
/uacute /ucircumflex /udieresis /yacute /thorn
/ydieresis
] def
%%EndResource
%FOPBeginFontReencode
/Courier-Oblique findfont
dup length dict begin
  {1 index /FID ne {def} {pop pop} ifelse} forall
  /Encoding WinAnsiEncoding def
  currentdict
end
/Courier-Oblique exch definefont pop
/Courier-BoldOblique findfont
dup length dict begin
  {1 index /FID ne {def} {pop pop} ifelse} forall
  /Encoding WinAnsiEncoding def
  currentdict
end
/Courier-BoldOblique exch definefont pop
/Courier-Bold findfont
dup length dict begin
  {1 index /FID ne {def} {pop pop} ifelse} forall
  /Encoding WinAnsiEncoding def
  currentdict
end
/Courier-Bold exch definefont pop
/Helvetica findfont
dup length dict begin
  {1 index /FID ne {def} {pop pop} ifelse} forall
  /Encoding WinAnsiEncoding def
  currentdict
end
/Helvetica exch definefont pop
/Helvetica-Oblique findfont
dup length dict begin
  {1 index /FID ne {def} {pop pop} ifelse} forall
  /Encoding WinAnsiEncoding def
  currentdict
end
/Helvetica-Oblique exch definefont pop
/Helvetica-Bold findfont
dup length dict begin
  {1 index /FID ne {def} {pop pop} ifelse} forall
  /Encoding WinAnsiEncoding def
  currentdict
end
/Helvetica-Bold exch definefont pop
/Helvetica-BoldOblique findfont
dup length dict begin
  {1 index /FID ne {def} {pop pop} ifelse} forall
  /Encoding WinAnsiEncoding def
  currentdict
end
/Helvetica-BoldOblique exch definefont pop
/Times-Roman findfont
dup length dict begin
  {1 index /FID ne {def} {pop pop} ifelse} forall
  /Encoding WinAnsiEncoding def
  currentdict
end
/Times-Roman exch definefont pop
/Times-Italic findfont
dup length dict begin
  {1 index /FID ne {def} {pop pop} ifelse} forall
  /Encoding WinAnsiEncoding def
  currentdict
end
/Times-Italic exch definefont pop
/Times-Bold findfont
dup length dict begin
  {1 index /FID ne {def} {pop pop} ifelse} forall
  /Encoding WinAnsiEncoding def
  currentdict
end
/Times-Bold exch definefont pop
/Times-BoldItalic findfont
dup length dict begin
  {1 index /FID ne {def} {pop pop} ifelse} forall
  /Encoding WinAnsiEncoding def
  currentdict
end
/Times-BoldItalic exch definefont pop
/Courier findfont
dup length dict begin
  {1 index /FID ne {def} {pop pop} ifelse} forall
  /Encoding WinAnsiEncoding def
  currentdict
end
/Courier exch definefont pop
%FOPEndFontReencode
%%EndProlog
%%Page: 1 1
%%PageBoundingBox: 0 0 375 375
%%BeginPageSetup
[1 0 0 -1 0 375] CT
%%EndPageSetup
GS
[0.375 0 0 0.375 0 0] CT
1 GC
N
0 0 1000 1000 re
f
GR
GS
[0.375 0 0 0.375 0 0] CT
1 GC
N
0 0 1000 1000 re
f
GR
GS
[0.375 0 0 0.375 0 0] CT
1 GC
N
146 916 M
920 916 L
920 40 L
146 40 L
cp
f
GR
GS
[0.375 0 0 0.375 0 0] CT
2 setlinecap
1 LJ
1.333 LW
N
146 916 M
920 916 L
S
GR
GS
[0.375 0 0 0.375 0 0] CT
2 setlinecap
1 LJ
1.333 LW
N
404 916 M
404 907.24 L
S
GR
GS
[0.375 0 0 0.375 0 0] CT
2 setlinecap
1 LJ
1.333 LW
N
662 916 M
662 907.24 L
S
GR
GS
[0.375 0 0 0.375 151.5 347.50001] CT
/Helvetica 26.667 F
GS
[1 0 0 1 0 0] CT
-78 27 moveto 
1 -1 scale
(Last fix gains) t 
GR
GR
GS
[0.375 0 0 0.375 248.25 347.50001] CT
/Helvetica 26.667 F
GS
[1 0 0 1 0 0] CT
-84 27 moveto 
1 -1 scale
(Last fix losses) t 
GR
GR
GS
[0.375 0 0 0.375 0 0] CT
2 setlinecap
1 LJ
1.333 LW
N
146 916 M
146 40 L
S
GR
GS
[0.375 0 0 0.375 0 0] CT
2 setlinecap
1 LJ
1.333 LW
N
146 850.992 M
154.76 850.992 L
S
GR
GS
[0.375 0 0 0.375 0 0] CT
2 setlinecap
1 LJ
1.333 LW
N
146 722.062 M
154.76 722.062 L
S
GR
GS
[0.375 0 0 0.375 0 0] CT
2 setlinecap
1 LJ
1.333 LW
N
146 593.131 M
154.76 593.131 L
S
GR
GS
[0.375 0 0 0.375 0 0] CT
2 setlinecap
1 LJ
1.333 LW
N
146 464.201 M
154.76 464.201 L
S
GR
GS
[0.375 0 0 0.375 0 0] CT
2 setlinecap
1 LJ
1.333 LW
N
146 335.27 M
154.76 335.27 L
S
GR
GS
[0.375 0 0 0.375 0 0] CT
2 setlinecap
1 LJ
1.333 LW
N
146 206.339 M
154.76 206.339 L
S
GR
GS
[0.375 0 0 0.375 0 0] CT
2 setlinecap
1 LJ
1.333 LW
N
146 77.409 M
154.76 77.409 L
S
GR
GS
[0.375 0 0 0.375 50.75 319.12216] CT
/Helvetica 26.667 F
GS
[1 0 0 1 0 0] CT
-54 10.5 moveto 
1 -1 scale
(-500) t 
GR
GR
GS
[0.375 0 0 0.375 50.75 270.77319] CT
/Helvetica 26.667 F
GS
[1 0 0 1 0 0] CT
-54 10.5 moveto 
1 -1 scale
(-400) t 
GR
GR
GS
[0.375 0 0 0.375 50.75 222.42421] CT
/Helvetica 26.667 F
GS
[1 0 0 1 0 0] CT
-54 10.5 moveto 
1 -1 scale
(-300) t 
GR
GR
GS
[0.375 0 0 0.375 50.75 174.07524] CT
/Helvetica 26.667 F
GS
[1 0 0 1 0 0] CT
-54 10.5 moveto 
1 -1 scale
(-200) t 
GR
GR
GS
[0.375 0 0 0.375 50.75 125.72627] CT
/Helvetica 26.667 F
GS
[1 0 0 1 0 0] CT
-54 10.5 moveto 
1 -1 scale
(-100) t 
GR
GR
GS
[0.375 0 0 0.375 50.75 77.3773] CT
/Helvetica 26.667 F
GS
[1 0 0 1 0 0] CT
-15 10.5 moveto 
1 -1 scale
(0) t 
GR
GR
GS
[0.375 0 0 0.375 50.75 29.02833] CT
/Helvetica 26.667 F
GS
[1 0 0 1 0 0] CT
-45 10.5 moveto 
1 -1 scale
(100) t 
GR
GR
GS
[0 -0.375 0.375 0 27.5 179.24984] CT
/Helvetica 26.667 F
GS
[1 0 0 1 0 0] CT
-345.5 -6 moveto 
1 -1 scale
(PSE \(= point of subjective equality, where P\(accept\) = 0.5\)) t 
GR
GR
GS
[0.375 0 0 0.375 151.5 29.93182] CT
N
6.667 0 M
6.667 -3.682 3.682 -6.667 0 -6.667 C
-3.682 -6.667 -6.667 -3.682 -6.667 0 C
-6.667 3.682 -3.682 6.667 0 6.667 C
3.682 6.667 6.667 3.682 6.667 0 C
cp
f
GR
GS
[0.375 0 0 0.375 248.25 132.23565] CT
N
/f640454831{6.667 0 M
6.667 -3.682 3.682 -6.667 0 -6.667 C
-3.682 -6.667 -6.667 -3.682 -6.667 0 C
-6.667 3.682 -3.682 6.667 0 6.667 C
3.682 6.667 6.667 3.682 6.667 0 C
cp}def
f640454831
f
GR
GS
[0.375 0 0 0.375 0 0] CT
1 LJ
4 LW
N
404 79.818 M
662 352.628 L
S
GR
GS
[0.375 0 0 0.375 151.5 73.539] CT
N
f640454831
f
GR
GS
[0.375 0 0 0.375 248.25 69.67623] CT
N
f640454831
f
GR
GS
[0.375 0 0 0.375 0 0] CT
1 LJ
4 LW
N
404 196.104 M
662 185.803 L
S
GR
GS
[0.375 0 0 0.375 151.5 100.27895] CT
N
f640454831
f
GR
GS
[0.375 0 0 0.375 248.25 112.58831] CT
N
f640454831
f
GR
GS
[0.375 0 0 0.375 0 0] CT
1 LJ
4 LW
N
404 267.411 M
662 300.236 L
S
GR
GS
[0.375 0 0 0.375 151.5 81.11654] CT
N
f640454831
f
GR
GS
[0.375 0 0 0.375 248.25 77.52852] CT
N
f640454831
f
GR
GS
[0.375 0 0 0.375 0 0] CT
1 LJ
4 LW
N
404 216.311 M
662 206.743 L
S
GR
GS
[0.375 0 0 0.375 151.5 77.88321] CT
N
f640454831
f
GR
GS
[0.375 0 0 0.375 248.25 73.68334] CT
N
f640454831
f
GR
GS
[0.375 0 0 0.375 0 0] CT
1 LJ
4 LW
N
404 207.689 M
662 196.489 L
S
GR
GS
[0.375 0 0 0.375 151.5 76.18412] CT
N
f640454831
f
GR
GS
[0.375 0 0 0.375 248.25 75.05529] CT
N
f640454831
f
GR
GS
[0.375 0 0 0.375 0 0] CT
1 LJ
4 LW
N
404 203.158 M
662 200.147 L
S
GR
GS
[0.375 0 0 0.375 151.5 55.78229] CT
N
f640454831
f
GR
GS
[0.375 0 0 0.375 248.25 63.25228] CT
N
f640454831
f
GR
GS
[0.375 0 0 0.375 0 0] CT
1 LJ
4 LW
N
404 148.753 M
662 168.673 L
S
GR
GS
[0.375 0 0 0.375 151.5 88.08852] CT
N
f640454831
f
GR
GS
[0.375 0 0 0.375 248.25 86.8939] CT
N
f640454831
f
GR
GS
[0.375 0 0 0.375 0 0] CT
1 LJ
4 LW
N
404 234.903 M
662 231.717 L
S
GR
GS
[0.375 0 0 0.375 151.5 70.33866] CT
N
f640454831
f
GR
GS
[0.375 0 0 0.375 248.25 77.04298] CT
N
f640454831
f
GR
GS
[0.375 0 0 0.375 0 0] CT
1 LJ
4 LW
N
404 187.57 M
662 205.448 L
S
GR
GS
[0.375 0 0 0.375 151.5 84.21717] CT
N
f640454831
f
GR
GS
[0.375 0 0 0.375 248.25 82.78243] CT
N
f640454831
f
GR
GS
[0.375 0 0 0.375 0 0] CT
1 LJ
4 LW
N
404 224.579 M
662 220.753 L
S
GR
GS
[0.375 0 0 0.375 151.5 74.12092] CT
N
f640454831
f
GR
GS
[0.375 0 0 0.375 248.25 71.39604] CT
N
f640454831
f
GR
GS
[0.375 0 0 0.375 0 0] CT
1 LJ
4 LW
N
404 197.656 M
662 190.389 L
S
GR
GS
[0.375 0 0 0.375 151.5 78.11155] CT
N
f640454831
f
GR
GS
[0.375 0 0 0.375 248.25 73.60118] CT
N
f640454831
f
GR
GS
[0.375 0 0 0.375 0 0] CT
1 LJ
4 LW
N
404 208.297 M
662 196.27 L
S
GR
GS
[0.375 0 0 0.375 151.5 91.96329] CT
N
f640454831
f
GR
GS
[0.375 0 0 0.375 248.25 83.43982] CT
N
f640454831
f
GR
GS
[0.375 0 0 0.375 0 0] CT
1 LJ
4 LW
N
404 245.235 M
662 222.506 L
S
GR
GS
[0.375 0 0 0.375 151.5 80.63637] CT
N
f640454831
f
GR
GS
[0.375 0 0 0.375 248.25 75.50011] CT
N
f640454831
f
GR
GS
[0.375 0 0 0.375 0 0] CT
1 LJ
4 LW
N
404 215.03 M
662 201.334 L
S
GR
GS
[0.375 0 0 0.375 151.5 79.06038] CT
N
f640454831
f
GR
GS
[0.375 0 0 0.375 248.25 77.33113] CT
N
f640454831
f
GR
GS
[0.375 0 0 0.375 0 0] CT
1 LJ
4 LW
N
404 210.828 M
662 206.216 L
S
GR
GS
[0.375 0 0 0.375 151.5 85.18615] CT
N
f640454831
f
GR
GS
[0.375 0 0 0.375 248.25 32.94913] CT
N
f640454831
f
GR
GS
[0.375 0 0 0.375 0 0] CT
1 LJ
4 LW
N
404 227.163 M
662 87.864 L
S
GR
GS
[0.375 0 0 0.375 151.5 80.51238] CT
N
f640454831
f
GR
GS
[0.375 0 0 0.375 248.25 76.42563] CT
N
f640454831
f
GR
GS
[0.375 0 0 0.375 0 0] CT
1 LJ
4 LW
N
404 214.7 M
662 203.802 L
S
GR
GS
[0.375 0 0 0.375 151.5 80.04201] CT
N
f640454831
f
GR
GS
[0.375 0 0 0.375 248.25 67.32987] CT
N
f640454831
f
GR
GS
[0.375 0 0 0.375 0 0] CT
1 LJ
4 LW
N
404 213.445 M
662 179.546 L
S
GR
GS
[0.375 0 0 0.375 151.5 45.17509] CT
N
f640454831
f
GR
GS
[0.375 0 0 0.375 248.25 75.25804] CT
N
f640454831
f
GR
GS
[0.375 0 0 0.375 0 0] CT
1 LJ
4 LW
N
404 120.467 M
662 200.688 L
S
GR
GS
[0.375 0 0 0.375 151.5 74.08823] CT
N
f640454831
f
GR
GS
[0.375 0 0 0.375 248.25 244.35233] CT
N
f640454831
f
GR
GS
[0.375 0 0 0.375 0 0] CT
1 LJ
4 LW
N
404 197.569 M
662 651.606 L
S
GR
GS
[0.375 0 0 0.375 151.5 78.4156] CT
N
f640454831
f
GR
GS
[0.375 0 0 0.375 248.25 77.18191] CT
N
f640454831
f
GR
GS
[0.375 0 0 0.375 0 0] CT
1 LJ
4 LW
N
404 209.108 M
662 205.818 L
S
GR
GS
[0.375 0 0 0.375 151.5 328.56818] CT
N
f640454831
f
GR
GS
[0.375 0 0 0.375 248.25 90.24498] CT
N
f640454831
f
GR
GS
[0.375 0 0 0.375 0 0] CT
1 LJ
4 LW
N
404 876.182 M
662 240.653 L
S
GR
GS
[0.375 0 0 0.375 151.5 90.52239] CT
N
f640454831
f
GR
GS
[0.375 0 0 0.375 248.25 83.9755] CT
N
f640454831
f
GR
GS
[0.375 0 0 0.375 0 0] CT
1 LJ
4 LW
N
404 241.393 M
662 223.935 L
S
GR
GS
[0.375 0 0 0.375 151.5 98.31189] CT
N
f640454831
f
GR
GS
[0.375 0 0 0.375 248.25 88.09515] CT
N
f640454831
f
GR
GS
[0.375 0 0 0.375 0 0] CT
1 LJ
4 LW
N
404 262.165 M
662 234.92 L
S
GR
GS
[0.375 0 0 0.375 151.5 80.85266] CT
N
f640454831
f
GR
GS
[0.375 0 0 0.375 248.25 75.17061] CT
N
f640454831
f
GR
GS
[0.375 0 0 0.375 0 0] CT
1 LJ
4 LW
N
404 215.607 M
662 200.455 L
S
GR
GS
[0.375 0 0 0.375 151.5 90.30519] CT
N
f640454831
f
GR
GS
[0.375 0 0 0.375 248.25 77.11556] CT
N
f640454831
f
GR
GS
[0.375 0 0 0.375 0 0] CT
1 LJ
4 LW
N
404 240.814 M
662 205.641 L
S
GR
GS
[0.375 0 0 0.375 151.5 76.22377] CT
N
f640454831
f
GR
GS
[0.375 0 0 0.375 248.25 67.26577] CT
N
f640454831
f
GR
GS
[0.375 0 0 0.375 0 0] CT
1 LJ
4 LW
N
404 203.263 M
662 179.375 L
S
GR
GS
[0.375 0 0 0.375 151.5 81.70159] CT
N
f640454831
f
GR
GS
[0.375 0 0 0.375 248.25 79.54174] CT
N
f640454831
f
GR
GS
[0.375 0 0 0.375 0 0] CT
1 LJ
4 LW
N
404 217.871 M
662 212.111 L
S
GR
GS
[0.375 0 0 0.375 151.5 87.11644] CT
N
f640454831
f
GR
GS
[0.375 0 0 0.375 248.25 76.66138] CT
N
f640454831
f
GR
GS
[0.375 0 0 0.375 0 0] CT
1 LJ
4 LW
N
404 232.311 M
662 204.43 L
S
GR
GS
[0.375 0 0 0.375 151.5 75.45419] CT
N
f640454831
f
GR
GS
[0.375 0 0 0.375 248.25 74.91643] CT
N
f640454831
f
GR
GS
[0.375 0 0 0.375 0 0] CT
1 LJ
4 LW
N
404 201.211 M
662 199.777 L
S
GR
GS
[0.375 0 0 0.375 151.5 120.60092] CT
N
f640454831
f
GR
GS
[0.375 0 0 0.375 248.25 88.63494] CT
N
f640454831
f
GR
GS
[0.375 0 0 0.375 0 0] CT
1 LJ
4 LW
N
404 321.602 M
662 236.36 L
S
GR
GS
[0.375 0 0 0.375 151.5 83.02142] CT
N
f640454831
f
GR
GS
[0.375 0 0 0.375 248.25 87.86426] CT
N
f640454831
f
GR
GS
[0.375 0 0 0.375 0 0] CT
1 LJ
4 LW
N
404 221.39 M
662 234.305 L
S
GR
GS
[0.375 0 0 0.375 151.5 75.54628] CT
N
f640454831
f
GR
GS
[0.375 0 0 0.375 248.25 72.88469] CT
N
f640454831
f
GR
GS
[0.375 0 0 0.375 0 0] CT
1 LJ
4 LW
N
404 201.457 M
662 194.359 L
S
GR
GS
[0.375 0 0 0.375 151.5 89.45119] CT
N
f640454831
f
GR
GS
[0.375 0 0 0.375 248.25 90.61709] CT
N
f640454831
f
GR
GS
[0.375 0 0 0.375 0 0] CT
1 LJ
4 LW
N
404 238.537 M
662 241.646 L
S
GR
GS
[0.375 0 0 0.375 151.5 82.95605] CT
N
f640454831
f
GR
GS
[0.375 0 0 0.375 248.25 79.32294] CT
N
f640454831
f
GR
GS
[0.375 0 0 0.375 0 0] CT
1 LJ
4 LW
N
404 221.216 M
662 211.528 L
S
GR
GS
[0.375 0 0 0.375 151.5 81.27752] CT
N
f640454831
f
GR
GS
[0.375 0 0 0.375 248.25 82.53848] CT
N
f640454831
f
GR
GS
[0.375 0 0 0.375 0 0] CT
1 LJ
4 LW
N
404 216.74 M
662 220.103 L
S
GR
GS
[0.375 0 0 0.375 151.5 60.62719] CT
N
f640454831
f
GR
GS
[0.375 0 0 0.375 248.25 62.26872] CT
N
f640454831
f
GR
GS
[0.375 0 0 0.375 0 0] CT
1 LJ
4 LW
N
404 161.673 M
662 166.05 L
S
GR
GS
[0.375 0 0 0.375 151.5 76.24287] CT
N
f640454831
f
GR
GS
[0.375 0 0 0.375 248.25 75.09882] CT
N
f640454831
f
GR
GS
[0.375 0 0 0.375 0 0] CT
1 LJ
4 LW
N
404 203.314 M
662 200.264 L
S
GR
%%Trailer
%%Pages: 1
%%EOF
