%!PS-Adobe-3.0 EPSF-3.0
%%Creator: (MATLAB, The Mathworks, Inc. Version 9.7.0.1261785 \(R2019b\) Update 3. Operating System: Windows 10)
%%Title: C:/Users/Clarissa/Documents/decid_eye/analysis/manip1&2/1_pipeline/fixations/3_f_fixation_behav/plots/lvl2_agent/nFixByUtil.eps
%%CreationDate: 2021-05-03T22:46:32
%%Pages: (atend)
%%BoundingBox:    17    14   346   361
%%LanguageLevel: 3
%%EndComments
%%BeginProlog
%%BeginResource: procset (Apache XML Graphics Std ProcSet) 1.2 0
%%Version: 1.2 0
%%Copyright: (Copyright 2001-2003,2010 The Apache Software Foundation. License terms: http://www.apache.org/licenses/LICENSE-2.0)
/bd{bind def}bind def
/ld{load def}bd
/GR/grestore ld
/GS/gsave ld
/RM/rmoveto ld
/C/curveto ld
/t/show ld
/L/lineto ld
/ML/setmiterlimit ld
/CT/concat ld
/f/fill ld
/N/newpath ld
/S/stroke ld
/CC/setcmykcolor ld
/A/ashow ld
/cp/closepath ld
/RC/setrgbcolor ld
/LJ/setlinejoin ld
/GC/setgray ld
/LW/setlinewidth ld
/M/moveto ld
/re {4 2 roll M
1 index 0 rlineto
0 exch rlineto
neg 0 rlineto
cp } bd
/_ctm matrix def
/_tm matrix def
/BT { _ctm currentmatrix pop matrix _tm copy pop 0 0 moveto } bd
/ET { _ctm setmatrix } bd
/iTm { _ctm setmatrix _tm concat } bd
/Tm { _tm astore pop iTm 0 0 moveto } bd
/ux 0.0 def
/uy 0.0 def
/F {
  /Tp exch def
  /Tf exch def
  Tf findfont Tp scalefont setfont
  /cf Tf def  /cs Tp def
} bd
/ULS {currentpoint /uy exch def /ux exch def} bd
/ULE {
  /Tcx currentpoint pop def
  gsave
  newpath
  cf findfont cs scalefont dup
  /FontMatrix get 0 get /Ts exch def /FontInfo get dup
  /UnderlinePosition get Ts mul /To exch def
  /UnderlineThickness get Ts mul /Tt exch def
  ux uy To add moveto  Tcx uy To add lineto
  Tt setlinewidth stroke
  grestore
} bd
/OLE {
  /Tcx currentpoint pop def
  gsave
  newpath
  cf findfont cs scalefont dup
  /FontMatrix get 0 get /Ts exch def /FontInfo get dup
  /UnderlinePosition get Ts mul /To exch def
  /UnderlineThickness get Ts mul /Tt exch def
  ux uy To add cs add moveto Tcx uy To add cs add lineto
  Tt setlinewidth stroke
  grestore
} bd
/SOE {
  /Tcx currentpoint pop def
  gsave
  newpath
  cf findfont cs scalefont dup
  /FontMatrix get 0 get /Ts exch def /FontInfo get dup
  /UnderlinePosition get Ts mul /To exch def
  /UnderlineThickness get Ts mul /Tt exch def
  ux uy To add cs 10 mul 26 idiv add moveto Tcx uy To add cs 10 mul 26 idiv add lineto
  Tt setlinewidth stroke
  grestore
} bd
/QT {
/Y22 exch store
/X22 exch store
/Y21 exch store
/X21 exch store
currentpoint
/Y21 load 2 mul add 3 div exch
/X21 load 2 mul add 3 div exch
/X21 load 2 mul /X22 load add 3 div
/Y21 load 2 mul /Y22 load add 3 div
/X22 load /Y22 load curveto
} bd
/SSPD {
dup length /d exch dict def
{
/v exch def
/k exch def
currentpagedevice k known {
/cpdv currentpagedevice k get def
v cpdv ne {
/upd false def
/nullv v type /nulltype eq def
/nullcpdv cpdv type /nulltype eq def
nullv nullcpdv or
{
/upd true def
} {
/sametype v type cpdv type eq def
sametype {
v type /arraytype eq {
/vlen v length def
/cpdvlen cpdv length def
vlen cpdvlen eq {
0 1 vlen 1 sub {
/i exch def
/obj v i get def
/cpdobj cpdv i get def
obj cpdobj ne {
/upd true def
exit
} if
} for
} {
/upd true def
} ifelse
} {
v type /dicttype eq {
v {
/dv exch def
/dk exch def
/cpddv cpdv dk get def
dv cpddv ne {
/upd true def
exit
} if
} forall
} {
/upd true def
} ifelse
} ifelse
} if
} ifelse
upd true eq {
d k v put
} if
} if
} if
} forall
d length 0 gt {
d setpagedevice
} if
} bd
/RE { % /NewFontName [NewEncodingArray] /FontName RE -
  findfont dup length dict begin
  {
    1 index /FID ne
    {def} {pop pop} ifelse
  } forall
  /Encoding exch def
  /FontName 1 index def
  currentdict definefont pop
  end
} bind def
%%EndResource
%%BeginResource: procset (Apache XML Graphics EPS ProcSet) 1.0 0
%%Version: 1.0 0
%%Copyright: (Copyright 2002-2003 The Apache Software Foundation. License terms: http://www.apache.org/licenses/LICENSE-2.0)
/BeginEPSF { %def
/b4_Inc_state save def         % Save state for cleanup
/dict_count countdictstack def % Count objects on dict stack
/op_count count 1 sub def      % Count objects on operand stack
userdict begin                 % Push userdict on dict stack
/showpage { } def              % Redefine showpage, { } = null proc
0 setgray 0 setlinecap         % Prepare graphics state
1 setlinewidth 0 setlinejoin
10 setmiterlimit [ ] 0 setdash newpath
/languagelevel where           % If level not equal to 1 then
{pop languagelevel             % set strokeadjust and
1 ne                           % overprint to their defaults.
{false setstrokeadjust false setoverprint
} if
} if
} bd
/EndEPSF { %def
count op_count sub {pop} repeat            % Clean up stacks
countdictstack dict_count sub {end} repeat
b4_Inc_state restore
} bd
%%EndResource
%FOPBeginFontDict
%%IncludeResource: font Courier-Oblique
%%IncludeResource: font Courier-BoldOblique
%%IncludeResource: font Courier-Bold
%%IncludeResource: font ZapfDingbats
%%IncludeResource: font Symbol
%%IncludeResource: font Helvetica
%%IncludeResource: font Helvetica-Oblique
%%IncludeResource: font Helvetica-Bold
%%IncludeResource: font Helvetica-BoldOblique
%%IncludeResource: font Times-Roman
%%IncludeResource: font Times-Italic
%%IncludeResource: font Times-Bold
%%IncludeResource: font Times-BoldItalic
%%IncludeResource: font Courier
%FOPEndFontDict
%%BeginResource: encoding WinAnsiEncoding
/WinAnsiEncoding [
/.notdef /.notdef /.notdef /.notdef /.notdef
/.notdef /.notdef /.notdef /.notdef /.notdef
/.notdef /.notdef /.notdef /.notdef /.notdef
/.notdef /.notdef /.notdef /.notdef /.notdef
/.notdef /.notdef /.notdef /.notdef /.notdef
/.notdef /.notdef /.notdef /.notdef /.notdef
/.notdef /.notdef /space /exclam /quotedbl
/numbersign /dollar /percent /ampersand /quotesingle
/parenleft /parenright /asterisk /plus /comma
/hyphen /period /slash /zero /one
/two /three /four /five /six
/seven /eight /nine /colon /semicolon
/less /equal /greater /question /at
/A /B /C /D /E
/F /G /H /I /J
/K /L /M /N /O
/P /Q /R /S /T
/U /V /W /X /Y
/Z /bracketleft /backslash /bracketright /asciicircum
/underscore /quoteleft /a /b /c
/d /e /f /g /h
/i /j /k /l /m
/n /o /p /q /r
/s /t /u /v /w
/x /y /z /braceleft /bar
/braceright /asciitilde /bullet /Euro /bullet
/quotesinglbase /florin /quotedblbase /ellipsis /dagger
/daggerdbl /circumflex /perthousand /Scaron /guilsinglleft
/OE /bullet /Zcaron /bullet /bullet
/quoteleft /quoteright /quotedblleft /quotedblright /bullet
/endash /emdash /asciitilde /trademark /scaron
/guilsinglright /oe /bullet /zcaron /Ydieresis
/space /exclamdown /cent /sterling /currency
/yen /brokenbar /section /dieresis /copyright
/ordfeminine /guillemotleft /logicalnot /sfthyphen /registered
/macron /degree /plusminus /twosuperior /threesuperior
/acute /mu /paragraph /middot /cedilla
/onesuperior /ordmasculine /guillemotright /onequarter /onehalf
/threequarters /questiondown /Agrave /Aacute /Acircumflex
/Atilde /Adieresis /Aring /AE /Ccedilla
/Egrave /Eacute /Ecircumflex /Edieresis /Igrave
/Iacute /Icircumflex /Idieresis /Eth /Ntilde
/Ograve /Oacute /Ocircumflex /Otilde /Odieresis
/multiply /Oslash /Ugrave /Uacute /Ucircumflex
/Udieresis /Yacute /Thorn /germandbls /agrave
/aacute /acircumflex /atilde /adieresis /aring
/ae /ccedilla /egrave /eacute /ecircumflex
/edieresis /igrave /iacute /icircumflex /idieresis
/eth /ntilde /ograve /oacute /ocircumflex
/otilde /odieresis /divide /oslash /ugrave
/uacute /ucircumflex /udieresis /yacute /thorn
/ydieresis
] def
%%EndResource
%FOPBeginFontReencode
/Courier-Oblique findfont
dup length dict begin
  {1 index /FID ne {def} {pop pop} ifelse} forall
  /Encoding WinAnsiEncoding def
  currentdict
end
/Courier-Oblique exch definefont pop
/Courier-BoldOblique findfont
dup length dict begin
  {1 index /FID ne {def} {pop pop} ifelse} forall
  /Encoding WinAnsiEncoding def
  currentdict
end
/Courier-BoldOblique exch definefont pop
/Courier-Bold findfont
dup length dict begin
  {1 index /FID ne {def} {pop pop} ifelse} forall
  /Encoding WinAnsiEncoding def
  currentdict
end
/Courier-Bold exch definefont pop
/Helvetica findfont
dup length dict begin
  {1 index /FID ne {def} {pop pop} ifelse} forall
  /Encoding WinAnsiEncoding def
  currentdict
end
/Helvetica exch definefont pop
/Helvetica-Oblique findfont
dup length dict begin
  {1 index /FID ne {def} {pop pop} ifelse} forall
  /Encoding WinAnsiEncoding def
  currentdict
end
/Helvetica-Oblique exch definefont pop
/Helvetica-Bold findfont
dup length dict begin
  {1 index /FID ne {def} {pop pop} ifelse} forall
  /Encoding WinAnsiEncoding def
  currentdict
end
/Helvetica-Bold exch definefont pop
/Helvetica-BoldOblique findfont
dup length dict begin
  {1 index /FID ne {def} {pop pop} ifelse} forall
  /Encoding WinAnsiEncoding def
  currentdict
end
/Helvetica-BoldOblique exch definefont pop
/Times-Roman findfont
dup length dict begin
  {1 index /FID ne {def} {pop pop} ifelse} forall
  /Encoding WinAnsiEncoding def
  currentdict
end
/Times-Roman exch definefont pop
/Times-Italic findfont
dup length dict begin
  {1 index /FID ne {def} {pop pop} ifelse} forall
  /Encoding WinAnsiEncoding def
  currentdict
end
/Times-Italic exch definefont pop
/Times-Bold findfont
dup length dict begin
  {1 index /FID ne {def} {pop pop} ifelse} forall
  /Encoding WinAnsiEncoding def
  currentdict
end
/Times-Bold exch definefont pop
/Times-BoldItalic findfont
dup length dict begin
  {1 index /FID ne {def} {pop pop} ifelse} forall
  /Encoding WinAnsiEncoding def
  currentdict
end
/Times-BoldItalic exch definefont pop
/Courier findfont
dup length dict begin
  {1 index /FID ne {def} {pop pop} ifelse} forall
  /Encoding WinAnsiEncoding def
  currentdict
end
/Courier exch definefont pop
%FOPEndFontReencode
%%EndProlog
%%Page: 1 1
%%PageBoundingBox: 0 0 375 375
%%BeginPageSetup
[1 0 0 -1 0 375] CT
%%EndPageSetup
GS
[0.375 0 0 0.375 0 0] CT
1 GC
N
0 0 1000 1000 re
f
GR
GS
[0.375 0 0 0.375 0 0] CT
1 GC
N
0 0 1000 1000 re
f
GR
GS
[0.375 0 0 0.375 0 0] CT
1 GC
N
107 881 M
920 881 L
920 40 L
107 40 L
cp
f
GR
GS
[0.375 0 0 0.375 0 0] CT
2 setlinecap
1 LJ
1.333 LW
N
107 881 M
920 881 L
S
GR
GS
[0.375 0 0 0.375 0 0] CT
2 setlinecap
1 LJ
1.333 LW
N
143.955 881 M
143.955 872.59 L
S
GR
GS
[0.375 0 0 0.375 0 0] CT
2 setlinecap
1 LJ
1.333 LW
N
328.727 881 M
328.727 872.59 L
S
GR
GS
[0.375 0 0 0.375 0 0] CT
2 setlinecap
1 LJ
1.333 LW
N
513.5 881 M
513.5 872.59 L
S
GR
GS
[0.375 0 0 0.375 0 0] CT
2 setlinecap
1 LJ
1.333 LW
N
698.273 881 M
698.273 872.59 L
S
GR
GS
[0.375 0 0 0.375 0 0] CT
2 setlinecap
1 LJ
1.333 LW
N
883.045 881 M
883.045 872.59 L
S
GR
GS
[0.375 0 0 0.375 53.98295 334.37501] CT
/Helvetica 26.667 F
GS
[1 0 0 1 0 0] CT
-19 27 moveto 
1 -1 scale
(20 ) t 
GR
GR
GS
[0.375 0 0 0.375 123.27272 334.37501] CT
/Helvetica 26.667 F
GS
[1 0 0 1 0 0] CT
-19 27 moveto 
1 -1 scale
(40 ) t 
GR
GR
GS
[0.375 0 0 0.375 192.5625 334.37501] CT
/Helvetica 26.667 F
GS
[1 0 0 1 0 0] CT
-19 27 moveto 
1 -1 scale
(60 ) t 
GR
GR
GS
[0.375 0 0 0.375 261.85226 334.37501] CT
/Helvetica 26.667 F
GS
[1 0 0 1 0 0] CT
-19 27 moveto 
1 -1 scale
(80 ) t 
GR
GR
GS
[0.375 0 0 0.375 331.14205 334.37501] CT
/Helvetica 26.667 F
GS
[1 0 0 1 0 0] CT
-22.5 27 moveto 
1 -1 scale
(100) t 
GR
GR
GS
[0.375 0 0 0.375 192.56264 347.74999] CT
/Helvetica 26.667 F
GS
[1 0 0 1 0 0] CT
-121 27 moveto 
1 -1 scale
(|Utility|, percent rank) t 
GR
GR
GS
[0.375 0 0 0.375 0 0] CT
2 setlinecap
1 LJ
1.333 LW
N
107 881 M
107 40 L
S
GR
GS
[0.375 0 0 0.375 0 0] CT
2 setlinecap
1 LJ
1.333 LW
N
107 862.492 M
115.41 862.492 L
S
GR
GS
[0.375 0 0 0.375 0 0] CT
2 setlinecap
1 LJ
1.333 LW
N
107 749.105 M
115.41 749.105 L
S
GR
GS
[0.375 0 0 0.375 0 0] CT
2 setlinecap
1 LJ
1.333 LW
N
107 635.717 M
115.41 635.717 L
S
GR
GS
[0.375 0 0 0.375 0 0] CT
2 setlinecap
1 LJ
1.333 LW
N
107 522.329 M
115.41 522.329 L
S
GR
GS
[0.375 0 0 0.375 0 0] CT
2 setlinecap
1 LJ
1.333 LW
N
107 408.941 M
115.41 408.941 L
S
GR
GS
[0.375 0 0 0.375 0 0] CT
2 setlinecap
1 LJ
1.333 LW
N
107 295.554 M
115.41 295.554 L
S
GR
GS
[0.375 0 0 0.375 36.125 323.43462] CT
/Helvetica 26.667 F
GS
[1 0 0 1 0 0] CT
-15 10.5 moveto 
1 -1 scale
(0) t 
GR
GR
GS
[0.375 0 0 0.375 36.125 280.91423] CT
/Helvetica 26.667 F
GS
[1 0 0 1 0 0] CT
-15 10.5 moveto 
1 -1 scale
(1) t 
GR
GR
GS
[0.375 0 0 0.375 36.125 238.39384] CT
/Helvetica 26.667 F
GS
[1 0 0 1 0 0] CT
-15 10.5 moveto 
1 -1 scale
(2) t 
GR
GR
GS
[0.375 0 0 0.375 36.125 195.87344] CT
/Helvetica 26.667 F
GS
[1 0 0 1 0 0] CT
-15 10.5 moveto 
1 -1 scale
(3) t 
GR
GR
GS
[0.375 0 0 0.375 36.125 153.35305] CT
/Helvetica 26.667 F
GS
[1 0 0 1 0 0] CT
-15 10.5 moveto 
1 -1 scale
(4) t 
GR
GR
GS
[0.375 0 0 0.375 36.125 110.83265] CT
/Helvetica 26.667 F
GS
[1 0 0 1 0 0] CT
-15 10.5 moveto 
1 -1 scale
(5) t 
GR
GR
GS
[0 -0.375 0.375 0 27.5 172.68735] CT
/Helvetica 26.667 F
GS
[1 0 0 1 0 0] CT
-178 -6 moveto 
1 -1 scale
(NB of fixations to gains/losses) t 
GR
GR
GS
[0.375 0 0 0.375 53.98295 272.81511] CT
N
6.667 0 M
6.667 -3.682 3.682 -6.667 0 -6.667 C
-3.682 -6.667 -6.667 -3.682 -6.667 0 C
-6.667 3.682 -3.682 6.667 0 6.667 C
3.682 6.667 6.667 3.682 6.667 0 C
cp
f
GR
GS
[0.375 0 0 0.375 123.27272 278.88945] CT
N
/f640454831{6.667 0 M
6.667 -3.682 3.682 -6.667 0 -6.667 C
-3.682 -6.667 -6.667 -3.682 -6.667 0 C
-6.667 3.682 -3.682 6.667 0 6.667 C
3.682 6.667 6.667 3.682 6.667 0 C
cp}def
f640454831
f
GR
GS
[0.375 0 0 0.375 192.5625 269.31775] CT
N
f640454831
f
GR
GS
[0.375 0 0 0.375 261.85226 266.74077] CT
N
f640454831
f
GR
GS
[0.375 0 0 0.375 331.14205 282.93901] CT
N
f640454831
f
GR
GS
[0.375 0 0 0.375 53.98295 147.75826] CT
N
f640454831
f
GR
GS
[0.375 0 0 0.375 123.27272 188.04073] CT
N
f640454831
f
GR
GS
[0.375 0 0 0.375 192.5625 156.62385] CT
N
f640454831
f
GR
GS
[0.375 0 0 0.375 261.85226 171.25637] CT
N
f640454831
f
GR
GS
[0.375 0 0 0.375 331.14205 171.25637] CT
N
f640454831
f
GR
GS
[0.375 0 0 0.375 53.98295 272.64638] CT
N
f640454831
f
GR
GS
[0.375 0 0 0.375 123.27272 276.31744] CT
N
f640454831
f
GR
GS
[0.375 0 0 0.375 192.5625 279.73311] CT
N
f640454831
f
GR
GS
[0.375 0 0 0.375 261.85226 290.10782] CT
N
f640454831
f
GR
GS
[0.375 0 0 0.375 331.14205 285.63872] CT
N
f640454831
f
GR
GS
[0.375 0 0 0.375 53.98295 207.77916] CT
N
f640454831
f
GR
GS
[0.375 0 0 0.375 123.27272 195.87344] CT
N
f640454831
f
GR
GS
[0.375 0 0 0.375 192.5625 223.0865] CT
N
f640454831
f
GR
GS
[0.375 0 0 0.375 261.85226 214.58242] CT
N
f640454831
f
GR
GS
[0.375 0 0 0.375 331.14205 238.39384] CT
N
f640454831
f
GR
GS
[0.375 0 0 0.375 53.98295 129.85494] CT
N
f640454831
f
GR
GS
[0.375 0 0 0.375 123.27272 148.87721] CT
N
f640454831
f
GR
GS
[0.375 0 0 0.375 192.5625 130.36905] CT
N
f640454831
f
GR
GS
[0.375 0 0 0.375 261.85226 147.75826] CT
N
f640454831
f
GR
GS
[0.375 0 0 0.375 331.14205 160.0668] CT
N
f640454831
f
GR
GS
[0.375 0 0 0.375 53.98295 202.12644] CT
N
f640454831
f
GR
GS
[0.375 0 0 0.375 123.27272 209.63004] CT
N
f640454831
f
GR
GS
[0.375 0 0 0.375 192.5625 209.237] CT
N
f640454831
f
GR
GS
[0.375 0 0 0.375 261.85226 210.88065] CT
N
f640454831
f
GR
GS
[0.375 0 0 0.375 331.14205 224.63722] CT
N
f640454831
f
GR
GS
[0.375 0 0 0.375 53.98295 62.40665] CT
N
f640454831
f
GR
GS
[0.375 0 0 0.375 123.27272 29.33523] CT
N
f640454831
f
GR
GS
[0.375 0 0 0.375 192.5625 55.31992] CT
N
f640454831
f
GR
GS
[0.375 0 0 0.375 261.85226 60.04439] CT
N
f640454831
f
GR
GS
[0.375 0 0 0.375 331.14205 70.67449] CT
N
f640454831
f
GR
GS
[0.375 0 0 0.375 53.98295 205.94405] CT
N
f640454831
f
GR
GS
[0.375 0 0 0.375 123.27272 222.72842] CT
N
f640454831
f
GR
GS
[0.375 0 0 0.375 192.5625 217.70824] CT
N
f640454831
f
GR
GS
[0.375 0 0 0.375 261.85226 221.60948] CT
N
f640454831
f
GR
GS
[0.375 0 0 0.375 331.14205 226.08529] CT
N
f640454831
f
GR
GS
[0.375 0 0 0.375 53.98295 310.49364] CT
N
f640454831
f
GR
GS
[0.375 0 0 0.375 123.27272 312.80452] CT
N
f640454831
f
GR
GS
[0.375 0 0 0.375 192.5625 316.03976] CT
N
f640454831
f
GR
GS
[0.375 0 0 0.375 261.85226 307.48947] CT
N
f640454831
f
GR
GS
[0.375 0 0 0.375 331.14205 314.19106] CT
N
f640454831
f
GR
GS
[0.375 0 0 0.375 53.98295 170.59105] CT
N
f640454831
f
GR
GS
[0.375 0 0 0.375 123.27272 165.99424] CT
N
f640454831
f
GR
GS
[0.375 0 0 0.375 192.5625 171.74024] CT
N
f640454831
f
GR
GS
[0.375 0 0 0.375 261.85226 213.11144] CT
N
f640454831
f
GR
GS
[0.375 0 0 0.375 331.14205 215.40985] CT
N
f640454831
f
GR
GS
[0.375 0 0 0.375 53.98295 156.80065] CT
N
f640454831
f
GR
GS
[0.375 0 0 0.375 123.27272 158.21252] CT
N
f640454831
f
GR
GS
[0.375 0 0 0.375 192.5625 179.78465] CT
N
f640454831
f
GR
GS
[0.375 0 0 0.375 261.85226 180.51885] CT
N
f640454831
f
GR
GS
[0.375 0 0 0.375 331.14205 204.14129] CT
N
f640454831
f
GR
GS
[0.375 0 0 0.375 53.98295 193.63552] CT
N
f640454831
f
GR
GS
[0.375 0 0 0.375 123.27272 199.23031] CT
N
f640454831
f
GR
GS
[0.375 0 0 0.375 192.5625 197.02265] CT
N
f640454831
f
GR
GS
[0.375 0 0 0.375 261.85226 222.72842] CT
N
f640454831
f
GR
GS
[0.375 0 0 0.375 331.14205 203.70614] CT
N
f640454831
f
GR
GS
[0.375 0 0 0.375 53.98295 138.0457] CT
N
f640454831
f
GR
GS
[0.375 0 0 0.375 123.27272 137.40789] CT
N
f640454831
f
GR
GS
[0.375 0 0 0.375 192.5625 132.94326] CT
N
f640454831
f
GR
GS
[0.375 0 0 0.375 261.85226 146.26632] CT
N
f640454831
f
GR
GS
[0.375 0 0 0.375 331.14205 114.23428] CT
N
f640454831
f
GR
GS
[0.375 0 0 0.375 53.98295 223.8474] CT
N
f640454831
f
GR
GS
[0.375 0 0 0.375 123.27272 233.91799] CT
N
f640454831
f
GR
GS
[0.375 0 0 0.375 192.5625 212.22743] CT
N
f640454831
f
GR
GS
[0.375 0 0 0.375 261.85226 211.53884] CT
N
f640454831
f
GR
GS
[0.375 0 0 0.375 331.14205 236.15591] CT
N
f640454831
f
GR
GS
[0.375 0 0 0.375 53.98295 238.39384] CT
N
f640454831
f
GR
GS
[0.375 0 0 0.375 123.27272 231.49864] CT
N
f640454831
f
GR
GS
[0.375 0 0 0.375 192.5625 227.20427] CT
N
f640454831
f
GR
GS
[0.375 0 0 0.375 261.85226 222.30503] CT
N
f640454831
f
GR
GS
[0.375 0 0 0.375 331.14205 229.20023] CT
N
f640454831
f
GR
GS
[0.375 0 0 0.375 53.98295 256.61687] CT
N
f640454831
f
GR
GS
[0.375 0 0 0.375 123.27272 247.14803] CT
N
f640454831
f
GR
GS
[0.375 0 0 0.375 192.5625 250.54253] CT
N
f640454831
f
GR
GS
[0.375 0 0 0.375 261.85226 259.65404] CT
N
f640454831
f
GR
GS
[0.375 0 0 0.375 331.14205 251.75739] CT
N
f640454831
f
GR
GS
[0.375 0 0 0.375 53.98295 144.49463] CT
N
f640454831
f
GR
GS
[0.375 0 0 0.375 123.27272 165.25875] CT
N
f640454831
f
GR
GS
[0.375 0 0 0.375 192.5625 135.63622] CT
N
f640454831
f
GR
GS
[0.375 0 0 0.375 261.85226 183.96774] CT
N
f640454831
f
GR
GS
[0.375 0 0 0.375 331.14205 183.47166] CT
N
f640454831
f
GR
GS
[0.375 0 0 0.375 53.98295 221.60948] CT
N
f640454831
f
GR
GS
[0.375 0 0 0.375 123.27272 203.70614] CT
N
f640454831
f
GR
GS
[0.375 0 0 0.375 192.5625 202.41504] CT
N
f640454831
f
GR
GS
[0.375 0 0 0.375 261.85226 203.70614] CT
N
f640454831
f
GR
GS
[0.375 0 0 0.375 331.14205 205.94405] CT
N
f640454831
f
GR
GS
[0.375 0 0 0.375 53.98295 293.42022] CT
N
f640454831
f
GR
GS
[0.375 0 0 0.375 123.27272 275.91183] CT
N
f640454831
f
GR
GS
[0.375 0 0 0.375 192.5625 280.91423] CT
N
f640454831
f
GR
GS
[0.375 0 0 0.375 261.85226 274.66122] CT
N
f640454831
f
GR
GS
[0.375 0 0 0.375 331.14205 267.15763] CT
N
f640454831
f
GR
GS
[0.375 0 0 0.375 53.98295 238.39384] CT
N
f640454831
f
GR
GS
[0.375 0 0 0.375 123.27272 218.25259] CT
N
f640454831
f
GR
GS
[0.375 0 0 0.375 192.5625 233.79703] CT
N
f640454831
f
GR
GS
[0.375 0 0 0.375 261.85226 226.08529] CT
N
f640454831
f
GR
GS
[0.375 0 0 0.375 331.14205 242.99064] CT
N
f640454831
f
GR
GS
[0.375 0 0 0.375 53.98295 209.66384] CT
N
f640454831
f
GR
GS
[0.375 0 0 0.375 123.27272 202.58718] CT
N
f640454831
f
GR
GS
[0.375 0 0 0.375 192.5625 199.32104] CT
N
f640454831
f
GR
GS
[0.375 0 0 0.375 261.85226 208.18197] CT
N
f640454831
f
GR
GS
[0.375 0 0 0.375 331.14205 215.40985] CT
N
f640454831
f
GR
GS
[0.375 0 0 0.375 53.98295 246.22655] CT
N
f640454831
f
GR
GS
[0.375 0 0 0.375 123.27272 251.82133] CT
N
f640454831
f
GR
GS
[0.375 0 0 0.375 192.5625 267.12383] CT
N
f640454831
f
GR
GS
[0.375 0 0 0.375 261.85226 266.36778] CT
N
f640454831
f
GR
GS
[0.375 0 0 0.375 331.14205 284.2711] CT
N
f640454831
f
GR
GS
[0.375 0 0 0.375 53.98295 203.70614] CT
N
f640454831
f
GR
GS
[0.375 0 0 0.375 123.27272 186.67984] CT
N
f640454831
f
GR
GS
[0.375 0 0 0.375 192.5625 213.77676] CT
N
f640454831
f
GR
GS
[0.375 0 0 0.375 261.85226 198.17184] CT
N
f640454831
f
GR
GS
[0.375 0 0 0.375 331.14205 211.53884] CT
N
f640454831
f
GR
GS
[0.375 0 0 0.375 53.98295 230.34943] CT
N
f640454831
f
GR
GS
[0.375 0 0 0.375 123.27272 232.64783] CT
N
f640454831
f
GR
GS
[0.375 0 0 0.375 192.5625 236.09544] CT
N
f640454831
f
GR
GS
[0.375 0 0 0.375 261.85226 236.09544] CT
N
f640454831
f
GR
GS
[0.375 0 0 0.375 331.14205 251.03503] CT
N
f640454831
f
GR
GS
[0.375 0 0 0.375 53.98295 160.15631] CT
N
f640454831
f
GR
GS
[0.375 0 0 0.375 123.27272 124.43919] CT
N
f640454831
f
GR
GS
[0.375 0 0 0.375 192.5625 181.69997] CT
N
f640454831
f
GR
GS
[0.375 0 0 0.375 261.85226 175.46365] CT
N
f640454831
f
GR
GS
[0.375 0 0 0.375 331.14205 211.18078] CT
N
f640454831
f
GR
GS
[0.375 0 0 0.375 53.98295 185.74953] CT
N
f640454831
f
GR
GS
[0.375 0 0 0.375 123.27272 195.87344] CT
N
f640454831
f
GR
GS
[0.375 0 0 0.375 192.5625 151.32827] CT
N
f640454831
f
GR
GS
[0.375 0 0 0.375 261.85226 200.12547] CT
N
f640454831
f
GR
GS
[0.375 0 0 0.375 331.14205 195.87344] CT
N
f640454831
f
GR
GS
[0.375 0 0 0.375 53.98295 237.24463] CT
N
f640454831
f
GR
GS
[0.375 0 0 0.375 123.27272 224.60344] CT
N
f640454831
f
GR
GS
[0.375 0 0 0.375 192.5625 238.39384] CT
N
f640454831
f
GR
GS
[0.375 0 0 0.375 261.85226 199.32104] CT
N
f640454831
f
GR
GS
[0.375 0 0 0.375 331.14205 267.12383] CT
N
f640454831
f
GR
GS
[0.375 0 0 0.375 53.98295 165.99424] CT
N
f640454831
f
GR
GS
[0.375 0 0 0.375 123.27272 165.99424] CT
N
f640454831
f
GR
GS
[0.375 0 0 0.375 192.5625 153.35305] CT
N
f640454831
f
GR
GS
[0.375 0 0 0.375 261.85226 157.94984] CT
N
f640454831
f
GR
GS
[0.375 0 0 0.375 331.14205 216.55904] CT
N
f640454831
f
GR
GS
[0.375 0 0 0.375 53.98295 233.79703] CT
N
f640454831
f
GR
GS
[0.375 0 0 0.375 123.27272 244.13983] CT
N
f640454831
f
GR
GS
[0.375 0 0 0.375 192.5625 242.86967] CT
N
f640454831
f
GR
GS
[0.375 0 0 0.375 261.85226 268.27304] CT
N
f640454831
f
GR
GS
[0.375 0 0 0.375 331.14205 259.07943] CT
N
f640454831
f
GR
GS
[0.375 0 0 0.375 53.98295 237.27489] CT
N
f640454831
f
GR
GS
[0.375 0 0 0.375 123.27272 237.27489] CT
N
f640454831
f
GR
GS
[0.375 0 0 0.375 192.5625 267.12383] CT
N
f640454831
f
GR
GS
[0.375 0 0 0.375 261.85226 279.79527] CT
N
f640454831
f
GR
GS
[0.375 0 0 0.375 331.14205 269.72466] CT
N
f640454831
f
GR
GS
[0.375 0 0 0.375 53.98295 232.79906] CT
N
f640454831
f
GR
GS
[0.375 0 0 0.375 123.27272 248.73663] CT
N
f640454831
f
GR
GS
[0.375 0 0 0.375 192.5625 250.70238] CT
N
f640454831
f
GR
GS
[0.375 0 0 0.375 261.85226 247.58743] CT
N
f640454831
f
GR
GS
[0.375 0 0 0.375 331.14205 277.55736] CT
N
f640454831
f
GR
GS
[0.375 0 0 0.375 53.98295 189.49538] CT
N
f640454831
f
GR
GS
[0.375 0 0 0.375 123.27272 123.58878] CT
N
f640454831
f
GR
GS
[0.375 0 0 0.375 192.5625 149.30348] CT
N
f640454831
f
GR
GS
[0.375 0 0 0.375 261.85226 153.35305] CT
N
f640454831
f
GR
GS
[0.375 0 0 0.375 331.14205 208.62955] CT
N
f640454831
f
GR
GS
[0.375 0 0 0.375 53.98295 217.70824] CT
N
f640454831
f
GR
GS
[0.375 0 0 0.375 123.27272 209.66384] CT
N
f640454831
f
GR
GS
[0.375 0 0 0.375 192.5625 236.03158] CT
N
f640454831
f
GR
GS
[0.375 0 0 0.375 261.85226 239.54304] CT
N
f640454831
f
GR
GS
[0.375 0 0 0.375 331.14205 232.64783] CT
N
f640454831
f
GR
GS
[0.375 0 0 0.375 53.98295 153.35305] CT
N
f640454831
f
GR
GS
[0.375 0 0 0.375 123.27272 155.59097] CT
N
f640454831
f
GR
GS
[0.375 0 0 0.375 192.5625 133.81666] CT
N
f640454831
f
GR
GS
[0.375 0 0 0.375 261.85226 172.37533] CT
N
f640454831
f
GR
GS
[0.375 0 0 0.375 331.14205 156.70991] CT
N
f640454831
f
GR
GS
[0.375 0 0 0.375 53.98295 127.84082] CT
N
f640454831
f
GR
GS
[0.375 0 0 0.375 123.27272 107.56186] CT
N
f640454831
f
GR
GS
[0.375 0 0 0.375 192.5625 151.65223] CT
N
f640454831
f
GR
GS
[0.375 0 0 0.375 261.85226 168.07164] CT
N
f640454831
f
GR
GS
[0.375 0 0 0.375 331.14205 166.95957] CT
N
f640454831
f
GR
GS
[0.375 0 0 0.375 53.98295 289.86589] CT
N
f640454831
f
GR
GS
[0.375 0 0 0.375 123.27272 293.67034] CT
N
f640454831
f
GR
GS
[0.375 0 0 0.375 192.5625 283.15215] CT
N
f640454831
f
GR
GS
[0.375 0 0 0.375 261.85226 297.92239] CT
N
f640454831
f
GR
GS
[0.375 0 0 0.375 331.14205 303.29338] CT
N
f640454831
f
GR
GS
[0.375 0 0 0.375 53.98295 182.26691] CT
N
f640454831
f
GR
GS
[0.375 0 0 0.375 123.27272 189.07018] CT
N
f640454831
f
GR
GS
[0.375 0 0 0.375 192.5625 197.64512] CT
N
f640454831
f
GR
GS
[0.375 0 0 0.375 261.85226 211.18078] CT
N
f640454831
f
GR
GS
[0.375 0 0 0.375 331.14205 212.8816] CT
N
f640454831
f
GR
GS
[0.375 0 0 0.375 53.98295 236.69302] CT
N
f640454831
f
GR
GS
[0.375 0 0 0.375 123.27272 231.59056] CT
N
f640454831
f
GR
GS
[0.375 0 0 0.375 192.5625 240.09464] CT
N
f640454831
f
GR
GS
[0.375 0 0 0.375 261.85226 231.59056] CT
N
f640454831
f
GR
GS
[0.375 0 0 0.375 331.14205 248.59872] CT
N
f640454831
f
GR
GS
[0.375 0 0 0.375 53.98295 205.99628] CT
N
f640454831
f
GR
GS
[0.375 0 0 0.375 123.27272 203.27815] CT
N
f640454831
f
GR
GS
[0.375 0 0 0.375 192.5625 207.24069] CT
N
f640454831
f
GR
GS
[0.375 0 0 0.375 261.85226 214.37849] CT
N
f640454831
f
GR
GS
[0.375 0 0 0.375 331.14205 224.1349] CT
N
f640454831
f
GR
GS
[0.375 0 0 0.375 0 0] CT
1 LJ
4 LW
N
143.955 595.426 M
143.955 503.221 L
S
GR
GS
[0.375 0 0 0.375 0 0] CT
1 LJ
4 LW
N
132.406 503.221 M
155.503 503.221 L
S
GR
GS
[0.375 0 0 0.375 0 0] CT
1 LJ
4 LW
N
132.406 595.426 M
155.503 595.426 L
S
GR
GS
[0.375 0 0 0.375 0 0] CT
1 LJ
4 LW
N
328.727 591.753 M
328.727 492.397 L
S
GR
GS
[0.375 0 0 0.375 0 0] CT
1 LJ
4 LW
N
317.179 492.397 M
340.276 492.397 L
S
GR
GS
[0.375 0 0 0.375 0 0] CT
1 LJ
4 LW
N
317.179 591.753 M
340.276 591.753 L
S
GR
GS
[0.375 0 0 0.375 0 0] CT
1 LJ
4 LW
N
513.5 600.996 M
513.5 504.288 L
S
GR
GS
[0.375 0 0 0.375 0 0] CT
1 LJ
4 LW
N
501.952 504.288 M
525.048 504.288 L
S
GR
GS
[0.375 0 0 0.375 0 0] CT
1 LJ
4 LW
N
501.952 600.996 M
525.048 600.996 L
S
GR
GS
[0.375 0 0 0.375 0 0] CT
1 LJ
4 LW
N
698.273 615.515 M
698.273 527.837 L
S
GR
GS
[0.375 0 0 0.375 0 0] CT
1 LJ
4 LW
N
686.724 527.837 M
709.821 527.837 L
S
GR
GS
[0.375 0 0 0.375 0 0] CT
1 LJ
4 LW
N
686.724 615.515 M
709.821 615.515 L
S
GR
GS
[0.375 0 0 0.375 0 0] CT
1 LJ
4 LW
N
883.045 641.595 M
883.045 553.791 L
S
GR
GS
[0.375 0 0 0.375 0 0] CT
1 LJ
4 LW
N
871.497 553.791 M
894.594 553.791 L
S
GR
GS
[0.375 0 0 0.375 0 0] CT
1 LJ
4 LW
N
871.497 641.595 M
894.594 641.595 L
S
GR
%%Trailer
%%Pages: 1
%%EOF
