%!PS-Adobe-3.0 EPSF-3.0
%%Creator: (MATLAB, The Mathworks, Inc. Version 9.7.0.1261785 \(R2019b\) Update 3. Operating System: Windows 10)
%%Title: C:/Users/Clarissa/Documents/decid_eye/analysis/manip1&2/1_pipeline/fixations/3_f_fixation_behav/plots/lvl2/choiceAsFunctionOfTimeAdv.eps
%%CreationDate: 2021-04-13T11:17:31
%%Pages: (atend)
%%BoundingBox:    17    14   346   361
%%LanguageLevel: 3
%%EndComments
%%BeginProlog
%%BeginResource: procset (Apache XML Graphics Std ProcSet) 1.2 0
%%Version: 1.2 0
%%Copyright: (Copyright 2001-2003,2010 The Apache Software Foundation. License terms: http://www.apache.org/licenses/LICENSE-2.0)
/bd{bind def}bind def
/ld{load def}bd
/GR/grestore ld
/GS/gsave ld
/RM/rmoveto ld
/C/curveto ld
/t/show ld
/L/lineto ld
/ML/setmiterlimit ld
/CT/concat ld
/f/fill ld
/N/newpath ld
/S/stroke ld
/CC/setcmykcolor ld
/A/ashow ld
/cp/closepath ld
/RC/setrgbcolor ld
/LJ/setlinejoin ld
/GC/setgray ld
/LW/setlinewidth ld
/M/moveto ld
/re {4 2 roll M
1 index 0 rlineto
0 exch rlineto
neg 0 rlineto
cp } bd
/_ctm matrix def
/_tm matrix def
/BT { _ctm currentmatrix pop matrix _tm copy pop 0 0 moveto } bd
/ET { _ctm setmatrix } bd
/iTm { _ctm setmatrix _tm concat } bd
/Tm { _tm astore pop iTm 0 0 moveto } bd
/ux 0.0 def
/uy 0.0 def
/F {
  /Tp exch def
  /Tf exch def
  Tf findfont Tp scalefont setfont
  /cf Tf def  /cs Tp def
} bd
/ULS {currentpoint /uy exch def /ux exch def} bd
/ULE {
  /Tcx currentpoint pop def
  gsave
  newpath
  cf findfont cs scalefont dup
  /FontMatrix get 0 get /Ts exch def /FontInfo get dup
  /UnderlinePosition get Ts mul /To exch def
  /UnderlineThickness get Ts mul /Tt exch def
  ux uy To add moveto  Tcx uy To add lineto
  Tt setlinewidth stroke
  grestore
} bd
/OLE {
  /Tcx currentpoint pop def
  gsave
  newpath
  cf findfont cs scalefont dup
  /FontMatrix get 0 get /Ts exch def /FontInfo get dup
  /UnderlinePosition get Ts mul /To exch def
  /UnderlineThickness get Ts mul /Tt exch def
  ux uy To add cs add moveto Tcx uy To add cs add lineto
  Tt setlinewidth stroke
  grestore
} bd
/SOE {
  /Tcx currentpoint pop def
  gsave
  newpath
  cf findfont cs scalefont dup
  /FontMatrix get 0 get /Ts exch def /FontInfo get dup
  /UnderlinePosition get Ts mul /To exch def
  /UnderlineThickness get Ts mul /Tt exch def
  ux uy To add cs 10 mul 26 idiv add moveto Tcx uy To add cs 10 mul 26 idiv add lineto
  Tt setlinewidth stroke
  grestore
} bd
/QT {
/Y22 exch store
/X22 exch store
/Y21 exch store
/X21 exch store
currentpoint
/Y21 load 2 mul add 3 div exch
/X21 load 2 mul add 3 div exch
/X21 load 2 mul /X22 load add 3 div
/Y21 load 2 mul /Y22 load add 3 div
/X22 load /Y22 load curveto
} bd
/SSPD {
dup length /d exch dict def
{
/v exch def
/k exch def
currentpagedevice k known {
/cpdv currentpagedevice k get def
v cpdv ne {
/upd false def
/nullv v type /nulltype eq def
/nullcpdv cpdv type /nulltype eq def
nullv nullcpdv or
{
/upd true def
} {
/sametype v type cpdv type eq def
sametype {
v type /arraytype eq {
/vlen v length def
/cpdvlen cpdv length def
vlen cpdvlen eq {
0 1 vlen 1 sub {
/i exch def
/obj v i get def
/cpdobj cpdv i get def
obj cpdobj ne {
/upd true def
exit
} if
} for
} {
/upd true def
} ifelse
} {
v type /dicttype eq {
v {
/dv exch def
/dk exch def
/cpddv cpdv dk get def
dv cpddv ne {
/upd true def
exit
} if
} forall
} {
/upd true def
} ifelse
} ifelse
} if
} ifelse
upd true eq {
d k v put
} if
} if
} if
} forall
d length 0 gt {
d setpagedevice
} if
} bd
/RE { % /NewFontName [NewEncodingArray] /FontName RE -
  findfont dup length dict begin
  {
    1 index /FID ne
    {def} {pop pop} ifelse
  } forall
  /Encoding exch def
  /FontName 1 index def
  currentdict definefont pop
  end
} bind def
%%EndResource
%%BeginResource: procset (Apache XML Graphics EPS ProcSet) 1.0 0
%%Version: 1.0 0
%%Copyright: (Copyright 2002-2003 The Apache Software Foundation. License terms: http://www.apache.org/licenses/LICENSE-2.0)
/BeginEPSF { %def
/b4_Inc_state save def         % Save state for cleanup
/dict_count countdictstack def % Count objects on dict stack
/op_count count 1 sub def      % Count objects on operand stack
userdict begin                 % Push userdict on dict stack
/showpage { } def              % Redefine showpage, { } = null proc
0 setgray 0 setlinecap         % Prepare graphics state
1 setlinewidth 0 setlinejoin
10 setmiterlimit [ ] 0 setdash newpath
/languagelevel where           % If level not equal to 1 then
{pop languagelevel             % set strokeadjust and
1 ne                           % overprint to their defaults.
{false setstrokeadjust false setoverprint
} if
} if
} bd
/EndEPSF { %def
count op_count sub {pop} repeat            % Clean up stacks
countdictstack dict_count sub {end} repeat
b4_Inc_state restore
} bd
%%EndResource
%FOPBeginFontDict
%%IncludeResource: font Courier-Oblique
%%IncludeResource: font Courier-BoldOblique
%%IncludeResource: font Courier-Bold
%%IncludeResource: font ZapfDingbats
%%IncludeResource: font Symbol
%%IncludeResource: font Helvetica
%%IncludeResource: font Helvetica-Oblique
%%IncludeResource: font Helvetica-Bold
%%IncludeResource: font Helvetica-BoldOblique
%%IncludeResource: font Times-Roman
%%IncludeResource: font Times-Italic
%%IncludeResource: font Times-Bold
%%IncludeResource: font Times-BoldItalic
%%IncludeResource: font Courier
%FOPEndFontDict
%%BeginResource: encoding WinAnsiEncoding
/WinAnsiEncoding [
/.notdef /.notdef /.notdef /.notdef /.notdef
/.notdef /.notdef /.notdef /.notdef /.notdef
/.notdef /.notdef /.notdef /.notdef /.notdef
/.notdef /.notdef /.notdef /.notdef /.notdef
/.notdef /.notdef /.notdef /.notdef /.notdef
/.notdef /.notdef /.notdef /.notdef /.notdef
/.notdef /.notdef /space /exclam /quotedbl
/numbersign /dollar /percent /ampersand /quotesingle
/parenleft /parenright /asterisk /plus /comma
/hyphen /period /slash /zero /one
/two /three /four /five /six
/seven /eight /nine /colon /semicolon
/less /equal /greater /question /at
/A /B /C /D /E
/F /G /H /I /J
/K /L /M /N /O
/P /Q /R /S /T
/U /V /W /X /Y
/Z /bracketleft /backslash /bracketright /asciicircum
/underscore /quoteleft /a /b /c
/d /e /f /g /h
/i /j /k /l /m
/n /o /p /q /r
/s /t /u /v /w
/x /y /z /braceleft /bar
/braceright /asciitilde /bullet /Euro /bullet
/quotesinglbase /florin /quotedblbase /ellipsis /dagger
/daggerdbl /circumflex /perthousand /Scaron /guilsinglleft
/OE /bullet /Zcaron /bullet /bullet
/quoteleft /quoteright /quotedblleft /quotedblright /bullet
/endash /emdash /asciitilde /trademark /scaron
/guilsinglright /oe /bullet /zcaron /Ydieresis
/space /exclamdown /cent /sterling /currency
/yen /brokenbar /section /dieresis /copyright
/ordfeminine /guillemotleft /logicalnot /sfthyphen /registered
/macron /degree /plusminus /twosuperior /threesuperior
/acute /mu /paragraph /middot /cedilla
/onesuperior /ordmasculine /guillemotright /onequarter /onehalf
/threequarters /questiondown /Agrave /Aacute /Acircumflex
/Atilde /Adieresis /Aring /AE /Ccedilla
/Egrave /Eacute /Ecircumflex /Edieresis /Igrave
/Iacute /Icircumflex /Idieresis /Eth /Ntilde
/Ograve /Oacute /Ocircumflex /Otilde /Odieresis
/multiply /Oslash /Ugrave /Uacute /Ucircumflex
/Udieresis /Yacute /Thorn /germandbls /agrave
/aacute /acircumflex /atilde /adieresis /aring
/ae /ccedilla /egrave /eacute /ecircumflex
/edieresis /igrave /iacute /icircumflex /idieresis
/eth /ntilde /ograve /oacute /ocircumflex
/otilde /odieresis /divide /oslash /ugrave
/uacute /ucircumflex /udieresis /yacute /thorn
/ydieresis
] def
%%EndResource
%FOPBeginFontReencode
/Courier-Oblique findfont
dup length dict begin
  {1 index /FID ne {def} {pop pop} ifelse} forall
  /Encoding WinAnsiEncoding def
  currentdict
end
/Courier-Oblique exch definefont pop
/Courier-BoldOblique findfont
dup length dict begin
  {1 index /FID ne {def} {pop pop} ifelse} forall
  /Encoding WinAnsiEncoding def
  currentdict
end
/Courier-BoldOblique exch definefont pop
/Courier-Bold findfont
dup length dict begin
  {1 index /FID ne {def} {pop pop} ifelse} forall
  /Encoding WinAnsiEncoding def
  currentdict
end
/Courier-Bold exch definefont pop
/Helvetica findfont
dup length dict begin
  {1 index /FID ne {def} {pop pop} ifelse} forall
  /Encoding WinAnsiEncoding def
  currentdict
end
/Helvetica exch definefont pop
/Helvetica-Oblique findfont
dup length dict begin
  {1 index /FID ne {def} {pop pop} ifelse} forall
  /Encoding WinAnsiEncoding def
  currentdict
end
/Helvetica-Oblique exch definefont pop
/Helvetica-Bold findfont
dup length dict begin
  {1 index /FID ne {def} {pop pop} ifelse} forall
  /Encoding WinAnsiEncoding def
  currentdict
end
/Helvetica-Bold exch definefont pop
/Helvetica-BoldOblique findfont
dup length dict begin
  {1 index /FID ne {def} {pop pop} ifelse} forall
  /Encoding WinAnsiEncoding def
  currentdict
end
/Helvetica-BoldOblique exch definefont pop
/Times-Roman findfont
dup length dict begin
  {1 index /FID ne {def} {pop pop} ifelse} forall
  /Encoding WinAnsiEncoding def
  currentdict
end
/Times-Roman exch definefont pop
/Times-Italic findfont
dup length dict begin
  {1 index /FID ne {def} {pop pop} ifelse} forall
  /Encoding WinAnsiEncoding def
  currentdict
end
/Times-Italic exch definefont pop
/Times-Bold findfont
dup length dict begin
  {1 index /FID ne {def} {pop pop} ifelse} forall
  /Encoding WinAnsiEncoding def
  currentdict
end
/Times-Bold exch definefont pop
/Times-BoldItalic findfont
dup length dict begin
  {1 index /FID ne {def} {pop pop} ifelse} forall
  /Encoding WinAnsiEncoding def
  currentdict
end
/Times-BoldItalic exch definefont pop
/Courier findfont
dup length dict begin
  {1 index /FID ne {def} {pop pop} ifelse} forall
  /Encoding WinAnsiEncoding def
  currentdict
end
/Courier exch definefont pop
%FOPEndFontReencode
%%EndProlog
%%Page: 1 1
%%PageBoundingBox: 0 0 375 375
%%BeginPageSetup
[1 0 0 -1 0 375] CT
%%EndPageSetup
GS
[0.375 0 0 0.375 0 0] CT
1 GC
N
0 0 1000 1000 re
f
GR
GS
[0.375 0 0 0.375 0 0] CT
1 GC
N
0 0 1000 1000 re
f
GR
GS
[0.375 0 0 0.375 0 0] CT
1 GC
N
107 881 M
920 881 L
920 40 L
107 40 L
cp
f
GR
GS
[0.375 0 0 0.375 0 0] CT
2 setlinecap
1 LJ
1.333 LW
N
107 881 M
920 881 L
S
GR
GS
[0.375 0 0 0.375 0 0] CT
2 setlinecap
1 LJ
1.333 LW
N
143.955 881 M
143.955 872.59 L
S
GR
GS
[0.375 0 0 0.375 0 0] CT
2 setlinecap
1 LJ
1.333 LW
N
328.727 881 M
328.727 872.59 L
S
GR
GS
[0.375 0 0 0.375 0 0] CT
2 setlinecap
1 LJ
1.333 LW
N
513.5 881 M
513.5 872.59 L
S
GR
GS
[0.375 0 0 0.375 0 0] CT
2 setlinecap
1 LJ
1.333 LW
N
698.273 881 M
698.273 872.59 L
S
GR
GS
[0.375 0 0 0.375 0 0] CT
2 setlinecap
1 LJ
1.333 LW
N
883.045 881 M
883.045 872.59 L
S
GR
GS
[0.375 0 0 0.375 53.98295 334.37501] CT
/Helvetica 26.667 F
GS
[1 0 0 1 0 0] CT
-7.5 27 moveto 
1 -1 scale
(1) t 
GR
GR
GS
[0.375 0 0 0.375 123.27272 334.37501] CT
/Helvetica 26.667 F
GS
[1 0 0 1 0 0] CT
-7.5 27 moveto 
1 -1 scale
(2) t 
GR
GR
GS
[0.375 0 0 0.375 192.5625 334.37501] CT
/Helvetica 26.667 F
GS
[1 0 0 1 0 0] CT
-7.5 27 moveto 
1 -1 scale
(3) t 
GR
GR
GS
[0.375 0 0 0.375 261.85226 334.37501] CT
/Helvetica 26.667 F
GS
[1 0 0 1 0 0] CT
-7.5 27 moveto 
1 -1 scale
(4) t 
GR
GR
GS
[0.375 0 0 0.375 331.14205 334.37501] CT
/Helvetica 26.667 F
GS
[1 0 0 1 0 0] CT
-7.5 27 moveto 
1 -1 scale
(5) t 
GR
GR
GS
[0.375 0 0 0.375 192.56264 347.74999] CT
/Helvetica 26.667 F
GS
[1 0 0 1 0 0] CT
-131.5 27 moveto 
1 -1 scale
(Time advantage gains) t 
GR
GR
GS
[0.375 0 0 0.375 0 0] CT
2 setlinecap
1 LJ
1.333 LW
N
107 881 M
107 40 L
S
GR
GS
[0.375 0 0 0.375 0 0] CT
2 setlinecap
1 LJ
1.333 LW
N
107 879.18 M
115.41 879.18 L
S
GR
GS
[0.375 0 0 0.375 36.125 329.69236] CT
/Helvetica 26.667 F
GS
[1 0 0 1 0 0] CT
-15 10.5 moveto 
1 -1 scale
(0) t 
GR
GR
GS
[0 -0.375 0.375 0 27.5 172.68735] CT
/Helvetica 26.667 F
GS
[1 0 0 1 0 0] CT
-56 -6 moveto 
1 -1 scale
(p\(accept\)) t 
GR
GR
GS
[0.375 0 0 0.375 53.98295 286.5789] CT
N
6.667 0 M
6.667 -3.682 3.682 -6.667 0 -6.667 C
-3.682 -6.667 -6.667 -3.682 -6.667 0 C
-6.667 3.682 -3.682 6.667 0 6.667 C
3.682 6.667 6.667 3.682 6.667 0 C
cp
f
GR
GS
[0.375 0 0 0.375 123.27272 234.84274] CT
N
/f640454831{6.667 0 M
6.667 -3.682 3.682 -6.667 0 -6.667 C
-3.682 -6.667 -6.667 -3.682 -6.667 0 C
-6.667 3.682 -3.682 6.667 0 6.667 C
3.682 6.667 6.667 3.682 6.667 0 C
cp}def
f640454831
f
GR
GS
[0.375 0 0 0.375 192.5625 205.71201] CT
N
f640454831
f
GR
GS
[0.375 0 0 0.375 261.85226 200.35197] CT
N
f640454831
f
GR
GS
[0.375 0 0 0.375 331.14205 131.37043] CT
N
f640454831
f
GR
GS
[0.375 0 0 0.375 53.98295 193.1664] CT
N
f640454831
f
GR
GS
[0.375 0 0 0.375 123.27272 133.09496] CT
N
f640454831
f
GR
GS
[0.375 0 0 0.375 192.5625 111.25081] CT
N
f640454831
f
GR
GS
[0.375 0 0 0.375 261.85226 119.98848] CT
N
f640454831
f
GR
GS
[0.375 0 0 0.375 331.14205 70.29301] CT
N
f640454831
f
GR
GS
[0.375 0 0 0.375 53.98295 260.71083] CT
N
f640454831
f
GR
GS
[0.375 0 0 0.375 123.27272 252.08812] CT
N
f640454831
f
GR
GS
[0.375 0 0 0.375 192.5625 179.14481] CT
N
f640454831
f
GR
GS
[0.375 0 0 0.375 261.85226 148.61583] CT
N
f640454831
f
GR
GS
[0.375 0 0 0.375 331.14205 62.38889] CT
N
f640454831
f
GR
GS
[0.375 0 0 0.375 53.98295 223.68395] CT
N
f640454831
f
GR
GS
[0.375 0 0 0.375 123.27272 210.54243] CT
N
f640454831
f
GR
GS
[0.375 0 0 0.375 192.5625 194.77258] CT
N
f640454831
f
GR
GS
[0.375 0 0 0.375 261.85226 200.61326] CT
N
f640454831
f
GR
GS
[0.375 0 0 0.375 331.14205 108.03844] CT
N
f640454831
f
GR
GS
[0.375 0 0 0.375 53.98295 83.94562] CT
N
f640454831
f
GR
GS
[0.375 0 0 0.375 123.27272 129.45427] CT
N
f640454831
f
GR
GS
[0.375 0 0 0.375 192.5625 108.2989] CT
N
f640454831
f
GR
GS
[0.375 0 0 0.375 261.85226 83.94562] CT
N
f640454831
f
GR
GS
[0.375 0 0 0.375 331.14205 56.64043] CT
N
f640454831
f
GR
GS
[0.375 0 0 0.375 53.98295 275.08198] CT
N
f640454831
f
GR
GS
[0.375 0 0 0.375 123.27272 229.57333] CT
N
f640454831
f
GR
GS
[0.375 0 0 0.375 192.5625 223.42351] CT
N
f640454831
f
GR
GS
[0.375 0 0 0.375 261.85226 238.67505] CT
N
f640454831
f
GR
GS
[0.375 0 0 0.375 331.14205 202.26812] CT
N
f640454831
f
GR
GS
[0.375 0 0 0.375 53.98295 232.27924] CT
N
f640454831
f
GR
GS
[0.375 0 0 0.375 123.27272 183.10659] CT
N
f640454831
f
GR
GS
[0.375 0 0 0.375 192.5625 196.85628] CT
N
f640454831
f
GR
GS
[0.375 0 0 0.375 261.85226 165.8612] CT
N
f640454831
f
GR
GS
[0.375 0 0 0.375 331.14205 179.14481] CT
N
f640454831
f
GR
GS
[0.375 0 0 0.375 53.98295 157.2385] CT
N
f640454831
f
GR
GS
[0.375 0 0 0.375 123.27272 131.37043] CT
N
f640454831
f
GR
GS
[0.375 0 0 0.375 192.5625 139.99313] CT
N
f640454831
f
GR
GS
[0.375 0 0 0.375 261.85226 200.35197] CT
N
f640454831
f
GR
GS
[0.375 0 0 0.375 331.14205 208.97468] CT
N
f640454831
f
GR
GS
[0.375 0 0 0.375 53.98295 152.5776] CT
N
f640454831
f
GR
GS
[0.375 0 0 0.375 123.27272 174.96294] CT
N
f640454831
f
GR
GS
[0.375 0 0 0.375 192.5625 143.72185] CT
N
f640454831
f
GR
GS
[0.375 0 0 0.375 261.85226 147.65773] CT
N
f640454831
f
GR
GS
[0.375 0 0 0.375 331.14205 152.5776] CT
N
f640454831
f
GR
GS
[0.375 0 0 0.375 53.98295 316.03976] CT
N
f640454831
f
GR
GS
[0.375 0 0 0.375 123.27272 224.84042] CT
N
f640454831
f
GR
GS
[0.375 0 0 0.375 192.5625 138.55601] CT
N
f640454831
f
GR
GS
[0.375 0 0 0.375 261.85226 80.669] CT
N
f640454831
f
GR
GS
[0.375 0 0 0.375 331.14205 29.33522] CT
N
f640454831
f
GR
GS
[0.375 0 0 0.375 53.98295 243.46543] CT
N
f640454831
f
GR
GS
[0.375 0 0 0.375 123.27272 252.08812] CT
N
f640454831
f
GR
GS
[0.375 0 0 0.375 192.5625 188.00054] CT
N
f640454831
f
GR
GS
[0.375 0 0 0.375 261.85226 139.99313] CT
N
f640454831
f
GR
GS
[0.375 0 0 0.375 331.14205 79.63427] CT
N
f640454831
f
GR
GS
[0.375 0 0 0.375 53.98295 152.5776] CT
N
f640454831
f
GR
GS
[0.375 0 0 0.375 123.27272 152.5776] CT
N
f640454831
f
GR
GS
[0.375 0 0 0.375 192.5625 152.5776] CT
N
f640454831
f
GR
GS
[0.375 0 0 0.375 261.85226 152.5776] CT
N
f640454831
f
GR
GS
[0.375 0 0 0.375 331.14205 205.71201] CT
N
f640454831
f
GR
GS
[0.375 0 0 0.375 53.98295 93.77548] CT
N
f640454831
f
GR
GS
[0.375 0 0 0.375 123.27272 98.14433] CT
N
f640454831
f
GR
GS
[0.375 0 0 0.375 192.5625 122.74775] CT
N
f640454831
f
GR
GS
[0.375 0 0 0.375 261.85226 67.5625] CT
N
f640454831
f
GR
GS
[0.375 0 0 0.375 331.14205 76.30017] CT
N
f640454831
f
GR
GS
[0.375 0 0 0.375 53.98295 142.45674] CT
N
f640454831
f
GR
GS
[0.375 0 0 0.375 123.27272 115.70881] CT
N
f640454831
f
GR
GS
[0.375 0 0 0.375 192.5625 149.14374] CT
N
f640454831
f
GR
GS
[0.375 0 0 0.375 261.85226 182.57867] CT
N
f640454831
f
GR
GS
[0.375 0 0 0.375 331.14205 175.89167] CT
N
f640454831
f
GR
GS
[0.375 0 0 0.375 53.98295 148.61583] CT
N
f640454831
f
GR
GS
[0.375 0 0 0.375 123.27272 144.8572] CT
N
f640454831
f
GR
GS
[0.375 0 0 0.375 192.5625 191.72928] CT
N
f640454831
f
GR
GS
[0.375 0 0 0.375 261.85226 161.6604] CT
N
f640454831
f
GR
GS
[0.375 0 0 0.375 331.14205 148.61583] CT
N
f640454831
f
GR
GS
[0.375 0 0 0.375 53.98295 226.53941] CT
N
f640454831
f
GR
GS
[0.375 0 0 0.375 123.27272 180.75494] CT
N
f640454831
f
GR
GS
[0.375 0 0 0.375 192.5625 171.92902] CT
N
f640454831
f
GR
GS
[0.375 0 0 0.375 261.85226 162.88245] CT
N
f640454831
f
GR
GS
[0.375 0 0 0.375 331.14205 190.13248] CT
N
f640454831
f
GR
GS
[0.375 0 0 0.375 53.98295 179.14481] CT
N
f640454831
f
GR
GS
[0.375 0 0 0.375 123.27272 103.87103] CT
N
f640454831
f
GR
GS
[0.375 0 0 0.375 192.5625 133.09496] CT
N
f640454831
f
GR
GS
[0.375 0 0 0.375 261.85226 126.01038] CT
N
f640454831
f
GR
GS
[0.375 0 0 0.375 331.14205 126.01038] CT
N
f640454831
f
GR
GS
[0.375 0 0 0.375 53.98295 155.62175] CT
N
f640454831
f
GR
GS
[0.375 0 0 0.375 123.27272 132.05476] CT
N
f640454831
f
GR
GS
[0.375 0 0 0.375 192.5625 140.26258] CT
N
f640454831
f
GR
GS
[0.375 0 0 0.375 261.85226 121.65278] CT
N
f640454831
f
GR
GS
[0.375 0 0 0.375 331.14205 119.78368] CT
N
f640454831
f
GR
GS
[0.375 0 0 0.375 53.98295 194.46664] CT
N
f640454831
f
GR
GS
[0.375 0 0 0.375 123.27272 163.26069] CT
N
f640454831
f
GR
GS
[0.375 0 0 0.375 192.5625 194.46664] CT
N
f640454831
f
GR
GS
[0.375 0 0 0.375 261.85226 215.2706] CT
N
f640454831
f
GR
GS
[0.375 0 0 0.375 331.14205 236.07456] CT
N
f640454831
f
GR
GS
[0.375 0 0 0.375 53.98295 83.94562] CT
N
f640454831
f
GR
GS
[0.375 0 0 0.375 123.27272 113.91472] CT
N
f640454831
f
GR
GS
[0.375 0 0 0.375 192.5625 108.52028] CT
N
f640454831
f
GR
GS
[0.375 0 0 0.375 261.85226 113.91472] CT
N
f640454831
f
GR
GS
[0.375 0 0 0.375 331.14205 75.75407] CT
N
f640454831
f
GR
GS
[0.375 0 0 0.375 53.98295 193.94655] CT
N
f640454831
f
GR
GS
[0.375 0 0 0.375 123.27272 191.2435] CT
N
f640454831
f
GR
GS
[0.375 0 0 0.375 192.5625 207.9892] CT
N
f640454831
f
GR
GS
[0.375 0 0 0.375 261.85226 191.2435] CT
N
f640454831
f
GR
GS
[0.375 0 0 0.375 331.14205 156.49942] CT
N
f640454831
f
GR
GS
[0.375 0 0 0.375 53.98295 111.25081] CT
N
f640454831
f
GR
GS
[0.375 0 0 0.375 123.27272 162.64881] CT
N
f640454831
f
GR
GS
[0.375 0 0 0.375 192.5625 130.52506] CT
N
f640454831
f
GR
GS
[0.375 0 0 0.375 261.85226 91.97655] CT
N
f640454831
f
GR
GS
[0.375 0 0 0.375 331.14205 156.22406] CT
N
f640454831
f
GR
GS
[0.375 0 0 0.375 53.98295 147.65773] CT
N
f640454831
f
GR
GS
[0.375 0 0 0.375 123.27272 165.8612] CT
N
f640454831
f
GR
GS
[0.375 0 0 0.375 192.5625 79.12705] CT
N
f640454831
f
GR
GS
[0.375 0 0 0.375 261.85226 129.45427] CT
N
f640454831
f
GR
GS
[0.375 0 0 0.375 331.14205 129.45427] CT
N
f640454831
f
GR
GS
[0.375 0 0 0.375 53.98295 165.8612] CT
N
f640454831
f
GR
GS
[0.375 0 0 0.375 123.27272 165.8612] CT
N
f640454831
f
GR
GS
[0.375 0 0 0.375 192.5625 169.34697] CT
N
f640454831
f
GR
GS
[0.375 0 0 0.375 261.85226 208.59977] CT
N
f640454831
f
GR
GS
[0.375 0 0 0.375 331.14205 222.84595] CT
N
f640454831
f
GR
GS
[0.375 0 0 0.375 53.98295 184.19285] CT
N
f640454831
f
GR
GS
[0.375 0 0 0.375 123.27272 168.61346] CT
N
f640454831
f
GR
GS
[0.375 0 0 0.375 192.5625 157.54962] CT
N
f640454831
f
GR
GS
[0.375 0 0 0.375 261.85226 152.17114] CT
N
f640454831
f
GR
GS
[0.375 0 0 0.375 331.14205 137.49851] CT
N
f640454831
f
GR
GS
[0.375 0 0 0.375 0 0] CT
1 LJ
4 LW
N
143.955 562.892 M
143.955 419.47 L
S
GR
GS
[0.375 0 0 0.375 0 0] CT
1 LJ
4 LW
N
132.406 419.47 M
155.503 419.47 L
S
GR
GS
[0.375 0 0 0.375 0 0] CT
1 LJ
4 LW
N
132.406 562.892 M
155.503 562.892 L
S
GR
GS
[0.375 0 0 0.375 0 0] CT
1 LJ
4 LW
N
328.727 501.735 M
328.727 397.537 L
S
GR
GS
[0.375 0 0 0.375 0 0] CT
1 LJ
4 LW
N
317.179 397.537 M
340.276 397.537 L
S
GR
GS
[0.375 0 0 0.375 0 0] CT
1 LJ
4 LW
N
317.179 501.735 M
340.276 501.735 L
S
GR
GS
[0.375 0 0 0.375 0 0] CT
1 LJ
4 LW
N
513.5 462.992 M
513.5 377.272 L
S
GR
GS
[0.375 0 0 0.375 0 0] CT
1 LJ
4 LW
N
501.952 377.272 M
525.048 377.272 L
S
GR
GS
[0.375 0 0 0.375 0 0] CT
1 LJ
4 LW
N
501.952 462.992 M
525.048 462.992 L
S
GR
GS
[0.375 0 0 0.375 0 0] CT
1 LJ
4 LW
N
698.273 458.209 M
698.273 353.37 L
S
GR
GS
[0.375 0 0 0.375 0 0] CT
1 LJ
4 LW
N
686.724 353.37 M
709.821 353.37 L
S
GR
GS
[0.375 0 0 0.375 0 0] CT
1 LJ
4 LW
N
686.724 458.209 M
709.821 458.209 L
S
GR
GS
[0.375 0 0 0.375 0 0] CT
1 LJ
4 LW
N
883.045 432.538 M
883.045 300.787 L
S
GR
GS
[0.375 0 0 0.375 0 0] CT
1 LJ
4 LW
N
871.497 300.787 M
894.594 300.787 L
S
GR
GS
[0.375 0 0 0.375 0 0] CT
1 LJ
4 LW
N
871.497 432.538 M
894.594 432.538 L
S
GR
%%Trailer
%%Pages: 1
%%EOF
