%!PS-Adobe-3.0 EPSF-3.0
%%Creator: (MATLAB, The Mathworks, Inc. Version 9.7.0.1261785 \(R2019b\) Update 3. Operating System: Windows 10)
%%Title: C:/Users/Clarissa/Documents/decid_eye/analysis/manip1&2/1_pipeline/fixations/3_f_fixation_behav/plots/lvl2_agent/choiceAsFunctionOfValueDiff_TimeAdv_PSE.eps
%%CreationDate: 2021-04-20T23:12:17
%%Pages: (atend)
%%BoundingBox:    17    15   346   361
%%LanguageLevel: 3
%%EndComments
%%BeginProlog
%%BeginResource: procset (Apache XML Graphics Std ProcSet) 1.2 0
%%Version: 1.2 0
%%Copyright: (Copyright 2001-2003,2010 The Apache Software Foundation. License terms: http://www.apache.org/licenses/LICENSE-2.0)
/bd{bind def}bind def
/ld{load def}bd
/GR/grestore ld
/GS/gsave ld
/RM/rmoveto ld
/C/curveto ld
/t/show ld
/L/lineto ld
/ML/setmiterlimit ld
/CT/concat ld
/f/fill ld
/N/newpath ld
/S/stroke ld
/CC/setcmykcolor ld
/A/ashow ld
/cp/closepath ld
/RC/setrgbcolor ld
/LJ/setlinejoin ld
/GC/setgray ld
/LW/setlinewidth ld
/M/moveto ld
/re {4 2 roll M
1 index 0 rlineto
0 exch rlineto
neg 0 rlineto
cp } bd
/_ctm matrix def
/_tm matrix def
/BT { _ctm currentmatrix pop matrix _tm copy pop 0 0 moveto } bd
/ET { _ctm setmatrix } bd
/iTm { _ctm setmatrix _tm concat } bd
/Tm { _tm astore pop iTm 0 0 moveto } bd
/ux 0.0 def
/uy 0.0 def
/F {
  /Tp exch def
  /Tf exch def
  Tf findfont Tp scalefont setfont
  /cf Tf def  /cs Tp def
} bd
/ULS {currentpoint /uy exch def /ux exch def} bd
/ULE {
  /Tcx currentpoint pop def
  gsave
  newpath
  cf findfont cs scalefont dup
  /FontMatrix get 0 get /Ts exch def /FontInfo get dup
  /UnderlinePosition get Ts mul /To exch def
  /UnderlineThickness get Ts mul /Tt exch def
  ux uy To add moveto  Tcx uy To add lineto
  Tt setlinewidth stroke
  grestore
} bd
/OLE {
  /Tcx currentpoint pop def
  gsave
  newpath
  cf findfont cs scalefont dup
  /FontMatrix get 0 get /Ts exch def /FontInfo get dup
  /UnderlinePosition get Ts mul /To exch def
  /UnderlineThickness get Ts mul /Tt exch def
  ux uy To add cs add moveto Tcx uy To add cs add lineto
  Tt setlinewidth stroke
  grestore
} bd
/SOE {
  /Tcx currentpoint pop def
  gsave
  newpath
  cf findfont cs scalefont dup
  /FontMatrix get 0 get /Ts exch def /FontInfo get dup
  /UnderlinePosition get Ts mul /To exch def
  /UnderlineThickness get Ts mul /Tt exch def
  ux uy To add cs 10 mul 26 idiv add moveto Tcx uy To add cs 10 mul 26 idiv add lineto
  Tt setlinewidth stroke
  grestore
} bd
/QT {
/Y22 exch store
/X22 exch store
/Y21 exch store
/X21 exch store
currentpoint
/Y21 load 2 mul add 3 div exch
/X21 load 2 mul add 3 div exch
/X21 load 2 mul /X22 load add 3 div
/Y21 load 2 mul /Y22 load add 3 div
/X22 load /Y22 load curveto
} bd
/SSPD {
dup length /d exch dict def
{
/v exch def
/k exch def
currentpagedevice k known {
/cpdv currentpagedevice k get def
v cpdv ne {
/upd false def
/nullv v type /nulltype eq def
/nullcpdv cpdv type /nulltype eq def
nullv nullcpdv or
{
/upd true def
} {
/sametype v type cpdv type eq def
sametype {
v type /arraytype eq {
/vlen v length def
/cpdvlen cpdv length def
vlen cpdvlen eq {
0 1 vlen 1 sub {
/i exch def
/obj v i get def
/cpdobj cpdv i get def
obj cpdobj ne {
/upd true def
exit
} if
} for
} {
/upd true def
} ifelse
} {
v type /dicttype eq {
v {
/dv exch def
/dk exch def
/cpddv cpdv dk get def
dv cpddv ne {
/upd true def
exit
} if
} forall
} {
/upd true def
} ifelse
} ifelse
} if
} ifelse
upd true eq {
d k v put
} if
} if
} if
} forall
d length 0 gt {
d setpagedevice
} if
} bd
/RE { % /NewFontName [NewEncodingArray] /FontName RE -
  findfont dup length dict begin
  {
    1 index /FID ne
    {def} {pop pop} ifelse
  } forall
  /Encoding exch def
  /FontName 1 index def
  currentdict definefont pop
  end
} bind def
%%EndResource
%%BeginResource: procset (Apache XML Graphics EPS ProcSet) 1.0 0
%%Version: 1.0 0
%%Copyright: (Copyright 2002-2003 The Apache Software Foundation. License terms: http://www.apache.org/licenses/LICENSE-2.0)
/BeginEPSF { %def
/b4_Inc_state save def         % Save state for cleanup
/dict_count countdictstack def % Count objects on dict stack
/op_count count 1 sub def      % Count objects on operand stack
userdict begin                 % Push userdict on dict stack
/showpage { } def              % Redefine showpage, { } = null proc
0 setgray 0 setlinecap         % Prepare graphics state
1 setlinewidth 0 setlinejoin
10 setmiterlimit [ ] 0 setdash newpath
/languagelevel where           % If level not equal to 1 then
{pop languagelevel             % set strokeadjust and
1 ne                           % overprint to their defaults.
{false setstrokeadjust false setoverprint
} if
} if
} bd
/EndEPSF { %def
count op_count sub {pop} repeat            % Clean up stacks
countdictstack dict_count sub {end} repeat
b4_Inc_state restore
} bd
%%EndResource
%FOPBeginFontDict
%%IncludeResource: font Courier-Oblique
%%IncludeResource: font Courier-BoldOblique
%%IncludeResource: font Courier-Bold
%%IncludeResource: font ZapfDingbats
%%IncludeResource: font Symbol
%%IncludeResource: font Helvetica
%%IncludeResource: font Helvetica-Oblique
%%IncludeResource: font Helvetica-Bold
%%IncludeResource: font Helvetica-BoldOblique
%%IncludeResource: font Times-Roman
%%IncludeResource: font Times-Italic
%%IncludeResource: font Times-Bold
%%IncludeResource: font Times-BoldItalic
%%IncludeResource: font Courier
%FOPEndFontDict
%%BeginResource: encoding WinAnsiEncoding
/WinAnsiEncoding [
/.notdef /.notdef /.notdef /.notdef /.notdef
/.notdef /.notdef /.notdef /.notdef /.notdef
/.notdef /.notdef /.notdef /.notdef /.notdef
/.notdef /.notdef /.notdef /.notdef /.notdef
/.notdef /.notdef /.notdef /.notdef /.notdef
/.notdef /.notdef /.notdef /.notdef /.notdef
/.notdef /.notdef /space /exclam /quotedbl
/numbersign /dollar /percent /ampersand /quotesingle
/parenleft /parenright /asterisk /plus /comma
/hyphen /period /slash /zero /one
/two /three /four /five /six
/seven /eight /nine /colon /semicolon
/less /equal /greater /question /at
/A /B /C /D /E
/F /G /H /I /J
/K /L /M /N /O
/P /Q /R /S /T
/U /V /W /X /Y
/Z /bracketleft /backslash /bracketright /asciicircum
/underscore /quoteleft /a /b /c
/d /e /f /g /h
/i /j /k /l /m
/n /o /p /q /r
/s /t /u /v /w
/x /y /z /braceleft /bar
/braceright /asciitilde /bullet /Euro /bullet
/quotesinglbase /florin /quotedblbase /ellipsis /dagger
/daggerdbl /circumflex /perthousand /Scaron /guilsinglleft
/OE /bullet /Zcaron /bullet /bullet
/quoteleft /quoteright /quotedblleft /quotedblright /bullet
/endash /emdash /asciitilde /trademark /scaron
/guilsinglright /oe /bullet /zcaron /Ydieresis
/space /exclamdown /cent /sterling /currency
/yen /brokenbar /section /dieresis /copyright
/ordfeminine /guillemotleft /logicalnot /sfthyphen /registered
/macron /degree /plusminus /twosuperior /threesuperior
/acute /mu /paragraph /middot /cedilla
/onesuperior /ordmasculine /guillemotright /onequarter /onehalf
/threequarters /questiondown /Agrave /Aacute /Acircumflex
/Atilde /Adieresis /Aring /AE /Ccedilla
/Egrave /Eacute /Ecircumflex /Edieresis /Igrave
/Iacute /Icircumflex /Idieresis /Eth /Ntilde
/Ograve /Oacute /Ocircumflex /Otilde /Odieresis
/multiply /Oslash /Ugrave /Uacute /Ucircumflex
/Udieresis /Yacute /Thorn /germandbls /agrave
/aacute /acircumflex /atilde /adieresis /aring
/ae /ccedilla /egrave /eacute /ecircumflex
/edieresis /igrave /iacute /icircumflex /idieresis
/eth /ntilde /ograve /oacute /ocircumflex
/otilde /odieresis /divide /oslash /ugrave
/uacute /ucircumflex /udieresis /yacute /thorn
/ydieresis
] def
%%EndResource
%FOPBeginFontReencode
/Courier-Oblique findfont
dup length dict begin
  {1 index /FID ne {def} {pop pop} ifelse} forall
  /Encoding WinAnsiEncoding def
  currentdict
end
/Courier-Oblique exch definefont pop
/Courier-BoldOblique findfont
dup length dict begin
  {1 index /FID ne {def} {pop pop} ifelse} forall
  /Encoding WinAnsiEncoding def
  currentdict
end
/Courier-BoldOblique exch definefont pop
/Courier-Bold findfont
dup length dict begin
  {1 index /FID ne {def} {pop pop} ifelse} forall
  /Encoding WinAnsiEncoding def
  currentdict
end
/Courier-Bold exch definefont pop
/Helvetica findfont
dup length dict begin
  {1 index /FID ne {def} {pop pop} ifelse} forall
  /Encoding WinAnsiEncoding def
  currentdict
end
/Helvetica exch definefont pop
/Helvetica-Oblique findfont
dup length dict begin
  {1 index /FID ne {def} {pop pop} ifelse} forall
  /Encoding WinAnsiEncoding def
  currentdict
end
/Helvetica-Oblique exch definefont pop
/Helvetica-Bold findfont
dup length dict begin
  {1 index /FID ne {def} {pop pop} ifelse} forall
  /Encoding WinAnsiEncoding def
  currentdict
end
/Helvetica-Bold exch definefont pop
/Helvetica-BoldOblique findfont
dup length dict begin
  {1 index /FID ne {def} {pop pop} ifelse} forall
  /Encoding WinAnsiEncoding def
  currentdict
end
/Helvetica-BoldOblique exch definefont pop
/Times-Roman findfont
dup length dict begin
  {1 index /FID ne {def} {pop pop} ifelse} forall
  /Encoding WinAnsiEncoding def
  currentdict
end
/Times-Roman exch definefont pop
/Times-Italic findfont
dup length dict begin
  {1 index /FID ne {def} {pop pop} ifelse} forall
  /Encoding WinAnsiEncoding def
  currentdict
end
/Times-Italic exch definefont pop
/Times-Bold findfont
dup length dict begin
  {1 index /FID ne {def} {pop pop} ifelse} forall
  /Encoding WinAnsiEncoding def
  currentdict
end
/Times-Bold exch definefont pop
/Times-BoldItalic findfont
dup length dict begin
  {1 index /FID ne {def} {pop pop} ifelse} forall
  /Encoding WinAnsiEncoding def
  currentdict
end
/Times-BoldItalic exch definefont pop
/Courier findfont
dup length dict begin
  {1 index /FID ne {def} {pop pop} ifelse} forall
  /Encoding WinAnsiEncoding def
  currentdict
end
/Courier exch definefont pop
%FOPEndFontReencode
%%EndProlog
%%Page: 1 1
%%PageBoundingBox: 0 0 375 375
%%BeginPageSetup
[1 0 0 -1 0 375] CT
%%EndPageSetup
GS
[0.375 0 0 0.375 0 0] CT
1 GC
N
0 0 1000 1000 re
f
GR
GS
[0.375 0 0 0.375 0 0] CT
1 GC
N
0 0 1000 1000 re
f
GR
GS
[0.375 0 0 0.375 0 0] CT
1 GC
N
161 916 M
920 916 L
920 40 L
161 40 L
cp
f
GR
GS
[0.375 0 0 0.375 0 0] CT
2 setlinecap
1 LJ
1.333 LW
N
161 916 M
920 916 L
S
GR
GS
[0.375 0 0 0.375 0 0] CT
2 setlinecap
1 LJ
1.333 LW
N
414 916 M
414 907.24 L
S
GR
GS
[0.375 0 0 0.375 0 0] CT
2 setlinecap
1 LJ
1.333 LW
N
667 916 M
667 907.24 L
S
GR
GS
[0.375 0 0 0.375 155.25 347.50001] CT
/Helvetica 26.667 F
GS
[1 0 0 1 0 0] CT
-90.5 27 moveto 
1 -1 scale
(Time adv gains) t 
GR
GR
GS
[0.375 0 0 0.375 250.125 347.50001] CT
/Helvetica 26.667 F
GS
[1 0 0 1 0 0] CT
-96.5 27 moveto 
1 -1 scale
(Time adv losses) t 
GR
GR
GS
[0.375 0 0 0.375 0 0] CT
2 setlinecap
1 LJ
1.333 LW
N
161 916 M
161 40 L
S
GR
GS
[0.375 0 0 0.375 0 0] CT
2 setlinecap
1 LJ
1.333 LW
N
161 903.951 M
169.76 903.951 L
S
GR
GS
[0.375 0 0 0.375 0 0] CT
2 setlinecap
1 LJ
1.333 LW
N
161 794.819 M
169.76 794.819 L
S
GR
GS
[0.375 0 0 0.375 0 0] CT
2 setlinecap
1 LJ
1.333 LW
N
161 685.687 M
169.76 685.687 L
S
GR
GS
[0.375 0 0 0.375 0 0] CT
2 setlinecap
1 LJ
1.333 LW
N
161 576.555 M
169.76 576.555 L
S
GR
GS
[0.375 0 0 0.375 0 0] CT
2 setlinecap
1 LJ
1.333 LW
N
161 467.423 M
169.76 467.423 L
S
GR
GS
[0.375 0 0 0.375 0 0] CT
2 setlinecap
1 LJ
1.333 LW
N
161 358.291 M
169.76 358.291 L
S
GR
GS
[0.375 0 0 0.375 0 0] CT
2 setlinecap
1 LJ
1.333 LW
N
161 249.159 M
169.76 249.159 L
S
GR
GS
[0.375 0 0 0.375 0 0] CT
2 setlinecap
1 LJ
1.333 LW
N
161 140.027 M
169.76 140.027 L
S
GR
GS
[0.375 0 0 0.375 56.375 338.98158] CT
/Helvetica 26.667 F
GS
[1 0 0 1 0 0] CT
-69 10.5 moveto 
1 -1 scale
(-1000) t 
GR
GR
GS
[0.375 0 0 0.375 56.375 298.05707] CT
/Helvetica 26.667 F
GS
[1 0 0 1 0 0] CT
-15 10.5 moveto 
1 -1 scale
(0) t 
GR
GR
GS
[0.375 0 0 0.375 56.375 257.13258] CT
/Helvetica 26.667 F
GS
[1 0 0 1 0 0] CT
-60 10.5 moveto 
1 -1 scale
(1000) t 
GR
GR
GS
[0.375 0 0 0.375 56.375 216.20808] CT
/Helvetica 26.667 F
GS
[1 0 0 1 0 0] CT
-60 10.5 moveto 
1 -1 scale
(2000) t 
GR
GR
GS
[0.375 0 0 0.375 56.375 175.28359] CT
/Helvetica 26.667 F
GS
[1 0 0 1 0 0] CT
-60 10.5 moveto 
1 -1 scale
(3000) t 
GR
GR
GS
[0.375 0 0 0.375 56.375 134.3591] CT
/Helvetica 26.667 F
GS
[1 0 0 1 0 0] CT
-60 10.5 moveto 
1 -1 scale
(4000) t 
GR
GR
GS
[0.375 0 0 0.375 56.375 93.43461] CT
/Helvetica 26.667 F
GS
[1 0 0 1 0 0] CT
-60 10.5 moveto 
1 -1 scale
(5000) t 
GR
GR
GS
[0.375 0 0 0.375 56.375 52.51012] CT
/Helvetica 26.667 F
GS
[1 0 0 1 0 0] CT
-60 10.5 moveto 
1 -1 scale
(6000) t 
GR
GR
GS
[0 -0.375 0.375 0 27.5 179.24984] CT
/Helvetica 26.667 F
GS
[1 0 0 1 0 0] CT
-345.5 -6 moveto 
1 -1 scale
(PSE \(= point of subjective equality, where P\(accept\) = 0.5\)) t 
GR
GR
GS
[0.375 0 0 0.375 155.25 274.08584] CT
N
6.667 0 M
6.667 -3.682 3.682 -6.667 0 -6.667 C
-3.682 -6.667 -6.667 -3.682 -6.667 0 C
-6.667 3.682 -3.682 6.667 0 6.667 C
3.682 6.667 6.667 3.682 6.667 0 C
cp
f
GR
GS
[0.375 0 0 0.375 250.125 328.56818] CT
N
/f640454831{6.667 0 M
6.667 -3.682 3.682 -6.667 0 -6.667 C
-3.682 -6.667 -6.667 -3.682 -6.667 0 C
-6.667 3.682 -3.682 6.667 0 6.667 C
3.682 6.667 6.667 3.682 6.667 0 C
cp}def
f640454831
f
GR
GS
[0.375 0 0 0.375 0 0] CT
1 LJ
4 LW
N
414 730.896 M
667 876.182 L
S
GR
GS
[0.375 0 0 0.375 155.25 297.77374] CT
N
f640454831
f
GR
GS
[0.375 0 0 0.375 250.125 297.25443] CT
N
f640454831
f
GR
GS
[0.375 0 0 0.375 0 0] CT
1 LJ
4 LW
N
414 794.063 M
667 792.678 L
S
GR
GS
[0.375 0 0 0.375 155.25 299.68023] CT
N
f640454831
f
GR
GS
[0.375 0 0 0.375 250.125 281.4562] CT
N
f640454831
f
GR
GS
[0.375 0 0 0.375 0 0] CT
1 LJ
4 LW
N
414 799.147 M
667 750.55 L
S
GR
GS
[0.375 0 0 0.375 155.25 298.22376] CT
N
f640454831
f
GR
GS
[0.375 0 0 0.375 250.125 298.31767] CT
N
f640454831
f
GR
GS
[0.375 0 0 0.375 0 0] CT
1 LJ
4 LW
N
414 795.263 M
667 795.514 L
S
GR
GS
[0.375 0 0 0.375 155.25 298.04544] CT
N
f640454831
f
GR
GS
[0.375 0 0 0.375 250.125 297.66518] CT
N
f640454831
f
GR
GS
[0.375 0 0 0.375 0 0] CT
1 LJ
4 LW
N
414 794.788 M
667 793.774 L
S
GR
GS
[0.375 0 0 0.375 155.25 297.97671] CT
N
f640454831
f
GR
GS
[0.375 0 0 0.375 250.125 297.79383] CT
N
f640454831
f
GR
GS
[0.375 0 0 0.375 0 0] CT
1 LJ
4 LW
N
414 794.605 M
667 794.117 L
S
GR
GS
[0.375 0 0 0.375 155.25 296.72761] CT
N
f640454831
f
GR
GS
[0.375 0 0 0.375 250.125 296.34567] CT
N
f640454831
f
GR
GS
[0.375 0 0 0.375 0 0] CT
1 LJ
4 LW
N
414 791.274 M
667 790.255 L
S
GR
GS
[0.375 0 0 0.375 155.25 298.89491] CT
N
f640454831
f
GR
GS
[0.375 0 0 0.375 250.125 298.9481] CT
N
f640454831
f
GR
GS
[0.375 0 0 0.375 0 0] CT
1 LJ
4 LW
N
414 797.053 M
667 797.195 L
S
GR
GS
[0.375 0 0 0.375 155.25 297.46129] CT
N
f640454831
f
GR
GS
[0.375 0 0 0.375 250.125 298.02878] CT
N
f640454831
f
GR
GS
[0.375 0 0 0.375 0 0] CT
1 LJ
4 LW
N
414 793.23 M
667 794.743 L
S
GR
GS
[0.375 0 0 0.375 155.25 298.49957] CT
N
f640454831
f
GR
GS
[0.375 0 0 0.375 250.125 298.7525] CT
N
f640454831
f
GR
GS
[0.375 0 0 0.375 0 0] CT
1 LJ
4 LW
N
414 795.999 M
667 796.673 L
S
GR
GS
[0.375 0 0 0.375 155.25 297.79779] CT
N
f640454831
f
GR
GS
[0.375 0 0 0.375 250.125 297.58413] CT
N
f640454831
f
GR
GS
[0.375 0 0 0.375 0 0] CT
1 LJ
4 LW
N
414 794.127 M
667 793.558 L
S
GR
GS
[0.375 0 0 0.375 155.25 297.95009] CT
N
f640454831
f
GR
GS
[0.375 0 0 0.375 250.125 297.89184] CT
N
f640454831
f
GR
GS
[0.375 0 0 0.375 0 0] CT
1 LJ
4 LW
N
414 794.534 M
667 794.378 L
S
GR
GS
[0.375 0 0 0.375 155.25 298.94595] CT
N
f640454831
f
GR
GS
[0.375 0 0 0.375 250.125 298.86058] CT
N
f640454831
f
GR
GS
[0.375 0 0 0.375 0 0] CT
1 LJ
4 LW
N
414 797.189 M
667 796.962 L
S
GR
GS
[0.375 0 0 0.375 155.25 297.96032] CT
N
f640454831
f
GR
GS
[0.375 0 0 0.375 250.125 298.0825] CT
N
f640454831
f
GR
GS
[0.375 0 0 0.375 0 0] CT
1 LJ
4 LW
N
414 794.561 M
667 794.887 L
S
GR
GS
[0.375 0 0 0.375 155.25 298.14764] CT
N
f640454831
f
GR
GS
[0.375 0 0 0.375 250.125 298.11681] CT
N
f640454831
f
GR
GS
[0.375 0 0 0.375 0 0] CT
1 LJ
4 LW
N
414 795.06 M
667 794.978 L
S
GR
GS
[0.375 0 0 0.375 155.25 298.99326] CT
N
f640454831
f
GR
GS
[0.375 0 0 0.375 250.125 302.23993] CT
N
f640454831
f
GR
GS
[0.375 0 0 0.375 0 0] CT
1 LJ
4 LW
N
414 797.315 M
667 805.973 L
S
GR
GS
[0.375 0 0 0.375 155.25 298.38712] CT
N
f640454831
f
GR
GS
[0.375 0 0 0.375 250.125 297.67019] CT
N
f640454831
f
GR
GS
[0.375 0 0 0.375 0 0] CT
1 LJ
4 LW
N
414 795.699 M
667 793.787 L
S
GR
GS
[0.375 0 0 0.375 155.25 298.13086] CT
N
f640454831
f
GR
GS
[0.375 0 0 0.375 250.125 297.65071] CT
N
f640454831
f
GR
GS
[0.375 0 0 0.375 0 0] CT
1 LJ
4 LW
N
414 795.016 M
667 793.735 L
S
GR
GS
[0.375 0 0 0.375 155.25 297.92661] CT
N
f640454831
f
GR
GS
[0.375 0 0 0.375 250.125 294.71242] CT
N
f640454831
f
GR
GS
[0.375 0 0 0.375 0 0] CT
1 LJ
4 LW
N
414 794.471 M
667 785.9 L
S
GR
GS
[0.375 0 0 0.375 155.25 297.26411] CT
N
f640454831
f
GR
GS
[0.375 0 0 0.375 250.125 298.69391] CT
N
f640454831
f
GR
GS
[0.375 0 0 0.375 0 0] CT
1 LJ
4 LW
N
414 792.704 M
667 796.517 L
S
GR
GS
[0.375 0 0 0.375 155.25 298.06682] CT
N
f640454831
f
GR
GS
[0.375 0 0 0.375 250.125 298.09296] CT
N
f640454831
f
GR
GS
[0.375 0 0 0.375 0 0] CT
1 LJ
4 LW
N
414 794.845 M
667 794.915 L
S
GR
GS
[0.375 0 0 0.375 155.25 300.48784] CT
N
f640454831
f
GR
GS
[0.375 0 0 0.375 250.125 300.28313] CT
N
f640454831
f
GR
GS
[0.375 0 0 0.375 0 0] CT
1 LJ
4 LW
N
414 801.301 M
667 800.755 L
S
GR
GS
[0.375 0 0 0.375 155.25 299.77121] CT
N
f640454831
f
GR
GS
[0.375 0 0 0.375 250.125 299.14343] CT
N
f640454831
f
GR
GS
[0.375 0 0 0.375 0 0] CT
1 LJ
4 LW
N
414 799.39 M
667 797.716 L
S
GR
GS
[0.375 0 0 0.375 155.25 299.85175] CT
N
f640454831
f
GR
GS
[0.375 0 0 0.375 250.125 298.86189] CT
N
f640454831
f
GR
GS
[0.375 0 0 0.375 0 0] CT
1 LJ
4 LW
N
414 799.605 M
667 796.965 L
S
GR
GS
[0.375 0 0 0.375 155.25 298.38972] CT
N
f640454831
f
GR
GS
[0.375 0 0 0.375 250.125 298.79043] CT
N
f640454831
f
GR
GS
[0.375 0 0 0.375 0 0] CT
1 LJ
4 LW
N
414 795.706 M
667 796.774 L
S
GR
GS
[0.375 0 0 0.375 155.25 301.48581] CT
N
f640454831
f
GR
GS
[0.375 0 0 0.375 250.125 299.3383] CT
N
f640454831
f
GR
GS
[0.375 0 0 0.375 0 0] CT
1 LJ
4 LW
N
414 803.962 M
667 798.235 L
S
GR
GS
[0.375 0 0 0.375 155.25 298.32882] CT
N
f640454831
f
GR
GS
[0.375 0 0 0.375 250.125 298.85355] CT
N
f640454831
f
GR
GS
[0.375 0 0 0.375 0 0] CT
1 LJ
4 LW
N
414 795.544 M
667 796.943 L
S
GR
GS
[0.375 0 0 0.375 155.25 298.53248] CT
N
f640454831
f
GR
GS
[0.375 0 0 0.375 250.125 298.40641] CT
N
f640454831
f
GR
GS
[0.375 0 0 0.375 0 0] CT
1 LJ
4 LW
N
414 796.087 M
667 795.75 L
S
GR
GS
[0.375 0 0 0.375 155.25 299.14027] CT
N
f640454831
f
GR
GS
[0.375 0 0 0.375 250.125 299.21164] CT
N
f640454831
f
GR
GS
[0.375 0 0 0.375 0 0] CT
1 LJ
4 LW
N
414 797.707 M
667 797.898 L
S
GR
GS
[0.375 0 0 0.375 155.25 297.83814] CT
N
f640454831
f
GR
GS
[0.375 0 0 0.375 250.125 297.93118] CT
N
f640454831
f
GR
GS
[0.375 0 0 0.375 0 0] CT
1 LJ
4 LW
N
414 794.235 M
667 794.483 L
S
GR
GS
[0.375 0 0 0.375 155.25 299.68851] CT
N
f640454831
f
GR
GS
[0.375 0 0 0.375 250.125 299.46863] CT
N
f640454831
f
GR
GS
[0.375 0 0 0.375 0 0] CT
1 LJ
4 LW
N
414 799.169 M
667 798.583 L
S
GR
GS
[0.375 0 0 0.375 155.25 29.93182] CT
N
f640454831
f
GR
GS
[0.375 0 0 0.375 250.125 298.90402] CT
N
f640454831
f
GR
GS
[0.375 0 0 0.375 0 0] CT
1 LJ
4 LW
N
414 79.818 M
667 797.077 L
S
GR
GS
[0.375 0 0 0.375 155.25 298.39954] CT
N
f640454831
f
GR
GS
[0.375 0 0 0.375 250.125 298.36153] CT
N
f640454831
f
GR
GS
[0.375 0 0 0.375 0 0] CT
1 LJ
4 LW
N
414 795.732 M
667 795.631 L
S
GR
GS
[0.375 0 0 0.375 155.25 298.85976] CT
N
f640454831
f
GR
GS
[0.375 0 0 0.375 250.125 300.18068] CT
N
f640454831
f
GR
GS
[0.375 0 0 0.375 0 0] CT
1 LJ
4 LW
N
414 796.959 M
667 800.482 L
S
GR
GS
[0.375 0 0 0.375 155.25 298.78958] CT
N
f640454831
f
GR
GS
[0.375 0 0 0.375 250.125 298.27535] CT
N
f640454831
f
GR
GS
[0.375 0 0 0.375 0 0] CT
1 LJ
4 LW
N
414 796.772 M
667 795.401 L
S
GR
GS
[0.375 0 0 0.375 155.25 298.57297] CT
N
f640454831
f
GR
GS
[0.375 0 0 0.375 250.125 298.47404] CT
N
f640454831
f
GR
GS
[0.375 0 0 0.375 0 0] CT
1 LJ
4 LW
N
414 796.195 M
667 795.931 L
S
GR
GS
[0.375 0 0 0.375 155.25 296.29843] CT
N
f640454831
f
GR
GS
[0.375 0 0 0.375 250.125 297.39503] CT
N
f640454831
f
GR
GS
[0.375 0 0 0.375 0 0] CT
1 LJ
4 LW
N
414 790.129 M
667 793.053 L
S
GR
GS
[0.375 0 0 0.375 155.25 298.07817] CT
N
f640454831
f
GR
GS
[0.375 0 0 0.375 250.125 298.10522] CT
N
f640454831
f
GR
GS
[0.375 0 0 0.375 0 0] CT
1 LJ
4 LW
N
414 794.875 M
667 794.947 L
S
GR
%%Trailer
%%Pages: 1
%%EOF
