%!PS-Adobe-3.0 EPSF-3.0
%%Creator: (MATLAB, The Mathworks, Inc. Version 9.7.0.1261785 \(R2019b\) Update 3. Operating System: Windows 10)
%%Title: C:/Users/Clarissa/Documents/decid_eye/analysis/manip1&2/1_pipeline/fixations/3_f_fixation_behav/plots/lvl2_all/choiceAsFunctionOfTimeAdv.eps
%%CreationDate: 2021-04-19T12:26:50
%%Pages: (atend)
%%BoundingBox:    17    14   346   361
%%LanguageLevel: 3
%%EndComments
%%BeginProlog
%%BeginResource: procset (Apache XML Graphics Std ProcSet) 1.2 0
%%Version: 1.2 0
%%Copyright: (Copyright 2001-2003,2010 The Apache Software Foundation. License terms: http://www.apache.org/licenses/LICENSE-2.0)
/bd{bind def}bind def
/ld{load def}bd
/GR/grestore ld
/GS/gsave ld
/RM/rmoveto ld
/C/curveto ld
/t/show ld
/L/lineto ld
/ML/setmiterlimit ld
/CT/concat ld
/f/fill ld
/N/newpath ld
/S/stroke ld
/CC/setcmykcolor ld
/A/ashow ld
/cp/closepath ld
/RC/setrgbcolor ld
/LJ/setlinejoin ld
/GC/setgray ld
/LW/setlinewidth ld
/M/moveto ld
/re {4 2 roll M
1 index 0 rlineto
0 exch rlineto
neg 0 rlineto
cp } bd
/_ctm matrix def
/_tm matrix def
/BT { _ctm currentmatrix pop matrix _tm copy pop 0 0 moveto } bd
/ET { _ctm setmatrix } bd
/iTm { _ctm setmatrix _tm concat } bd
/Tm { _tm astore pop iTm 0 0 moveto } bd
/ux 0.0 def
/uy 0.0 def
/F {
  /Tp exch def
  /Tf exch def
  Tf findfont Tp scalefont setfont
  /cf Tf def  /cs Tp def
} bd
/ULS {currentpoint /uy exch def /ux exch def} bd
/ULE {
  /Tcx currentpoint pop def
  gsave
  newpath
  cf findfont cs scalefont dup
  /FontMatrix get 0 get /Ts exch def /FontInfo get dup
  /UnderlinePosition get Ts mul /To exch def
  /UnderlineThickness get Ts mul /Tt exch def
  ux uy To add moveto  Tcx uy To add lineto
  Tt setlinewidth stroke
  grestore
} bd
/OLE {
  /Tcx currentpoint pop def
  gsave
  newpath
  cf findfont cs scalefont dup
  /FontMatrix get 0 get /Ts exch def /FontInfo get dup
  /UnderlinePosition get Ts mul /To exch def
  /UnderlineThickness get Ts mul /Tt exch def
  ux uy To add cs add moveto Tcx uy To add cs add lineto
  Tt setlinewidth stroke
  grestore
} bd
/SOE {
  /Tcx currentpoint pop def
  gsave
  newpath
  cf findfont cs scalefont dup
  /FontMatrix get 0 get /Ts exch def /FontInfo get dup
  /UnderlinePosition get Ts mul /To exch def
  /UnderlineThickness get Ts mul /Tt exch def
  ux uy To add cs 10 mul 26 idiv add moveto Tcx uy To add cs 10 mul 26 idiv add lineto
  Tt setlinewidth stroke
  grestore
} bd
/QT {
/Y22 exch store
/X22 exch store
/Y21 exch store
/X21 exch store
currentpoint
/Y21 load 2 mul add 3 div exch
/X21 load 2 mul add 3 div exch
/X21 load 2 mul /X22 load add 3 div
/Y21 load 2 mul /Y22 load add 3 div
/X22 load /Y22 load curveto
} bd
/SSPD {
dup length /d exch dict def
{
/v exch def
/k exch def
currentpagedevice k known {
/cpdv currentpagedevice k get def
v cpdv ne {
/upd false def
/nullv v type /nulltype eq def
/nullcpdv cpdv type /nulltype eq def
nullv nullcpdv or
{
/upd true def
} {
/sametype v type cpdv type eq def
sametype {
v type /arraytype eq {
/vlen v length def
/cpdvlen cpdv length def
vlen cpdvlen eq {
0 1 vlen 1 sub {
/i exch def
/obj v i get def
/cpdobj cpdv i get def
obj cpdobj ne {
/upd true def
exit
} if
} for
} {
/upd true def
} ifelse
} {
v type /dicttype eq {
v {
/dv exch def
/dk exch def
/cpddv cpdv dk get def
dv cpddv ne {
/upd true def
exit
} if
} forall
} {
/upd true def
} ifelse
} ifelse
} if
} ifelse
upd true eq {
d k v put
} if
} if
} if
} forall
d length 0 gt {
d setpagedevice
} if
} bd
/RE { % /NewFontName [NewEncodingArray] /FontName RE -
  findfont dup length dict begin
  {
    1 index /FID ne
    {def} {pop pop} ifelse
  } forall
  /Encoding exch def
  /FontName 1 index def
  currentdict definefont pop
  end
} bind def
%%EndResource
%%BeginResource: procset (Apache XML Graphics EPS ProcSet) 1.0 0
%%Version: 1.0 0
%%Copyright: (Copyright 2002-2003 The Apache Software Foundation. License terms: http://www.apache.org/licenses/LICENSE-2.0)
/BeginEPSF { %def
/b4_Inc_state save def         % Save state for cleanup
/dict_count countdictstack def % Count objects on dict stack
/op_count count 1 sub def      % Count objects on operand stack
userdict begin                 % Push userdict on dict stack
/showpage { } def              % Redefine showpage, { } = null proc
0 setgray 0 setlinecap         % Prepare graphics state
1 setlinewidth 0 setlinejoin
10 setmiterlimit [ ] 0 setdash newpath
/languagelevel where           % If level not equal to 1 then
{pop languagelevel             % set strokeadjust and
1 ne                           % overprint to their defaults.
{false setstrokeadjust false setoverprint
} if
} if
} bd
/EndEPSF { %def
count op_count sub {pop} repeat            % Clean up stacks
countdictstack dict_count sub {end} repeat
b4_Inc_state restore
} bd
%%EndResource
%FOPBeginFontDict
%%IncludeResource: font Courier-Oblique
%%IncludeResource: font Courier-BoldOblique
%%IncludeResource: font Courier-Bold
%%IncludeResource: font ZapfDingbats
%%IncludeResource: font Symbol
%%IncludeResource: font Helvetica
%%IncludeResource: font Helvetica-Oblique
%%IncludeResource: font Helvetica-Bold
%%IncludeResource: font Helvetica-BoldOblique
%%IncludeResource: font Times-Roman
%%IncludeResource: font Times-Italic
%%IncludeResource: font Times-Bold
%%IncludeResource: font Times-BoldItalic
%%IncludeResource: font Courier
%FOPEndFontDict
%%BeginResource: encoding WinAnsiEncoding
/WinAnsiEncoding [
/.notdef /.notdef /.notdef /.notdef /.notdef
/.notdef /.notdef /.notdef /.notdef /.notdef
/.notdef /.notdef /.notdef /.notdef /.notdef
/.notdef /.notdef /.notdef /.notdef /.notdef
/.notdef /.notdef /.notdef /.notdef /.notdef
/.notdef /.notdef /.notdef /.notdef /.notdef
/.notdef /.notdef /space /exclam /quotedbl
/numbersign /dollar /percent /ampersand /quotesingle
/parenleft /parenright /asterisk /plus /comma
/hyphen /period /slash /zero /one
/two /three /four /five /six
/seven /eight /nine /colon /semicolon
/less /equal /greater /question /at
/A /B /C /D /E
/F /G /H /I /J
/K /L /M /N /O
/P /Q /R /S /T
/U /V /W /X /Y
/Z /bracketleft /backslash /bracketright /asciicircum
/underscore /quoteleft /a /b /c
/d /e /f /g /h
/i /j /k /l /m
/n /o /p /q /r
/s /t /u /v /w
/x /y /z /braceleft /bar
/braceright /asciitilde /bullet /Euro /bullet
/quotesinglbase /florin /quotedblbase /ellipsis /dagger
/daggerdbl /circumflex /perthousand /Scaron /guilsinglleft
/OE /bullet /Zcaron /bullet /bullet
/quoteleft /quoteright /quotedblleft /quotedblright /bullet
/endash /emdash /asciitilde /trademark /scaron
/guilsinglright /oe /bullet /zcaron /Ydieresis
/space /exclamdown /cent /sterling /currency
/yen /brokenbar /section /dieresis /copyright
/ordfeminine /guillemotleft /logicalnot /sfthyphen /registered
/macron /degree /plusminus /twosuperior /threesuperior
/acute /mu /paragraph /middot /cedilla
/onesuperior /ordmasculine /guillemotright /onequarter /onehalf
/threequarters /questiondown /Agrave /Aacute /Acircumflex
/Atilde /Adieresis /Aring /AE /Ccedilla
/Egrave /Eacute /Ecircumflex /Edieresis /Igrave
/Iacute /Icircumflex /Idieresis /Eth /Ntilde
/Ograve /Oacute /Ocircumflex /Otilde /Odieresis
/multiply /Oslash /Ugrave /Uacute /Ucircumflex
/Udieresis /Yacute /Thorn /germandbls /agrave
/aacute /acircumflex /atilde /adieresis /aring
/ae /ccedilla /egrave /eacute /ecircumflex
/edieresis /igrave /iacute /icircumflex /idieresis
/eth /ntilde /ograve /oacute /ocircumflex
/otilde /odieresis /divide /oslash /ugrave
/uacute /ucircumflex /udieresis /yacute /thorn
/ydieresis
] def
%%EndResource
%FOPBeginFontReencode
/Courier-Oblique findfont
dup length dict begin
  {1 index /FID ne {def} {pop pop} ifelse} forall
  /Encoding WinAnsiEncoding def
  currentdict
end
/Courier-Oblique exch definefont pop
/Courier-BoldOblique findfont
dup length dict begin
  {1 index /FID ne {def} {pop pop} ifelse} forall
  /Encoding WinAnsiEncoding def
  currentdict
end
/Courier-BoldOblique exch definefont pop
/Courier-Bold findfont
dup length dict begin
  {1 index /FID ne {def} {pop pop} ifelse} forall
  /Encoding WinAnsiEncoding def
  currentdict
end
/Courier-Bold exch definefont pop
/Helvetica findfont
dup length dict begin
  {1 index /FID ne {def} {pop pop} ifelse} forall
  /Encoding WinAnsiEncoding def
  currentdict
end
/Helvetica exch definefont pop
/Helvetica-Oblique findfont
dup length dict begin
  {1 index /FID ne {def} {pop pop} ifelse} forall
  /Encoding WinAnsiEncoding def
  currentdict
end
/Helvetica-Oblique exch definefont pop
/Helvetica-Bold findfont
dup length dict begin
  {1 index /FID ne {def} {pop pop} ifelse} forall
  /Encoding WinAnsiEncoding def
  currentdict
end
/Helvetica-Bold exch definefont pop
/Helvetica-BoldOblique findfont
dup length dict begin
  {1 index /FID ne {def} {pop pop} ifelse} forall
  /Encoding WinAnsiEncoding def
  currentdict
end
/Helvetica-BoldOblique exch definefont pop
/Times-Roman findfont
dup length dict begin
  {1 index /FID ne {def} {pop pop} ifelse} forall
  /Encoding WinAnsiEncoding def
  currentdict
end
/Times-Roman exch definefont pop
/Times-Italic findfont
dup length dict begin
  {1 index /FID ne {def} {pop pop} ifelse} forall
  /Encoding WinAnsiEncoding def
  currentdict
end
/Times-Italic exch definefont pop
/Times-Bold findfont
dup length dict begin
  {1 index /FID ne {def} {pop pop} ifelse} forall
  /Encoding WinAnsiEncoding def
  currentdict
end
/Times-Bold exch definefont pop
/Times-BoldItalic findfont
dup length dict begin
  {1 index /FID ne {def} {pop pop} ifelse} forall
  /Encoding WinAnsiEncoding def
  currentdict
end
/Times-BoldItalic exch definefont pop
/Courier findfont
dup length dict begin
  {1 index /FID ne {def} {pop pop} ifelse} forall
  /Encoding WinAnsiEncoding def
  currentdict
end
/Courier exch definefont pop
%FOPEndFontReencode
%%EndProlog
%%Page: 1 1
%%PageBoundingBox: 0 0 375 375
%%BeginPageSetup
[1 0 0 -1 0 375] CT
%%EndPageSetup
GS
[0.375 0 0 0.375 0 0] CT
1 GC
N
0 0 1000 1000 re
f
GR
GS
[0.375 0 0 0.375 0 0] CT
1 GC
N
0 0 1000 1000 re
f
GR
GS
[0.375 0 0 0.375 0 0] CT
1 GC
N
107 881 M
920 881 L
920 40 L
107 40 L
cp
f
GR
GS
[0.375 0 0 0.375 0 0] CT
2 setlinecap
1 LJ
1.333 LW
N
107 881 M
920 881 L
S
GR
GS
[0.375 0 0 0.375 0 0] CT
2 setlinecap
1 LJ
1.333 LW
N
143.955 881 M
143.955 872.59 L
S
GR
GS
[0.375 0 0 0.375 0 0] CT
2 setlinecap
1 LJ
1.333 LW
N
328.727 881 M
328.727 872.59 L
S
GR
GS
[0.375 0 0 0.375 0 0] CT
2 setlinecap
1 LJ
1.333 LW
N
513.5 881 M
513.5 872.59 L
S
GR
GS
[0.375 0 0 0.375 0 0] CT
2 setlinecap
1 LJ
1.333 LW
N
698.273 881 M
698.273 872.59 L
S
GR
GS
[0.375 0 0 0.375 0 0] CT
2 setlinecap
1 LJ
1.333 LW
N
883.045 881 M
883.045 872.59 L
S
GR
GS
[0.375 0 0 0.375 53.98295 334.37501] CT
/Helvetica 26.667 F
GS
[1 0 0 1 0 0] CT
-7.5 27 moveto 
1 -1 scale
(1) t 
GR
GR
GS
[0.375 0 0 0.375 123.27272 334.37501] CT
/Helvetica 26.667 F
GS
[1 0 0 1 0 0] CT
-7.5 27 moveto 
1 -1 scale
(2) t 
GR
GR
GS
[0.375 0 0 0.375 192.5625 334.37501] CT
/Helvetica 26.667 F
GS
[1 0 0 1 0 0] CT
-7.5 27 moveto 
1 -1 scale
(3) t 
GR
GR
GS
[0.375 0 0 0.375 261.85226 334.37501] CT
/Helvetica 26.667 F
GS
[1 0 0 1 0 0] CT
-7.5 27 moveto 
1 -1 scale
(4) t 
GR
GR
GS
[0.375 0 0 0.375 331.14205 334.37501] CT
/Helvetica 26.667 F
GS
[1 0 0 1 0 0] CT
-7.5 27 moveto 
1 -1 scale
(5) t 
GR
GR
GS
[0.375 0 0 0.375 192.56264 347.74999] CT
/Helvetica 26.667 F
GS
[1 0 0 1 0 0] CT
-131.5 27 moveto 
1 -1 scale
(Time advantage gains) t 
GR
GR
GS
[0.375 0 0 0.375 0 0] CT
2 setlinecap
1 LJ
1.333 LW
N
107 881 M
107 40 L
S
GR
GS
[0.375 0 0 0.375 0 0] CT
2 setlinecap
1 LJ
1.333 LW
N
107 842.773 M
115.41 842.773 L
S
GR
GS
[0.375 0 0 0.375 0 0] CT
2 setlinecap
1 LJ
1.333 LW
N
107 46.371 M
115.41 46.371 L
S
GR
GS
[0.375 0 0 0.375 36.125 316.03976] CT
/Helvetica 26.667 F
GS
[1 0 0 1 0 0] CT
-15 10.5 moveto 
1 -1 scale
(0) t 
GR
GR
GS
[0.375 0 0 0.375 36.125 17.3892] CT
/Helvetica 26.667 F
GS
[1 0 0 1 0 0] CT
-15 10.5 moveto 
1 -1 scale
(1) t 
GR
GR
GS
[0 -0.375 0.375 0 27.5 172.68734] CT
/Helvetica 26.667 F
GS
[1 0 0 1 0 0] CT
-56 -6 moveto 
1 -1 scale
(p\(accept\)) t 
GR
GR
GS
[0.375 0 0 0.375 53.98295 37.29924] CT
N
6.667 0 M
6.667 -3.682 3.682 -6.667 0 -6.667 C
-3.682 -6.667 -6.667 -3.682 -6.667 0 C
-6.667 3.682 -3.682 6.667 0 6.667 C
3.682 6.667 6.667 3.682 6.667 0 C
cp
f
GR
GS
[0.375 0 0 0.375 123.27272 97.02935] CT
N
/f640454831{6.667 0 M
6.667 -3.682 3.682 -6.667 0 -6.667 C
-3.682 -6.667 -6.667 -3.682 -6.667 0 C
-6.667 3.682 -3.682 6.667 0 6.667 C
3.682 6.667 6.667 3.682 6.667 0 C
cp}def
f640454831
f
GR
GS
[0.375 0 0 0.375 192.5625 77.11931] CT
N
f640454831
f
GR
GS
[0.375 0 0 0.375 261.85226 37.29924] CT
N
f640454831
f
GR
GS
[0.375 0 0 0.375 331.14205 37.29924] CT
N
f640454831
f
GR
GS
[0.375 0 0 0.375 53.98295 276.74364] CT
N
f640454831
f
GR
GS
[0.375 0 0 0.375 123.27272 229.5883] CT
N
f640454831
f
GR
GS
[0.375 0 0 0.375 192.5625 203.03684] CT
N
f640454831
f
GR
GS
[0.375 0 0 0.375 261.85226 198.15138] CT
N
f640454831
f
GR
GS
[0.375 0 0 0.375 331.14205 135.27758] CT
N
f640454831
f
GR
GS
[0.375 0 0 0.375 53.98295 29.83298] CT
N
f640454831
f
GR
GS
[0.375 0 0 0.375 123.27272 29.83298] CT
N
f640454831
f
GR
GS
[0.375 0 0 0.375 192.5625 29.33523] CT
N
f640454831
f
GR
GS
[0.375 0 0 0.375 261.85226 42.27675] CT
N
f640454831
f
GR
GS
[0.375 0 0 0.375 331.14205 29.83298] CT
N
f640454831
f
GR
GS
[0.375 0 0 0.375 53.98295 191.60204] CT
N
f640454831
f
GR
GS
[0.375 0 0 0.375 123.27272 136.84942] CT
N
f640454831
f
GR
GS
[0.375 0 0 0.375 192.5625 116.93939] CT
N
f640454831
f
GR
GS
[0.375 0 0 0.375 261.85226 124.90342] CT
N
f640454831
f
GR
GS
[0.375 0 0 0.375 331.14205 79.60807] CT
N
f640454831
f
GR
GS
[0.375 0 0 0.375 53.98295 253.16597] CT
N
f640454831
f
GR
GS
[0.375 0 0 0.375 123.27272 245.30674] CT
N
f640454831
f
GR
GS
[0.375 0 0 0.375 192.5625 178.82195] CT
N
f640454831
f
GR
GS
[0.375 0 0 0.375 261.85226 150.99605] CT
N
f640454831
f
GR
GS
[0.375 0 0 0.375 331.14205 72.40379] CT
N
f640454831
f
GR
GS
[0.375 0 0 0.375 53.98295 219.41753] CT
N
f640454831
f
GR
GS
[0.375 0 0 0.375 123.27272 207.43957] CT
N
f640454831
f
GR
GS
[0.375 0 0 0.375 192.5625 193.06602] CT
N
f640454831
f
GR
GS
[0.375 0 0 0.375 261.85226 198.38953] CT
N
f640454831
f
GR
GS
[0.375 0 0 0.375 331.14205 114.01146] CT
N
f640454831
f
GR
GS
[0.375 0 0 0.375 53.98295 257.96883] CT
N
f640454831
f
GR
GS
[0.375 0 0 0.375 123.27272 257.96883] CT
N
f640454831
f
GR
GS
[0.375 0 0 0.375 192.5625 222.17816] CT
N
f640454831
f
GR
GS
[0.375 0 0 0.375 261.85226 257.96883] CT
N
f640454831
f
GR
GS
[0.375 0 0 0.375 331.14205 241.37714] CT
N
f640454831
f
GR
GS
[0.375 0 0 0.375 53.98295 40.96688] CT
N
f640454831
f
GR
GS
[0.375 0 0 0.375 123.27272 73.89067] CT
N
f640454831
f
GR
GS
[0.375 0 0 0.375 192.5625 80.263] CT
N
f640454831
f
GR
GS
[0.375 0 0 0.375 261.85226 90.03393] CT
N
f640454831
f
GR
GS
[0.375 0 0 0.375 331.14205 95.98146] CT
N
f640454831
f
GR
GS
[0.375 0 0 0.375 53.98295 316.03976] CT
N
f640454831
f
GR
GS
[0.375 0 0 0.375 123.27272 67.1643] CT
N
f640454831
f
GR
GS
[0.375 0 0 0.375 192.5625 136.84942] CT
N
f640454831
f
GR
GS
[0.375 0 0 0.375 261.85226 216.48958] CT
N
f640454831
f
GR
GS
[0.375 0 0 0.375 331.14205 256.30966] CT
N
f640454831
f
GR
GS
[0.375 0 0 0.375 53.98295 92.05185] CT
N
f640454831
f
GR
GS
[0.375 0 0 0.375 123.27272 133.53109] CT
N
f640454831
f
GR
GS
[0.375 0 0 0.375 192.5625 114.24884] CT
N
f640454831
f
GR
GS
[0.375 0 0 0.375 261.85226 92.05185] CT
N
f640454831
f
GR
GS
[0.375 0 0 0.375 331.14205 67.1643] CT
N
f640454831
f
GR
GS
[0.375 0 0 0.375 53.98295 266.26467] CT
N
f640454831
f
GR
GS
[0.375 0 0 0.375 123.27272 224.78542] CT
N
f640454831
f
GR
GS
[0.375 0 0 0.375 192.5625 219.18013] CT
N
f640454831
f
GR
GS
[0.375 0 0 0.375 261.85226 233.08127] CT
N
f640454831
f
GR
GS
[0.375 0 0 0.375 331.14205 199.89789] CT
N
f640454831
f
GR
GS
[0.375 0 0 0.375 53.98295 227.25176] CT
N
f640454831
f
GR
GS
[0.375 0 0 0.375 123.27272 182.43295] CT
N
f640454831
f
GR
GS
[0.375 0 0 0.375 192.5625 194.96521] CT
N
f640454831
f
GR
GS
[0.375 0 0 0.375 261.85226 166.71449] CT
N
f640454831
f
GR
GS
[0.375 0 0 0.375 331.14205 178.82195] CT
N
f640454831
f
GR
GS
[0.375 0 0 0.375 53.98295 89.06534] CT
N
f640454831
f
GR
GS
[0.375 0 0 0.375 123.27272 116.93939] CT
N
f640454831
f
GR
GS
[0.375 0 0 0.375 192.5625 101.01136] CT
N
f640454831
f
GR
GS
[0.375 0 0 0.375 261.85226 104.49562] CT
N
f640454831
f
GR
GS
[0.375 0 0 0.375 331.14205 41.28125] CT
N
f640454831
f
GR
GS
[0.375 0 0 0.375 53.98295 158.85526] CT
N
f640454831
f
GR
GS
[0.375 0 0 0.375 123.27272 135.27758] CT
N
f640454831
f
GR
GS
[0.375 0 0 0.375 192.5625 143.13682] CT
N
f640454831
f
GR
GS
[0.375 0 0 0.375 261.85226 198.15138] CT
N
f640454831
f
GR
GS
[0.375 0 0 0.375 331.14205 206.01061] CT
N
f640454831
f
GR
GS
[0.375 0 0 0.375 53.98295 154.60704] CT
N
f640454831
f
GR
GS
[0.375 0 0 0.375 123.27272 175.01034] CT
N
f640454831
f
GR
GS
[0.375 0 0 0.375 192.5625 146.53539] CT
N
f640454831
f
GR
GS
[0.375 0 0 0.375 261.85226 150.12278] CT
N
f640454831
f
GR
GS
[0.375 0 0 0.375 331.14205 154.60704] CT
N
f640454831
f
GR
GS
[0.375 0 0 0.375 53.98295 116.93939] CT
N
f640454831
f
GR
GS
[0.375 0 0 0.375 123.27272 120.37216] CT
N
f640454831
f
GR
GS
[0.375 0 0 0.375 192.5625 97.02935] CT
N
f640454831
f
GR
GS
[0.375 0 0 0.375 261.85226 161.56534] CT
N
f640454831
f
GR
GS
[0.375 0 0 0.375 331.14205 116.93939] CT
N
f640454831
f
GR
GS
[0.375 0 0 0.375 53.98295 303.59601] CT
N
f640454831
f
GR
GS
[0.375 0 0 0.375 123.27272 220.4716] CT
N
f640454831
f
GR
GS
[0.375 0 0 0.375 192.5625 141.82695] CT
N
f640454831
f
GR
GS
[0.375 0 0 0.375 261.85226 89.06534] CT
N
f640454831
f
GR
GS
[0.375 0 0 0.375 331.14205 42.27675] CT
N
f640454831
f
GR
GS
[0.375 0 0 0.375 53.98295 237.44751] CT
N
f640454831
f
GR
GS
[0.375 0 0 0.375 123.27272 245.30674] CT
N
f640454831
f
GR
GS
[0.375 0 0 0.375 192.5625 186.89358] CT
N
f640454831
f
GR
GS
[0.375 0 0 0.375 261.85226 143.13682] CT
N
f640454831
f
GR
GS
[0.375 0 0 0.375 331.14205 88.12223] CT
N
f640454831
f
GR
GS
[0.375 0 0 0.375 53.98295 174.57372] CT
N
f640454831
f
GR
GS
[0.375 0 0 0.375 123.27272 166.71449] CT
N
f640454831
f
GR
GS
[0.375 0 0 0.375 192.5625 174.57372] CT
N
f640454831
f
GR
GS
[0.375 0 0 0.375 261.85226 196.57954] CT
N
f640454831
f
GR
GS
[0.375 0 0 0.375 331.14205 158.85526] CT
N
f640454831
f
GR
GS
[0.375 0 0 0.375 53.98295 188.04667] CT
N
f640454831
f
GR
GS
[0.375 0 0 0.375 123.27272 175.49833] CT
N
f640454831
f
GR
GS
[0.375 0 0 0.375 192.5625 153.91517] CT
N
f640454831
f
GR
GS
[0.375 0 0 0.375 261.85226 193.06602] CT
N
f640454831
f
GR
GS
[0.375 0 0 0.375 331.14205 179.5138] CT
N
f640454831
f
GR
GS
[0.375 0 0 0.375 53.98295 154.60704] CT
N
f640454831
f
GR
GS
[0.375 0 0 0.375 123.27272 154.60704] CT
N
f640454831
f
GR
GS
[0.375 0 0 0.375 192.5625 154.60704] CT
N
f640454831
f
GR
GS
[0.375 0 0 0.375 261.85226 154.60704] CT
N
f640454831
f
GR
GS
[0.375 0 0 0.375 331.14205 203.03684] CT
N
f640454831
f
GR
GS
[0.375 0 0 0.375 53.98295 93.31732] CT
N
f640454831
f
GR
GS
[0.375 0 0 0.375 123.27272 78.13169] CT
N
f640454831
f
GR
GS
[0.375 0 0 0.375 192.5625 47.76046] CT
N
f640454831
f
GR
GS
[0.375 0 0 0.375 261.85226 78.13169] CT
N
f640454831
f
GR
GS
[0.375 0 0 0.375 331.14205 73.06983] CT
N
f640454831
f
GR
GS
[0.375 0 0 0.375 53.98295 101.01136] CT
N
f640454831
f
GR
GS
[0.375 0 0 0.375 123.27272 104.99337] CT
N
f640454831
f
GR
GS
[0.375 0 0 0.375 192.5625 127.41837] CT
N
f640454831
f
GR
GS
[0.375 0 0 0.375 261.85226 77.11931] CT
N
f640454831
f
GR
GS
[0.375 0 0 0.375 331.14205 85.08334] CT
N
f640454831
f
GR
GS
[0.375 0 0 0.375 53.98295 85.65219] CT
N
f640454831
f
GR
GS
[0.375 0 0 0.375 123.27272 77.11931] CT
N
f640454831
f
GR
GS
[0.375 0 0 0.375 192.5625 55.78714] CT
N
f640454831
f
GR
GS
[0.375 0 0 0.375 261.85226 55.78714] CT
N
f640454831
f
GR
GS
[0.375 0 0 0.375 331.14205 47.25427] CT
N
f640454831
f
GR
GS
[0.375 0 0 0.375 53.98295 145.3823] CT
N
f640454831
f
GR
GS
[0.375 0 0 0.375 123.27272 121.00267] CT
N
f640454831
f
GR
GS
[0.375 0 0 0.375 192.5625 151.47723] CT
N
f640454831
f
GR
GS
[0.375 0 0 0.375 261.85226 181.95177] CT
N
f640454831
f
GR
GS
[0.375 0 0 0.375 331.14205 175.85685] CT
N
f640454831
f
GR
GS
[0.375 0 0 0.375 53.98295 150.99605] CT
N
f640454831
f
GR
GS
[0.375 0 0 0.375 123.27272 147.57021] CT
N
f640454831
f
GR
GS
[0.375 0 0 0.375 192.5625 190.29216] CT
N
f640454831
f
GR
GS
[0.375 0 0 0.375 261.85226 162.88562] CT
N
f640454831
f
GR
GS
[0.375 0 0 0.375 331.14205 150.99605] CT
N
f640454831
f
GR
GS
[0.375 0 0 0.375 53.98295 222.02014] CT
N
f640454831
f
GR
GS
[0.375 0 0 0.375 123.27272 180.28951] CT
N
f640454831
f
GR
GS
[0.375 0 0 0.375 192.5625 172.24505] CT
N
f640454831
f
GR
GS
[0.375 0 0 0.375 261.85226 163.99949] CT
N
f640454831
f
GR
GS
[0.375 0 0 0.375 331.14205 188.83675] CT
N
f640454831
f
GR
GS
[0.375 0 0 0.375 53.98295 178.82195] CT
N
f640454831
f
GR
GS
[0.375 0 0 0.375 123.27272 110.21302] CT
N
f640454831
f
GR
GS
[0.375 0 0 0.375 192.5625 136.84942] CT
N
f640454831
f
GR
GS
[0.375 0 0 0.375 261.85226 130.39213] CT
N
f640454831
f
GR
GS
[0.375 0 0 0.375 331.14205 130.39213] CT
N
f640454831
f
GR
GS
[0.375 0 0 0.375 53.98295 157.38166] CT
N
f640454831
f
GR
GS
[0.375 0 0 0.375 123.27272 135.90133] CT
N
f640454831
f
GR
GS
[0.375 0 0 0.375 192.5625 143.38241] CT
N
f640454831
f
GR
GS
[0.375 0 0 0.375 261.85226 126.42035] CT
N
f640454831
f
GR
GS
[0.375 0 0 0.375 331.14205 124.71675] CT
N
f640454831
f
GR
GS
[0.375 0 0 0.375 53.98295 192.78715] CT
N
f640454831
f
GR
GS
[0.375 0 0 0.375 123.27272 164.34424] CT
N
f640454831
f
GR
GS
[0.375 0 0 0.375 192.5625 192.78715] CT
N
f640454831
f
GR
GS
[0.375 0 0 0.375 261.85226 211.74909] CT
N
f640454831
f
GR
GS
[0.375 0 0 0.375 331.14205 230.71104] CT
N
f640454831
f
GR
GS
[0.375 0 0 0.375 53.98295 60.05357] CT
N
f640454831
f
GR
GS
[0.375 0 0 0.375 123.27272 60.7417] CT
N
f640454831
f
GR
GS
[0.375 0 0 0.375 192.5625 36.35114] CT
N
f640454831
f
GR
GS
[0.375 0 0 0.375 261.85226 36.65698] CT
N
f640454831
f
GR
GS
[0.375 0 0 0.375 331.14205 31.61066] CT
N
f640454831
f
GR
GS
[0.375 0 0 0.375 53.98295 92.05185] CT
N
f640454831
f
GR
GS
[0.375 0 0 0.375 123.27272 119.36744] CT
N
f640454831
f
GR
GS
[0.375 0 0 0.375 192.5625 114.45063] CT
N
f640454831
f
GR
GS
[0.375 0 0 0.375 261.85226 119.36744] CT
N
f640454831
f
GR
GS
[0.375 0 0 0.375 331.14205 84.58559] CT
N
f640454831
f
GR
GS
[0.375 0 0 0.375 53.98295 192.31311] CT
N
f640454831
f
GR
GS
[0.375 0 0 0.375 123.27272 189.84939] CT
N
f640454831
f
GR
GS
[0.375 0 0 0.375 192.5625 205.11241] CT
N
f640454831
f
GR
GS
[0.375 0 0 0.375 261.85226 189.84939] CT
N
f640454831
f
GR
GS
[0.375 0 0 0.375 331.14205 158.18161] CT
N
f640454831
f
GR
GS
[0.375 0 0 0.375 53.98295 92.05185] CT
N
f640454831
f
GR
GS
[0.375 0 0 0.375 123.27272 123.48875] CT
N
f640454831
f
GR
GS
[0.375 0 0 0.375 192.5625 136.84942] CT
N
f640454831
f
GR
GS
[0.375 0 0 0.375 261.85226 119.55914] CT
N
f640454831
f
GR
GS
[0.375 0 0 0.375 331.14205 131.34796] CT
N
f640454831
f
GR
GS
[0.375 0 0 0.375 53.98295 116.93939] CT
N
f640454831
f
GR
GS
[0.375 0 0 0.375 123.27272 163.78654] CT
N
f640454831
f
GR
GS
[0.375 0 0 0.375 192.5625 134.50707] CT
N
f640454831
f
GR
GS
[0.375 0 0 0.375 261.85226 99.3717] CT
N
f640454831
f
GR
GS
[0.375 0 0 0.375 331.14205 157.93064] CT
N
f640454831
f
GR
GS
[0.375 0 0 0.375 53.98295 150.12278] CT
N
f640454831
f
GR
GS
[0.375 0 0 0.375 123.27272 166.71449] CT
N
f640454831
f
GR
GS
[0.375 0 0 0.375 192.5625 87.65992] CT
N
f640454831
f
GR
GS
[0.375 0 0 0.375 261.85226 133.53109] CT
N
f640454831
f
GR
GS
[0.375 0 0 0.375 331.14205 133.53109] CT
N
f640454831
f
GR
GS
[0.375 0 0 0.375 53.98295 270.59294] CT
N
f640454831
f
GR
GS
[0.375 0 0 0.375 123.27272 270.59294] CT
N
f640454831
f
GR
GS
[0.375 0 0 0.375 192.5625 258.85137] CT
N
f640454831
f
GR
GS
[0.375 0 0 0.375 261.85226 290.07017] CT
N
f640454831
f
GR
GS
[0.375 0 0 0.375 331.14205 238.13093] CT
N
f640454831
f
GR
GS
[0.375 0 0 0.375 53.98295 166.71449] CT
N
f640454831
f
GR
GS
[0.375 0 0 0.375 123.27272 166.71449] CT
N
f640454831
f
GR
GS
[0.375 0 0 0.375 192.5625 169.89162] CT
N
f640454831
f
GR
GS
[0.375 0 0 0.375 261.85226 205.66891] CT
N
f640454831
f
GR
GS
[0.375 0 0 0.375 331.14205 218.65372] CT
N
f640454831
f
GR
GS
[0.375 0 0 0.375 53.98295 164.59351] CT
N
f640454831
f
GR
GS
[0.375 0 0 0.375 123.27272 152.02206] CT
N
f640454831
f
GR
GS
[0.375 0 0 0.375 192.5625 142.8212] CT
N
f640454831
f
GR
GS
[0.375 0 0 0.375 261.85226 146.88573] CT
N
f640454831
f
GR
GS
[0.375 0 0 0.375 331.14205 133.14521] CT
N
f640454831
f
GR
GS
[0.375 0 0 0.375 0 0] CT
1 LJ
4 LW
N
143.955 505.68 M
143.955 372.152 L
S
GR
GS
[0.375 0 0 0.375 0 0] CT
1 LJ
4 LW
N
132.406 372.152 M
155.503 372.152 L
S
GR
GS
[0.375 0 0 0.375 0 0] CT
1 LJ
4 LW
N
132.406 505.68 M
155.503 505.68 L
S
GR
GS
[0.375 0 0 0.375 0 0] CT
1 LJ
4 LW
N
328.727 456.898 M
328.727 353.886 L
S
GR
GS
[0.375 0 0 0.375 0 0] CT
1 LJ
4 LW
N
317.179 353.886 M
340.276 353.886 L
S
GR
GS
[0.375 0 0 0.375 0 0] CT
1 LJ
4 LW
N
317.179 456.898 M
340.276 456.898 L
S
GR
GS
[0.375 0 0 0.375 0 0] CT
1 LJ
4 LW
N
513.5 428.198 M
513.5 333.515 L
S
GR
GS
[0.375 0 0 0.375 0 0] CT
1 LJ
4 LW
N
501.952 333.515 M
525.048 333.515 L
S
GR
GS
[0.375 0 0 0.375 0 0] CT
1 LJ
4 LW
N
501.952 428.198 M
525.048 428.198 L
S
GR
GS
[0.375 0 0 0.375 0 0] CT
1 LJ
4 LW
N
698.273 445.441 M
698.273 337.95 L
S
GR
GS
[0.375 0 0 0.375 0 0] CT
1 LJ
4 LW
N
686.724 337.95 M
709.821 337.95 L
S
GR
GS
[0.375 0 0 0.375 0 0] CT
1 LJ
4 LW
N
686.724 445.441 M
709.821 445.441 L
S
GR
GS
[0.375 0 0 0.375 0 0] CT
1 LJ
4 LW
N
883.045 412.473 M
883.045 297.635 L
S
GR
GS
[0.375 0 0 0.375 0 0] CT
1 LJ
4 LW
N
871.497 297.635 M
894.594 297.635 L
S
GR
GS
[0.375 0 0 0.375 0 0] CT
1 LJ
4 LW
N
871.497 412.473 M
894.594 412.473 L
S
GR
%%Trailer
%%Pages: 1
%%EOF
