{"layers":[{"out_depth":1,"out_sx":28,"out_sy":28,"layer_type":"input"},{"sx":5,"sy":5,"stride":1,"in_depth":1,"out_depth":8,"out_sx":28,"out_sy":28,"layer_type":"conv","l1_decay_mul":0,"l2_decay_mul":1,"pad":2,"filters":[{"sx":5,"sy":5,"depth":1,"w":{"0":0.18017446149145158,"1":0.33974958397899885,"2":0.3393359654168729,"3":0.22387342622673848,"4":0.04838654300124149,"5":0.003676697522649004,"6":0.23245437275407882,"7":0.47999243245810636,"8":0.3817620873653344,"9":0.4876477394078399,"10":-0.20817146836152364,"11":0.04713009398385674,"12":0.29161873474078687,"13":0.44678060998293295,"14":0.1937275292567224,"15":-0.10180616358079705,"16":-0.22939089706492793,"17":-0.10080141541556538,"18":0.057951019651075374,"19":0.25973517279988395,"20":-0.2520892565321733,"21":-0.49695792270267614,"22":-0.16952712767531827,"23":-0.42841686847988947,"24":0.10118316466502156}},{"sx":5,"sy":5,"depth":1,"w":{"0":-0.03881412205944783,"1":-0.3055447110958059,"2":-0.029200987334747443,"3":-0.2086358628137972,"4":-0.09420096344346246,"5":-0.09492936731786063,"6":-0.19735380657017457,"7":-0.5379513604705983,"8":-0.09942552859390823,"9":-0.11424754670181698,"10":0.3285758008315702,"11":-0.13001768914879286,"12":-0.3778870162502742,"13":-0.4715229630637165,"14":-0.1866745571220112,"15":0.45864335078536456,"16":0.49232195381676935,"17":0.008181791904739605,"18":-0.23954833667894737,"19":-0.29154793293148445,"20":0.3371242514365525,"21":0.5892638257410351,"22":0.578694051009813,"23":0.31265194487593667,"24":0.1943362579422613}},{"sx":5,"sy":5,"depth":1,"w":{"0":0.35595008306911524,"1":0.07718625399976245,"2":0.20684300910301356,"3":-0.23239740400900658,"4":-0.32548532989415413,"5":0.18484760887203214,"6":0.045436443031128634,"7":-0.24337990970886106,"8":0.3671795863380392,"9":-0.6738142378682097,"10":-0.19625178664914825,"11":0.04828512594472833,"12":-0.7895065463744213,"13":-0.8031852585859537,"14":0.025951177426077183,"15":-0.33718812880781057,"16":-0.8366862537452776,"17":-0.14255133375493495,"18":0.20488280606009449,"19":0.2084783655571376,"20":-0.7435627815564484,"21":0.1448524950108911,"22":0.3542943167763684,"23":0.1874107962709364,"24":0.10143327081847454}},{"sx":5,"sy":5,"depth":1,"w":{"0":0.019437301127202863,"1":-0.5736680491152781,"2":0.41874557957994724,"3":-0.49243194710870847,"4":0.37401950209121265,"5":-0.2045663413951002,"6":0.030640028397778466,"7":-0.3525684061096076,"8":-0.16950788014654267,"9":0.15638752921426666,"10":0.07561035291793074,"11":-0.8695876596291091,"12":0.4651087534479258,"13":-0.5950542695278233,"14":0.07377395972569324,"15":-0.024741699288360914,"16":0.1135068400032333,"17":-0.2736158352571736,"18":-0.12408098003427404,"19":-0.331432162755205,"20":0.013937672028809087,"21":0.04007682223887814,"22":-0.3338674170848607,"23":0.22928357242808414,"24":-0.5537704641675739}},{"sx":5,"sy":5,"depth":1,"w":{"0":-0.15360344951349572,"1":-0.5367439794182313,"2":-0.059186829688413434,"3":-0.1694194272186093,"4":-0.5761499012069425,"5":-0.22102388036872092,"6":0.011779803288318307,"7":-0.5140574522925505,"8":-0.4856987067332854,"9":0.05337107224768221,"10":-0.5388836164342365,"11":0.09758193071855938,"12":-0.4738489755251891,"13":-0.3424022411420942,"14":0.39332584595877373,"15":0.06604293599593294,"16":-0.568610433448126,"17":-0.06039780111456396,"18":0.4339129746870446,"19":0.675222147235685,"20":-0.07844860435119155,"21":0.06257267902231302,"22":0.4676530760198145,"23":0.6153614401071619,"24":0.37450688073639776}},{"sx":5,"sy":5,"depth":1,"w":{"0":-0.09970830550263438,"1":0.21288735207949294,"2":0.2206118981666993,"3":0.18522668543878618,"4":0.33266697922060123,"5":0.4059581721024087,"6":0.2515736012089374,"7":0.07246988700790268,"8":-0.12051011021536097,"9":0.11939743552049568,"10":0.371472445773371,"11":0.13524906561567288,"12":-0.09724954268682261,"13":-0.418386279507553,"14":-0.4596151018811851,"15":0.2900118761550221,"16":0.29685443800090827,"17":-0.16775248222269595,"18":-0.26258186269138994,"19":-0.5463498388708761,"20":0.28513275414417455,"21":0.13268263876502953,"22":0.013728717678932375,"23":-0.45263612716563373,"24":-0.1336328601581827}},{"sx":5,"sy":5,"depth":1,"w":{"0":0.41562172966425004,"1":0.21623888662897137,"2":0.32116124491027614,"3":0.2933499461475863,"4":0.12008136616872571,"5":-0.06557736237375757,"6":0.1876711435559687,"7":0.19188114282055863,"8":0.22831084688274839,"9":0.16093560294988626,"10":-0.5406927587671968,"11":-0.3183687902217986,"12":-0.23075337401330093,"13":0.011125863801113156,"14":0.10197760784670452,"15":-0.45859615275860377,"16":-0.050746189660696175,"17":-0.020458204384075383,"18":0.07085271382842721,"19":0.22449589737137018,"20":0.38458049601703553,"21":0.26171279868717334,"22":0.04591899566190722,"23":0.004036706602452087,"24":-0.24360353836054524}},{"sx":5,"sy":5,"depth":1,"w":{"0":0.2791887118629791,"1":0.11818133001579985,"2":0.33100975423172996,"3":0.267556000024817,"4":0.032734085727903664,"5":0.10898921032339905,"6":0.04936208748531571,"7":0.2118289571043054,"8":0.21221646351828422,"9":0.2570924906432079,"10":-0.08702647891803,"11":-0.16550650693093222,"12":-0.3696158684137575,"13":0.17219075867261058,"14":0.13239368101345234,"15":-0.5464459185137908,"16":0.10956889537350656,"17":-0.8799828089431129,"18":-0.9156019099212188,"19":-0.19109344190788788,"20":0.08037528477042354,"21":-0.09141297021894389,"22":0.30313088847706293,"23":0.09789796324952557,"24":-0.6699983404030955}}],"biases":{"sx":1,"sy":1,"depth":8,"w":{"0":-0.4991207759800029,"1":-0.002610843644244101,"2":0.373201613838064,"3":0.36584679774843876,"4":0.1299037544016276,"5":-0.35514700680984557,"6":-0.5369321257122682,"7":0.12327794866047415}}},{"out_depth":8,"out_sx":28,"out_sy":28,"layer_type":"relu"},{"sx":2,"sy":2,"stride":2,"in_depth":8,"out_depth":8,"out_sx":14,"out_sy":14,"layer_type":"pool","pad":0},{"sx":5,"sy":5,"stride":1,"in_depth":8,"out_depth":18,"out_sx":14,"out_sy":14,"layer_type":"conv","l1_decay_mul":0,"l2_decay_mul":1,"pad":2,"filters":[{"sx":5,"sy":5,"depth":8,"w":{"0":-0.17450048822129174,"1":0.2669805119708937,"2":0.058079969791856506,"3":0.10471305831042274,"4":-0.08124124933326785,"5":0.11355760532391906,"6":-0.0681297111609374,"7":0.10318353906647867,"8":-0.13943840066104268,"9":0.2327420131613212,"10":0.10234393150813212,"11":0.18267615248099725,"12":-0.06714846811923936,"13":-0.025790369869220814,"14":0.061256627946759304,"15":0.33042942421984756,"16":-0.05301111504967572,"17":-0.08052261914553716,"18":0.07391532289629113,"19":0.06442326671774172,"20":0.06734446071582031,"21":-0.21564764160956146,"22":-0.08358179459503517,"23":0.18220915994627562,"24":-0.08868094083165824,"25":-0.1959478322875803,"26":0.019513953379753233,"27":0.12270625812159362,"28":-0.12828242991937594,"29":-0.17763128665304956,"30":-0.05982417020304455,"31":0.028871176854227094,"32":-0.11456850849296424,"33":-0.22147173093960001,"34":-0.002507542741514764,"35":0.10096735579095269,"36":0.014138244675907479,"37":-0.029755699467872616,"38":-0.1856520113276617,"39":-0.10585198558030448,"40":-0.21289607363344673,"41":0.2368850515222883,"42":-0.12441569539187294,"43":-0.24847794313643853,"44":-0.2309368156281521,"45":0.15564745173318076,"46":-0.15449546633538905,"47":-0.27282419594072066,"48":-0.43827646172434936,"49":0.506462264089508,"50":-0.28601258025166926,"51":0.18408599886973276,"52":-0.22790276788294492,"53":0.14779428855680984,"54":-0.242075047868324,"55":-0.27959995549479744,"56":-0.09603979709132274,"57":-0.09116665235038605,"58":0.03473256269247881,"59":0.2109058059871135,"60":0.08372406501722368,"61":-0.17586445084829977,"62":-0.2174569167036553,"63":0.07016534590796518,"64":-0.19770529349351795,"65":-0.14797643803080723,"66":0.1500175188121566,"67":0.1784273775764791,"68":0.1350077651304747,"69":-0.12443345033330898,"70":-0.22231464704302636,"71":0.07319839218748864,"72":-0.16164534619500692,"73":-0.11993144523535024,"74":0.013928267654848921,"75":0.06377538945210127,"76":-0.11619463549311577,"77":0.055302758996460005,"78":0.008014429996973362,"79":0.07673548341976441,"80":0.15103254142164174,"81":-0.23718240219474376,"82":-0.10875704352186683,"83":-0.18649304070714465,"84":-0.1800435852877138,"85":-0.12782156100959502,"86":0.3230608007705199,"87":-0.29953877186201894,"88":-0.015197387948045316,"89":0.3814017033929366,"90":-0.4742818977629639,"91":-0.07561954041826252,"92":-0.22911776805090134,"93":0.0855052619487241,"94":-0.18201813235870845,"95":-0.42879660166367334,"96":-0.4925691471696832,"97":0.2090006959682927,"98":-0.11153672803838624,"99":0.18749119068329342,"100":0.013805123026407379,"101":-0.05775420292514501,"102":-0.24523852416197478,"103":-0.2520612661299728,"104":-0.34195267223105824,"105":-0.03505625658404431,"106":0.1827110621158717,"107":-0.0030718126432539433,"108":0.10411987170028597,"109":0.015591144520418137,"110":-0.22490046498960706,"111":-0.02948794513980472,"112":-0.2835213037100052,"113":-0.04607083147686703,"114":-0.05238345437478259,"115":-0.030831021531823464,"116":0.031061925876364447,"117":-0.029992960102546116,"118":-0.004589073332556167,"119":0.0020377056541114502,"120":0.06862929688334331,"121":-0.38271349641402214,"122":-0.22082136590737803,"123":-0.11966735529585772,"124":-0.2906975532639796,"125":-0.25506078381357344,"126":0.08852519882688739,"127":-0.21705988760341322,"128":0.12384882236545375,"129":0.03329126762646203,"130":-0.32408403410588343,"131":-0.3474765155428985,"132":-0.146899818648807,"133":-0.01113705408298915,"134":-0.04954811052180118,"135":-0.12084431797855971,"136":-0.17696156034687155,"137":0.15383882086571163,"138":-0.09318621941474715,"139":-0.03213036921582444,"140":0.09128600871116857,"141":-0.0449331563796952,"142":-0.05480770312566932,"143":-0.11285032208078721,"144":-0.1872104373860911,"145":0.03915724410650775,"146":0.010085938780639844,"147":-0.0000012478111753789394,"148":0.08731700851276579,"149":-0.034948334659909965,"150":-0.09274545058675542,"151":-0.02896154253488331,"152":-0.20549151317968545,"153":0.06850158297474496,"154":-0.03805150216712024,"155":-0.01404540095459737,"156":0.008373841261879896,"157":-0.0906065457541354,"158":-0.058815232395539936,"159":-0.04064229500903867,"160":0.19054078042799139,"161":-0.36298844215208137,"162":-0.15333289300703512,"163":-0.31499014352877747,"164":-0.14803245250293715,"165":-0.0823494790281468,"166":0.28274357825139323,"167":-0.14942147998888847,"168":0.11432244772280735,"169":-0.1650105166512961,"170":-0.32855859055451325,"171":-0.32933316849773964,"172":-0.007474025428042359,"173":0.1021539012275083,"174":0.10736374145520546,"175":-0.2925722743491105,"176":0.13230353643180048,"177":0.10229649037404136,"178":-0.30294279402375085,"179":-0.1319174568076471,"180":-0.07534402215930604,"181":0.02821098522085698,"182":-0.04473209814224029,"183":-0.2922043902947026,"184":-0.042126183040530375,"185":0.15327342176127384,"186":-0.02305872381558576,"187":-0.13327168158888547,"188":-0.1126948503968398,"189":0.23083755049733967,"190":-0.0412731494513557,"191":-0.02778350894396796,"192":-0.1105350640433727,"193":-0.20047562791943188,"194":-0.06227682501723371,"195":0.01594174284820616,"196":0.057682774090307413,"197":0.15071938941328872,"198":-0.11094963327224125,"199":-0.03314716796554274}},{"sx":5,"sy":5,"depth":8,"w":{"0":-0.12210317269156966,"1":0.08107274454384654,"2":-0.055634519703026665,"3":-0.031484243559283635,"4":-0.011468159784013363,"5":0.09276092212033649,"6":-0.061035845177052954,"7":0.08165175926072434,"8":-0.036080818513346935,"9":-0.024192209889210222,"10":-0.1808874167971892,"11":-0.18709495764044415,"12":-0.18750727625421693,"13":0.14151638855074933,"14":0.06751537282255571,"15":0.07399232268725049,"16":-0.12377969567858738,"17":-0.03909678722895904,"18":0.007549259263039964,"19":-0.10598264026902916,"20":-0.0322883664013065,"21":0.1930407817947768,"22":0.14279417614104373,"23":0.07539243382670714,"24":-0.1797131688332534,"25":-0.08259872817623472,"26":0.1867390830471466,"27":0.051219724803063076,"28":0.09141135175217655,"29":-0.1470468649461637,"30":-0.30131312729958426,"31":-0.10152849121633883,"32":-0.01026229607699774,"33":-0.05913440131134926,"34":-0.11356105222491523,"35":0.05887538001599748,"36":0.10726070288840889,"37":-0.09198439404941744,"38":-0.04787660953393299,"39":0.010784767227915744,"40":0.07937054735953511,"41":-0.2599548663896475,"42":0.13518615726827962,"43":0.02987999782446842,"44":0.03844277396594549,"45":-0.3408630929106147,"46":0.10101213784920536,"47":-0.11473794717022025,"48":-0.02307284973883269,"49":0.22432075108085242,"50":0.022914613340703393,"51":-0.01010400343293294,"52":-0.018729654136442293,"53":0.01060687896480013,"54":-0.07986141859830838,"55":-0.0382684617856923,"56":-0.14714018441607554,"57":0.1493496877882834,"58":-0.09264042016417574,"59":-0.06899048291120444,"60":-0.2548958288824284,"61":0.19603062241023972,"62":-0.046142285555423976,"63":-0.1537925883854407,"64":-0.152593607837398,"65":0.0013081548753701771,"66":0.02163286040220308,"67":0.05165489470810946,"68":-0.02386894659229194,"69":-0.10460613019751998,"70":-0.047006025608624505,"71":0.028043954131633745,"72":-0.08810578121202357,"73":-0.07668842027534986,"74":-0.022923144651096346,"75":-0.018164889919564064,"76":0.13266565584477927,"77":-0.17663242625227749,"78":-0.16631398823594795,"79":0.0839466138597359,"80":-0.13888922894869254,"81":0.3499921476687489,"82":-0.08423697079401257,"83":0.017702540821746444,"84":-0.0990399104116554,"85":0.1021341481899729,"86":0.050383688941979886,"87":0.2844517702348217,"88":0.05719733947186427,"89":-0.08484301065099316,"90":-0.1464247047374025,"91":-0.011530829435495387,"92":-0.35905186935413197,"93":-0.11291144981378581,"94":0.16441099693652508,"95":0.16746210811106924,"96":-0.07702965038922423,"97":-0.1556550598074601,"98":0.015614316886988517,"99":-0.094050747069457,"100":-0.21178742115012472,"101":-0.10383110393737666,"102":-0.08270208899942913,"103":-0.007369055734569624,"104":-0.13890023288256734,"105":-0.05065672649647901,"106":0.008123403736589183,"107":0.12976664376688452,"108":0.1499106822506693,"109":0.07645498417487233,"110":-0.021199750068848208,"111":-0.06287407989301023,"112":-0.1449202491376454,"113":0.023123140643099758,"114":0.0923103525601194,"115":0.08984866376784008,"116":0.04392862769079513,"117":-0.03331109058289873,"118":-0.14743592698636246,"119":-0.028417226049642214,"120":-0.17345031505984213,"121":0.236494082847508,"122":-0.15066611716416778,"123":-0.2128573099504064,"124":-0.21320365975429564,"125":0.17028614032073108,"126":-0.17539307007198757,"127":-0.21887755816890775,"128":-0.22244546047472893,"129":0.6587878912530427,"130":-0.35470005279218847,"131":0.1103788456273433,"132":-0.6301527675212393,"133":-0.05314856688022996,"134":-0.11372986585000565,"135":-0.08012266908117502,"136":-0.15793364838326168,"137":0.3318941355325223,"138":-0.1712979951264091,"139":0.037440366174820335,"140":-0.2652249511667886,"141":0.020133151200895538,"142":0.07756966043436893,"143":0.052590022078751145,"144":-0.009181360434329846,"145":-0.12705868013199528,"146":-0.044706649565083835,"147":0.12596707634864224,"148":0.10075883083674346,"149":-0.1250233150122373,"150":0.13942097807932957,"151":0.19654808398274015,"152":0.04594049572472002,"153":-0.05145414046760147,"154":-0.0001897186606875267,"155":-0.10507374248314101,"156":0.04190191558575129,"157":-0.05786437908721277,"158":-0.08954412581463725,"159":0.00724677770894931,"160":0.08510870276652739,"161":-0.09553310822036956,"162":-0.03636609346279557,"163":-0.2994218714998739,"164":-0.23791209551173725,"165":-0.25138031702958064,"166":0.35078537611562255,"167":0.2522659811851359,"168":0.10595457111719546,"169":0.002565873576705544,"170":-0.23026968802002284,"171":-0.21966937543917867,"172":-0.20374571886539386,"173":-0.22063007208617733,"174":0.2301195975929557,"175":-0.08785185974716672,"176":-0.14368216608867618,"177":0.544089686791495,"178":-0.43726685150481864,"179":-0.13052790296328998,"180":-0.27866692319636116,"181":0.09579378123834999,"182":-0.05688046264048266,"183":-0.4071802504545992,"184":-0.11495516745558416,"185":0.44604298242670976,"186":-0.25814638761291764,"187":0.10120722241095828,"188":-0.18359104784039562,"189":0.1511967010061546,"190":-0.05522010730115431,"191":-0.17699854759957184,"192":0.007318180004060358,"193":-0.09758479814382022,"194":-0.07588751788007113,"195":0.054321619457596025,"196":0.0360822443621755,"197":0.07022321800110766,"198":0.062351011930158476,"199":-0.09004420248871842}},{"sx":5,"sy":5,"depth":8,"w":{"0":-0.0015167731597514834,"1":-0.04696418534292162,"2":-0.3569726182700175,"3":-0.19273509511635176,"4":-0.024185084791492888,"5":0.11984385961044229,"6":0.04294418329844486,"7":-0.4750751265935614,"8":0.008759761782998728,"9":-0.29743488010660935,"10":-0.21148250564918775,"11":-0.1825793448941915,"12":-0.024762384007806417,"13":0.26868483613457356,"14":0.17432234704669677,"15":-0.2709430667345057,"16":0.051450347931546396,"17":-0.2677819489750619,"18":0.050297078050618296,"19":-0.25041805214481155,"20":-0.09952968640626611,"21":0.2643997534704386,"22":0.13763364832179595,"23":-0.06987102147025936,"24":0.033394018514300614,"25":-0.19541065893714937,"26":0.17511703519449742,"27":-0.18700177424176337,"28":-0.09093148675584306,"29":0.20993536560283718,"30":0.1139568256206334,"31":0.2624226225137249,"32":-0.16933292199127484,"33":-0.1635259688434674,"34":0.26754257238981666,"35":-0.136159880682352,"36":-0.09177689257794171,"37":0.11245092291695138,"38":-0.11116578906671741,"39":0.14443743361236175,"40":0.013164976115356981,"41":0.05769592587791129,"42":-0.4864468689388749,"43":-0.4459027675502625,"44":-0.14597273248240752,"45":0.18802630910954557,"46":0.19454427581465764,"47":-0.4301179601833336,"48":0.05961986246543937,"49":-0.09130686321763054,"50":-0.020398152318477154,"51":-0.1114553960826999,"52":-0.28286651026670473,"53":0.19037327007064128,"54":-0.037325285118615166,"55":-0.18275464834340005,"56":0.06368020087392946,"57":-0.23911748454723147,"58":0.2127304655371382,"59":-0.06089944600885211,"60":-0.10023128235596179,"61":0.07524503093120914,"62":-0.048057849712964666,"63":0.11620516679308107,"64":-0.1298648086226535,"65":-0.08994555698969237,"66":0.17869100167827257,"67":0.1664813723678984,"68":-0.1318296652311046,"69":-0.019243717540722943,"70":-0.20612444860630216,"71":0.09616578924863307,"72":-0.20914321742303654,"73":0.15271948095259397,"74":0.11389727877751557,"75":0.12441911460124684,"76":0.009909831588105683,"77":-0.24240044414463338,"78":-0.31685160118955646,"79":0.1007463789974945,"80":0.06760677860579739,"81":0.0477371221268003,"82":-0.4062298019421452,"83":-0.6075156993274567,"84":-0.36004142610336726,"85":0.22672663481559263,"86":0.03669607716809164,"87":-0.28117781728571695,"88":0.011189755337977614,"89":-0.03603355661228662,"90":0.16165958214712559,"91":0.09325586648815577,"92":-0.09017450887347929,"93":0.09454120526227064,"94":-0.13032491634137444,"95":0.12023120586261406,"96":-0.14771666428408756,"97":-0.12961727674662207,"98":0.07385983143177058,"99":0.13650252070296068,"100":0.013666435831544995,"101":-0.08695207280589207,"102":-0.11527700285905486,"103":0.1361283899149661,"104":-0.25572300865280134,"105":-0.07611350502116311,"106":0.03601407540176733,"107":0.16022385605186124,"108":-0.03166002303073673,"109":-0.23007058797369637,"110":-0.1453541088614488,"111":0.1263600330075536,"112":-0.05459981017957958,"113":-0.014268866968103013,"114":0.10704406324401708,"115":0.11378125282454675,"116":-0.009923217876450289,"117":-0.14028587056539438,"118":-0.11643437012126423,"119":-0.034746113669885115,"120":0.023348310277236564,"121":0.01649316318283962,"122":-0.012761502273735187,"123":-0.3650218104490424,"124":-0.22770863600534597,"125":0.25127091048395994,"126":0.1509600722414691,"127":-0.07765403356711886,"128":-0.08214107560726788,"129":-0.12663088310708598,"130":0.2995188384808211,"131":0.1146128169954571,"132":-0.04557611684201686,"133":-0.09093957953520188,"134":-0.13769503519737195,"135":0.17274616923634115,"136":-0.10741951301107049,"137":-0.019219521154449533,"138":0.108242920553442,"139":0.249213719948978,"140":0.08731083008376575,"141":-0.1411145545168042,"142":-0.1291034346890629,"143":0.16462400467981253,"144":-0.11424510237384922,"145":0.02208828702905681,"146":-0.08517720177897008,"147":0.0691055644052354,"148":0.02176281176910125,"149":-0.1876889469200772,"150":-0.17867395971257594,"151":0.0884749800535169,"152":-0.16227920711305216,"153":-0.04651205295605383,"154":0.06896989650113215,"155":0.10402535762819375,"156":-0.05641130999079764,"157":-0.19508566097363314,"158":-0.14827064835427592,"159":0.028440138970934573,"160":-0.1916149415259593,"161":0.14414203335676387,"162":-0.1954407982130772,"163":-0.16602429480293043,"164":-0.22607327440464614,"165":0.15768636844455816,"166":0.021113852144080656,"167":-0.22232572027614497,"168":-0.1176774129533945,"169":0.05057912125995476,"170":-0.29815923234592745,"171":0.10697943174078058,"172":-0.1541718834410087,"173":-0.03840585260923598,"174":-0.05890377462451341,"175":-0.08040381573882846,"176":-0.16843548078408985,"177":-0.05785231828614807,"178":-0.16514813556849323,"179":0.06765539554261989,"180":-0.19594565481140025,"181":-0.0947163222328942,"182":-0.15779954051377124,"183":0.0012501113100812297,"184":-0.1285287953680538,"185":-0.15490027009381976,"186":-0.14069064624801506,"187":0.04030653703309432,"188":-0.16433852810634159,"189":-0.1254380573128735,"190":-0.19878584358432008,"191":-0.002617139108174023,"192":-0.21653088727090455,"193":-0.07749660655146719,"194":-0.06741429737949228,"195":0.09561356501069304,"196":-0.09252977967197533,"197":-0.06043672649273502,"198":-0.19150680252835248,"199":-0.11557274591746157}},{"sx":5,"sy":5,"depth":8,"w":{"0":-0.09944370194834841,"1":0.09264777015971751,"2":0.1469121098917388,"3":-0.06186361657816194,"4":-0.09246497576201407,"5":0.15837357919503212,"6":-0.06489354022991865,"7":-0.026905775954368962,"8":0.14620768807657558,"9":-0.2005768097752602,"10":-0.33669776066615137,"11":0.014532792490137239,"12":-0.06533746978788547,"13":0.10376068334388977,"14":0.1629810291185114,"15":-0.11912861195425348,"16":0.33725588599651374,"17":-0.12189719513976853,"18":-0.5441501507944569,"19":-0.1611296736341997,"20":-0.18409661681880626,"21":-0.22724734512653783,"22":0.1351932767106361,"23":-0.391534886422091,"24":-0.00608098213916343,"25":0.21102169235602025,"26":-0.18340468721538045,"27":-0.2263422901799749,"28":-0.20512676372012678,"29":0.23933733762951798,"30":0.023878759066294587,"31":-0.3097864387606461,"32":-0.5470278724346122,"33":0.2640439813627259,"34":0.05825313722621439,"35":0.35578009896701623,"36":-0.09293639358551156,"37":0.06609428618029553,"38":-0.30727427060399454,"39":-0.4966552821832956,"40":-0.13775428787268615,"41":-0.07567216014187063,"42":0.12319275410275841,"43":-0.04985827693300926,"44":-0.01510647395814754,"45":0.15326666947229944,"46":-0.008210883057276299,"47":0.07351315956791825,"48":-0.06097262686380235,"49":-0.07243735434003919,"50":-0.05968243177403211,"51":0.09293780603207064,"52":-0.2538926652599301,"53":0.1338730912517974,"54":0.07188656477591537,"55":0.027790349643391894,"56":0.2769125912760896,"57":-0.33325998393380385,"58":-0.2537978750728416,"59":0.016876797866582218,"60":-0.12199636068655036,"61":-0.37716780141282297,"62":0.1068583208070357,"63":0.08161172471928527,"64":0.28141409327865713,"65":0.11134697917864948,"66":-0.12792438190032818,"67":-0.23318144115953512,"68":-0.22784161648626738,"69":0.03175879742371375,"70":0.014579120237649299,"71":-0.19778150972582323,"72":-0.21982764341038485,"73":0.28092064477299666,"74":-0.1508351163874486,"75":-0.034229158808572475,"76":-0.08909000565485226,"77":0.027713798663135576,"78":-0.1599698069870867,"79":-0.3533373199472112,"80":-0.16862188267544304,"81":-0.1722749710975132,"82":0.2833711514815589,"83":-0.029597743200886907,"84":0.11346269325608879,"85":-0.04565322547003982,"86":-0.018715420925427655,"87":-0.024043425405810243,"88":-0.2049239010066053,"89":-0.050072120296804946,"90":-0.02702339037180532,"91":0.2752008367546578,"92":-0.2688401721411968,"93":0.10399982230653108,"94":-0.3033658979625092,"95":-0.11956409222149236,"96":0.16135721468002384,"97":-0.11592551015250895,"98":-0.18246476166567194,"99":0.14694150224111213,"100":-0.3490036611726085,"101":-0.09975868569050603,"102":0.1234262405588823,"103":0.21934531682823485,"104":0.2006315900024795,"105":-0.2359507034720114,"106":-0.04612704625623283,"107":-0.1603634947851674,"108":-0.14824670971450504,"109":-0.3165417803294164,"110":0.0747092586941344,"111":0.06244518214743257,"112":0.130137288185967,"113":-0.00782493510554516,"114":-0.02042078271614049,"115":-0.12267906225562493,"116":-0.08591071052735728,"117":-0.07869037344774862,"118":0.022769601183320554,"119":-0.06195123167059582,"120":-0.1097260685474152,"121":-0.13916002729066887,"122":0.04275810576547195,"123":0.0011552474307618787,"124":-0.008987916118318224,"125":-0.012441783715134826,"126":-0.019643069637303754,"127":-0.03336524610988078,"128":-0.36702318703614506,"129":-0.029013959842327703,"130":0.19880777106003636,"131":0.13585694081813302,"132":-0.10376589681356053,"133":-0.01743608312576324,"134":-0.49293411899367706,"135":-0.09140965586748691,"136":-0.23701650512317998,"137":0.04973658346247176,"138":-0.07980107527491943,"139":0.36432369492777916,"140":-0.31332309502362843,"141":0.07043935187405291,"142":-0.1415640960254516,"143":0.07506944585209901,"144":0.22775022239583467,"145":-0.12440230424303558,"146":-0.18331692082532558,"147":0.04804662137936291,"148":-0.1591021988191534,"149":-0.1611931177812364,"150":0.04481065916634976,"151":0.14141630413552597,"152":0.23097485546859597,"153":-0.2116349786100419,"154":-0.019926323069470623,"155":-0.1510460936063708,"156":-0.1715757039931363,"157":0.057142530256022485,"158":0.19154221185975365,"159":0.25208217366993624,"160":-0.0563474064762795,"161":0.006299401677773374,"162":0.10003380407476427,"163":0.06085913511373804,"164":-0.17695400497495914,"165":0.05369294095003406,"166":-0.003960132699397906,"167":0.035767220370680856,"168":-0.46907003097215577,"169":0.10819656630133384,"170":0.07893035588998627,"171":0.23451155747481625,"172":-0.019834056873797717,"173":0.12660737611012238,"174":-0.23196156367523227,"175":-0.08616531510132848,"176":-0.4157441081418458,"177":-0.11298325087550067,"178":0.06601907088395013,"179":0.16033448642857298,"180":0.045608152290486176,"181":-0.07888017390680821,"182":-0.3100774476935921,"183":0.01892079143045205,"184":-0.2080623017239748,"185":-0.009522832174979736,"186":0.09195088670452906,"187":0.28722485033134143,"188":-0.13209574464528576,"189":-0.154899604941515,"190":-0.18314246037542023,"191":0.00798524960147269,"192":0.0052544922395518,"193":-0.015810195556024403,"194":0.13965180889879594,"195":0.12213889992788089,"196":-0.07081600744978761,"197":-0.09236998166543602,"198":0.10118901772627155,"199":0.0691772910944633}},{"sx":5,"sy":5,"depth":8,"w":{"0":0.0328484555148707,"1":0.0603191343738094,"2":0.009729749441079856,"3":-0.10688967047879853,"4":0.07071765679716506,"5":-0.00989805851446601,"6":0.012516576541548611,"7":0.07174359179124833,"8":0.06738771930924176,"9":0.15324799827817537,"10":-0.04770092661655179,"11":-0.10287103374931883,"12":0.16276470830821962,"13":-0.22793049121005515,"14":0.08061483803029644,"15":-0.043465154480652135,"16":0.09677901355021601,"17":0.11458880244257277,"18":-0.055917797773043704,"19":-0.09416775646676193,"20":-0.007478090072541551,"21":-0.07445614256158208,"22":0.015655151780453163,"23":-0.034357891054844665,"24":0.127433881288332,"25":-0.10213217962424792,"26":0.06298387046961891,"27":-0.16519736347428846,"28":-0.054696934787557494,"29":-0.015490479806894015,"30":-0.012153721586566794,"31":-0.14024015529635012,"32":0.07617588263923986,"33":-0.14271310696145167,"34":0.034746048108894506,"35":-0.09294165197096649,"36":-0.01430105830315727,"37":-0.1183565276772624,"38":-0.1497939027307458,"39":0.025808202039199778,"40":0.10681276916039661,"41":-0.051803275004747996,"42":-0.08610582829043606,"43":0.05596442189761497,"44":-0.09320652226654165,"45":-0.12840091812237897,"46":-0.0044939714007558905,"47":0.2056172867813923,"48":-0.030386138096611573,"49":-0.19419499442013757,"50":-0.13276285964615542,"51":-0.10103485220842712,"52":-0.16770750664377873,"53":0.035367610728262375,"54":0.11226895990632325,"55":0.12363672176572967,"56":0.10269567824824263,"57":-0.18729233678887938,"58":-0.006626779201447533,"59":-0.20655236648374578,"60":-0.18611541396705028,"61":0.14939325979010726,"62":0.22004100382964079,"63":-0.00812669632179177,"64":0.18939363923483896,"65":-0.08143681256859255,"66":0.013651945427867887,"67":0.0009380097054051246,"68":-0.10789402690332364,"69":0.194998446648558,"70":0.12150095051274123,"71":0.04744387238875082,"72":0.14343877471455807,"73":-0.13104407502744866,"74":0.10726873149883512,"75":-0.0039364634329370355,"76":-0.08130968642103648,"77":0.17233469180448066,"78":-0.03711426344324627,"79":0.1754924331367855,"80":0.036423139487834495,"81":0.023592277641339057,"82":0.06022699810735907,"83":-0.049080539937188056,"84":0.002785623512175154,"85":-0.14883501932872778,"86":-0.05948936460846542,"87":-0.05068475060138753,"88":-0.13116170951698342,"89":-0.09423278718709542,"90":0.0065861543450442,"91":-0.11870120968026444,"92":-0.072874132913067,"93":0.04431564885039925,"94":-0.07540176436067916,"95":-0.09816690261836339,"96":-0.10207172098294853,"97":-0.05941308115669229,"98":-0.019926743030763645,"99":-0.011386591213850134,"100":-0.14213625276600483,"101":-0.004610131005495296,"102":0.06579999919273893,"103":0.03110616152249429,"104":-0.02872451163393122,"105":-0.17308023581489917,"106":-0.030661053449482622,"107":-0.09755218818087724,"108":-0.13908015421523073,"109":-0.06404229079906917,"110":0.026286895002033586,"111":0.020870642567053368,"112":-0.11589748473264508,"113":-0.04999125547195159,"114":-0.031173806115258957,"115":0.03659294342346631,"116":-0.12769821722857408,"117":-0.0926610634274553,"118":0.053583576361717324,"119":0.06288892942726013,"120":-0.15377824737450457,"121":-0.09031809348530469,"122":-0.011654394911110597,"123":-0.04247602053598873,"124":-0.013339875482940773,"125":-0.08793868622965562,"126":-0.16606944465751494,"127":-0.09807899265504881,"128":-0.1215155451835438,"129":-0.04055483168686186,"130":0.030188210882659227,"131":0.15936776219070853,"132":0.11974389994254431,"133":-0.1644242789051643,"134":-0.0413992697745338,"135":-0.05687452585207014,"136":-0.04349225560002315,"137":-0.007506417658196093,"138":-0.031087522189152846,"139":-0.0316344253270562,"140":-0.04706408645549173,"141":-0.059944376805481314,"142":-0.10428010243660867,"143":-0.01745126730628447,"144":-0.06848858306268407,"145":-0.1033445093840118,"146":0.05103308579604539,"147":-0.069968190770825,"148":0.03646486161460354,"149":-0.10216886946435509,"150":-0.03689160574444668,"151":-0.10972626966046216,"152":-0.06431298330584893,"153":0.0036591544211703577,"154":-0.0845392577210339,"155":-0.0754936771603831,"156":-0.026807526818620163,"157":-0.141959077247118,"158":-0.07318454269511476,"159":-0.1343353664979741,"160":-0.0861685556628993,"161":-0.13205201771235184,"162":-0.0022276222412833976,"163":0.05043473416935802,"164":0.10777413096352374,"165":-0.06851627514453953,"166":-0.17208508376860895,"167":0.038787266375853495,"168":-0.02841380304613522,"169":-0.05815465027136668,"170":-0.04401057506292024,"171":0.00244705145920395,"172":-0.14960082660989285,"173":-0.022907620598292246,"174":-0.04210501954885459,"175":-0.02098165543092207,"176":-0.009885388890670694,"177":-0.10438057766705273,"178":-0.031029857263202794,"179":-0.03756432893943336,"180":0.08399938519598656,"181":0.03288069463987817,"182":-0.030398333922082004,"183":0.03806749396950717,"184":-0.10065877962774271,"185":-0.09302809223679984,"186":0.020659132366913625,"187":0.03816342603664933,"188":0.08714795603707665,"189":0.08787212658457287,"190":-0.03791859417475401,"191":-0.09753622546006141,"192":0.031782258738131716,"193":-0.16490462302965533,"194":-0.05954647448772435,"195":-0.12679813902714387,"196":0.01559626936379448,"197":-0.029213529873941466,"198":-0.10981808649291466,"199":-0.059420127888772656}},{"sx":5,"sy":5,"depth":8,"w":{"0":0.049286849243946065,"1":-0.11269278368733844,"2":0.08070798005615874,"3":0.13853636053611185,"4":0.09115405508349807,"5":-0.062064605380397334,"6":0.010706321381577835,"7":0.3381678536234325,"8":0.23808881496641604,"9":-0.2942148375699915,"10":0.00956189677800766,"11":0.1688601845818892,"12":0.29063680100543604,"13":-0.539844284714854,"14":0.08747023726105325,"15":-0.051145731433520344,"16":0.21015863758605363,"17":-0.0011546433134676116,"18":-0.3803682135312197,"19":-0.19130259780306924,"20":-0.09814244947062874,"21":0.057718205372339564,"22":0.06219777725919905,"23":-0.29810388653415254,"24":-0.07412409070297396,"25":0.3674079150456656,"26":-0.40200166856901093,"27":0.08360339771182115,"28":-0.7574982407238384,"29":0.27732879645751335,"30":-0.04988415501434917,"31":-0.4660375491221767,"32":-0.39019680987367644,"33":0.06421876750093786,"34":-0.0227854978442023,"35":0.3193910449807668,"36":0.0022863824278782207,"37":0.0845032286142379,"38":-0.3238610409815936,"39":0.03623858825908592,"40":-0.2675593740034027,"41":0.33924803289020006,"42":0.09770465953554683,"43":0.10122455056634605,"44":0.25674025988452115,"45":-0.35599105856749497,"46":-0.21238003259406546,"47":-0.0152719822766474,"48":0.010835644111491526,"49":-0.26035956582319786,"50":-0.1518631873421601,"51":-0.03638458147850215,"52":0.20335077214892733,"53":-0.28992413503575165,"54":0.1598216039620479,"55":-0.170742555458406,"56":0.22276338266338952,"57":-0.19458622896422262,"58":-0.3478744656430268,"59":-0.2201676559266966,"60":-0.04289778138249521,"61":0.06641136893877238,"62":0.18099538446885258,"63":-0.2823589850527682,"64":-0.028942245357431094,"65":-0.02552553520574755,"66":-0.007356905158652804,"67":-0.11626276990101658,"68":-0.33116059901987116,"69":0.05919675750745806,"70":-0.0891090083357746,"71":-0.07241572215876568,"72":-0.3341462723407283,"73":0.023232541348967014,"74":0.24746701250516473,"75":0.22083362182944402,"76":-0.15272202035537322,"77":-0.01416273505854622,"78":-0.3545263569631451,"79":0.15828477598907414,"80":0.029726643898608542,"81":0.20556715387235247,"82":-0.09800832439342777,"83":0.08169635809317215,"84":0.11198134750241828,"85":-0.38725176062600253,"86":-0.15051510903980075,"87":0.09169708203610409,"88":0.15882926870634576,"89":-0.3347389498610963,"90":-0.24717349255549625,"91":-0.2338493860821562,"92":0.12078825974862831,"93":-0.1248453896809021,"94":0.011953313377668112,"95":-0.21843947908878736,"96":-0.10119805000804746,"97":-0.21771422904346616,"98":-0.07504027000613046,"99":-0.419571377826041,"100":-0.1329357772255484,"101":0.16910941965623558,"102":0.07648044383508873,"103":-0.1414275330340828,"104":0.02098102150748412,"105":-0.21682394487101508,"106":0.2047206147222559,"107":-0.02769045700614662,"108":-0.13269975133732848,"109":-0.1261265942968527,"110":-0.0707474433712526,"111":0.14633836621044907,"112":-0.12006269412358947,"113":0.10993491062618126,"114":0.3077720902741443,"115":0.3313916637321885,"116":0.1063509946173927,"117":-0.3319954504794139,"118":-0.2300686900938454,"119":-0.026579114381502737,"120":0.03995838849113192,"121":-0.28089805915437854,"122":0.059590010507645355,"123":-0.12819413280616224,"124":-0.040900722890510624,"125":-0.010561042817935434,"126":-0.13901078533457756,"127":0.10453685566818893,"128":-0.005145841943602972,"129":-0.542635058549578,"130":-0.027974351499582387,"131":-0.4880432025847577,"132":0.0419641099672717,"133":-0.043931112241909494,"134":-0.0260227724276162,"135":0.05100121221254276,"136":-0.0361764550820649,"137":-0.17464108593021152,"138":0.08944005757620381,"139":-0.08491885676560933,"140":-0.16153699507909844,"141":0.023353825256794497,"142":-0.04244701560162267,"143":-0.12349574235647018,"144":0.049225104874731675,"145":-0.11997175253692095,"146":0.02414402155036355,"147":0.03885822376086718,"148":-0.0001843964332543266,"149":-0.06715441099058361,"150":0.026956417088516465,"151":-0.04208755555469661,"152":0.15394783517132246,"153":-0.13979459172173597,"154":-0.14875602819568542,"155":0.04358371252754209,"156":0.10720875906370538,"157":-0.20693520979870753,"158":0.09986604108312831,"159":-0.1648738500254725,"160":-0.08181125906812617,"161":0.0665711865026479,"162":0.3017336411784278,"163":-0.00714402440530938,"164":-0.017872612754196854,"165":0.04577709165968424,"166":-0.16539062919882588,"167":0.1302574427880375,"168":0.02762427900522295,"169":-0.3925872439708184,"170":0.017665037756750008,"171":-0.1994730211618885,"172":0.05752791402274425,"173":-0.2872483686796398,"174":-0.02229913980293133,"175":-0.16933413781289683,"176":-0.0017897543882968575,"177":-0.13590297313872785,"178":-0.1404923468089727,"179":-0.06379158407878867,"180":0.05255113126137445,"181":-0.04389216134425881,"182":0.24823901187248865,"183":-0.3647684371927138,"184":-0.006026931971375934,"185":0.20625256986297877,"186":-0.2607158290468357,"187":0.006366326916519008,"188":-0.011445817080310517,"189":0.13198823047111696,"190":0.06783345046823999,"191":-0.23034627962393536,"192":0.1316900640773872,"193":0.18463988490110744,"194":-0.17816741475930323,"195":-0.18763592750062824,"196":0.09277792648017562,"197":-0.03779940580762595,"198":0.22614182927407817,"199":-0.22255551588807576}},{"sx":5,"sy":5,"depth":8,"w":{"0":-0.03142144007394705,"1":0.07412270022939497,"2":-0.24639205816052084,"3":-0.05956492824820309,"4":-0.17085937789069794,"5":0.18389737233854567,"6":0.041715086580439084,"7":0.05292011908383932,"8":0.1326895636975103,"9":-0.23756576221147513,"10":-0.27213426498095866,"11":-0.05821635132847636,"12":-0.11645652641781193,"13":0.194700067164483,"14":0.3034165263039194,"15":0.06437885959812452,"16":0.14755632958884476,"17":-0.2417195844561342,"18":-0.25303464522068975,"19":-0.3688608990689374,"20":0.014348245226073494,"21":0.2761415132668957,"22":0.29118897345742756,"23":0.11638183205080789,"24":0.09920140165997565,"25":-0.25661922974205764,"26":-0.11529922489004846,"27":-0.1030156713614969,"28":-0.08500493350516097,"29":0.16422169409903847,"30":0.24694992150355619,"31":-0.050319281766239156,"32":0.06179511191187655,"33":-0.09703751405333234,"34":-0.10102022698711406,"35":-0.13045880196485898,"36":-0.19218801497057628,"37":0.06697627962069232,"38":0.207532626605085,"39":-0.06246775983567752,"40":-0.08626301219417849,"41":0.08595327264107276,"42":-0.07231199739749246,"43":-0.09465996730565163,"44":0.0521589233155599,"45":0.09294734905415138,"46":-0.003720144770669065,"47":-0.12448970747480614,"48":-0.25695952878849393,"49":0.06923795677033706,"50":0.011977779882122992,"51":0.20644488581612597,"52":-0.2308512407025665,"53":0.0458151722232484,"54":-0.15601401793019395,"55":0.1181958947728198,"56":0.006066178453570834,"57":-0.15996548000639005,"58":-0.15959557204815955,"59":-0.030078952877252912,"60":0.023613437885941467,"61":-0.1572060304938444,"62":0.03376864164790731,"63":-0.007258112178535126,"64":0.07446003342822485,"65":-0.06476765923646334,"66":-0.02100076455320575,"67":-0.025771621807841177,"68":-0.06152607456920401,"69":-0.11085127825216662,"70":0.02177525724825683,"71":-0.16789993700822306,"72":-0.07049380654601721,"73":-0.1276168806904873,"74":-0.2533085879505507,"75":-0.22172776768139354,"76":-0.16107583667192057,"77":-0.1298081166762963,"78":-0.005942041794179104,"79":-0.21925863137050106,"80":-0.15621850743428395,"81":0.08688481438415274,"82":-0.024597769453828456,"83":-0.08476278932564818,"84":-0.03728961865756687,"85":0.18848726856413958,"86":0.021799800930243026,"87":-0.13390145193248404,"88":-0.1813913420383064,"89":0.09413366431719897,"90":0.04024915891694841,"91":0.09130910560953595,"92":-0.21601662047711284,"93":-0.07877831527956729,"94":-0.3208779893767157,"95":-0.07618707478723259,"96":0.02687774825977984,"97":-0.1243583594493641,"98":0.03266489047772723,"99":0.13565633033792823,"100":-0.15277403286243607,"101":-0.11267617964646547,"102":-0.13168432802606925,"103":-0.027858253564607013,"104":0.13723184700594385,"105":-0.13077664278399456,"106":-0.058183905241741114,"107":0.010106719838903091,"108":-0.15553602626457866,"109":-0.2563972168890531,"110":0.031073096087843498,"111":-0.10466193997140684,"112":-0.012971225384003736,"113":-0.019395910447063874,"114":-0.1395437989388288,"115":-0.1022309127308388,"116":0.037593201104179214,"117":0.07729265105546872,"118":0.0911874002632958,"119":-0.06619642093791117,"120":-0.07555455771387741,"121":-0.16309911257967444,"122":0.177726343659062,"123":-0.0776885502061379,"124":-0.11023726486565083,"125":0.1895350143752218,"126":-0.030759796337804988,"127":0.13135508361955783,"128":-0.18329936953548584,"129":-0.323321734611061,"130":0.06564637074426513,"131":0.006538946584707766,"132":-0.1129487761808117,"133":-0.09491797869945968,"134":-0.18180810292807226,"135":0.11290220301926476,"136":-0.07097932057440708,"137":0.011986544603447719,"138":0.018063874781235802,"139":0.15109121947751808,"140":-0.05027891642826993,"141":0.04376799571758659,"142":-0.18989523195331512,"143":0.012508597568209927,"144":-0.005788899093197827,"145":-0.06710290802701574,"146":-0.1147656600867363,"147":-0.02233631003617032,"148":-0.10030608221769717,"149":0.02896941329563774,"150":0.03848591205255366,"151":0.13413665964933022,"152":0.12984500240489888,"153":-0.12728726853184666,"154":-0.13808181914043374,"155":-0.07811455239818213,"156":-0.020657634026528024,"157":-0.09809732730290516,"158":0.06060879531549894,"159":-0.0012453741387917837,"160":-0.15436211526748206,"161":0.02572332686381472,"162":-0.11011543347612004,"163":0.0028670627958590406,"164":-0.03359837222140769,"165":-0.017250101631531217,"166":-0.11810110488911604,"167":-0.0695079386856858,"168":-0.2806714551283516,"169":-0.04679528655665872,"170":-0.08239496428465476,"171":0.08113164235527875,"172":-0.044416028487262504,"173":0.016781620014681867,"174":-0.10077288734475356,"175":0.08861432103536011,"176":-0.22315621941152256,"177":-0.046858573352703665,"178":0.003243550069707774,"179":0.1515859922926879,"180":-0.21523720007165267,"181":-0.06930390475444535,"182":-0.17547343681476585,"183":0.05236507882178984,"184":-0.052122861976777686,"185":-0.10053381315978847,"186":-0.09266756400426283,"187":0.10579530321403732,"188":-0.018371397558441145,"189":-0.05427011171817317,"190":-0.0666869007470038,"191":0.0803443345795152,"192":0.21647058239146813,"193":-0.10387018767178124,"194":-0.23667353412440542,"195":-0.100496124348856,"196":-0.044924380110680555,"197":-0.10592127737129639,"198":0.14680379993822257,"199":0.06562982339417847}},{"sx":5,"sy":5,"depth":8,"w":{"0":0.07460164078834781,"1":-0.10430726303430699,"2":-0.0722619310050629,"3":-0.15751960379939867,"4":0.12539449910951977,"5":0.20258201999519254,"6":0.13343123202769885,"7":-0.1925269647798408,"8":-0.0003588611430218864,"9":0.1270789647848924,"10":-0.0812615274902454,"11":-0.56222196434858,"12":-0.04402189865447024,"13":0.061540523719015965,"14":0.023648562084751305,"15":-0.29405160548793613,"16":-0.12078911440326379,"17":0.20303628534466478,"18":-0.2317224643894049,"19":-0.2058727834100135,"20":-0.08310125433327756,"21":0.055849283758072625,"22":-0.010268993215960535,"23":-0.16962248717459838,"24":-0.014853134916896885,"25":-0.0744149681282111,"26":-0.034182930546705154,"27":-0.5275015035608653,"28":0.2698359105044448,"29":-0.1160532480566942,"30":0.016533425231977872,"31":-0.24354480761468594,"32":0.13969359883266855,"33":-0.003100473534473183,"34":-0.2978348882867347,"35":-0.3500899039693423,"36":0.05009367814820239,"37":-0.04030869017353237,"38":0.13792104901890453,"39":-0.4209272326809246,"40":0.09923340395408409,"41":-0.02927802567240026,"42":-0.054481363243599513,"43":-0.05658209406883727,"44":-0.16744390274634244,"45":0.03265668521550755,"46":0.08072179287030419,"47":-0.15526568661429183,"48":0.09728421030436261,"49":0.012830138181904684,"50":-0.30836562095420683,"51":-0.37829122246758523,"52":-0.17428587261918715,"53":0.15572793693619752,"54":0.0024919137967795825,"55":-0.09128679674847805,"56":-0.0636604455970435,"57":0.11871027639383049,"58":-0.12445002757970144,"59":-0.24968613421563665,"60":-0.2397920736333522,"61":0.18880371727156475,"62":0.10589821447136497,"63":0.17663039310201906,"64":0.12988085848180486,"65":-0.24481466665232826,"66":-0.12881133278393683,"67":-0.3442006441549555,"68":-0.2123385395215353,"69":-0.07156072679836165,"70":0.22534011379080765,"71":0.08630393012486953,"72":-0.0027783510579618416,"73":-0.23389855566859316,"74":0.1570341935622983,"75":-0.42737346876408383,"76":-0.31389714112461176,"77":0.0948989830949938,"78":0.11427609759212637,"79":0.10331006503327546,"80":0.13534055145172882,"81":-0.10222469651503947,"82":-0.1063569679296558,"83":0.09226138234521215,"84":-0.4232111686313652,"85":0.10045337925192306,"86":0.08336070277810508,"87":0.21613467693696636,"88":0.13756092655665586,"89":-0.2750884211999419,"90":-0.17654482605013172,"91":-0.06636167835675444,"92":-0.1918041902730687,"93":-0.16796011466392533,"94":-0.08425816119896931,"95":-0.042999885673557635,"96":-0.011234950006407184,"97":0.4610740826716319,"98":-0.2058920937350809,"99":-0.2709307136584853,"100":-0.09679321424739341,"101":0.052810244704126534,"102":-0.09964467050605268,"103":-0.19071343189877762,"104":-0.2852219817907051,"105":0.483112055047104,"106":-0.15592486164129313,"107":-0.5191775108370188,"108":-0.05181001587646928,"109":0.12908084997040556,"110":0.017247623147920443,"111":-0.16003041770650306,"112":-0.1298654119468685,"113":0.11034567700311125,"114":0.0080412251281438,"115":-0.2788242188106645,"116":-0.27768009808962457,"117":0.025608426773391497,"118":0.13479498155404487,"119":-0.06466877683090552,"120":-0.13449179814422538,"121":0.10523491244631555,"122":0.07305255753027108,"123":0.1400338726872473,"124":-0.06192216284203524,"125":0.08212255741770852,"126":-0.14405211987875743,"127":0.06948090298699908,"128":0.28676852773790507,"129":-0.029065918113088524,"130":-0.4257961690485736,"131":0.21624432144712757,"132":-0.35874312149952253,"133":-0.09419896330254596,"134":0.0851687945762659,"135":0.3009793980306182,"136":0.2058282308207372,"137":-0.2865777359623691,"138":-0.4156024553751142,"139":-0.2934902338470916,"140":-0.054576381197030496,"141":-0.22329039371942372,"142":0.047074409727281295,"143":0.04116041850221933,"144":0.09114850910686909,"145":-0.08794878442083232,"146":-0.1612892045895213,"147":-0.5844560957812505,"148":-0.0687222142183005,"149":0.12182938676798864,"150":-0.08385107495032518,"151":-0.07383882699848732,"152":-0.18981141528980341,"153":-0.04898968314572519,"154":0.11675945507272996,"155":-0.2539154081387514,"156":-0.14175543858939463,"157":0.15303465154677684,"158":-0.1035011313292989,"159":0.021175633432365535,"160":-0.2724342505640671,"161":0.09139258081952505,"162":0.36392754726839793,"163":0.19333921101019955,"164":0.16998124734727346,"165":0.0009654211953315961,"166":-0.31504245389830104,"167":0.03622922577777025,"168":-0.13630650524635848,"169":0.23168926042716625,"170":-0.07107761861270007,"171":0.10201777458794627,"172":0.002647293781191974,"173":-0.02381398130241579,"174":-0.2433343140976887,"175":0.06317956573743674,"176":0.10140681528217622,"177":0.15260219798102032,"178":-0.12070612578850731,"179":-0.1865987521108394,"180":-0.05207068350770651,"181":0.09189925433324386,"182":0.0196553244511927,"183":-0.055554111774072795,"184":0.13486201050972416,"185":-0.263300071670539,"186":0.1303841961908251,"187":-0.027286913347650765,"188":-0.0541871189016197,"189":-0.07089417614541414,"190":0.08224770509722662,"191":0.09959386738551111,"192":-0.008835656855361772,"193":-0.014286684279105639,"194":0.22778578426986265,"195":-0.019458052645659626,"196":-0.06042922342295683,"197":0.10199194394923515,"198":0.05997875813525604,"199":0.1781358688351488}},{"sx":5,"sy":5,"depth":8,"w":{"0":0.043573843230448085,"1":-0.11010012515422964,"2":-0.009495064791824279,"3":-0.05326313325830342,"4":0.03726127316619565,"5":-0.10416777787524857,"6":-0.03846501427085822,"7":0.09001139883457984,"8":0.06770178869018624,"9":0.010154235654940726,"10":-0.06611509653227052,"11":0.010308539733782906,"12":0.0650282083441588,"13":-0.16964556991668306,"14":-0.11051926242208183,"15":-0.043123530630473195,"16":-0.014294908152071548,"17":-0.0820794524670635,"18":0.04559259586013485,"19":0.022802747674901036,"20":0.11200564119154975,"21":-0.124868515983325,"22":-0.07393776451082294,"23":0.0050271332285076,"24":-0.07850067976562822,"25":-0.022841820864977984,"26":-0.08434307451528637,"27":0.03919487475999237,"28":-0.16410733533910302,"29":-0.13592543625061757,"30":-0.02604555929263426,"31":-0.08241624370552414,"32":0.07171446650925727,"33":-0.0602149139656165,"34":-0.12920386023754085,"35":-0.02556701556024833,"36":0.09512050969509944,"37":0.008832208120129978,"38":-0.021497573567723492,"39":-0.12456247142653028,"40":-0.06657642183764595,"41":0.014829186271758478,"42":-0.09459013116552828,"43":0.05257928662979424,"44":-0.08030117126734988,"45":-0.08237297936044613,"46":-0.046498256740346515,"47":-0.035782392612187776,"48":-0.18105769543033576,"49":-0.15678723309176612,"50":0.09561584587738316,"51":-0.11474668377581623,"52":0.013057291926440728,"53":-0.04945457667510541,"54":-0.04504624447064658,"55":0.008513001887388863,"56":0.04884882615210932,"57":-0.09401718698283151,"58":-0.10049860460813888,"59":-0.03193092134894404,"60":0.16943341188910213,"61":-0.08887071056167418,"62":0.03579828279570488,"63":0.07699666724974376,"64":-0.008163795443949701,"65":-0.09365425152797731,"66":0.021255681376103047,"67":0.051013950887999635,"68":-0.0069775249798678446,"69":-0.017736490075392693,"70":0.011333602236149331,"71":-0.09931450055359016,"72":0.06372498816192912,"73":0.03118574301399322,"74":-0.05778209592464462,"75":0.1088244256290135,"76":-0.057154891105844284,"77":-0.15680264830728555,"78":-0.004728997083530434,"79":-0.0527033421260851,"80":-0.05082918827316208,"81":0.008771749585382975,"82":-0.06715342077922791,"83":-0.07585539110812849,"84":-0.07120388401859863,"85":0.010525583916386404,"86":-0.029013203733413918,"87":-0.042025592172886615,"88":0.02775077502015057,"89":-0.011313392017544282,"90":-0.08376245045030342,"91":0.017914741885875104,"92":0.03982189358516853,"93":-0.01125691312643166,"94":0.07302915075691949,"95":0.1082339532286415,"96":-0.09985267865690703,"97":0.004787499203788295,"98":0.021606156410756267,"99":-0.08265050177178922,"100":-0.017822894530525612,"101":-0.04094911264284454,"102":0.056344149425872535,"103":-0.08835959367423518,"104":-0.008617743604669935,"105":0.0821091478967772,"106":-0.05426015723299589,"107":-0.013123768839508181,"108":-0.05892643367297133,"109":-0.1540233620808924,"110":-0.09282816794619393,"111":-0.1377612160764715,"112":-0.08939426710969335,"113":0.06835967840438759,"114":0.05270832726283741,"115":0.08319511169754433,"116":-0.047069260840487605,"117":0.0028717724121537897,"118":-0.019729662013029968,"119":0.04704880343156687,"120":0.018460014124756726,"121":0.054420129423713964,"122":-0.020943150370396645,"123":0.017581740891698377,"124":-0.04193952560682414,"125":0.02858744800275963,"126":0.009241582338498476,"127":0.06995600962839572,"128":0.08191970897431429,"129":0.08483088154578802,"130":-0.10026231857326125,"131":-0.007272737266592898,"132":-0.026038380916663564,"133":-0.11978132077988107,"134":0.03311202771641364,"135":-0.04307742008490039,"136":-0.042392607491973336,"137":-0.039191569629235264,"138":-0.03589712078422403,"139":-0.0647598099613868,"140":-0.005529427375822402,"141":0.02720488981675841,"142":-0.10487701720952551,"143":-0.007122922736405675,"144":0.010811178803594855,"145":-0.023066118477372465,"146":-0.01355175737930143,"147":-0.04949081238424496,"148":0.006387592959874705,"149":-0.0562137606929431,"150":-0.023390363158154702,"151":-0.13420494078804104,"152":-0.011287341701252576,"153":-0.06632013374135813,"154":0.02052498518915801,"155":-0.21768505510722455,"156":-0.06611596029501601,"157":-0.024453865300221842,"158":0.08185161526796135,"159":0.009388118984693002,"160":-0.0460568096869334,"161":-0.09771374650565803,"162":-0.02580264681922641,"163":-0.08272036955865199,"164":0.012739874549278161,"165":0.05551285944116909,"166":-0.08138274059390727,"167":-0.05072078261803916,"168":-0.06411761037539161,"169":0.05867333293717283,"170":0.03236259214835065,"171":-0.05529269713496431,"172":-0.18328613129785712,"173":-0.04735641775861554,"174":-0.030954396555779643,"175":-0.042788691381729624,"176":0.10852705093657701,"177":-0.04335545081963926,"178":-0.016823057263578307,"179":-0.009157963693044145,"180":0.031228907805363464,"181":-0.06602935898012727,"182":-0.08544682887972221,"183":0.08176783743324537,"184":-0.03301318222359357,"185":-0.10511256000193642,"186":0.016595362786473597,"187":-0.05895693566810732,"188":-0.033713402606288974,"189":0.05641109958773214,"190":0.033806440389865966,"191":-0.04826585289394384,"192":-0.008974591895767237,"193":-0.08902581797647657,"194":-0.011269453685734584,"195":-0.056218736319048314,"196":0.00987858370048449,"197":0.06290912975515323,"198":-0.18733851055311784,"199":0.021274067807534713}},{"sx":5,"sy":5,"depth":8,"w":{"0":-0.31776028672233825,"1":-0.0068170607655103225,"2":0.06917269227683233,"3":0.20217079234264076,"4":-0.09640127708502721,"5":0.06193156903945284,"6":-0.25662173755228,"7":0.009403789816091633,"8":-0.2022245034231935,"9":-0.14316310412251376,"10":0.08732343774998198,"11":-0.11403884211176503,"12":0.11984713996234342,"13":-0.007241675446688128,"14":-0.24144578099165548,"15":-0.15817745011844983,"16":-0.2214411295183098,"17":-0.13940893750839578,"18":0.5492853002198865,"19":-0.3135138081156633,"20":0.5850365438999159,"21":-0.28231697055121424,"22":0.04016534347791077,"23":-0.37501123957811494,"24":-0.03999307205622557,"25":-0.16220279832846193,"26":0.16071294713866263,"27":-0.15217756441494953,"28":0.3095175052293267,"29":-0.33512055805923274,"30":0.0778466927394059,"31":-0.503569287794977,"32":0.19350659323425898,"33":-0.09319724695769939,"34":-0.26948678405359994,"35":-0.22474692445095032,"36":-0.2410233644605695,"37":0.09182492075536045,"38":0.16348517248413263,"39":-0.11230580805660592,"40":-0.13338298222770126,"41":0.05747399020865057,"42":0.06004430248687344,"43":-0.0584044471047266,"44":0.17741098786696757,"45":0.07925548865434906,"46":-0.380344410701681,"47":-0.1954143031332231,"48":-0.19647503382962458,"49":-0.5075709934599889,"50":0.43579280228096484,"51":-0.40706701363965664,"52":0.7943571671448606,"53":-0.17990666963104318,"54":-0.023767277281425265,"55":-0.4826669662261085,"56":-0.009864971765642055,"57":-0.368760079174141,"58":0.33987475227081554,"59":-0.45390739845870504,"60":0.3528204426066955,"61":-0.15526968833985855,"62":-0.010704653945057496,"63":-0.5199986251956294,"64":-0.08200371524057011,"65":-0.20520395515696763,"66":-0.18916204015295465,"67":-0.5390060478495649,"68":-0.11167554836085655,"69":-0.006967836165241235,"70":0.04015186759478201,"71":-0.07830421754310851,"72":0.10267407675488915,"73":-0.0192998995014601,"74":-0.038677630959319934,"75":-0.09074057325198272,"76":-0.20300223615476606,"77":0.02213550358201565,"78":0.12019121279271736,"79":0.22586745228874416,"80":-0.14750751139253657,"81":-0.04432368950199545,"82":0.14996877226524705,"83":-0.1029716940937583,"84":0.7162994526674916,"85":0.1183667764979598,"86":-0.04843675539104105,"87":-0.09336092724142435,"88":0.004238836582211912,"89":-0.5846588267777708,"90":0.03329357133953173,"91":-0.3976758581505596,"92":0.5039013359765027,"93":-0.27421942292258805,"94":-0.021991779977496885,"95":-0.03420751439234779,"96":-0.11682609956148218,"97":-0.03514620335731795,"98":-0.32655713703305106,"99":-0.4421265508278174,"100":-0.1671160184840824,"101":0.19629284496527666,"102":-0.14122136013025008,"103":-0.23607861112392006,"104":0.07720806068228374,"105":-0.049215903551896076,"106":0.20608727144721475,"107":-0.3697297581016738,"108":-0.12272925957292408,"109":0.1306447654634766,"110":0.057497393076009484,"111":-0.0129763870167318,"112":-0.03572188987038045,"113":-0.05514355482777709,"114":-0.10125688712884552,"115":-0.0465982288928911,"116":-0.22664522595039308,"117":0.004230033356271384,"118":0.19151649181630412,"119":0.04891070974317825,"120":-0.04054378901894634,"121":0.1675931644747274,"122":-0.45011028800616554,"123":0.051286042151809,"124":0.34964281082149984,"125":-0.13363764622798427,"126":-0.015488181437781877,"127":-0.03239623364072079,"128":0.09987369490399749,"129":-0.04982017032962389,"130":-0.46070862519595007,"131":-0.2301411729720793,"132":-0.4435325064736882,"133":0.09726397036589152,"134":0.10294158506802138,"135":0.031750049172745314,"136":0.18177364664207527,"137":-0.11590506133736603,"138":-0.08575328523479508,"139":-0.30391038521637376,"140":-0.5079256280584978,"141":0.15600895194912978,"142":0.06049501221704965,"143":0.14898044103581434,"144":-0.05141366608034089,"145":-0.07163431011622241,"146":0.017421820884051913,"147":-0.2027131093875037,"148":-0.20334239599772294,"149":-0.07336676604161446,"150":-0.09051411297026041,"151":0.28004528788781896,"152":-0.08965621463352022,"153":0.059148816479022155,"154":0.11322357505291138,"155":-0.025518842842498193,"156":-0.17161122958623773,"157":0.13378790399216034,"158":-0.1824164746302762,"159":0.4197854322398985,"160":-0.14930596999464604,"161":0.05402537531247522,"162":-0.38897212582512547,"163":-0.155402695938984,"164":-0.30201571053606646,"165":0.12658186455000017,"166":0.1308128312037268,"167":-0.06843198178111011,"168":0.007621824208170243,"169":0.07394530218907186,"170":-0.3640507790288605,"171":-0.33482177517727496,"172":-0.651430893106168,"173":0.2172516020324752,"174":0.0622717518436498,"175":0.03612227319466295,"176":0.0542470472018996,"177":-0.0188597895414733,"178":-0.1742837005975463,"179":-0.20994163066608193,"180":-0.3858717938177925,"181":0.16193184105515002,"182":-0.024434060785498136,"183":0.09100310887595625,"184":-0.09717139102510954,"185":0.3197626798902227,"186":-0.17553448597027457,"187":-0.03274616422242736,"188":-0.18404297323572757,"189":0.0715388053822307,"190":-0.014629769440320033,"191":0.2236814416073932,"192":-0.1748977143566127,"193":0.2074414601642575,"194":0.052954299296909,"195":-0.03794424170253887,"196":-0.005590892664446718,"197":-0.07652940363647481,"198":-0.14646794375311772,"199":0.11569962072608422}},{"sx":5,"sy":5,"depth":8,"w":{"0":0.03325259610728994,"1":-0.017613185573911408,"2":0.0901593039120422,"3":-0.1022538999582996,"4":0.1350356007509997,"5":0.07027010210181582,"6":-0.14882831673199223,"7":-0.09435017662227962,"8":-0.14992833375399756,"9":0.056670530500211466,"10":0.15133328135686597,"11":0.03713596428433641,"12":-0.0672421556774209,"13":0.2216305557419425,"14":-0.04939984986942452,"15":0.07709653270297148,"16":0.05663337476746114,"17":0.028961687757453704,"18":-0.14303240759128097,"19":-0.05103062110715988,"20":-0.10705466237596124,"21":-0.04354161878897707,"22":-0.10177393211955998,"23":0.02180426681191077,"24":0.07962504083749056,"25":0.08131023130061817,"26":-0.2032195150852495,"27":-0.06840741196737216,"28":-0.07251567323670412,"29":-0.010256282501690426,"30":0.05838072312467588,"31":-0.04479493505851184,"32":-0.3789632661122592,"33":0.2712839663207582,"34":-0.218889994260798,"35":0.1891377255239174,"36":-0.15797775466360583,"37":0.12084076006606825,"38":-0.04582514290041167,"39":0.00834306531067996,"40":0.14765333564597413,"41":-0.0421263849340749,"42":0.07388338283459174,"43":-0.22206787858182583,"44":0.10217644205444595,"45":0.06233911568951829,"46":-0.043602445767476204,"47":-0.10893475728461505,"48":-0.18715607107886734,"49":-0.0009992260810245544,"50":-0.020474431782336155,"51":0.13051837546024259,"52":-0.10074843256179601,"53":0.25235909425984915,"54":-0.02071913714201269,"55":-0.0563932583676967,"56":0.05398386862253044,"57":-0.05050793010820284,"58":-0.24952749886742878,"59":0.06092422460563644,"60":-0.07605335692817343,"61":0.0952423356156314,"62":-0.1434759050359459,"63":-0.18810071526397004,"64":0.14644715688610904,"65":-0.12482159659763153,"66":-0.6054804812987687,"67":-0.10281031216243645,"68":0.08605040745675775,"69":-0.0013230083570849004,"70":0.1625772293635296,"71":-0.3159414276437019,"72":0.016535683969530552,"73":0.2680684066582354,"74":-0.21604959733108914,"75":0.23982024070625835,"76":0.01173327999952824,"77":0.27024964123309736,"78":-0.032213528641965514,"79":-0.15875078785935517,"80":0.02906890972689792,"81":0.02922741018498354,"82":-0.02061308554311367,"83":0.048706516702347116,"84":0.15747532173039644,"85":0.006016653418531475,"86":-0.017602503212399447,"87":-0.002244196387449989,"88":-0.2083326078472014,"89":0.2133966994109139,"90":0.1144841992232888,"91":-0.009400349883758602,"92":-0.16566505495575568,"93":0.13583980512479094,"94":-0.3236837697940147,"95":-0.06415047270580927,"96":-0.04853221915370392,"97":-0.002821391804121734,"98":-0.25144571382143677,"99":0.09335689232400939,"100":-0.061501667768019214,"101":-0.16005536353602912,"102":-0.05441398053606476,"103":-0.39422390078920855,"104":0.10593785644235262,"105":-0.21670187133759997,"106":-0.5623769115567403,"107":-0.1559118603689643,"108":0.010864526769322709,"109":-0.08416260653536069,"110":0.09256036454088662,"111":-0.8027351015653523,"112":-0.13043579911589176,"113":0.1740304092174193,"114":-0.34695551770677696,"115":0.017845563807799104,"116":-0.19026235276235612,"117":0.3282328710246692,"118":-0.13829742690328234,"119":-0.36341978444291234,"120":-0.14831668995333527,"121":-0.06338139604298172,"122":0.18139039213461433,"123":0.011209895234461106,"124":0.11524153356427401,"125":-0.017639540333235948,"126":0.0008577182396825822,"127":0.09336088003426296,"128":-0.11498854221939875,"129":0.2752564634046618,"130":0.1371406373783819,"131":0.030187359800215363,"132":-0.03045795198059923,"133":-0.14594372614368845,"134":-0.09774895717331401,"135":-0.031483243385616116,"136":-0.040490329670520214,"137":-0.11356455636423773,"138":-0.11096822686517042,"139":-0.05166666729043445,"140":0.15452909665811007,"141":-0.2805171410206611,"142":-0.07193066589561094,"143":-0.29181896348863334,"144":0.016237588651931947,"145":-0.3001918046146781,"146":-0.4925797570057668,"147":-0.3814735503076415,"148":0.16820151509595985,"149":-0.1098803077222135,"150":0.09049097242651674,"151":-0.598809446527541,"152":-0.10913900283299563,"153":0.14762103216856215,"154":-0.2363465056529193,"155":-0.059328854929511315,"156":-0.13993957477508945,"157":0.31711271910989264,"158":-0.017409122823590497,"159":-0.12288545409791458,"160":-0.03181627104255691,"161":-0.012176813668561319,"162":0.17748342065167497,"163":-0.03273397354836387,"164":0.1424779076346817,"165":0.00509238709186454,"166":-0.13220494871374958,"167":0.20042004561566512,"168":-0.16321121896786503,"169":-0.0306638393160914,"170":0.22528741175282319,"171":-0.18789677238924468,"172":0.09559043846488592,"173":-0.20585266499647883,"174":-0.2194259591714145,"175":0.04561882536701803,"176":0.01544912393311505,"177":-0.11760728079021117,"178":0.09230858197383841,"179":-0.20493415924619468,"180":0.2617786183661866,"181":-0.34100109011051233,"182":-0.024383769755068556,"183":-0.03268266495646495,"184":0.176218335854386,"185":-0.4647765487343348,"186":0.022522252434774404,"187":-0.3349646105138584,"188":0.27844373067539774,"189":-0.07592127616313772,"190":0.04962846808719149,"191":-0.22494268180134058,"192":-0.052017020009095694,"193":-0.12920085692788133,"194":0.0660337023452981,"195":0.036875065593932416,"196":-0.27245408564092366,"197":0.1764810774856757,"198":-0.08469401150312479,"199":-0.07189547527594649}},{"sx":5,"sy":5,"depth":8,"w":{"0":0.19603981313420363,"1":-0.21618128631271813,"2":-0.08105913078469346,"3":-0.2632045666835514,"4":-0.060848409423536524,"5":-0.01707097152514047,"6":0.15952776803180893,"7":-0.13500494223103005,"8":0.07007000390342527,"9":-0.08848294342455916,"10":-0.24744586498069202,"11":-0.11238968382017991,"12":-0.03933565543749058,"13":0.039970537520490616,"14":0.2737722803464277,"15":-0.09730782758259775,"16":0.030662333819108132,"17":-0.023600977251020477,"18":-0.09171977213213678,"19":-0.09661425666518193,"20":-0.007100829417408673,"21":0.17636972740001333,"22":-0.027676967804731615,"23":-0.09181305307604294,"24":-0.07804971954968702,"25":-0.007629963324621247,"26":0.041132040915090304,"27":-0.03891565413975076,"28":-0.1777548388117125,"29":0.07835119783091632,"30":-0.21765903773276443,"31":-0.016581365115241893,"32":-0.24016276771439,"33":-0.11009399470773559,"34":0.09622945466178409,"35":-0.14379831334112972,"36":-0.12633228306771027,"37":-0.02924106113847939,"38":-0.1775660296084328,"39":0.03887856771753811,"40":0.06502007912495159,"41":-0.07096012260632799,"42":-0.010115426980393276,"43":-0.12551930707058423,"44":0.02177124303111801,"45":0.1566749570838305,"46":0.1316214409049189,"47":-0.25208940359595505,"48":0.13686223183728857,"49":-0.02977725305710168,"50":-0.1054143369908944,"51":-0.14171427774074974,"52":-0.04609028111149625,"53":0.21876146305270572,"54":0.009212263743642141,"55":-0.022075623810999246,"56":-0.010475981369416245,"57":-0.11399260038694925,"58":0.07592739719218755,"59":-0.13835151822850555,"60":-0.1405584755864053,"61":0.14980932549659776,"62":-0.0395080667921391,"63":0.25591466481768865,"64":-0.1680344412736989,"65":-0.024289134142013613,"66":0.000122378728979916,"67":-0.007834509284149407,"68":-0.09092753865590776,"69":0.042466775765843116,"70":-0.06825461078803437,"71":0.14685182041254174,"72":-0.14017227643823002,"73":0.0415215238103356,"74":0.13175274917275573,"75":0.1106123410868134,"76":-0.10640544243267945,"77":-0.09385410261501766,"78":-0.19149396112102088,"79":0.09247105405432607,"80":0.06805584265067399,"81":-0.07313817817102757,"82":-0.10410820387078633,"83":-0.07642092459289862,"84":-0.2272272663798304,"85":0.09126105485494695,"86":0.0014566128397037919,"87":-0.15000034686851427,"88":-0.15927739462149026,"89":0.059358314345525263,"90":-0.009928428535739352,"91":0.1598665457677,"92":-0.04592410564632088,"93":0.09275064157773087,"94":-0.20807309746830938,"95":0.06675852091973149,"96":-0.2213110714797806,"97":-0.0823387588173107,"98":-0.10039501590282508,"99":0.04923327930054878,"100":-0.11112407681676227,"101":-0.17453224423375407,"102":-0.14886619456403613,"103":0.09775876342094125,"104":-0.17247881214594535,"105":0.011137681022178946,"106":-0.07484054982150552,"107":0.12280958358418159,"108":0.06478486093631161,"109":-0.13278124697713395,"110":-0.15832440292213773,"111":0.05354991117016682,"112":-0.33931674660191224,"113":0.042862491639403,"114":0.03335881960610567,"115":0.05457832639190548,"116":-0.14954832985200348,"117":-0.1786375449821696,"118":-0.2150061350025612,"119":0.004047364759505978,"120":0.10628912928286519,"121":0.1740487739591574,"122":-0.07795752515767515,"123":-0.1691654269188244,"124":0.0636356029500998,"125":0.011492262851833177,"126":0.05070057034129569,"127":-0.17139657213730014,"128":-0.11941798963959027,"129":0.5271333064756162,"130":0.04315026053059823,"131":-0.116727640919207,"132":0.08114307325506451,"133":-0.15002827923304798,"134":-0.011527178693302161,"135":0.040197431210370255,"136":-0.15002028550982874,"137":0.4574550814632572,"138":-0.12198048220948064,"139":-0.11581069715070871,"140":0.3013707527103486,"141":-0.47366898562299364,"142":-0.028340418546132295,"143":-0.15862045304262298,"144":-0.22353450186979437,"145":0.40698312838177025,"146":0.004149585002602298,"147":-0.17370912020486448,"148":0.40586431577210796,"149":-0.24250564689907594,"150":0.16425580634946524,"151":0.09184890820069352,"152":-0.2631345001258053,"153":0.3453195573666961,"154":-0.10540275582870097,"155":-0.06735617120349495,"156":0.1629094349922912,"157":0.022472211725876733,"158":0.04357176416646596,"159":-0.13947273211463773,"160":0.045786449257880786,"161":-0.14250890039142264,"162":-0.29474779525464284,"163":-0.2838025838786239,"164":0.17930340308969167,"165":-0.1047791805825795,"166":0.10895480486535887,"167":-0.19347661767767257,"168":0.25500750919474674,"169":-0.0735510241002223,"170":-0.3238674186231999,"171":-0.33448628492179466,"172":0.24094700846835673,"173":-0.19876037180113082,"174":0.13956757361113895,"175":-0.09149709407745867,"176":0.0389788629600267,"177":-0.2198603977831527,"178":-0.25882003824352817,"179":-0.45088709364347646,"180":0.024924137431823732,"181":0.13701516922456475,"182":0.07001050860070797,"183":-0.11411528863073646,"184":0.23268903390298712,"185":-0.3226180528737579,"186":-0.16116129197909695,"187":-0.5592700492659505,"188":-0.19684077200445577,"189":0.1540985516292794,"190":-0.1245856802423819,"191":-0.06159744873185162,"192":0.06272881601763725,"193":-0.22826667859441582,"194":-0.1999629183981294,"195":-0.18967540881482567,"196":-0.11691643346769218,"197":-0.1059754949154391,"198":-0.1524415688290125,"199":-0.027058825358025947}},{"sx":5,"sy":5,"depth":8,"w":{"0":-0.10431203629005234,"1":-0.046758053189942465,"2":-0.01449445011483172,"3":-0.03388620158726067,"4":-0.10749763806212805,"5":-0.009568342534687245,"6":-0.03264016567270888,"7":-0.04393788478687855,"8":0.035297527294888054,"9":-0.11543598083164833,"10":0.06393736533821928,"11":-0.03621745804094047,"12":-0.048522829607532236,"13":-0.10273880316297786,"14":-0.03410526921177283,"15":-0.09674349385911493,"16":-0.045926805843080995,"17":0.010908914804463425,"18":-0.11429509252822584,"19":-0.03666344472259436,"20":0.04783262426952376,"21":0.053717049487164104,"22":-0.07235069920516281,"23":0.05133472981362727,"24":0.03180711675936252,"25":-0.04851563229827079,"26":-0.05894742646797846,"27":-0.09423821690844827,"28":0.019114872298769903,"29":-0.049585890301988976,"30":-0.15213729728037784,"31":-0.07176749679301765,"32":-0.16106077314503278,"33":-0.06187179732121296,"34":-0.12584734881661935,"35":-0.024089724294642702,"36":-0.03038381774830302,"37":-0.004913972214668123,"38":-0.05090577598984909,"39":-0.041465446475942865,"40":0.05706661666803022,"41":-0.013377877378698695,"42":0.06438499527275493,"43":-0.01822589627899841,"44":0.12645212803422193,"45":-0.05222671598666058,"46":0.04605994957833538,"47":-0.034849674794741464,"48":-0.14151913192559762,"49":0.03973370018865509,"50":-0.11751954885794125,"51":0.029389195285667646,"52":0.043956097602519464,"53":-0.05662695470577589,"54":-0.048928905146893895,"55":0.08356603322492435,"56":0.06692428484290762,"57":-0.008707727109242794,"58":0.001406077214127114,"59":-0.026320395723481,"60":-0.19949805078790644,"61":-0.02489203824260917,"62":-0.10484036854439933,"63":-0.030792575871825996,"64":-0.062386512849311154,"65":0.018355198430373715,"66":0.016966846881908634,"67":0.03314042995802148,"68":0.008330138197183316,"69":0.03821212825873804,"70":-0.024996016978591717,"71":-0.03294613775051965,"72":-0.06476042199289386,"73":0.02333324755766908,"74":-0.04731459386585175,"75":0.09698589659981705,"76":0.07084859906649844,"77":0.054122293115906814,"78":-0.09884014797686705,"79":0.13200682631612812,"80":-0.0749486589456423,"81":0.008956019371066515,"82":0.057942855746524004,"83":0.06093201890971666,"84":0.03783001919944402,"85":0.007143543337049733,"86":-0.10357624064338775,"87":0.03127170365546939,"88":0.011508284916218161,"89":0.0007744388573182961,"90":0.1720868245744279,"91":-0.0536081405864909,"92":0.04376204134447476,"93":0.07872356751815072,"94":0.05818853032083332,"95":0.013415323008640052,"96":-0.0041756045271083096,"97":-0.05872230777194423,"98":0.06534881625013263,"99":-0.06474679648226042,"100":-0.040096608585545764,"101":-0.01059413151135564,"102":-0.020068133935150157,"103":0.026706018296936546,"104":-0.049549844626775204,"105":-0.08499699721679482,"106":0.053360388746555215,"107":0.05053531653170552,"108":-0.01188321492758802,"109":-0.09857623720983559,"110":-0.03430828950107401,"111":0.07358186468605844,"112":-0.01645343855024725,"113":-0.039898374262162424,"114":0.009950755070936927,"115":-0.004601729052077191,"116":-0.0444340170890116,"117":0.039095072016533554,"118":0.050992734036439516,"119":-0.014425277145236632,"120":-0.0021337668316860742,"121":-0.022837996243907158,"122":-0.03536692520263299,"123":0.0687657356689726,"124":0.06838208167849384,"125":-0.011546040789724637,"126":-0.02899513867825661,"127":0.04586830013624136,"128":-0.12295213754194834,"129":-0.16484170056306968,"130":-0.14165236962554262,"131":-0.06927719679944594,"132":-0.03358553913840755,"133":-0.11892912002214111,"134":-0.1028877430628861,"135":-0.1691585716276283,"136":-0.014369029379203056,"137":-0.09471772563741603,"138":-0.0708401669744982,"139":-0.12207969019298133,"140":-0.07262005354421673,"141":-0.08555615879428669,"142":-0.12248518136519912,"143":-0.08220648918021789,"144":0.02253076052560417,"145":-0.05226014685801899,"146":-0.107762965944229,"147":-0.07082476248446211,"148":-0.10279073569782392,"149":-0.0619351223793063,"150":-0.10394957084299676,"151":0.07337448867694306,"152":-0.07415877044739579,"153":0.021372416254674686,"154":-0.0568551535913328,"155":0.055221550933276874,"156":0.047451677145118006,"157":-0.03408020877978532,"158":0.042176664459173036,"159":0.003120746550470458,"160":0.014795290935992455,"161":-0.01809321436446227,"162":0.1015686483693855,"163":0.0030365118094658142,"164":-0.04999112948413677,"165":-0.07304475647930354,"166":0.011122458077106438,"167":-0.052696653972162597,"168":-0.06074641232365592,"169":-0.08706718364909756,"170":0.04655769385319032,"171":-0.05396760392597984,"172":-0.06037350614348763,"173":-0.06942316461841756,"174":-0.12231943855475115,"175":-0.20078800608647746,"176":-0.05448145221155743,"177":-0.15768366246838453,"178":-0.022682640677442037,"179":0.016771165295913135,"180":0.01635532948613285,"181":-0.11124553419441287,"182":0.010985672906786086,"183":-0.1013398200988771,"184":-0.1701403397525647,"185":-0.03430286485014782,"186":-0.04036714952631955,"187":0.020741942044851778,"188":0.1074954887057022,"189":-0.06608918146704928,"190":0.009128658957926257,"191":-0.08242224687936679,"192":-0.0539078688937707,"193":-0.03336894018846394,"194":0.07167906331799066,"195":-0.028531430719123445,"196":-0.04370862475151916,"197":0.07616268088378243,"198":-0.07963877479435802,"199":0.02324482642789994}},{"sx":5,"sy":5,"depth":8,"w":{"0":-0.09432698994749458,"1":-0.14959047906940617,"2":-0.009621235964420813,"3":-0.023501381201552977,"4":-0.02420780095769693,"5":0.061205206295589544,"6":-0.14118634996283852,"7":-0.08226141421768862,"8":0.13526525996245473,"9":0.009678155404099624,"10":-0.08620507569436524,"11":-0.11213312251032832,"12":-0.06809049856374683,"13":0.04568922391219466,"14":-0.10737224186463624,"15":0.08002437289185596,"16":-0.06028213285978632,"17":-0.020171624592876206,"18":-0.040358453239289084,"19":-0.06418607013640636,"20":-0.06078058720697318,"21":0.06181864335024223,"22":0.0290087622755026,"23":-0.05120600025954397,"24":0.10371890857838854,"25":-0.06533528902731883,"26":0.026875284486529764,"27":-0.027100417997854245,"28":-0.028347563649119195,"29":0.006299323181578857,"30":-0.007619001322938708,"31":0.10765250384910627,"32":-0.11959240016692908,"33":0.0584864039362617,"34":-0.04450206249474644,"35":0.0066294802154715435,"36":-0.05248995365439107,"37":0.0007816976585826401,"38":0.05367542826697648,"39":0.09324954780870585,"40":0.016466673295475232,"41":-0.0673997017857771,"42":-0.013361877345665152,"43":-0.1787238738107517,"44":0.10920741203963996,"45":-0.09228978572946432,"46":0.04779921868006641,"47":0.02713213428673447,"48":-0.03182505324584985,"49":-0.0405043977888897,"50":-0.004744935324831715,"51":-0.04705470252816,"52":0.036875428231966004,"53":-0.025976024773691042,"54":-0.08523145594678763,"55":0.03382551899288078,"56":0.06677031971905477,"57":-0.030128139986444525,"58":0.007265382157528489,"59":-0.08323633458492016,"60":-0.09989873912500129,"61":0.06503059028005312,"62":0.030306259084160687,"63":0.005150042086146031,"64":-0.1121339549577633,"65":0.028193431751017684,"66":-0.08178866824345217,"67":0.004217082269150667,"68":-0.07968636581432324,"69":-0.06630102585432666,"70":0.0006588924093927111,"71":-0.05731278035039473,"72":0.009990391047508498,"73":0.1005291026923197,"74":-0.019406622763198433,"75":0.061103637098898524,"76":-0.14585529913797346,"77":-0.016898039569696998,"78":-0.009832686991046618,"79":0.03967884736960908,"80":-0.034912571495255236,"81":-0.03675295213311804,"82":0.08240542385767248,"83":0.04799708042664162,"84":-0.014127857333228631,"85":-0.14148978286072764,"86":0.012888188041960003,"87":0.00798540945116053,"88":-0.1083008671005888,"89":-0.03972491304331856,"90":0.04228049250835629,"91":-0.050234657868868875,"92":0.049540392710099274,"93":-0.0389799553063959,"94":0.03120299244272533,"95":-0.04607729350764721,"96":0.03806049708050662,"97":0.007855805252600902,"98":0.08055221041397777,"99":-0.045160717235620235,"100":-0.03858596578837924,"101":-0.11624547275734813,"102":-0.0380877695632429,"103":0.016025048614324282,"104":-0.12594267459038053,"105":-0.03125852110556573,"106":0.002442645686443242,"107":0.014274914294687644,"108":0.0878921398901544,"109":0.0009703655081051718,"110":0.07563423541378937,"111":-0.05950499715382126,"112":-0.003376036542675983,"113":-0.043883450487895194,"114":0.04052744981244845,"115":0.0038891585604986104,"116":-0.022791963837183155,"117":-0.13553072186160514,"118":0.13508180458782168,"119":-0.04212846758795011,"120":-0.01422115577850265,"121":-0.02303262754419558,"122":-0.12940489620334886,"123":-0.0726870218081359,"124":0.032172701445444145,"125":0.04352990605514044,"126":-0.0786165215943738,"127":0.02593496648421149,"128":0.015722346852358314,"129":-0.026264332958419373,"130":0.026020759641180283,"131":-0.03040317882682133,"132":-0.09645198577262558,"133":-0.011345194982540573,"134":-0.02115844250490767,"135":-0.1525381854889686,"136":0.00197945693344799,"137":0.003352574486044987,"138":0.019526973964801648,"139":-0.06803317371969211,"140":-0.08567950385325426,"141":0.04346740506699438,"142":0.013308794515273765,"143":-0.09499957883380591,"144":-0.13921292436806348,"145":-0.0919990858682405,"146":-0.17309680339693337,"147":-0.07169197676932873,"148":-0.07276253301310356,"149":-0.017527409703408735,"150":-0.018475162182410132,"151":0.07949369451443143,"152":-0.031151256630343772,"153":-0.06931153470471796,"154":0.059237477562470296,"155":-0.029066735289813087,"156":-0.11378518615370459,"157":-0.01192408811909905,"158":0.028424185413685955,"159":0.03566240528270152,"160":-0.025978420012415303,"161":0.05625002986274898,"162":0.024274942383121924,"163":-0.1831751420714366,"164":-0.029355353727551742,"165":-0.08019212191981415,"166":-0.02026110067112679,"167":-0.0555942195157068,"168":-0.004003794271158053,"169":-0.057300036391810624,"170":0.0059807620086637465,"171":-0.03557348720264813,"172":-0.06731197893027022,"173":-0.03638990048391102,"174":-0.10220745054770575,"175":-0.04670147410124674,"176":-0.012151867178494131,"177":0.003884287444205709,"178":-0.011932277877185923,"179":-0.1239919691868736,"180":0.07149484640714857,"181":0.07682593490199115,"182":0.0019166960770620376,"183":0.05125980662311401,"184":0.0454875408815549,"185":0.07190737929497432,"186":0.00714060786337238,"187":-0.07938505822484829,"188":-0.02607351522853345,"189":-0.018881379639787105,"190":0.03511051038153458,"191":-0.030746187418788973,"192":0.0033939275822090884,"193":-0.08083477020120448,"194":0.08363527838048626,"195":0.0017875518225286267,"196":-0.04246374907460862,"197":0.02997870508308532,"198":-0.040458663805521086,"199":0.08745214478352897}},{"sx":5,"sy":5,"depth":8,"w":{"0":0.02881782555308086,"1":0.00006784200490630466,"2":0.1848812251110379,"3":0.23872244174646043,"4":0.09294608534622187,"5":-0.08167950658327938,"6":-0.011702322380798418,"7":0.22829795816702342,"8":-0.052069506808123465,"9":-0.003435004679112205,"10":0.10772566101438867,"11":0.15089859167861183,"12":-0.02373050261251739,"13":-0.11999314262530474,"14":-0.049420239508133734,"15":0.007066768555938487,"16":-0.09260137288546802,"17":0.15390761967969088,"18":0.0381986476017224,"19":0.07261938219861028,"20":0.05719596584345916,"21":-0.04343460995073062,"22":-0.06410881959292297,"23":0.13855000270501808,"24":-0.183992866456911,"25":-0.015926758124404607,"26":0.13952869722541889,"27":-0.11416506154287923,"28":-0.03846675153796082,"29":-0.07198790185937558,"30":-0.12428006727094784,"31":-0.06775984957151894,"32":-0.18788161274808304,"33":0.05849089308766594,"34":0.1454323501059526,"35":0.21162683587400308,"36":0.097127777577261,"37":0.05885276628156762,"38":-0.042819950836477126,"39":0.07468153748049267,"40":-0.11441219619220737,"41":-0.09445109204955539,"42":0.18815920141173392,"43":0.019831456339117967,"44":0.08247775554775447,"45":-0.35605352075448476,"46":-0.08525077556733945,"47":0.08331725945017582,"48":-0.010217260277630777,"49":-0.053028620637741136,"50":-0.026819328603083753,"51":0.08178370167300698,"52":0.09772347926635801,"53":-0.1537551809451231,"54":0.025030459874561404,"55":-0.06349301039251704,"56":0.005842288554910268,"57":-0.04052433343772792,"58":-0.1388873679708211,"59":-0.04224543633872399,"60":-0.06812909019564985,"61":-0.08475359299314539,"62":-0.08494216829478023,"63":-0.0689746152210668,"64":-0.24525869617990406,"65":-0.0683222115449268,"66":-0.028021214423687813,"67":0.0007825735230412229,"68":-0.0507490358923098,"69":-0.0889019935105203,"70":-0.1687349494447828,"71":0.08887383591171859,"72":-0.2735013372035617,"73":0.16637508060634607,"74":0.13052908389969448,"75":0.18613823541832905,"76":0.030328097910306866,"77":0.006304661861971582,"78":-0.07567388688493044,"79":0.07215189326719708,"80":-0.05288635213037693,"81":-0.08774355255767494,"82":0.018737925686125596,"83":0.25788379905960224,"84":0.025655473135760658,"85":-0.02488586997848811,"86":-0.07663697850673944,"87":0.005326898526078261,"88":-0.11043460934043288,"89":-0.1420060341875645,"90":-0.11033458364352025,"91":0.04108847624635319,"92":-0.004600888465836979,"93":-0.15334416302756793,"94":-0.19118038973250315,"95":0.08799471207261148,"96":-0.053780354969567686,"97":-0.24222708987930178,"98":-0.0871214671874579,"99":-0.10813360634054177,"100":-0.09634505993284037,"101":-0.02978279239859279,"102":-0.07626898252228452,"103":-0.10261108759695761,"104":-0.08725586703631738,"105":-0.07398642468574664,"106":-0.19736678206202357,"107":0.010204450146574574,"108":-0.08920564493476422,"109":-0.08758654077600962,"110":-0.15011560904967802,"111":-0.03495579228776065,"112":-0.24816439106952837,"113":-0.09796003929139904,"114":-0.02480257994539874,"115":0.06096169372655477,"116":-0.07733830854953734,"117":-0.14677382885850954,"118":-0.28644155573687097,"119":0.1189520706279776,"120":-0.12929550999682965,"121":-0.09269897709657439,"122":0.1176743998888758,"123":0.11574239998546187,"124":-0.07785236132329862,"125":-0.2277830680943422,"126":-0.2032508630555333,"127":0.05276151805735206,"128":-0.08033068501536308,"129":-0.19507186026378898,"130":-0.10378688758086334,"131":-0.19692001974485798,"132":-0.11530423416354962,"133":0.0006481460167731819,"134":-0.059712496465073164,"135":-0.04952602005624334,"136":-0.11052838255747784,"137":-0.2770865556607486,"138":-0.08270570412802095,"139":-0.23756488263477119,"140":-0.07526457116205511,"141":-0.04565478408486343,"142":-0.264559125521387,"143":0.012696884262498404,"144":-0.16097593321476275,"145":-0.13359173669503902,"146":-0.10941211743388184,"147":0.03633865273394145,"148":-0.08443216322690084,"149":0.005088194100543598,"150":-0.17364242596371143,"151":-0.040542832597861164,"152":-0.08533724770195841,"153":-0.07386606699064299,"154":0.12224654644906681,"155":0.025943141721842783,"156":-0.12601213282376691,"157":0.0643157095225386,"158":-0.18788252178987772,"159":-0.008628905254979684,"160":-0.07956565098069779,"161":-0.11881899766077127,"162":-0.04792610338475324,"163":0.08715640622435668,"164":0.15526632967443468,"165":-0.17060966912991174,"166":-0.08373486391812289,"167":0.2154600345170573,"168":-0.19889689473227776,"169":0.08153832890027018,"170":0.05210467378905764,"171":0.11895861208409066,"172":0.016390431632891,"173":-0.10864308511538918,"174":-0.07652723828598952,"175":0.1014713893652727,"176":-0.28408383410535576,"177":-0.03548861949695166,"178":0.12779389967295646,"179":-0.078773978391857,"180":-0.05095193862424845,"181":-0.07920979412503805,"182":0.0848115297058039,"183":-0.08611804746464585,"184":-0.28746073100988734,"185":0.057509643143522235,"186":-0.0826878706890017,"187":-0.13648631326839408,"188":-0.011207505399443946,"189":-0.03583819023329062,"190":-0.008754340354402685,"191":-0.024650222384124103,"192":-0.33079076799582285,"193":0.16104127901805207,"194":-0.15686709344322441,"195":0.12642703822559612,"196":-0.27412357425567824,"197":-0.009024008116531793,"198":-0.2696894179537276,"199":0.11692518213810446}},{"sx":5,"sy":5,"depth":8,"w":{"0":-0.047946202061393044,"1":-0.026840068378648527,"2":-0.040525227527060684,"3":-0.03971570565124756,"4":-0.021009025013281377,"5":-0.030786865069297325,"6":0.03462740148660348,"7":-0.06679053571992116,"8":-0.07973122569523816,"9":0.0036661229919909837,"10":-0.10463237664221069,"11":-0.16464399974751187,"12":-0.09775314590980916,"13":-0.15795378218292072,"14":0.03378350174032863,"15":-0.03623963602085442,"16":-0.024677523321141984,"17":-0.13812923160234772,"18":-0.04814606347128402,"19":-0.03094367234500418,"20":0.048285773305999855,"21":0.010226726054895437,"22":-0.007615527535080159,"23":-0.12945121702557263,"24":-0.03336913685631763,"25":0.020027007062437662,"26":0.0492574171407655,"27":-0.04332928939400871,"28":-0.07982800652156713,"29":-0.03926178795020612,"30":0.03698757687451624,"31":0.04415366078419787,"32":-0.0021266914913086617,"33":-0.02880206976427318,"34":-0.036838217343089764,"35":0.013670755296449073,"36":-0.10905600049551052,"37":0.004570535136702285,"38":0.04609025733715488,"39":0.013272407704929953,"40":0.024566823447290984,"41":-0.07455644616047916,"42":-0.07068951937556618,"43":0.018216012045592537,"44":0.020789573207707728,"45":0.104740569300804,"46":-0.04016407771018597,"47":-0.056771843445736964,"48":-0.05504155382929775,"49":0.047140732427681104,"50":0.054514001197139915,"51":-0.12267489578151096,"52":0.017750878593662256,"53":-0.12890284961923884,"54":-0.00017349259716462233,"55":0.03934802859643371,"56":-0.12652839814663955,"57":0.04404331236476114,"58":0.08290850898818033,"59":-0.002232170098186787,"60":0.008861652609724801,"61":-0.025945823613879336,"62":0.002517266076002204,"63":-0.08565944036291996,"64":-0.048057124508817356,"65":0.10470612302100894,"66":0.04250358030252154,"67":-0.018272725173338604,"68":-0.044617826133160524,"69":-0.028049645633168346,"70":0.011285495679950464,"71":-0.140443217561117,"72":-0.0553752044915378,"73":-0.15180668796100993,"74":-0.005736305495436366,"75":-0.06662651015714745,"76":-0.0009951608380184159,"77":-0.0051225613114883675,"78":-0.043499852333988565,"79":-0.032295569465780966,"80":-0.046511527461895956,"81":-0.09496883614934036,"82":0.012250015711218814,"83":0.11788660691922212,"84":-0.051911843957431404,"85":-0.0012551910920099447,"86":-0.15832184917089212,"87":-0.03993684992364127,"88":-0.05662333907599448,"89":-0.0762568151023937,"90":-0.012896950693675923,"91":0.04109931015201412,"92":-0.02165093836825449,"93":-0.0740849394916431,"94":-0.17100962087142213,"95":-0.0018455436357038774,"96":0.02021556598008346,"97":0.04571600828620018,"98":0.0568757292364632,"99":-0.12033133077322271,"100":-0.07560452221260852,"101":0.009102562330388643,"102":-0.06373253579934512,"103":0.027857266706978388,"104":0.029859499994223774,"105":-0.03737028990540002,"106":-0.05836228757876999,"107":0.02979812064343256,"108":-0.002335223761975315,"109":0.050628024319679665,"110":0.04070040737587698,"111":-0.009931593988836057,"112":0.09899303515455617,"113":0.0698418453791425,"114":0.010668989484305813,"115":-0.048328361636419424,"116":-0.08771065141493144,"117":-0.1282390796838574,"118":0.015759189952282378,"119":-0.03598922900191732,"120":0.02531159262266796,"121":-0.09258851536244023,"122":0.04424461080767747,"123":-0.036281775782381474,"124":0.04829768059642109,"125":-0.05687570663224194,"126":-0.02758069825544794,"127":-0.05211287412911905,"128":-0.10885323248492366,"129":-0.10676695496383626,"130":-0.024397168000053124,"131":0.009523326681145864,"132":-0.06254296073106821,"133":0.08093107789979694,"134":-0.019417008652261033,"135":-0.05202553081329171,"136":-0.003499584646012791,"137":-0.0186095614644736,"138":-0.09160084142491688,"139":-0.04003017722539054,"140":-0.06645469549531033,"141":-0.03740996906195851,"142":0.07891890660363649,"143":-0.03233010933268458,"144":0.02053643248153235,"145":-0.08804459005590587,"146":0.04939888985205006,"147":-0.11896645251009018,"148":-0.0857769853105347,"149":-0.049083837027040576,"150":0.005491419522204319,"151":0.026311932921286602,"152":-0.17493866729717047,"153":0.03629943713131081,"154":-0.08234714436968156,"155":-0.03351692327666102,"156":0.015410830343711336,"157":-0.02152245854034314,"158":0.041338561835032754,"159":-0.055323101124026296,"160":-0.0005440863388977841,"161":-0.0989479036873862,"162":0.04126693682887739,"163":-0.11260874811401211,"164":-0.008786301391535689,"165":-0.022898981247308284,"166":-0.0440788828809905,"167":-0.055922994873076746,"168":-0.13101006795336415,"169":-0.06127663211541656,"170":0.06790631885492567,"171":-0.03808770489694222,"172":0.0003084501306047487,"173":0.03989794527311449,"174":0.07785607898329766,"175":-0.06679943591928451,"176":-0.1271691022558596,"177":0.008039304223982139,"178":0.009077287863371364,"179":0.011919032352719893,"180":-0.016968046106997505,"181":-0.013034266397302038,"182":-0.11737347604558548,"183":0.1321988295520545,"184":0.038502691106889364,"185":-0.03331312573142014,"186":-0.10946294332706616,"187":0.04048387271189447,"188":0.036196769529489484,"189":-0.07415413898121574,"190":0.06599573635104092,"191":-0.025659851073135728,"192":0.00287491434463565,"193":-0.004935956391426255,"194":0.003650865865830092,"195":0.014666780019999336,"196":0.06390586037711363,"197":0.02253195724522619,"198":-0.014852168748708237,"199":0.02946139319349741}},{"sx":5,"sy":5,"depth":8,"w":{"0":-0.0030129741093203395,"1":-0.033591130719387775,"2":-0.06501969756099464,"3":-0.09912675237106407,"4":0.07780721958593616,"5":-0.3085833019757321,"6":0.12646272314756962,"7":-0.09886895004155886,"8":0.18796915957937396,"9":-0.07491764911702747,"10":-0.06297172347772398,"11":-0.18565688535718172,"12":0.11136035029605465,"13":-0.2433265721998038,"14":-0.03539323059702663,"15":0.014628668339048157,"16":0.12571627911803607,"17":0.03699238415433927,"18":-0.20585291381374363,"19":-0.07241901077112844,"20":-0.07779119899647544,"21":0.012819715706947768,"22":0.0955759242175129,"23":0.018416276987974593,"24":-0.1135239917703983,"25":0.2408101532623223,"26":-0.30951249289764643,"27":-0.1093776631838613,"28":-0.11775452581196003,"29":-0.013487499195396454,"30":-0.2067434788679851,"31":-0.0526903610978765,"32":-0.2409858909380744,"33":0.26389778708966843,"34":-0.06082164403799779,"35":0.12917960204524137,"36":-0.07466200410690658,"37":-0.10376393134810824,"38":-0.36618119852799536,"39":-0.2559033697917951,"40":0.2528571897820404,"41":-0.3433431411098214,"42":-0.27773557359259515,"43":0.023112918185252133,"44":-0.389769712489648,"45":-0.08940394950997534,"46":0.13818767243121718,"47":0.21008765208860952,"48":0.22640341684589685,"49":-0.34217086930858565,"50":-0.2634762781564913,"51":-0.05802500936546881,"52":-0.3094673987986399,"53":0.0563729893885777,"54":0.14184336135790404,"55":0.026335411365763534,"56":0.1409557489089227,"57":-0.11498831391330021,"58":-0.09378954455985745,"59":-0.0628088343149594,"60":0.03440960946709069,"61":0.023987509736347806,"62":0.16223052568936572,"63":0.049333448451209544,"64":0.14059657388577582,"65":-0.23235817591590957,"66":0.2414486197673566,"67":-0.1893117350297488,"68":-0.12585023559954162,"69":0.03270086727343018,"70":0.07552343910384589,"71":0.09512128688376982,"72":-0.1079870766367909,"73":-0.09308350113048396,"74":0.14675670317187986,"75":0.104672923015264,"76":-0.18136488992072344,"77":0.041229815805716157,"78":-0.15292902015614984,"79":0.12126575812794685,"80":0.09950819983395884,"81":-0.3145752886512153,"82":-0.15681900759455095,"83":0.23162401827568682,"84":-0.189133153797594,"85":-0.14704004933012887,"86":0.04782153047541147,"87":-0.07203394184012935,"88":0.10183701886724901,"89":-0.313829241177342,"90":-0.03995349405141616,"91":-0.07510262575751711,"92":0.05215616358567313,"93":-0.14778790861585295,"94":0.0798203304248534,"95":-0.12139102774797902,"96":0.05653525907302723,"97":-0.08632834698101025,"98":0.02859339443748773,"99":-0.18830120855944332,"100":-0.023115987977687682,"101":0.13239578733504706,"102":0.1039128040742899,"103":-0.004334631939313522,"104":-0.013164712496685075,"105":0.04501115232552826,"106":0.021831601874343364,"107":-0.030164340222528847,"108":-0.11758663403139605,"109":0.11262646605334252,"110":-0.022665551995000855,"111":-0.03537982495409708,"112":-0.012056938087120085,"113":0.0307842757028605,"114":0.05327855417239758,"115":0.0042279616415010985,"116":-0.19051696724101974,"117":-0.18132814814034381,"118":-0.11400042342967562,"119":0.09466220363754331,"120":-0.15912806035691682,"121":-0.03840094935752098,"122":0.07636019345105508,"123":0.05607297034288785,"124":0.1703612967637454,"125":-0.27193583967418944,"126":-0.1762369293906265,"127":-0.1206087786952067,"128":0.08087739056012849,"129":-0.2590934278453156,"130":-0.015465251438367002,"131":-0.08848514656449882,"132":0.060536475651464215,"133":-0.17767207742862978,"134":-0.015782645825162357,"135":-0.3184665391105938,"136":-0.11338566336416918,"137":0.14397309056157015,"138":-0.1135533761745476,"139":-0.09517972639674688,"140":-0.08036153604768256,"141":0.05943662103074191,"142":-0.18424630281104845,"143":-0.29265350318122024,"144":-0.4039653364013051,"145":0.0527651094884115,"146":-0.11229872809317452,"147":0.13047141311889535,"148":-0.06641789808192006,"149":0.04316135640957906,"150":-0.19156337811628393,"151":-0.07974606414324484,"152":-0.21408298959692384,"153":0.081823803286417,"154":0.06457469476536523,"155":0.15165100713229093,"156":-0.08470541249668648,"157":-0.0641652984698091,"158":-0.20966728564822948,"159":0.03209143422905028,"160":-0.019857216876849354,"161":0.0726633492956379,"162":0.09020901131259076,"163":0.02287394936756108,"164":0.33527147481517633,"165":-0.3166127789274949,"166":-0.08574616494636757,"167":-0.09770491019996483,"168":-0.07180301085663784,"169":0.09343427456441437,"170":-0.13086839484324142,"171":-0.08227029156102865,"172":0.08492309795800128,"173":-0.07561667744576082,"174":0.07771510461331804,"175":-0.20042016335942853,"176":-0.04999829872309003,"177":0.08867034884177544,"178":-0.22433971594358776,"179":-0.1354754816492222,"180":-0.11546090874737172,"181":-0.15403081374724065,"182":0.024284097005973258,"183":-0.1564953031494098,"184":-0.3291887639587213,"185":0.21927135036366124,"186":-0.31482098951256865,"187":-0.02158439260310297,"188":-0.06643368123146313,"189":0.14775283704793618,"190":-0.15072232115586365,"191":-0.16718682825894157,"192":-0.39981489911994567,"193":0.048003092602930286,"194":-0.07647638710780495,"195":0.08556705293209542,"196":-0.22626834674355525,"197":0.08231853359334507,"198":-0.21382324583001333,"199":-0.0971505715783828}},{"sx":5,"sy":5,"depth":8,"w":{"0":-0.17718697389893664,"1":0.41504292710195234,"2":0.10800140130995994,"3":-0.17882665118574495,"4":0.22606593513999107,"5":-0.02731965972303202,"6":-0.1331632968643884,"7":-0.03121648768493282,"8":-0.11364014402179078,"9":0.24989825846457372,"10":-0.14035480917161333,"11":0.2722354483579078,"12":-0.03955746944814915,"13":-0.10518697296219363,"14":-0.20924885394735954,"15":0.03270178253843752,"16":-0.19548638141030764,"17":0.1365807810106033,"18":0.002212451229704651,"19":-0.005494440216729331,"20":0.024753928492672866,"21":-0.12838051173292647,"22":-0.06419198809888048,"23":0.031221520777200383,"24":-0.061016665942934645,"25":-0.12231116381910945,"26":0.04872547539989253,"27":0.05689128085540508,"28":-0.1182840293121952,"29":-0.041278217853487904,"30":-0.24723193883563221,"31":0.028255616880951247,"32":-0.11803743434814129,"33":-0.14009066737425668,"34":-0.07066188188287048,"35":0.06546474224069836,"36":-0.07036826766386331,"37":0.02784175177361991,"38":-0.13859043650395234,"39":0.1378127884939837,"40":0.03010667456510862,"41":-0.24421866432610564,"42":-0.18773309178039183,"43":-0.5124006341160132,"44":0.02510015112779073,"45":0.100801985110599,"46":0.12079421172558248,"47":-0.06884211119454602,"48":-0.09867952210471638,"49":0.06337641967147158,"50":-0.22159366884488982,"51":-0.1638882761140798,"52":-0.17699854031053908,"53":0.2224864756879644,"54":-0.03742719939523948,"55":-0.3000236024553393,"56":-0.17172868445918946,"57":-0.05068878154602536,"58":0.10858101574833832,"59":0.07736596638398362,"60":-0.00604077262237496,"61":-0.0820251493881563,"62":-0.23725098691353733,"63":0.07348736375959007,"64":-0.14434533148334158,"65":-0.0287169246926643,"66":0.0835694657251792,"67":0.07707888554843347,"68":-0.0031172307221899315,"69":-0.06940870998955131,"70":-0.21182062548181238,"71":0.040803150491468466,"72":-0.10694777326432857,"73":-0.10363434010166317,"74":-0.03259658226477162,"75":0.10630194991702638,"76":-0.08320564329957719,"77":-0.11053064485796789,"78":-0.10040928895436439,"79":-0.007377617632742977,"80":0.05687141543244475,"81":0.0015109389919345556,"82":-0.05789855084455857,"83":-0.40930105955676555,"84":-0.1861965873371873,"85":0.21794591003542801,"86":0.02621316641379028,"87":0.3841659065927117,"88":-0.1586108094433514,"89":-0.21302618154453032,"90":-0.06039886735650741,"91":-0.22473945370586434,"92":-0.363807142120201,"93":0.05825994400696575,"94":0.16598268515442927,"95":0.18880187938539064,"96":-0.1384301665682312,"97":-0.0784544070584866,"98":0.1325330800361714,"99":0.09956762470877421,"100":-0.15804206673360155,"101":-0.0772415260270977,"102":-0.047504620940112714,"103":0.14702162459964618,"104":-0.039323813203653295,"105":-0.1343029112827986,"106":-0.06712745803113639,"107":-0.00945694672544803,"108":0.02535996546658731,"109":-0.14587857069866855,"110":-0.028945891197792027,"111":0.06913806737518574,"112":-0.2042589021516762,"113":-0.03400954644339338,"114":-0.052258847546318654,"115":0.02320590400441351,"116":0.0148106504523701,"117":-0.05265898902789792,"118":-0.13512842139025347,"119":-0.07917626278644282,"120":-0.03860157282963474,"121":-0.08007858540840779,"122":-0.13507142621031507,"123":-0.10081400360227002,"124":-0.053088045568817965,"125":-0.13407119829467917,"126":0.07301710305453973,"127":-0.21165799109854863,"128":-0.26527327099167125,"129":0.30141143759826,"130":-0.3265298687655581,"131":-0.06064931236975189,"132":-0.3425205147065226,"133":-0.05977688268554621,"134":-0.12289816820675475,"135":-0.22208905318729635,"136":-0.25201634184409155,"137":0.021834894212521067,"138":-0.17252998418250814,"139":0.07433068687956974,"140":-0.0034907485450505122,"141":-0.10609175691585385,"142":-0.19491764338300394,"143":-0.1143346260480929,"144":-0.05423055221535587,"145":-0.03759655013551747,"146":-0.06408454797732595,"147":0.08557780071729484,"148":-0.06624793892733206,"149":-0.20541203268928718,"150":-0.058844172369108196,"151":0.03767705128395571,"152":-0.03547259586052001,"153":0.014250191158512004,"154":0.027511622927459026,"155":0.048470374925027815,"156":-0.11663394491324132,"157":-0.2014878861079962,"158":-0.010235780554052989,"159":-0.11953853570359765,"160":0.3221890588864649,"161":-0.1315487708795308,"162":-0.11804591754635743,"163":-0.13721311175019263,"164":-0.1329970986922066,"165":-0.08835736306558109,"166":0.13707845291812254,"167":-0.1754269176094996,"168":0.05757238248779604,"169":0.1899046297112932,"170":-0.5655878666978091,"171":-0.18128367514296598,"172":-0.5624683977244855,"173":0.029816021809166284,"174":0.01839070308103016,"175":-0.4268050317596198,"176":-0.2026127387825131,"177":0.18641344630629658,"178":-0.36498082694005113,"179":0.009453752453682478,"180":-0.1306413732129926,"181":0.04600799143594784,"182":-0.16491190165524133,"183":-0.21146496758486946,"184":-0.08094113052949074,"185":-0.1393904879176938,"186":-0.006410748536543014,"187":-0.007512438882711065,"188":0.039505680260392896,"189":-0.0717344410048248,"190":-0.13174753452545437,"191":-0.005996546952235671,"192":-0.1099735788163519,"193":-0.10089785800287697,"194":0.05868809690446597,"195":0.013600075833926665,"196":-0.02944234242150487,"197":-0.19774521228101977,"198":0.059250557553176264,"199":-0.031680325106827355}}],"biases":{"sx":1,"sy":1,"depth":18,"w":{"0":0.015926699027659186,"1":0.045209729575733396,"2":0.044244450423315186,"3":0.04659650203670845,"4":0.0324508418209372,"5":0.060227404582774646,"6":0.05990128489576477,"7":0.14232766544331202,"8":0.045904665264348714,"9":-0.007709173189344024,"10":0.136806595978079,"11":-0.02212424068755505,"12":0.04113898617932211,"13":0.06487322478468574,"14":-0.027229441461981356,"15":0.06499874980408268,"16":0.026749797156673014,"17":0.04665201106139991}}},{"out_depth":18,"out_sx":14,"out_sy":14,"layer_type":"relu"},{"sx":5,"sy":5,"stride":2,"in_depth":18,"out_depth":18,"out_sx":5,"out_sy":5,"layer_type":"pool","pad":0},{"out_depth":43,"out_sx":1,"out_sy":1,"layer_type":"fc","num_inputs":450,"l1_decay_mul":0,"l2_decay_mul":1,"filters":[{"sx":1,"sy":1,"depth":450,"w":{"0":-0.11859719838318807,"1":0.0028939142972407286,"2":0.04026453576506737,"3":0.0441833880611359,"4":-0.01373215829835592,"5":0.011602361547684691,"6":0.03779740758874165,"7":-0.0685471252311178,"8":0.020365555020158934,"9":-0.20200962722311483,"10":-0.27494398895407074,"11":-0.0710173550561661,"12":0.04950643746643186,"13":0.03180671988820232,"14":0.0016431820445237592,"15":-0.0011403177079890299,"16":-0.02569467088293347,"17":0.047986570521479095,"18":-0.1923361129172072,"19":-0.03439356246816286,"20":0.028466285827222795,"21":-0.023376462991658832,"22":0.011567295645639557,"23":-0.129960938443583,"24":-0.07358029393208623,"25":-0.18807782538250487,"26":-0.019639286395108906,"27":-0.07989289882692036,"28":-0.3175498841029258,"29":-0.001320854115423759,"30":0.03434162256974343,"31":-0.006139249184807039,"32":0.020366054218002593,"33":-0.021392093606201253,"34":0.007494699466228256,"35":-0.048765927481664556,"36":-0.0485899376988472,"37":-0.027592781317099867,"38":-0.018131972637249572,"39":0.0697036936956568,"40":0.025500979046446725,"41":-0.1601363429228286,"42":-0.09090727790474579,"43":-0.1704105850708662,"44":-0.03249941997343405,"45":-0.18352227415284064,"46":-0.22636067316925373,"47":-0.07106423710799908,"48":0.025719316782108915,"49":0.010970175773712164,"50":-0.009222233558532163,"51":0.060400454820563367,"52":-0.035146777539399626,"53":-0.24867909907252678,"54":0.017257266303244034,"55":0.0758866241654522,"56":-0.0336738478294458,"57":-0.03698217106414166,"58":0.018643278249031014,"59":-0.1001641494321085,"60":-0.05266183647754392,"61":-0.07305025601355758,"62":0.013588101856872613,"63":-0.046857420382683375,"64":-0.22865068053885446,"65":-0.020946286953003435,"66":-0.04167784560914442,"67":0.1592427425647574,"68":0.017725016150906533,"69":-0.02627539936763787,"70":-0.048496220529646014,"71":-0.1641674837412231,"72":-0.008376417342716692,"73":0.07649689564939996,"74":-0.054447840435515725,"75":-0.0663952688316277,"76":0.03326256344212868,"77":-0.053788820246966317,"78":-0.0489774689539881,"79":-0.09259245080113176,"80":0.04730460628424584,"81":-0.22618293821780128,"82":-0.09370966025982498,"83":-0.10132149493406728,"84":0.08419007069519373,"85":0.005643732079585626,"86":-0.05189856402269743,"87":0.04885101597345077,"88":-0.10290522769540668,"89":-0.17150551476890794,"90":-0.13911003264894195,"91":-0.0077078693094727,"92":-0.05220643866081118,"93":-0.17359697669038388,"94":0.07602457967362113,"95":-0.1953488994861266,"96":-0.1407310088094253,"97":-0.16262787282374186,"98":-0.010288375666756487,"99":-0.06574934813925337,"100":-0.39689058109636155,"101":-0.0779994261343744,"102":-0.028321785190021122,"103":-0.00800598189231812,"104":-0.09236955593070062,"105":0.09062344978654652,"106":0.004009125572829742,"107":-0.022536369959343504,"108":-0.2988869298172562,"109":-0.1344946393015395,"110":0.022272024414292796,"111":-0.14620152406111286,"112":0.004461872679361139,"113":-0.24965694905913152,"114":-0.061001070849008576,"115":-0.2967107606301037,"116":-0.006150867310100275,"117":-0.02024409199309395,"118":-0.1857778018026684,"119":-0.05581239543509315,"120":-0.08301921006542118,"121":-0.08286654799312436,"122":-0.10938131147025758,"123":0.040598223200264384,"124":-0.10537425894340632,"125":-0.022199491451675553,"126":0.00009824263429064557,"127":-0.04116440965474417,"128":-0.11670324870412561,"129":-0.09526174812926479,"130":-0.044923856392316115,"131":-0.34052547797567123,"132":-0.014679996841784818,"133":-0.2680790676148243,"134":0.005284452955842263,"135":-0.0897262495334678,"136":-0.023207346237086392,"137":-0.14120558823550908,"138":0.019403263479724858,"139":-0.04854640260653085,"140":0.013390682186830302,"141":-0.04557495927728185,"142":-0.1037085862604219,"143":-0.003958847527536857,"144":0.08615599044276982,"145":-0.09906285962059996,"146":0.07944170346541289,"147":-0.07314544702382052,"148":0.012818660879379962,"149":-0.27492222053298315,"150":-0.02343673610678457,"151":-0.1649930763713066,"152":0.03249064265782647,"153":-0.15408182803196763,"154":0.20990136741972698,"155":-0.052326911754205195,"156":-0.02159873244519289,"157":0.04273301018581002,"158":-0.03464133365056613,"159":-0.05972856420704465,"160":0.017285548592461286,"161":-0.03813017150908744,"162":0.13266326735939196,"163":-0.06639881500924878,"164":0.025639546239746708,"165":-0.011792339048223334,"166":0.051274278165806805,"167":-0.14173893319624195,"168":0.0315024765143779,"169":-0.0783600837723474,"170":0.06521953132582503,"171":-0.24698187892728898,"172":-0.02837206587205884,"173":-0.10780744837459734,"174":0.07685231305685553,"175":-0.05820801590651966,"176":-0.09550551241486697,"177":-0.04468445146429099,"178":-0.01752673948742141,"179":-0.1165124596004279,"180":-0.13880926008870106,"181":-0.03778628871895249,"182":-0.07912032868848154,"183":0.041507968179017585,"184":0.09703391395254894,"185":-0.296828794258979,"186":-0.28826464355913306,"187":-0.11309544545456447,"188":-0.07653081250298256,"189":-0.07663609049017484,"190":-0.3394636882594527,"191":-0.01848680068447946,"192":0.05666522917325751,"193":0.005806382560389639,"194":-0.2238381476657785,"195":0.05656152334823788,"196":-0.06055801601829557,"197":0.03164119165259073,"198":-0.10667481832063568,"199":-0.008104485701317509,"200":-0.033938280094401016,"201":-0.10261837346399634,"202":-0.11307719668096645,"203":-0.29664503105141493,"204":-0.20362657746825555,"205":-0.052689946124243874,"206":0.039322914693165636,"207":-0.056665346188055694,"208":-0.20136704961933216,"209":-0.1411481181022181,"210":0.09680791449511664,"211":-0.011627770386142891,"212":-0.08793341684310668,"213":0.14726223238994088,"214":-0.17982514993727683,"215":-0.07635099772933472,"216":0.08943712672033755,"217":-0.10817794931366892,"218":-0.14503971593818524,"219":-0.1603534614914743,"220":-0.11276080046555313,"221":-0.23823228579310263,"222":-0.16072594255291123,"223":-0.14612521125027697,"224":0.01772620250090052,"225":-0.04132296114349907,"226":0.06654508710241559,"227":-0.18323718479627712,"228":0.011690441911229215,"229":-0.07830250693883363,"230":-0.09437556522199497,"231":0.054839140859105594,"232":-0.13162122363023168,"233":-0.0132045242219143,"234":0.14177193790441195,"235":-0.11748717340004465,"236":-0.006830462471972785,"237":-0.2569711190953697,"238":-0.11337550374396271,"239":-0.1609213908922155,"240":-0.13745607896357445,"241":-0.22841270747333164,"242":-0.04268682417918281,"243":-0.14323069330109683,"244":0.08525971974217547,"245":-0.10421850656927767,"246":-0.0938621405313257,"247":0.014492607750086837,"248":-0.12700659807478865,"249":-0.02829737713131295,"250":-0.05239205959239055,"251":0.07113774843833952,"252":0.1149609575654867,"253":-0.059298126807195074,"254":-0.03537491744882732,"255":-0.0691827450936083,"256":-0.009055447868018106,"257":-0.016458972954076626,"258":-0.0762316208997512,"259":-0.0534971916675652,"260":-0.004071038618495062,"261":-0.15258572876270138,"262":-0.14186716802305713,"263":-0.12304493431738149,"264":-0.015393467714775634,"265":0.02929960107664379,"266":-0.08165354522369694,"267":0.020276730228688304,"268":-0.046237351606937725,"269":0.15714634858726234,"270":-0.1538856606175708,"271":-0.011846618458579233,"272":0.006107764776171812,"273":-0.037322234605665236,"274":-0.0047733367516687155,"275":-0.2913719907056873,"276":-0.07547862953027225,"277":-0.129305331860345,"278":-6.811022057849435e-7,"279":0.0610595026402831,"280":-0.3961877289009053,"281":-0.014728076596748177,"282":-0.05658940071747437,"283":0.038183226058815,"284":-0.01928090718299053,"285":0.09631412993748106,"286":-0.10150259170113236,"287":0.06260546111487578,"288":-0.11708204280725938,"289":-0.06899861067852377,"290":-0.11213846416692942,"291":-0.1419834264724235,"292":-0.04868221359495752,"293":-0.3219336341103274,"294":-0.08263079153328486,"295":0.04364912324407614,"296":-0.0807933832515153,"297":0.026192308443941756,"298":-0.21217900156219602,"299":0.030026481190397837,"300":-0.014618093758442585,"301":-0.004291436707760956,"302":-0.09912226148307787,"303":0.016221523929647912,"304":-0.031878658159109875,"305":-0.025480833075416497,"306":-0.04705036169467004,"307":0.10275625903021833,"308":-0.15593811272645375,"309":-0.14009677512259094,"310":0.026009637469647694,"311":-0.1459669027347194,"312":-0.12396229647734218,"313":-0.14994828936461532,"314":-0.005192970643766141,"315":-0.002889085489175293,"316":0.08474513537254597,"317":-0.07431854410998834,"318":0.039862485092594886,"319":0.026951753889236093,"320":-0.03989167108766429,"321":-0.07863490659979512,"322":-0.047928579481080626,"323":-0.05060065379384453,"324":0.039949362106727754,"325":0.045500154577025095,"326":-0.09293361742471225,"327":-0.1035981929817313,"328":0.0733242592352276,"329":-0.11706709394448453,"330":-0.14244540907339368,"331":-0.15002555997783867,"332":-0.0071898745287746636,"333":-0.03668790208366754,"334":0.08488598640055606,"335":-0.07711932691733932,"336":0.06006990040815463,"337":-0.02861845709765457,"338":-0.019425454658802417,"339":-0.037490195631154695,"340":-0.013640972277962333,"341":0.10151217942540558,"342":0.008618622606390208,"343":-0.10049897008107053,"344":-0.1466515271815521,"345":0.09152257639712645,"346":0.059661344030497616,"347":0.003776315915168635,"348":-0.06530462037500566,"349":0.02388069833486236,"350":0.020405639637191123,"351":-0.15799409685647073,"352":-0.06564400170600827,"353":-0.1357112538380778,"354":0.04712090752491247,"355":-0.030972809560838283,"356":0.03885882016443465,"357":-0.06703305366339003,"358":-0.025058973944327153,"359":0.026277008854340915,"360":-0.005140084399168633,"361":-0.0509378569526443,"362":0.0414698616006915,"363":0.04492741541812419,"364":0.05762279415841006,"365":-0.3436626294794501,"366":-0.09323162095776923,"367":-0.06137443645203384,"368":-0.0117744292754516,"369":-0.011021040891705382,"370":-0.22344688311678726,"371":-0.08416169293419332,"372":0.05914539359086391,"373":-0.022994883767593458,"374":-0.008866088657735647,"375":-0.012797213222235758,"376":-0.0826563837930459,"377":-0.08117310035311993,"378":0.01350115615887014,"379":0.006766033470758963,"380":-0.12895291385182642,"381":-0.10422564109150333,"382":0.016938789798382446,"383":-0.3222250110388095,"384":-0.09680026767525729,"385":-0.030279803440620433,"386":-0.06384439333080254,"387":0.08584696692416202,"388":-0.2376249126525039,"389":-0.0814975390809023,"390":-0.02820174996851416,"391":-0.10780400936364945,"392":0.009218930125175927,"393":0.02712014989880248,"394":-0.01328184368798778,"395":-0.06230984532878769,"396":0.08847145529321213,"397":-0.02097678338989443,"398":-0.24056320931638295,"399":-0.1155325684866657,"400":0.08714249540113755,"401":-0.0596404040341409,"402":0.01098410119809399,"403":-0.11469259012041175,"404":0.023730710851510486,"405":0.11373064575152522,"406":-0.22339522195612208,"407":-0.09222618943447654,"408":-0.05400092454648194,"409":-0.04479239224037064,"410":0.019599446845559792,"411":-0.04569501795202755,"412":0.029087918183245444,"413":-0.0479784084820366,"414":-0.09455276884153563,"415":-0.11335933262768445,"416":-0.18200146039900134,"417":-0.06292526319876403,"418":-0.031108563682501235,"419":-0.02889484726448647,"420":0.059371721044070375,"421":0.0088145484840694,"422":-0.0067192804561378916,"423":0.06279351388956736,"424":-0.07928515198002806,"425":-0.16357710502330847,"426":0.0789917651982639,"427":-0.003022504663793251,"428":0.07058279625457534,"429":-0.0030861573975136613,"430":0.07514680059148841,"431":-0.15351061686242412,"432":-0.15645082903512667,"433":-0.04017553559163534,"434":-0.1891757060912596,"435":0.010872717516009569,"436":0.08269064446521919,"437":-0.0037611710006104204,"438":-0.052034607092589905,"439":-0.01870534356733053,"440":0.02749208270211179,"441":-0.12437515524521432,"442":-0.06891630533949632,"443":-0.11790045691356094,"444":-0.10757323275932824,"445":-0.010623622026142945,"446":0.0017803916081212147,"447":0.03175530803055787,"448":-0.02426970801269053,"449":-0.03765655801679664}},{"sx":1,"sy":1,"depth":450,"w":{"0":-0.11798204385622471,"1":-0.044694201622431894,"2":-0.015923827034744327,"3":-0.1524711376646571,"4":-0.03001929669578093,"5":-0.16724917215119925,"6":-0.0150910454209133,"7":-0.039048449948681556,"8":-0.021161409837161773,"9":-0.030724825584561535,"10":-0.1801957426831573,"11":-0.18266013459595185,"12":-0.034740171271503445,"13":0.003344219426966664,"14":-0.12023676354560786,"15":0.08064111814258272,"16":-0.05371983010436344,"17":-0.06603486249613283,"18":-0.13777757369295948,"19":0.027789789688120316,"20":-0.041697115227737495,"21":-0.1630470935211859,"22":-0.02035295967033877,"23":-0.21870469440705476,"24":-0.05450731750404571,"25":-0.12869051866582998,"26":0.015274660995783005,"27":0.0692302770254135,"28":-0.03178779663375227,"29":-0.06872622304847077,"30":-0.017957966073088496,"31":0.003218486735707143,"32":-0.15721474541824146,"33":0.09313784933641152,"34":0.010318502500067056,"35":-0.005847167029856799,"36":0.09238360312813451,"37":0.04834860573410014,"38":0.08470564946623989,"39":-0.095954524670799,"40":-0.018472334475611942,"41":-0.137891687898031,"42":-0.08086638521522256,"43":-0.16057033037957977,"44":0.009565734250030428,"45":0.11642556316004476,"46":0.04683673016872989,"47":-0.16769828166351147,"48":-0.009958113248908412,"49":-0.06344637761084115,"50":-0.16332315895523813,"51":-0.033739054520541004,"52":0.05147958741061511,"53":0.06741298267645782,"54":0.1172631548707186,"55":-0.022945249877869937,"56":-0.014013201750587966,"57":-0.11595639542655815,"58":0.03796878727974258,"59":-0.13390198477076856,"60":-0.06415601018243951,"61":-0.009839655112197155,"62":0.018875481826054957,"63":0.07954036310865477,"64":0.057734591537363954,"65":-0.08573240450191726,"66":-0.018110149963061924,"67":-0.0022280980088460007,"68":-0.07686786323008016,"69":0.0451755019902781,"70":-0.001890988806487839,"71":-0.028741232278229088,"72":0.14440148105841702,"73":-0.05103362304238712,"74":0.0035209196584445137,"75":-0.09148782136213489,"76":-0.046770114850741215,"77":-0.14056736886965895,"78":-0.12044727386931986,"79":0.022962006630380477,"80":-0.009046137621593765,"81":-0.12235190621700656,"82":-0.08718252975666677,"83":-0.044532559579139326,"84":-0.02096845592236741,"85":0.04545067808112817,"86":-0.06533660381416162,"87":0.04434853852295719,"88":-0.005919191592086174,"89":0.003121698753542354,"90":-0.05635592886108148,"91":-0.016715256667535275,"92":-0.07672508037230112,"93":-0.13627572100528357,"94":0.0007254467963106714,"95":-0.23848596009843628,"96":-0.12243207683868498,"97":-0.12086925989843918,"98":0.08164312119593718,"99":-0.006479429041739506,"100":-0.13883675938808768,"101":-0.13412808711818489,"102":0.007814180121037271,"103":0.10215211063983193,"104":-0.13701213136575977,"105":0.1688477895235987,"106":-0.006946803040032194,"107":-0.008096069834450666,"108":-0.10351757951324418,"109":-0.06998356725758466,"110":0.017147507965640706,"111":-0.11833423572954556,"112":-0.07234145919726041,"113":-0.153506850579501,"114":-0.1674167673230564,"115":-0.2517168323336539,"116":0.0020902905611594326,"117":0.03791328425867053,"118":-0.11272211941125873,"119":-0.24516152665129615,"120":-0.014266189872883204,"121":0.07092466788151108,"122":-0.17825793407026685,"123":-0.08300440012464352,"124":-0.09050393536142183,"125":-0.04704120421741995,"126":-0.03895680498563354,"127":-0.10767321283411795,"128":0.002957917635835476,"129":-0.1273660840106619,"130":-0.02416282597372325,"131":0.05004591301577631,"132":-0.12944664320619162,"133":-0.15532990285305817,"134":-0.03666819504494208,"135":0.020587651985209943,"136":-0.005718395569294431,"137":-0.23156544285874062,"138":-0.025046230837286063,"139":0.07533147930560292,"140":-0.14331700146134269,"141":-0.06395862133483567,"142":-0.06294234778436764,"143":-0.013482515398708681,"144":0.0577101936724336,"145":-0.12907655488655817,"146":-0.07304720906675298,"147":-0.1289156662515043,"148":0.010962353943718086,"149":0.029955384829728433,"150":-0.048205275031796266,"151":-0.027127347685851802,"152":-0.0097863437937618,"153":-0.05819718753554044,"154":-0.06456626671131489,"155":-0.2309315802735135,"156":-0.016736735345557953,"157":0.0003835793480755466,"158":-0.05607115799652935,"159":0.03690298671991647,"160":-0.1274964018404941,"161":0.007055092067850286,"162":0.07246540832372489,"163":-0.12964693499920119,"164":-0.18562139828998583,"165":-0.04564959996098997,"166":0.015072622865224664,"167":-0.09572657383362623,"168":-0.09147218259129795,"169":-0.09716195671777579,"170":0.06942600176918352,"171":-0.2826772717361578,"172":-0.1371173691521711,"173":-0.17339035033507744,"174":0.003754554581925203,"175":-0.02545905627024983,"176":-0.011766993525289211,"177":-0.010973625070014495,"178":-0.05387604285804202,"179":0.034190167747979505,"180":-0.1336182097078421,"181":-0.027079805601814878,"182":-0.17618697213196274,"183":-0.19376760231914797,"184":0.027379881210158264,"185":-0.24519738843879565,"186":-0.19079815174331696,"187":-0.21588545705778675,"188":0.03392159089275274,"189":0.050262528669698166,"190":-0.02961118121171188,"191":-0.24506736364830972,"192":-0.004411465033433199,"193":0.0202246170261404,"194":-0.1464552039412101,"195":-0.044515681745525504,"196":-0.12145528465652276,"197":0.04850884209976398,"198":-0.1415472953472937,"199":-0.07005399598077866,"200":-0.024409550313645927,"201":-0.1742113082478112,"202":-0.012595636537991658,"203":-0.09041546755633997,"204":-0.21784205064517012,"205":-0.19196664706242103,"206":0.005474077690828288,"207":-0.03997481585846102,"208":-0.13213113886231345,"209":-0.11957903947501644,"210":0.10768697728015374,"211":0.08635272362831324,"212":-0.10670716523244858,"213":-0.008755056257952686,"214":-0.05630147741920601,"215":0.0028076258711553555,"216":-0.04347190287956644,"217":0.008738625473300453,"218":-0.21408831338801945,"219":-0.07844459922606965,"220":0.021321410873400358,"221":-0.09329861174245055,"222":-0.1489009170686738,"223":-0.14595118890120873,"224":0.009210100164101625,"225":0.014148418129746718,"226":-0.13640303887512617,"227":-0.17316119431438534,"228":0.0887165571034516,"229":-0.11042295952619657,"230":-0.06902466702440069,"231":0.015394289497589196,"232":-0.08566108801500985,"233":-0.03382926412332834,"234":-0.04726937589188531,"235":-0.0015124614187004165,"236":-0.20557589816354918,"237":0.020027691901323096,"238":-0.10150371575371159,"239":-0.1231276287803169,"240":-0.06341918080752525,"241":-0.04387693525649233,"242":-0.0019169245750428373,"243":-0.09744525189275483,"244":0.008622336787282374,"245":-0.24904926917178163,"246":-0.048449434640958154,"247":0.046631732635849785,"248":-0.08930210932334554,"249":0.03128033230587823,"250":-0.202329521675652,"251":-0.05789458452333149,"252":0.00597512233444336,"253":-0.13312623868717607,"254":-0.17543373309254603,"255":-0.11087922143729934,"256":-0.045075660289921625,"257":-0.0932516506601423,"258":-0.028235468238728294,"259":-0.014107567018861684,"260":-0.055670415852628385,"261":-0.25580162544478674,"262":-0.06304284544220824,"263":-0.1563064641144389,"264":0.010436852643774152,"265":0.025130087591348754,"266":0.02971755808621212,"267":-0.04663028475266765,"268":0.00343165152085688,"269":0.04665655837134126,"270":-0.18920984926523632,"271":-0.008478602255527773,"272":-0.1381594759257618,"273":-0.1776019962785862,"274":-0.0390121533342551,"275":-0.06458879798854146,"276":-0.30502218963575123,"277":-0.004609016419619462,"278":0.014164485871389266,"279":0.11925525551064554,"280":-0.06879288952826766,"281":0.020312811007385717,"282":-0.0180252688298158,"283":-0.0077932840177356005,"284":-0.24309378908791876,"285":-0.012859115676291586,"286":-0.06602471993697377,"287":-0.03270599318185362,"288":-0.08383742734214608,"289":-0.09413004160790879,"290":0.02561829379393892,"291":-0.2924646846929134,"292":-0.16349591639791733,"293":-0.1751813908237601,"294":-0.027844644937618124,"295":-0.14662051245023097,"296":-0.033250584023786715,"297":0.02203314604351521,"298":-0.13724053376657963,"299":-0.17683635016287846,"300":0.012318576460435117,"301":-0.033701822453938116,"302":-0.20687882642982902,"303":-0.03692481498528191,"304":-0.11723763290380242,"305":-0.020068866862992224,"306":-0.01812276240694448,"307":-0.010472249140866181,"308":-0.17094572269993658,"309":0.03539959850125896,"310":-0.11915266143253825,"311":-0.175517511769651,"312":0.13472235821084816,"313":-0.22187461133116146,"314":0.010242688071151574,"315":-0.1314124300312009,"316":-0.22466558858573482,"317":-0.170249282674556,"318":0.08980526951183976,"319":0.01234813055589486,"320":-0.0013968061773456824,"321":-0.004911856340439624,"322":-0.26484793850665694,"323":-0.07581306260464608,"324":0.0730376541321231,"325":-0.0639203787506238,"326":-0.19339224410409386,"327":0.16525417122177236,"328":-0.0294311442103823,"329":-0.07916506848303045,"330":0.03710362320818288,"331":-0.12030394780295119,"332":-0.009303742516484836,"333":-0.1159601772440704,"334":0.037243577263877524,"335":-0.1063956571050587,"336":0.005770389613304691,"337":-0.013131553296828587,"338":-0.17111782105934106,"339":0.020988944997482044,"340":-0.2120805199187004,"341":-0.04497667723441866,"342":0.0702883418785696,"343":0.0457239384893371,"344":-0.17549662200762955,"345":-0.01774608887329753,"346":-0.08124211827731469,"347":0.11291851806101066,"348":0.014546029642773694,"349":0.14668762183023784,"350":-0.008959448340321178,"351":-0.26691980809950866,"352":-0.09115283459707539,"353":-0.16827442668259776,"354":-0.026965664110982127,"355":0.009249484777072188,"356":-0.1194094372070528,"357":-0.014792843031687044,"358":-0.0514797963597379,"359":-0.052039880696236225,"360":-0.09975530477763196,"361":-0.13349223120304166,"362":-0.14355553823595876,"363":-0.22074535499649603,"364":-0.12385184235254829,"365":0.2099817433956063,"366":-0.23128973298313116,"367":0.04563719100489659,"368":-0.03339920121499429,"369":0.08379005680930166,"370":-0.04082457503556194,"371":-0.000980562269173569,"372":-0.01280837140428621,"373":0.04527913472535965,"374":-0.17885583070859135,"375":0.021202552257249697,"376":0.021285119532888957,"377":0.010526872399916138,"378":-0.04463252645465487,"379":-0.05846959669925567,"380":0.037977761162471785,"381":-0.13277294582481328,"382":-0.020139403218258613,"383":-0.05313454825533676,"384":-0.018913038921626064,"385":-0.15932345844311857,"386":-0.02165404866388806,"387":0.052660914558973496,"388":-0.04921743712323977,"389":-0.06265486560219591,"390":0.04156030795219416,"391":-0.05769018572377638,"392":-0.17300823909814034,"393":0.006135958054260832,"394":-0.07528036835501858,"395":-0.01455940329623265,"396":-0.08644861114073989,"397":-0.12233797168172514,"398":-0.18374474401006935,"399":-0.05431273310852858,"400":-0.0525529411794611,"401":-0.04490481216207741,"402":0.15858856178476585,"403":-0.11053580157635465,"404":-0.03780250777473563,"405":0.01759080129517648,"406":-0.06856332657371009,"407":-0.12758003715242572,"408":-0.057488223336297356,"409":-0.06626404742741497,"410":-0.0955546850248804,"411":0.0062221123692667675,"412":-0.10079984942466817,"413":-0.11009671459736414,"414":0.09706665170991571,"415":-0.037146469150584796,"416":-0.2686351062809748,"417":0.0829507969017873,"418":0.019854937797242653,"419":0.011147528940160563,"420":0.10840839396090982,"421":-0.17808052444327496,"422":-0.014257995404862852,"423":-0.21757692722572453,"424":0.08833726133887954,"425":-0.09337196154408174,"426":-0.038435875242954304,"427":0.02233275552263849,"428":-0.1088891616446207,"429":-0.03548170801004655,"430":-0.06209560894065787,"431":0.013906769891931212,"432":0.026090543662164453,"433":-0.010407292978913452,"434":-0.2221817442692986,"435":0.08783853035471989,"436":0.017156961440732345,"437":0.1063764717864748,"438":-0.06319708234007926,"439":0.07079988631311643,"440":-0.015204704660512373,"441":-0.23472727878484187,"442":0.10707441521642899,"443":-0.025731497195504445,"444":-0.017136467725287506,"445":-0.017496585199280972,"446":-0.18397286057066328,"447":-0.053254581599743014,"448":0.04434892394157692,"449":0.0652994412954272}},{"sx":1,"sy":1,"depth":450,"w":{"0":-0.027919475199635627,"1":-0.01295418650214308,"2":-0.06580717961593298,"3":-0.024557691982860293,"4":-0.0005926410935018925,"5":-0.012142481831191812,"6":-0.0011037362412509998,"7":-0.07416469998495608,"8":-0.04339375308214081,"9":-0.07278402123153123,"10":0.054585893326578275,"11":-0.2560183482357725,"12":0.024594176029269253,"13":-0.06722766645124009,"14":-0.16417931226802027,"15":0.034281417392974786,"16":-0.019765702544318156,"17":-0.0009516205736872265,"18":0.09584351836295694,"19":0.023347559470824626,"20":-0.0015111471200371582,"21":-0.10255126436410937,"22":-0.06079421192163995,"23":0.06415324078977612,"24":0.06483526865381169,"25":-0.10983374481433861,"26":0.019912865556823683,"27":0.0013375227060547152,"28":0.06146373524526599,"29":-0.22564350753028536,"30":-0.0786507444776085,"31":-0.046078899591226526,"32":-0.21278709140217222,"33":-0.04423721109699281,"34":0.0067867486080812126,"35":-0.007716305971363052,"36":0.09641367229526054,"37":0.02286355704956327,"38":0.005425656216472853,"39":0.0059414045406592925,"40":0.02505484088337601,"41":0.05125084281151702,"42":0.0020527590431377385,"43":-0.11155361639135845,"44":0.035606354301185784,"45":-0.06443855415295749,"46":-0.07382920921588909,"47":-0.17166200586096036,"48":-0.02515865820673391,"49":-0.022423004945054323,"50":-0.1794671960552789,"51":0.021262899144848448,"52":-0.080995756586678,"53":-0.08510528397091899,"54":-0.0641618171105226,"55":-0.007360293219720016,"56":-0.17332259318112817,"57":0.03505223504191887,"58":-0.0532190484401276,"59":-0.05469391746547128,"60":-0.0026364540725595112,"61":-0.16957048436298666,"62":0.019363921091549396,"63":-0.091097760092702,"64":-0.35497809877146674,"65":-0.10506504602053929,"66":-0.0005912334341614063,"67":0.026511916769526047,"68":-0.0013530105092954242,"69":-0.022227898861289584,"70":-0.14815256846553193,"71":-0.14632042209052587,"72":-0.14682279640722984,"73":-0.03272760094826385,"74":-0.2825561077449836,"75":-0.0807287833337295,"76":-0.08192485635340094,"77":-0.183347480946764,"78":-0.13365115092722385,"79":-0.10836561095404561,"80":0.024953419754088522,"81":-0.24273116281482357,"82":-0.15694119836607145,"83":-0.013116103719752848,"84":-0.010053675236248182,"85":-0.03960788695779418,"86":-0.007941919027350006,"87":-0.02064259500517708,"88":-0.03481884985408407,"89":-0.07432527959966735,"90":-0.0837510534113287,"91":-0.058505411635040805,"92":-0.05323999921728765,"93":0.06329196304116833,"94":0.008564743174086157,"95":-0.030629592394278777,"96":0.0026886683974345687,"97":-0.08820237960301529,"98":-0.043246859786557804,"99":-0.1449287444894679,"100":-0.006727809567180298,"101":-0.17311500205345984,"102":0.056563557075540054,"103":0.034376220663824626,"104":-0.014632524575417057,"105":0.061973383223482253,"106":-0.06810457629562017,"107":-0.003309410961584729,"108":0.08270938436518649,"109":-0.0817207486978502,"110":-0.039323489217288295,"111":-0.10034607150123086,"112":-0.03622181530099638,"113":0.07998118988867854,"114":-0.017124991146426297,"115":-0.2086361858332881,"116":0.05495150101278612,"117":-0.2517858797889075,"118":-0.04121310645899076,"119":-0.1125878328896557,"120":-0.03595620921636199,"121":-0.031086453977694162,"122":-0.23716455964554467,"123":0.03968148264058969,"124":-0.04270554118273288,"125":-0.01524172108239667,"126":-0.006173336751093053,"127":-0.017116363080749788,"128":-0.2384480870541122,"129":-0.11500943485016592,"130":-0.0378828493201892,"131":0.13716124406127805,"132":-0.057373917412985094,"133":-0.12354585536216481,"134":-0.14142554177885186,"135":-0.16108463460842185,"136":0.025298631797050775,"137":-0.068745039943345,"138":-0.04732289361382594,"139":-0.032943219249629604,"140":-0.09967163912199446,"141":0.003929642319398462,"142":-0.1530348515129065,"143":-0.10022642563141673,"144":-0.0330762427256285,"145":-0.054721012322238256,"146":-0.28488482263461307,"147":-0.12639243271751055,"148":-0.04413776225349615,"149":-0.11965837394515155,"150":-0.06031974218288904,"151":-0.033818235976406125,"152":0.03556096601659713,"153":-0.1344717856056637,"154":-0.05349995973555374,"155":-0.0682153119524974,"156":0.011420859544362236,"157":-0.04309609673938885,"158":-0.015666364791065195,"159":0.005857658047840604,"160":-0.2149125322059798,"161":-0.14632566586426626,"162":0.037727745960383155,"163":0.02312076327135177,"164":-0.23135088189840855,"165":-0.09386953228611754,"166":-0.08210106636293699,"167":-0.5054211046001781,"168":0.015997573130927107,"169":-0.015951232784058213,"170":0.04436515166745975,"171":-0.22595129632856364,"172":-0.015593582239346194,"173":0.01975484437037192,"174":0.002890993949710179,"175":-0.07611581644112259,"176":-0.053074989493823166,"177":0.03385865246558086,"178":-0.09268696213404981,"179":-0.1342947405017846,"180":-0.12024486942388776,"181":-0.05213244356341469,"182":-0.025052240942601448,"183":-0.19473210220797912,"184":0.025450194305341785,"185":-0.026697892409764914,"186":-0.0362231699302526,"187":-0.02895753796479012,"188":0.016623739989384934,"189":-0.21744034332870946,"190":-0.0446837086978414,"191":-0.05052232746734057,"192":0.009450506906405224,"193":-0.014177164167897459,"194":-0.026926109897474296,"195":0.05371690394058539,"196":0.022912882667567924,"197":-0.029158581637575787,"198":-0.06497992582722588,"199":-0.11688787007901363,"200":-0.02939660492991072,"201":-0.15791347673674114,"202":-0.0036320693715532005,"203":0.11288735319895692,"204":-0.02013780663036281,"205":-0.09255699233662468,"206":-0.015659189577267436,"207":-0.229865722733336,"208":-0.07154165422194174,"209":-0.004213506825113544,"210":-0.009941469980105849,"211":-0.041133401753599814,"212":-0.0955656396732929,"213":-0.005794944193102427,"214":-0.02119615198425853,"215":0.03768048661373462,"216":-0.028782963977880632,"217":-0.2279542209253293,"218":-0.1735556922316122,"219":-0.08898277840192917,"220":-0.04400280186299124,"221":0.001655033771408846,"222":-0.14812601139533055,"223":-0.017506916411554264,"224":-0.023391899513883978,"225":-0.2677859588073491,"226":-0.035952248314306344,"227":-0.0276302236152468,"228":0.050995217138184876,"229":-0.07165350858789535,"230":-0.014221950437630141,"231":0.014436387122370336,"232":-0.1276182495145058,"233":-0.23921009465772622,"234":-0.0345030924611292,"235":0.011829128213557596,"236":-0.11720598803164783,"237":-0.06417156639945665,"238":-0.031565124322597525,"239":-0.047445502829824134,"240":-0.10989335704792905,"241":-0.05642700670398852,"242":0.009305410727114126,"243":-0.1754725092270221,"244":0.04840925880383704,"245":-0.05552208964268867,"246":0.010959978471098787,"247":0.003440158039468792,"248":-0.1038360196861653,"249":-0.01595000001250568,"250":0.021585431708684974,"251":-0.2524458991237811,"252":0.04149726150691258,"253":-0.02805881210016865,"254":-0.08325371344468126,"255":0.004027693853920487,"256":-0.02744317153703665,"257":-0.02280582573132554,"258":-0.035700801619635514,"259":-0.05690248063037943,"260":-0.03399814070381429,"261":-0.1592303592840635,"262":-0.06852701751724162,"263":-0.061841792014704446,"264":-0.017138342694376564,"265":0.005683180660500578,"266":-0.19208958198137924,"267":-0.029467412011957354,"268":-0.004363416740620242,"269":-0.2297544047981751,"270":-0.16639627874189217,"271":0.016272450774049572,"272":-0.11496929490427725,"273":-0.08218560354835491,"274":-0.14586452455060478,"275":-0.09228295945611388,"276":-0.006408369252533316,"277":-0.09882708001073325,"278":0.040090292826458755,"279":-0.0867819212215915,"280":-0.021557227751094036,"281":-0.007334476160969498,"282":0.0007235188494215405,"283":-0.11993385368713469,"284":-0.07428393728929975,"285":-0.053821619815437496,"286":-0.07011884294726947,"287":-0.0028381577627049934,"288":-0.09554240701992782,"289":-0.027642200597343115,"290":-0.08277539763009337,"291":0.012045774403309357,"292":-0.013295566484557712,"293":-0.02125035166482519,"294":-0.11687233524962892,"295":0.0077428566366061465,"296":0.0338677685268521,"297":-0.10745382081698733,"298":-0.16112088727385182,"299":-0.091839807915774,"300":-0.03728963475435309,"301":-0.03042550709058094,"302":-0.05072850512938623,"303":0.045022967550965035,"304":-0.11590346150934251,"305":-0.08367394782294434,"306":-0.1283732039784177,"307":-0.3782396669072348,"308":-0.15222219314591295,"309":-0.060250417424157335,"310":-0.0916975009085844,"311":0.019762577120294056,"312":-0.19803927590868514,"313":-0.04329762280485016,"314":0.008203966595654089,"315":-0.2725483192842455,"316":-0.08091529461677993,"317":-0.04179275622456318,"318":0.041578225431948494,"319":-0.0032483907499201207,"320":-0.06051600777681616,"321":-0.0023107329680167508,"322":-0.08147589479772997,"323":-0.0691997179120837,"324":0.011788094465771448,"325":-0.19221499609345136,"326":-0.04127548576385769,"327":-0.3813497970608088,"328":-0.01625981857163722,"329":0.0007776632989446939,"330":-0.09985961576465179,"331":0.002662289600888431,"332":-0.018244780656348936,"333":-0.09639904171204029,"334":-0.041514197414921475,"335":-0.07279942146928148,"336":-0.052025257704640795,"337":0.0404463863782654,"338":-0.06117651803648989,"339":0.07639163001661552,"340":-0.11976235323687062,"341":-0.2831059596077464,"342":0.03312277816397941,"343":-0.17934149422082032,"344":-0.07846426439402512,"345":-0.1642251996512882,"346":-0.06786010777843562,"347":0.01733005954221032,"348":0.09092267624407147,"349":-0.20072508201671896,"350":-0.003163952086357504,"351":-0.09794149062566566,"352":0.002815168228844255,"353":-0.07710472151803922,"354":0.07899182420559296,"355":0.020832274223947417,"356":-0.11612654995045431,"357":0.06254155548668362,"358":-0.08013070628671774,"359":-0.22430386635847166,"360":-0.05973266712869012,"361":-0.009533270818030699,"362":-0.07617108425289332,"363":-0.0237441836111976,"364":-0.10285792175286415,"365":-0.08318092688928841,"366":-0.031987148289225074,"367":-0.06175239064368192,"368":-0.057788385016347026,"369":-0.11656807535183439,"370":-0.09066265482560602,"371":-0.1065197323180733,"372":-0.04221206016438037,"373":-0.006245967299151399,"374":-0.13636003212246897,"375":0.012540191550521355,"376":-0.035415839864252126,"377":0.011880785080866364,"378":-0.044913355391720824,"379":-0.14996047199647022,"380":-0.06404073850772204,"381":0.01754541770925275,"382":-0.05216796152370906,"383":-0.11840053509632509,"384":-0.04556837945856879,"385":-0.029932012048763557,"386":0.06454016272838357,"387":-0.1475063889257154,"388":-0.0997796858069517,"389":-0.05645241799678894,"390":-0.019609169953391056,"391":-0.11439939769924846,"392":-0.09916527413939151,"393":-0.008978056362148986,"394":-0.12282972601073752,"395":-0.045384561013119516,"396":-0.21772917661166993,"397":-0.17464419387687485,"398":0.11189510757897872,"399":-0.1644652136994252,"400":0.004094930343563856,"401":-0.140211488595823,"402":0.05368614701161077,"403":-0.03767502448371583,"404":-0.03403847362158669,"405":-0.031665237466228596,"406":-0.06345980557164678,"407":-0.20797173615491524,"408":-0.04405478842764869,"409":-0.09109336027233686,"410":-0.1299592133372178,"411":0.021748694070527392,"412":-0.07671109363087149,"413":0.013181140405136252,"414":-0.25248292194188277,"415":-0.25265953693260046,"416":0.020973213547740725,"417":-0.43635046224660173,"418":0.03226801476344264,"419":-0.014733704961336306,"420":-0.08939560472099785,"421":0.05973763091260657,"422":0.06684631175963894,"423":-0.08471756253323216,"424":-0.05116590693047036,"425":-0.105974707018285,"426":-0.02247446781633248,"427":-0.012851412448850618,"428":-0.1874518226164348,"429":0.023430200664942342,"430":-0.09260754944586576,"431":-0.06909102681168922,"432":-0.26297359031551654,"433":-0.22671505706468004,"434":0.10114857439653933,"435":-0.3034819829105461,"436":-0.033556137161631416,"437":0.11517634638304812,"438":-0.03319567395388562,"439":-0.19643919822850425,"440":0.06760402438194188,"441":0.04578239879066373,"442":-0.0668078802079444,"443":-0.04849161141291867,"444":-0.02686165969456185,"445":0.05582241463329461,"446":-0.1610909391785545,"447":-0.03594598807730989,"448":-0.2294639377158631,"449":-0.09377118013419779}},{"sx":1,"sy":1,"depth":450,"w":{"0":-0.018331003183474918,"1":-0.11515019028556085,"2":0.007304370884883032,"3":-0.0561395932875048,"4":-0.06013468899262366,"5":-0.07452642517260923,"6":-0.06750638073241083,"7":-0.044704177279451716,"8":0.03591063638756453,"9":-0.03922863800018461,"10":0.04966975533312217,"11":0.03707325259643581,"12":-0.0944048389063569,"13":-0.037127096304788366,"14":-0.13305027239575404,"15":-0.05849096660751367,"16":-0.04101979350046852,"17":-0.07250634999112109,"18":-0.22330103904416101,"19":-0.1663534079464256,"20":-0.014788944289641944,"21":-0.028610407446595872,"22":-0.0029327036948022913,"23":-0.05325609946110707,"24":-0.08534730137594645,"25":-0.1002645821735951,"26":0.006488609643042218,"27":-0.04181448874045496,"28":0.05018689925260103,"29":0.08511339717416028,"30":-0.043333056322760716,"31":0.09638013907408266,"32":-0.2764209115859989,"33":0.06241908447175209,"34":-0.10103487920390845,"35":-0.06435377407383949,"36":-0.08652176440458063,"37":-0.020822228008005112,"38":-0.1887809751573039,"39":-0.21857904992134877,"40":-0.00442313531969312,"41":-0.07905828156412778,"42":-0.004484829099916918,"43":-0.06967327824058131,"44":0.018764688315395697,"45":-0.10264062917864351,"46":0.06874535307496511,"47":0.02175503873358149,"48":0.008955356321465184,"49":-0.04578256160451618,"50":-0.12561253755029417,"51":-0.013841488835573538,"52":-0.14707479426236095,"53":-0.02098364921683226,"54":0.02404554221714441,"55":0.0461315549177421,"56":-0.12389549481327283,"57":-0.10517300797550987,"58":0.08260436330089058,"59":0.01507974948099946,"60":-0.05867274799228188,"61":-0.09209097150780768,"62":0.02683859411570267,"63":-0.2302541900971238,"64":-0.04032960462300304,"65":-0.07047975166804354,"66":-0.1377602113427412,"67":0.01767140827881455,"68":-0.07789216023127125,"69":0.04823802069766117,"70":-0.11389507214376421,"71":-0.04310698669602531,"72":0.01979367113486991,"73":0.042288712898189536,"74":0.012124281855088792,"75":-0.061049640276816794,"76":0.013556198943645952,"77":-0.050319007856827476,"78":-0.0598410209530577,"79":-0.07124930368979926,"80":-0.016880595415612713,"81":-0.1850530076494411,"82":-0.009389590028819048,"83":-0.19334649496716938,"84":-0.058370253736812434,"85":-0.03848359241775382,"86":-0.14562680892590543,"87":-0.009015005355617136,"88":-0.11369675198380531,"89":0.004594424963535393,"90":-0.08677910946638959,"91":-0.12646409929484348,"92":-0.055861276791140224,"93":-0.013830349133472608,"94":0.1107018817446654,"95":0.02310823334439247,"96":0.03477019142821299,"97":0.0039863125995044475,"98":-0.024964955759109887,"99":-0.17964482540714294,"100":0.014318529791344688,"101":-0.115990709750429,"102":0.06483750809520347,"103":0.0724194546919652,"104":-0.12825380863407926,"105":-0.014568285454593537,"106":-0.05619533755066822,"107":-0.017006541413043454,"108":-0.18867256275873517,"109":-0.15632320285774276,"110":-0.017051831366413136,"111":-0.15528839560495147,"112":0.019803473476905097,"113":-0.10293580727557432,"114":0.019964164863930857,"115":-0.027687933510883767,"116":0.0949806971377229,"117":-0.20067026919186692,"118":-0.041307798528589484,"119":-0.09555497037897737,"120":-0.001691182552853683,"121":0.041274189997243596,"122":-0.2721272307229342,"123":-0.022113745723858026,"124":-0.14409919894161757,"125":-0.05380456977503431,"126":-0.16332851417478927,"127":0.06513100217672499,"128":-0.23149038395746135,"129":-0.29848254927580314,"130":-0.07434726951003857,"131":-0.11952470272769315,"132":-0.08468166443697298,"133":-0.01270787550869602,"134":-0.027236748827541523,"135":-0.27471123179890106,"136":-0.05045886209106816,"137":-0.057121367115048984,"138":-0.001791439586890171,"139":0.033822615656979575,"140":-0.30613478431137603,"141":0.03822826235797643,"142":-0.24173851427118087,"143":0.013467978319243751,"144":0.014721267747364352,"145":0.04802318172561029,"146":-0.18564178195568679,"147":-0.2803729623969897,"148":-0.010295972946339564,"149":0.034096202806128455,"150":0.0095267475149433,"151":-0.06539480216357683,"152":-0.015976629346273755,"153":-0.19803405544060884,"154":0.029110809029939736,"155":-0.13520389207075137,"156":0.0037069126680158173,"157":-0.003559997000065424,"158":-0.2125285880515187,"159":-0.06601120049389612,"160":-0.2014484142993809,"161":-0.024953013301769897,"162":-0.06486715117763713,"163":0.05604453489348659,"164":0.013053686254417314,"165":-0.12356064072334523,"166":0.06232250784730656,"167":0.14526035889694588,"168":-0.12344818638855456,"169":0.07552268330075575,"170":-0.033609885550666914,"171":-0.2683249756019977,"172":-0.02873844739898921,"173":-0.0100148622128589,"174":-0.05626411044139307,"175":-0.020369043004145312,"176":-0.06838993479115371,"177":0.010677233168152481,"178":-0.1558742297433134,"179":0.19054740632583742,"180":-0.07115239365533964,"181":-0.08588038053148585,"182":-0.017931830823195896,"183":-0.1946389716687707,"184":-0.047882813982665175,"185":-0.18980135112790775,"186":-0.022399058264394818,"187":-0.1168710813994573,"188":0.019504136035688218,"189":-0.19327985531428196,"190":0.122395378883266,"191":-0.10500719912483678,"192":0.018400459539036906,"193":0.055926094914884934,"194":-0.04960906098557225,"195":0.011656067109466641,"196":-0.0070724676222831285,"197":0.016043190463242086,"198":-0.22279054852838906,"199":-0.13619317914845194,"200":-0.05175223006087794,"201":-0.10834825316950657,"202":-0.06086013726517506,"203":-0.06153714403324161,"204":-0.09614864602644733,"205":-0.11824186640594872,"206":0.011654552470753667,"207":-0.16025447155920014,"208":-0.0051238266840761635,"209":-0.14376378422534594,"210":0.060394391664816076,"211":0.06765900364393211,"212":-0.12297980444617478,"213":0.017091841825866483,"214":-0.12981304427358345,"215":-0.03354253171061588,"216":-0.2101598267201773,"217":0.10129361709080631,"218":-0.286380548044805,"219":-0.20481601689680817,"220":-0.07810088044125318,"221":-0.1497358332367202,"222":-0.16832431837555306,"223":-0.06954556682299186,"224":0.0627616786392476,"225":-0.18424042510003297,"226":-0.07645223087034796,"227":-0.08680934493867185,"228":-0.03040068812410184,"229":0.1030404768227823,"230":-0.10530148192399222,"231":-0.02022707335988761,"232":-0.1809778887529476,"233":-0.06695369958717268,"234":-0.05882647325486916,"235":0.1356785739849943,"236":-0.3163739778986736,"237":-0.10841488830389334,"238":0.007352952145438661,"239":-0.004161786009731204,"240":-0.05887497529953402,"241":0.013111458231648953,"242":-0.04199345778674544,"243":-0.22639869647732408,"244":-0.03115875173553711,"245":-0.04586057582060001,"246":-0.04407693052104546,"247":-0.017725277392193334,"248":-0.18080974075527892,"249":-0.004304148118836337,"250":-0.13159381186432276,"251":0.0022077144044016614,"252":-0.009847402370150058,"253":0.17633739419094685,"254":-0.15396412923892944,"255":-0.05543360263613003,"256":0.05556133010105491,"257":-0.020140007162092462,"258":-0.051154219695369166,"259":0.0709069875451263,"260":0.0994159421519473,"261":-0.1564274566082011,"262":-0.11150794808429773,"263":0.027590914312035645,"264":0.09957363574751425,"265":0.02620677660267465,"266":-0.036364443566229206,"267":0.08813950675573091,"268":-0.09654429111553063,"269":0.14516067014044154,"270":-0.011593249698158144,"271":0.020149993059670107,"272":-0.037654458409919836,"273":-0.07060992078167516,"274":0.001360238659202682,"275":-0.06871710211515009,"276":-0.09118060022722217,"277":-0.001032394974733061,"278":-0.003997395363467822,"279":-0.02118421285292804,"280":0.015529296163616086,"281":0.027240221228100176,"282":-0.06404919871688251,"283":0.0736835504515,"284":-0.02836416000330433,"285":-0.022388449241901746,"286":-0.08827525540800388,"287":0.06733375519103367,"288":-0.18011289874401112,"289":-0.12293963954378707,"290":-0.20213768608334418,"291":-0.09051663971598678,"292":-0.05853093444109781,"293":-0.15580418412459301,"294":-0.13097504801519455,"295":-0.0283301119318755,"296":0.06365851938904096,"297":-0.1810758856400624,"298":0.005353761260841727,"299":-0.020012610289015024,"300":-0.05314778290806025,"301":-0.004227312298541088,"302":-0.16914995839016878,"303":-0.018142188051148513,"304":-0.04910717449484993,"305":0.0500000140443779,"306":-0.3645406060774534,"307":-0.08046877757674621,"308":-0.18728624527206425,"309":-0.25070570508712964,"310":-0.023339468842170596,"311":-0.16353827058705137,"312":-0.11988126373512745,"313":-0.09974739919338738,"314":-0.03321487558786441,"315":-0.17043172741969934,"316":-0.12733250578055896,"317":-0.06028121774762781,"318":-0.013554508665349851,"319":0.05754717967884181,"320":0.0200673834868391,"321":-0.011195370540562999,"322":-0.1727166380018183,"323":-0.11538206280514111,"324":-0.17477268687667344,"325":-0.11382192775412378,"326":-0.16006386293730931,"327":-0.3478162274677445,"328":-0.040188002789731225,"329":0.11573451586596198,"330":-0.1159839186089783,"331":-0.11663776520816946,"332":-0.012030013286818908,"333":-0.1510275227190089,"334":-0.09923112355175683,"335":-0.08483800934537546,"336":-0.009142065153127122,"337":0.04997880308090633,"338":-0.06589025428666656,"339":0.005039971848443328,"340":-0.2288447966081139,"341":-0.007121309007941685,"342":-0.02395164104566358,"343":-0.08233931425440151,"344":-0.05986971972645457,"345":-0.08924848498006957,"346":-0.009963028918475147,"347":0.10498848735316031,"348":-0.0912732185665998,"349":0.039461147310220775,"350":0.0009621523174641023,"351":-0.06882589746126637,"352":-0.022921449309248724,"353":0.04967652357448885,"354":-0.042196413242817435,"355":-0.056302040188023816,"356":-0.0220182856841266,"357":-0.05584050333646754,"358":-0.15196790382307632,"359":0.07132088963557813,"360":-0.00665252679968958,"361":-0.06400505024514355,"362":-0.0650256402704567,"363":0.023688902780200485,"364":-0.038838521687859215,"365":-0.10347918688475395,"366":-0.0967941188001757,"367":-0.07204061999061077,"368":-0.0013876926546872047,"369":-0.04008730262019339,"370":0.041029302260544145,"371":-0.03342923893153485,"372":-0.009788657887979321,"373":0.014256159797185763,"374":-0.16756539161876763,"375":-0.030351561948224397,"376":-0.041338803680490054,"377":0.13480649161838923,"378":-0.0220561932530818,"379":-0.11169618214982918,"380":0.08009825867340178,"381":0.02998148168204036,"382":0.07689336927795098,"383":-0.21443549613649457,"384":-0.04539024594550296,"385":0.042870438064420355,"386":0.04656283895026577,"387":-0.037437281249028564,"388":0.01619994186257871,"389":0.0016499517654363844,"390":-0.14788790224682077,"391":0.12509168236985982,"392":-0.1245380835426394,"393":0.033212980489851274,"394":-0.007172991628888831,"395":0.009462576848849503,"396":-0.2604344609750651,"397":-0.13295924566397738,"398":-0.005868779842782082,"399":-0.15283996360792432,"400":-0.0018636334585408337,"401":-0.0038160804455297103,"402":-0.18294118902434553,"403":-0.021661262714751637,"404":-0.030380750630405722,"405":-0.10540614022843657,"406":-0.06390805805532915,"407":-0.13822105981393057,"408":-0.003632342329688295,"409":-0.03492391441748034,"410":-0.1302259994562119,"411":-0.021154579679302465,"412":-0.11029543462323378,"413":-0.06047714865104919,"414":-0.07749437850437221,"415":-0.3066907333487394,"416":-0.09900223152598087,"417":-0.25464694516976777,"418":0.03545142815181048,"419":0.10733501019788114,"420":-0.0619867356143895,"421":-0.13063644632586294,"422":-0.009505711257573811,"423":-0.1402006737834577,"424":-0.06975052478408543,"425":0.00004776973879807616,"426":-0.0229424493111964,"427":-0.05637248481933453,"428":-0.03989231997211679,"429":-0.06492811934925366,"430":-0.16417503307270057,"431":-0.18253261502896884,"432":-0.09559707015685273,"433":-0.32090843741360076,"434":-0.06483029189453289,"435":-0.24351948473595542,"436":-0.01681901759599523,"437":0.14916408000100323,"438":-0.16233756284561507,"439":-0.21017319731907885,"440":0.03513422618236298,"441":-0.05578628500175489,"442":-0.007422373666367124,"443":-0.09863427634292335,"444":-0.07949093546319613,"445":0.002303368857917508,"446":-0.13358729180678536,"447":0.004112864772911133,"448":-0.16914890061378468,"449":-0.1929108746981048}},{"sx":1,"sy":1,"depth":450,"w":{"0":-0.0027483423425251345,"1":-0.02810071261430781,"2":-0.12562493671296648,"3":-0.19195651905782243,"4":-0.017510915250274445,"5":-0.17317324076484716,"6":-0.07755473882892498,"7":-0.06667132971157169,"8":0.005780382269785297,"9":0.0756326647524544,"10":-0.08527455394264488,"11":-0.09476964933239695,"12":0.0024137562744526012,"13":0.036942416092675304,"14":-0.030636485759959673,"15":-0.013473298007036014,"16":-0.057782623798783087,"17":-0.010701644259402648,"18":-0.26630627616735797,"19":-0.19853400757420447,"20":0.008200869051926185,"21":-0.09426691023848174,"22":-0.0057936733217451,"23":-0.0738791893794966,"24":-0.015646848463522246,"25":-0.18071647301117147,"26":0.0183513013323615,"27":0.022332724462959804,"28":-0.1923244557873989,"29":-0.10823755246637771,"30":0.000865419372541027,"31":0.009078212499187475,"32":-0.0027157226151862043,"33":-0.036397483878087535,"34":-0.018143128775490885,"35":0.059524293297944314,"36":-0.16502256306840923,"37":0.09826988545418602,"38":-0.0677785392441248,"39":0.024341441399770826,"40":-0.10386499976868939,"41":-0.2732705556881755,"42":0.029755399394867977,"43":0.03643646953786187,"44":0.037255987698301345,"45":-0.01849647141056146,"46":-0.0650956194647274,"47":0.02101838248427128,"48":-0.05360767956520154,"49":-0.00835988882046495,"50":-0.05472441816624248,"51":0.044093534300627124,"52":-0.05821968370190609,"53":-0.09503603293229397,"54":-0.0521152299608558,"55":-0.021361286007067555,"56":-0.007384615164844268,"57":0.007133562893336757,"58":0.04162992551958464,"59":-0.06510839145255001,"60":0.01844528393592629,"61":-0.062727714798278,"62":-0.05228003307184549,"63":-0.11104973435215942,"64":-0.12802514913570615,"65":0.05373026908563657,"66":-0.07220551376217461,"67":0.006393649103841549,"68":-0.01146072002422821,"69":-0.0169523496876915,"70":-0.016244444147778793,"71":-0.051531349734801016,"72":-0.16554169671786112,"73":0.03762739277482821,"74":-0.028052103819803498,"75":-0.07916072221367963,"76":0.01867089982258992,"77":0.0326587051596231,"78":0.06426105193355386,"79":0.10343202373151332,"80":-0.006597813238150539,"81":-0.059497653002040414,"82":-0.0779846580843163,"83":-0.013531751137124156,"84":-0.10585819365941482,"85":0.059838009187248804,"86":-0.06893579064386529,"87":-0.07446627414187772,"88":0.032294741608726994,"89":0.03683319246395775,"90":-0.10743140574151963,"91":-0.0011997125276996335,"92":0.0308350008860618,"93":-0.08446036545896753,"94":0.007815106818465936,"95":-0.1155113682388771,"96":0.006741382924716395,"97":-0.09941920377422264,"98":-0.027322996746043784,"99":0.006028317309859903,"100":-0.024425334415253623,"101":-0.1222756334679609,"102":-0.0999960769673881,"103":-0.0005744511814853542,"104":-0.06009469352573448,"105":-0.004411693305649183,"106":-0.03426123266979176,"107":0.02732749937542061,"108":-0.14143265429773072,"109":-0.21047341704679462,"110":-0.028820562546133997,"111":-0.020837819803900554,"112":-0.004148272136465764,"113":-0.163629133669354,"114":-0.002719946856596189,"115":-0.20024939405374254,"116":-0.000008672599712625654,"117":0.07969186902350602,"118":-0.12149702863030752,"119":-0.09573619006764894,"120":0.004381028253202182,"121":0.003815390847039158,"122":0.025046693907086814,"123":-0.0017348562734689102,"124":-0.19053834593285224,"125":-0.038954864453203904,"126":-0.14361548667669968,"127":-0.12159234917569527,"128":-0.031053804750239795,"129":0.10571412885394932,"130":0.04963958241924583,"131":-0.16330790833863282,"132":-0.03866284580989867,"133":-0.14556206762540105,"134":-0.02158541096926672,"135":0.0346929745456117,"136":-0.1917574441428388,"137":-0.16171263590492987,"138":0.028194307877890824,"139":0.015193608268948867,"140":-0.033511136810078265,"141":-0.1010373339271698,"142":-0.026238718817871924,"143":-0.042610591437119975,"144":-0.22154962987177454,"145":-0.05574294761988482,"146":-0.08099623406361031,"147":0.1031298564119632,"148":-0.04101792076931473,"149":-0.020763405671314152,"150":0.008391242059520024,"151":-0.13171891696091623,"152":-0.009888543713779884,"153":-0.008369841554122381,"154":-0.27888664885906744,"155":-0.044176902745562144,"156":0.00770617736823185,"157":-0.010039694945957805,"158":-0.055599754983371996,"159":0.0779656862985868,"160":-0.0018747937504364578,"161":-0.04459835655321691,"162":-0.2944691862998879,"163":0.011662149961371956,"164":-0.10896777561721001,"165":0.027396424523372667,"166":-0.028187413237985456,"167":-0.044247738115845564,"168":0.007832060693773455,"169":0.05989364750468386,"170":-0.07216662771940874,"171":-0.19212897638131265,"172":-0.26645639848770314,"173":-0.03514731520961599,"174":-0.01187468919024523,"175":0.011672471351455995,"176":-0.06614693036101772,"177":0.015219965845847632,"178":0.003480807606854754,"179":-0.08983423295618263,"180":-0.10302599616051548,"181":0.06724257959643648,"182":-0.12915321057022117,"183":-0.08153470100343994,"184":0.002015859777971617,"185":-0.17528034069933304,"186":-0.05419188460101229,"187":-0.14386790203370248,"188":-0.007277501361427968,"189":-0.004822178940473238,"190":-0.06291514119947471,"191":-0.042228592416489755,"192":0.03880290745228183,"193":-0.04013138215184133,"194":-0.05488454713986755,"195":0.09549345784878926,"196":-0.14461149470922458,"197":0.0330846180252009,"198":-0.061728365678013424,"199":-0.0950058094943701,"200":-0.008251896341832434,"201":-0.06914860312150015,"202":-0.08351791613516506,"203":-0.10591817339198037,"204":0.02048818258115325,"205":-0.012034128091803207,"206":-0.08776249915717191,"207":0.032411504235525544,"208":-0.14763162019370452,"209":-0.011080306564329843,"210":-0.054812062424220834,"211":-0.07116262678096666,"212":-0.11883971329892284,"213":-0.025782748804800762,"214":-0.28333358515880175,"215":-0.03803857045275,"216":-0.05041517409995534,"217":-0.17794091794682043,"218":-0.07221417149022662,"219":0.12375242907281944,"220":-0.007380407952691119,"221":-0.12446320596243207,"222":-0.14255970295742232,"223":-0.11604410139183692,"224":0.07327875980092771,"225":0.11111341413246571,"226":-0.2036898108139381,"227":-0.02696809802326628,"228":-0.007832396397097924,"229":0.01713119597648346,"230":0.09292991935595663,"231":0.059665998350402906,"232":-0.20996256294838475,"233":-0.15171773439931482,"234":-0.14407592974304495,"235":-0.08818777480870504,"236":-0.22822268697819822,"237":0.10757237737803084,"238":0.012398710834016015,"239":-0.14153954780302078,"240":-0.03544890502055893,"241":-0.1273966455212016,"242":-0.028830974272936714,"243":0.03225366551179963,"244":-0.328182606784574,"245":0.026265059448192574,"246":0.02720725382568328,"247":0.01338053714208289,"248":-0.07861422008682564,"249":-0.012415694803688655,"250":-0.04477004135723754,"251":-0.08580742894215684,"252":-0.26335429798574345,"253":-0.028617835644468646,"254":-0.23468033321504753,"255":0.02086294958023945,"256":-0.04485130696073669,"257":-0.12036859186158122,"258":-0.05577602857218385,"259":-0.01361807342545762,"260":-0.057077707554876574,"261":-0.12831241866923412,"262":-0.28023445800102437,"263":0.03499142197809472,"264":0.04553154530054139,"265":0.012140368681945627,"266":-0.05329456526674122,"267":0.007132096075645218,"268":0.11376700273118803,"269":-0.0794728765082039,"270":-0.0597220503790488,"271":0.023236858986437806,"272":-0.11291835283096222,"273":-0.005844354883784925,"274":0.041848494237574356,"275":-0.05463510743425752,"276":0.005110663478199714,"277":-0.08586690166333569,"278":-0.0016531257095433918,"279":-0.0913514290609907,"280":-0.04037094907738854,"281":-0.04276781305640665,"282":0.03948621974105819,"283":-0.017903332595141878,"284":-0.0576656991250394,"285":-0.007608649370814187,"286":-0.13213237113123297,"287":-0.050975397110916455,"288":0.01829130762820205,"289":-0.11622659354719292,"290":-0.1027829507749535,"291":0.09888635929953396,"292":-0.0449902661542017,"293":-0.11748320272370442,"294":0.021344967670745698,"295":-0.09842510042457987,"296":0.04444569042166209,"297":0.06310669880766474,"298":-0.0829018044244803,"299":-0.0012953547478550978,"300":-0.003208894776169695,"301":-0.037518910448435916,"302":0.011470678553240441,"303":-0.015164975440736037,"304":-0.18927469217881204,"305":-0.09032865805540087,"306":0.1529520283948429,"307":-0.07789390582196867,"308":-0.09905339994183497,"309":0.10595720925457323,"310":-0.09979263798145721,"311":-0.0917543292828529,"312":-0.08331083725353311,"313":-0.029549303161985348,"314":-0.03985788879862814,"315":0.029729912808718412,"316":-0.11301338656759997,"317":0.14180044646484616,"318":-0.007688541292731383,"319":0.013197048298454916,"320":-0.06949875809665694,"321":0.025288045621595936,"322":-0.09340906289719028,"323":-0.0836577845887066,"324":-0.1382424509798033,"325":-0.1418722586843133,"326":-0.2987670549393875,"327":-0.09485101826274901,"328":0.00823122672128263,"329":-0.2887723500614776,"330":-0.027095595196547837,"331":-0.1788843309750501,"332":0.03644091728396103,"333":0.05147251586267688,"334":-0.3216913988418036,"335":0.12255972765667451,"336":0.0015589701015746684,"337":0.0006371484767245919,"338":-0.0778591510564144,"339":-0.0015339750061473811,"340":-0.07584285686619723,"341":-0.10812194504901142,"342":-0.30062294720353316,"343":-0.009305859907426453,"344":-0.3484211490195384,"345":-0.17415436964765374,"346":-0.023472713495294308,"347":-0.2174583715304598,"348":0.004807592102510774,"349":-0.162182392082209,"350":-0.06555343904243525,"351":-0.11429047861837807,"352":-0.30729993111636483,"353":0.03834195763019455,"354":-0.071811774080921,"355":-0.04855479160705523,"356":-0.09303374302520752,"357":-0.09202953631744883,"358":-0.04497947998676088,"359":-0.05491657959978368,"360":-0.08330508841326129,"361":-0.07252954226468591,"362":-0.08085915912315272,"363":-0.02019488083373079,"364":0.11183446599473862,"365":0.03925443602305098,"366":-0.032808197854186996,"367":-0.05746395193090453,"368":0.0430907994381352,"369":-0.13756943396862442,"370":-0.1792764909335367,"371":-0.051829350854132976,"372":0.0757621533319832,"373":-0.01883353642254251,"374":-0.0680507487736795,"375":-0.011319018863938629,"376":-0.03286355455249494,"377":-0.014295286187908835,"378":-0.010524129397996749,"379":-0.01939589274350057,"380":-0.11407619263936418,"381":0.07249125971041012,"382":-0.0022136089646980625,"383":-0.03189544917504609,"384":0.022730771386354265,"385":-0.057911154591636475,"386":-0.041786390203688906,"387":-0.1307440274904216,"388":-0.08629148317759194,"389":-0.0779003529028032,"390":-0.05130171322188098,"391":0.004110363043486109,"392":0.024531998714869,"393":0.05580677838107628,"394":0.02439914530822223,"395":-0.005077877171282884,"396":0.12625049886132725,"397":-0.1723482114820191,"398":-0.10778771351205661,"399":0.023631016143754853,"400":-0.01081270842133515,"401":-0.1588404589924923,"402":0.007565680842589836,"403":-0.03924859571809496,"404":0.011750763372001993,"405":-0.16229863898151073,"406":-0.09272264836436352,"407":0.04418122164051283,"408":0.05654697420748212,"409":-0.0449153839066623,"410":-0.11463546934946722,"411":-0.03643761361191922,"412":-0.05999520373693128,"413":-0.055139885044635094,"414":0.07155066522692677,"415":-0.190912264879401,"416":-0.20014820987173657,"417":-0.15880855303630487,"418":-0.0916367766638242,"419":-0.3744281018320927,"420":0.012880932974540208,"421":-0.03568603687318875,"422":0.020212335646095352,"423":-0.07058557852764352,"424":-0.20376191218950043,"425":-0.018567515094814035,"426":-0.012251241314756687,"427":0.045434494865899795,"428":-0.04597112933297289,"429":0.04097084420966183,"430":0.01360589094160542,"431":-0.015074965208630046,"432":-0.10274924673124997,"433":-0.07090256969084154,"434":-0.2866197977745732,"435":-0.2080140911245015,"436":-0.11239507002962902,"437":-0.3802719481738305,"438":-0.12225967029124495,"439":-0.2600999377656122,"440":0.006530292013095771,"441":0.008033007144566652,"442":-0.13124143785451603,"443":-0.05308205948003119,"444":-0.03447335639578274,"445":0.018876281911770605,"446":-0.1467169431672784,"447":-0.004046360587136115,"448":-0.0785597929418071,"449":-0.08547152288355642}},{"sx":1,"sy":1,"depth":450,"w":{"0":-0.06324137122141481,"1":0.0037926391589454657,"2":-0.1454497755552521,"3":-0.08783849278533945,"4":0.0889384926134205,"5":-0.16806219476743076,"6":-0.12949698025391831,"7":-0.0823962506426287,"8":-0.04173838893463353,"9":-0.14329973026727708,"10":-0.41925360497503444,"11":-0.13518216359594298,"12":-0.03134572925881367,"13":-0.09197075769050424,"14":-0.012232409542701186,"15":-0.02638747590918805,"16":0.05067785897355257,"17":-0.04224274912279429,"18":-0.06841495041720634,"19":-0.006626822606357883,"20":-0.02267499138554749,"21":-0.05869810286539983,"22":0.12301419369332599,"23":-0.15972839722046092,"24":0.005304176914970688,"25":-0.1444648609117741,"26":-0.01814271193775745,"27":-0.0680538313549575,"28":-0.029951480918485797,"29":-0.24520414403919044,"30":-0.01782333317042274,"31":0.05189861226116363,"32":-0.11724178135840281,"33":-0.0033162964690221517,"34":-0.10991758833293859,"35":-0.07546949754569621,"36":-0.04625736430423582,"37":-0.08374062006202308,"38":-0.023081766173964444,"39":-0.18423726086823505,"40":-0.034262294564049826,"41":0.09101777537486398,"42":-0.03129524785815615,"43":-0.15840339542885473,"44":0.06569783077262036,"45":-0.0028175660086909335,"46":0.06500714815361713,"47":-0.1938862406784202,"48":-0.06109173730859702,"49":-0.08217033694417555,"50":-0.22091334344979352,"51":-0.001801610875340139,"52":-0.16990430508407223,"53":-0.008844347649967393,"54":-0.09273953381186878,"55":-0.17934309916756763,"56":0.09950184303497304,"57":-0.14873464467649883,"58":-0.06329724840221836,"59":0.13325787449998863,"60":-0.14226447293890662,"61":-0.11014385684180532,"62":-0.008461851405639953,"63":0.09336836040687181,"64":0.21132106655342958,"65":-0.2854220460173108,"66":-0.021981428553194914,"67":0.01764422933247151,"68":-0.3061584426444794,"69":-0.02412783686222086,"70":-0.012178242632890184,"71":0.015672903020701217,"72":0.05844130244493278,"73":-0.13501229692924227,"74":0.07743476904037258,"75":-0.17552355935572703,"76":-0.011644064682154898,"77":0.14818611468426907,"78":-0.008341029777460972,"79":-0.030339395787875006,"80":-0.007981582696987777,"81":0.010592130262849362,"82":-0.025199787367644846,"83":-0.06033608744275663,"84":-0.05746918885590393,"85":0.057664327468650516,"86":-0.15235247087593906,"87":-0.013909071571502313,"88":-0.1316371030234035,"89":-0.0534363548135356,"90":-0.049325841604818864,"91":-0.0253040850682973,"92":-0.11351714283783029,"93":-0.11021943808172452,"94":0.038013473517674735,"95":-0.33062079459703375,"96":-0.1451124051667325,"97":-0.07524175097325611,"98":-0.010777959521144137,"99":-0.02379679854148896,"100":-0.1393560181914652,"101":-0.10453395511696598,"102":-0.028546746866871437,"103":-0.02659312036242566,"104":-0.07902177377274283,"105":0.01695706528998785,"106":-0.022041867676189514,"107":0.01293588342297739,"108":-0.12056989126369078,"109":-0.10764942279081646,"110":-0.02098954521738581,"111":-0.09013598265498597,"112":0.017090151142024265,"113":-0.4312108188225918,"114":-0.140706878047694,"115":-0.2640153551570192,"116":0.07349696562825493,"117":0.01242579460232784,"118":-0.19161866565686056,"119":-0.12362910671456011,"120":-0.020995928375215335,"121":-0.022361677094485728,"122":-0.0807081503185446,"123":0.04285381908508196,"124":-0.014648783092409875,"125":0.09001538173460384,"126":-0.20122244521844723,"127":-0.03605320935529506,"128":-0.10770150106754471,"129":-0.22307632396376786,"130":-0.00979420906904942,"131":0.1018358536402158,"132":-0.04816460750646654,"133":-0.20980414457157362,"134":-0.06655511856905173,"135":-0.011026140123058826,"136":-0.1879853268851673,"137":-0.21954483660992186,"138":-0.036736430946879874,"139":0.0360509181280158,"140":-0.11868286907572861,"141":-0.04437796873117714,"142":-0.15537075316159665,"143":0.012489123135787764,"144":-0.11196285732263639,"145":-0.1473200701915804,"146":0.019192233443637945,"147":-0.04649899938039214,"148":-0.009594174386443178,"149":0.16454892099383467,"150":-0.06423664218318428,"151":-0.10316329568884504,"152":-0.025769738366488847,"153":0.014808425364627767,"154":-0.010644954089649446,"155":-0.1745783151880804,"156":-0.03479725775930192,"157":-0.01487155587010714,"158":-0.2998007595333037,"159":-0.019057827380866983,"160":-0.009200233062050707,"161":0.024167483167494234,"162":-0.10862277759705345,"163":-0.10216202609271083,"164":0.10424803832254283,"165":-0.008766304883823586,"166":0.0012365068242376205,"167":0.11216097628229736,"168":0.025676305359079884,"169":0.014446861244071801,"170":0.032125418948770024,"171":0.012192619276406389,"172":-0.03811247876258762,"173":-0.18381171919475614,"174":-0.023657243731286956,"175":-0.0416742967118866,"176":-0.14890441295133947,"177":0.014949474070804257,"178":-0.09512248908422832,"179":-0.07281885607289595,"180":-0.04145838552602766,"181":-0.02930894158562242,"182":-0.08356338108439683,"183":-0.029081935413790862,"184":0.06540271206698667,"185":-0.12343299093246322,"186":-0.026267105325878295,"187":-0.02921359379833499,"188":0.020095761325669287,"189":-0.0014169788521414199,"190":-0.01649126245961612,"191":-0.014224932340033834,"192":0.07652326697938722,"193":-0.006733071167490458,"194":-0.07917806644654674,"195":0.027354432233297133,"196":-0.093041229790282,"197":0.00998415753929865,"198":-0.10412155553891073,"199":-0.12169607736270618,"200":-0.03712147501078646,"201":0.017634881918322815,"202":-0.07397872239222045,"203":-0.2856185774900082,"204":-0.03800007397860521,"205":0.01587475185700741,"206":-0.01973026094349626,"207":0.013317996625853572,"208":-0.20362794023117517,"209":-0.007859091402146278,"210":-0.0689967820091446,"211":-0.011388807459149665,"212":-0.08252357200035954,"213":-0.029790262102353013,"214":-0.1312524907173961,"215":0.0016515020592944806,"216":-0.17701883425549514,"217":-0.06994499411510038,"218":-0.20405943425372067,"219":-0.1636509928046177,"220":-0.004843696327134803,"221":-0.13625571211077667,"222":-0.1416943455158561,"223":-0.12122936146898246,"224":0.032227719659643335,"225":-0.011332395164109492,"226":-0.04446402652580824,"227":-0.0024716419731735037,"228":-0.0579302284031152,"229":0.04383231604321007,"230":-0.04271959162334742,"231":0.030904292014329964,"232":-0.09494841562681533,"233":-0.03535194577275422,"234":-0.07322919218885718,"235":-0.1166234454243104,"236":-0.07715017207792754,"237":-0.19275414269027014,"238":0.01881450167625796,"239":0.09497796215677379,"240":-0.05590817455750106,"241":-0.1438572410323966,"242":0.05892395820459133,"243":-0.027140282060773686,"244":-0.05286924789671653,"245":-0.05356485132934106,"246":-0.05269335989402467,"247":0.061509666583960766,"248":-0.1277584364831434,"249":-0.0675940975622497,"250":-0.059831498674274085,"251":-0.03386016354530924,"252":-0.1727435794621324,"253":-0.06668529725288262,"254":0.03729624689465522,"255":-0.08170463689819316,"256":-0.031334985705979285,"257":-0.023669412667167867,"258":-0.024154497621619357,"259":-0.20189037664235665,"260":0.08725688399836315,"261":-0.0017716156965475408,"262":-0.022292937362100623,"263":-0.10796249135058861,"264":-0.025042891565790745,"265":-0.03891437619731846,"266":-0.1397432255075695,"267":0.028111794218615635,"268":-0.13052890682484652,"269":-0.06532556680550186,"270":-0.09973071657466964,"271":-0.04369441776816212,"272":-0.16416986296819094,"273":0.07809053822622797,"274":-0.10356595506191156,"275":-0.16849765997844351,"276":-0.08491529808297614,"277":-0.002054978407393239,"278":0.05189428601523872,"279":0.0004891008875788922,"280":-0.027183629459345104,"281":-0.09245273962432596,"282":-0.09019356345630454,"283":-0.03092480258062365,"284":-0.09696545590826143,"285":0.031425778222596346,"286":-0.02388395699487158,"287":-0.026703435326741867,"288":-0.09433468839019905,"289":-0.041405564783220807,"290":-0.08073111356479393,"291":0.06778111634234896,"292":-0.0167757634912509,"293":-0.3314152405424281,"294":-0.14320424286611244,"295":0.07523206611679989,"296":-0.025689371833212217,"297":0.11921541801462783,"298":-0.07863818464062082,"299":-0.05333458803111057,"300":-0.0784094564876356,"301":-0.03590053178832742,"302":-0.17402531412366593,"303":0.026388151647862196,"304":-0.1696800018700894,"305":0.02771199531367996,"306":-0.15352323610606822,"307":-0.09060605498387424,"308":-0.2524799513386758,"309":-0.07071274807484636,"310":-0.01787617873682137,"311":-0.13547959485147595,"312":-0.19963181113760461,"313":-0.07954781832034807,"314":0.02200562136031126,"315":0.06218344017872478,"316":-0.05131708978621956,"317":0.014911068682966514,"318":0.08238812368480739,"319":0.0520551832633353,"320":-0.022011507335545084,"321":0.049062034803193585,"322":-0.12222145144012693,"323":-0.0920338709589218,"324":-0.10639248194322697,"325":-0.10770567082099954,"326":-0.19161458930751388,"327":-0.20673062252227775,"328":-0.05223614723524234,"329":-0.01968444201808844,"330":-0.20399233934020736,"331":-0.13025412622406743,"332":0.04376970501586066,"333":-0.07782418797200112,"334":-0.12184615014611941,"335":-0.014480011195980512,"336":-0.02967127892052862,"337":-0.024339876451792048,"338":-0.18245932871196985,"339":-0.0031394483911130274,"340":-0.017629398387369353,"341":-0.08627890051142793,"342":-0.14756578216225003,"343":-0.06774478399049806,"344":-0.10708811773337368,"345":-0.10683594721387721,"346":0.030818590902168378,"347":-0.07542639861238402,"348":-0.08815427466018848,"349":-0.1820305895365427,"350":0.039552651023214404,"351":-0.08295984175765597,"352":0.037319242709601345,"353":-0.017244932460879048,"354":-0.04622517408588562,"355":0.00676812588838038,"356":-0.03816588090195238,"357":0.024929320872313105,"358":-0.05293985580750299,"359":-0.07853350147297979,"360":-0.13007637655013296,"361":0.052965232722723965,"362":-0.11029142963379804,"363":-0.0008299582501176822,"364":0.024114680340056677,"365":-0.015988500228458182,"366":-0.0263345205292171,"367":0.052203064065557164,"368":0.03472754701459692,"369":-0.09855485045371636,"370":0.0359581781347287,"371":-0.04193808862705512,"372":0.06764896437493247,"373":-0.002321203588764206,"374":-0.06479297933505888,"375":-0.010896900714368952,"376":-0.018571103455439573,"377":-0.10122794091527362,"378":-0.022820055254215904,"379":-0.054164336752387444,"380":-0.05745265053490331,"381":0.041785497462858215,"382":0.01903043533765097,"383":-0.3154345174454053,"384":-0.041159071444474706,"385":0.0012527676634867563,"386":0.018808717823434684,"387":-0.15442502562733756,"388":-0.050674634606544436,"389":-0.04868516725224098,"390":-0.03899546035922636,"391":-0.07797539397643162,"392":-0.07237152611763485,"393":0.036546737945990504,"394":-0.08539996206464544,"395":-0.03757300345671002,"396":-0.16656176974526704,"397":-0.12679218728835484,"398":-0.19063658331147718,"399":0.008555506419267753,"400":-0.009909968595301783,"401":-0.19881628725744094,"402":-0.082667247953362,"403":-0.08592551327098143,"404":0.018604332848007894,"405":-0.16414357216668474,"406":-0.09981105632675245,"407":-0.026314254501415217,"408":-0.06419675097263766,"409":0.04607881266896774,"410":-0.16385909012200595,"411":-0.039883060388426074,"412":-0.06367553018815982,"413":-0.07227989912464959,"414":-0.07940343896298992,"415":-0.08541882669916985,"416":-0.1340866661087671,"417":-0.2503520922751973,"418":0.01380566231636888,"419":-0.15987137773631638,"420":-0.11284137227495507,"421":-0.014708530785898226,"422":0.07470929889196155,"423":-0.3106975629381684,"424":0.04607139526355738,"425":-0.02302843460038988,"426":0.005138885996701198,"427":-0.05081416708357454,"428":-0.12271891789203936,"429":-0.03016053251838003,"430":-0.01273501359893711,"431":-0.04540735942275299,"432":-0.0362736319481706,"433":-0.0701989322262653,"434":-0.1752597715837813,"435":-0.12352550823126018,"436":-0.011705654006995617,"437":-0.14526546490394002,"438":0.08691388378271109,"439":-0.11535283401092009,"440":-0.05655405251573175,"441":-0.17231769968938246,"442":0.016423387271987902,"443":-0.12255731651419612,"444":0.00031330617758806975,"445":-0.03727062207035926,"446":-0.09055537766911208,"447":0.05373260985535934,"448":-0.008184660673496658,"449":-0.0691856462113468}},{"sx":1,"sy":1,"depth":450,"w":{"0":-0.08940484879357578,"1":-0.028576805725563013,"2":0.01337579257718145,"3":-0.08462348526152016,"4":-0.02182453281344472,"5":-0.12200936435482802,"6":-0.07617363184433852,"7":-0.004379097918811766,"8":-0.030953560106933436,"9":-0.12591502310216893,"10":0.08294254981742388,"11":-0.02447800149190795,"12":-0.07816344418660548,"13":-0.03386722018854181,"14":-0.06488861732383762,"15":-0.05619115916235467,"16":-0.08186587490586081,"17":-0.03733868092228515,"18":-0.1656964052533575,"19":-0.03709686976596541,"20":-0.03986376912178999,"21":-0.045217480356058985,"22":0.018633321442915556,"23":-0.12583771339828956,"24":-0.037145618306964466,"25":-0.040605357374225264,"26":-0.024188092187994725,"27":-0.20168515962063246,"28":-0.04480361539435254,"29":0.053613234219398044,"30":-0.08205885985122074,"31":-0.058038175378786576,"32":-0.09081966340754911,"33":-0.013910313732062786,"34":0.04132147413348601,"35":0.03926231394795645,"36":-0.15670949603987386,"37":0.000045204229086359796,"38":0.020122731932331925,"39":-0.06276333044353005,"40":0.022629745137523312,"41":-0.16401313455835545,"42":0.0644409491075659,"43":0.024113205006715623,"44":0.019714765104542318,"45":-0.048505144929646186,"46":-0.06705756391034874,"47":0.04320136149154655,"48":-0.0006552260014631686,"49":-0.026756195676901958,"50":-0.026298180991691157,"51":-0.09211853538651182,"52":-0.0047019464414277705,"53":0.0212738931190869,"54":0.0502070492953977,"55":0.11776873637733618,"56":-0.1912827144472625,"57":0.03386554659457212,"58":-0.038587922496476475,"59":-0.1088714129350209,"60":0.03901796421692695,"61":-0.04099026803612876,"62":0.03301692466556807,"63":-0.22297790145711824,"64":-0.020369950075484054,"65":-0.06836375632567351,"66":-0.04144299663785733,"67":-0.0008409447724260195,"68":-0.10646795628214654,"69":-0.034575017908794324,"70":-0.09141523946001229,"71":-0.14422972219933433,"72":0.06780757445520727,"73":0.13853732765623974,"74":-0.08565820595947997,"75":-0.05173005326482568,"76":-0.029720596308683744,"77":-0.1353126572127663,"78":-0.04589084864842075,"79":0.08557683645002558,"80":-0.03395596303192698,"81":-0.3250840025987443,"82":-0.023184994177910093,"83":-0.2274437012058959,"84":-0.024488578525994738,"85":0.0003666452935079311,"86":-0.14873355518111794,"87":-0.01356200712037559,"88":-0.06790418347994877,"89":-0.10967980546980405,"90":-0.03609968653316205,"91":-0.04925829988053417,"92":-0.08594905472952113,"93":-0.1267878957508199,"94":-0.0024571382681318633,"95":-0.03764102631489688,"96":-0.004006865064164236,"97":0.025304347273157425,"98":-0.05882564144087761,"99":-0.10089583132464082,"100":0.005453442342470307,"101":-0.0007321908080288449,"102":0.021209862684520808,"103":-0.07816498097588377,"104":-0.1603297315873433,"105":0.09623443309216317,"106":0.02971997229720878,"107":0.04200529009601816,"108":-0.14636770507746397,"109":-0.13870552488979546,"110":-0.0332885074763835,"111":0.026746783010433182,"112":0.04619725711311721,"113":-0.09397002391282204,"114":-0.13646756275382868,"115":-0.13261809005967545,"116":0.02840464843289046,"117":-0.17343805758375663,"118":-0.012690649564700097,"119":-0.03391350497620501,"120":0.03623863702049379,"121":-0.00619693860823412,"122":-0.1379923291870213,"123":-0.028959966537730697,"124":-0.010149950823574182,"125":0.010650070880499346,"126":-0.08256193461872406,"127":0.014048147964131733,"128":-0.24134432696553826,"129":0.03188277789977972,"130":0.02919341755714096,"131":-0.05751591828853876,"132":-0.08674455540198149,"133":-0.19181374586357314,"134":-0.008667577708716425,"135":-0.17365752531091175,"136":-0.013025347464563988,"137":-0.014880419161952197,"138":-0.035241958583658715,"139":0.02376688621190664,"140":-0.07086530934761211,"141":-0.019537111778226757,"142":-0.056386922275277446,"143":-0.005891111284778758,"144":-0.0634423380557554,"145":-0.019062317460391286,"146":-0.17068431258256353,"147":0.051434651247359735,"148":-0.05232282983127207,"149":-0.0387275807844936,"150":0.09184891390440664,"151":-0.08002100302074548,"152":0.03240013439115004,"153":-0.2694919468207258,"154":0.0785248840345016,"155":-0.208593286205292,"156":-0.03724926747125024,"157":0.05320366588501479,"158":-0.11459835897810432,"159":-0.062303517854011274,"160":-0.04086364085783636,"161":-0.15828289931624298,"162":0.01672929832438591,"163":0.046393317024184096,"164":0.02726931390067819,"165":-0.02873025380554249,"166":-0.03720015009310548,"167":-0.08773628389270446,"168":0.025935307276728714,"169":-0.03486851717410898,"170":-0.02760140811055723,"171":-0.2605970346665277,"172":-0.0025368956529795875,"173":-0.15535857285025076,"174":-0.0583181581570939,"175":0.06709334104918295,"176":-0.08880614304370918,"177":-0.01755407239929109,"178":-0.0061871451479621154,"179":-0.15381662805305688,"180":-0.012039970957800412,"181":-0.1215772629092685,"182":-0.06889440971612121,"183":-0.18681484700128315,"184":-0.07953122701652772,"185":-0.07194083831237703,"186":-0.04056372642442846,"187":-0.18245156717620145,"188":0.0033500457750861726,"189":-0.09539308516784112,"190":-0.009876924705823763,"191":-0.07278583349841403,"192":-0.0653609820615801,"193":-0.020446754685509442,"194":-0.09933290798208373,"195":-0.02597235556633958,"196":-0.11414179216584382,"197":-0.015322662862815738,"198":-0.09941986432699433,"199":-0.19353984380123782,"200":-0.026522397366606856,"201":-0.07006296952748821,"202":-0.08977882296514324,"203":-0.05793993980999202,"204":-0.11101092458642078,"205":-0.03395651775200978,"206":0.03889581331887208,"207":-0.10949661003480214,"208":-0.033973387721784445,"209":-0.11318539989813396,"210":-0.030599971180614534,"211":0.06431086521762669,"212":-0.2277378503813824,"213":0.047633894756947535,"214":-0.038688725674209404,"215":-0.004099677875248421,"216":-0.1273589291542745,"217":-0.1437095561475441,"218":-0.19223342937846086,"219":0.02622418587949461,"220":-0.030859332261604488,"221":-0.10861193529243719,"222":-0.07656771699742013,"223":-0.24872850286759107,"224":0.003437124102892661,"225":-0.15912271837469041,"226":-0.011990735001114005,"227":-0.15930868485473654,"228":-0.04126294448815038,"229":0.010786895973672724,"230":-0.11177383576641817,"231":0.042576411897144874,"232":-0.03438512556474582,"233":-0.02160382306589178,"234":0.10539182221528352,"235":-0.10315167177615112,"236":-0.11788232267292473,"237":0.08712519597346347,"238":0.04687723576623644,"239":-0.1057919708883361,"240":0.018943971980890865,"241":-0.12513884983185886,"242":-0.040690396484546296,"243":-0.03985153212129478,"244":-0.017392645001157513,"245":-0.1309144036361238,"246":-0.072481217312564,"247":-0.02500270184092609,"248":-0.18283321392492574,"249":-0.0631063594017244,"250":0.014613364021706415,"251":-0.09167688694462678,"252":0.11125856374458046,"253":-0.12931614339205905,"254":-0.000024066963960641144,"255":-0.09888997184725451,"256":-0.020218225783425633,"257":-0.016916484450576703,"258":0.04213626304319274,"259":-0.14971864426677406,"260":-0.04215607635601987,"261":-0.09568905899607687,"262":-0.03520346538568623,"263":-0.16165045497494787,"264":-0.059598490511261704,"265":-0.008634730393513234,"266":-0.1580977038319766,"267":-0.04050320240405068,"268":0.07520120509464949,"269":-0.09374715684837764,"270":-0.05253853274690371,"271":0.0011859673626887217,"272":-0.0576038056580307,"273":-0.05839721268890943,"274":-0.04039631359711529,"275":-0.0012791538398105168,"276":-0.15037961792827295,"277":-0.19585836416357205,"278":-0.02191028773123869,"279":-0.16637900438087894,"280":0.06965340779717968,"281":0.02823735280528321,"282":0.02919310972049318,"283":-0.006258525559525669,"284":-0.07431497747146223,"285":0.011827205443506664,"286":-0.15043446427352727,"287":0.04134768355672842,"288":-0.09254495348163078,"289":-0.09716688546075881,"290":-0.20271908184399565,"291":-0.043749569839923834,"292":-0.03378568695264356,"293":-0.013607976442677269,"294":-0.08045016401702898,"295":-0.1422658393079157,"296":0.1155760479309729,"297":-0.23245025345424425,"298":-0.12508202172162564,"299":-0.04426033952644328,"300":-0.025935946916228803,"301":-0.09009543907194932,"302":-0.18824349132649545,"303":0.049346546065960235,"304":-0.127984863221557,"305":0.009419317220850758,"306":-0.11486838916062973,"307":-0.1271310071775673,"308":-0.13893183718857466,"309":-0.14217984998859504,"310":-0.07212039433528916,"311":-0.002049622334382864,"312":-0.10038756732564877,"313":-0.13801066380082153,"314":0.005054627886386023,"315":-0.07462474356589276,"316":-0.06340802293999212,"317":0.018846813325984698,"318":-0.07016397632211972,"319":0.01591684037894728,"320":-0.0687340365015405,"321":0.06058590703868113,"322":-0.13663153357540112,"323":-0.014264169863814494,"324":-0.1760100890570313,"325":-0.26993821716195227,"326":-0.1175155730891776,"327":-0.1297851286482285,"328":-0.10920340395029682,"329":-0.06956336150643022,"330":-0.12943156492330565,"331":-0.12719440605475807,"332":-0.013914333026225958,"333":0.13410009705297032,"334":0.02439326299496617,"335":-0.12992221660833447,"336":0.027396523523551427,"337":0.04430447713476839,"338":-0.18296199696434404,"339":0.02485358615882236,"340":-0.02958016455751445,"341":-0.0938454442293129,"342":-0.18191952139017853,"343":-0.20136426444310634,"344":-0.03005719460526469,"345":-0.1749268187219036,"346":-0.06312574111799801,"347":-0.08474051078910139,"348":-0.005214148324761284,"349":-0.17993897763718084,"350":0.00509180846588191,"351":0.038813927229172596,"352":-0.01375240869028744,"353":-0.20096502458826604,"354":-0.016729219681899384,"355":-0.035463539342314575,"356":0.002476579050666962,"357":-0.05025087671702799,"358":-0.09647315538204664,"359":-0.17075768101975225,"360":-0.016822608546633058,"361":-0.08945859652312334,"362":-0.06603244632342203,"363":-0.12887162578537545,"364":0.09603200139767612,"365":0.002430861453336668,"366":-0.0628827521650961,"367":-0.10100800106762642,"368":0.04193690084945755,"369":-0.0418589091637225,"370":0.07854575896933468,"371":-0.07072013311167456,"372":0.023359152096613805,"373":0.037213650492498584,"374":-0.061855761964040086,"375":0.00018245899897546963,"376":-0.09999335332392711,"377":-0.03898271023354458,"378":-0.16832242694654784,"379":-0.10371521332763926,"380":-0.02796837333187563,"381":-0.023862614703069718,"382":0.04698634135636346,"383":-0.11391390300305947,"384":-0.10437838494114239,"385":-0.018082681407200582,"386":0.04955044969338621,"387":-0.17860487461399588,"388":-0.15695556884346468,"389":-0.027147169442974108,"390":-0.09555043249336678,"391":0.04723074190066277,"392":-0.03874227749040768,"393":-0.0008875554022208679,"394":-0.12560990796032395,"395":0.054398319565678636,"396":-0.03979998440500684,"397":-0.05482651683142054,"398":-0.04820724439894281,"399":-0.109405675645138,"400":0.099413928678378,"401":-0.1051310797696767,"402":-0.21587622682747962,"403":-0.03648279936772995,"404":-0.04961655757897118,"405":0.08249900120130568,"406":-0.036334645151532084,"407":0.020446119517034553,"408":-0.005101319894958141,"409":-0.03245834510796455,"410":-0.17080222182196242,"411":0.03580053893559919,"412":-0.10788788184919432,"413":-0.04727583918816529,"414":-0.27919914861345,"415":-0.12388425977332121,"416":-0.007212113273021608,"417":-0.37159695751602917,"418":-0.08461303317440914,"419":0.002384522907502917,"420":-0.14597075938668252,"421":-0.028686154790137607,"422":-0.03601887913123388,"423":0.1281641046917471,"424":-0.04518470022305043,"425":-0.0465083004143969,"426":-0.032609013259424,"427":0.006642232790153726,"428":0.022071572600987847,"429":-0.02660772211895199,"430":-0.13985002766440768,"431":-0.12841903589259837,"432":-0.3804634843709567,"433":-0.1862611319886432,"434":-0.03915677628442467,"435":-0.2689850894119322,"436":0.029945527965885378,"437":0.07583743619235687,"438":-0.08358205748006091,"439":-0.2272081828262573,"440":-0.03073805531602478,"441":0.1043442085665062,"442":-0.027578560560268476,"443":-0.08814177303114341,"444":0.09074584108457137,"445":-0.03275039697174542,"446":-0.13490865974771743,"447":-0.004613979417286307,"448":-0.16662620676663886,"449":-0.016185977702253836}},{"sx":1,"sy":1,"depth":450,"w":{"0":-0.018098028082885922,"1":-0.04492957356625253,"2":-0.007487557465153467,"3":-0.09164797912399276,"4":0.06697211293129235,"5":-0.10030716871316633,"6":-0.0031104726988610766,"7":-0.12420520612720362,"8":-0.009015941198662178,"9":-0.17607895674763768,"10":-0.1271876151046451,"11":-0.05150064394531534,"12":-0.04961537352178561,"13":0.0390391722844309,"14":-0.06384718929315487,"15":0.05801608101123832,"16":-0.029787419614145307,"17":0.03268541160129856,"18":-0.04614896718128801,"19":-0.12668108268866127,"20":0.00910649018844902,"21":0.011706013673046347,"22":0.05940648834097313,"23":0.004125976973910617,"24":-0.03873856576298945,"25":-0.28126578593394985,"26":0.08805245051494978,"27":-0.11432633354300753,"28":-0.13187409884108464,"29":-0.12638372057960176,"30":0.06668076771526033,"31":0.03295729235502835,"32":0.033611046971954855,"33":-0.016569097490964465,"34":-0.05508362875662253,"35":-0.07755128816730525,"36":-0.13647049951659757,"37":0.10709099377640521,"38":-0.023941431656732765,"39":0.005101532294239613,"40":-0.045537210385506184,"41":-0.09465408969614744,"42":0.016686304958885415,"43":-0.20901575413118414,"44":-0.08371976626302477,"45":-0.08968031782888915,"46":-0.23211276281205712,"47":-0.05478669462015948,"48":0.048195465298899794,"49":0.008775756490760784,"50":0.08868903795799404,"51":-0.01878467463006035,"52":-0.0027167874473012833,"53":-0.10449157036263207,"54":-0.03549305778671429,"55":0.042452358162144904,"56":-0.14350761454496355,"57":-0.008565818945947568,"58":0.005502976892255182,"59":-0.1491103353390423,"60":-0.003173206941333595,"61":-0.24295590533558006,"62":0.017307280451530314,"63":-0.1646508382152898,"64":-0.09825205834648373,"65":-0.02981286280565012,"66":-0.08115241529146963,"67":-0.00018508015114417425,"68":-0.04816568434767912,"69":0.058994366653930264,"70":-0.0053274518116439695,"71":-0.17290388605372087,"72":-0.031305263736900985,"73":0.07874368039504558,"74":-0.06083550838003845,"75":-0.045636646192464284,"76":-0.018551764192303713,"77":-0.06101271099719862,"78":-0.029971006621434627,"79":-0.13013309861299363,"80":-0.04325362211334263,"81":-0.07313118982807248,"82":-0.12963183320363308,"83":0.020453802642326203,"84":-0.06206550205064055,"85":0.01543236089495393,"86":-0.04059033567309968,"87":0.12282504091333439,"88":-0.046506425346472265,"89":-0.04470446793782961,"90":0.0018527954799217317,"91":-0.05690293595325621,"92":0.05765112643306284,"93":-0.07922898304985528,"94":0.06687771588852952,"95":-0.2095161112224453,"96":-0.04111789711137277,"97":-0.12883681172636574,"98":-0.04071258046359264,"99":0.018401432265062693,"100":-0.10114625945935632,"101":-0.09927343305691427,"102":0.044803417492310774,"103":-0.012104246197279837,"104":-0.037795340797753645,"105":0.005965402614182185,"106":-0.05726579630346745,"107":-0.05546003786395435,"108":-0.23635028048615758,"109":-0.03984099775835021,"110":0.005889981503240344,"111":-0.023257331415666663,"112":-0.031474224802264666,"113":-0.14070919343783922,"114":0.03989730216585237,"115":-0.08564879687054362,"116":0.039645047928161085,"117":-0.009200163343076257,"118":-0.14056951175909044,"119":-0.07566425271217879,"120":0.02669005285840876,"121":-0.0023081444010370454,"122":0.00963097352338981,"123":0.040805256025763424,"124":-0.06845769574829988,"125":-0.0843247325431956,"126":-0.08607570484793407,"127":0.05167837105639997,"128":-0.07979323084511278,"129":-0.11119266962882018,"130":0.009106528697074751,"131":-0.11120613432970958,"132":-0.04761955576813604,"133":-0.2996022054300926,"134":-0.05798566198851959,"135":0.013949020011563642,"136":-0.21287863690217695,"137":-0.03911102211103756,"138":-0.007243813995136774,"139":-0.03632996724604629,"140":0.0389821256016316,"141":0.036375151651216894,"142":0.13571991281644727,"143":-0.015788850387558964,"144":0.0016239261861398055,"145":0.14015295232913658,"146":-0.027592292064980106,"147":-0.0057733624895439815,"148":-0.027547402597261322,"149":-0.12634941451026563,"150":-0.01659919593230724,"151":-0.3366315283909528,"152":-0.019567894006329203,"153":-0.020874156107879887,"154":-0.29225546696423393,"155":-0.1739927220089286,"156":0.05396132048241024,"157":-0.0031126562493678286,"158":-0.10648094715089262,"159":0.03108647925364298,"160":-0.09130958551288788,"161":-0.10528865901394073,"162":0.06210069815774661,"163":0.10910046581890899,"164":-0.06300598817283735,"165":0.013218496846942181,"166":-0.011734928058013383,"167":-0.17350543143772434,"168":-0.06845137565850809,"169":-0.32879753046509713,"170":-0.059851061084700445,"171":-0.13371617785492235,"172":-0.22381725743193642,"173":-0.0760111837018832,"174":0.08918949786567087,"175":-0.03562346632140895,"176":-0.08160416057167953,"177":-0.09008016673513344,"178":-0.0839176267546365,"179":-0.2216506407118176,"180":0.019774788477945143,"181":-0.027527472357820146,"182":0.06084323176131728,"183":-0.1333008490524179,"184":0.03686780272102566,"185":-0.2477314130362773,"186":-0.04100212843061288,"187":-0.09584428862361721,"188":-0.019554830272472828,"189":0.009790990013808766,"190":-0.04683034429603578,"191":-0.02242784117268767,"192":0.03344904489107229,"193":0.039319738813620234,"194":0.07318111652783046,"195":-0.002957786029722976,"196":-0.08602328296183745,"197":-0.018915602773462402,"198":-0.24164608532506038,"199":-0.0936215505059351,"200":-0.06248579000834446,"201":-0.08508083857950216,"202":0.018423180204199686,"203":-0.1694690323911905,"204":0.06130578774529037,"205":-0.044794351216235796,"206":-0.06245255362074442,"207":0.12368288893862626,"208":-0.051435893976997056,"209":-0.13396224074357627,"210":-0.005063011277172088,"211":-0.02399797239249789,"212":0.0973916482607546,"213":0.032507105442770655,"214":-0.21297100584847362,"215":-0.08316058038013935,"216":-0.13538887214680215,"217":-0.06892092405619507,"218":-0.0837799478866328,"219":0.07393667485229859,"220":-0.0020001189473887668,"221":-0.19932020549426133,"222":0.0439877480560899,"223":-0.03692068683244888,"224":0.025514610837309493,"225":0.051988394792208216,"226":-0.19040010407804892,"227":-0.06424450098418209,"228":0.05326855324609391,"229":-0.08938377967436378,"230":0.11857482675330008,"231":-0.014295429535450571,"232":-0.22600360148137463,"233":-0.1604705751024693,"234":0.04597228998729229,"235":-0.02950976633906347,"236":-0.14950267866949002,"237":-0.10498012606550869,"238":-0.016877487859154737,"239":-0.1856705418684808,"240":-0.09923836667863899,"241":-0.05395681976306916,"242":-0.03391987208057021,"243":-0.07644070893022437,"244":-0.3839992618995284,"245":-0.020542057217880282,"246":0.01139770797215501,"247":0.026671479865959944,"248":-0.0054507673563929495,"249":-0.022525662515899568,"250":-0.2697800166315386,"251":-0.1800755665028983,"252":-0.06542829759206736,"253":-0.057215974094349135,"254":-0.10476684916229544,"255":-0.11936812800255732,"256":-0.04592387235488593,"257":-0.042575141530437274,"258":-0.053937926811521535,"259":-0.24613655010981697,"260":0.03964803584345225,"261":-0.14952813580262772,"262":-0.06432393041220795,"263":-0.017334163263800606,"264":-0.07999962485869111,"265":0.03805212119191402,"266":0.022599792948902724,"267":-0.06932256007008485,"268":-0.2444485658594407,"269":-0.14907069571683554,"270":0.012924479617102963,"271":-0.09894530514536978,"272":0.034155528770591706,"273":-0.0872160503637844,"274":-0.042572344424615695,"275":-0.2562214710589239,"276":-0.009548687383406716,"277":0.007287574717627888,"278":0.007015264340704338,"279":-0.04156283730465633,"280":0.09426109251290116,"281":0.04764756927357574,"282":0.030609543123932003,"283":-0.022651871236520783,"284":-0.08139730259647993,"285":-0.0796205851559601,"286":-0.12017795687686782,"287":0.06912418111216244,"288":-0.1945194768838186,"289":-0.030841339318902174,"290":-0.05725919935327746,"291":-0.04097456860808559,"292":-0.08611560970716893,"293":-0.0046407308398646605,"294":0.04306573735494788,"295":0.23762973505228355,"296":0.06822192659129506,"297":0.1194535259172061,"298":-0.024645615965950017,"299":-0.10777311298303664,"300":0.05206047479044789,"301":-0.004901432107345975,"302":0.08203525895098752,"303":-0.026292929780705535,"304":-0.08666666974451492,"305":-0.014206361864628255,"306":-0.2591029303241175,"307":-0.182328871339199,"308":-0.0777112400319356,"309":0.0333454011775206,"310":-0.016402790916139973,"311":-0.25667620208804076,"312":-0.018165069881209195,"313":0.15338041135255379,"314":-0.029424459346145945,"315":0.10280950056063373,"316":-0.24679102036981865,"317":-0.10292894421310972,"318":0.0463366167812969,"319":0.045860378266005544,"320":-0.07005118926911369,"321":0.02157558511593673,"322":-0.11568967578572784,"323":-0.0640603162744662,"324":-0.12996769978372347,"325":-0.20786877261826953,"326":-0.16845284042603953,"327":-0.05061171228228255,"328":-0.06135564841470334,"329":-0.23990884625599743,"330":-0.23081471064201217,"331":0.2095380691531112,"332":-0.060696239146738884,"333":-0.03233263949482098,"334":-0.3587759160552669,"335":-0.1538731774426636,"336":-0.026123721310266055,"337":0.024091953532409456,"338":0.021485308884816378,"339":0.07797835903375712,"340":-0.14835439427657632,"341":-0.14212882985974098,"342":-0.06212198376771099,"343":-0.17628493785497631,"344":-0.09351799053616744,"345":-0.10819735529216483,"346":0.027532854687410686,"347":-0.3550192751359226,"348":-0.04925673744409111,"349":-0.06611300611395048,"350":0.013839016712527203,"351":-0.12742357305864385,"352":-0.13286166837169397,"353":0.027844759166771395,"354":-0.020874013009733117,"355":0.005244946594338931,"356":-0.0853966814163358,"357":-0.03695226110113612,"358":-0.17853139552015662,"359":-0.07631746603924328,"360":-0.01049980126179541,"361":-0.04698514724276414,"362":0.01325124098296095,"363":-0.05392636584355664,"364":-0.013913876457446895,"365":-0.13523199828783766,"366":0.010027131987752376,"367":-0.023847802209093157,"368":-0.1071335477374177,"369":-0.12288416144781844,"370":-0.0290839419453651,"371":0.05283379682105167,"372":0.010642019379937475,"373":0.0701875165183939,"374":0.0616500802681907,"375":-0.05189238134457066,"376":0.02521148943088845,"377":0.04041862746688684,"378":-0.1556476153860556,"379":0.001251048628926176,"380":-0.07425129582141042,"381":0.01781843604244327,"382":0.008739407981663531,"383":-0.09397217473192719,"384":0.028351899817750204,"385":0.08979535936425356,"386":0.03454881074457343,"387":-0.10281788173093141,"388":-0.09804277367410279,"389":-0.0071062115584293985,"390":0.02673855834101868,"391":-0.01168274396848696,"392":0.021600659340836832,"393":-0.021043157195704154,"394":0.06885405254290397,"395":-0.018574888744270306,"396":-0.3290997735774881,"397":-0.07458504695344301,"398":-0.0005232136798743994,"399":-0.09448493048857122,"400":0.09128266740468235,"401":-0.24617233037223046,"402":0.056462410164923024,"403":0.04003247147719761,"404":0.0524757311179811,"405":-0.0294846386456536,"406":-0.2868933114337497,"407":-0.06360553659605245,"408":0.013172973856182102,"409":-0.014767942004464704,"410":0.01606376864406556,"411":-0.011228796251872682,"412":0.07150924244644227,"413":0.044582870993927846,"414":-0.3654666134642861,"415":-0.0561079291936802,"416":-0.2886541611147378,"417":-0.04606422619982355,"418":0.03432704685259715,"419":-0.3561673790399638,"420":-0.0594145369995542,"421":0.08946755429690308,"422":-0.0006559455802327983,"423":-0.13190188294770266,"424":-0.3212640769783103,"425":-0.09050660710583561,"426":0.07084310418199935,"427":0.05435822143347781,"428":0.012903863494757358,"429":-0.0065291641580157616,"430":0.09951688544593008,"431":0.08536597731573575,"432":-0.43842233939024317,"433":-0.03320428722901799,"434":-0.12986203695314022,"435":-0.16686324449299603,"436":0.02399667143187474,"437":-0.369055910740087,"438":-0.05902208421876739,"439":-0.1031162918617784,"440":-0.05377548499753511,"441":-0.19777075136902475,"442":-0.20041248029013023,"443":0.04653756678907411,"444":0.007862327560156961,"445":-0.018857053195888984,"446":-0.09758983039870012,"447":0.03949532639365955,"448":0.09853190957788079,"449":0.05523100062830002}},{"sx":1,"sy":1,"depth":450,"w":{"0":-0.018175786116679873,"1":-0.04729866295868144,"2":0.017241904390865866,"3":-0.0052653833506005445,"4":-0.0012727422118946855,"5":-0.16000623430365554,"6":-0.014701597962475698,"7":-0.15996384909669087,"8":-0.0382551602829897,"9":-0.07131607196685791,"10":0.051668397637725405,"11":0.03464399047389641,"12":-0.07038402008578246,"13":-0.040532003414684825,"14":-0.005714362982539395,"15":-0.07594742760004225,"16":-0.054483068541954054,"17":0.03673746114291345,"18":-0.10104283601496167,"19":-0.08418634042185419,"20":-0.06078023225659197,"21":-0.0852078918261967,"22":0.02460240525182279,"23":-0.0764071734907768,"24":0.01166719864251459,"25":0.012705702980532826,"26":0.005749808840279398,"27":-0.060449060770018256,"28":0.17089855807048507,"29":0.07002411084686211,"30":0.09264380983571431,"31":0.08987177602680327,"32":-0.06563009439205256,"33":-0.04080219809046181,"34":0.01801189592459378,"35":0.025562121501085205,"36":-0.21421398786967713,"37":-0.1677410251307474,"38":-0.15671131771567443,"39":-0.09980685576577239,"40":-0.0425573660889302,"41":-0.11701747651050884,"42":-0.02781352170868054,"43":0.045744693851552665,"44":0.010021540010781612,"45":-0.03974186178359358,"46":0.019725812521902093,"47":0.16941897138244694,"48":-0.06737342902921903,"49":-0.024015484357353817,"50":-0.1509768989173371,"51":-0.04466028407504481,"52":-0.0721610236593902,"53":-0.03359249326509151,"54":-0.2463548881829676,"55":-0.02653910467941855,"56":-0.1253490861683749,"57":-0.11133812419337435,"58":0.0357479727265643,"59":-0.0932922233718482,"60":-0.038804791237458586,"61":0.016034574092454658,"62":0.01862261645919107,"63":0.05738444439028051,"64":-0.2592222490809143,"65":0.08790662139638424,"66":-0.06391993482788502,"67":0.015966339945361882,"68":-0.18389578255211717,"69":-0.05352340324036171,"70":0.037960592251633486,"71":-0.029963844501274844,"72":-0.18600268839992326,"73":-0.03150046467637759,"74":-0.04574788303127045,"75":-0.07717055559028536,"76":0.04357684300958936,"77":-0.11243802457670635,"78":-0.02613051468839076,"79":-0.03456876775577725,"80":0.034516473664031946,"81":-0.049798057297545315,"82":-0.09973036534249075,"83":-0.04120277676077443,"84":0.02603327789707222,"85":0.030936996872532912,"86":-0.10264142926080409,"87":0.0120805164925585,"88":-0.1084195491817805,"89":0.051346789500208344,"90":0.008297452181371488,"91":-0.04267167623567734,"92":-0.033074573945222306,"93":-0.015127791938062685,"94":-0.02800302763433228,"95":-0.027318093287776183,"96":-0.17442133420820086,"97":-0.07236108012361656,"98":-0.057217089934288666,"99":-0.0649441006063188,"100":-0.013901154536462705,"101":-0.13302295739775585,"102":-0.00395512875917457,"103":0.07302420874545619,"104":-0.06337309579202316,"105":0.02530161416062593,"106":-0.016830830187623682,"107":-0.001904413714827351,"108":-0.1856605261256757,"109":-0.1640403301413968,"110":0.01837320992716902,"111":-0.06250418581325692,"112":-0.07150720876814569,"113":0.11125389760570532,"114":-0.038110122894320295,"115":0.0805526859441433,"116":0.02609948641307516,"117":-0.07090716731681847,"118":0.08754294552827563,"119":-0.04452433892918146,"120":-0.06379638998192232,"121":-0.023510925528176668,"122":-0.052047351214926325,"123":-0.015710903038169473,"124":-0.12966590203984985,"125":-0.01893590445686299,"126":-0.21244091411068675,"127":-0.19387110768508894,"128":-0.09109970905302346,"129":-0.06235239982098077,"130":-0.016208760948233567,"131":0.02329809110609036,"132":-0.13642025012558384,"133":0.08548930322236477,"134":-0.06338439290172752,"135":-0.025720286376637896,"136":0.02157829266324608,"137":0.03328550941758573,"138":-0.05388948968091966,"139":-0.0013057013659805055,"140":-0.2179596987968703,"141":0.008521832266319824,"142":-0.18326129197774202,"143":-0.0005240049928178315,"144":-0.3465878931220141,"145":-0.06350160380452201,"146":-0.1283054778258797,"147":-0.0913421629793994,"148":0.0430249114920996,"149":-0.1149092384911229,"150":0.02121565419075313,"151":0.064518639445382,"152":-0.019246629055207576,"153":-0.006585070153528594,"154":-0.33264600665500343,"155":-0.060098257317181145,"156":0.009736244664138288,"157":0.028411998854614425,"158":-0.21362634127973323,"159":0.0405286598097082,"160":-0.18943441833476674,"161":-0.027447402930543593,"162":-0.30235231216474295,"163":-0.039660464007892644,"164":-0.09040591589781721,"165":-0.06523963946326686,"166":-0.07431384965659432,"167":-0.15305200030258753,"168":0.013345656471816564,"169":-0.06525011873213366,"170":0.01300544593952044,"171":-0.11031514927204221,"172":-0.13163980370586123,"173":-0.06731602995453524,"174":-0.005048689125981538,"175":-0.002760588461808027,"176":-0.06370045758453044,"177":-0.031001422666161908,"178":-0.05792564828167535,"179":0.028615672749113516,"180":-0.03847587778073068,"181":0.02580659427570916,"182":-0.07498200794990707,"183":-0.05781037261462326,"184":0.014732544387024342,"185":-0.026877766960302907,"186":-0.01651594367307034,"187":-0.029683316529326893,"188":0.09210661736960289,"189":-0.12417602181094974,"190":0.03005692167855392,"191":-0.22391709965566917,"192":0.05266838816902462,"193":-0.06630033209024266,"194":0.016554267702190165,"195":-0.027192231675200938,"196":-0.08781467226423949,"197":0.032134627786627776,"198":-0.10748183801126311,"199":-0.10228333531263736,"200":-0.13569435004094743,"201":-0.10573562545999984,"202":0.06831303040678939,"203":0.10359168532268113,"204":-0.10403161330962113,"205":-0.022384860442492358,"206":0.02809498769529309,"207":-0.12614061104244864,"208":-0.000018654597661445424,"209":-0.036019883732792836,"210":-0.03883195822370699,"211":0.0019569711087384476,"212":-0.07466257060271653,"213":0.008972066945589764,"214":-0.1927568586405374,"215":-0.10667170051861923,"216":-0.141820972979073,"217":-0.1152879656077754,"218":-0.2261603677750802,"219":-0.20644325458980042,"220":0.016747505412658594,"221":0.026437583622634125,"222":-0.01655649595344457,"223":-0.044558221035143585,"224":0.009992636884011016,"225":-0.0961301539519876,"226":-0.01744584251804044,"227":0.04580278264169867,"228":-0.08589382153350085,"229":-0.03230709625049288,"230":-0.08910781969576981,"231":-0.051816837891793574,"232":-0.1623813557870288,"233":-0.09034588207264402,"234":-0.2702600752496794,"235":-0.011086549302209278,"236":-0.15824693239610244,"237":-0.23069818934629338,"238":-0.03090916164575285,"239":-0.09409904227808263,"240":-0.10046450800801221,"241":-0.00500770468668,"242":0.03371430815226128,"243":-0.15126357129047618,"244":-0.30498942005114915,"245":0.053494844153301094,"246":0.05348307584326963,"247":0.06069954673294052,"248":-0.14158500856355583,"249":-0.014472115337058904,"250":-0.17456982350112807,"251":0.028602299369766108,"252":-0.2605367388907857,"253":-0.0443533998802572,"254":-0.23007986882282966,"255":-0.07895610125796435,"256":0.06959851833703687,"257":-0.21337488237781255,"258":-0.06711761798407612,"259":-0.12735628980470926,"260":-0.0336676404266747,"261":-0.21076546005826033,"262":-0.20762697135877425,"263":0.04837929445610746,"264":0.001432126873437519,"265":0.037801517744628595,"266":-0.15784552728678602,"267":0.004974310961737176,"268":-0.161607732089882,"269":-0.02973760981657411,"270":-0.009271868686707992,"271":-0.008665236436017236,"272":-0.0063219859858768,"273":-0.1488368416110123,"274":0.03846346647208399,"275":-0.08180774330003547,"276":0.03986297452146239,"277":0.005041400104123025,"278":0.04224668958900143,"279":-0.029360638146489506,"280":0.0321472666368349,"281":-0.12844092335841312,"282":-0.06160081139120671,"283":-0.038887535825852436,"284":0.06280329047005162,"285":0.005604622765214702,"286":-0.11966324653915544,"287":0.023323147515256163,"288":-0.13050580615498433,"289":-0.06641451065653119,"290":-0.21789536819762634,"291":-0.016288336138317025,"292":0.010235680977441146,"293":0.07423203489612977,"294":-0.04795898356277309,"295":-0.002628999776069666,"296":-0.008789485115198314,"297":-0.18499593572562026,"298":0.05706502768987555,"299":-0.0026297429236539667,"300":0.023037594963057895,"301":-0.048175451367282476,"302":-0.02481006327180074,"303":0.04753525706517151,"304":-0.0619713814122192,"305":-0.07228945123828084,"306":-0.2506124658480152,"307":-0.18132732770502408,"308":-0.2941871599522772,"309":0.025389810694471337,"310":-0.05123678036890687,"311":-0.0385753329931446,"312":-0.2368417484861651,"313":-0.09825392037908735,"314":-0.07851682248973424,"315":-0.07057809856349827,"316":-0.17889766697901685,"317":0.13120914093382538,"318":0.11142194432784892,"319":0.0023360022322518846,"320":-0.046912451559656884,"321":-0.03983180256558014,"322":-0.16683170700659938,"323":-0.0941577641297433,"324":-0.20564382893889807,"325":0.007209828154487532,"326":-0.38540754191445664,"327":-0.24192121795274912,"328":0.012459828454992954,"329":-0.1674307846922113,"330":-0.21808258235505504,"331":-0.06391654343738487,"332":-0.004689284230502905,"333":-0.23917201211093972,"334":-0.26597107296540184,"335":0.13701301606543703,"336":-0.0045714436818420755,"337":-0.06201021378674503,"338":-0.1749830364736229,"339":-0.057715222034712785,"340":-0.05192448131869145,"341":-0.11639977521505715,"342":-0.2432262987084493,"343":0.05192269536165874,"344":-0.3066287118054286,"345":-0.16051043809096668,"346":0.03601829232650141,"347":-0.20657070956144566,"348":-0.07756177837381197,"349":-0.18949743613222486,"350":-0.08328889142132204,"351":-0.09380048218677031,"352":-0.09647691197100401,"353":0.053733578592391286,"354":-0.04533993798839139,"355":0.005402235492274355,"356":-0.16462377883962973,"357":-0.038296135479866655,"358":-0.09524770168655791,"359":-0.048620502909258456,"360":0.009972452854695231,"361":0.07892114968829518,"362":0.05550380317515929,"363":-0.04713512149983196,"364":0.01307716024470938,"365":-0.0013680267891373733,"366":-0.01724349152165376,"367":-0.07487057456211298,"368":-0.007308342368760865,"369":-0.026188614455610243,"370":0.07990368766439206,"371":-0.02172820366216297,"372":0.0020177391413253604,"373":-0.05622474940014703,"374":0.006496262179235187,"375":-0.02632802489006743,"376":-0.11756186309292554,"377":-0.024682669252715776,"378":-0.06983260873362013,"379":-0.10192596236343694,"380":-0.2579803121552678,"381":-0.08064847667867135,"382":-0.008532889874695878,"383":-0.0531102116698063,"384":-0.09456838013549866,"385":-0.004566659263323992,"386":-0.014442414647327921,"387":-0.05368896080237141,"388":0.021882628464371577,"389":0.08173408252644862,"390":0.05271347407553912,"391":0.04508798713552946,"392":-0.0806071041020224,"393":0.05448216101516754,"394":-0.019968150739419127,"395":-0.008214391084241058,"396":-0.17129993699829052,"397":-0.09429669431881836,"398":-0.2955844967311376,"399":-0.025280177082042322,"400":0.0072327478183676795,"401":-0.1964238349375478,"402":-0.006613256285718297,"403":0.008451845758718783,"404":0.028195905580703163,"405":-0.1015571873126652,"406":-0.03978442823250057,"407":0.04783275483700714,"408":0.013211682326594318,"409":-0.02758615025709317,"410":-0.12062155519426006,"411":-0.022793101091375688,"412":0.015243184645094002,"413":-0.059388549332795734,"414":-0.22537952145808499,"415":0.031195632950025642,"416":-0.35459544437020435,"417":-0.061601309872650306,"418":0.08132618664561604,"419":-0.2541393138109252,"420":-0.08962084755894346,"421":-0.1053266708484726,"422":-0.07906853760211408,"423":-0.0858906260270445,"424":-0.16556901047366343,"425":0.08041293512050454,"426":0.02779098257070708,"427":0.059329650859054964,"428":-0.08801575362901384,"429":0.011795393306696529,"430":0.06537977978745053,"431":-0.08698652841021116,"432":-0.04979207608183892,"433":-0.06891973491944269,"434":-0.2180257458978405,"435":-0.19039772766895935,"436":0.023382506247332995,"437":-0.09330627827881649,"438":-0.11034242828861678,"439":-0.14281112802143167,"440":-0.0406155081927566,"441":-0.03275448253289593,"442":-0.053179778098913756,"443":0.02930832192808184,"444":-0.04742042944473482,"445":-0.043599058877196666,"446":-0.01872118970364255,"447":0.03310885867468314,"448":0.02899105239241842,"449":-0.10362740054482499}},{"sx":1,"sy":1,"depth":450,"w":{"0":-0.05902422461391814,"1":0.03574060916247623,"2":-0.11717659504763266,"3":-0.05702785225043772,"4":-0.022160305680557223,"5":-0.11493838526089387,"6":-0.08228592988611459,"7":-0.03116009853238018,"8":0.02868252874449369,"9":0.002348122671710282,"10":-0.04772939344020316,"11":-0.16280676230665656,"12":-0.01043965734620278,"13":-0.012684524709900821,"14":-0.061564291527048266,"15":-0.09481703878715031,"16":-0.015078543183032424,"17":0.05764341674275663,"18":-0.12768335870116887,"19":-0.01638574009815111,"20":-0.013121115476563165,"21":-0.09105608104331402,"22":0.053457628555492666,"23":0.0038198260652061323,"24":-0.030027795350220945,"25":-0.07817099910885686,"26":-0.05731077707272129,"27":0.05284676128878516,"28":-0.12577390600148292,"29":-0.09519454801170148,"30":-0.06457825582824968,"31":0.02155251561317288,"32":-0.06848282056594658,"33":-0.005546506188420345,"34":-0.19654116298947114,"35":-0.01634835087193481,"36":-0.3263756306560625,"37":-0.09971127474003079,"38":0.017284447604524796,"39":-0.13130245361912107,"40":-0.002774799524277341,"41":-0.031143671995853654,"42":-0.026417549508791126,"43":-0.059911879470855266,"44":0.014233138752483518,"45":0.09339247467669518,"46":0.004877191141345162,"47":-0.02435515375870756,"48":-0.01927367720817988,"49":-0.06271898045238598,"50":-0.20648882332969903,"51":0.08057191671494329,"52":-0.12324238424163189,"53":-0.04816616045569114,"54":-0.21446206058192116,"55":0.014249934100624294,"56":0.008759395724410105,"57":-0.056004256507467605,"58":0.11928347987347153,"59":-0.03226841865422145,"60":-0.04301950856921764,"61":-0.07400396961820685,"62":0.049025223544280364,"63":0.14100306557595157,"64":-0.016900406393069892,"65":0.02828563792522484,"66":-0.010755089242899267,"67":0.03843927838531691,"68":-0.21748225689064185,"69":-0.032298264101366214,"70":-0.13318135094851263,"71":-0.017941865269795566,"72":-0.1945564675838014,"73":0.0004470428869398487,"74":0.03313704704246584,"75":-0.046826190436495684,"76":0.023892135851172416,"77":-0.026056617068959034,"78":-0.00017292925105709967,"79":-0.016339364806047862,"80":-0.01640078023146212,"81":0.12429267937383814,"82":-0.138217425433888,"83":0.053813596265300245,"84":-0.10922702209328031,"85":-0.044353419708670815,"86":-0.06607650959299453,"87":-0.04566527949658943,"88":-0.046254912910978246,"89":0.07381576295083846,"90":-0.06980463195949545,"91":0.006401794684700923,"92":-0.17767840518666334,"93":-0.18558827426188243,"94":-0.006331218210850369,"95":-0.16739673808236719,"96":0.03367152635590092,"97":-0.1089093701655645,"98":-0.016916727842177876,"99":-0.07687978950581288,"100":-0.1307220481573103,"101":-0.19570623086814606,"102":-0.05836536375149591,"103":0.05218459743461217,"104":-0.06390522689551224,"105":0.021067838828519498,"106":-0.04804156237533562,"107":0.01513126297745692,"108":-0.13104017886154817,"109":-0.10779469538937796,"110":0.011280508840852296,"111":-0.12754366054505856,"112":-0.06245931037305173,"113":0.0023417579928116774,"114":-0.0364786088730209,"115":-0.11619592027163021,"116":0.03579599312026889,"117":0.06808020433955446,"118":-0.09978277822468667,"119":-0.11584095880118958,"120":-0.023315663048067585,"121":-0.044300115041045814,"122":0.0023466196077113564,"123":0.03383317736385661,"124":-0.09787908583604166,"125":0.04164787290185356,"126":-0.1336086917738369,"127":-0.1209176528028385,"128":-0.020619784619667517,"129":-0.10590988781211529,"130":-0.12342793894902691,"131":0.023976803808613955,"132":-0.002414873204110488,"133":-0.15668941533441003,"134":0.034680500392947365,"135":0.14574491544675475,"136":-0.03574849489660521,"137":-0.1337865842718713,"138":0.01680354336983066,"139":-0.006984700380031457,"140":-0.20075936031784053,"141":0.01132273992501165,"142":-0.16713610533203405,"143":-0.12347241434380964,"144":-0.2984749684623731,"145":-0.056266355460849724,"146":0.06319201113631134,"147":-0.11738999099762935,"148":-0.04883878448411067,"149":-0.09644568408719843,"150":0.011154929893787,"151":-0.112412482377243,"152":0.009749134281659591,"153":0.05706695141719569,"154":-0.07327956290311487,"155":-0.09724414189142394,"156":-0.009269060016788852,"157":0.049391601537736994,"158":-0.15107966238893766,"159":-0.017500420827200266,"160":-0.1127934002551059,"161":-0.11625543753207485,"162":-0.3289907361219833,"163":-0.004007846213606901,"164":0.036271933140167995,"165":-0.0954532930655494,"166":-0.04516191305708345,"167":-0.20540142504110057,"168":0.03951899870746378,"169":0.04221629009484753,"170":0.021861048002914107,"171":-0.0027314178966594584,"172":-0.17459545743037852,"173":-0.016789537222095176,"174":-0.04223268657098659,"175":0.016321807795540204,"176":-0.09563127426994224,"177":-0.051553173204401975,"178":-0.018372643981645467,"179":-0.10615012261627123,"180":0.00841843446814023,"181":-0.051232105237999905,"182":0.003665927671108809,"183":-0.12146396913246864,"184":0.02896121661715014,"185":-0.17267824156893408,"186":-0.0045686118261373965,"187":-0.1609827156632188,"188":-0.010763496273075563,"189":-0.0715271675042035,"190":-0.17464714304524834,"191":-0.08226738257128485,"192":-0.04380941003571894,"193":0.016158359581591574,"194":-0.02470853086679201,"195":-0.060195384426309236,"196":-0.04901328524178482,"197":0.046879454140113797,"198":-0.1476105845652806,"199":-0.00956848355355314,"200":-0.047158906781380246,"201":-0.19167100861285583,"202":-0.05591312125369226,"203":-0.09385176490770179,"204":-0.009147394341527663,"205":-0.17648052547303814,"206":-0.04894148418270479,"207":0.02102989744100731,"208":0.0012103888429614545,"209":-0.11740326134732025,"210":0.03428820749805134,"211":0.07533950871157345,"212":0.049239943205933084,"213":-0.13110849940299776,"214":0.10040797991731724,"215":-0.010789855373492778,"216":-0.17672893455528899,"217":-0.19368230589140842,"218":0.026735434893795883,"219":-0.18745500463200707,"220":-0.021591129938212876,"221":-0.022519723025162836,"222":0.07115422950956841,"223":-0.1925344125625072,"224":0.00543494166347833,"225":0.03652701976138892,"226":-0.0505788496593124,"227":-0.0897113944629337,"228":0.04380603774500258,"229":-0.08990345721320255,"230":0.08429359326063995,"231":0.04352383522875337,"232":0.003416056981523416,"233":-0.13245804891281288,"234":-0.09133268259755843,"235":-0.08563656143817437,"236":0.007819053529055785,"237":-0.032050341208824384,"238":-0.06885097656572159,"239":-0.10452071053948814,"240":0.05917252888193118,"241":-0.18944826730800712,"242":0.034657277504391036,"243":0.10609047397362958,"244":-0.02917591704285339,"245":-0.08256251185021474,"246":0.012101199115583891,"247":-0.09269954824980478,"248":-0.04648110466429735,"249":0.1341742177073163,"250":0.11267468197730733,"251":-0.047747768192205095,"252":-0.22801260313099883,"253":-0.13962465154222795,"254":-0.0519580896944788,"255":-0.06586003349414653,"256":-0.03824265870443907,"257":-0.23588643976499607,"258":0.03370910779107056,"259":-0.1318463472955904,"260":-0.05040979781314187,"261":-0.07168020998928384,"262":-0.18135916926455126,"263":-0.07296964873918627,"264":0.07318175780545334,"265":-0.08969641432941743,"266":-0.018611846214354476,"267":0.0441635699791894,"268":-0.04174131579966638,"269":-0.04602986837097919,"270":-0.013956221091718747,"271":0.002917655075801376,"272":-0.1382164559934919,"273":-0.13784871551716346,"274":-0.07286158097856349,"275":-0.2793474287096423,"276":0.012175950060995795,"277":-0.1166297877520497,"278":0.005039212596523419,"279":-0.12747096964188884,"280":-0.15051254300334116,"281":0.04515031425420637,"282":-0.08079125858526505,"283":-0.01749159430711517,"284":-0.06129209436175812,"285":-0.0006996030697959027,"286":-0.03384462022805124,"287":0.04578101335457282,"288":0.0556902752401583,"289":0.01760047738035192,"290":-0.029580830766100557,"291":-0.11499777740226748,"292":-0.10084024713284347,"293":-0.06976239514698306,"294":0.010979435371576977,"295":-0.206945994876272,"296":0.044657277887073014,"297":-0.11873541594367434,"298":0.0776673248218144,"299":0.025076859359166,"300":0.04720143029153783,"301":-0.0810173526289578,"302":0.014190085520058043,"303":-0.07659592258894242,"304":0.05639716002404011,"305":0.0595434772384595,"306":-0.09069520537793789,"307":-0.08933438378870566,"308":0.05346977721014053,"309":-0.10211075703477772,"310":-0.0790540667556426,"311":-0.07629926212043961,"312":-0.009864025786635115,"313":-0.24241519960144622,"314":-0.022623099192783873,"315":-0.14912830130945215,"316":0.031747608231411616,"317":0.012890266351982626,"318":-0.017040398487593526,"319":-0.042376106841506556,"320":-0.054424757510404716,"321":-0.017866765833571035,"322":0.10961520565854051,"323":-0.07894282678788125,"324":-0.0886306578401155,"325":-0.14111067853529694,"326":-0.0040727831541466355,"327":-0.09765768050028728,"328":-0.14879040579935568,"329":-0.18797779556834832,"330":-0.053398920243460775,"331":-0.1765662823088719,"332":-0.0729076893987954,"333":-0.16497410566635776,"334":-0.14145933146650208,"335":-0.07654535923868944,"336":0.12105842841169695,"337":0.06528410569028528,"338":-0.04566450562781441,"339":-0.010189070559994217,"340":0.09051107487303732,"341":-0.06968953140301841,"342":-0.1286222176597239,"343":-0.04041953674936334,"344":-0.01720917287460615,"345":-0.08446700128457608,"346":-0.043415219266267555,"347":-0.28062451244451647,"348":-0.06868901066299421,"349":-0.19809716988539663,"350":-0.03023694043512378,"351":-0.14205134214841195,"352":-0.2810249304238534,"353":-0.1011445974198025,"354":-0.05944367564738744,"355":0.0013115031375798244,"356":-0.12909125944077487,"357":0.011496001732728167,"358":-0.08529194750241009,"359":-0.12733315318036945,"360":-0.03189883998126057,"361":0.002788133930692259,"362":-0.09632584419175168,"363":-0.08900708907434345,"364":-0.0033852178787893154,"365":-0.22708943031713577,"366":-0.008524253204645506,"367":-0.0938325073277242,"368":-0.013585766802088914,"369":-0.2615198564384916,"370":-0.10404507497717487,"371":0.002897327953592022,"372":0.03616389727076587,"373":-0.01726887808627355,"374":0.013033150863232722,"375":-0.004753731019500586,"376":-0.02362195951172509,"377":0.0846625425780605,"378":-0.016264924812177797,"379":-0.009222457895174382,"380":-0.05065216053571708,"381":-0.06139819484627955,"382":-0.0770423965905754,"383":0.006781772954137931,"384":0.05305359441428752,"385":-0.23513717292611108,"386":0.010009459811613993,"387":-0.26789413876083756,"388":0.08573171022713297,"389":-0.06927841031844685,"390":0.008672179041536532,"391":0.04915657569218158,"392":-0.1184433152686795,"393":-0.022470939032990956,"394":0.03219147503863874,"395":-0.019265755480205638,"396":0.07575565039386077,"397":-0.04907000434247854,"398":-0.06197284118351817,"399":-0.10226227289722235,"400":-0.05822097249475618,"401":0.03920964529881527,"402":-0.0010782295459485468,"403":-0.10993032319116945,"404":-0.012834412123937001,"405":-0.11135884105603101,"406":0.06201601550412184,"407":-0.07821101671746557,"408":0.014860146194847768,"409":0.014800957602548806,"410":-0.11474770348647723,"411":-0.007285734099427336,"412":0.09750027781589209,"413":0.0322272105991858,"414":0.09552227517907148,"415":-0.035601871812066366,"416":-0.04734386266817101,"417":0.03607675133903144,"418":-0.05520441474123808,"419":-0.10022486857761596,"420":-0.05037856965087403,"421":-0.20636204922507492,"422":0.07233781530715609,"423":-0.2114384011099181,"424":-0.14105693110153883,"425":0.012376071008039065,"426":-0.025546206294390715,"427":0.030353847178335502,"428":-0.10784932717768199,"429":0.021833433610225463,"430":0.045404459708533525,"431":-0.03515679395291319,"432":0.00918974910643866,"433":-0.0013051824218546727,"434":-0.018681064992960576,"435":-0.0773200180880057,"436":-0.04469434631401242,"437":-0.26702989754712864,"438":0.0031987684939817854,"439":-0.19948367683959628,"440":-0.01067371810338421,"441":-0.0745244534902458,"442":-0.15678013533496307,"443":-0.06269429584174094,"444":-0.07777373261441671,"445":-0.023231624540117027,"446":0.005420853560659898,"447":-0.03857045781842651,"448":-0.02089342864968931,"449":-0.07816217421397977}},{"sx":1,"sy":1,"depth":450,"w":{"0":0.006202396460812529,"1":-0.003766811500256107,"2":-0.019707809002968733,"3":-0.1261957079432273,"4":0.0005011597261910832,"5":-0.0817439661826398,"6":0.04147025963245104,"7":-0.10673972582706635,"8":0.012252254368649358,"9":-0.08068009966295159,"10":-0.08738769907639722,"11":-0.05907149286373705,"12":0.004711864129485443,"13":0.008835905086963273,"14":-0.0354685549531369,"15":0.05725214658627356,"16":-0.0632454583900243,"17":0.042015981982572254,"18":-0.10702052532193823,"19":-0.13453370810483403,"20":-0.008561221209085122,"21":-0.06795225708000535,"22":-0.061006697739701285,"23":-0.15427823407502117,"24":-0.06630724508063163,"25":0.026196716822070427,"26":-0.03388153739949303,"27":-0.008824672366397087,"28":0.022103181496851823,"29":0.06757425576260778,"30":-0.07833530465105376,"31":-0.004359558750935781,"32":-0.12418055118140901,"33":-0.036384967214122446,"34":-0.08431720463865917,"35":0.032137902430814755,"36":-0.2055951361398948,"37":-0.1994065477778294,"38":-0.1470954060546477,"39":0.012039562438033795,"40":-0.07244127879500895,"41":-0.008509077145540611,"42":-0.019236054516887906,"43":-0.07105406310647588,"44":-0.08501637822371677,"45":0.03406978022522512,"46":-0.03939760022393176,"47":0.10728772739227743,"48":0.01680005188953483,"49":0.03995321721080727,"50":-0.07028498019268753,"51":0.03148474920622357,"52":-0.13941339028444408,"53":-0.10860616319774379,"54":-0.29353420962227866,"55":-0.01555385179439825,"56":-0.12332463767814061,"57":-0.07981578669492244,"58":-0.017569449375279895,"59":-0.05473212138528847,"60":-0.042863907863046065,"61":0.04231329604080066,"62":0.014463231907434867,"63":-0.07415767046548528,"64":-0.29564917759463005,"65":0.13436485274712398,"66":-0.0229462372353272,"67":-0.020136143878359707,"68":-0.06745337766178573,"69":-0.0967590403259837,"70":-0.02617233946296814,"71":-0.033194782087872785,"72":-0.2745711092978716,"73":-0.0866329676661612,"74":-0.1830813308070555,"75":-0.02179232926770265,"76":0.009829089745300945,"77":0.008680196743481399,"78":-0.016366847804098392,"79":-0.08843615546969659,"80":-0.029577426016310637,"81":0.005557911989337044,"82":-0.08587328724861476,"83":0.08594460372945645,"84":-0.0650639500083603,"85":-0.07711153643110952,"86":-0.19530548668614647,"87":-0.06832425451638803,"88":-0.08547745719208397,"89":-0.04966715401528249,"90":0.049682531983849594,"91":-0.05796785921971397,"92":-0.0014866616481786412,"93":-0.03674927127485242,"94":-0.07353501492418137,"95":0.02314465457777638,"96":-0.055871591170248175,"97":-0.07027965860832407,"98":0.02199293527887296,"99":-0.09153273853218406,"100":-0.012372660800551051,"101":-0.14984193201033585,"102":0.0033869398831146416,"103":0.06370146118361236,"104":-0.10053995638553599,"105":0.02554294918669099,"106":-0.0044338406946361885,"107":0.023291585710037626,"108":-0.13520015385953318,"109":-0.15622980428061803,"110":-0.04243025606444878,"111":0.013593344743625524,"112":0.029555789662417863,"113":0.059334222247335054,"114":-0.05094871992300034,"115":0.12648496468731332,"116":-0.004230174265060039,"117":-0.05790458696753069,"118":0.1595404731744393,"119":-0.10118358490329103,"120":-0.028035889938198954,"121":-0.024654822670334996,"122":-0.15635218729826095,"123":-0.05036607214243453,"124":-0.11618400311657558,"125":-0.05768298454375274,"126":-0.162965475372328,"127":-0.061606520516971214,"128":-0.1284252601525154,"129":-0.04904126324138188,"130":-0.06552236556350831,"131":-0.06964478676692622,"132":-0.0675784826094513,"133":0.04402482295430223,"134":0.031123375343569473,"135":-0.022077409444486086,"136":-0.0033902635065885985,"137":0.10354939684907992,"138":-0.03203726691876289,"139":-0.04158856781059879,"140":-0.1453058713331807,"141":0.0973742561246908,"142":-0.17087214065988626,"143":-0.077783518015888,"144":-0.255999449930285,"145":-0.06626073218374597,"146":-0.18384084910089762,"147":-0.04558459825400395,"148":-0.012891032574167561,"149":-0.20934206128985702,"150":0.010874040529628905,"151":0.14651299835138334,"152":0.02661978879227372,"153":-0.05209059094232271,"154":-0.4204631757123033,"155":-0.11652201372073431,"156":0.026150703259177614,"157":0.013384525273519151,"158":-0.23687841916627217,"159":-0.01982747977211873,"160":-0.17499065854140508,"161":-0.03658425123868728,"162":-0.33647839395873175,"163":0.10204817873450915,"164":-0.22712075608152094,"165":-0.10803251804711268,"166":-0.06278054830201933,"167":-0.20058630467292743,"168":-0.09578211114050068,"169":-0.08195794840902511,"170":-0.12504494467462277,"171":-0.0230702304472383,"172":-0.10306285794058344,"173":0.02863120834849491,"174":0.01347988929920229,"175":0.008786370894069702,"176":-0.19363220572410741,"177":-0.015945916300369865,"178":-0.13016897032248176,"179":0.028901359449838925,"180":-0.09267525393340514,"181":-0.04783400985813074,"182":-0.0047699394757730745,"183":-0.04750784947165958,"184":-0.00040313466745811247,"185":-0.021102975768055126,"186":-0.06789462079618196,"187":-0.14005255259393046,"188":0.01272974248827263,"189":-0.16228034160372926,"190":0.005813514408411488,"191":-0.0747683802620943,"192":-0.004573996705613633,"193":-0.08704464994545501,"194":0.01597375300714503,"195":-0.02372894474027347,"196":0.044609939483641524,"197":0.0440869256276606,"198":-0.09242283649818234,"199":-0.14808907074318695,"200":-0.05582951254630012,"201":-0.19874279646425613,"202":-0.03202667163400402,"203":-0.08280220057559075,"204":-0.1833907647727271,"205":-0.08809476146804641,"206":0.09289848952091999,"207":-0.22193425237659953,"208":0.024926401136052247,"209":-0.1500372650065542,"210":0.044976125299144486,"211":0.14910997712881757,"212":-0.038703919999724924,"213":0.001030688546075061,"214":0.00838629413977936,"215":-0.012873701863861204,"216":-0.2431298708867063,"217":-0.02923874015653828,"218":-0.06457134553013537,"219":-0.17904868366441795,"220":-0.025280936236766624,"221":0.00953548266211174,"222":-0.08458030442877655,"223":-0.001481853768188905,"224":-0.014820025008383671,"225":-0.1362542860031619,"226":-0.03930870158122378,"227":-0.08074002633226882,"228":0.03815278148189408,"229":-0.03410116857992422,"230":-0.028481058371739774,"231":0.00790774725629341,"232":0.00012301644459813537,"233":-0.06388135915469363,"234":-0.36411945007370544,"235":-0.092346635988034,"236":-0.0960903459732084,"237":-0.10805904951983619,"238":-0.019995486283151,"239":-0.177348917213581,"240":-0.04954511391951783,"241":0.045199678429970365,"242":0.01819873291773566,"243":-0.22264220857320552,"244":-0.3359455952441932,"245":-0.17087895959883592,"246":0.03345637427335296,"247":0.0046686733956179454,"248":-0.07681428065600251,"249":-0.02988700000217812,"250":-0.09931913883274929,"251":0.0312937297412551,"252":-0.36204254822422105,"253":0.0521458042568568,"254":-0.17192391564009518,"255":-0.020640621177409817,"256":0.025501532178705568,"257":-0.39772659096203683,"258":-0.07384352724051874,"259":-0.0733707809692626,"260":-0.043041659999008205,"261":-0.2588918183249115,"262":-0.16314763907724023,"263":-0.07864953146551988,"264":0.05063108772603082,"265":0.010954221752545738,"266":-0.050612782928651096,"267":-0.05262554728639313,"268":-0.11205317749937319,"269":0.028287098396215897,"270":0.02932338902180201,"271":0.012410533838402554,"272":-0.007047458335076415,"273":-0.08011232047140052,"274":-0.05700956586111527,"275":0.02922578181413579,"276":-0.112629597427218,"277":-0.16649802037292188,"278":-0.038995408184924724,"279":-0.1432388888552927,"280":-0.053212222056903444,"281":-0.019676410067978413,"282":0.040249201475817266,"283":0.029725266877894514,"284":0.047888531232872414,"285":0.0407012574517442,"286":-0.0439138305190576,"287":0.01032023728751531,"288":-0.12601366215407253,"289":-0.09760693792915498,"290":0.14638803331525074,"291":-0.06406342609855693,"292":0.005464998563418177,"293":-0.05740692028092904,"294":-0.1020735020520662,"295":-0.14956221671472994,"296":-0.009551578629723998,"297":-0.1335465283754238,"298":-0.013282637060369954,"299":-0.2704062011120806,"300":-0.0018106903619516397,"301":0.05339549138715667,"302":-0.04801657128638273,"303":-0.038033173495489445,"304":0.09464155602809926,"305":-0.06861615820979926,"306":-0.25848375639077403,"307":-0.17945944141626527,"308":0.1349992189343872,"309":-0.15834177727286014,"310":-0.06322959859394134,"311":-0.051768707868583744,"312":-0.08595161542232413,"313":-0.13732421615498666,"314":-0.08777863017812,"315":-0.1824987564741262,"316":-0.027020920339610417,"317":-0.21944573358389025,"318":-0.07346818372929159,"319":0.04036714498851108,"320":0.027138249840320528,"321":0.04387818373091688,"322":-0.018952720251630154,"323":-0.036087886197033604,"324":-0.39975342531845176,"325":-0.13221950772843982,"326":0.06717370623704516,"327":-0.05439641106447008,"328":-0.16096242691164853,"329":-0.23450528620675867,"330":-0.02540925142717071,"331":-0.028550887562962982,"332":0.03785758855478841,"333":-0.1549914350894245,"334":-0.38666649368407113,"335":-0.17351827360968786,"336":0.009215497438502572,"337":-0.03420093172731211,"338":-0.027641723782247433,"339":-0.024729664224429106,"340":0.01303206114795463,"341":-0.009192412128450272,"342":-0.22389998139656575,"343":-0.10415285999048661,"344":-0.07111817284630058,"345":0.02409903861708536,"346":-0.060231099341426224,"347":-0.43328305972971454,"348":0.021974040904647576,"349":-0.08768656525004062,"350":0.054759278998989025,"351":-0.3180648405667956,"352":-0.07924791844429507,"353":-0.09000592907625994,"354":-0.004592813786441469,"355":-0.0329779543002641,"356":0.13182954047011036,"357":-0.004955307082941505,"358":-0.1746935419820805,"359":-0.022279180448349964,"360":0.0166679031308634,"361":0.022389503818520506,"362":-0.029919987454584438,"363":-0.11340615117239487,"364":-0.030947920889812772,"365":-0.05529636954042482,"366":-0.09029882990323282,"367":0.016396569863741696,"368":-0.05646847881672648,"369":-0.049611262731255774,"370":0.08050754699585294,"371":0.018628003255234594,"372":0.0483774848703119,"373":-0.0045820536679706605,"374":-0.03787543771419818,"375":-0.03819007982358545,"376":0.04725434108259679,"377":-0.048351446044229876,"378":-0.053385295957037684,"379":0.003386677760428915,"380":0.0744404168099845,"381":-0.049388060085800496,"382":-0.05526345387092939,"383":0.14041455441750395,"384":-0.08171428820762303,"385":-0.047442697708405784,"386":0.032547456802442226,"387":0.059549405329400756,"388":0.04985557256243111,"389":-0.05379905559731322,"390":-0.008271149105015495,"391":0.00013305838774953395,"392":-0.04971283880889818,"393":-0.07640572566848805,"394":-0.002816360145679552,"395":0.018743580354634266,"396":-0.13817632171284713,"397":-0.03412560928106709,"398":0.19945985779199105,"399":-0.004259057804786821,"400":-0.1246981098693311,"401":0.04182114808828082,"402":-0.10874225630409297,"403":-0.08351745528673557,"404":-0.005273554281801094,"405":-0.11583586108341953,"406":-0.05547013503613159,"407":-0.09954280785725655,"408":0.024794136183303613,"409":-0.032981674570335705,"410":-0.04890947154971332,"411":0.020516356577084015,"412":-0.020502845669904336,"413":-0.038089368000532114,"414":-0.2186945576567476,"415":0.04529616247613585,"416":0.18114559723258103,"417":-0.13446930389636205,"418":-0.07255749662219026,"419":-0.1028946809927668,"420":-0.03949544945938435,"421":-0.1549877932565104,"422":-0.06648546547424557,"423":-0.046318543758953105,"424":-0.3249732756096858,"425":-0.161777338069421,"426":-0.050753102874660054,"427":-0.056345444061463766,"428":0.0851445450002789,"429":0.01593051338189209,"430":-0.055764632837208554,"431":-0.03277986856658165,"432":-0.1625425855920465,"433":-0.021142348279245427,"434":-0.007384023787339384,"435":-0.1190530618576305,"436":-0.05626932500543854,"437":-0.3545447589027001,"438":0.09177043207424211,"439":-0.35591471424051907,"440":-0.04666917084904679,"441":-0.1240562512689262,"442":-0.1506724554722517,"443":-0.08585743886480565,"444":-0.01057484823384805,"445":-0.020007982008176422,"446":0.009659708230721533,"447":-0.03091761867179291,"448":-0.2059653784564772,"449":-0.07875436407072424}},{"sx":1,"sy":1,"depth":450,"w":{"0":-0.016594781079419613,"1":-0.12967875087235328,"2":-0.11504743408587075,"3":0.030465679182554824,"4":-0.03852403218705988,"5":-0.1860163410269546,"6":-0.03013650555142628,"7":-0.15232160711648765,"8":0.003232865293887759,"9":-0.019638061916613003,"10":-0.08784212944593714,"11":-0.11414527559117263,"12":-0.015401884530415771,"13":-0.07334483404442066,"14":-0.040762112682298145,"15":-0.0665383905030824,"16":-0.05237689004688595,"17":-0.006457717982718392,"18":-0.2275911070411868,"19":-0.031399744109339926,"20":0.05989027248693305,"21":-0.03293463655721957,"22":-0.018483006909349838,"23":-0.16720879945790038,"24":-0.011123595164640423,"25":-0.18480994280670748,"26":0.002013714434626884,"27":-0.07388148369599422,"28":-0.191065756615912,"29":-0.07590027911059531,"30":-0.05319393514831855,"31":0.07477986563643967,"32":-0.04526932142198552,"33":0.01688575967050696,"34":-0.09373591077845927,"35":-0.020410151792649447,"36":-0.1874616274951907,"37":-0.12417905903887301,"38":-0.0005567974039438751,"39":0.010635389537392495,"40":-0.031387150184025533,"41":-0.21220354820401727,"42":-0.08440810825178252,"43":-0.12687753555443887,"44":0.002428397907176404,"45":-0.010290988231614433,"46":-0.16696907131263175,"47":-0.029231504006622312,"48":0.08575857533921,"49":0.049761613596165884,"50":-0.05078718567995613,"51":-0.04175952960447527,"52":-0.05573009952386696,"53":-0.057644400480086164,"54":-0.011519102164509127,"55":0.022090197703557538,"56":-0.18749762698100983,"57":-0.0010309495618870505,"58":0.11244916272314322,"59":-0.16180721680827,"60":0.0026490832641210323,"61":-0.08895212150416656,"62":-0.02478189736868812,"63":-0.053207535826161646,"64":-0.04862267444342617,"65":-0.05914034429231804,"66":-0.03640428175758059,"67":-0.015186887522160946,"68":0.0012646675155143258,"69":-0.05972334575640456,"70":0.018528925347703847,"71":-0.12492796882403795,"72":0.012552008844130628,"73":-0.09477658746543821,"74":-0.12069534321052362,"75":0.007561634058859088,"76":-0.02686175603146265,"77":-0.06366189747668027,"78":0.04509849526236734,"79":-0.2357413394621609,"80":0.05418124860888594,"81":-0.15082185971422898,"82":-0.10852562522976823,"83":-0.06062273833546234,"84":0.005767366815259699,"85":-0.05751492577561693,"86":0.02861780718106968,"87":-0.09031543484039418,"88":-0.1096845115397745,"89":-0.08504621094473318,"90":0.06276146963274125,"91":-0.043497930958927754,"92":0.014127354688015431,"93":0.049895663887496,"94":0.028576887056540965,"95":-0.14342394214067353,"96":-0.07583286766375347,"97":-0.08485984582086453,"98":-0.053981497597064984,"99":-0.013669721547184238,"100":-0.0480684821180447,"101":-0.18117015388778052,"102":-0.026771330350871963,"103":-0.043987390993002466,"104":-0.034263463913235793,"105":-0.05801488553744669,"106":-0.06640647593306294,"107":-0.011408781962313888,"108":-0.22979867256547276,"109":-0.12308080727686373,"110":-0.02851228153966952,"111":0.12174899360897597,"112":0.0059678347874309425,"113":-0.21409988563539264,"114":-0.044684949685534714,"115":0.02286739023887586,"116":-0.013723761548731811,"117":0.10380058134050103,"118":-0.10358224022594172,"119":-0.06734188595072552,"120":-0.033991970767733755,"121":-0.03460489720451427,"122":-0.05177306067987324,"123":-0.027090941501905358,"124":-0.15780863792982824,"125":-0.060056627353406555,"126":-0.1972249979955803,"127":-0.149152174723721,"128":-0.12262131240669168,"129":-0.12552997078630232,"130":0.012454883622404418,"131":-0.276979388041018,"132":-0.10862544430646466,"133":-0.01341326750091286,"134":0.06585855604850123,"135":0.0752763449639081,"136":-0.04335322016264725,"137":-0.03841860850071283,"138":0.0000362693782891439,"139":-0.04141412420405197,"140":0.04852918682161113,"141":0.023618071773030276,"142":-0.03585583332098681,"143":-0.08054230760066719,"144":0.053158370902141844,"145":-0.12008329227190796,"146":-0.021117034398008258,"147":-0.173032862490142,"148":0.011597032343375367,"149":-0.15228239522706155,"150":0.00556525432457062,"151":-0.12435875993784441,"152":0.038815065174608275,"153":-0.02956516800349558,"154":0.03842782345719146,"155":-0.04045217628335838,"156":0.044593022285599325,"157":0.017067630453079418,"158":-0.04597394673044168,"159":0.012978385166774168,"160":-0.09062731545424801,"161":-0.08977745902454788,"162":-0.010987944738901412,"163":-0.04592631205476807,"164":0.028757483896531846,"165":-0.09524539824708866,"166":0.06003289847940442,"167":-0.08537975889516156,"168":0.0379670621411446,"169":-0.17103607134037832,"170":-0.012849520527643174,"171":-0.13698152110691136,"172":-0.1283097321395931,"173":-0.026836207195332033,"174":0.07854296600362341,"175":0.0565730837197905,"176":0.06947045918604176,"177":0.012285806225875686,"178":-0.07196574763784204,"179":-0.09501271397352191,"180":-0.042837664473066375,"181":-0.03758832019413413,"182":0.0026870108311355073,"183":0.07349888143893972,"184":-0.08255735173509568,"185":-0.074983000638082,"186":-0.2011262507489645,"187":-0.023569367140836305,"188":0.06376836158529287,"189":-0.07641970973878051,"190":-0.13522187044369496,"191":-0.039608806263654706,"192":0.02680864118358596,"193":0.008180266765717223,"194":-0.005514860628901735,"195":-0.04691729564218123,"196":-0.10529178187586286,"197":-0.04430547843507546,"198":-0.18148266294211313,"199":-0.12138974104009309,"200":-0.01521797904474986,"201":0.03992528341467389,"202":0.00016040383999277544,"203":-0.08443796262174307,"204":-0.09496624376016222,"205":0.08400649168936254,"206":0.05168627511310554,"207":0.013028350240761908,"208":-0.03104204851488991,"209":-0.05975863223771153,"210":-0.011413003963882446,"211":0.05182999184655892,"212":-0.04963520290785265,"213":0.028259187608602982,"214":-0.10134235410516154,"215":-0.08265311129984503,"216":-0.1877209065747053,"217":-0.10457550913076355,"218":-0.08633421461867487,"219":-0.05922491195195729,"220":0.06387421094898614,"221":-0.08319727921075765,"222":-0.1616840537759783,"223":-0.02936922468860149,"224":0.0019449810063779098,"225":0.041627253420898104,"226":-0.04781573889379283,"227":-0.06821482680464461,"228":0.00909389846231267,"229":0.0010566441520956623,"230":-0.14883414001719508,"231":-0.0254628523477609,"232":-0.10988028825047391,"233":0.0075373316746127645,"234":-0.011125665339598403,"235":-0.039137549617094265,"236":0.08289261578501275,"237":-0.20608289047888484,"238":-0.014974407489987279,"239":-0.004818412869664722,"240":-0.13661051337526095,"241":-0.011326766729404443,"242":0.036761916623503234,"243":-0.1141938497676601,"244":-0.09753489424228304,"245":-0.15752641772566126,"246":0.0005232086783324911,"247":0.08942595763612413,"248":-0.10550291362264086,"249":0.08995571305501926,"250":-0.022274060044493383,"251":-0.004162531486745331,"252":-0.09200755604098776,"253":-0.026796811612130347,"254":0.012554636150048837,"255":0.0409316695946173,"256":0.014699566969486069,"257":0.01433621819162419,"258":-0.053648829898905015,"259":-0.1753998068897719,"260":0.049944562858016205,"261":-0.12383638153030596,"262":-0.11789541260846396,"263":0.012884430987654743,"264":0.05730235806628007,"265":0.0136230722678789,"266":-0.09745389986193342,"267":-0.05113911208169094,"268":-0.0743365652849509,"269":0.017270713387521563,"270":0.003200751690742307,"271":0.003975841817936606,"272":0.0017533913903789145,"273":-0.06141670011342109,"274":-0.04410808400120228,"275":0.0018908430158894136,"276":-0.08386304971452124,"277":-0.2218827057763441,"278":0.017257744367634224,"279":-0.07456662062935027,"280":-0.14646365135503345,"281":-0.061359090484750946,"282":-0.0387156327942714,"283":-0.05382832960324501,"284":-0.05674604580210039,"285":0.0006358324968735151,"286":-0.07162195211282245,"287":-0.016007711341138934,"288":-0.14425970517503295,"289":-0.07668464448237065,"290":-0.009415185631009158,"291":-0.2699272656158058,"292":-0.09612092103174161,"293":-0.010686647293431112,"294":-0.1320922321613109,"295":0.015340890780553526,"296":-0.066017413910824,"297":0.03565979506311836,"298":-0.016153219502956766,"299":-0.038267222805805357,"300":-0.03576914039673058,"301":0.07398574200633859,"302":-0.10971236637900733,"303":0.005703240947201459,"304":-0.24849269463418633,"305":0.020959639361684743,"306":-0.2308521304802651,"307":0.011495814260089169,"308":-0.18383962417668975,"309":-0.3382064135177691,"310":-0.16706212769231366,"311":-0.11920637894865817,"312":-0.06916397611671816,"313":0.055292477398083135,"314":-0.020957269474308128,"315":-0.012662556072811068,"316":-0.04626073001056905,"317":-0.07338512973259152,"318":0.05522593221852695,"319":0.028906355427946076,"320":0.02995763915523713,"321":-0.0669788251317781,"322":-0.14390457930243505,"323":-0.12222759619259581,"324":-0.13417582899853484,"325":0.0972188271057424,"326":-0.014755221884823849,"327":-0.5360581466818084,"328":-0.04840456872945987,"329":-0.06240629056850622,"330":-0.10718943466582945,"331":0.012423006094968676,"332":-0.004888529380672393,"333":-0.10321672175824055,"334":-0.038034756810508705,"335":0.03292854568948711,"336":0.025186021184997773,"337":0.020101430241395993,"338":-0.15360988941278916,"339":0.07400821246648204,"340":0.027493000710242205,"341":0.004487878467884542,"342":-0.10559515002501968,"343":0.07580281463735042,"344":0.007778219422437097,"345":-0.23663523773897044,"346":-0.08849203886542932,"347":-0.17493918782913817,"348":0.07628741824825393,"349":-0.1431474878362326,"350":-0.04669281465049593,"351":-0.13958949630289114,"352":0.0254616018140551,"353":0.01898450106613011,"354":-0.010915367602954317,"355":-0.06595963842233889,"356":-0.03040664618075947,"357":-0.07227211565315568,"358":0.006591788203270969,"359":0.05275258195057733,"360":0.053148703832105605,"361":-0.01571930258903147,"362":-0.057478217807137494,"363":-0.15569507208058816,"364":-0.13000752378632735,"365":-0.08561094846492195,"366":-0.0009485542537253707,"367":-0.0949021160901064,"368":0.01207109529826036,"369":-0.10979051427403609,"370":-0.09056810411752933,"371":-0.05342436702247431,"372":-0.07560408450941535,"373":-0.016068652376185,"374":-0.09696161162682004,"375":-0.10427654971053478,"376":-0.2047495698287811,"377":0.0025346894828206647,"378":-0.11686261052355179,"379":-0.09043841109251241,"380":-0.06103802151868195,"381":-0.291499191528857,"382":-0.07877543125308493,"383":-0.0115121774368984,"384":-0.08756495140099495,"385":0.00702676635856868,"386":-0.012268712547299788,"387":-0.0673041015862771,"388":-0.10908583534906933,"389":-0.09127724978104923,"390":-0.048386131105331014,"391":0.03035591883396315,"392":-0.11801829020096143,"393":-0.02312389985215308,"394":-0.3194378903486956,"395":-0.04432273153409256,"396":-0.04715475862165836,"397":0.06728545662784799,"398":-0.04312992611042476,"399":-0.29868350970648133,"400":-0.10012458588747271,"401":-0.0025103868843064088,"402":-0.1832287073813866,"403":-0.13864022951429314,"404":-0.00024353367503459543,"405":-0.09650137327782235,"406":-0.01566441139917334,"407":-0.004871651568422688,"408":-0.04695640945559263,"409":-0.08440141902936567,"410":-0.3065396864077643,"411":-0.10705044300798534,"412":-0.31534785527139764,"413":-0.0855357281715353,"414":-0.08433648648179132,"415":0.10351327787730144,"416":-0.00655530339810157,"417":-0.4406968443101584,"418":-0.054284968004849894,"419":0.11138018665694828,"420":-0.1712262529927715,"421":-0.03728127328572465,"422":-0.019983257017647686,"423":-0.11783212188717254,"424":-0.027062918563977335,"425":0.0004941483340324696,"426":-0.037912539846763016,"427":0.061299895094727865,"428":-0.3950602519128633,"429":0.023277026765607313,"430":-0.11135081825401626,"431":-0.004587855789831237,"432":-0.035414095436636726,"433":0.12846522195720944,"434":0.07000113044199517,"435":-0.16111591033508463,"436":-0.07532381500776786,"437":-0.03150702353863354,"438":-0.00459722167633161,"439":-0.05961285399877896,"440":-0.039531007135384724,"441":-0.15969540915170843,"442":-0.14165705206609885,"443":-0.034231022976659926,"444":-0.07834335069886994,"445":0.04471520972608636,"446":-0.08706605464549434,"447":-0.044491352236515895,"448":-0.21781496792486896,"449":-0.005467703368502683}},{"sx":1,"sy":1,"depth":450,"w":{"0":-0.027264498061741513,"1":-0.05359226279454059,"2":-0.1566994036780368,"3":-0.08851150186129168,"4":0.028495627195717455,"5":-0.18500876174288142,"6":-0.010246792201619708,"7":-0.040988447847988906,"8":0.03343558617258644,"9":-0.04143505823769993,"10":-0.019127233426888195,"11":-0.07757148495470012,"12":-0.08079247344720977,"13":0.016151747218377588,"14":-0.149342115265922,"15":-0.03700948970259327,"16":-0.055824152236055476,"17":0.044669386171058444,"18":-0.14692080778779845,"19":-0.1957869174260767,"20":-0.06712649049693706,"21":-0.14174885891961367,"22":-0.08331734296627508,"23":-0.1686647377152497,"24":0.01421876054025317,"25":-0.10676466988521809,"26":0.002395089548587757,"27":0.07718441911216577,"28":-0.15897325881929414,"29":-0.06952121894071175,"30":-0.04441051522351309,"31":0.03784658317411754,"32":-0.22012448206869537,"33":-0.02827159613573855,"34":-0.03716838245429601,"35":-0.04674867806152847,"36":-0.3313038894835074,"37":-0.13734751005827672,"38":-0.13007504221780256,"39":-0.13188239837152843,"40":0.08101119009720216,"41":-0.13048022650000107,"42":-0.026798718997909816,"43":-0.10605355189669308,"44":0.017777759557823156,"45":0.1352690849791019,"46":-0.14307275344961543,"47":-0.050503438413436484,"48":-0.03951891710390884,"49":0.010990180542956822,"50":-0.19384038515751367,"51":0.014112456882677607,"52":-0.045845440243847416,"53":-0.06149631771924763,"54":-0.192337763080029,"55":-0.11238713187450286,"56":-0.13715303132673137,"57":-0.0887880650363273,"58":0.02639119766657849,"59":-0.10985104015549349,"60":0.03220772457687597,"61":-0.01856827806061181,"62":0.04291257701794313,"63":0.05106561905733856,"64":-0.21827324672956575,"65":-0.030117319704988633,"66":-0.062366884032826544,"67":-0.09067509987979704,"68":-0.20039166377181858,"69":-0.034353830173879725,"70":-0.03355884560662294,"71":0.1244570396682188,"72":-0.3847315687862715,"73":-0.05202588322130089,"74":-0.08060159068129184,"75":-0.025379095717000488,"76":-0.08167520209466597,"77":-0.1495687538222572,"78":-0.0012334392814647543,"79":-0.05729986599755148,"80":0.037053683235717415,"81":-0.03582668839769745,"82":-0.11458837174395851,"83":-0.07766044204041946,"84":-0.0800356428387231,"85":-0.049860538830478446,"86":-0.17047134692114832,"87":0.015162885384782478,"88":0.028430918174491476,"89":-0.03627606217343489,"90":-0.07286978616490751,"91":0.010352620274139825,"92":-0.07733794511158804,"93":-0.08668429822525568,"94":-0.03879742796656289,"95":0.012810019587563918,"96":-0.007125966944917207,"97":-0.1340312769014204,"98":-0.03838371662051213,"99":0.024062874490519963,"100":0.013344579394402447,"101":-0.185136232200675,"102":-0.05613869730968528,"103":-0.057799399668864763,"104":-0.11346118977861039,"105":-0.03551053178709503,"106":-0.06700553834837901,"107":-0.010039147054435885,"108":-0.12602706415499274,"109":0.0022121999270928398,"110":-0.02544768804056336,"111":-0.19794683863645995,"112":0.013289755629317458,"113":0.006082435416242338,"114":-0.04951752752366608,"115":-0.1744961686063948,"116":0.08727438536532121,"117":0.03390313443367438,"118":-0.20176307813921585,"119":-0.09242527019311082,"120":0.015923974659048285,"121":0.009039708332119204,"122":-0.2529003756307553,"123":-0.07483266525842139,"124":-0.20308172291241566,"125":-0.08262110003595086,"126":-0.33306670738151956,"127":-0.11408172817263067,"128":-0.12358822259277542,"129":-0.3671589099761531,"130":0.01067735101221325,"131":-0.05555850466757937,"132":-0.05560240681106356,"133":-0.11625304659094225,"134":0.032611092756837746,"135":0.057223486525613335,"136":-0.17836912914054764,"137":-0.05264738602857678,"138":0.07850811935471365,"139":0.011201762197849647,"140":-0.24071499139348307,"141":-0.02878932176575318,"142":-0.09323847253595881,"143":-0.09257560171499785,"144":-0.2949141416815648,"145":-0.04735405927696039,"146":-0.31030350613946267,"147":-0.2459555600124717,"148":-0.06940262806106397,"149":-0.2179370700346833,"150":-0.15899282463192715,"151":-0.07020569670068941,"152":-0.03978534076308452,"153":0.09619728402693081,"154":-0.3174349173512237,"155":-0.04438074794585798,"156":-0.0037455201787718276,"157":0.004237127738368324,"158":-0.24077862938877076,"159":-0.006995102966193551,"160":-0.0027843227652607134,"161":0.13830085991326582,"162":-0.24826621056551712,"163":-0.02550016555209169,"164":-0.13026659309136235,"165":-0.2716495160852656,"166":-0.08513036531697425,"167":-0.25880322005302847,"168":-0.14812159917189321,"169":-0.09715340229127425,"170":0.028709112427330343,"171":-0.11305420961839523,"172":-0.11678264009953955,"173":0.04239780782107076,"174":0.0237043172306179,"175":0.02121682423006359,"176":-0.1324824954457344,"177":-0.015023589652216044,"178":-0.00584321230723126,"179":0.06506119073613692,"180":-0.04486583880060464,"181":-0.021339818804886976,"182":-0.01840641251164808,"183":-0.11672933802658852,"184":0.08331485769022026,"185":0.0757102624447356,"186":-0.022052560176621598,"187":0.024978163041835786,"188":0.004998895323851895,"189":0.0839731234088145,"190":-0.07078124682911995,"191":-0.14478975345162648,"192":0.014507971677395783,"193":0.033581578785478836,"194":-0.11164402059678491,"195":0.05270172974642157,"196":-0.07442599618993657,"197":0.02702960971962409,"198":-0.003916216577836777,"199":0.04347087604242921,"200":-0.035994175238089655,"201":-0.06894618751857925,"202":0.00459089764608377,"203":0.03994124579934624,"204":-0.07660844958114907,"205":-0.12547311681643983,"206":0.038982458310364454,"207":0.05295853607521015,"208":-0.05955897382021675,"209":-0.2203761171443589,"210":-0.009529608628591157,"211":0.10169369861949829,"212":-0.18385725729053898,"213":0.04335271521315192,"214":-0.1772998803743143,"215":-0.014107723938484532,"216":-0.0960432751003556,"217":-0.014178505169800735,"218":-0.15399247716309514,"219":-0.1529283255610082,"220":-0.057864450191130054,"221":-0.05086846523339948,"222":-0.069738623748339,"223":-0.08806056348237494,"224":-0.014603266842305762,"225":-0.030074922663895696,"226":-0.08923769372873624,"227":-0.25335541082488644,"228":-0.04219769893733056,"229":-0.04582563162593157,"230":-0.07489602900824924,"231":0.0822025967786053,"232":-0.031918353221384366,"233":-0.09114956552285786,"234":-0.1621411490893475,"235":0.0398911871562113,"236":-0.17198239351097228,"237":-0.2752641986767739,"238":-0.0863183868666496,"239":-0.273945070605258,"240":-0.031066083529917403,"241":-0.0861928879650816,"242":0.037531082261985364,"243":-0.06534458178170881,"244":-0.09909280583486535,"245":-0.11453739644415202,"246":-0.0770171507091823,"247":0.020640763837106835,"248":-0.12795413344929113,"249":0.02520157305006263,"250":-0.091983159957412,"251":0.09728337997002777,"252":-0.11861953426858377,"253":-0.06072786951777413,"254":-0.18213617206655772,"255":-0.10257599222805175,"256":-0.0012146040190505016,"257":-0.13544011946001216,"258":-0.08318287003723249,"259":-0.025643992824102717,"260":-0.008395880770176558,"261":-0.11693697474753006,"262":-0.12511665634724417,"263":0.0327564909615663,"264":0.0015479786594552007,"265":-0.05465328773409625,"266":-0.2211966692167815,"267":0.02645605618656423,"268":-0.06012506437845442,"269":-0.0014825091299216892,"270":-0.09259870592993658,"271":-0.05262906184538537,"272":-0.048106645518820615,"273":0.03499412595206872,"274":-0.10362235834863429,"275":-0.0438647259013056,"276":0.05057269549109779,"277":-0.006760337463297838,"278":0.004092444020695895,"279":-0.0021245612188962805,"280":0.007503704849653235,"281":-0.07005486424753261,"282":0.0032914642919226324,"283":-0.03279218628737089,"284":-0.10206909239423724,"285":-0.011731078438952823,"286":-0.1306865901129968,"287":-0.0061746082764965226,"288":-0.022629200524263236,"289":0.0350563579899094,"290":-0.08452275321721564,"291":0.07869667628497551,"292":-0.049832948271314084,"293":-0.00041832870034997364,"294":-0.011634611387415337,"295":0.014862192518560557,"296":0.04971222066105939,"297":-0.076329990500161,"298":-0.09530566372589994,"299":-0.11220489095712864,"300":0.03225397982681308,"301":0.024907911328891086,"302":-0.08228717538142283,"303":-0.008252254630817208,"304":-0.19254308824921662,"305":-0.04982823396963101,"306":-0.04261593332483022,"307":0.02676118236492357,"308":-0.23074451964397427,"309":-0.051700950766653334,"310":-0.023699292932524728,"311":-0.09279760383587124,"312":-0.14747297041183974,"313":0.0883440303923066,"314":-0.03682731284465711,"315":-0.11908440825190231,"316":-0.06413163935768101,"317":-0.08100809170220631,"318":-0.0035030565746901605,"319":0.042014559650953215,"320":-0.17826425505284782,"321":-0.01453607797945252,"322":-0.11342059683628673,"323":-0.10518590328984842,"324":-0.07398054912590489,"325":-0.15973734280532936,"326":-0.2224986818299972,"327":-0.21738377351466134,"328":-0.0924765585532447,"329":-0.011866370722050263,"330":-0.1870013460835923,"331":-0.06145005606718788,"332":0.0171528552629394,"333":-0.08825947566062714,"334":-0.08286956140871024,"335":-0.1401034296281693,"336":-0.045398378233941175,"337":0.04842190008203393,"338":-0.22002704843949125,"339":-0.03396729702849182,"340":-0.14908742758071283,"341":-0.23062552036214803,"342":0.039533209497644335,"343":-0.13809373238130065,"344":-0.10957318653170908,"345":-0.1015063230147083,"346":0.03221396088662844,"347":-0.009003361408097705,"348":-0.19925140006542602,"349":-0.07432363563616834,"350":0.0036112710262626796,"351":-0.1334216777770917,"352":-0.09772092177798983,"353":-0.08215496023574878,"354":-0.07788889974211391,"355":0.010977067441196814,"356":-0.12029946771897017,"357":-0.026010309488733698,"358":-0.1346560709491733,"359":-0.25924112498934027,"360":0.02903327902342118,"361":-0.014865647053559587,"362":0.009578787601555139,"363":-0.09908206501759655,"364":-0.08224672707791603,"365":0.02098312749527423,"366":0.06120271431695206,"367":-0.13622137481451335,"368":-0.02969857441078267,"369":-0.2710447669067914,"370":-0.03598318979116229,"371":-0.11717940512092206,"372":0.01718699498861027,"373":0.07234323516195364,"374":-0.02526039398551643,"375":-0.045276723940664135,"376":-0.0878294389435404,"377":-0.010385858858347478,"378":-0.04765210703238244,"379":0.04189531124155197,"380":-0.26144211596090117,"381":0.0573228084421331,"382":-0.01948558513503402,"383":-0.06001299413570301,"384":-0.09636064851809148,"385":0.03679773182182802,"386":0.05456393040294183,"387":-0.21379495084413822,"388":-0.10409497308009714,"389":-0.014719794187186667,"390":-0.04286649021611959,"391":-0.012002778813129519,"392":-0.129013123931821,"393":-0.01752068885972065,"394":-0.14643674708362336,"395":0.03753336842996694,"396":-0.11609521012443484,"397":-0.03623802185486022,"398":-0.1299000603088021,"399":-0.11263498327243278,"400":0.0021843395815689653,"401":0.02104724862501594,"402":-0.11265176979825518,"403":0.11994893671705939,"404":-0.05757607295499545,"405":-0.19101149203181458,"406":-0.02198657540146189,"407":-0.08729387145651239,"408":0.020204364544917648,"409":-0.011908370201406546,"410":-0.14779352283741506,"411":0.027368927092777214,"412":-0.04281188058991202,"413":-0.007934321169147381,"414":-0.08597137631916905,"415":-0.12496516167345835,"416":-0.08188881094511258,"417":-0.07487778963511066,"418":-0.03938552061440345,"419":0.06786927588719721,"420":-0.1492364296519578,"421":-0.06407936354907402,"422":-0.07963243869192281,"423":-0.04036283861874544,"424":0.0549237320077459,"425":-0.14796326659540746,"426":-0.07384659741313077,"427":-0.03438946461686113,"428":-0.09965608672144552,"429":-0.004851132588762422,"430":-0.11975471687185398,"431":-0.06537390049395492,"432":-0.051146699508673885,"433":-0.16101439573454718,"434":0.003794088496051938,"435":-0.11004260972398325,"436":0.032656063384063946,"437":0.1211445483254758,"438":-0.06563470034859237,"439":-0.19264653469767404,"440":0.0409564592053486,"441":-0.02316234024780688,"442":0.014262809722969097,"443":-0.14272305794951973,"444":-0.0311541408904634,"445":0.0071566403324405115,"446":-0.11645500225190558,"447":0.011720575543153118,"448":-0.02249823036917146,"449":-0.10227973713627671}},{"sx":1,"sy":1,"depth":450,"w":{"0":-0.006498327423783633,"1":-0.02121431119922792,"2":-0.04472432136427618,"3":-0.06833612679631326,"4":0.0423905138395785,"5":0.030341698805701443,"6":0.06880513323213096,"7":-0.16154141377743395,"8":0.00512578232218498,"9":-0.11658723064680944,"10":0.09201538513414168,"11":-0.07124633418646463,"12":-0.021214653499661673,"13":0.014077464783850968,"14":-0.12549169582894282,"15":0.01585716648431537,"16":-0.03657151227912492,"17":0.05386400079117102,"18":0.12526826761771515,"19":0.01836542063599437,"20":-0.026602080778124208,"21":-0.05852005565183391,"22":-0.049194498730988315,"23":0.06889278901814024,"24":-0.01007370100516371,"25":-0.1392418598149439,"26":0.07326239588230161,"27":0.034471643320337655,"28":0.16839144762518113,"29":-0.11406445609623306,"30":-0.12218877676412188,"31":-0.05329247880612239,"32":-0.18261828313559658,"33":-0.05472523349310728,"34":-0.07882417782047663,"35":0.0011514367770125676,"36":0.08376751807193328,"37":-0.0003065810438105474,"38":-0.050784411450094116,"39":-0.1294206490735718,"40":-0.06494672299793068,"41":0.1810738039998465,"42":-0.01706841585658865,"43":-0.05805234435462424,"44":-0.0805385873556191,"45":-0.028016420480550194,"46":-0.02261150227773442,"47":-0.13615262327606686,"48":-0.03551179386791012,"49":0.003182279537572566,"50":-0.12332585515724119,"51":-0.03289575934593785,"52":-0.14043350595744114,"53":-0.09163101296747207,"54":-0.038602238719038715,"55":-0.05774550956261543,"56":-0.20121994558848716,"57":-0.1503354637070362,"58":-0.05682154417279371,"59":-0.09859995338663483,"60":-0.03620015905864619,"61":-0.012666022430217317,"62":-0.014352291449587844,"63":-0.11562415957773704,"64":-0.4479284222825109,"65":-0.1247440667361252,"66":-0.04646980398928098,"67":0.07586750549760173,"68":-0.09920112362650384,"69":-0.035876042334970555,"70":-0.16631944461215703,"71":-0.10133263796115098,"72":-0.046581455366018244,"73":0.027672291089761776,"74":-0.29095884695154267,"75":-0.042115924322992535,"76":0.06551065000058971,"77":-0.1712620789063269,"78":-0.011809122338991205,"79":-0.11318486080346053,"80":0.058996224977629935,"81":-0.22511142812725157,"82":-0.16806734226975664,"83":0.016213230040747834,"84":0.12473719936055488,"85":-0.03821738291732409,"86":0.03297270412933651,"87":0.05269943746031576,"88":-0.10882583601447811,"89":-0.186834608381411,"90":-0.0604364827856153,"91":-0.07014412819917283,"92":-0.10002442707253462,"93":-0.04471361588241503,"94":0.04951896923924767,"95":0.060155480999329575,"96":-0.0700239128072206,"97":-0.07728505815173142,"98":0.030914069859786675,"99":-0.17816791796895673,"100":0.09737680495091958,"101":-0.20275340671433142,"102":0.015576492018250072,"103":-0.023888459690716308,"104":-0.1740484928518241,"105":-0.0030549889139016954,"106":-0.03592501996411519,"107":-0.02952854026667982,"108":0.09068428585129797,"109":0.054949993612761254,"110":-0.005837024490598136,"111":-0.041389606883944316,"112":0.017304009229188837,"113":0.16998471274882448,"114":-0.02855263856407433,"115":-0.24445978037170538,"116":0.0067144010996428,"117":-0.0781974578134242,"118":-0.11542735548559117,"119":-0.12569575934376673,"120":-0.018221219639634887,"121":-0.02926849539583543,"122":-0.22154248860882017,"123":0.015668443840911577,"124":-0.08366841104949893,"125":-0.002168749159494915,"126":0.13316241249069774,"127":-0.09102264519744306,"128":-0.11471520629698531,"129":-0.13364817785628288,"130":-0.0276945066286577,"131":0.14304031255328042,"132":-0.07184943975390709,"133":-0.227974928147021,"134":0.03172020660909284,"135":-0.1325933416879596,"136":-0.056012897233757596,"137":-0.08415285414711036,"138":-0.05080025948183408,"139":0.02705359986789953,"140":-0.09620735667712844,"141":-0.00835983939307834,"142":-0.19469924463839897,"143":-0.16200779767762208,"144":0.05086799301070008,"145":-0.038776418915036345,"146":-0.28458443773845327,"147":-0.05488658312547247,"148":-0.003229961702495694,"149":-0.10082997253374126,"150":0.004299263539388996,"151":-0.11952002472567896,"152":0.0018988067640579274,"153":-0.15219722613833897,"154":-0.052472706883869194,"155":-0.009155815145060135,"156":-0.030765208284771223,"157":0.10494340694836844,"158":-0.08624952562968771,"159":0.057689750405372886,"160":-0.25276505297352153,"161":-0.014580991356147481,"162":0.11637321878184809,"163":-0.04009414963498425,"164":-0.08001250096786422,"165":-0.013239189252013962,"166":-0.04045443506241428,"167":-0.3409623044196851,"168":-0.03814232840085519,"169":-0.13183150675317692,"170":-0.03529660838083192,"171":-0.24178481931622509,"172":-0.047543948624846295,"173":-0.1107458546453324,"174":-0.05795888026679764,"175":-0.0033786701465107756,"176":-0.02385954697496327,"177":0.025556802891518914,"178":-0.04108257821682972,"179":-0.14584058465771627,"180":-0.16730716287027572,"181":-0.04286343504130116,"182":-0.04373795142132183,"183":-0.03982576398657842,"184":0.0401392520743887,"185":-0.03918618267624329,"186":-0.14345600077165765,"187":-0.03542861925605763,"188":-0.021194431822673013,"189":-0.19266105641752057,"190":-0.027990523466472576,"191":-0.16394337127462577,"192":-0.008953101467842032,"193":-0.021861761001811437,"194":-0.0796914706961056,"195":-0.044829474694702165,"196":0.001390563525483688,"197":-0.16519804223637566,"198":0.06467228082709234,"199":-0.08079621311877866,"200":0.05464507023809221,"201":-0.09759308192968243,"202":0.047276366228271326,"203":0.14360427918098803,"204":-0.062407500214831026,"205":-0.20958877175984578,"206":0.0075482900812091054,"207":-0.20712408706294835,"208":-0.022616001737847582,"209":-0.10750201281859322,"210":-0.026216160948001034,"211":-0.07159588104148437,"212":-0.09660552186374367,"213":0.01621310650623082,"214":-0.1374366260066226,"215":-0.06476171756701235,"216":0.026819313973994355,"217":-0.18564244518278955,"218":-0.13011990734682716,"219":-0.15409144394475888,"220":0.05423121211213218,"221":0.07987588404937512,"222":0.09946996811827354,"223":-0.29179511472282005,"224":0.07830563913334408,"225":-0.28123169665788966,"226":-0.03942282449360888,"227":-0.08274308414039502,"228":0.038193712872294616,"229":-0.009961786365464086,"230":-0.06072670579132684,"231":-0.01125074238717603,"232":-0.08746961712644852,"233":-0.14469912822615832,"234":0.0816049593374292,"235":-0.0729385499658985,"236":-0.10652962703266422,"237":-0.10540453085484817,"238":0.07891511475560606,"239":-0.043940603765262584,"240":0.08845620703671211,"241":-0.16259220969393287,"242":0.021377295870765034,"243":-0.2947316621220121,"244":0.07572530777321787,"245":-0.11094742416111567,"246":0.0005240488089388596,"247":-0.057717513588200584,"248":-0.06018094923550377,"249":-0.017492488856154557,"250":-0.09970774500634005,"251":0.011946387901818227,"252":0.004026053242502604,"253":-0.05051127220169175,"254":-0.1305952389292518,"255":0.012815352859099096,"256":-0.08775598697551402,"257":-0.09566331492568851,"258":-0.1082894599823491,"259":-0.17113860912368375,"260":-0.03116128627682604,"261":-0.2165873295817931,"262":-0.005072911953549971,"263":-0.0497603868131113,"264":-0.04352133927211684,"265":0.1183163010926495,"266":-0.11148021992704898,"267":-0.06458054741726131,"268":-0.03370160038218563,"269":0.07975465812228734,"270":-0.152425205215149,"271":-0.022126637372875655,"272":-0.07810641955161177,"273":-0.16923774325702934,"274":-0.03439538711608705,"275":-0.046882661369036675,"276":-0.20071484916290752,"277":-0.149726009374269,"278":-0.0024690646930287806,"279":-0.045465489369096605,"280":0.07406397763504449,"281":-0.03844078322135946,"282":-0.018561788394082138,"283":0.0007173960191932444,"284":-0.03222328180031214,"285":-0.028858219092094912,"286":-0.02920054344092335,"287":0.008220662756466665,"288":-0.0868319543763465,"289":-0.11490589528668102,"290":0.0033983103795041155,"291":-0.15364273228535993,"292":-0.09755888337320376,"293":-0.00538447057917049,"294":-0.06122175964329874,"295":-0.23511922628049814,"296":-0.02372100540562327,"297":-0.12256829496994942,"298":-0.08112837258450989,"299":-0.1706089725424386,"300":-0.06630471617418969,"301":0.029685316305478958,"302":-0.07733944673958022,"303":-0.004278701514983517,"304":-0.020203666945606314,"305":-0.02285006011387575,"306":-0.06983000114635231,"307":-0.08735602260615549,"308":-0.26611329163019765,"309":-0.20014212680062768,"310":-0.04333279730866139,"311":-0.058295530255084924,"312":-0.07291388116418279,"313":-0.23088195488279212,"314":-0.0887381040745409,"315":-0.1981177376791888,"316":-0.008784599080520235,"317":-0.13544131478296795,"318":-0.0891542582072839,"319":-0.02784297562020303,"320":-0.07597670597574453,"321":0.008625260416586848,"322":-0.15577165172875074,"323":-0.14015015694091063,"324":0.058569085463855475,"325":0.0017495010668629447,"326":-0.11829198056075832,"327":0.01579473429541533,"328":-0.032015456927464665,"329":-0.13390163362064567,"330":0.0482077629800956,"331":-0.11994022045648128,"332":0.0381529715850035,"333":-0.15976338393844217,"334":0.09823748666886732,"335":-0.19004718486726152,"336":-0.08980567472491573,"337":-0.08979551777615612,"338":-0.06226180311933343,"339":-0.028493183832688746,"340":-0.10789737696905176,"341":-0.04521130859617194,"342":0.039360669049115976,"343":-0.026417690172040226,"344":-0.09718160509108185,"345":0.05553148457763988,"346":0.02524463582845377,"347":-0.02098266343093347,"348":-0.05715694143069837,"349":-0.13990337184457452,"350":0.04994504650734806,"351":-0.2939656466900782,"352":0.03767741655232399,"353":-0.17838786383771832,"354":-0.10025557303140432,"355":-0.06638964436122212,"356":-0.15392168713624446,"357":-0.016565169240705106,"358":0.0017460827979462372,"359":0.019909636034953767,"360":-0.07036273326243496,"361":-0.06704095823215764,"362":0.02338931560936352,"363":-0.06121482559493589,"364":-0.061718921717361666,"365":-0.045446691379525714,"366":-0.0432469725626162,"367":-0.07964698085237495,"368":-0.03192656431517883,"369":-0.009827258560594769,"370":-0.09067513986525963,"371":0.011633592846659426,"372":0.00664408400857948,"373":0.017036098271243777,"374":-0.05417527519412948,"375":-0.07729119143896515,"376":0.11172315916381732,"377":-0.03643135885352551,"378":-0.07538798246377472,"379":-0.020024318146487925,"380":-0.16732240249751956,"381":-0.13320262418150072,"382":-0.057904510760009305,"383":-0.195670561814545,"384":-0.10458883816437402,"385":-0.1470139221855336,"386":-0.011231122114041092,"387":-0.03611578222221593,"388":-0.1151097998279797,"389":-0.05105722076352957,"390":0.017257079338989043,"391":-0.05301420005866503,"392":-0.051314549526248435,"393":0.056033261979802504,"394":-0.15952758095764819,"395":-0.00018225930935077746,"396":-0.22209936800509994,"397":-0.049914842094545685,"398":-0.3016338004743699,"399":-0.14156706905395208,"400":-0.13050483578329997,"401":-0.1864499742430978,"402":-0.04000290846612549,"403":-0.23670218263417772,"404":0.023896180935817996,"405":-0.10571147268189793,"406":0.05850656659345341,"407":-0.09244052030425784,"408":-0.10471491894267036,"409":-0.0756543981351158,"410":-0.022578839451436156,"411":-0.012474006677119055,"412":-0.14684891080051266,"413":0.006602634900922778,"414":-0.10312699994983442,"415":-0.0956250277337557,"416":-0.09206753440025613,"417":0.04563973317064696,"418":-0.10507338698431327,"419":-0.05902723360754335,"420":-0.023376635559370047,"421":-0.12014507532893759,"422":-0.04454573646660834,"423":-0.12621886823291145,"424":0.05864182858986369,"425":-0.037537665911737156,"426":0.05723887812917628,"427":0.020959872644668583,"428":-0.09483246229043474,"429":0.02298229512892905,"430":-0.05515940614206467,"431":0.056496401283759864,"432":-0.10367875183733102,"433":-0.04212220037739662,"434":-0.07776072964381357,"435":0.10079828882843173,"436":-0.237547126620706,"437":0.005714864130600414,"438":-0.09643038297975043,"439":0.02636323496703778,"440":-0.04155146707624082,"441":-0.19074585933912339,"442":0.004270059743620026,"443":-0.00889637231060171,"444":-0.06462087503349566,"445":-0.008627825378855506,"446":-0.10901237794305285,"447":0.0729398461835158,"448":-0.01302755690713804,"449":0.08057248866196337}},{"sx":1,"sy":1,"depth":450,"w":{"0":-0.05079719377312654,"1":-0.02181027198707448,"2":-0.13783652581238254,"3":-0.050896957700442905,"4":0.008769788048896714,"5":0.006001502711239942,"6":0.000686491189621939,"7":-0.0814439641531926,"8":0.0266077925279766,"9":-0.00807513360349434,"10":0.019841830549041727,"11":-0.1537937624492296,"12":-0.04078697321720394,"13":0.015786709028057243,"14":-0.19166886918856643,"15":0.04111788851378437,"16":-0.005214312657655612,"17":0.01754591514926053,"18":0.02677925922841915,"19":0.07122824003061085,"20":-0.030366478304343865,"21":-0.049378150977009344,"22":0.02279066365034784,"23":0.02390753075452934,"24":0.006840730161460432,"25":-0.15070725271490737,"26":-0.017920005585269152,"27":-0.10462437375030106,"28":-0.035588412540511524,"29":-0.10827728820343498,"30":-0.06769824952653573,"31":0.008630404214606075,"32":-0.1932875715513161,"33":0.02719444326624892,"34":-0.11236798053110934,"35":-0.04020772786818648,"36":-0.060833180323290964,"37":-0.07983277288290666,"38":-0.062030885998830956,"39":-0.19298777794786476,"40":-0.00006490796919127856,"41":-0.13787185262531523,"42":-0.03490353902470798,"43":-0.17418308226578147,"44":0.018334691622026732,"45":-0.061306075075004504,"46":0.07604046302169117,"47":-0.09910625570465914,"48":-0.04179113159701257,"49":-0.03754372382096157,"50":-0.2222274011300484,"51":-0.018125544271652676,"52":-0.15047094184913154,"53":-0.0162099108190716,"54":-0.09021342689022752,"55":-0.1949779871212813,"56":-0.03358100456445906,"57":-0.028764370228707262,"58":0.01095032606313632,"59":-0.03746521483001541,"60":-0.00396749457397562,"61":-0.2305949877571355,"62":0.02001509781340612,"63":-0.08186085341065776,"64":0.17969577448827023,"65":-0.08439589303764465,"66":-0.03639141883753621,"67":-0.03598923751921507,"68":-0.2045882454100748,"69":0.05828587240268495,"70":-0.04071495129071632,"71":-0.06560034664024987,"72":-0.039298094731937266,"73":-0.2324472557361767,"74":0.0630436987949978,"75":-0.059743262104653604,"76":0.06390217550287193,"77":0.037073449674882825,"78":-0.005670711836994193,"79":-0.22729918377638897,"80":-0.02042990519345137,"81":0.07994991288002092,"82":0.014332770971051383,"83":0.024095807501340657,"84":-0.12639113166902047,"85":-0.014897104014201214,"86":-0.019382543259964566,"87":-0.032023627687901846,"88":-0.060493156517643996,"89":-0.04339452962638503,"90":-0.0585092787903119,"91":-0.09965998507551996,"92":-0.0925216013860967,"93":-0.039018872933207153,"94":-0.06542204007052564,"95":0.0825101342947483,"96":-0.0943868257949277,"97":-0.037236324082018796,"98":-0.014390866985150906,"99":-0.19585095775042002,"100":0.04719431153959907,"101":-0.06916311532566104,"102":-0.003455231391025828,"103":-0.006950665371425761,"104":-0.23593517536894315,"105":0.03734665665757759,"106":-0.08193462981534605,"107":0.044014101593028224,"108":-0.025549809252022968,"109":-0.021079122521753584,"110":-0.14503874620436696,"111":-0.20616354149190932,"112":0.09858555457631712,"113":0.05562863658655293,"114":-0.11670611878849584,"115":-0.061364092553390696,"116":0.021194476346429028,"117":-0.2575976973624909,"118":-0.020976989188292154,"119":-0.018018906285370943,"120":-0.03822058072773863,"121":0.001579870837723198,"122":-0.20665913181346102,"123":0.017675996458328784,"124":-0.0969716521928156,"125":-0.017550864893739884,"126":-0.1173815566702999,"127":-0.060065203580873555,"128":-0.2084956674134717,"129":-0.13245868618256623,"130":-0.03120979926883157,"131":0.016617049383640246,"132":-0.16711178010800043,"133":-0.09414731125971826,"134":0.02948554765314826,"135":-0.31112313060143676,"136":0.029321237720101062,"137":-0.1437274382455728,"138":-0.0003031042853426177,"139":0.07808131883580957,"140":-0.23349100385709715,"141":0.05971798264160236,"142":-0.08653310048786274,"143":0.017678951416845216,"144":-0.1504065670162491,"145":-0.11617962043484714,"146":-0.060643239463794275,"147":-0.16757162114076893,"148":-0.04188743076172135,"149":0.08918783728878846,"150":-0.08071639229832427,"151":-0.10713146704314541,"152":0.0692707396539131,"153":-0.025741466720380912,"154":0.01699642212274882,"155":-0.1004909393026439,"156":-0.031539534285919324,"157":-0.026305482622374667,"158":-0.2609579024347583,"159":-0.013967214584111638,"160":-0.06508005735768765,"161":-0.11655005575016164,"162":-0.1363010144197255,"163":-0.11174867289793192,"164":0.11799887220654409,"165":-0.14461077383531076,"166":-0.050705499453357235,"167":0.11682887600717347,"168":-0.05448242902985953,"169":-0.06667742031765171,"170":0.026091810057841048,"171":0.07840437348766653,"172":-0.06506757895445213,"173":-0.14887078900258738,"174":-0.11406391587377489,"175":-0.04041128239962677,"176":-0.12832156418581422,"177":0.031220859738717396,"178":-0.15302535784652885,"179":-0.029096553915773937,"180":0.02762776869339279,"181":-0.051635626194700156,"182":0.00007237056544581959,"183":-0.14201325137032467,"184":0.014397260974323298,"185":0.021132933017910367,"186":-0.09975825964584656,"187":0.0013263879960041193,"188":0.03971547836846776,"189":-0.10590446732997469,"190":-0.01369490706781343,"191":-0.11818679063388506,"192":-0.06512949117073653,"193":-0.01966197586287896,"194":-0.17715045615844802,"195":-0.014413240844478106,"196":-0.10881566801332844,"197":0.025032162678919227,"198":-0.007907196449584868,"199":-0.0013858025954788405,"200":0.08447046116863778,"201":-0.15753203266596072,"202":0.04016052339575773,"203":-0.017960867786475532,"204":-0.15904325962787108,"205":-0.04631989683251333,"206":-0.034985207623423074,"207":-0.21574777028391093,"208":-0.0028203853481114775,"209":-0.05348971983788716,"210":-0.004388311358341437,"211":0.01728977414556999,"212":-0.16782014271577014,"213":-0.012865511214159978,"214":0.0013449777122018522,"215":0.01462341980553798,"216":-0.13143526491361265,"217":-0.048832280944021755,"218":-0.14254169124408392,"219":-0.07605327615275287,"220":-0.02658746351506969,"221":-0.13021983269788398,"222":0.0006768319197405881,"223":-0.18511675016118884,"224":-0.002485202997272684,"225":-0.22231927274224775,"226":-0.0973835754295495,"227":-0.08063528671669763,"228":0.03584879927770375,"229":0.0833083748375994,"230":-0.04531854486111398,"231":-0.00490303937185007,"232":-0.06762705147342224,"233":-0.008542029057009022,"234":-0.15673751460169627,"235":-0.03053678264965028,"236":-0.079567748264284,"237":-0.1297831308620268,"238":-0.02152101782947975,"239":0.02361031021076607,"240":-0.08355839274056233,"241":-0.108156390728247,"242":0.09136720255802291,"243":0.029086087546389805,"244":-0.04628406217138392,"245":-0.07024097453619518,"246":-0.10041905772036376,"247":-0.0004720137789333073,"248":-0.1700408483382474,"249":-0.06905665487611105,"250":-0.06440462397167518,"251":-0.04426887944544205,"252":-0.1451769907710356,"253":-0.03878451569594864,"254":-0.008229146182978818,"255":-0.09293247906370622,"256":-0.04843165749166784,"257":0.046825561896544805,"258":0.014561101253348353,"259":-0.02750301668986597,"260":-0.05688338422756409,"261":0.022536944108578285,"262":-0.11163900554924207,"263":-0.048351454373137315,"264":-0.0825064110741589,"265":0.0354540152322381,"266":-0.09701472172285273,"267":0.013582118091869282,"268":-0.06024237760414681,"269":-0.08542137372742258,"270":-0.059092478905438554,"271":-0.07279390186913977,"272":-0.019133045149112144,"273":-0.15318287198858518,"274":-0.06274497907528037,"275":0.041559122079699376,"276":-0.060934318538974186,"277":-0.03599839708754155,"278":-0.06049630163432271,"279":-0.02662866430838304,"280":0.0488015261285837,"281":-0.055495351860399916,"282":-0.04733731992144464,"283":0.005141028366931899,"284":-0.18960574557910767,"285":-0.075799868542583,"286":0.03817400744532944,"287":0.004371914235739056,"288":-0.14637769497415118,"289":-0.0993661089157631,"290":-0.059786276348083985,"291":-0.10827765197348241,"292":-0.02225425739617273,"293":-0.0570117270177577,"294":-0.07794499723706291,"295":-0.15455487696069614,"296":0.0175265850975506,"297":-0.15662115375993238,"298":-0.10412109168949026,"299":-0.09710329718256899,"300":0.027259899236385523,"301":-0.04270197556846908,"302":-0.17372200669598362,"303":-0.008074316046546464,"304":0.0663096275040465,"305":-0.09215324811268331,"306":-0.25129361660383864,"307":-0.11158756630147892,"308":-0.22664346980357825,"309":-0.06793650094936494,"310":0.009638235525023872,"311":-0.19026078902585414,"312":0.10150248017813294,"313":-0.1725552456989279,"314":0.029229634582541502,"315":-0.14439044885177277,"316":-0.07741723396725235,"317":-0.2648543381538968,"318":0.02937048565060468,"319":-0.012084393123043274,"320":0.06628608041198475,"321":-0.023598938487335387,"322":-0.0416085278068379,"323":-0.1224940925722246,"324":-0.11267396989744678,"325":-0.07039574141654928,"326":-0.14225353434361246,"327":-0.029036608131693092,"328":-0.08615644506702934,"329":-0.03279610464404238,"330":0.0746186488651409,"331":-0.17891117132882212,"332":0.051634056419237954,"333":-0.13827411293727443,"334":0.029807239511946176,"335":-0.10511074209613008,"336":-0.013021476467034427,"337":-0.07711876803913786,"338":-0.17422765992548694,"339":0.08564592779610164,"340":-0.0323102535628777,"341":-0.09421538905583655,"342":-0.045181174035542435,"343":0.0032107494821709387,"344":-0.01027005043098896,"345":0.017176061273294338,"346":-0.10827770918268852,"347":0.03369065996413083,"348":-0.021100470697901753,"349":0.025221421261567567,"350":-0.002666468312880796,"351":-0.10232403174785944,"352":-0.06648369581175652,"353":-0.12551216111932534,"354":0.08014616179248095,"355":-0.04098914625185644,"356":-0.15791673826642888,"357":-0.04554440794587498,"358":0.019045601223532695,"359":0.008717596700689986,"360":-0.12391819508329588,"361":-0.06396812704225444,"362":-0.15220688486458192,"363":-0.1626285162286025,"364":-0.008431005570237746,"365":0.1297002023996914,"366":-0.08628192939851183,"367":0.013829945165575355,"368":0.06981986448679482,"369":-0.015914197587477332,"370":-0.021383287169397813,"371":-0.011077396828072482,"372":0.07604095341987838,"373":-0.008222063935485384,"374":-0.09095136134153449,"375":-0.08921868235105972,"376":0.049610220354024674,"377":-0.009776577563974808,"378":-0.11074572434435752,"379":-0.0464921051335305,"380":-0.04726974858453557,"381":-0.05739603509324834,"382":0.027681764239182532,"383":0.012919741606709046,"384":-0.02462767149779277,"385":-0.002168525379334679,"386":-0.051819492386891444,"387":-0.05626762127749884,"388":-0.12492238900847814,"389":-0.10170018959253946,"390":-0.09402094091077214,"391":0.01072865209400481,"392":-0.11579486944129948,"393":-0.01079132574071048,"394":0.05921547833075186,"395":0.030185698613082325,"396":-0.21404038760155558,"397":0.005938062151970798,"398":-0.1762021352087046,"399":-0.026914276877160356,"400":-0.06951555160688935,"401":-0.0376698284683086,"402":0.026858204222612057,"403":-0.17314494616174167,"404":-0.06363852702193407,"405":-0.21477492773977605,"406":0.06830726935097683,"407":-0.1413271586523669,"408":-0.08509591614578993,"409":0.005993546676464674,"410":-0.036536745898756745,"411":0.019723004369055924,"412":0.043065786772860534,"413":-0.02400441925434665,"414":-0.11025936153957273,"415":0.0039023819979052844,"416":-0.27144843420497894,"417":-0.013688607101154972,"418":-0.0018928980105332848,"419":-0.05179647685955386,"420":0.0859880449666605,"421":-0.1814887962642114,"422":-0.03389134245500711,"423":-0.19727118773506028,"424":0.04327698576502262,"425":-0.1373300427660645,"426":-0.026659017531486234,"427":0.006152698990675015,"428":-0.17303922463135604,"429":-0.026509066059654262,"430":-0.06353154945903558,"431":-0.1145307595496627,"432":-0.06051282191932715,"433":0.015497214723783844,"434":-0.07393866194252618,"435":0.029687646060852096,"436":-0.0015440111242135096,"437":0.042721549561910065,"438":0.08419426707259274,"439":-0.06386172610561083,"440":-0.05822908990314708,"441":-0.1640132881807483,"442":-0.043050731270236745,"443":-0.10026902400425777,"444":-0.033562171235082476,"445":0.08635520206264759,"446":-0.08400878408462178,"447":-0.09275589388903786,"448":0.013728483050678475,"449":-0.18512588112865747}},{"sx":1,"sy":1,"depth":450,"w":{"0":-0.04332158152278339,"1":-0.0429495193291606,"2":0.03008363257545295,"3":0.04229629901291908,"4":0.017121259634211683,"5":-0.07185954995582405,"6":-0.023029438244080828,"7":-0.11854788691927733,"8":-0.054822727329142146,"9":-0.18374058274327792,"10":-0.019972185599362608,"11":-0.0989278481304215,"12":-0.023920678183794935,"13":0.08285157977010736,"14":-0.05721941335295444,"15":0.021457672879609997,"16":0.036978030522318295,"17":-0.11940309701035765,"18":-0.094390237702594,"19":-0.008460749700709529,"20":0.01808585298647012,"21":-0.03498363655969937,"22":-0.12744273725875144,"23":-0.09513282033134797,"24":-0.014477637172378856,"25":-0.087132292490026,"26":0.03251131669548166,"27":-0.07593250212329836,"28":-0.03147599894489223,"29":-0.060909938588839876,"30":-0.008335840767983195,"31":0.0623645959476926,"32":0.029010956269540887,"33":0.06566214483184023,"34":-0.050327891882685646,"35":-0.030096913289965194,"36":-0.03142488747031572,"37":-0.0539611157840596,"38":-0.02440084312376303,"39":-0.03472721060141049,"40":-0.03357525728836312,"41":0.0336601394090624,"42":-0.04152231970814427,"43":-0.17404943709115267,"44":0.016790443518661314,"45":-0.08278676357808967,"46":-0.010562761926446519,"47":-0.07055075315256823,"48":-0.03299367298124468,"49":0.017748356336797763,"50":-0.30432988442004455,"51":0.016410148090025133,"52":-0.058275966060581955,"53":0.0703021255716498,"54":0.048341227242666616,"55":-0.1212852490323045,"56":-0.04465455609476972,"57":-0.004960636179173549,"58":-0.05203723820014912,"59":0.12171196367848708,"60":0.03620153415646395,"61":-0.10781444611721772,"62":0.015216398344087095,"63":0.004839633316590121,"64":0.091677268299175,"65":-0.17144773246535752,"66":-0.007630616314516811,"67":-0.04874129796204564,"68":-0.12075137813743518,"69":0.019942310417876807,"70":-0.10225708336572117,"71":0.120072876382495,"72":-0.09580509193468827,"73":-0.2774877120088348,"74":0.0625531365688188,"75":0.04797050331617935,"76":-0.05075888077250867,"77":-0.04871497088801639,"78":-0.06404558893456427,"79":-0.1500909370540009,"80":-0.004108386266923904,"81":-0.06305979288826302,"82":-0.1434879505513534,"83":-0.08046293595145121,"84":0.04306073229521387,"85":-0.03706288271576071,"86":0.017935771521817724,"87":0.0010849370643399997,"88":0.05910740475515151,"89":0.1274018368980814,"90":-0.07962015384959285,"91":0.03431033143475587,"92":0.030000541360059835,"93":0.004796621944272918,"94":0.0335175811970097,"95":-0.2763904849257531,"96":-0.17611597380236763,"97":-0.04587587098998615,"98":0.04835928107299054,"99":-0.19368902574094857,"100":-0.13778803406921888,"101":-0.00129863755407067,"102":-0.0018033316833629296,"103":0.036927149601426436,"104":0.0742887936941347,"105":0.07795932960600836,"106":-0.07233386453707263,"107":-0.03854044965933758,"108":-0.022668956370204867,"109":0.08328205584914765,"110":0.011020633859678388,"111":-0.0951675556325506,"112":0.027058922617318442,"113":-0.01267988874076605,"114":-0.11852522254552722,"115":-0.06086119830014621,"116":0.0535380359051036,"117":-0.2801260572229571,"118":0.0216536462463032,"119":-0.01616533262004913,"120":-0.01396345416484712,"121":-0.02326779588572767,"122":0.027563867321333705,"123":0.023297174943917507,"124":0.09158266775307822,"125":-0.0799758870731248,"126":-0.10295086299308544,"127":0.006132472667807656,"128":0.1235247813167561,"129":0.017973282330859017,"130":-0.033279373984191084,"131":0.05427580262759285,"132":-0.1804331431601772,"133":-0.1253428620307703,"134":0.03773240518875718,"135":-0.24432670922497896,"136":0.023475830492780545,"137":-0.0472093307707898,"138":-0.024446917247212336,"139":-0.00009764981969811154,"140":-0.3555901275737885,"141":-0.024951640855557847,"142":0.08957703483970667,"143":0.049904768306712165,"144":-0.07151513025821926,"145":-0.016374847002254583,"146":0.15586245808028715,"147":-0.15113672534873768,"148":-0.014645788426877653,"149":0.03798581161421229,"150":-0.1817829420085098,"151":-0.12769648050537938,"152":0.0979425690019468,"153":-0.07373890719318124,"154":0.025700714219995167,"155":-0.05963766595188797,"156":-0.04184147337285282,"157":0.02250376846908653,"158":-0.06080265718954008,"159":0.014995386456790051,"160":0.03142367670097151,"161":0.07576429968794722,"162":-0.16644245759653825,"163":-0.23005243565642522,"164":0.000010938198846761467,"165":-0.19633197754519402,"166":-0.09343300384074306,"167":-0.09988766983627499,"168":-0.15637623268695192,"169":-0.20268426153651734,"170":0.03989931792919983,"171":-0.12904254173008742,"172":-0.2854536435138321,"173":-0.11374508247322138,"174":-0.07284101915387306,"175":0.02697244047645504,"176":0.009294213841859762,"177":-0.058541990754437064,"178":0.026272763138147852,"179":0.008905780209348332,"180":-0.05689014250450715,"181":-0.009015904422660072,"182":-0.07761989586165517,"183":-0.0584014254354168,"184":0.026631619599996464,"185":-0.43989876420068436,"186":-0.046435322354838125,"187":-0.09881992032604739,"188":-0.023541893870204465,"189":-0.22614885732189283,"190":-0.1920028404050759,"191":-0.19504487424073702,"192":0.02014054306594311,"193":-0.003266620742320365,"194":0.04896293925529961,"195":0.023373793279512802,"196":-0.08064938572460212,"197":-0.06226446967274535,"198":-0.0784065724549041,"199":0.075094924478213,"200":-0.04742166949218959,"201":-0.18854375846093985,"202":0.0015210767809071325,"203":-0.13951006464610818,"204":-0.15705198161341544,"205":-0.2187967782767851,"206":0.04773642005096912,"207":-0.1675955539492994,"208":-0.06089648382840607,"209":-0.11600847614660606,"210":0.10676279129112125,"211":0.03852075930285817,"212":-0.039192944240659694,"213":0.00648241113026619,"214":0.018372402583743216,"215":0.03581323898407193,"216":0.022744555458482293,"217":0.030476728978106413,"218":-0.06628307639145053,"219":-0.23669428670348713,"220":-0.0382590841079664,"221":0.029149943348858384,"222":-0.022961915443849377,"223":-0.2833202776532764,"224":0.008389893324808795,"225":-0.17763547201247834,"226":0.027945001576481353,"227":-0.17911363246991047,"228":-0.010052183980608793,"229":0.052295307419039434,"230":0.02814448887555618,"231":0.012649104254252155,"232":0.04636436535698243,"233":-0.09094901801946673,"234":0.04286564641839259,"235":-0.013651047084487961,"236":0.0045590328495634,"237":-0.14408175548342497,"238":-0.052303864866737174,"239":-0.01639090673002511,"240":-0.10607502653075676,"241":-0.33529471092742585,"242":-0.01889028662810089,"243":-0.15470477721073078,"244":-0.0756952173379271,"245":-0.1723161655853497,"246":0.02651843877076696,"247":-0.005209324387466584,"248":0.15249457076231082,"249":0.06023401085681419,"250":-0.06502676521610865,"251":-0.08387236242168246,"252":-0.1447926194678537,"253":-0.06502262202726461,"254":-0.03470336743483115,"255":-0.17499493498880192,"256":-0.052337235593859534,"257":-0.1588436387605524,"258":-0.1684415612133081,"259":-0.22593478087189436,"260":0.0005275937953440357,"261":-0.21127910649846746,"262":-0.30559903775375924,"263":-0.03392817307245676,"264":0.00011205992775702834,"265":-0.010370729336384811,"266":0.04403949054316446,"267":0.07553810086810878,"268":0.03493118081825762,"269":-0.11052060549131229,"270":-0.07016283816421784,"271":0.04248149208178187,"272":-0.012676639946995631,"273":-0.024734059778278045,"274":0.02356335280606374,"275":-0.4683812447974627,"276":-0.01498325289437546,"277":-0.2369727812582364,"278":-0.06793671227638058,"279":-0.0058339014936878405,"280":-0.0650491023803741,"281":0.028202093558877393,"282":0.034644494967626414,"283":-0.018604739095288217,"284":0.0946830797697926,"285":0.045475102325591654,"286":-0.08754870543660394,"287":0.04577252786361077,"288":-0.048852390609257286,"289":0.11383293946210828,"290":-0.13839298888317023,"291":-0.09296674667265835,"292":-0.02175865967162259,"293":-0.12022255948543074,"294":-0.04037158729638611,"295":-0.2918935794905321,"296":-0.044439787174640075,"297":-0.13605590783995053,"298":0.08559751134247619,"299":0.02381965123071531,"300":0.07738620598296524,"301":0.03158160988335084,"302":-0.057868157847230206,"303":-0.03728656003420298,"304":-0.01855216324588732,"305":-0.030120138266039126,"306":0.04219539255027726,"307":0.05708459205881827,"308":-0.028437220910963883,"309":-0.058359647031126116,"310":0.02551580075696132,"311":0.03706438241182524,"312":-0.09189238074297339,"313":-0.28019659041851935,"314":0.06678735825542732,"315":0.004495023837100641,"316":0.04024960230240896,"317":-0.03363381665233511,"318":0.02994271929016513,"319":-0.010757683275432705,"320":-0.10812120081698612,"321":0.0204572709673947,"322":0.03237511157520098,"323":-0.1374115776337842,"324":0.040670804236902156,"325":0.032870152261712374,"326":0.004333771486414389,"327":-0.02927574418049906,"328":-0.00513533539128144,"329":-0.11568983381056522,"330":-0.07387426498352255,"331":-0.09062936681677516,"332":-0.046125154376951145,"333":-0.09568852490302726,"334":-0.007846899341338597,"335":-0.02840773848697134,"336":-0.02297980098056216,"337":-0.011139657613650747,"338":0.09432746736094642,"339":0.07496640691998009,"340":-0.09070964799087858,"341":-0.1724474946336729,"342":-0.06137364700864402,"343":-0.11902375771429999,"344":-0.08879552168705275,"345":-0.07681622971828067,"346":-0.0002451657770326735,"347":-0.2803230925998307,"348":-0.021823765360210134,"349":-0.0358191464678614,"350":-0.06379570873699666,"351":-0.2588487548737406,"352":-0.32603754398337687,"353":-0.11020418463937816,"354":-0.024629493483258314,"355":0.01932826808542306,"356":-0.0074963683924597945,"357":0.05843761685623814,"358":-0.017940243646858898,"359":-0.16128293803419458,"360":-0.008162715427071365,"361":-0.15975502302116992,"362":-0.02987723675989897,"363":-0.17965421261314157,"364":0.05712803323109162,"365":-0.3781615961210484,"366":0.1049619707791306,"367":-0.175557554465349,"368":-0.025014619257948702,"369":-0.05171247154781684,"370":-0.05230515934097783,"371":0.06095991628053814,"372":0.05814084300920264,"373":0.05868665319908978,"374":0.0003148000088498779,"375":0.0691753347989376,"376":-0.12462406328130438,"377":-0.07507745029128683,"378":-0.0602029480216285,"379":-0.026727679114187466,"380":0.00011502779082081519,"381":-0.11302195897463305,"382":0.07768936221628318,"383":0.02757043217188364,"384":0.09026181812861411,"385":-0.22413224910011545,"386":0.003254487291764507,"387":-0.027852504834132485,"388":0.0722526269298865,"389":-0.02074917202681561,"390":0.021995560111829404,"391":-0.04078247983197879,"392":0.06761975632895462,"393":0.01676756066515008,"394":0.033224405310036384,"395":-0.002707893846068388,"396":0.06497296391370533,"397":-0.10267223153489069,"398":-0.013212524972621733,"399":-0.08813386415253471,"400":0.038500790890248,"401":0.08514148575367045,"402":0.14031644486168543,"403":-0.18306965934704295,"404":0.029506380418626767,"405":-0.04760207079260262,"406":0.036294108633744215,"407":-0.10730354828725949,"408":0.009174784743358387,"409":0.03162811684097264,"410":-0.02333053876592878,"411":0.018714407496352697,"412":0.05918243913610895,"413":-0.040024325917004756,"414":-0.1354686537746708,"415":-0.07045982305134549,"416":-0.03341404691646982,"417":0.03276386104997847,"418":-0.0388071208372736,"419":-0.022277561941628922,"420":0.018665047330716337,"421":-0.06895373134525894,"422":0.0535341786410967,"423":0.0002311053670389028,"424":-0.07737200653314229,"425":-0.029027199684484955,"426":0.0183521381390456,"427":-0.027394237187425997,"428":0.04291349057708399,"429":-0.0037408781884682553,"430":0.030311447430875462,"431":0.011975615510738422,"432":-0.041782802383184964,"433":-0.07229070550997924,"434":-0.10245415742570964,"435":-0.061046128671170145,"436":0.013825015851256166,"437":-0.33302735576185927,"438":-0.03528264908445231,"439":-0.018362645365896345,"440":-0.025070824496763358,"441":-0.19206355726234525,"442":-0.23358982138240125,"443":-0.007794898408671013,"444":0.015398937363182787,"445":0.005019407016902622,"446":-0.013111549164121671,"447":-0.018549623050055045,"448":0.038896942808527166,"449":-0.014686126793291484}},{"sx":1,"sy":1,"depth":450,"w":{"0":-0.0004320900836168754,"1":0.006425677222663107,"2":-0.0220689151185546,"3":-0.0276732242698844,"4":0.043081188952529645,"5":-0.10923989208404594,"6":-0.04337248617153557,"7":-0.03431208090609142,"8":-0.012819172801690398,"9":-0.19915381925422046,"10":-0.2423090525096559,"11":-0.15894912666573646,"12":-0.007908372810639134,"13":0.0047470016469867956,"14":0.012977013059792535,"15":-0.019135120216654113,"16":-0.011771840112740002,"17":-0.04445316438167983,"18":-0.07941004608868014,"19":-0.13028117889094962,"20":0.008297898370804708,"21":-0.07633630225734991,"22":-0.03943971616649624,"23":-0.06539779512579476,"24":0.013809358481876782,"25":-0.1867888218097235,"26":0.040418610840152046,"27":-0.022187162027716117,"28":0.034921535880997834,"29":-0.13386473889486603,"30":-0.016768762148284874,"31":0.004712719291009059,"32":0.0645984352662572,"33":0.06208952365218898,"34":-0.04332139619570867,"35":-0.04677465404335538,"36":-0.04082423175023958,"37":-0.14382602129837785,"38":-0.1139117051711171,"39":0.0750496943154622,"40":-0.036475618521432364,"41":0.00026052173952798816,"42":-0.019549666802474035,"43":-0.14259650265739993,"44":-0.02790741904163008,"45":-0.10475418464524261,"46":0.10169116138991752,"47":-0.09093560797263256,"48":-0.004597688239067884,"49":-0.10551750872180357,"50":-0.08871572466478399,"51":-0.0025196060936797586,"52":0.03189346280203403,"53":0.046144925114086834,"54":-0.0063869304776313675,"55":-0.0459027871006103,"56":0.00004469292127961015,"57":-0.0884411520431522,"58":-0.015656111254336965,"59":-0.013111085089435804,"60":-0.05122678785274519,"61":-0.11882302094422974,"62":-0.06344820190687707,"63":-0.07272357749973826,"64":0.03219830843602888,"65":-0.1686155192799075,"66":0.03898363647305715,"67":0.033786851938110776,"68":-0.08601622076555973,"69":-0.007918176304085494,"70":-0.009894154214273778,"71":0.061645603115275824,"72":-0.011763246429321458,"73":-0.17572440740154044,"74":0.07083392807513901,"75":-0.07514188312442135,"76":0.08248134365774193,"77":0.019241958388314277,"78":-0.05126060350932675,"79":-0.06354875995611253,"80":-0.02021779320804655,"81":-0.03969000877293889,"82":-0.01863803566041212,"83":-0.045028621685577294,"84":-0.03300161108193099,"85":0.006043271483862286,"86":-0.06319581891204866,"87":0.031192611274967853,"88":-0.1118802900339687,"89":0.02229958128460631,"90":-0.08710784219653282,"91":-0.024050093853648983,"92":0.004925266328067037,"93":-0.01630120659285374,"94":-0.0005142133711327978,"95":-0.28397342801798964,"96":-0.15415851147081347,"97":-0.25839147866996137,"98":0.03782144845092126,"99":-0.25289381919892595,"100":-0.31934080870725845,"101":-0.16753021741307286,"102":0.0463391514707739,"103":-0.05185697253794028,"104":0.05186527753257608,"105":0.024063320771532032,"106":-0.06291678602550277,"107":-0.05325811405959879,"108":-0.10391874009581277,"109":-0.07642382349167565,"110":0.046783144777957045,"111":0.02262266014589774,"112":0.08759181650398364,"113":-0.03928203446038601,"114":-0.12664938874708248,"115":-0.1977543918807275,"116":0.06264467940483125,"117":-0.20905813055020073,"118":-0.017959337754639336,"119":-0.1950310991729661,"120":0.014798076064799402,"121":-0.037167612601009606,"122":0.03832842266088939,"123":0.007288749954017516,"124":-0.026912837546388794,"125":-0.010518589182784754,"126":-0.054588231398451266,"127":-0.11548725061911218,"128":-0.12962875383735678,"129":-0.11356531851204367,"130":0.021022631105750065,"131":-0.04636598903719298,"132":-0.015021642733631654,"133":-0.049830565561762685,"134":0.042044150647925375,"135":-0.2343898610380051,"136":0.10847272526372426,"137":-0.21146804760907573,"138":0.05133718985762631,"139":-0.016888202650859732,"140":-0.12525545468478722,"141":0.08150243188465844,"142":0.05796200922385771,"143":0.08283074901900402,"144":-0.07132594989655743,"145":-0.10900735658899112,"146":0.005209845865388851,"147":0.012556459177130408,"148":-0.070951121731567,"149":0.11331117991553152,"150":-0.021147116050953256,"151":-0.09804229309489755,"152":-0.03517842642687248,"153":-0.14507030950880134,"154":0.03825358559301976,"155":-0.1399381253093825,"156":0.0027769148723026343,"157":0.10836693980925076,"158":-0.10549142265683262,"159":-0.07222156008608843,"160":0.13094321256459113,"161":0.03031964935465543,"162":-0.05338836639865483,"163":-0.17350867423236066,"164":0.14507101469910558,"165":0.0211899525741093,"166":0.00966627350313201,"167":-0.061991892948509854,"168":-0.012771409649596228,"169":0.006294670423753061,"170":0.017735129905680408,"171":-0.14853089990354074,"172":-0.06832801346683486,"173":-0.11348461631961498,"174":0.028628994610277715,"175":0.014342567695556942,"176":0.027792557444453296,"177":0.00514227156734401,"178":0.033068797625111786,"179":0.012093397236206099,"180":-0.004533553489665351,"181":0.017543392297101553,"182":-0.048287138549894,"183":0.03077912360029825,"184":-0.13175304755083142,"185":-0.3650743467060826,"186":-0.1166791634026853,"187":-0.1415911152932962,"188":-0.016293413890339788,"189":-0.25756384737704036,"190":-0.19929382008690355,"191":0.01221604186543975,"192":-0.03906925377905301,"193":0.0018707665925258028,"194":0.030477997981285417,"195":0.09603302147510923,"196":0.002680542043638333,"197":0.05405537869489167,"198":-0.156550646777623,"199":0.02822726654801732,"200":0.07240999849537606,"201":0.034183551737225065,"202":0.05797966568067182,"203":-0.01820398455948427,"204":-0.0677763477326509,"205":-0.17510756235089506,"206":0.050816602469671526,"207":-0.24051114143869987,"208":0.05336718255914521,"209":-0.1393368531921479,"210":-0.03697976399042402,"211":-0.050068495330821944,"212":0.009809937262727862,"213":0.0406769661312264,"214":-0.02866309535533317,"215":-0.044098373447785416,"216":0.012763473207422077,"217":0.04554526337709827,"218":-0.03348542393959478,"219":-0.05641433580844375,"220":-0.05676182232302819,"221":0.07690623245393925,"222":-0.044532456546762175,"223":-0.17653008654917898,"224":0.0045130883630929,"225":-0.2254480296164873,"226":0.020034081232781602,"227":-0.18326197799366276,"228":0.02591334633439904,"229":-0.014445065602187404,"230":0.02636425679557483,"231":-0.0938023182158321,"232":0.08229591988711014,"233":-0.010940844745201425,"234":-0.014576248874539973,"235":-0.08880499251168521,"236":-0.026113363810254312,"237":-0.09589141173200098,"238":0.042081067708363215,"239":0.11477059236067723,"240":-0.05969705318023361,"241":-0.19500337412097488,"242":0.04645484618991781,"243":-0.15965864139912878,"244":0.04143644896980388,"245":-0.2750856596081468,"246":-0.005887442181714711,"247":-0.013021002147249956,"248":-0.03746562485585457,"249":-0.04696434929067226,"250":0.12662429675884326,"251":0.0032407104202080905,"252":-0.127988530593288,"253":-0.21122727977094644,"254":-0.06522755954504929,"255":0.010291906702621851,"256":-0.07391082752435132,"257":-0.09233165690249653,"258":-0.04682092852247732,"259":-0.26678250006535087,"260":-0.062087392080241,"261":-0.19424512444002992,"262":-0.1469092444227433,"263":-0.1275484431618365,"264":-0.031196338108657472,"265":0.029477517031111095,"266":0.041007563345591865,"267":0.05236024537673581,"268":0.08292714282247839,"269":0.024507124410877157,"270":-0.08564494356035547,"271":-0.07909104418988375,"272":-0.18758357981554158,"273":0.07472293953171953,"274":0.022306141093703005,"275":-0.23625470722086472,"276":-0.13545651416026885,"277":-0.16239180587105467,"278":-0.060787156354627,"279":-0.057981289890225926,"280":-0.2151339723620796,"281":0.0779750975545183,"282":-0.04600938320674796,"283":-0.05824328837338531,"284":-0.1399570056708834,"285":-0.023751552136161404,"286":0.009934137952472723,"287":-0.03909362707192029,"288":-0.09913402268346673,"289":-0.003771085556410408,"290":-0.08892411635951072,"291":-0.30236904140047305,"292":0.04128125903562894,"293":-0.1450957312814145,"294":-0.03379035724054056,"295":0.02683470196131931,"296":-0.08593604979178741,"297":-0.1117815348992043,"298":-0.0477804922900601,"299":-0.004334453839594776,"300":-0.029885447858282167,"301":0.0013719424479519916,"302":-0.09072278768060466,"303":0.05819478331042936,"304":0.05810568288385216,"305":-0.046136290256210896,"306":0.03670303397587617,"307":-0.09167425984332454,"308":-0.025090025845335272,"309":-0.4236966653973841,"310":-0.039346113125803335,"311":-0.012905159581484428,"312":-0.1452050672748099,"313":-0.09756266237930532,"314":0.04703864033727383,"315":-0.07835356737888118,"316":0.05739069414323,"317":-0.060053698917510175,"318":0.038816664786507436,"319":0.041792258454792036,"320":-0.05800666140977972,"321":-0.017624487832316165,"322":0.029046208020751196,"323":-0.10789858277339284,"324":0.028745727274970184,"325":-0.13788340929433113,"326":-0.007121594377391288,"327":-0.4997922707262697,"328":0.03329666511549466,"329":-0.028314390561105837,"330":-0.1202172662545357,"331":-0.287912659611269,"332":-0.04417626676872738,"333":0.025848219017741696,"334":0.023572497064630236,"335":-0.06525812234778094,"336":-0.020658082236227428,"337":0.03873200525077229,"338":-0.008970874712502524,"339":0.000680455677335295,"340":0.004411449017204185,"341":0.008579162625515585,"342":-0.0483618974046157,"343":-0.060147684906077935,"344":-0.08080345474521773,"345":-0.07869615638406877,"346":-0.08147634721905501,"347":-0.14255501861334252,"348":0.0001914285618421735,"349":-0.3956143211224429,"350":-0.00006154126522438888,"351":-0.0271730800708091,"352":-0.04918079642457297,"353":-0.20848133605474878,"354":0.007988706174414913,"355":-0.09417541648778956,"356":-0.003446882524291473,"357":-0.03517876929170751,"358":-0.047730937250029984,"359":-0.0961467592052581,"360":-0.014535978795688891,"361":-0.12757579960167847,"362":-0.16452894263939366,"363":0.09352383929363725,"364":0.004608026025315947,"365":-0.2043649369875046,"366":-0.1294419442497457,"367":-0.02517672543931899,"368":0.10495807974502866,"369":0.15209923985412513,"370":-0.10657237186113093,"371":-0.00978474238745367,"372":-0.047641900486858825,"373":0.08109276808462647,"374":-0.2079355610303427,"375":-0.12041599379005101,"376":-0.08885125484832235,"377":-0.041826590474583945,"378":0.048836226061911396,"379":-0.14902471503220982,"380":0.03194430960594517,"381":-0.3089930261479908,"382":0.030178764187394534,"383":-0.05142908875658729,"384":-0.04272334032270221,"385":0.006909331717704007,"386":-0.03963920178335347,"387":0.22287725812745687,"388":0.09908672480724601,"389":-0.02208245626228038,"390":-0.005489725192115527,"391":-0.07331038384774144,"392":-0.16718626385391128,"393":-0.04007288214885271,"394":0.08727163825246177,"395":0.08518245536528452,"396":0.032265861114140454,"397":0.005019999293900996,"398":0.18933305423329416,"399":-0.42189132613806946,"400":-0.01591754127691826,"401":0.059260864372725194,"402":-0.051372485403772476,"403":-0.026313222503039132,"404":-0.051529394869822685,"405":0.18013669550650485,"406":0.03992664532685666,"407":-0.1027618159542705,"408":-0.015119198882879029,"409":-0.0180283198730491,"410":-0.22615905227431626,"411":-0.007711139144753329,"412":0.045305918190381864,"413":-0.03950609239811518,"414":0.03897908316209061,"415":-0.08361678625317492,"416":0.08337437642372153,"417":-0.5821377000497601,"418":-0.054237849420130387,"419":0.006297530384719468,"420":-0.07794391295267276,"421":-0.21000671630099627,"422":0.011008600755686807,"423":0.08609694103252072,"424":-0.02281326403271754,"425":0.013936666415885044,"426":-0.0788757419167261,"427":-0.0022252540557604183,"428":-0.08360379305672858,"429":0.02179117739814952,"430":0.08158242951229216,"431":-0.049175927255441676,"432":-0.11029335848585567,"433":-0.04065260744401482,"434":0.17556008578602877,"435":-0.15692533720439125,"436":0.05494330998546443,"437":0.010300218782159505,"438":-0.012104919762024645,"439":-0.3765930720947619,"440":0.07216380930019685,"441":0.06236002755026708,"442":-0.058166897309082914,"443":-0.08007911772051363,"444":0.03612526316622972,"445":0.09052576212278426,"446":-0.015224559117229159,"447":-0.045312718897585806,"448":-0.09417869919418964,"449":-0.04614479395157225}},{"sx":1,"sy":1,"depth":450,"w":{"0":-0.02765639001611164,"1":-0.04582798083755554,"2":0.050995743968799995,"3":-0.04160157054642889,"4":0.02810980968185753,"5":0.04980517816356223,"6":0.0400560259618287,"7":-0.083934202564163,"8":-0.02785621198615098,"9":-0.09436041931553013,"10":0.1345092366885693,"11":-0.09493034626578624,"12":-0.0657455393428449,"13":0.06053392357470225,"14":-0.07776039741984665,"15":-0.02026152045569159,"16":-0.1064747053234755,"17":-0.018337332073908023,"18":-0.027900492576020775,"19":-0.07599919585030311,"20":0.009425205711157368,"21":-0.1648091453175009,"22":0.03673709023230079,"23":0.14376733509560544,"24":-0.03955756281336689,"25":-0.19030878875187984,"26":-0.041035583587550904,"27":-0.0015854996559483954,"28":0.07779956322680776,"29":-0.15586912317181625,"30":-0.025396806024344073,"31":-0.07592602167671247,"32":-0.09197850014173457,"33":0.007755416064661873,"34":-0.07031023853949507,"35":-0.04648568241325257,"36":0.1293172076993805,"37":-0.17785634572759723,"38":-0.1089884407137875,"39":-0.12339667817181163,"40":-0.07709852965975754,"41":0.20625701728668402,"42":0.03705446242745236,"43":-0.29079074262527027,"44":-0.054793665760877276,"45":-0.07263561901185189,"46":-0.07273540007552615,"47":-0.12316123939889996,"48":-0.023326301350702877,"49":0.02470790904640502,"50":-0.11768930806520218,"51":-0.005831427227751846,"52":-0.026935732136446892,"53":-0.09882508730585227,"54":0.01199721444665612,"55":-0.15929846646515672,"56":-0.1754799875241253,"57":-0.09209059184345363,"58":-0.0020679747677910783,"59":-0.06014042011439387,"60":-0.004487151310295931,"61":-0.2078708830335883,"62":0.03272538264868949,"63":-0.09063578824992659,"64":-0.281703779641843,"65":-0.0564538020448396,"66":0.04098833153082317,"67":-0.09359167619349797,"68":-0.056523900250621574,"69":0.02907586119606302,"70":-0.06474445501744878,"71":-0.14718041776708182,"72":-0.06256334000513905,"73":-0.23595284755983545,"74":-0.24286895560595737,"75":-0.04421808669367459,"76":0.04643875604567473,"77":-0.11129745666916128,"78":-0.06667861467438682,"79":-0.07978373539182218,"80":-0.034066778911505544,"81":-0.1327135869358626,"82":-0.09433447275923598,"83":0.010982997726121543,"84":0.03484918539518762,"85":0.02687845833995337,"86":-0.07706611261723377,"87":-0.067507897217179,"88":-0.09768065258948642,"89":-0.09679276373512181,"90":-0.07042547667383017,"91":-0.1094417082876556,"92":-0.11345309049776643,"93":-0.0575492317899533,"94":-0.02028828432364928,"95":-0.013342305847247365,"96":0.02081392988610189,"97":-0.1295119425416241,"98":0.0010748386620504469,"99":-0.14174403450459525,"100":0.08356373710445174,"101":-0.23606218611099372,"102":0.02758102665667375,"103":0.09500949626367583,"104":-0.15191423815875135,"105":-0.05188825392570554,"106":0.03513761874752123,"107":0.005800215561647211,"108":0.02442428203049603,"109":-0.060866715340744386,"110":-0.0642927822565937,"111":-0.09523566559739194,"112":-0.003424634570141841,"113":0.11272845223374552,"114":0.014899257483122276,"115":-0.13235721139752296,"116":0.008771681499970672,"117":-0.153193099026292,"118":0.02718645096562283,"119":-0.22764293104104283,"120":-0.022127031919539547,"121":-0.001109150295449458,"122":-0.1700485448539922,"123":-0.040688062971509995,"124":-0.05537668845850711,"125":-0.01566281665794632,"126":0.04701790493631355,"127":-0.09020355261348997,"128":-0.23102080164210373,"129":-0.08623203235858957,"130":-0.04962693553832394,"131":0.10134366155684067,"132":-0.07508840931635274,"133":-0.18680703471569632,"134":0.02540101206801771,"135":-0.0794453310039469,"136":-0.09442886518433405,"137":-0.11616583430268956,"138":0.034890212544230706,"139":0.05920397625213666,"140":-0.21574175891863157,"141":-0.026611127631962845,"142":-0.09685083220386383,"143":-0.1521748028904354,"144":0.014593835651350796,"145":-0.10347206478232508,"146":-0.37715046044608924,"147":-0.039957897276164715,"148":-0.010196754561247726,"149":-0.057463698833337074,"150":-0.050559909698368405,"151":-0.08860944499345728,"152":0.06398279889704078,"153":0.031743888435929436,"154":-0.26087027568196713,"155":-0.11245588762440135,"156":0.009586374938691059,"157":0.005527867664398568,"158":-0.03767536075437444,"159":0.00809042472813409,"160":-0.1161216176640741,"161":-0.08015545294223447,"162":-0.12842880175918722,"163":-0.0548278857447678,"164":-0.22075600603343537,"165":-0.10748836701001203,"166":-0.005437936185335771,"167":-0.2947687956470215,"168":0.0019242879022463273,"169":-0.21244848304056976,"170":-0.0106339990719217,"171":-0.043903363211854986,"172":-0.1376672755000995,"173":-0.029808953795360457,"174":-0.08047760954390742,"175":-0.0032993458598955176,"176":-0.04093098593881889,"177":0.07990299574938252,"178":-0.015545638387267207,"179":-0.06840136948414706,"180":-0.010433218859752208,"181":0.04764667057501838,"182":-0.06964339612284122,"183":-0.04992948561252363,"184":0.02794502261666858,"185":-0.039015731094211054,"186":-0.04408489844744509,"187":-0.18587394805605756,"188":-0.0021154646361175,"189":-0.1886290829549472,"190":-0.006584716665640524,"191":-0.18432387378747145,"192":0.0006448527923738637,"193":0.04519205259894357,"194":-0.02010542202732938,"195":-0.030687470615801207,"196":-0.005274620404641962,"197":-0.008727765754634216,"198":-0.04673010534086141,"199":0.02788807249750117,"200":-0.06816485910097395,"201":-0.21374374148959369,"202":0.10033188682609921,"203":-0.0006329192803374461,"204":-0.06705514534508072,"205":-0.07798804636582778,"206":0.04307591035056655,"207":-0.2295747077233467,"208":-0.020252519342057285,"209":-0.14585088587190345,"210":-0.022813163501602344,"211":0.0019049935626837687,"212":-0.06298175171164334,"213":0.003768203921459309,"214":-0.06633303274650403,"215":-0.051584955610546504,"216":0.024290960519575435,"217":0.03639641224237018,"218":-0.21201812003924073,"219":-0.14825563062417774,"220":-0.00890424824598997,"221":0.10640094323455797,"222":-0.10717157826167474,"223":-0.053590427406804045,"224":-0.030490334565145823,"225":-0.021456293705618874,"226":-0.07140897183861314,"227":-0.11857299971204563,"228":0.08539281557562386,"229":-0.009289224978928952,"230":-0.07679694652866537,"231":-0.021726524708991314,"232":-0.11375729906108337,"233":-0.05529355128966829,"234":-0.1123855052569386,"235":0.022577298227114077,"236":-0.15600406834164754,"237":-0.07784883104709724,"238":0.013686888683700995,"239":-0.12632990649035283,"240":-0.07065452917793215,"241":0.015430049501123717,"242":-0.035762444013925185,"243":-0.1499843238470925,"244":-0.324662811646227,"245":-0.09143510390947086,"246":-0.006742856043557454,"247":-0.1045549529006922,"248":-0.02692894672595445,"249":-0.036973424175415326,"250":-0.1822643659889984,"251":0.056740039004844735,"252":-0.15264508571115765,"253":0.09457035180259127,"254":-0.1815089850581537,"255":-0.03772202467161921,"256":-0.019313582763971743,"257":-0.3430219827458634,"258":-0.11234460120240881,"259":0.09294479847717713,"260":-0.05527790279320671,"261":0.07762191200131675,"262":-0.19007175616700814,"263":-0.10219348208728257,"264":-0.015639822267163466,"265":-0.02520906162393077,"266":-0.03664201852435174,"267":0.05057014076607188,"268":-0.1467078489664156,"269":0.059106088551032374,"270":-0.05597065695192963,"271":0.036199286768410735,"272":-0.034297933708722986,"273":-0.1952566105467299,"274":-0.053747335321154534,"275":-0.08102938468206797,"276":-0.08926710722494409,"277":-0.16530522898088107,"278":0.006392498401689973,"279":-0.045383496056312825,"280":-0.044551481103389155,"281":-0.010545173745549002,"282":-0.00525618336389801,"283":0.023840909021453468,"284":-0.08090586975069777,"285":0.07412419165207683,"286":-0.11348913940380925,"287":-0.06764737559305968,"288":-0.05883375627956818,"289":-0.08670249450125957,"290":-0.05381480594187586,"291":-0.15814704118603384,"292":-0.03777764591991052,"293":0.024034298737824134,"294":-0.12019813061895479,"295":-0.08272405546684196,"296":-0.04382613753329485,"297":-0.03768549203583169,"298":-0.02645046523414599,"299":-0.2784245974652415,"300":0.03893519717507598,"301":0.002132517345811357,"302":-0.06887907371352867,"303":-0.053921351766516655,"304":-0.08981458555996227,"305":-0.03584502318945654,"306":-0.10304286647139595,"307":-0.06967865517389389,"308":-0.3556749293296984,"309":-0.08922775232175746,"310":-0.0737389430257164,"311":-0.04095150972237661,"312":-0.1055808906365546,"313":-0.056227498438538366,"314":-0.08068549867378835,"315":-0.03801353717872499,"316":-0.1397586745834754,"317":-0.08378170766743223,"318":0.016332352686622014,"319":0.0077775754339865395,"320":-0.0424809677673729,"321":-0.017642728285609397,"322":-0.13056644677208545,"323":-0.08358518147105541,"324":-0.13215279089724946,"325":0.022505661545495086,"326":-0.19396115972410352,"327":-0.007022494075949325,"328":-0.023534621234976943,"329":-0.09591618073688303,"330":-0.147829972155797,"331":0.007165240854711452,"332":0.009409197626673952,"333":-0.019476887971171544,"334":-0.334749314596988,"335":-0.0026002058909257494,"336":-0.034376895990709685,"337":-0.021431676059633673,"338":-0.05700205871831849,"339":-0.08217414691606928,"340":0.019606969302716777,"341":0.019868940621083776,"342":-0.10989400504148793,"343":0.02361322159186272,"344":-0.20432166015942568,"345":0.007688939107283217,"346":-0.012975255758760868,"347":-0.21214535883209945,"348":-0.11004800489012499,"349":0.031447177619768854,"350":-0.04698944311306026,"351":-0.09593762923050486,"352":-0.1516776689774219,"353":-0.044097412368035036,"354":-0.040451281390034996,"355":-0.01757644510827972,"356":-0.017080664621051515,"357":-0.049036350538562076,"358":-0.026085053595497665,"359":0.016784712671749986,"360":-0.11678481958437968,"361":0.015936245579349632,"362":0.0783145383522828,"363":-0.2229591975174751,"364":-0.0731596519514285,"365":-0.24910477071771617,"366":-0.041217580938500406,"367":-0.05029372408478158,"368":0.07506893444213385,"369":-0.08160368960741514,"370":-0.059121071255129824,"371":-0.010084214143639414,"372":-0.07184189973838914,"373":-0.08749255013199504,"374":-0.02560589621221049,"375":-0.011146704561976296,"376":-0.09730547375041357,"377":-0.0645140557957555,"378":-0.022472673799953404,"379":0.015486722822247384,"380":-0.09654077474369524,"381":-0.18145641259425047,"382":-0.10347989345315713,"383":-0.047554979839079387,"384":-0.1552626820715078,"385":-0.08531879827826548,"386":0.014640730734574907,"387":-0.08761361626769568,"388":-0.12097803180074831,"389":-0.07322080820994052,"390":0.03916161870905972,"391":-0.02662877149197003,"392":-0.07341191093725483,"393":0.09334554366118256,"394":-0.2274264106908759,"395":0.021844312491903137,"396":-0.0239316419271487,"397":-0.05492969652792367,"398":-0.264873243807658,"399":-0.052143854858865565,"400":-0.11961737751221771,"401":-0.058213686921797146,"402":-0.032616332825457034,"403":-0.1259126033122267,"404":0.0542562193295899,"405":-0.03922201084180657,"406":-0.1802985377440661,"407":-0.10767703567240852,"408":0.03801641015784903,"409":-0.03510293599779103,"410":-0.03545448289742213,"411":0.009209463417721374,"412":-0.028458520689489057,"413":-0.04764683379018094,"414":0.07170787001615464,"415":-0.09137709109165984,"416":-0.21933674146716034,"417":-0.005728860464137916,"418":-0.10397502860786047,"419":-0.041199401923525523,"420":-0.05409607217717237,"421":0.0043037561324888165,"422":0.022662839079438193,"423":-0.12123224821239637,"424":-0.29381872179919954,"425":-0.019250629329567,"426":-0.05190739721369768,"427":-0.008800293100748872,"428":-0.14231839009221456,"429":-0.047140005212766414,"430":-0.020239716956343592,"431":-0.054083864124873926,"432":0.068024797847169,"433":-0.013776395385838745,"434":-0.21160252074957844,"435":0.015044257824724159,"436":-0.1424212391645443,"437":-0.11813571251197753,"438":-0.04576716961893388,"439":-0.05067908868895461,"440":0.010259203400552185,"441":-0.07343847240864776,"442":-0.054644340318026015,"443":-0.005300509222194874,"444":0.003549496800908893,"445":0.06983188929046542,"446":-0.1302146080459219,"447":-0.014067289420985672,"448":-0.010485816082018663,"449":-0.01167001093098194}},{"sx":1,"sy":1,"depth":450,"w":{"0":-0.053281684458051363,"1":0.015402778688955102,"2":-0.1349171585934002,"3":-0.09588090238929207,"4":-0.008308543166040456,"5":-0.037023540793601976,"6":-0.0022665492343036447,"7":-0.09741704722293443,"8":0.00880770031424289,"9":-0.16860529137879107,"10":0.07208063288500328,"11":-0.08893111480617577,"12":-0.10011422035049551,"13":-0.05989995874376413,"14":-0.16849649425439614,"15":-0.06196111252988395,"16":-0.042578580339168066,"17":-0.025788485169123087,"18":-0.026784844811823305,"19":-0.10326502805190141,"20":0.045974920147788395,"21":-0.07178815316916022,"22":0.00784879410662906,"23":-0.05376578909906397,"24":0.0022502385132371155,"25":-0.05651950995006592,"26":-0.07565937057127069,"27":-0.1811592204128101,"28":0.03047159188992087,"29":-0.044264129000714504,"30":-0.004022211341140303,"31":0.025441355732660143,"32":-0.17521031601657994,"33":-0.03212752066134171,"34":-0.01567097172450568,"35":-0.01724152175637766,"36":-0.04165755544327865,"37":-0.1337963985797488,"38":-0.04962020540955061,"39":-0.18026619485932835,"40":0.008304498853974602,"41":-0.11311611874891492,"42":0.016569102520961106,"43":-0.07076521583963015,"44":0.014568300226969663,"45":0.04525049950236417,"46":-0.09149091186734475,"47":-0.08997434527318332,"48":-0.04235649400163063,"49":-0.0057873870920473,"50":-0.16434033168470938,"51":-0.03149312798413188,"52":-0.1818842006140682,"53":-0.03029267942177059,"54":-0.22470789113540598,"55":-0.24562138656769406,"56":-0.04209815904636125,"57":-0.04867550443353962,"58":-0.012606440752814599,"59":-0.2020319849021161,"60":0.08189477114923684,"61":-0.029107659858871406,"62":-0.019883160613097806,"63":0.07899949366633928,"64":-0.14481444862198997,"65":-0.01208325781970193,"66":-0.003465065749427659,"67":-0.05933464330174919,"68":-0.19514520765715526,"69":-0.012971647862976506,"70":-0.10043967067166029,"71":-0.03860348833085224,"72":-0.5422490901936164,"73":-0.2590008077887346,"74":-0.0018411008171001766,"75":-0.10274104597524852,"76":0.02260149930932113,"77":-0.10502377206673372,"78":-0.06530308939674843,"79":-0.14202629495554495,"80":-0.0232451614496841,"81":0.05388918154726624,"82":-0.11513679284398386,"83":0.03440325410623378,"84":-0.10084886760347853,"85":-0.04103759370696039,"86":-0.17867418995196155,"87":-0.018043758702867802,"88":-0.0331121409875648,"89":-0.08778316128046333,"90":-0.05623393433853779,"91":-0.0659034341969064,"92":-0.10252359675071777,"93":-0.07419493371855344,"94":-0.02355396817999944,"95":-0.09132375132609089,"96":-0.04476856004442213,"97":-0.09475470977505367,"98":-0.030610687617265448,"99":-0.1604684329208712,"100":0.004373461469058024,"101":-0.16388644387887882,"102":0.061289962479562136,"103":0.005223759958700103,"104":-0.1211043524163274,"105":-0.09665967775159126,"106":-0.10305846445693402,"107":-0.10007982629264253,"108":-0.035779122655878286,"109":-0.1434447812464468,"110":-0.0157489168061546,"111":-0.1857036659447805,"112":0.04828222295420212,"113":-0.02583936797630218,"114":-0.09082950730720588,"115":0.07302318399204229,"116":-0.06357538886814218,"117":-0.1043594543240318,"118":0.011924555251849918,"119":-0.15624908640402893,"120":-0.010044116794848368,"121":0.025957989996071965,"122":-0.21969117717447298,"123":-0.020999961819079437,"124":-0.13736878790923507,"125":0.02677682717871937,"126":-0.033559317724124814,"127":-0.056693516963327535,"128":-0.014203146437988765,"129":-0.14715064940323533,"130":-0.032041824301903464,"131":-0.0744450666629866,"132":-0.1096187479374632,"133":0.08990561311936782,"134":0.031180080066802892,"135":0.01813913778529901,"136":-0.20649816531032242,"137":-0.15850646163521528,"138":-0.04516911766730287,"139":-0.03705948086686451,"140":-0.17870253282516643,"141":-0.07043855410511429,"142":-0.16607322610906003,"143":-0.03871158226587697,"144":-0.020170336065507027,"145":-0.0328048456334062,"146":-0.06897012101181461,"147":-0.12931513616883245,"148":0.012444549501265188,"149":-0.10041905092159036,"150":-0.022101380317301616,"151":-0.0005018842581935057,"152":-0.0005717728014651968,"153":0.056041888272027586,"154":-0.3170152583515385,"155":-0.220440581996932,"156":-0.07475650864761223,"157":0.01841474682493766,"158":-0.19121051809082545,"159":-0.04983688256466073,"160":-0.2632828714707283,"161":-0.09615348944683891,"162":-0.11821262719811368,"163":-0.06227059104897913,"164":0.02307025636960092,"165":-0.016589134652161424,"166":-0.0642523707295257,"167":-0.24147757046888932,"168":-0.058860118280347,"169":-0.05269777549914786,"170":0.04846891631650346,"171":0.16667054025370764,"172":-0.17553980707163364,"173":-0.0600115918433496,"174":-0.03979352422994677,"175":0.0034856053049833395,"176":-0.10871992013865056,"177":0.041432695512913495,"178":-0.078437287440807,"179":-0.06573351550865202,"180":-0.04010049862325456,"181":0.03172849709707983,"182":-0.04151324650475472,"183":-0.06763549879598105,"184":0.014143579161687517,"185":-0.10925592005446089,"186":-0.0328798542610247,"187":-0.06082904862250235,"188":0.0506585626803431,"189":-0.1592031325338231,"190":-0.027716495401630317,"191":-0.13990449932949947,"192":0.03316990582814034,"193":0.01621413944447549,"194":-0.1855770006149906,"195":-0.058639335793562175,"196":-0.104022865067528,"197":-0.04343105024933947,"198":-0.0629070751221962,"199":-0.09278807299161827,"200":-0.028478503884243295,"201":-0.057175307517127204,"202":0.03700670688064968,"203":0.026860071268630995,"204":-0.10147999872252415,"205":-0.08723235434066365,"206":0.02855334086842476,"207":-0.12773788361145919,"208":-0.05786006528267389,"209":-0.2103332903218834,"210":-0.00871665920332116,"211":0.09676686814037945,"212":-0.21003458196934394,"213":0.02900206123526469,"214":-0.11040118449790996,"215":-0.023910314923273657,"216":-0.07756589031904267,"217":-0.0741469681438272,"218":0.0065356895584380015,"219":-0.13462019744648518,"220":-0.005336140782271839,"221":-0.06104157752340042,"222":-0.09577489610484456,"223":-0.011170575067724701,"224":0.09105222757380231,"225":-0.06234111685181543,"226":-0.18405140397061126,"227":-0.180675940273632,"228":-0.05176492736186145,"229":-0.016878821428234738,"230":-0.08064961222143353,"231":-0.043986223992900454,"232":-0.20487795893678418,"233":-0.10243216073595467,"234":0.008643092846459411,"235":0.0002726981196093102,"236":-0.014271412916176394,"237":0.014335929973973467,"238":-0.005160645210361223,"239":-0.22299241244364348,"240":-0.1146838668595448,"241":-0.028859130381829398,"242":0.005781766474664831,"243":0.03572386259975711,"244":-0.21280836345209658,"245":-0.04790904887356072,"246":-0.07146931526564641,"247":-0.01345023201040507,"248":-0.05272382416661763,"249":0.062197087881913485,"250":-0.14568282407736766,"251":-0.13118414249723648,"252":0.034285146458103245,"253":0.024311207969014897,"254":-0.08798878550848685,"255":-0.03681913075618959,"256":-0.01898274590360716,"257":-0.29160282565774565,"258":-0.05103632037509911,"259":0.012112224566091172,"260":-0.016264985076312802,"261":-0.08440762441280159,"262":-0.0790810732699572,"263":-0.06346137000784398,"264":-0.0006304322320329838,"265":-0.023056450915518275,"266":-0.07104901720151975,"267":0.009773899877301307,"268":-0.1684157937881804,"269":-0.031755930658854965,"270":-0.05357891347583972,"271":-0.015986781978551672,"272":-0.10936439930018649,"273":-0.2170582729350067,"274":-0.005715003451230814,"275":0.011331414127363902,"276":-0.051470786859532186,"277":0.04028006708619529,"278":-0.005533389742781693,"279":-0.10067204644391753,"280":-0.04112574947168137,"281":-0.024403435839977613,"282":0.05243670232165493,"283":0.00010478175287144085,"284":-0.14724354330604333,"285":-0.06818738459973439,"286":0.062008943123935026,"287":0.06620240617053734,"288":-0.050963792986631944,"289":-0.04784271726640451,"290":-0.06456709376643038,"291":-0.12245742255655673,"292":-0.02151498988250529,"293":-0.027144119209152214,"294":-0.12778522538411027,"295":-0.10074200843062092,"296":-0.02883430482861018,"297":-0.15558719617724787,"298":-0.06047397157803516,"299":-0.10492924720946727,"300":-0.017486679805216863,"301":-0.047210626585288795,"302":-0.241500946119142,"303":0.04117303202992762,"304":-0.11199668419262014,"305":-0.03284290028903165,"306":-0.0707542834092791,"307":0.01188796223357999,"308":-0.12810075983182426,"309":0.009317621477873211,"310":0.03473171765495666,"311":0.004183246200879365,"312":-0.09319510204630506,"313":-0.05987312220167526,"314":0.053543223345616967,"315":-0.05895534818767555,"316":-0.17391686012600996,"317":0.006269073619746947,"318":0.08165982701149557,"319":0.021335692318034852,"320":-0.09248575555861238,"321":-0.011433331068585925,"322":-0.22235429936995776,"323":-0.05417437433241885,"324":-0.011988046883450044,"325":-0.027275889197751636,"326":-0.10597245004280267,"327":-0.007682644334338514,"328":0.03192882355093099,"329":-0.10554831466304847,"330":0.0756054288004049,"331":0.023940233106349025,"332":0.01209175599484826,"333":-0.09330907289835051,"334":-0.16293804130323455,"335":0.012094527428948527,"336":-0.00952593983660386,"337":-0.08360543863233516,"338":-0.14775145188055738,"339":0.0023687122476710033,"340":-0.1158509080720944,"341":-0.14405698109736748,"342":0.09415851104029588,"343":0.07119737923430042,"344":-0.12464047547218872,"345":-0.01896668191871343,"346":-0.04191957486318654,"347":-0.10897232096657332,"348":-0.14280518223678612,"349":0.05703336747911888,"350":-0.04631119465988574,"351":-0.18646487029528597,"352":-0.10631496384654902,"353":0.05417957529602387,"354":0.057341374471672736,"355":-0.054295217855392194,"356":-0.10376189101393157,"357":-0.006879945603631003,"358":0.04063069397823698,"359":-0.13383350648165288,"360":-0.13144962713853914,"361":-0.06696560456810009,"362":-0.048387745765033574,"363":-0.0014539561077824106,"364":-0.0777909094644141,"365":0.012447425510494194,"366":-0.030998608923010405,"367":-0.10038960864147714,"368":-0.03722460015051323,"369":-0.10336510829912737,"370":-0.039307410331878886,"371":-0.01484847255472283,"372":-0.004827540303391685,"373":-0.022118483211793376,"374":-0.21664893123854748,"375":-0.07010995125566012,"376":-0.04515425841957598,"377":0.0562326665162987,"378":-0.01829193975723956,"379":-0.051854682126319336,"380":-0.06842737960561722,"381":-0.09107767228404758,"382":-0.043980002835160036,"383":-0.08715700981949955,"384":-0.15623038296812594,"385":-0.07121628406089603,"386":-0.04457982205427326,"387":-0.1403127170150434,"388":0.00746165493627717,"389":-0.02967604804786539,"390":-0.050219160782488115,"391":-0.06356071757897826,"392":-0.17838270140843263,"393":-0.0033041758564821937,"394":-0.031520969732133766,"395":0.057061591892019786,"396":-0.0934180517360266,"397":-0.13588442959011704,"398":-0.2975285064215145,"399":-0.033147455293498766,"400":-0.11098177113610914,"401":-0.15302031875305297,"402":-0.05344842471091656,"403":-0.06234203478366814,"404":-0.05991141572254119,"405":-0.16400446301896673,"406":-0.15398124529804588,"407":-0.1233601538245705,"408":-0.003788306163757086,"409":-0.10839627534023637,"410":-0.042640356732306345,"411":0.06256428850752715,"412":-0.14159848344100806,"413":-0.005339792348152684,"414":0.08129155079401773,"415":0.015679072292406414,"416":-0.33656354484472834,"417":-0.0012549078709075668,"418":-0.02998052218587396,"419":-0.0883345249922707,"420":-0.0006681587641458753,"421":-0.10628273312881076,"422":0.01522674466198237,"423":-0.3005225917944732,"424":-0.10419302542128475,"425":-0.11590433558487168,"426":-0.05282371007316795,"427":0.067735732980369,"428":-0.15991490827164512,"429":-0.06607873274739645,"430":-0.01420361103892338,"431":-0.14399411286785357,"432":0.15475027800519667,"433":0.03975950694012333,"434":-0.3470703791274314,"435":0.02599768257526039,"436":0.053349093137610035,"437":0.029376322343916173,"438":0.00899253572218488,"439":-0.0085562177812127,"440":-0.04943857451507338,"441":-0.05299448637763408,"442":-0.032314351064396216,"443":-0.0788677268148782,"444":-0.03942542110541214,"445":-0.03010001620642886,"446":-0.07558735059272506,"447":-0.05858221287900731,"448":0.008898071941420846,"449":-0.11180609251081626}},{"sx":1,"sy":1,"depth":450,"w":{"0":-0.01717101910392531,"1":-0.0008410840689612311,"2":-0.043347540727195766,"3":-0.08610192752650325,"4":-0.05685153612042465,"5":0.02937321948007032,"6":-0.08426799564713863,"7":-0.028487898034438176,"8":0.01757622938871192,"9":-0.13505298940604613,"10":-0.04561191381859513,"11":-0.08347596019717225,"12":-0.00447052049395623,"13":0.00208551113358594,"14":-0.11905751299367022,"15":0.07864679777556613,"16":0.0035807059272326886,"17":-0.019823747167978883,"18":-0.02208542794879829,"19":-0.01993798455863306,"20":-0.034294803033759,"21":-0.05386092840968526,"22":0.09874400473743332,"23":0.006007996025030129,"24":0.038387525247833225,"25":-0.03273534730441185,"26":0.016195983778803942,"27":-0.1159542119521224,"28":-0.001432562331365683,"29":-0.1881205941201729,"30":0.03216938411408069,"31":0.03713606712303621,"32":-0.07675797704619242,"33":-0.0370336982828395,"34":-0.006551317613238506,"35":0.039185820375785684,"36":0.03066385899223302,"37":-0.16519905906526827,"38":0.08873207084054391,"39":-0.11088892074367045,"40":-0.010742809276671957,"41":-0.05810163577054328,"42":-0.045030020267666684,"43":-0.23739823160529536,"44":-0.06763899766236722,"45":0.030222848004883982,"46":0.037615547266858056,"47":-0.17217025099934158,"48":-0.03218511114333052,"49":0.03518385099997259,"50":-0.11932960443030888,"51":0.0762519811557524,"52":-0.0028976225277547313,"53":0.012626541508237672,"54":0.0655124387774694,"55":-0.0895138694507095,"56":0.007649748401244789,"57":-0.053599353060523026,"58":-0.0846761751666066,"59":-0.016499356653456927,"60":0.045702618738418556,"61":-0.201630343321058,"62":0.04123363504139398,"63":-0.060394935275636705,"64":-0.2567995380732265,"65":-0.17551148199098562,"66":-0.0026626720490663305,"67":-0.04241948220569696,"68":-0.04808296264370343,"69":0.019798013076347945,"70":-0.11746081966631906,"71":-0.020382730689823676,"72":-0.14054223447414715,"73":-0.2789449878403133,"74":-0.023897782926703914,"75":0.00628205440382877,"76":0.09716496558919892,"77":-0.05019107835655563,"78":-0.01017754883686695,"79":-0.06839382117114723,"80":-0.07955688806440356,"81":-0.20063984605053103,"82":-0.1373568255955394,"83":-0.23235625503609858,"84":0.04339232660526428,"85":-0.04829509712039797,"86":0.04312010207260871,"87":-0.06537512717591261,"88":-0.0840928569480991,"89":-0.07662660229933656,"90":-0.11627524651617023,"91":-0.062155303540296594,"92":-0.061744153024079505,"93":-0.07271118494181981,"94":-0.01628338163587246,"95":-0.07883981742579764,"96":-0.13847156782388031,"97":-0.19694396019120228,"98":0.008832923572778704,"99":-0.17835685071489743,"100":0.002351666480036107,"101":-0.08897662464733644,"102":-0.02137204311317001,"103":0.1015582174657686,"104":-0.10091234476011186,"105":-0.029198624389640285,"106":0.07574667604452576,"107":0.012733361846581795,"108":-0.05097970073734004,"109":-0.05761389250806969,"110":-0.03645162734533227,"111":-0.11549932645735071,"112":-0.022407128004959077,"113":0.04377941270810929,"114":-0.14288497254503008,"115":-0.18613268268802574,"116":-0.0014581748164380032,"117":-0.1355291707013827,"118":-0.043285987268641836,"119":-0.11326075916118873,"120":-0.03966741425663632,"121":-0.04782719121880188,"122":-0.14767358443278947,"123":-0.013561882335013292,"124":0.0377081948548588,"125":-0.019663162437953588,"126":0.04895208377890995,"127":-0.11431663029163207,"128":0.11456928931413601,"129":-0.11726314681937271,"130":-0.07789342922113204,"131":0.06825556412989166,"132":-0.13321997129832594,"133":-0.2444526134777317,"134":0.0074163690502222004,"135":-0.15027313014910848,"136":0.0028612449963021465,"137":-0.09936793225770722,"138":-0.03547277317459481,"139":-0.026257341178174257,"140":-0.03971278178170397,"141":0.07162998095775784,"142":0.07568014658165242,"143":-0.04674727850319822,"144":-0.007952138838644134,"145":-0.16418905267028835,"146":0.04109195891989771,"147":-0.029557582560771317,"148":-0.031204360345893474,"149":0.08627766490841664,"150":-0.1481252674382845,"151":-0.3765668445426185,"152":0.043269541196865664,"153":-0.23191623632453368,"154":-0.33801859557549824,"155":-0.04545040088690849,"156":0.04989758517893031,"157":-0.008808115741941644,"158":-0.02296039584808773,"159":0.005560284876973601,"160":0.025274297490384474,"161":0.08973782827030223,"162":-0.13541388363825563,"163":-0.20329263909627818,"164":-0.0761868540635406,"165":-0.09311698201453622,"166":0.018822927615376045,"167":-0.34810271760052525,"168":-0.12385451289465178,"169":-0.2934285448450478,"170":-0.006326729691210165,"171":-0.2863327954968508,"172":-0.18088478754184598,"173":-0.09422434738113372,"174":-0.05056038214826924,"175":0.01624765418762369,"176":0.006791483131687874,"177":0.053582624987193454,"178":-0.20256349993251335,"179":-0.11470743954762826,"180":-0.08954224828810166,"181":-0.001958490508667036,"182":-0.020784185174097636,"183":-0.14147168667846813,"184":-0.036670931533929293,"185":-0.06927943272313788,"186":-0.13835158219607302,"187":-0.08451286810881878,"188":-0.04057427605015876,"189":-0.23573772070367227,"190":-0.051129201714045905,"191":-0.12580226082889803,"192":0.04893641650119497,"193":0.0863415754735516,"194":-0.06289903029398,"195":0.029211120074650397,"196":-0.10088624532466123,"197":0.09292643239310927,"198":-0.09675004089065391,"199":-0.005476058641713669,"200":0.057186485900407674,"201":-0.11504611124849086,"202":-0.007020023412949875,"203":0.024455496937161755,"204":-0.126119690381103,"205":-0.20011372409859288,"206":0.03772415293192045,"207":-0.2294813012874811,"208":-0.06726540145880382,"209":0.06927112650480775,"210":-0.031231571730795972,"211":0.056915016586615956,"212":-0.07478517732514324,"213":-0.0287455037176261,"214":-0.01106760470271451,"215":0.005310076905264506,"216":-0.09636957675821227,"217":-0.019602343218528887,"218":0.026461325744925976,"219":-0.18177458894808493,"220":0.021173168164643843,"221":0.08529779892657242,"222":-0.07310019507279257,"223":-0.19586266585938,"224":-0.026858566266036606,"225":-0.11849480128049793,"226":-0.14541071595963395,"227":0.18699193613437634,"228":-0.025107763531436803,"229":-0.03094452186682631,"230":0.08967064378270392,"231":0.07917123973945352,"232":-0.012251354689024382,"233":-0.03187193090195607,"234":-0.03170486612322485,"235":-0.07075302733940048,"236":-0.0960856550458487,"237":-0.1031084232699847,"238":-0.07853729926757028,"239":-0.05050019555781856,"240":-0.16105557631101686,"241":-0.28140467037841127,"242":0.01567453620705208,"243":-0.04366322439147162,"244":-0.21358731859239535,"245":0.11916797206758463,"246":0.06687182290605964,"247":0.05344415141098408,"248":-0.005755666978667501,"249":-0.053873743250559034,"250":-0.11949006281879677,"251":-0.10823773929908925,"252":-0.13865836983048274,"253":-0.07536610059818145,"254":-0.01766318845607061,"255":-0.1259162902630718,"256":0.03286725642398579,"257":-0.3250972658144289,"258":0.06634849011446864,"259":-0.2030239536979687,"260":-0.01680505534371754,"261":0.07674442662299891,"262":-0.10102630669884256,"263":0.11589121620994854,"264":-0.02058421076611991,"265":-0.002241055039974405,"266":-0.04374557782777015,"267":0.03568923110035056,"268":-0.12274410065860963,"269":-0.166547954695212,"270":-0.04234552889665813,"271":-0.03377093851302068,"272":-0.03683298174643017,"273":-0.1509422055722583,"274":-0.03649026649180196,"275":-0.054813112577006225,"276":-0.030421250170382174,"277":-0.18259715584795413,"278":-0.08570411685220046,"279":-0.13570875563987714,"280":-0.08335703706011924,"281":-0.10965368734614422,"282":0.0025838116186819742,"283":0.05578572259824646,"284":-0.06832710536717705,"285":-0.018459403208522903,"286":-0.09354999111521657,"287":-0.028969428239468145,"288":-0.03928451730909758,"289":-0.09740764997258856,"290":-0.09781632698172384,"291":-0.02005142022865309,"292":-0.03446420158906832,"293":0.09229212977165116,"294":-0.07839129796101203,"295":-0.18886305882653673,"296":-0.032204900844683144,"297":-0.15022621514042353,"298":-0.0263763442387462,"299":0.13119678157165554,"300":-0.017954905875117645,"301":-0.05867535845338601,"302":-0.09697836245025691,"303":0.02035498094777936,"304":-0.09457686720308045,"305":-0.036237015281213675,"306":-0.018592775557075843,"307":0.02543213082853275,"308":-0.23940619265348975,"309":-0.0059058404024123394,"310":0.05978372381544883,"311":-0.03512126867088149,"312":-0.012967583982482378,"313":-0.20163529824254134,"314":0.02190146791533289,"315":-0.20226808449141423,"316":-0.10550614386230033,"317":0.18759270952143844,"318":-0.013965956995072254,"319":0.004695200853845589,"320":-0.08117060845159216,"321":0.01319334385566948,"322":-0.06343846939806838,"323":-0.1168485439730613,"324":-0.09724822924062324,"325":-0.04725089155208859,"326":-0.1247450600740119,"327":-0.1289526142150805,"328":0.0408912490602696,"329":-0.04712477945675705,"330":-0.038377038580691365,"331":-0.10707059918150033,"332":-0.04957311790865675,"333":0.05231608871932017,"334":-0.1705936040551583,"335":0.1224590382131565,"336":-0.012927575210891785,"337":0.005620881696685773,"338":-0.22263667661753275,"339":-0.044329699336930664,"340":-0.1398157669480348,"341":-0.21204873284000994,"342":-0.04590590912392754,"343":-0.02812497732304992,"344":-0.22583809972699084,"345":0.006238595507960226,"346":0.02937503931307192,"347":-0.07527180232234208,"348":-0.05112147855817327,"349":-0.031186511901839586,"350":-0.06350168587807248,"351":0.19715868625916902,"352":-0.08269022441779962,"353":0.10096921050287419,"354":0.05260212931976689,"355":0.005860571957631965,"356":-0.2908353687759609,"357":-0.07925800427212804,"358":-0.03845359855198159,"359":-0.22384016094890224,"360":-0.09472179849706154,"361":-0.13997632388450806,"362":-0.07954507636535157,"363":-0.0722245565497243,"364":-0.062494583126687604,"365":-0.13545059976345114,"366":0.004132492254156422,"367":-0.1867858375064939,"368":0.03899908605629522,"369":-0.020357101764163235,"370":-0.12455855337465341,"371":-0.024017604096833074,"372":0.07308853495259074,"373":0.09246494113482234,"374":-0.06762756366116154,"375":0.028375423932336327,"376":-0.09130729190049365,"377":0.006598824052746103,"378":-0.008907645021375685,"379":-0.12406120766974257,"380":-0.1729426539898608,"381":0.025126327142100995,"382":-0.015020498100423108,"383":-0.025884940441699807,"384":0.014903785274171612,"385":-0.19437984036602637,"386":0.03629368869751498,"387":-0.1334755776186788,"388":-0.03043478346091411,"389":0.007711324832714417,"390":-0.019815574417961997,"391":0.030389989952948032,"392":-0.11855938737182595,"393":0.08714166634895953,"394":-0.10300171085231004,"395":-0.042015638865576556,"396":-0.006718299921864188,"397":-0.050226763433892783,"398":-0.33658749470341065,"399":-0.03856784714268267,"400":0.035760696850117416,"401":0.004562466253220411,"402":0.04647219506219711,"403":0.00695568609003476,"404":0.009741651854452188,"405":-0.07242562571495424,"406":-0.06606173931062945,"407":0.06856931858787002,"408":0.01128898071100983,"409":-0.039636647195923747,"410":-0.28439008407480654,"411":0.010870720202015498,"412":-0.0742020323689031,"413":-0.050149733547435904,"414":-0.08467203665227291,"415":-0.12440793518771602,"416":-0.31359549696614497,"417":-0.1149646710443774,"418":0.0827602569096178,"419":-0.19112658284079473,"420":0.11022653680436671,"421":-0.09340707027319342,"422":0.06592359989256873,"423":0.0571000638696957,"424":-0.14510430464817967,"425":0.06634734976074316,"426":-0.08734437247369692,"427":-0.040231089815995484,"428":-0.2536879172504423,"429":-0.011182560529975903,"430":-0.02659220940363522,"431":-0.03496997388659311,"432":-0.046218329530638196,"433":-0.07743246878158434,"434":-0.22081606723633534,"435":0.058610478826854426,"436":0.07403817619011006,"437":-0.0860559436529942,"438":0.1409546646746516,"439":0.06841681208972636,"440":0.07076117963666122,"441":0.07097300156694315,"442":0.010219826893184807,"443":0.09680579548882236,"444":-0.16917220311218517,"445":-0.009594208217313107,"446":-0.2832317808243061,"447":-0.023485285550851914,"448":0.15586414474768273,"449":-0.07869401199810043}},{"sx":1,"sy":1,"depth":450,"w":{"0":0.0895402228638734,"1":0.019576725933318773,"2":-0.016410163314706964,"3":-0.01417049238395792,"4":0.03743091511208826,"5":-0.05642051699599864,"6":-0.008418980912129923,"7":-0.004840967427707792,"8":-0.0029270280929722015,"9":-0.10568373875375552,"10":-0.27651514573657743,"11":0.1741324123212856,"12":-0.012294291571213598,"13":0.011469811779899758,"14":0.09197696328991653,"15":0.01984123920818861,"16":-0.0682345963073043,"17":-0.032358920605263665,"18":-0.11627521208798872,"19":0.02053734597059021,"20":0.04454301395217774,"21":0.03981182058216677,"22":0.00017375727516274718,"23":-0.13039507399909825,"24":-0.059063244442392554,"25":-0.09189157168345055,"26":-0.009008318703723841,"27":-0.22291346343738694,"28":-0.1781656389851989,"29":-0.019601598666856405,"30":0.07591875723654555,"31":-0.0354656591457738,"32":0.02240236661663354,"33":0.010810517344830697,"34":-0.002432738911141581,"35":-0.005812612454512394,"36":-0.14679776478956288,"37":-0.15187487050808166,"38":0.027959229642994642,"39":-0.01785169743563116,"40":0.08962205358234061,"41":-0.16764987513064966,"42":-0.0456617229175191,"43":-0.26209293227461966,"44":0.01285440171130135,"45":-0.17809809225010337,"46":-0.3143712663778959,"47":0.03375203437864008,"48":0.00018846412710888177,"49":0.03501485443992649,"50":0.07962757189582208,"51":0.007109237263279595,"52":-0.05797990169019045,"53":-0.10155249385900562,"54":-0.08524538299509696,"55":-0.03596297561294266,"56":-0.04822693046038267,"57":0.10785651935679542,"58":-0.028742923658605413,"59":-0.11811160857470748,"60":0.10074070476248392,"61":-0.16187421347870457,"62":0.045134136800667746,"63":-0.01671683976006545,"64":-0.3002339122737383,"65":0.029541885845765996,"66":0.007758614221600056,"67":-0.02901295908114757,"68":0.037168518878223415,"69":-0.03492091073205306,"70":-0.05315532078132736,"71":-0.0445021127231115,"72":-0.09895252307672107,"73":-0.06294681650401523,"74":-0.12749235883878804,"75":-0.014350857933161893,"76":-0.04222106221058141,"77":-0.046380342961448565,"78":-0.04385284398840229,"79":-0.14144919198206604,"80":0.007359069779186409,"81":0.051176902623190496,"82":-0.12383416833060198,"83":-0.09550980570322795,"84":-0.025279839409223837,"85":-0.04576952365957278,"86":-0.008932796795334527,"87":0.06190993600345054,"88":-0.010093567217519887,"89":-0.0742470710446907,"90":-0.021394231799605163,"91":0.06820503477899378,"92":-0.13345910205026576,"93":-0.02898611455562783,"94":0.01943629692960913,"95":-0.061339829646580475,"96":-0.008945788937669152,"97":-0.07473687982604216,"98":-0.03263126467773146,"99":0.0609581740265736,"100":0.02128218145887032,"101":0.19390156929635624,"102":0.02229159168327127,"103":0.05525994577372685,"104":-0.034452195516755955,"105":-0.0820122021902709,"106":0.08468187300320322,"107":-0.09671958095327547,"108":0.0276503697764611,"109":-0.0038973119817276246,"110":0.02458396458889795,"111":-0.14408743549986724,"112":-0.03893897409855149,"113":-0.10060621790454168,"114":-0.04091714075279203,"115":-0.03328893430308481,"116":-0.029908375930588753,"117":-0.1353486661799988,"118":-0.05397555845640828,"119":0.018119918388872492,"120":0.00012853232794829357,"121":-0.003155050661283566,"122":0.02138594779519632,"123":-0.019657688709559775,"124":-0.0008562710679400176,"125":-0.10661514029953362,"126":-0.166451015756715,"127":-0.17370460455931258,"128":-0.06233692987091325,"129":-0.03634080276978407,"130":-0.014113142392559782,"131":-0.32691103119031784,"132":-0.001268207812877787,"133":-0.17507959739167078,"134":-0.022374144182112983,"135":-0.2847801605231913,"136":-0.1309505007561732,"137":0.10543042274030066,"138":-0.000014889083985055671,"139":-0.046549606137982896,"140":0.08853584774238366,"141":-0.05568753705661344,"142":-0.05778660513684983,"143":-0.04920132416524764,"144":-0.12912427525625195,"145":-0.09161530038688839,"146":-0.21471847551449072,"147":0.014698481887584281,"148":-0.05599211893624056,"149":-0.26739651931069364,"150":-0.026481153395645916,"151":-0.27546685933977294,"152":-0.07375294922161259,"153":-0.18938794147652227,"154":-0.07695587021360376,"155":-0.031452604455835184,"156":-0.05558323013385631,"157":-0.03535574821620878,"158":0.14628961400409812,"159":-0.0032860376599813884,"160":-0.14332275859376392,"161":-0.00978907281169401,"162":-0.006321231772008898,"163":-0.015216432421380658,"164":-0.032211703955872854,"165":-0.09494274879239997,"166":-0.033250880647702354,"167":-0.1773587650655374,"168":-0.02209737241366787,"169":-0.10677997256644402,"170":0.010096547008801707,"171":0.04047037406071035,"172":0.038445822551414675,"173":0.0011900015311203606,"174":0.005261148316569408,"175":0.02084425569857695,"176":0.08415486773182954,"177":-0.06964830903513812,"178":-0.08995939405262178,"179":0.027345345383916708,"180":-0.14342938995003685,"181":-0.025953155159949413,"182":-0.23681851547455743,"183":-0.03578092419194087,"184":0.13039270839045394,"185":-0.03755302009376195,"186":-0.027148611188294286,"187":0.17922325878835807,"188":-0.014905716846046226,"189":-0.0325184718967263,"190":0.21444672318040361,"191":0.0325445727952075,"192":0.0011235951016212579,"193":0.02300046214774928,"194":-0.16877697345482034,"195":0.025697899501751775,"196":0.04247692382154775,"197":-0.06553392622762942,"198":-0.023953773464133854,"199":-0.06777130642850522,"200":-0.028280915673518377,"201":-0.12333780187992031,"202":-0.023865265347239765,"203":-0.179113552620265,"204":-0.02864765858239757,"205":0.053401739050247844,"206":-0.023126259907081476,"207":-0.11895084904974736,"208":0.01286625476305583,"209":-0.049170839050362944,"210":-0.11005876868384089,"211":0.013403543907137716,"212":-0.20719700205281558,"213":-0.03137432238819921,"214":-0.20256103836161637,"215":-0.09632200972390363,"216":-0.17204528216099366,"217":-0.23203346136320135,"218":-0.03935227388268553,"219":-0.07351982888005733,"220":0.002692942979591099,"221":-0.30018778139051805,"222":-0.04853371828375964,"223":-0.07091831671670343,"224":0.0174548635512889,"225":-0.20002290508432785,"226":-0.017276575755286804,"227":-0.03355993613769827,"228":0.012720616012421028,"229":-0.024062756329524693,"230":-0.031482226397767314,"231":-0.0012658286530327005,"232":-0.17843952662968074,"233":-0.0876523035380329,"234":-0.0941040342157171,"235":-0.11683956007650753,"236":-0.2702323688355106,"237":-0.06748081335719369,"238":-0.0785613988814335,"239":-0.1939333501532718,"240":-0.016078763840136522,"241":-0.001877316023387635,"242":0.004175299819412571,"243":-0.11669593090782947,"244":0.04777938028400897,"245":-0.00150851635862374,"246":-0.05604772868681075,"247":0.04403874602239824,"248":-0.03597205622971815,"249":0.07008076476364114,"250":-0.24568715275867953,"251":-0.13166461643241373,"252":0.05601856086825029,"253":-0.07664609803677114,"254":0.0016345818913366921,"255":0.0178457091088838,"256":-0.13608066070780686,"257":-0.10104683402313036,"258":-0.08057477225317673,"259":-0.0032699922370563574,"260":0.021628306523975942,"261":0.016218731350980026,"262":0.2312473753293566,"263":-0.05297770279732668,"264":-0.019190483263395838,"265":-0.02637084408492146,"266":-0.10503316898273013,"267":0.0034538964138928372,"268":-0.15268776341593776,"269":-0.024202589956336285,"270":-0.09163782248008365,"271":-0.04757196982836956,"272":-0.14649212747615228,"273":-0.02572515598628224,"274":0.06495908162754614,"275":0.02684645009347672,"276":-0.12970102276934745,"277":0.18557865699589554,"278":-0.026474621539611456,"279":0.07589722672843702,"280":0.043751682876964175,"281":-0.058955612817412045,"282":0.012693433311217197,"283":-0.021238849776684696,"284":-0.31083406813113446,"285":-0.019790498488434855,"286":-0.042423196348179315,"287":0.05932509691907321,"288":-0.11585137016171389,"289":-0.023931805145342534,"290":-0.030050407137182936,"291":-0.13732158194954486,"292":-0.018425246739898083,"293":-0.2818148198432212,"294":-0.15062514802871382,"295":-0.021429142403037765,"296":-0.026241858313233703,"297":-0.07697247398249712,"298":0.004376647540595667,"299":-0.10462058362730646,"300":-0.0009331728024924,"301":-0.005817604037398112,"302":-0.33298676483421963,"303":0.010645213842523541,"304":-0.03875148290778083,"305":0.0342273810619109,"306":-0.2981446707227292,"307":-0.2729551393196574,"308":-0.16578351559345142,"309":-0.1447916544581255,"310":-0.04081237408852455,"311":-0.3647939883674071,"312":-0.06105339581463371,"313":-0.0992849288207716,"314":-0.038343082412258755,"315":-0.19570251258538443,"316":-0.020181079866610614,"317":-0.2027772641599535,"318":0.020718131465230064,"319":0.11047343374755202,"320":-0.0773329664226626,"321":-0.1271047090001947,"322":-0.11449063913452082,"323":-0.07813754862624704,"324":-0.1157554120194179,"325":-0.1353816582360898,"326":-0.2680261826120879,"327":0.019756028309387854,"328":-0.08147476555138936,"329":-0.17553991693841536,"330":-0.061182158836772575,"331":-0.05683081008781478,"332":-0.04529052983389671,"333":-0.22471990866071462,"334":0.07566392616706513,"335":-0.11277802658944566,"336":-0.010819789730067532,"337":-0.014454690805925046,"338":-0.11045740515744883,"339":0.05327388483617946,"340":-0.16839299233071597,"341":-0.0583610241008347,"342":0.05245648770522451,"343":-0.11626657509113485,"344":0.005706293579436331,"345":0.04291706515901693,"346":-0.0008434739005339,"347":-0.046754579520488136,"348":-0.05502138147667489,"349":0.06314092407178618,"350":-0.000025413021654994962,"351":-0.08859757499126504,"352":0.2079644329606194,"353":-0.1499904903877981,"354":-0.021830509443203534,"355":-0.0019687780441641706,"356":-0.014729717933093764,"357":-0.015505770446140476,"358":-0.2046707469931367,"359":-0.03207066212594443,"360":-0.059519697708115306,"361":-0.06128960665059392,"362":-0.010392024282070792,"363":-0.06702267933543048,"364":0.0001420568684869455,"365":0.03811671254225309,"366":-0.07118149247167813,"367":0.09333069823327586,"368":-0.0010321274737449368,"369":-0.10776950139392985,"370":-0.00443803523907313,"371":-0.08320537985221127,"372":0.004924476270244471,"373":0.009832820208862643,"374":-0.018542035692327166,"375":0.0022353309975598344,"376":-0.06137920793413,"377":0.04065589710978263,"378":-0.11529275878680685,"379":-0.006900328273424845,"380":-0.06337991597401385,"381":-0.15693540492840896,"382":-0.08115359955463278,"383":-0.23532399467465037,"384":-0.1238996046622236,"385":-0.09538323854515522,"386":-0.006710451528930596,"387":-0.11031043439861309,"388":-0.021718179102943713,"389":-0.11115589561783695,"390":0.0011353964192006864,"391":0.0456105506736845,"392":0.02432822281290435,"393":-0.05432127009586709,"394":-0.2182690090005117,"395":0.055317158179116296,"396":-0.09967536101414477,"397":-0.1059161912003994,"398":-0.2242600537088485,"399":-0.20812273931746306,"400":-0.07309499646233814,"401":-0.25708755256550153,"402":-0.19257247363779578,"403":-0.08086656261372394,"404":0.05986796878584904,"405":-0.5126220143121001,"406":0.015501830960905847,"407":-0.14972060404213766,"408":0.04860792276536283,"409":0.07500108707432358,"410":0.09211554598098583,"411":-0.01703375397060171,"412":-0.2273377106522726,"413":-0.00861716267416952,"414":-0.22967835020925464,"415":-0.05917069391895315,"416":-0.3449024377067548,"417":0.05017390087983258,"418":-0.06827652355266911,"419":-0.16269707243841777,"420":-0.06491787813853926,"421":-0.05472739578370017,"422":0.07749625497292768,"423":-0.29469358058083767,"424":-0.08205896655705285,"425":-0.2000350489319712,"426":-0.06566288935965581,"427":0.009624495233808159,"428":0.08056227025196044,"429":-0.010977177862572494,"430":-0.22900159785887642,"431":-0.11471698130446233,"432":-0.157423549853936,"433":-0.14838197620174165,"434":-0.10699923843073235,"435":0.09426492827285073,"436":-0.04012788731282023,"437":0.05525447948986163,"438":-0.17724256929310256,"439":-0.03977225255206575,"440":-0.013571719554585015,"441":-0.1378456339800768,"442":0.08422988895956922,"443":-0.15310914322614483,"444":0.008249965099363401,"445":-0.038721219353570174,"446":-0.05945590205550019,"447":-0.009504737772363218,"448":-0.02566727814906727,"449":-0.14191614057019933}},{"sx":1,"sy":1,"depth":450,"w":{"0":-0.07642909779884412,"1":0.01086424747730888,"2":-0.01759375785159839,"3":-0.02667231023931973,"4":0.008392889488362202,"5":0.006284990345186366,"6":-0.05549292882174299,"7":0.0386056861694955,"8":-0.07232868290560826,"9":-0.06342350944867957,"10":0.03250296456464179,"11":-0.13667175871023268,"12":-0.012157676695049512,"13":-0.034409905540325914,"14":-0.048481291713864935,"15":0.0004464848177506439,"16":-0.04993617386906981,"17":-0.08814454075555997,"18":0.01624194057285927,"19":0.21773139217164872,"20":0.002123885267533283,"21":-0.009560870278156539,"22":-0.05942647514127489,"23":-0.13633610863084078,"24":-0.06066719650855153,"25":0.02530252679298231,"26":-0.08442196988194994,"27":-0.28725452625900744,"28":0.01386123312242356,"29":-0.09401278253978226,"30":-0.019220076792163907,"31":-0.0268972560806974,"32":-0.10308421060010711,"33":0.05542430831812858,"34":-0.1428792636058105,"35":0.015316382482744874,"36":0.09980301002135802,"37":0.01600689951468698,"38":-0.07229101357126243,"39":-0.04375534116009566,"40":0.004472141612842691,"41":-0.20793388748004532,"42":-0.08237038429522454,"43":-0.1058480555327692,"44":0.0056331662845380435,"45":-0.08554266236313303,"46":-0.0710889011447791,"47":-0.1714589397629425,"48":0.011624987934905774,"49":0.014936585968035085,"50":0.011729574952471154,"51":0.036275027657189,"52":-0.060977393730756786,"53":0.07143822136388915,"54":-0.09205593190951696,"55":-0.21284493110674785,"56":-0.0821698839081175,"57":-0.08521481281167434,"58":-0.053336959593687894,"59":-0.09732206606091093,"60":-0.030941502252361468,"61":-0.1896371680955444,"62":-0.04195065924563889,"63":0.08807005536349741,"64":-0.030997960042188685,"65":-0.16634546463882646,"66":-0.005364034047404903,"67":-0.04977963687246606,"68":-0.06257731627861558,"69":0.005998645363169695,"70":-0.0589704558324053,"71":0.0013464451454759377,"72":0.0778969670218105,"73":-0.051363488851464294,"74":-0.0364596054997218,"75":-0.08551464173641371,"76":-0.04528525393173763,"77":-0.02075097367681198,"78":-0.01105246583532195,"79":-0.08211310212460153,"80":0.03742380900111907,"81":0.15004381923831278,"82":0.010962071560228043,"83":-0.02716362318264241,"84":0.006976128125623069,"85":0.0887414899372076,"86":-0.12983813875936917,"87":0.0001584032921688212,"88":0.013395638973482216,"89":0.017310395240671052,"90":0.07481193953253776,"91":0.09284172225052172,"92":-0.048862551666990356,"93":-0.13887417783863634,"94":-0.04404678190127523,"95":0.17518896911495022,"96":-0.013287081104309276,"97":0.04642079441128715,"98":0.021411921022140096,"99":0.02035624630723004,"100":-0.07923633818294121,"101":-0.04201486266034062,"102":-0.022048383256201006,"103":-0.012347255701646331,"104":-0.1455211771529002,"105":0.059652819611308146,"106":-0.02644435660010896,"107":-0.04576744631146642,"108":0.1961684269882724,"109":0.09373605571720728,"110":0.006470412582638514,"111":-0.023786931856859005,"112":-0.04165383384381869,"113":0.07620670495580817,"114":-0.16679282749139532,"115":0.12014374569713258,"116":0.03468000105804462,"117":-0.22737710900589003,"118":-0.15718047176538702,"119":-0.16173586941914628,"120":-0.0270024379707487,"121":-0.03468876162305692,"122":-0.11300779641376796,"123":0.0936650156842203,"124":-0.14873513236206654,"125":-0.015939337782758484,"126":0.08432570262803082,"127":-0.0582663885257953,"128":-0.2292801103041765,"129":-0.050156245671354266,"130":-0.048554515686763534,"131":-0.08801605240345148,"132":-0.11956235507092174,"133":-0.05910934548424481,"134":-0.012602933075167952,"135":0.026045066028188266,"136":-0.139796675577285,"137":-0.1824601689999954,"138":0.025756099344725177,"139":0.023500857859364954,"140":-0.11089779541906436,"141":0.002057217566889277,"142":-0.014359059185774077,"143":-0.002984397385197133,"144":-0.06782139217185126,"145":-0.12507672193010233,"146":-0.10319887285882931,"147":-0.07540913307881908,"148":-0.01853958898877262,"149":0.02096077759007403,"150":0.025728575238981626,"151":-0.0836732756775997,"152":-0.04171852818660384,"153":0.2074316448548702,"154":0.0488869666373095,"155":-0.13618853582982113,"156":0.04476712622799881,"157":-0.01106911144771016,"158":-0.1768281814556643,"159":-0.02962787951340152,"160":-0.05565849320446533,"161":-0.1021563452963136,"162":-0.016422125552421347,"163":-0.06427268495480525,"164":-0.06076538244289316,"165":-0.11981925467739117,"166":0.08521451103529515,"167":0.08615859028868159,"168":-0.05278462927887268,"169":-0.07665928369637252,"170":-0.043187911302116674,"171":0.08297157487164615,"172":0.036645954900784775,"173":-0.01950762010864069,"174":-0.08324343525778846,"175":0.01808090795066332,"176":-0.14665368309149127,"177":0.002986596833056148,"178":-0.006318984352609953,"179":0.0660082496958952,"180":-0.03689513851343348,"181":0.04479583113263181,"182":-0.17924833434864967,"183":-0.16148716361085783,"184":-0.04963375982701907,"185":0.17452458794215406,"186":-0.14401015762852162,"187":-0.09078937634936085,"188":0.04201277300066638,"189":-0.04378595290716285,"190":-0.04920689150088738,"191":-0.11843243641061196,"192":-0.015472993267325314,"193":0.04305437376109127,"194":-0.20729611698021153,"195":-0.030871233292871992,"196":-0.12070096061421205,"197":0.05996105557225869,"198":0.024979775142096875,"199":0.0403681779604696,"200":-0.041689554725137655,"201":-0.06203421408647683,"202":-0.005215704670014318,"203":-0.0034054570533864417,"204":-0.0561624037831691,"205":0.0011863971882396203,"206":0.007346853849773109,"207":-0.19857374914048964,"208":-0.02783203793662321,"209":-0.1147105170273766,"210":-0.08564781368161345,"211":-0.047106467979727604,"212":-0.20905717357041967,"213":-0.03209673061196574,"214":-0.14825447166145445,"215":0.010455886691008921,"216":-0.010417963241756343,"217":-0.023031728369740906,"218":-0.19128097541822478,"219":-0.09123301345754778,"220":-0.006257646473775921,"221":-0.029851990658602306,"222":-0.05678530952574181,"223":0.0063842117231826135,"224":-0.04933297409675912,"225":-0.08498671978275565,"226":-0.10520158440294342,"227":-0.17576025296877018,"228":-0.014579798933618923,"229":-0.005294323472928006,"230":-0.11862711818628938,"231":-0.009219784892910757,"232":-0.17294676510087342,"233":-0.03537531545209253,"234":-0.12144380881593841,"235":-0.08244034273082769,"236":-0.28825677062926175,"237":-0.11040685398573345,"238":0.0005118228555121938,"239":0.0008763327509914242,"240":0.022414371052671706,"241":-0.04541736751753424,"242":0.044074800381298206,"243":0.13460337517731363,"244":-0.06663701902322319,"245":-0.17560556291267243,"246":-0.057295899338539506,"247":-0.07616324463217189,"248":-0.06742166406703516,"249":-0.016598561851119686,"250":-0.028842840179854508,"251":-0.06064910422541714,"252":-0.061226347513880584,"253":-0.08378882301706836,"254":-0.03423408669603717,"255":-0.07273561856946652,"256":0.006842752631567861,"257":0.02095775772464774,"258":-0.040831463337963135,"259":-0.015587772598565378,"260":-0.052185612941345313,"261":0.16662961150297986,"262":0.15644423570819502,"263":-0.11952507176631653,"264":0.0383438661150328,"265":0.021904640194353727,"266":-0.14278679783363676,"267":0.011737833059162804,"268":-0.0952683700656617,"269":-0.07097892392331703,"270":-0.13500055722653972,"271":-0.11864124215663092,"272":-0.00910778114648492,"273":-0.16431138447703109,"274":-0.05321150513900665,"275":0.13788802207035297,"276":0.11929446093338512,"277":-0.015320920370261804,"278":-0.02601486045684501,"279":-0.05287989803230778,"280":-0.14846930688216126,"281":-0.11687492300067981,"282":0.0027260288701914633,"283":-0.0452494205589288,"284":-0.20401587358699044,"285":0.05669470517348757,"286":-0.057451062200185955,"287":-0.048225119871211794,"288":0.06313788213860781,"289":-0.014428277374943246,"290":-0.07912296114344243,"291":-0.21127940758438996,"292":-0.09467314647300494,"293":0.029257074954562787,"294":-0.1466273923498778,"295":-0.05801960674263375,"296":0.007400919540682205,"297":-0.18639216647615847,"298":-0.13891204499543533,"299":-0.15593488408655715,"300":0.03671406673112179,"301":0.020435485165591353,"302":-0.1608371774873521,"303":0.000888867120975939,"304":-0.1777576594530025,"305":0.022540089461396733,"306":-0.12774841360498926,"307":-0.10909314646935174,"308":-0.15764714355859452,"309":-0.1710852110404148,"310":-0.13087567726964192,"311":-0.15556608763791438,"312":-0.10404097946673534,"313":-0.09177967421025748,"314":-0.054130511465356156,"315":-0.04952320895132316,"316":-0.1191749238005218,"317":-0.12892407227057473,"318":-0.0028309420069770204,"319":0.011660976204811652,"320":0.13088653309738976,"321":-0.04635933367969212,"322":-0.20186107276506837,"323":-0.044841660206589265,"324":-0.18524310461234605,"325":-0.13313525517744368,"326":-0.2908109580806368,"327":-0.06627939017873681,"328":-0.06437433389045402,"329":-0.1590255851786346,"330":-0.10570490001942984,"331":-0.05151107186331295,"332":-0.018312456675349958,"333":-0.11399354259737612,"334":0.055158636516356434,"335":-0.19876204548007187,"336":-0.050835330779336496,"337":-0.059055050504148346,"338":-0.13931705519311596,"339":0.024901291388550188,"340":-0.1384602266825311,"341":-0.12551528252313365,"342":-0.046035564185767604,"343":-0.15118841308244743,"344":-0.12225195771186587,"345":0.05861045958784876,"346":-0.06891750191245101,"347":-0.03081716449013534,"348":-0.05300568687549111,"349":-0.13141932277358934,"350":-0.031216405909788608,"351":-0.039524267203776164,"352":0.1499861521534769,"353":-0.1403845052614006,"354":-0.043895984262851795,"355":0.010849423360936652,"356":-0.07009486802429488,"357":0.041674324143891626,"358":-0.023737230095650926,"359":0.05908220814858577,"360":-0.08202269426847737,"361":-0.1112459118556024,"362":0.02312563207817153,"363":-0.21568914368380118,"364":-0.1200648529807119,"365":-0.09759711362194529,"366":-0.03979642037612263,"367":0.05918447096628544,"368":0.12694589529754222,"369":-0.012807557673849985,"370":-0.09632466017110318,"371":0.015057643557358912,"372":0.019130598912874722,"373":0.03949831840122851,"374":-0.13443609269015977,"375":0.04729847155900951,"376":-0.051041771654273066,"377":-0.04897842301667495,"378":-0.05667203743596258,"379":-0.08340695982487002,"380":0.031175812605419066,"381":-0.1054726474025775,"382":0.013307226037494933,"383":-0.16434574390120107,"384":-0.09184015509831263,"385":-0.09455983489124176,"386":-0.04738319349223404,"387":-0.013908418317977228,"388":-0.16771090232859445,"389":-0.04254067288263423,"390":0.13438994721051603,"391":-0.0018840746660833952,"392":-0.13092882558920876,"393":0.07565567090556301,"394":-0.18290733914371526,"395":0.02653013325531114,"396":-0.07994615211772148,"397":-0.00231789453506461,"398":-0.14076382049861882,"399":-0.16219504752356587,"400":-0.10940114291957716,"401":-0.2589168518398788,"402":-0.11347214877488562,"403":-0.07963352943362165,"404":0.02800313138933356,"405":-0.16169342218079882,"406":-0.009385251931335778,"407":-0.014332319673660172,"408":-0.0005423944814237574,"409":0.025437440311763378,"410":-0.03209068476032215,"411":-0.033056859221998885,"412":-0.18056239941757662,"413":-0.09208281194421625,"414":-0.11057938609083941,"415":-0.038628854292132676,"416":-0.27849996000204513,"417":-0.08543562328565936,"418":-0.02256075753326221,"419":-0.07411463786639763,"420":-0.14267611007076447,"421":-0.0121423965504861,"422":0.008095920512005693,"423":-0.13540076380686114,"424":0.03276390537234852,"425":-0.15524247732105328,"426":-0.08898340223067583,"427":0.0012028978468569388,"428":-0.09826847630002053,"429":0.003649483381640034,"430":-0.22001998178417975,"431":-0.038071907665694675,"432":-0.08738959160178167,"433":-0.02472541124270497,"434":-0.14344287628092528,"435":0.009765194881319722,"436":-0.18065502807285597,"437":-0.03205925908474816,"438":0.025830293563923783,"439":-0.0160573540541374,"440":0.01028265819999419,"441":-0.14832668356580764,"442":0.25469883752820305,"443":-0.06778187158073842,"444":0.10259625080990468,"445":-0.03336111074879961,"446":-0.1703090816936097,"447":0.007858543450933727,"448":-0.0928448357054584,"449":-0.02026038643891365}},{"sx":1,"sy":1,"depth":450,"w":{"0":-0.11898838953064418,"1":-0.014811162504293367,"2":0.03738285856426864,"3":-0.10788665890785722,"4":-0.11522926752701082,"5":-0.06673370882124101,"6":0.04444307644739164,"7":-0.08075751803528246,"8":-0.07419701755206083,"9":-0.19199598895228956,"10":-0.2561865932931328,"11":-0.09106580839947058,"12":0.04994938392534236,"13":-0.04052501197980045,"14":-0.11337502450396149,"15":0.04673973717538562,"16":0.06524890285459156,"17":0.0458209098063698,"18":-0.247553336404619,"19":-0.24261251483428772,"20":0.007178289593479091,"21":-0.14009453737787284,"22":0.002350560373591243,"23":-0.22144385546302037,"24":0.0291047329487591,"25":-0.21131040157859046,"26":0.045105990112903026,"27":-0.09907297756899587,"28":-0.2514424553152922,"29":0.03423457342032211,"30":-0.021816834278974725,"31":0.007836816974498551,"32":-0.04047412272426741,"33":-0.006218910799910539,"34":-0.13244774312793264,"35":-0.05788624049905618,"36":-0.13652354421659682,"37":-0.054013314924539216,"38":-0.05982619329833281,"39":-0.0992959588783511,"40":0.06370265600852341,"41":-0.17587899023997305,"42":0.0005303995475940594,"43":-0.11760770201130716,"44":-0.079237742589589,"45":-0.05099583842627413,"46":-0.32432307703215896,"47":0.05060691024634512,"48":-0.025587813165294387,"49":0.02982451643255106,"50":0.0925239144755866,"51":0.051217421895448645,"52":-0.08583702116222697,"53":-0.05641959263928569,"54":-0.000907770211195339,"55":-0.06135948219581679,"56":-0.023742779734751928,"57":-0.1722548440383689,"58":0.03971089641952637,"59":-0.21310989420681076,"60":0.04091198084137162,"61":-0.15744486148602865,"62":-0.0019888779482289004,"63":-0.07448032265946025,"64":-0.3704426580384358,"65":0.0022664905630128004,"66":0.05015855905443352,"67":0.00870504531020028,"68":0.10449877780599481,"69":0.03392254159455296,"70":-0.07189502105423307,"71":-0.1040240504824931,"72":0.03088113938450515,"73":-0.09127865916214227,"74":-0.1055540904955804,"75":-0.08845906355930566,"76":-0.02765682761244532,"77":-0.0036119465964570014,"78":-0.05128773527638193,"79":-0.0330198827074488,"80":-0.04352115025236844,"81":-0.12936425125106094,"82":-0.07484886132690258,"83":-0.15864677574888963,"84":0.018828565651505272,"85":-0.03664458434958185,"86":-0.06095681188656159,"87":0.03671124754097088,"88":0.09147124123938317,"89":-0.14061582261431663,"90":-0.014001554150165822,"91":-0.03506145387832182,"92":0.06382777863666067,"93":-0.12009319612852637,"94":-0.011210585605072666,"95":-0.22659852807201414,"96":-0.07008757916054509,"97":-0.08456399739994787,"98":-0.08796908311484865,"99":-0.0970642340106077,"100":0.02426070103496472,"101":-0.11348006438787865,"102":-0.011221121998081018,"103":0.07456612689717529,"104":-0.17762092472275454,"105":-0.03360511845119379,"106":-0.05118126995225401,"107":-0.03242514626783809,"108":-0.1596373883404684,"109":-0.18264065152345374,"110":0.0449601998597607,"111":-0.14505921392954924,"112":-0.028566596968957466,"113":-0.21106956503252833,"114":-0.07820275475772989,"115":-0.26897232372392293,"116":-0.04007548282575203,"117":-0.0847168562296458,"118":-0.019856917129261468,"119":0.10968797013646611,"120":-0.024601138156519743,"121":-0.044753560979859094,"122":0.016130602960306682,"123":0.058619604589275544,"124":0.000990439800161546,"125":0.045673118887338916,"126":-0.05844177393098967,"127":-0.04408637093969133,"128":-0.12348380066314392,"129":-0.06008238545945427,"130":0.034312536692709464,"131":-0.21146127821754312,"132":-0.06396720885866045,"133":-0.2995126720889604,"134":-0.017574930268391534,"135":-0.0884343095925127,"136":-0.18314417570671213,"137":0.19311040542727814,"138":-0.030863859113653108,"139":-0.03949252879835809,"140":-0.020005973832582055,"141":-0.02885780407803918,"142":-0.06569265381649347,"143":-0.0962494511227785,"144":0.11027274015065171,"145":-0.016586853823490684,"146":0.068948456722967,"147":0.02207914918980879,"148":-0.0759115270452402,"149":-0.28615609365451855,"150":-0.0938817780323478,"151":-0.2204839583534975,"152":-0.01938630107054685,"153":-0.05137714842920815,"154":-0.052503210894446456,"155":-0.03100972920634703,"156":-0.031072376174401038,"157":0.012310229003197885,"158":-0.03928209562360906,"159":0.06581730832793241,"160":-0.06431839176180765,"161":-0.0975526131719145,"162":-0.016241232281821852,"163":-0.04014398676208809,"164":0.08662815097417612,"165":-0.03819233012917937,"166":-0.040283267874068704,"167":-0.1945388278167926,"168":0.040800580336449156,"169":-0.08264884623391905,"170":-0.03473276205775594,"171":-0.14486835168491835,"172":-0.08078654992575385,"173":-0.1609435927997332,"174":0.04727747228861797,"175":0.03332858616831938,"176":0.00774003205002093,"177":0.015997689583040132,"178":0.12559488904478894,"179":-0.04705714036037228,"180":-0.1407425977776862,"181":-0.03899828373051866,"182":0.08544943057566493,"183":-0.097537408195724,"184":0.08478031000162825,"185":-0.251941489997137,"186":-0.053151205140315114,"187":-0.056846539198390555,"188":-0.03912729285759736,"189":-0.11809083957973045,"190":0.13585710502104648,"191":-0.07723840064371124,"192":-0.07917847559592514,"193":-0.007480624584257186,"194":-0.07851676606465798,"195":-0.05534042236946046,"196":-0.05499078503648568,"197":-0.02513956130738724,"198":-0.20666585940714077,"199":-0.1597173982801803,"200":0.03490318131869748,"201":-0.021048150831035436,"202":-0.009137473443652441,"203":-0.16074689625755703,"204":-0.09563799785903254,"205":-0.18604244432703992,"206":0.0733827652742243,"207":-0.11424655438905085,"208":-0.09211173594662722,"209":0.030426817830948926,"210":-0.012653192050299782,"211":-0.09804403172444608,"212":-0.17059627923695336,"213":0.07021133141641368,"214":-0.052923634806270305,"215":0.008816733537832312,"216":-0.08875844717469432,"217":-0.05702055147200235,"218":-0.12113510623375809,"219":-0.09356885626498089,"220":0.005054570411921273,"221":-0.18539727320623114,"222":0.08397224582629947,"223":-0.10294847884505293,"224":-0.06991698912563143,"225":-0.02438596601780612,"226":0.011011621757692073,"227":-0.03518298049933432,"228":-0.025929238081448935,"229":0.0017181442367114452,"230":-0.024323437301724232,"231":-0.06834960210003985,"232":-0.14633994539439518,"233":-0.014466219415910924,"234":0.16608419174788774,"235":-0.1853804466458239,"236":-0.028019872061675343,"237":-0.050904067456305636,"238":-0.02783652053032065,"239":-0.14470451217076613,"240":0.11603509180491145,"241":-0.19033507917447814,"242":-0.029052929225786398,"243":-0.008139905169736856,"244":0.07867048992185305,"245":-0.0263605213201582,"246":0.0058569160016810895,"247":0.06730140213849746,"248":0.13370691540872562,"249":-0.08096485898233982,"250":-0.16274152844831374,"251":-0.043809698967400015,"252":0.08368323371563897,"253":-0.10886597090374611,"254":-0.06468633508187864,"255":-0.06516898028223629,"256":0.058640290003335344,"257":0.004268905904734382,"258":-0.036112918612532935,"259":0.13191342687490068,"260":-0.005612177960833499,"261":-0.012635789885802938,"262":-0.02669713099054035,"263":-0.18741032294920557,"264":0.014833922952973012,"265":-0.0249957267786698,"266":-0.06687304191151607,"267":0.007722545736360339,"268":0.014165951959903743,"269":-0.05055259483716151,"270":-0.07040425241758448,"271":0.07620611365227481,"272":0.11128907615235217,"273":-0.1022212210027286,"274":-0.030936259938218174,"275":0.06977434526512512,"276":-0.040814855537165864,"277":-0.16360416356271243,"278":-0.01335619521582723,"279":-0.07057892309166477,"280":0.07453538678426175,"281":-0.09463316966885428,"282":0.06568801523477319,"283":0.046408358285486166,"284":-0.15839779360664466,"285":0.020280089407336933,"286":0.01990029631753283,"287":-0.04293007418046149,"288":-0.16486910914619418,"289":-0.0047495603363051425,"290":0.03010646908011097,"291":-0.11110992662786023,"292":-0.04566301573408888,"293":-0.1738207371185652,"294":-0.08655382674447114,"295":-0.23400145040559847,"296":0.019063357226739238,"297":-0.07733573686184596,"298":-0.005785653311238651,"299":-0.11743193050514525,"300":-0.04403498892747793,"301":-0.03051123278540227,"302":-0.15334630824123802,"303":0.00042381465375630436,"304":0.0731358901523695,"305":-0.02744759274161268,"306":-0.020658987443066264,"307":-0.10633315140590557,"308":-0.11546385784868086,"309":-0.07518886167177005,"310":0.0331131566806531,"311":-0.11221721930576481,"312":0.08897615781329983,"313":-0.23006142170830832,"314":0.02075237240517627,"315":-0.15907479571253402,"316":0.09581380585568798,"317":-0.18149193479486922,"318":-0.09342857881118684,"319":-0.0502119119747042,"320":0.02233596228876894,"321":0.017898151377291456,"322":-0.07809366997273448,"323":-0.07695550932872414,"324":0.152427650949051,"325":-0.14931504962046793,"326":-0.10477557305050272,"327":0.18617712844724846,"328":0.03558076954276068,"329":-0.12877598812105734,"330":0.020877138684060458,"331":-0.09313857721089966,"332":0.03561051817449759,"333":-0.05968447654461655,"334":0.06705038306025694,"335":-0.2476917173418467,"336":-0.004706552950251656,"337":0.07267760797913443,"338":-0.056055189286759864,"339":-0.020859713377551704,"340":-0.0772607140080028,"341":0.008498871962862241,"342":-0.03892123208206771,"343":-0.10246119000315762,"344":-0.10070446478324313,"345":0.03251448347217146,"346":-0.0837746828340579,"347":-0.03196924637832162,"348":-0.05613102303988706,"349":-0.07332529428397008,"350":0.007811196790548375,"351":-0.2548400861021128,"352":-0.05896787245658682,"353":-0.2407097125944269,"354":-0.01793119266951064,"355":0.027233213467240672,"356":-0.02840668931074148,"357":-0.018920179018577222,"358":-0.02986384885678439,"359":-0.025459968799994567,"360":-0.045475710819792174,"361":0.01303246015600837,"362":-0.06735502182436867,"363":-0.11132102965705125,"364":0.02591324377788375,"365":0.020330733554773953,"366":-0.1701040387961014,"367":-0.28143995475997746,"368":0.005249897525586187,"369":-0.02202204943270467,"370":-0.09208961571553735,"371":-0.021614728580715076,"372":-0.03332093703014803,"373":-0.01504481703122526,"374":-0.03457452053573298,"375":0.00958288479367026,"376":-0.00037436099722785445,"377":-0.02518891016552085,"378":-0.02584690940731726,"379":-0.03456687850841302,"380":-0.18654509816410506,"381":-0.06115350003119333,"382":-0.020338270794748252,"383":-0.115453287521472,"384":-0.20284256780790685,"385":-0.07114701710155774,"386":0.025520221482223708,"387":-0.09582599012756382,"388":-0.14693643767815343,"389":-0.19345192386109583,"390":-0.06097759365918773,"391":0.025888989717790467,"392":-0.00760203632040683,"393":0.06305969110157891,"394":-0.16513015384695634,"395":-0.05968283923257096,"396":-0.20306609735725817,"397":-0.042771399585690865,"398":-0.47602821438027804,"399":-0.06736137301926391,"400":-0.010017536503409651,"401":-0.1579085587211246,"402":-0.11623088196127615,"403":-0.20832215596569345,"404":-0.04402009752794433,"405":-0.1544159568464895,"406":-0.0637604318611597,"407":-0.13831841614127857,"408":-0.03656654012657186,"409":0.043668994129403144,"410":0.05994299186925877,"411":-0.06035481201581701,"412":-0.24056607776103842,"413":0.03691600959250946,"414":-0.12950324046469994,"415":-0.02988071751380504,"416":-0.2280605777649953,"417":0.11652622871288836,"418":-0.12292888453061446,"419":-0.08849742386902099,"420":-0.03781737775722103,"421":-0.17358594511796382,"422":0.08570308630959626,"423":-0.33331700861023467,"424":0.06575419696707137,"425":-0.1769702971394015,"426":-0.05574491314349723,"427":-0.07556549990494303,"428":0.0081375260694056,"429":-0.03242079689204249,"430":-0.2148773983990369,"431":-0.06023377161095145,"432":-0.22156532493617545,"433":-0.04544520823001584,"434":-0.20283818695176095,"435":0.00013447005055206943,"436":0.015078848330176524,"437":-0.010766096734996877,"438":-0.1061993273909364,"439":-0.05372590531169534,"440":0.05278953082606066,"441":-0.1994712825499638,"442":-0.0228374616724648,"443":-0.1470532702326401,"444":-0.008268377227189917,"445":0.053819400462352444,"446":0.04536738390566408,"447":-0.007585989651150152,"448":-0.09064879235993693,"449":-0.15979457523548046}},{"sx":1,"sy":1,"depth":450,"w":{"0":-0.08638470622982984,"1":0.0008922350765409811,"2":-0.1287943160624441,"3":-0.1446250096280371,"4":-0.00971018250402139,"5":-0.09013645579214567,"6":-0.08028318977192914,"7":-0.1311673918102549,"8":0.011507945986720296,"9":-0.11406280223550323,"10":-0.03400225368441356,"11":-0.0966504722310478,"12":-0.13855120683028804,"13":-0.043351611405477095,"14":-0.09538825090591378,"15":-0.05755418379703287,"16":-0.010859008475705109,"17":0.07223180658562654,"18":0.021258390880846967,"19":0.2871218735654287,"20":0.037556199621226465,"21":0.004193177322745578,"22":-0.025599646927244032,"23":-0.1211681633052805,"24":-0.028828700217543596,"25":-0.07094728916202848,"26":0.007598395951818177,"27":-0.12811640542167602,"28":-0.19997620906232588,"29":-0.0895671724990977,"30":-0.02512666813208405,"31":-0.07976644032260984,"32":-0.14174595895913086,"33":0.024443915049713202,"34":-0.12951555333932072,"35":-0.01238222958421502,"36":0.009150709226872764,"37":0.20999330835878952,"38":-0.12325841755194533,"39":-0.029864228595438105,"40":0.004334577352470799,"41":-0.14657917683068386,"42":-0.08939145261018101,"43":-0.02216556953133699,"44":0.02916530101113121,"45":-0.05665432209486192,"46":-0.11916798095627146,"47":-0.20541363621995795,"48":-0.020964273668729775,"49":-0.03623387037183898,"50":-0.1376114900813016,"51":-0.06224563792933615,"52":-0.06181059932780608,"53":-0.05799717132665287,"54":-0.11443445719437395,"55":-0.022532206105395317,"56":-0.15210387397287137,"57":0.008760833240218573,"58":-0.008341236731263803,"59":-0.05184052732163519,"60":0.03587750599213231,"61":-0.043253332301727565,"62":-0.027948397819647492,"63":-0.11796539660608141,"64":0.0009630595056914945,"65":-0.18602323858176215,"66":-0.010653783705646104,"67":-0.02497812753608046,"68":-0.204025898153713,"69":-0.01848136948998331,"70":-0.10152266463136539,"71":-0.12244440027866153,"72":-0.1280380620054122,"73":-0.1795987511957805,"74":-0.023820894665167618,"75":-0.04347897015635767,"76":0.028422473788602996,"77":-0.08661798771449286,"78":-0.027126139817969974,"79":-0.21594162265470132,"80":-0.030573208494519576,"81":-0.0021719016202828936,"82":-0.05706827625588822,"83":-0.10788064366948269,"84":-0.013228484518671042,"85":0.019028460339835716,"86":-0.17587253908771644,"87":0.026263754791305993,"88":-0.06507688652030308,"89":-0.09142475122210278,"90":-0.06969820655879963,"91":-0.06952233835926042,"92":-0.10379645748029497,"93":-0.1671668879563336,"94":0.04718346924784438,"95":0.011638866692078548,"96":-0.10221326318606493,"97":-0.16783048578343668,"98":-0.051425935910301444,"99":-0.14726957481580039,"100":-0.021483161278944993,"101":0.004674958419474067,"102":-0.015817259137386585,"103":0.0009797300712695335,"104":-0.16779085397190363,"105":0.0313892626837081,"106":-0.025008341510547736,"107":0.015603106628253328,"108":0.02145611725062774,"109":0.2768495781522533,"110":-0.05652077044573975,"111":-0.13193313148200853,"112":0.007872983653051288,"113":0.12782274461833962,"114":-0.13203650088567695,"115":-0.1057820261907635,"116":-0.04849495029558848,"117":-0.1239855284636956,"118":-0.13965330790999522,"119":-0.16302396856470866,"120":-0.029535350140061083,"121":0.01828919106403319,"122":-0.06779150302513495,"123":-0.015004334642388564,"124":-0.14350064416399452,"125":-0.06393678856442395,"126":0.09910024879788393,"127":0.14218986776182096,"128":-0.18823003389349002,"129":-0.12144565625125779,"130":0.026663484006560493,"131":-0.038889882721106245,"132":-0.03229146479104133,"133":0.13749106117488685,"134":0.013265657312600472,"135":-0.3234549651804647,"136":-0.055285706042284416,"137":-0.15966178959293972,"138":-0.05437135622637953,"139":0.05419704390551842,"140":-0.16566866394885096,"141":-0.025409496913519042,"142":-0.09208358374789445,"143":-0.08493315137762851,"144":-0.07612551024357217,"145":-0.1291595737780694,"146":-0.029718638356746988,"147":-0.09746668760132604,"148":-0.02089902743953344,"149":-0.10516105722080558,"150":-0.04300004506419231,"151":0.1197540257553207,"152":0.050172262392113524,"153":-0.08581341004462678,"154":0.0853168880913436,"155":-0.08095252563015495,"156":-0.02330575855999255,"157":0.00927027331803153,"158":-0.245200795509798,"159":-0.022255678041433146,"160":-0.11778551948132494,"161":-0.12735421446023593,"162":-0.08307218688550683,"163":-0.13995111293121312,"164":0.03661901900273378,"165":-0.0794507163487252,"166":-0.10078274982910765,"167":-0.12204761694964959,"168":-0.10906082516492921,"169":0.00021803613075438595,"170":-0.006839415579735658,"171":0.05018865441937543,"172":0.005858611875893794,"173":-0.10459055501814725,"174":-0.0020151696931057497,"175":0.09420853512666501,"176":-0.18601774727978068,"177":-0.06642272533817555,"178":-0.10547637480796013,"179":0.0036452892597796296,"180":-0.20048882421918535,"181":-0.06311256677342134,"182":-0.22846571568418456,"183":-0.12017284049844099,"184":-0.12344204056275819,"185":0.007795452755016721,"186":-0.16847385565913436,"187":-0.13645045006218084,"188":-0.007869268787479186,"189":-0.0072507100956264794,"190":-0.05996679770331381,"191":-0.0644449955254522,"192":-0.011331360814665466,"193":-0.023283345228946123,"194":-0.1643786681072298,"195":-0.03167243661153895,"196":0.015118335664851152,"197":0.0034836016600351526,"198":-0.012087894789026863,"199":-0.11750803208394438,"200":-0.04146781112602127,"201":-0.10430723338035143,"202":0.003347315282950884,"203":0.11694144674126317,"204":-0.14362755323455956,"205":-0.0523071533688444,"206":0.07384060112960736,"207":-0.1405494727406294,"208":-0.1841049555634345,"209":-0.17107497664228208,"210":-0.0488277225236112,"211":-0.03901684493306585,"212":-0.13692303539227926,"213":-0.13549854485676924,"214":-0.11834740623093452,"215":0.01495910886708363,"216":-0.05856328133952047,"217":-0.13613990388039968,"218":-0.24409317155889873,"219":-0.12596951900531578,"220":0.04405976804527506,"221":0.05925390237385325,"222":-0.09971621886183701,"223":0.033480913198818844,"224":-0.03945229797020149,"225":-0.2646302709663505,"226":-0.14541686916717506,"227":-0.2494602071030358,"228":0.012317924785568991,"229":0.03776401065503857,"230":-0.07595293205012292,"231":0.0032380480608516396,"232":-0.11088696205494415,"233":-0.11642830384363544,"234":-0.11167422825889833,"235":-0.06322095356884277,"236":-0.12531455233661676,"237":-0.09916724113831465,"238":-0.0169277210228823,"239":-0.20162386547847255,"240":0.028516295392735643,"241":0.18449181820416305,"242":-0.0291950601687372,"243":-0.21162783958925688,"244":-0.023707945839488327,"245":-0.15868195378918842,"246":-0.03814561177268042,"247":0.01016991670271059,"248":-0.18906671023922816,"249":-0.06546848588710587,"250":-0.13800203748925483,"251":-0.12154636098880268,"252":-0.17500076564636619,"253":-0.06498555728933736,"254":-0.07056643768589038,"255":-0.17428210186053622,"256":0.020440974173324272,"257":-0.0802492533524218,"258":-0.1508063425072329,"259":0.01079850833706891,"260":0.002813693670467115,"261":-0.044700826223219234,"262":-0.0031599582958358997,"263":-0.12430977491353822,"264":-0.07389817220977392,"265":-0.05551957516843707,"266":-0.12379894662506304,"267":0.0009814941356337012,"268":-0.0274282135947709,"269":-0.07511781884879977,"270":-0.027026648632703775,"271":-0.019543766477535716,"272":-0.15286896924036145,"273":-0.07778851407182294,"274":-0.038236835155280875,"275":0.08090380496398185,"276":-0.1249785998186273,"277":-0.08758722591996608,"278":0.057603389883891985,"279":-0.053290301586752464,"280":-0.06374521366843686,"281":-0.004363575631301471,"282":-0.07672425350329352,"283":0.07072578449288516,"284":-0.17098171366305667,"285":-0.05086676855693073,"286":-0.0165072853275146,"287":-0.022076981655382882,"288":-0.02452583068055821,"289":-0.060976932061395664,"290":-0.15565885256391454,"291":-0.04253932872181388,"292":-0.11016879518273502,"293":0.12970779579790132,"294":-0.07278903636856086,"295":-0.09304578755640076,"296":-0.025071824176910205,"297":-0.07792988377783598,"298":-0.1856883114460551,"299":-0.04865186760479266,"300":0.02284655622056024,"301":0.01968895641195619,"302":-0.1314769686218104,"303":-0.03514733892363453,"304":-0.11979946646114879,"305":-0.03167830830329375,"306":-0.02488482575427179,"307":-0.1495765396944647,"308":-0.1648326752223932,"309":0.08358149390904009,"310":-0.09016591622307542,"311":-0.006438482153832971,"312":0.013489256732624072,"313":0.06906236207421816,"314":0.02895349774877476,"315":-0.18134556865445658,"316":-0.024561469048357525,"317":-0.17067244899235662,"318":0.023079205653232397,"319":0.024128426833617884,"320":-0.046741223197662864,"321":0.028746316280333747,"322":-0.03692328042761199,"323":-0.18948012522308444,"324":-0.11972907104848489,"325":-0.13911307325611927,"326":-0.07693698945386537,"327":0.025468136160906284,"328":-0.04294796560724845,"329":-0.11774354962901892,"330":0.02061695777850212,"331":0.0833204849602243,"332":-0.02877733034162556,"333":-0.27485621487037193,"334":-0.024550017058706148,"335":-0.18329777784120016,"336":0.02520169730431379,"337":0.004784287802830874,"338":-0.1406005374849049,"339":-0.02327522805073026,"340":0.03693998636234713,"341":-0.11146111525649882,"342":-0.2820023747999441,"343":-0.15157060686212548,"344":-0.028825538976323443,"345":-0.0754125425439434,"346":0.0001621539248481712,"347":-0.01009810849734974,"348":-0.042815918879527126,"349":0.1073227976869001,"350":0.006969210210429391,"351":-0.20256855411822886,"352":0.01785115242959507,"353":-0.125462703562771,"354":-0.03628945174276057,"355":-0.025827836930062055,"356":-0.08868211396288442,"357":-0.04610330575937607,"358":-0.03571774495929884,"359":-0.09702499406934278,"360":-0.03663985622434098,"361":-0.03277358094533019,"362":-0.008388534488131524,"363":-0.02243564357333965,"364":0.01749323900089079,"365":0.013471200925982661,"366":-0.09123163074135873,"367":-0.06075160127229161,"368":-0.021524736229929654,"369":-0.12694546425900838,"370":-0.08540833220307903,"371":-0.013292560316464558,"372":-0.030909688172824315,"373":-0.07640937841071321,"374":-0.19090748868022198,"375":0.05633568035911805,"376":-0.025844687484969153,"377":-0.02865683529065441,"378":-0.05498984545214488,"379":-0.032694082665962375,"380":-0.05500219568416939,"381":-0.07485473993153459,"382":-0.03262199715735783,"383":0.0244213966186444,"384":-0.01962478043367798,"385":-0.10875078345313018,"386":-0.036308355799998256,"387":-0.10333618515487981,"388":-0.04298866045075839,"389":-0.054495161710006124,"390":0.022149773251869155,"391":0.018012850260116984,"392":-0.11572474320537937,"393":-0.012458163850255305,"394":-0.02556759838869026,"395":0.05321941967469846,"396":-0.10592813647432608,"397":-0.05296023749726309,"398":-0.18027740304455225,"399":0.1018542009495827,"400":-0.1500484516351387,"401":-0.1215016091395183,"402":0.06403410964098386,"403":-0.12475179845129894,"404":-0.05381259872002637,"405":-0.118255895358977,"406":-0.002161482720960275,"407":-0.12418015485758752,"408":0.01199156897586806,"409":-0.03305552194906409,"410":-0.12230077556682752,"411":-0.03372176014318275,"412":-0.08277318588337623,"413":0.05791858287791132,"414":-0.08211977160454399,"415":-0.1493261872908732,"416":-0.10731139334828393,"417":0.09537942435713544,"418":-0.012415964904936837,"419":-0.03468960419962087,"420":0.08897102781563833,"421":-0.17674327717372426,"422":0.12152100948178714,"423":-0.1882805010234497,"424":-0.08884555645141616,"425":-0.04888424531684066,"426":0.07194621461401095,"427":0.03842298870787675,"428":-0.12063322702052875,"429":0.09098503380296098,"430":0.015155459521605838,"431":-0.0811201707802803,"432":-0.07917650483855923,"433":-0.1698238184642713,"434":-0.008328004628647757,"435":-0.029612429395802404,"436":-0.0804585392073266,"437":-0.06655728280694344,"438":-0.01873901751746505,"439":0.14883899821929014,"440":-0.03293678558419328,"441":-0.1229338328446573,"442":-0.03499817613749313,"443":-0.06508783916725286,"444":-0.0268432048499878,"445":0.07450780804134365,"446":-0.04494455189921316,"447":0.015317434874270423,"448":0.07060226782129564,"449":-0.1137138227892246}},{"sx":1,"sy":1,"depth":450,"w":{"0":-0.07789647166092545,"1":-0.0712063325530028,"2":-0.00385852841840532,"3":-0.12462812117924468,"4":0.020779587999207063,"5":-0.139725874521482,"6":-0.06803772652287716,"7":-0.12460149158503075,"8":-0.038283699492188836,"9":-0.03452185233622751,"10":-0.1790389782203493,"11":-0.1042299442988571,"12":-0.03975648333931229,"13":0.02405029096138457,"14":0.048834923983672514,"15":0.015984272228399175,"16":-0.06383349466239298,"17":0.03468301307514816,"18":-0.12755546908555132,"19":-0.11982252356269235,"20":-0.0498930584604041,"21":0.029974770552568572,"22":0.04433228223755195,"23":-0.13323906159849677,"24":-0.056924028931126795,"25":-0.19613708424827261,"26":0.03881834927847381,"27":-0.0008002957545371459,"28":-0.22951275832280393,"29":-0.14827577635539635,"30":-0.0678316181784257,"31":0.06405804291928373,"32":-0.014507856498522348,"33":-0.056479213640302624,"34":-0.05009863592783759,"35":0.008903577924156665,"36":-0.1917752731408,"37":-0.11783409613478475,"38":-0.08034224220122473,"39":0.016900272793185345,"40":-0.03607952978282571,"41":-0.25130611494604377,"42":0.13375363245204722,"43":-0.08582332436761393,"44":-0.12360090270406882,"45":-0.04185994560931473,"46":-0.14579928936361328,"47":-0.20646693819155354,"48":0.06970203791825902,"49":0.0151184093700586,"50":0.024263200568639905,"51":0.010743187549832762,"52":0.026494617043475135,"53":-0.016517192009026894,"54":-0.10178228224433623,"55":-0.004555095177474256,"56":-0.0954925157884134,"57":0.0829837084695101,"58":0.020894363222648992,"59":-0.19606070272883683,"60":-0.024959325991252515,"61":-0.025724540298314523,"62":0.025945936711205212,"63":-0.21884524355486182,"64":-0.06688695113254046,"65":-0.09845091280423696,"66":-0.04181498966039111,"67":0.012235496559037091,"68":-0.03152956796042797,"69":0.02418763516053971,"70":0.03010796005226986,"71":-0.022614049855118726,"72":-0.042115134419926856,"73":-0.13630449161154828,"74":-0.1293228255371512,"75":-0.05984717818041049,"76":-0.009630224512854958,"77":-0.06708914474539095,"78":-0.0496112056726612,"79":-0.014201273683623722,"80":0.01908402286907299,"81":-0.24963874906050368,"82":-0.030589952078577475,"83":-0.0598764765571438,"84":0.0024618232325075325,"85":-0.010663762867106609,"86":-0.018097521414605217,"87":0.08373886016176207,"88":0.008140623199397085,"89":-0.042140111879598985,"90":-0.11570440960487213,"91":0.10020423658543812,"92":-0.12665003060687635,"93":-0.18773193710127553,"94":-0.004231070175766854,"95":-0.099146208338103,"96":-0.12828582156823687,"97":-0.17322065994841826,"98":-0.01066605746617981,"99":-0.03424009137250636,"100":-0.11542075561127832,"101":-0.14285181259319482,"102":0.02859770154698075,"103":-0.084559456741779,"104":-0.06271865016307263,"105":-0.07767980925892905,"106":-0.1455881734054449,"107":0.036483745991175265,"108":-0.12902687603409363,"109":-0.01878621770776661,"110":0.03585566591234794,"111":-0.038814332545492096,"112":-0.06395616610961263,"113":-0.1714434554295028,"114":-0.03720519046386521,"115":-0.30314141451837534,"116":-0.023606661247970246,"117":-0.0005545615207060424,"118":-0.16104709818413399,"119":-0.025415767773033695,"120":0.005705536450331222,"121":0.06069676663772903,"122":-0.0006686307106491033,"123":0.034271690511844394,"124":-0.08376686501730739,"125":-0.00868984772814393,"126":-0.13307426089886742,"127":0.02275341886409134,"128":-0.005534288194814213,"129":-0.05699538273387747,"130":-0.051073230167887194,"131":-0.27505839761649525,"132":0.06948695686777688,"133":-0.22380889232938328,"134":0.0025554830946085162,"135":-0.05780710876706734,"136":-0.14384552892000405,"137":-0.08792518706676482,"138":0.01133170403975099,"139":-0.014710037332796905,"140":0.018277594565370443,"141":0.008442528841487822,"142":-0.08039099865289977,"143":-0.08038353632717816,"144":0.06671078253968302,"145":0.028279182992291377,"146":-0.16804013138440146,"147":-0.021208009978939974,"148":0.014573411544821063,"149":-0.16905082212821804,"150":0.07347216931987836,"151":-0.201498093272055,"152":0.0434439369528518,"153":-0.09650427672114378,"154":-0.023327159555251185,"155":-0.10614107246791343,"156":-0.00959937242240449,"157":0.03426710842190027,"158":0.004883318449241968,"159":0.05362205169848688,"160":-0.03423926285522234,"161":-0.10455077889073505,"162":0.07031813635298442,"163":-0.07918453559509966,"164":-0.18347315839731687,"165":-0.012451483732734338,"166":0.03270805276538831,"167":-0.11946761511309305,"168":-0.0036241436272123253,"169":-0.04699385391680212,"170":0.051731227102616156,"171":-0.24438636801762714,"172":0.03507804922423889,"173":-0.17320407911226812,"174":0.018111458285152246,"175":0.06631928440159977,"176":-0.07584141290734052,"177":-0.017402248267370704,"178":-0.07855059055100544,"179":-0.10372214448493332,"180":-0.04893808388347615,"181":-0.04483858580235402,"182":-0.11372592730030028,"183":-0.06802675558396004,"184":0.0014940470238658224,"185":-0.12394294237298946,"186":-0.0005813844895801748,"187":-0.10941238106214049,"188":-0.04153534302387671,"189":0.08077260045076408,"190":-0.09541470203778149,"191":-0.054644077534960665,"192":-0.004100682086183525,"193":-0.05421838166978788,"194":-0.020513892986954052,"195":0.09837611779310143,"196":-0.02788546836350662,"197":-0.041601154630766475,"198":-0.0071293396982692,"199":-0.047517228693294826,"200":-0.03366570496510728,"201":0.015965535477314986,"202":0.06911345923971775,"203":-0.2909628741186777,"204":-0.08591358685621453,"205":-0.07845328606632607,"206":-0.0015000160820843303,"207":0.13165624408489204,"208":-0.11850906842192203,"209":-0.02242674748637299,"210":-0.022667392666277167,"211":0.0854859102977788,"212":-0.0943530132029371,"213":0.03705729942035154,"214":-0.19326562301039032,"215":-0.027724575527577507,"216":0.0006566836530506561,"217":0.0034412466142327404,"218":-0.08088976914728076,"219":-0.006344257327853084,"220":-0.029962561829497938,"221":-0.19505256540546387,"222":0.11865338121895516,"223":-0.09901736400375967,"224":-0.08726898957290036,"225":-0.003432709412638153,"226":-0.036819328442709215,"227":-0.10825432040537407,"228":0.03943081160782791,"229":-0.08010593119484125,"230":0.03088781778411013,"231":0.0010901444236921588,"232":-0.09412750339706656,"233":-0.16326904339283832,"234":0.07489031239979782,"235":-0.029386007073091632,"236":-0.16473296939012,"237":-0.015394758431481092,"238":-0.058816030581016365,"239":-0.15522702120733378,"240":0.06315237289390697,"241":-0.0018906266901153768,"242":-0.023654451747255875,"243":0.020399921750229547,"244":0.13554787997902046,"245":-0.04973459157912406,"246":-0.01225007079832613,"247":-0.021530366705964164,"248":0.033796585886736494,"249":-0.016578663001544532,"250":-0.14289489316422926,"251":-0.22023294193899626,"252":0.07986605987332622,"253":-0.029648523154809904,"254":-0.12228433522066683,"255":0.09015535336972372,"256":-0.03170161934506764,"257":-0.12362578789045395,"258":0.010162238148508774,"259":-0.16856602854739633,"260":0.06453564637835243,"261":-0.09707073232241328,"262":-0.02104670718426518,"263":-0.12790800684753525,"264":0.04323125782772347,"265":0.008945452903223869,"266":-0.023773248241932263,"267":0.050428490642030054,"268":-0.11800914657936278,"269":-0.2570578486199303,"270":-0.03915446429822894,"271":-0.1350907740925681,"272":-0.15075609523933473,"273":-0.010696041676828815,"274":-0.026477310318272818,"275":-0.12061115708806308,"276":-0.011844122388994658,"277":-0.1263575074216085,"278":-0.009257926564717375,"279":-0.1177436058469045,"280":-0.14846275036381007,"281":-0.07483946531423702,"282":0.017786212880576715,"283":-0.0003629034395075048,"284":-0.04260700980196246,"285":0.004843458389091945,"286":0.026075593454347623,"287":-0.020359031045587256,"288":-0.011434056989751211,"289":-0.08127340845990841,"290":-0.07508833693905918,"291":0.15798102886866022,"292":-0.07026296833877267,"293":-0.20731859320477944,"294":0.02142424703555331,"295":0.02126033913595989,"296":0.007278507363931732,"297":0.0527539495729358,"298":-0.04126246872744092,"299":-0.06946965094290158,"300":0.03719177371805151,"301":0.011021968315155723,"302":0.03419936117739256,"303":-0.08924134011729963,"304":-0.02684171822301913,"305":-0.08837420408858111,"306":-0.017150864648669207,"307":-0.19063652734141948,"308":0.04622600340210958,"309":0.021905267995915047,"310":-0.04720214911995399,"311":-0.12755011656411444,"312":0.021644459802997784,"313":0.026293746504379337,"314":-0.022715098997216958,"315":-0.01987805809615458,"316":-0.020950494678845553,"317":-0.13879864662582356,"318":-0.052038976869359606,"319":0.006563944223604293,"320":0.02845902850079989,"321":-0.017062445655806894,"322":-0.07937243681795694,"323":-0.09447920703414768,"324":-0.05304251398376979,"325":-0.2761813119372585,"326":0.009485398533142064,"327":-0.2596589483965594,"328":-0.001476793645353625,"329":0.10205133411035061,"330":-0.04558438496170934,"331":-0.0848149277193822,"332":0.034829760827018046,"333":-0.012961591690282446,"334":0.016172937841500347,"335":-0.12163164898931256,"336":-0.07648894126249904,"337":0.029577528583999393,"338":-0.10240907408596507,"339":0.06761915567624914,"340":-0.1893409201138004,"341":-0.22602381574911165,"342":0.05323826427557822,"343":-0.4108356475908687,"344":-0.08635324256674566,"345":-0.23997522771073945,"346":-0.09298164678492835,"347":0.09695944786990933,"348":-0.0062998620515674186,"349":-0.1864049694065441,"350":-0.03739338033052429,"351":-0.034511291734582415,"352":0.011029403371310038,"353":-0.1847692312040176,"354":-0.05036462163369176,"355":-0.0144596167175246,"356":-0.08265163791313995,"357":0.06683345238515304,"358":-0.026027533731336153,"359":-0.3045318137910151,"360":-0.0499147766058985,"361":0.04253724628686096,"362":-0.14309426153457785,"363":0.02408525674666746,"364":-0.13279672275434903,"365":-0.0016642005661121155,"366":-0.04211820304752377,"367":-0.14046305716968413,"368":-0.048531720451529016,"369":-0.14444321903555324,"370":-0.13938372518875275,"371":-0.03382822934853252,"372":-0.017013042443971442,"373":-0.027196713242893116,"374":-0.051402102899149794,"375":-0.01115035600064329,"376":0.014620200543375315,"377":0.03289665216011377,"378":0.0843817777492663,"379":0.07925960968639122,"380":-0.12271391324813825,"381":0.05916562401053845,"382":0.033157946073209765,"383":-0.3274593955298767,"384":-0.08221003089938425,"385":-0.006878918573101518,"386":0.026587659736258262,"387":-0.22065116003439142,"388":-0.2344201429270761,"389":-0.02485851533319031,"390":0.03353469594652806,"391":0.03332782483559067,"392":-0.04928756006707662,"393":0.003973832505161443,"394":-0.0709664083968623,"395":0.032973543116652106,"396":-0.10849989665240131,"397":-0.03583742035015511,"398":-0.017472490841939324,"399":-0.03978743445472524,"400":0.034251483526927896,"401":-0.09740236369614122,"402":-0.22381266336459568,"403":0.10028643211326843,"404":-0.05597051341744058,"405":-0.10043131634082046,"406":-0.0364086176173767,"407":-0.06125397807179162,"408":0.04065520045780177,"409":0.06319441987401606,"410":-0.050515944392914305,"411":-0.0327902916427808,"412":-0.19490918308960656,"413":0.038473389162857745,"414":-0.16496536217448612,"415":-0.27964499316043,"416":-0.026185207742413712,"417":-0.46314012773444874,"418":0.00726885389116158,"419":0.011628315178044918,"420":-0.26556933608060407,"421":0.03672422858943219,"422":-0.02808564812908914,"423":-0.05921048479083254,"424":-0.04850375403260488,"425":-0.1243197273756758,"426":0.034654732181282774,"427":-0.001951474045144806,"428":0.02751941492673264,"429":-0.013589322719272203,"430":-0.18020206688940882,"431":-0.0880150743534383,"432":-0.35498264608510494,"433":-0.38819646442238437,"434":0.029347525704701533,"435":-0.3853285567378305,"436":-0.031016867822406622,"437":0.09286952459755511,"438":-0.09987092943410882,"439":-0.3524264677823258,"440":-0.02227498393793693,"441":-0.0018052062868667666,"442":-0.13430779458237732,"443":-0.1758370529261269,"444":0.07679138913910666,"445":0.01676429372695805,"446":-0.12052478627530949,"447":0.09294735707291912,"448":-0.23974744277504456,"449":-0.14670566456302736}},{"sx":1,"sy":1,"depth":450,"w":{"0":-0.10209609831622257,"1":-0.07124319115107221,"2":-0.056485164728183275,"3":-0.024318977148256458,"4":-0.013535297623573382,"5":-0.1395350263905193,"6":-0.028658958196919312,"7":0.08779859056075484,"8":-0.0068867243439729815,"9":-0.09920921647838203,"10":-0.09509186860524729,"11":-0.10883020502492351,"12":-0.019195628941730804,"13":0.008556211817778766,"14":-0.02067350253439188,"15":-0.03166915991516356,"16":-0.08122061252066447,"17":0.01971549763684494,"18":-0.24555207743322835,"19":-0.25101221307164323,"20":0.02266749708135321,"21":-0.02636357258131671,"22":0.06487474413735499,"23":-0.10327142648868788,"24":0.02005819557470252,"25":-0.040587427864017256,"26":0.04665697519560509,"27":-0.11648425730069087,"28":-0.04029775838335889,"29":0.03239491014141992,"30":-0.01946852957540665,"31":-0.056713834305360325,"32":0.03065629084737806,"33":0.07051397609497267,"34":-0.04100032150784349,"35":0.06180748117939979,"36":-0.15577337025786794,"37":0.012393681272604339,"38":-0.10243816349792412,"39":-0.06631219772189322,"40":0.0002863629850734191,"41":-0.06721165597660865,"42":0.022465478547259887,"43":0.019143814147523048,"44":-0.0391292596247711,"45":-0.09266928547822914,"46":-0.06939883706792639,"47":0.01562571315167836,"48":0.009965493756859772,"49":0.07805480634885363,"50":0.06352042203962036,"51":-0.043247091973291796,"52":-0.10801608846611116,"53":-0.06708224941813269,"54":-0.04826098962662863,"55":0.0925379975028597,"56":-0.15393653124561607,"57":-0.13313742853728672,"58":-0.0332102381651185,"59":-0.11677865350758379,"60":-0.08191650202899531,"61":-0.0236960037416313,"62":-0.05182016436728824,"63":-0.2346172359627271,"64":-0.07180646255670857,"65":0.009471705326931278,"66":0.004653346819079953,"67":-0.005718496648702341,"68":0.04103765591246358,"69":-0.09062757992056593,"70":-0.0854384868576164,"71":-0.12535346234967928,"72":0.11831858159231727,"73":0.16463602748967654,"74":-0.06888659657036823,"75":-0.005689145414424329,"76":0.013792121320178978,"77":-0.08587603787505747,"78":-0.015206700649263988,"79":-0.011681217944321124,"80":0.03380887298377114,"81":-0.17514108783759563,"82":-0.029660743552181953,"83":-0.013407456870010728,"84":-0.006131112967988679,"85":-0.02458571045971501,"86":-0.12319173187102253,"87":-0.01866502462449695,"88":-0.018307282490236807,"89":-0.051083415458541545,"90":0.018315401775265857,"91":0.015028811049877971,"92":-0.15722999306881463,"93":-0.07682332525921755,"94":0.003688256760376221,"95":-0.2233417623933816,"96":0.010472754925496984,"97":-0.09538894166770627,"98":0.045553501020031084,"99":-0.14020018181968527,"100":-0.11057607194574508,"101":-0.06491624374581688,"102":-0.026906953335283087,"103":-0.013688911123012189,"104":-0.044805344679370404,"105":0.04028811180997391,"106":-0.14678719099010126,"107":0.006466228341819159,"108":-0.2367995266219857,"109":-0.12168235797766054,"110":0.035012924592608394,"111":0.024315685557942925,"112":-0.015350190218645374,"113":-0.20027123625952592,"114":-0.10345814185039183,"115":-0.07563125984295364,"116":0.04046939896893164,"117":-0.07822945878964423,"118":-0.16031554634176653,"119":0.041585175446698444,"120":-0.04689790976494826,"121":0.02505786977580783,"122":-0.021859919946391398,"123":-0.029558466744647783,"124":-0.11201524119642416,"125":-0.0023127465090533005,"126":-0.28912559317849973,"127":-0.18012146198179718,"128":0.013687732937740102,"129":-0.030209868007845652,"130":0.061607104800836164,"131":-0.28578854223270195,"132":-0.11157571439514745,"133":-0.07154467188372012,"134":0.010377566207609051,"135":-0.09136773413968466,"136":-0.07455402130101615,"137":-0.028151917662185853,"138":-0.011805277771359793,"139":0.046243051061493304,"140":0.012759115190011359,"141":-0.05063978003520996,"142":-0.09764155730364163,"143":-0.11906761158172612,"144":0.10403763282408045,"145":0.06963185653238461,"146":-0.09130951007965668,"147":-0.013010540326120427,"148":-0.03051554488593782,"149":-0.07331116870033483,"150":-0.03461552348880541,"151":-0.0076071352903144636,"152":-0.05718961261329924,"153":-0.08611772660812968,"154":-0.007305093777370633,"155":-0.001073144691083087,"156":0.03629428884299898,"157":-0.07888900663070382,"158":-0.041672012354826544,"159":-0.01504955560851063,"160":-0.13658099913432523,"161":-0.20371816746772187,"162":0.1557712506762861,"163":0.10900678277404632,"164":-0.0723401795716777,"165":-0.03735238667945314,"166":0.04093168906825986,"167":0.04544289960890513,"168":0.0013357350902643062,"169":-0.013151208661414749,"170":0.07526175427261803,"171":-0.12521596024337922,"172":0.013347942795303842,"173":-0.1422698936873784,"174":-0.01667741083468958,"175":0.007810909955604491,"176":-0.006328956793802772,"177":0.07125180518430121,"178":-0.08755501499794219,"179":-0.21548423274738912,"180":-0.07503331039803468,"181":-0.0336730502954672,"182":-0.15541002975403737,"183":-0.10727761156969427,"184":0.0812632846614731,"185":-0.16527620963039846,"186":-0.10824271698962123,"187":-0.13354199311272658,"188":-0.0197282461166758,"189":-0.17837257295804415,"190":-0.05385607507345993,"191":-0.053576727691701305,"192":-0.10267285496904964,"193":-0.021732253201929036,"194":-0.007334936477184476,"195":0.03774344203237948,"196":-0.04919253965639736,"197":-0.037793552032386823,"198":-0.13890445196466375,"199":-0.14711622407980096,"200":0.08359431810039908,"201":-0.2699502186913649,"202":0.014045282120303497,"203":-0.05545369959736969,"204":-0.07775119064666691,"205":-0.04421569696358931,"206":0.010605163429086625,"207":-0.12177798713133303,"208":0.019986543418067458,"209":0.07750101703246513,"210":0.00727291951667853,"211":0.01501003555533647,"212":-0.02308581377132777,"213":-0.011353733822440556,"214":-0.09648776889557345,"215":-0.0042011733715488445,"216":-0.23870584097612646,"217":-0.202361216695006,"218":0.11177069543173251,"219":-0.06691336626254857,"220":0.017943969206850326,"221":-0.13194610568242812,"222":-0.14251300642306994,"223":-0.1032456804206777,"224":0.02617448575747596,"225":-0.07404211632820157,"226":-0.03246855228623263,"227":0.12483344821090513,"228":0.030150624314540877,"229":0.004124562755302823,"230":-0.07388884635167002,"231":-0.04397308452849415,"232":-0.15041218460751518,"233":-0.1908652294611543,"234":-0.009397123420613631,"235":-0.11446692847383629,"236":-0.12138791689645716,"237":-0.021756724528621617,"238":-0.05353940668901481,"239":0.009875882397958703,"240":-0.09555986056479741,"241":-0.040688570167943285,"242":-0.017022807593271516,"243":-0.14084846276492335,"244":0.07914327681999636,"245":-0.058081746228141926,"246":-0.001847474489854888,"247":-0.0522627974512317,"248":-0.07875345101301205,"249":0.03387713656826351,"250":-0.2314189346994579,"251":-0.24632720444545014,"252":0.03430405301818632,"253":-0.10358527511413233,"254":-0.12784217718878874,"255":0.020052218424305192,"256":0.03890107829555605,"257":0.1383985283727595,"258":0.03383722855872905,"259":-0.15636025160914382,"260":-0.0023217736952657344,"261":-0.02219576044821524,"262":0.04784947896043658,"263":-0.03289422268001298,"264":0.045613085797701604,"265":-0.038100170999561,"266":0.007628518317069507,"267":-0.03366163268202657,"268":-0.036661704451396146,"269":-0.18209170308224168,"270":-0.1068548589212794,"271":0.052217946052127096,"272":-0.03100200162345419,"273":-0.3088192843685843,"274":-0.026125907333154133,"275":-0.05184467717553923,"276":-0.11111745673114545,"277":-0.13412084985875028,"278":-0.03815888030159324,"279":-0.14313635751674678,"280":0.1677266752534538,"281":0.04657615879700244,"282":0.08448540108515784,"283":-0.06161712458242028,"284":-0.023039708059765327,"285":-0.006257392658680169,"286":-0.0542911869924401,"287":0.02619161434626382,"288":-0.0740634593096422,"289":-0.06081965055343774,"290":0.10571343756954624,"291":-0.2809949136784822,"292":-0.043941195953535794,"293":-0.016886343854233547,"294":-0.06452745184539446,"295":-0.09367637997598383,"296":0.08205276580418645,"297":-0.08245526997289766,"298":0.10562794413826797,"299":-0.005352853510741281,"300":0.009852516411759665,"301":0.07567762022409572,"302":-0.02527230870806598,"303":0.045426491885698646,"304":0.010715564459933609,"305":-0.032049482046978224,"306":-0.1327565363909025,"307":-0.09654077818278779,"308":0.11373032550038609,"309":-0.13544440962492427,"310":-0.06128205240388767,"311":-0.08849609773249335,"312":-0.19754481195869206,"313":-0.17794704104553757,"314":0.09225012713717445,"315":-0.129710531379552,"316":-0.0005644672083195855,"317":-0.03127987355108062,"318":-0.01022469064835765,"319":0.06847494969627123,"320":0.032949769475348535,"321":-0.0013881395014602538,"322":-0.1070137205688616,"323":-0.037161314389800616,"324":-0.037688688760459686,"325":-0.17630427757864145,"326":0.05147483703884872,"327":-0.17206019419747098,"328":0.012100144680101309,"329":-0.0004058771895341813,"330":-0.06712256691596823,"331":-0.13665146671043973,"332":-0.022172697080934566,"333":-0.14054821130427603,"334":-0.15501151999740603,"335":-0.05728934244418414,"336":0.06104638339971935,"337":-0.020280869346868166,"338":0.07115375816550706,"339":0.06314045612194984,"340":-0.13741440009680272,"341":-0.18543354362700773,"342":-0.0926398681281682,"343":-0.1593153593855113,"344":-0.03904262423971855,"345":-0.08613888664752861,"346":-0.06393265093091367,"347":0.1293723471228443,"348":-0.0065152811972548595,"349":-0.1003133771648463,"350":-0.03227915426193795,"351":-0.13564450096452013,"352":-0.15349543531362825,"353":-0.15841348428672908,"354":-0.0324285844073397,"355":0.007977113971687797,"356":0.05254853255368517,"357":0.004958854806241764,"358":-0.11708723424422442,"359":-0.1299364183583031,"360":-0.13079443538206637,"361":-0.1003346360720912,"362":-0.09780391413683012,"363":-0.26292025319816315,"364":-0.13417366065682737,"365":0.17057535639869514,"366":-0.07388054989483477,"367":-0.015203041391430774,"368":0.024068501367972957,"369":0.05363478816607034,"370":0.15076440403099384,"371":-0.03750008785539104,"372":0.0009547477046195837,"373":0.03585485178287825,"374":-0.12919000161192554,"375":0.008649838647136802,"376":0.008001044825414314,"377":0.03559865622745377,"378":-0.023042981982273964,"379":0.01271035011550029,"380":0.23439176924716595,"381":-0.2143110570682299,"382":-0.18762607944674906,"383":0.22776573476584067,"384":-0.10967385312035842,"385":-0.05097997681071061,"386":0.03412752963617482,"387":-0.038065175356026104,"388":0.16416733229628,"389":-0.04721593478908489,"390":0.019039037201709363,"391":-0.07148617034542265,"392":-0.17122722770271795,"393":0.030118097362461346,"394":-0.02078123145611073,"395":-0.05932462159627372,"396":-0.0977133422119793,"397":-0.07887735053112119,"398":0.4740357409276075,"399":-0.14000195527852516,"400":-0.13588040212107055,"401":0.07233943567725291,"402":-0.08056118904535498,"403":-0.10708935008652153,"404":-0.0477481569212296,"405":-0.01823047750133701,"406":0.042420315872664226,"407":-0.11010424279344219,"408":0.02443472623451945,"409":-0.0017635419886815112,"410":-0.1407472851951989,"411":-0.07283704249514676,"412":-0.09982472897005297,"413":-0.00007426601812966464,"414":-0.06822836038952344,"415":-0.14392421016290372,"416":0.1981636439780685,"417":-0.2663129139764839,"418":-0.15460054837265386,"419":-0.13804260754094003,"420":0.055904702390316294,"421":-0.1332387052212107,"422":0.07695786005292486,"423":-0.004417114805228565,"424":-0.1758543959387093,"425":-0.18788264742309568,"426":-0.027457822095051165,"427":0.047085266611856726,"428":-0.01541031748276,"429":-0.029159037700697693,"430":-0.16307348215819673,"431":-0.19872860405238796,"432":-0.1301078272388113,"433":-0.09874253302273962,"434":0.0002877905431747996,"435":-0.23136662037497882,"436":-0.07001752639197358,"437":-0.26908308040909446,"438":0.01901622800823026,"439":-0.3977854685589233,"440":0.052840773528580375,"441":-0.04337506982298148,"442":-0.16250417419143576,"443":-0.08335676960670435,"444":-0.040507029150633,"445":0.042990648901125805,"446":0.012569569210386444,"447":0.012079975508209502,"448":-0.35975115836262017,"449":-0.06586375864484434}},{"sx":1,"sy":1,"depth":450,"w":{"0":-0.036011395126992855,"1":-0.043081321534545775,"2":-0.07903976892777896,"3":-0.02062043285576225,"4":-0.04066207908188488,"5":-0.09050749841754496,"6":-0.0176388037953492,"7":-0.01681183723781391,"8":-0.013062620671076159,"9":-0.09093705779710598,"10":-0.25511383405300975,"11":-0.05982871009568358,"12":-0.001773281923992891,"13":-0.0012779873169945755,"14":-0.037138000895950866,"15":-0.011369733980861857,"16":0.05194352020090075,"17":-0.07411585446287296,"18":-0.11140271935763457,"19":-0.07742079991393108,"20":-0.03752614500169323,"21":-0.10715258998505306,"22":0.12004775517590846,"23":-0.08579006570860424,"24":-0.03048739766920975,"25":-0.1490898113255846,"26":-0.05186992759834246,"27":-0.18377941782178628,"28":-0.2655686123544686,"29":0.0007373379882213904,"30":-0.013674448958318318,"31":0.05104492884154504,"32":-0.014836852033802408,"33":0.005087230519148857,"34":-0.14112771448077477,"35":-0.03529827254634945,"36":-0.10444889857511432,"37":-0.041545842408956105,"38":-0.05368336446284871,"39":-0.0856661680135817,"40":-0.01713110472415106,"41":-0.16376325346501341,"42":-0.08858915554373059,"43":-0.11459377612549307,"44":0.047884069949638085,"45":-0.11021169460049159,"46":-0.15962433391997954,"47":-0.11050411034910239,"48":-0.05099180804543939,"49":-0.06641728248652191,"50":-0.0516049924646399,"51":-0.038974525673715225,"52":-0.09246210949745244,"53":-0.043763494515481074,"54":-0.11191212641436335,"55":-0.15060878982745113,"56":-0.11874937591976589,"57":-0.057435401355037115,"58":-0.06282393528841032,"59":-0.10940075738280707,"60":0.009691957282427768,"61":-0.0488483029717013,"62":-0.01984569630664964,"63":-0.19604603725132583,"64":-0.19742993957967261,"65":-0.10128354494017136,"66":-0.04215940258543266,"67":0.015150491048749156,"68":-0.09768490027466509,"69":0.028112394549329137,"70":-0.24411936610509252,"71":-0.13770042366703428,"72":-0.11816629931514448,"73":-0.06197455764677946,"74":-0.09479641839582044,"75":-0.11689168187374464,"76":-0.038387196761143105,"77":-0.10413347450892846,"78":-0.02670529529234647,"79":-0.02172937258550492,"80":0.013818903431262946,"81":-0.11392051960260095,"82":-0.09662979890958047,"83":-0.15063687467564613,"84":0.011127688145624249,"85":0.02980880213529789,"86":-0.0778981642451711,"87":0.0022344420003562065,"88":-0.03763703430533031,"89":-0.10820376008063029,"90":-0.032652092010663956,"91":-0.04526342718357222,"92":-0.11358379387912776,"93":-0.06519159075456157,"94":0.017760160452434663,"95":-0.08181716011993023,"96":-0.008037829515029472,"97":-0.1456393868545048,"98":0.03795390703469054,"99":-0.07154680825832102,"100":-0.13200770969303052,"101":-0.11569666166669645,"102":-0.05081362493672652,"103":-0.02133405949544919,"104":-0.08846872324143329,"105":0.016554710717333755,"106":-0.07151300402910495,"107":0.07198618576939393,"108":-0.1981741992380644,"109":-0.1800615087505831,"110":-0.06662478646409957,"111":-0.10030418698921355,"112":-0.042349750343004096,"113":-0.21811306762614205,"114":-0.090529451914546,"115":-0.22736053222322622,"116":0.05044859830775656,"117":-0.03362628474588041,"118":-0.13760575836152325,"119":-0.11994442470543297,"120":-0.011358462315759574,"121":-0.002060545664382939,"122":-0.09551214963135657,"123":-0.04028201848517252,"124":-0.08737476732386668,"125":-0.046210371778093395,"126":-0.29498115273258896,"127":-0.08002124012818519,"128":-0.044241264679934465,"129":-0.1128299197176183,"130":-0.02688356483377933,"131":-0.26608588045511594,"132":0.013674363205177422,"133":-0.21370975167566428,"134":-0.046108227463329564,"135":-0.032026068086557946,"136":-0.033376418288952686,"137":0.0029321920488511477,"138":0.03949550026645569,"139":0.04981668900057048,"140":-0.05401551905120318,"141":0.07640267153457594,"142":-0.1556227681062425,"143":-0.02660140321699033,"144":-0.08772042054060304,"145":-0.14029020843481546,"146":-0.038849452058919,"147":-0.07776530670912803,"148":-0.0579883735868284,"149":-0.21939481629060079,"150":-0.0037430474589829313,"151":-0.1871867237075166,"152":-0.034499777724322535,"153":-0.05500686471366523,"154":-0.013882914606677428,"155":-0.040099099238681164,"156":-0.0038630339562573186,"157":-0.05621465823239354,"158":-0.06422825498928308,"159":-0.052840033378639364,"160":0.04187157376400689,"161":-0.09322670945008095,"162":-0.03195960444553303,"163":-0.1558076117967765,"164":0.0000031673352801170636,"165":-0.14548831556247455,"166":0.051034126720008434,"167":-0.10920489253718348,"168":-0.06029317514050307,"169":-0.11184507383606729,"170":0.13017332214174332,"171":-0.151302510080023,"172":0.0491857536134625,"173":-0.10441107825883246,"174":-0.028552052979246963,"175":-0.07352898679423002,"176":-0.054665962841964476,"177":-0.013986443384692593,"178":-0.023531797965382323,"179":-0.09564192789349689,"180":-0.23025782404163783,"181":0.018865682045494894,"182":-0.05076982036819456,"183":-0.04851953462915893,"184":0.02491856711793308,"185":-0.20412192176508115,"186":-0.004733175776513938,"187":-0.11672641216177405,"188":-0.10869441555700504,"189":-0.01452758027653384,"190":-0.18299935250298344,"191":-0.09080500515636197,"192":-0.05047402550678384,"193":0.03320677652158952,"194":-0.10336657099694177,"195":0.01888548619642875,"196":-0.07824884341657644,"197":-0.010522320048873924,"198":-0.12376747407308845,"199":-0.07999179316845367,"200":0.02613834024158354,"201":-0.00006859659172225884,"202":-0.051681428431436464,"203":-0.17551157299879847,"204":-0.0032225236293170253,"205":0.1172028748237145,"206":-0.007019042414913747,"207":-0.04475078797039932,"208":-0.14611251462924027,"209":-0.17141215146965152,"210":0.048841691040316944,"211":0.08351877754846175,"212":-0.13181280111808155,"213":-0.029273093301447107,"214":-0.13873671699014417,"215":0.01606452870704217,"216":-0.09679908450800491,"217":-0.12217786918724224,"218":-0.08022493554382674,"219":-0.04618045408991622,"220":0.054226266038195484,"221":-0.02594126977144826,"222":-0.0830629563311701,"223":-0.007064018191274614,"224":0.03455409662757016,"225":0.04164462685675591,"226":0.013365122881186731,"227":-0.09868470165528688,"228":-0.03901481042835105,"229":0.022373615792058033,"230":-0.063868908998603,"231":-0.003140931157062879,"232":-0.1352264057343492,"233":-0.07071833529354346,"234":-0.0661550951170152,"235":-0.13993071384278244,"236":-0.08536535720987926,"237":-0.14947372903917075,"238":-0.05247279922265715,"239":-0.07368333308517686,"240":-0.1138274873947241,"241":-0.10146335762133546,"242":-0.0341120367054524,"243":-0.07061933841226432,"244":-0.0019501653914220196,"245":-0.09301163565077264,"246":-0.07657092889538368,"247":0.04802301583342307,"248":-0.1432719187461338,"249":0.021000674331684236,"250":-0.002949452617712037,"251":-0.0651860634899503,"252":-0.1041985553841056,"253":-0.13395101314752386,"254":-0.05529170523505797,"255":-0.15681610208036106,"256":-0.07306181855199032,"257":-0.010687715337606502,"258":-0.0557716307183352,"259":-0.24913202182678676,"260":0.013788381112266615,"261":-0.249454864637958,"262":-0.12632578485078608,"263":-0.11601741116967168,"264":-0.06878509259488913,"265":-0.017092143952943003,"266":-0.056846519185705276,"267":0.046884677728613336,"268":-0.06448906762963906,"269":-0.0037060405786194257,"270":-0.07998005323136712,"271":0.022069720602325857,"272":-0.07158736716307854,"273":0.042142547497055115,"274":0.003215703445677821,"275":-0.08814222488468051,"276":-0.02967355961242772,"277":-0.08420298317573995,"278":-0.0979787988750216,"279":0.05639464445060486,"280":-0.12339684372513793,"281":-0.042871751957996584,"282":-0.02929878360751834,"283":0.04276711792772898,"284":-0.1779856344263254,"285":-0.01392491144883146,"286":-0.08780235859349644,"287":0.00969074543227627,"288":-0.11793352848475776,"289":-0.046548931865490195,"290":-0.04112878280081744,"291":-0.021029848829735125,"292":-0.014310167507226952,"293":-0.11999138277723706,"294":-0.017913614783956436,"295":-0.04568257522242597,"296":0.002334109112917626,"297":-0.048116883923193014,"298":-0.04484018470332666,"299":-0.035126591391512016,"300":-0.083893309062742,"301":-0.011807635910880744,"302":-0.1419061726472076,"303":0.0714731289660943,"304":-0.22841453958245161,"305":-0.05745812968760112,"306":-0.11786267540231618,"307":-0.039928152399340285,"308":-0.4092870662716417,"309":-0.1138170461266558,"310":-0.00830120106441568,"311":-0.12759739930219147,"312":-0.033088146842559195,"313":-0.060438316918647435,"314":0.025030336608370077,"315":-0.04138349781805818,"316":0.04189702495387978,"317":-0.091344405468743,"318":0.051982971469732527,"319":0.04811410776926951,"320":-0.10710685267045128,"321":0.02480156159352317,"322":-0.10806012110420338,"323":-0.03427153585859283,"324":-0.10025008372536243,"325":-0.10614743632540481,"326":-0.05273111344723835,"327":-0.3344063241017463,"328":-0.06003183928666394,"329":0.0232033407020585,"330":-0.08151621744105755,"331":-0.025805456650377208,"332":0.03595696087717383,"333":-0.0498661261389569,"334":-0.08137375681836172,"335":-0.08097594825796733,"336":0.0020930164017772556,"337":-0.020490219230742866,"338":-0.14642009626399144,"339":-0.06435997258870348,"340":-0.03208091881863788,"341":-0.12747614960222803,"342":-0.11182427862419704,"343":-0.07643058751851885,"344":0.059771089306752866,"345":-0.37193108409815345,"346":-0.021204662727545103,"347":-0.08395795209453782,"348":-0.1325473978244185,"349":-0.08526731103299379,"350":0.0036788171004593197,"351":-0.23980464167605411,"352":-0.07690527732102354,"353":-0.19901826176582682,"354":-0.05556265212742828,"355":0.010266266258139005,"356":-0.14678368995404847,"357":-0.03350907175156551,"358":-0.11416977279368176,"359":-0.07464470009249201,"360":-0.028231894837340146,"361":-0.042131835205785055,"362":-0.04490364827692123,"363":0.016575984431444823,"364":-0.0450389229968498,"365":-0.10574957069819003,"366":-0.09290751240391351,"367":-0.15950172114903263,"368":-0.06545696641485393,"369":-0.1722584302677275,"370":-0.21741570775227095,"371":-0.10945682132605362,"372":0.0004144214522199296,"373":0.045063720754226363,"374":-0.08593526702764302,"375":-0.012781855144403007,"376":-0.1271872457470451,"377":-0.06952676000416022,"378":-0.0453987447267456,"379":0.018414298623200147,"380":-0.20642906312110917,"381":0.11046275631125223,"382":-0.15755931747514484,"383":-0.04269210698418141,"384":0.08446511721505975,"385":-0.06187760766887692,"386":0.015080368764601221,"387":-0.13496800146332025,"388":-0.08112446100029615,"389":-0.07158560822464041,"390":-0.03610589117063742,"391":-0.020182566839269105,"392":-0.13516431876880017,"393":-0.024312765102116485,"394":-0.35979087749237865,"395":0.03352614662423802,"396":-0.06156371483213705,"397":-0.0370367951393104,"398":-0.33842927263851197,"399":-0.073657207409936,"400":-0.2383673380292134,"401":-0.015719720304516054,"402":0.04063202005757715,"403":0.01869173525957682,"404":0.06240556312030613,"405":-0.13613434381844472,"406":0.060055148131517674,"407":-0.03964108117943593,"408":-0.07056038300389458,"409":0.036475312686525554,"410":-0.15690660575081086,"411":-0.11183572032157789,"412":-0.07502546935937125,"413":-0.08958152795800695,"414":-0.017884340313712388,"415":0.011788868641251728,"416":-0.06070760284598756,"417":0.0808343868662894,"418":-0.1581662035206505,"419":-0.028389213773662388,"420":0.12515721970934798,"421":-0.011385427683796486,"422":-0.04167479441564744,"423":-0.26350232604076296,"424":-0.004642154107293354,"425":-0.11989583337767114,"426":-0.014332050352902897,"427":-0.008206750483654395,"428":-0.4348940581846293,"429":0.01178659966626503,"430":-0.014594768785398175,"431":0.019001396144900533,"432":0.01702935222544891,"433":0.12025137162918934,"434":-0.011079170048399742,"435":0.027033874290187193,"436":-0.13973031372797462,"437":-0.04334530288263787,"438":-0.08466341957664841,"439":0.01480796572041128,"440":0.08000574804140863,"441":-0.09112436314074351,"442":-0.08881469563837571,"443":-0.02559154280492821,"444":-0.035762571367858424,"445":-0.00027394215980606416,"446":-0.3174665801002992,"447":0.0462045372666946,"448":-0.07293372591097254,"449":0.015420682052447258}},{"sx":1,"sy":1,"depth":450,"w":{"0":-0.040150419616073976,"1":-0.12490059254279882,"2":-0.1521602607767148,"3":-0.10421193743864891,"4":-0.07470787453845455,"5":-0.24352535723684104,"6":0.02174970128211034,"7":-0.07153110529318392,"8":-0.07366621426889924,"9":-0.017032705438945105,"10":-0.15991033353793238,"11":-0.08079157251959858,"12":-0.016909222689074934,"13":0.05462212264741278,"14":-0.27009612113263454,"15":-0.0009034983792963018,"16":-0.09030205301265509,"17":0.03620270169358448,"18":-0.28571399247462437,"19":-0.13133155290996068,"20":-0.015261079073606144,"21":-0.04320944805000672,"22":-0.0439441737305118,"23":-0.26797392322688596,"24":-0.016343798257940058,"25":-0.21697228434558846,"26":-0.02172988189746409,"27":-0.04814794608909725,"28":-0.11015956439961902,"29":-0.046078727675496554,"30":0.03430421714389333,"31":0.0049219590828870384,"32":-0.18229263534602133,"33":-0.06321986532403275,"34":-0.025959326333155237,"35":-0.08283233212389696,"36":-0.051707350537388196,"37":-0.08031602679296855,"38":-0.020869193681536932,"39":0.031618271484803145,"40":0.023022431089209493,"41":-0.08850404795664966,"42":-0.08031114576303607,"43":-0.03754542803206498,"44":0.047431913663357625,"45":-0.03452889164939438,"46":-0.1200364401163775,"47":-0.012351867330890083,"48":-0.10342560459249965,"49":0.004356304712347419,"50":-0.06293873468973998,"51":0.06159328642799244,"52":-0.12068826516812348,"53":-0.10545131757783723,"54":0.03854835266898742,"55":-0.10366261014086313,"56":-0.1187813168389908,"57":-0.01111995221955707,"58":-0.005917473572852261,"59":-0.11778323996569118,"60":-0.035729559256955784,"61":-0.007783308997560789,"62":-0.07424369846364466,"63":-0.04482037550121826,"64":-0.03460204328028037,"65":-0.09995915594217858,"66":0.0721369119863662,"67":-0.006682589257726546,"68":-0.14156858138076983,"69":-0.024192706761173036,"70":-0.12529833182640995,"71":-0.02329579347206612,"72":-0.06644048806931567,"73":-0.0789710399889022,"74":-0.17790246261832382,"75":-0.038832766362059574,"76":-0.11565712913090534,"77":-0.17461626502138136,"78":-0.019379879744275078,"79":-0.07391309179871983,"80":-0.007692973882202827,"81":-0.20626372313952382,"82":-0.08016082487352223,"83":-0.108696120087279,"84":-0.02639573324927302,"85":0.019172698443695832,"86":-0.18234141331063283,"87":-0.04572074749811287,"88":-0.14697682859170594,"89":-0.046975174396503686,"90":-0.1345142581303276,"91":-0.06110767372456496,"92":-0.07975299859193521,"93":-0.11340199428938894,"94":0.016597014645747254,"95":-0.06681677171279934,"96":-0.09398149159456257,"97":-0.09466782239711947,"98":-0.059086148950424,"99":0.09729692744100109,"100":-0.12278212027181637,"101":-0.10625486279362882,"102":-0.03124418560410219,"103":0.031379762552061014,"104":-0.14973764911226858,"105":-0.030325188216203797,"106":-0.14393851015299705,"107":-0.03975981930083468,"108":-0.14379021200021405,"109":-0.04886510379457822,"110":-0.12307194913657452,"111":-0.047740440627436535,"112":-0.018572824585499637,"113":-0.0836452223449812,"114":-0.070554713244455,"115":-0.16257409966949268,"116":-0.0020229841169793782,"117":-0.0011363128097174123,"118":-0.08397138232652283,"119":-0.08101401680928191,"120":-0.13843276085745515,"121":-0.048718896373420306,"122":-0.1399393770760642,"123":0.025928682310926727,"124":-0.0959705698127405,"125":-0.07739572656269744,"126":-0.15454485512538568,"127":-0.0803864679837678,"128":-0.0658691446724535,"129":0.09509035132004512,"130":0.02233866224554262,"131":-0.039847805164754016,"132":-0.02667939508668511,"133":-0.1770283411607253,"134":0.10396733381988255,"135":-0.06424254853308352,"136":-0.020778451348955913,"137":-0.12409937397688603,"138":0.054365836790732945,"139":0.05648666990561904,"140":-0.15943069296909987,"141":-0.0000199179145513295,"142":-0.12358125374915749,"143":-0.12199441865075844,"144":-0.09064284541135116,"145":-0.1212284821308253,"146":-0.17982559860413175,"147":-0.049688975741958546,"148":-0.02212244772665444,"149":-0.076977155439054,"150":-0.04908276274524474,"151":-0.08940811410382798,"152":-0.028775120805552636,"153":-0.10100724601194888,"154":0.023788439735263112,"155":-0.16825536840622296,"156":-0.021557409646245234,"157":0.0279402798765771,"158":-0.2869617421841714,"159":0.03342327538333996,"160":0.001370380919288123,"161":-0.1061058390281981,"162":0.0160001205711275,"163":-0.11609964581740706,"164":-0.045932654084542,"165":-0.06200038216398038,"166":0.0009699114362027298,"167":-0.04732776028917143,"168":-0.05114882343055218,"169":-0.03679999444878773,"170":-0.030243624195399155,"171":-0.2437105132149789,"172":-0.025694954655645398,"173":-0.15537239384268187,"174":-0.03572202062134241,"175":-0.028425896241088714,"176":-0.15230281808314017,"177":-0.048862427674521716,"178":-0.01820197779046109,"179":-0.1310830146954051,"180":-0.008418514138909596,"181":-0.07558390227062628,"182":-0.06025078854242587,"183":-0.10568201404694777,"184":-0.1000274145241572,"185":-0.07595400448033901,"186":0.023631262920164847,"187":-0.0010796257122327212,"188":0.005080636292492709,"189":0.011087538658443365,"190":-0.07785842930723164,"191":0.04196091170302846,"192":0.013028295984959668,"193":-0.020411077604639196,"194":-0.13983102786266638,"195":0.0029399329264632582,"196":-0.06927972895862534,"197":0.03348155856459213,"198":0.04284941299319559,"199":-0.08825243723451874,"200":-0.04068222747638216,"201":-0.08353669665231521,"202":-0.04505975059353835,"203":-0.021215347780219815,"204":0.05852836593346288,"205":-0.1479840797678288,"206":0.04758165348976694,"207":-0.07098913291160314,"208":-0.08426406264892725,"209":-0.1773723641760735,"210":0.04202668982427963,"211":0.0476530519622047,"212":-0.07546084528846972,"213":-0.006383852143688527,"214":-0.09909937715839177,"215":-0.002165585272809521,"216":-0.027608778689072924,"217":-0.06795838381496713,"218":-0.1071811420598687,"219":0.06632379970379233,"220":-0.021197593738956723,"221":-0.09430104532605497,"222":-0.039103576185975285,"223":-0.1706524759102337,"224":-0.05245236462308616,"225":-0.01691738797861482,"226":-0.03214439925888876,"227":-0.11016738571337531,"228":-0.02638905400129118,"229":0.04600268127517431,"230":-0.035059404815552225,"231":0.015223766622253228,"232":-0.14018249509626016,"233":-0.09872368735373092,"234":-0.03269152352285289,"235":-0.14320701424815283,"236":-0.07774916575701764,"237":-0.0035961073650557203,"238":-0.0377291900555544,"239":-0.10290693378682694,"240":-0.03546035732599685,"241":-0.13677470774906839,"242":-0.06472627633209976,"243":-0.06102698735142786,"244":-0.013393121332534744,"245":-0.22585789734827455,"246":-0.04066960145539036,"247":0.05591533186192313,"248":-0.09261154505028789,"249":-0.01601642411751667,"250":-0.010805341197810856,"251":-0.17550052236970956,"252":-0.007090419327206193,"253":-0.09989284871286512,"254":-0.06765853626086425,"255":-0.01812030283497512,"256":-0.0015003832092172265,"257":-0.07654137101049126,"258":0.038354982604964304,"259":-0.14330697874400128,"260":-0.041325427323325,"261":-0.08990370292572127,"262":-0.07362686916703991,"263":-0.10377247608821018,"264":-0.0023251333493236356,"265":-0.07089882974414397,"266":-0.20933366225736663,"267":-0.01325280807652963,"268":-0.030520602745258165,"269":-0.16857810610275512,"270":-0.08546748630407965,"271":-0.026782336054479956,"272":-0.1400635347330167,"273":-0.02260617110587461,"274":-0.0833188307355885,"275":-0.022614352790901585,"276":0.028195903903447596,"277":-0.038059911881355726,"278":-0.0056701443225102574,"279":-0.07850589862505701,"280":-0.11330350703499528,"281":-0.031890167025974366,"282":0.01633580290584264,"283":-0.08600080674864385,"284":-0.14592238452011044,"285":-0.049471471813172345,"286":0.0020236574400891707,"287":-0.03574491315602588,"288":0.0383021379655484,"289":0.052180787570380895,"290":-0.039147873760882336,"291":0.011450329028802829,"292":-0.059445237581578214,"293":0.010121909781804427,"294":-0.016585643179334374,"295":0.005613732364354929,"296":-0.1007115141913738,"297":-0.08958300025440744,"298":-0.15237234117049567,"299":-0.0689592547831889,"300":0.04242970464813101,"301":-0.023367050100656324,"302":-0.18690936934229968,"303":0.02216018732707557,"304":-0.1657716550411154,"305":-0.03229152540514752,"306":-0.03699528381364903,"307":-0.03240035463952844,"308":-0.15992865132219217,"309":-0.03168673559515682,"310":-0.026979520219198423,"311":-0.15160949555939168,"312":-0.10474383902251574,"313":-0.0540259278307495,"314":-0.024965334586236752,"315":-0.07257837446990911,"316":-0.12239844307737634,"317":-0.08380624154537285,"318":-0.017993531396859254,"319":0.029193775654764928,"320":-0.011622822153033216,"321":-0.009513754291961295,"322":-0.09384886248355696,"323":-0.1654969014350439,"324":-0.10499965949340063,"325":-0.015981258167459194,"326":-0.07977707101604413,"327":-0.12571035702931974,"328":-0.11836117925965868,"329":-0.15592141933398332,"330":-0.0038695625259169307,"331":-0.05594272492664857,"332":-0.04127620065277153,"333":-0.019540154610153012,"334":-0.053720309494704264,"335":-0.06830537561673641,"336":-0.05918685171643179,"337":0.006843487289734855,"338":-0.2563699279532893,"339":-0.03856179824552346,"340":-0.004878783162529135,"341":-0.220393612704838,"342":-0.04141687888987496,"343":0.01896958191944374,"344":-0.03219988570015338,"345":0.0004943681896309881,"346":-0.06394574366436413,"347":-0.024475406411483342,"348":-0.10719529838286268,"349":-0.02055267141479311,"350":-0.03774423863879138,"351":-0.11359705724294546,"352":-0.021626020122493487,"353":0.042588677637760815,"354":0.01570095589292066,"355":0.0742733664084747,"356":-0.13551989541258477,"357":0.060277383293614435,"358":0.019486826830839882,"359":-0.06550305941565224,"360":-0.09248863529444833,"361":-0.03726416300882912,"362":-0.002836244254765392,"363":0.04093182311539044,"364":-0.1085597477067216,"365":0.09413521629467432,"366":-0.005408856682491545,"367":-0.13979484845010665,"368":0.0023409163899377134,"369":-0.1974480010385843,"370":-0.1024671606777471,"371":-0.01704988842981188,"372":-0.04319497414944088,"373":-0.05051556095002787,"374":-0.24436779284056892,"375":-0.007521041404130444,"376":-0.12611222295010244,"377":-0.07214082813804233,"378":-0.030039198563702588,"379":-0.07306140153309165,"380":-0.21351909766022675,"381":0.02174812532260842,"382":-0.13428673080928533,"383":-0.0789037310361743,"384":-0.019275638815872867,"385":-0.05105643347651028,"386":-0.0471352863374129,"387":-0.1403893895668955,"388":-0.11976267562448892,"389":-0.06652229272042247,"390":-0.03385643719050425,"391":0.07290667341682273,"392":-0.16262061658087462,"393":0.02218945473195725,"394":-0.04037188882069706,"395":-0.049885829870284774,"396":-0.015283327450410304,"397":-0.05957320943757492,"398":-0.26536075928632863,"399":-0.11427307164479998,"400":-0.1853430949405524,"401":-0.13776716956247614,"402":-0.038986346899641894,"403":0.01741085249315664,"404":-0.012143235629164107,"405":0.03128691151366875,"406":-0.18140435284911843,"407":-0.05977273213930158,"408":-0.054408488630662756,"409":0.012467353795039242,"410":-0.24737182693412949,"411":-0.09988490350802895,"412":-0.006400480754102201,"413":0.014564669069670409,"414":-0.06470266361475538,"415":0.09942919802663634,"416":-0.12372789620846786,"417":0.012787336952796937,"418":-0.12602738508089742,"419":-0.19647629578907783,"420":-0.09472034253869266,"421":0.019035815003742042,"422":0.010706940902867779,"423":0.018203809867304143,"424":-0.14857337463642684,"425":-0.005873683717064896,"426":-0.09078747116576055,"427":-0.04427212810266619,"428":-0.3564690531818151,"429":0.07308936153853775,"430":-0.045695066563316795,"431":-0.16353163312696545,"432":-0.03846892065490063,"433":0.14760892731249775,"434":-0.11057135033536744,"435":-0.05154512355304999,"436":-0.024637121411455767,"437":-0.13360702260939722,"438":-0.05320341410824325,"439":0.07635099834908596,"440":-0.02615310401873534,"441":-0.06879665654538335,"442":-0.11731416680677764,"443":0.07950161324579383,"444":-0.05205177978799442,"445":0.016406736418747514,"446":-0.30877979664998595,"447":0.0011233548269079913,"448":-0.004247296718331129,"449":0.016731632675441185}},{"sx":1,"sy":1,"depth":450,"w":{"0":0.024211826219650272,"1":0.018496793579702058,"2":-0.008214781843680035,"3":-0.062563103490746,"4":-0.01775441485004498,"5":-0.04711665694980997,"6":-0.01105159386748461,"7":-0.06957744570500482,"8":0.04514851225118979,"9":-0.12634802008186025,"10":-0.2731854114280804,"11":-0.20652023665420122,"12":-0.09582121420629874,"13":0.012069418801585184,"14":0.031200779343498318,"15":0.045196736489122535,"16":0.009256441810474364,"17":-0.00011102507388462993,"18":-0.24665710403255292,"19":-0.11687160756907972,"20":-0.00891752937904346,"21":-0.14833677383455446,"22":-0.04757369071603388,"23":-0.1921301854924044,"24":0.014809910963811207,"25":-0.19440654754932943,"26":0.053502350060396234,"27":-0.24324570038731078,"28":-0.2756566756037927,"29":0.031037687029103717,"30":-0.024354139100306295,"31":0.045259145287673934,"32":-0.028239209842978678,"33":0.04995425915853626,"34":-0.18642354100604408,"35":0.018192091204138665,"36":-0.2023007986102223,"37":-0.12016804885010071,"38":-0.06118854366164778,"39":-0.03351908769663025,"40":0.04636114306352708,"41":-0.28431242302601384,"42":0.021152099616057036,"43":-0.3054357027362389,"44":0.049373037380601004,"45":-0.14984129533553342,"46":-0.19934852620226315,"47":-0.003382988228555402,"48":-0.007366183214629124,"49":0.07147647613522046,"50":0.06415441352033928,"51":-0.05378922135362501,"52":-0.15896203840177503,"53":-0.10602294290126531,"54":-0.20389726965270855,"55":-0.08046950461428586,"56":-0.24828415587920027,"57":-0.09072274353910735,"58":-0.06573940704877838,"59":-0.18864796845010162,"60":-0.014378738386944331,"61":-0.12319424337450295,"62":0.054453432804830774,"63":-0.11635226206350471,"64":-0.2505497763812621,"65":0.1155557420250264,"66":-0.005880529773075912,"67":0.05066291807250144,"68":-0.004837400685704704,"69":-0.085595648313986,"70":-0.14254838030652808,"71":-0.21755613041999017,"72":-0.16699523597032181,"73":-0.10004716725459645,"74":-0.2645523701089907,"75":-0.05776685651716288,"76":-0.02446664584307565,"77":-0.09992340206291432,"78":0.0023569683775569853,"79":-0.0590221757656398,"80":-0.01160231258367826,"81":-0.03504491877982504,"82":-0.05407494651213421,"83":-0.11436258927164103,"84":-0.016091381836912215,"85":0.028966766819447768,"86":-0.037549071310628075,"87":-0.08145113613269883,"88":-0.061382412847739376,"89":-0.12129612340208636,"90":-0.07691758693533392,"91":0.04029335450455479,"92":-0.0007674068932922078,"93":-0.14843019358581236,"94":0.01375977686018447,"95":-0.17439783476397286,"96":-0.1177676697398829,"97":-0.15230987315199374,"98":0.06707979900697779,"99":-0.22086529687627995,"100":0.013657691940774232,"101":-0.1295402527415797,"102":-0.059938280873085795,"103":0.024650447997862028,"104":-0.03169606342831437,"105":-0.019648326869566822,"106":0.03810585967548155,"107":0.03845569642532384,"108":-0.20567750859974385,"109":-0.1691522536911063,"110":-0.10529053834363568,"111":-0.18713470270760096,"112":0.014337682553146816,"113":-0.3277495985762922,"114":-0.0957468075986514,"115":-0.33240372486132325,"116":0.01662573863420329,"117":-0.08290294060898531,"118":-0.039137687619709635,"119":0.06616528645216763,"120":0.07967622100492752,"121":0.047998094566095544,"122":-0.026549757231732633,"123":0.03294292027180711,"124":0.050997482172450356,"125":0.04584216648648676,"126":-0.3250831258280384,"127":-0.15484874707466964,"128":-0.08504850627440491,"129":-0.1329046257772411,"130":0.05360892234896051,"131":-0.2272559772108664,"132":-0.0314882204976423,"133":-0.23133479263054374,"134":-0.027974627181949215,"135":-0.03777260861947084,"136":-0.13250228237907197,"137":0.19275256659039752,"138":-0.023557142438250224,"139":-0.03422834526061689,"140":0.10023700171912255,"141":0.043091961249846995,"142":0.040340944151057545,"143":-0.02074252993685534,"144":-0.23621131915590027,"145":-0.050713251409681526,"146":-0.14213490717591007,"147":-0.07611120056070948,"148":-0.03251654512555063,"149":-0.20242772915007387,"150":-0.014817403671400121,"151":-0.22437680927565815,"152":-0.045783207791046644,"153":-0.041314713372912155,"154":-0.18738955374968197,"155":0.17459233406050303,"156":0.09771546731505852,"157":0.06334373364922254,"158":0.12555944029433347,"159":-0.06393172244268798,"160":-0.004797560687823739,"161":-0.048625819258825455,"162":-0.32459359682162453,"163":-0.05444439333190091,"164":-0.19461600946038726,"165":-0.030158172192504634,"166":-0.08750480334656274,"167":-0.22087447616145253,"168":-0.0593016733489065,"169":-0.024708848303110605,"170":0.06933013830505719,"171":0.07606579321207574,"172":-0.1685881761907695,"173":0.004310781423627236,"174":0.06591162059465275,"175":-0.012778080217010815,"176":-0.027104761533860305,"177":-0.01771123822787071,"178":-0.15430040839796552,"179":-0.0751660457099091,"180":0.06273503258161069,"181":0.05967296750517864,"182":-0.0698704014137584,"183":-0.03914736006665059,"184":-0.03419561964298502,"185":-0.11509573469736534,"186":-0.13296507470553162,"187":-0.08800591249753278,"188":0.024904326287627357,"189":-0.1267186892629964,"190":-0.0805493023201798,"191":-0.018932136696078707,"192":0.05265924770813794,"193":-0.04388677983301509,"194":0.06626959178056438,"195":-0.020998974452312153,"196":0.08239660844539219,"197":0.015144361610005218,"198":-0.16560655211928227,"199":-0.08011603945275908,"200":0.08285929027861372,"201":0.08423365288912359,"202":0.0190547345678702,"203":-0.18207117014042343,"204":-0.11065802591996267,"205":-0.13687307679786603,"206":0.04155077761891328,"207":-0.0567140792835427,"208":0.036071280848676675,"209":0.10197121175651447,"210":-0.007197467908819707,"211":-0.03140470098038066,"212":0.08039002095505672,"213":-0.05743739430904152,"214":-0.005098422650549882,"215":0.12036029086273352,"216":-0.22243263312441924,"217":-0.23589175783909058,"218":0.11529188223582525,"219":0.14426637069119602,"220":0.020749093001789544,"221":-0.1802744012513478,"222":-0.04618546965994756,"223":-0.2268424534831892,"224":-0.025155128349159298,"225":-0.061964183875014005,"226":-0.0284499089254248,"227":0.06395589156944606,"228":0.07076279287184162,"229":0.08573247082666889,"230":0.025799167072862558,"231":-0.003829725451564405,"232":-0.003445778772736548,"233":-0.021632015633726027,"234":-0.13188197683188763,"235":-0.1295240529880537,"236":-0.024318013543447082,"237":0.08379049790781708,"238":0.024790311194333857,"239":-0.1171529195128042,"240":-0.009843669974654183,"241":-0.09069400691984358,"242":-0.032658877252025875,"243":-0.03319439420194538,"244":-0.18000545087305087,"245":0.022009882442861933,"246":-0.03596207273023994,"247":-0.021512958134162336,"248":0.08934698643133675,"249":0.028344070683065603,"250":0.02450466764707258,"251":-0.07901973240990384,"252":-0.16762170788100925,"253":-0.21448840297533953,"254":-0.1336967891635136,"255":-0.05036036025396898,"256":0.00878106618165165,"257":-0.23960835764837235,"258":0.005831944106955327,"259":-0.16252063952990844,"260":-0.06592755390074877,"261":0.10523617110076394,"262":-0.22755197068687177,"263":0.023603471329591178,"264":0.03559298483265737,"265":0.05651913393752823,"266":0.007628717251236717,"267":0.00460443881912808,"268":0.12762669060754772,"269":-0.09866151442392831,"270":0.09919251800015622,"271":0.048150012968583095,"272":-0.040683659095135855,"273":-0.07403773845864553,"274":0.08415330179954002,"275":-0.018469616479854515,"276":-0.05676297426165803,"277":-0.1399839074331146,"278":-0.025492099847219365,"279":-0.13742835096257836,"280":-0.10519613186248097,"281":-0.06388927453518195,"282":0.06829929287444685,"283":-0.007098231674441776,"284":0.10986823282151874,"285":0.019077703595108773,"286":0.13645465000525012,"287":-0.05573846916444434,"288":-0.008644438879164792,"289":-0.010207565186502126,"290":0.002468867377598263,"291":0.03143139472124322,"292":-0.05426195449585689,"293":0.0500599129069794,"294":-0.12165641651614505,"295":-0.2146446556476976,"296":0.03547821320775091,"297":0.013404242172320755,"298":0.08668965120325935,"299":-0.14463237209759214,"300":0.02944800467483952,"301":-0.0414768562519755,"302":-0.0473490554960852,"303":0.04931148480843362,"304":0.06580856383988014,"305":-0.057874596774379054,"306":-0.12042253516693747,"307":-0.35535964449254054,"308":0.191871085356392,"309":0.10226656088070096,"310":-0.01169265081105512,"311":0.0729867532729494,"312":-0.07554015939894225,"313":-0.20007573460450362,"314":-0.023790828566572463,"315":-0.0749485583418867,"316":0.019809686000359587,"317":-0.08868128845947612,"318":0.025256733106113108,"319":0.002682244545529381,"320":-0.018066497920659064,"321":-0.02343248375602532,"322":0.0897753882712749,"323":0.10717562291581113,"324":-0.15839837798096568,"325":-0.35426613996191486,"326":0.12611189330141004,"327":0.08057927275217855,"328":-0.03348984052016148,"329":-0.14661901891841084,"330":-0.0006928683224879931,"331":-0.2184923305455007,"332":0.03335523765302439,"333":-0.10954752793428786,"334":-0.2473356477120814,"335":-0.1123254864098808,"336":0.018870440614435643,"337":-0.06168587903720818,"338":0.00030149934662210254,"339":-0.010811017115615195,"340":0.09675099917293187,"341":0.006378206240826731,"342":-0.25526087770198,"343":-0.21905543173356418,"344":-0.02925175454783619,"345":-0.05853606921435294,"346":-0.011297245187072697,"347":-0.3636640749833783,"348":0.045798297511083705,"349":-0.16949436883661861,"350":0.04421552841351021,"351":-0.008081775394387258,"352":-0.17272083082143153,"353":-0.006005978007000066,"354":0.16654210171353273,"355":-0.004589117119862803,"356":0.011708317708652577,"357":-0.021847880024992952,"358":-0.06022036931521865,"359":-0.04954193430467387,"360":-0.01916928283807476,"361":0.05633670590927865,"362":-0.1319246802469231,"363":-0.10960756799070523,"364":-0.07141885531847243,"365":0.02793142852148325,"366":-0.06804786489444122,"367":-0.09945562761914477,"368":0.0003444480430345547,"369":-0.25437555171089754,"370":-0.17282829908725003,"371":-0.03286331355131491,"372":0.01773489185501898,"373":-0.008359654744551035,"374":-0.0004989360923987369,"375":0.02552586120595842,"376":0.062341493763760226,"377":-0.06340229888452997,"378":0.0007472259745984265,"379":0.07010358527142954,"380":0.014548875294573861,"381":-0.0187587477358947,"382":-0.12000959845639055,"383":0.09614987316661094,"384":-0.06749824181222515,"385":-0.1519788736861883,"386":0.0008424176745966264,"387":-0.11293079218436235,"388":-0.06764480042768897,"389":-0.019405335250528163,"390":0.014575899704482,"391":0.02449934875307563,"392":-0.0858550594922139,"393":0.014816708212796563,"394":-0.006119302636243326,"395":-0.017643730043588338,"396":-0.05528603972736307,"397":-0.12438354449811334,"398":0.08481874376310795,"399":0.04680170008241258,"400":-0.08906506477554275,"401":0.19652713245843242,"402":-0.0415764937846815,"403":-0.21326008435981417,"404":-0.020602587958968886,"405":-0.27100400309777023,"406":-0.17924165109189966,"407":-0.16154706213322234,"408":0.02526894771022105,"409":-0.030861622629378704,"410":0.20442666373771667,"411":0.025133493964942046,"412":-0.06753207280822107,"413":-0.002376477840686382,"414":-0.054426951878159616,"415":-0.14284184341792033,"416":0.089953235206507,"417":0.02928985831778987,"418":-0.07488906938292016,"419":-0.050350812711788456,"420":0.040176884106998434,"421":-0.16580338349907275,"422":0.03995278180799083,"423":-0.15034086079040504,"424":-0.2337346290996884,"425":-0.1775358290032373,"426":-0.013546676358357526,"427":-0.009107765829042661,"428":0.027498151180564315,"429":0.02182212455766111,"430":-0.13755943858155517,"431":-0.029608741875337755,"432":-0.1218147282660185,"433":-0.10697012686182497,"434":-0.024518224866822497,"435":-0.09159190682226112,"436":-0.15122280296281315,"437":-0.46164014919281526,"438":0.031700625526398914,"439":-0.1846981803971416,"440":0.010032017521100873,"441":-0.1639323584563519,"442":-0.07767397103186491,"443":-0.13601180733362062,"444":0.0548818391321541,"445":-0.012371321370708531,"446":-0.06366334276121773,"447":0.014983753859239939,"448":-0.11018460703830041,"449":-0.04471695131624861}},{"sx":1,"sy":1,"depth":450,"w":{"0":0.034486359407061955,"1":-0.07402410855278148,"2":-0.009479247087844787,"3":-0.15468695664705315,"4":0.04146191305528046,"5":-0.0710999615953335,"6":-0.039065531985712,"7":0.09380196063793576,"8":0.041533419032678126,"9":0.015458346790318264,"10":0.07285896618403785,"11":0.07682019854681804,"12":-0.03265367477679466,"13":0.023572203001643414,"14":-0.3519495555723742,"15":0.024142456866335333,"16":-0.033684028583677694,"17":-0.04633112493166384,"18":-0.29848229237557744,"19":-0.22049576153762612,"20":-0.08523234301601525,"21":-0.1112049612248638,"22":0.023655772162043055,"23":-0.0651332378613533,"24":0.00987049897247917,"25":-0.042681244523624914,"26":0.008512746872823097,"27":-0.051757325174542415,"28":-0.07406827182977854,"29":0.050269596851398854,"30":-0.07382706712573939,"31":-0.0886712022105914,"32":-0.22734024462668137,"33":-0.04566642404885782,"34":0.0076318874565001705,"35":-0.025937378128160347,"36":-0.09009438131546825,"37":0.07569615340849348,"38":-0.08210825847263571,"39":-0.17037998248809658,"40":0.006639190183383262,"41":-0.11709480048678521,"42":-0.01290660920478098,"43":-0.10398232248774193,"44":0.042213158396854356,"45":-0.09475056744197168,"46":-0.04945011301664711,"47":0.040977444082951994,"48":0.025840587914541906,"49":-0.09642146283879394,"50":-0.1276204330616214,"51":0.03582967815500831,"52":-0.03654738371680537,"53":-0.09429143348276463,"54":-0.01853075305730984,"55":0.06404583933191951,"56":-0.009068836764695266,"57":-0.027542343972610888,"58":0.003753424399180946,"59":-0.21627083512788464,"60":0.03428827720053387,"61":-0.004062622198898494,"62":-0.038032328684789694,"63":-0.23204917642728093,"64":0.037316507477907254,"65":-0.025511669120174895,"66":-0.05790632647667602,"67":-0.019480246130489806,"68":-0.1386137200953206,"69":-0.07205622790686439,"70":-0.11864909020511644,"71":-0.06345173965314005,"72":0.05494865069784533,"73":0.14685165164071262,"74":-0.06097208787898989,"75":-0.09804598841660275,"76":0.006217892250512524,"77":-0.11528459120877581,"78":-0.027774008796117005,"79":0.007073539193236515,"80":0.0017219819637551818,"81":-0.4216048745632045,"82":-0.10270246638458876,"83":-0.1870320671870907,"84":-0.0832717669558737,"85":0.023993833034543374,"86":-0.15662036906793478,"87":-0.016491197159588092,"88":-0.13427805755670166,"89":-0.06163638229052205,"90":-0.013207093553979471,"91":-0.04162030850694772,"92":-0.142409782571676,"93":-0.10334477557396618,"94":-0.046591672942990076,"95":-0.08241333168559384,"96":-0.09364946311660474,"97":0.02173524956257428,"98":-0.05472818935299763,"99":-0.06004967974089997,"100":0.0764347747340906,"101":-0.11241482665728099,"102":0.007857125645222049,"103":-0.005360052146162998,"104":-0.17688581045092952,"105":0.0006666676847322727,"106":-0.026872903702492984,"107":-0.009716535718477906,"108":-0.18858153694695576,"109":-0.2401098183772513,"110":-0.11134048783105865,"111":-0.15660559846342492,"112":0.0013480681875732506,"113":-0.18488479862163898,"114":-0.04213563631684997,"115":0.10571972042506049,"116":0.01853706446407571,"117":-0.0746555944681818,"118":0.0022053494390575456,"119":-0.031808869109761426,"120":0.0015932180302002438,"121":-0.04570937617295918,"122":-0.3147854635503992,"123":0.07950144753445132,"124":-0.037888362204449265,"125":-0.05195482029452702,"126":-0.14325527859325737,"127":-0.018453818826034193,"128":-0.1371665576242719,"129":-0.2306025955560408,"130":0.026380676083823985,"131":-0.15771529313527977,"132":-0.10302453893524541,"133":-0.038307146663265325,"134":-0.03934112329475954,"135":-0.0768538637285772,"136":-0.1574322089595705,"137":-0.08362087311569628,"138":-0.06402846459778765,"139":-0.041410813092872506,"140":-0.2830298521654903,"141":0.00016969571173294575,"142":-0.1164332521872761,"143":-0.013753423963294835,"144":-0.02910526846105827,"145":-0.016770666345256136,"146":0.01453931578013215,"147":-0.11365554999722982,"148":0.02960327419139588,"149":0.0019665150502059968,"150":-0.025355585673923046,"151":-0.027942554394978093,"152":-0.07551139755473092,"153":-0.19301100704449692,"154":-0.0767906962742933,"155":-0.04616824202909701,"156":-0.0631795719244728,"157":-0.003143277038670385,"158":-0.15262742115882852,"159":0.03513141370641871,"160":-0.17792650626261797,"161":-0.15238883235706943,"162":-0.07668467686747293,"163":0.06067828329104009,"164":0.06684631395698917,"165":-0.07080382279858402,"166":-0.016637818736484587,"167":-0.041265275723550744,"168":-0.029400138474747275,"169":-0.13219499328177062,"170":0.058675389189179014,"171":-0.24171318741197784,"172":-0.05287428259192083,"173":-0.02960629109824816,"174":-0.06258404474950749,"175":0.035249927324442494,"176":-0.09100043907704256,"177":0.022654937679939525,"178":-0.1276527071173016,"179":-0.16016562642481105,"180":-0.0837670222106602,"181":-0.029840570883874255,"182":0.0038234722545841325,"183":-0.19370591936584136,"184":-0.017395418272099637,"185":0.07128301211157735,"186":-0.02985695871427317,"187":-0.04409075419909226,"188":-0.030142274585650854,"189":-0.07596430503227053,"190":0.05188741098728386,"191":-0.1864011781701855,"192":-0.047193927583174915,"193":0.058918594928112716,"194":-0.12063172226367892,"195":0.02073062938253958,"196":-0.024613419712364536,"197":-0.007674669524945307,"198":-0.20465215412459248,"199":-0.19111687709278832,"200":-0.11827746174404516,"201":-0.19488660733212995,"202":-0.09622594522992078,"203":-0.10671627239237175,"204":-0.20772208627052752,"205":-0.1099251253546328,"206":-0.02214058175963874,"207":-0.10901987396134821,"208":0.01324084272278236,"209":-0.1379591641658756,"210":-0.1095345547390588,"211":0.04421148102347475,"212":-0.2787567594663678,"213":0.024097515652196585,"214":-0.10191419362260212,"215":0.052764840592390574,"216":-0.18307254935939632,"217":-0.08535867969043294,"218":-0.11074926967090487,"219":0.025067954109427616,"220":-0.01380418313579832,"221":-0.05159317260077245,"222":-0.16272000883398371,"223":-0.09291010610267304,"224":-0.016267543478471702,"225":-0.15405917867569474,"226":-0.21427312205476554,"227":-0.08505685865247076,"228":-0.0386532455585431,"229":0.015060774197948653,"230":-0.05780251341886037,"231":0.011959820224506153,"232":-0.174643793290357,"233":-0.03361360765956492,"234":-0.12825696638769957,"235":-0.1189275375790349,"236":-0.028360572101140822,"237":-0.029054514319925978,"238":-0.10349807401263306,"239":0.03641536463914253,"240":-0.04147789953081835,"241":0.036433123463620744,"242":0.08703837997225046,"243":-0.11666423680220794,"244":-0.1271110688169416,"245":-0.04001869473405119,"246":0.025109485252475798,"247":-0.01988469757413716,"248":-0.03705205938114562,"249":-0.07215614176768598,"250":-0.24376369247307608,"251":-0.1370038508019373,"252":-0.10274341383401113,"253":-0.11400714288897443,"254":-0.06350440997323335,"255":-0.05932238825211478,"256":0.009056525610335693,"257":0.04353256022216683,"258":-0.07980721054333717,"259":0.038152141080414974,"260":-0.020610326698539974,"261":-0.14754777218741089,"262":-0.035204196280043655,"263":0.10403734681740033,"264":-0.04658935415061782,"265":0.011101749797371857,"266":0.05402720789561718,"267":-0.006209038232281498,"268":-0.11584271702880775,"269":-0.11606434201612607,"270":-0.10986733394651485,"271":-0.06672695196850485,"272":-0.03400504757502429,"273":-0.23444600844358665,"274":-0.09587149444733095,"275":0.02503641272248185,"276":-0.10182608367598274,"277":-0.0023332676471593725,"278":-0.03709133037986399,"279":-0.09434872521552262,"280":-0.002491316287094091,"281":-0.01660084452270946,"282":0.00894168727539714,"283":0.012236465051423439,"284":-0.06554532929788721,"285":-0.01052493921422421,"286":-0.042151021682856414,"287":0.05313984297431397,"288":-0.11343015906131451,"289":-0.09677428804978729,"290":0.03413299102331336,"291":-0.12935845568045998,"292":-0.07268244405228404,"293":-0.02471996666805397,"294":-0.08563099262488719,"295":-0.14340443016561205,"296":0.010794716661453596,"297":-0.11438771246326837,"298":-0.04605163965785859,"299":-0.12934812995175266,"300":-0.013817704258583557,"301":0.013210452062912822,"302":-0.15461929237165958,"303":0.007355230118388244,"304":-0.14620484875188575,"305":-0.04152212158685101,"306":-0.02840236720719816,"307":0.01297203376279855,"308":-0.1862845347661709,"309":0.08572277000375439,"310":-0.12438126425691048,"311":-0.08053742968791724,"312":-0.07440079625086123,"313":-0.14793751195884153,"314":0.0179137017415209,"315":-0.07141989850439423,"316":-0.1584075310338991,"317":0.04125083161708817,"318":0.01748007462547907,"319":-0.07130847799962876,"320":0.04001028380740235,"321":-0.03401920076073387,"322":-0.21895226510784224,"323":-0.03760508685667463,"324":-0.05406500451393971,"325":0.06721315982810483,"326":-0.14776538385521487,"327":0.17387470431945887,"328":-0.07688242108170634,"329":-0.08219963777371125,"330":0.04624208272415653,"331":-0.03231316485332056,"332":0.02431664664969776,"333":-0.051571437043834885,"334":-0.21530999812396553,"335":0.03931189045787755,"336":0.05832195511214059,"337":0.025089194245472776,"338":-0.1733959495949354,"339":-0.007870972605166537,"340":-0.14405247127018345,"341":-0.14089151723086177,"342":-0.13497857014338605,"343":-0.041323583862911996,"344":-0.10994377924687447,"345":-0.032353411018942985,"346":-0.02086271825268855,"347":0.009902821959490334,"348":0.03218944725678248,"349":0.1227414518848474,"350":0.08135082563129298,"351":-0.03391401934240696,"352":-0.11308444362241252,"353":0.10501656689016288,"354":0.0106361853115141,"355":-0.0696473758058947,"356":-0.13096697173608352,"357":-0.06193963462147542,"358":-0.06667476405596393,"359":-0.03367787797142956,"360":-0.053653514377853144,"361":-0.08802768716479628,"362":-0.061924257807412224,"363":-0.2195898199941333,"364":-0.07049942714675554,"365":-0.05413237252812448,"366":-0.11477180155140129,"367":-0.01173720821149052,"368":-0.017849237479256246,"369":-0.023485677990911023,"370":0.002914735005909283,"371":-0.018299483573151396,"372":-0.01979973223725233,"373":-0.042014767533431446,"374":-0.15738412218836909,"375":0.023413472458249894,"376":-0.11549184673647656,"377":-0.03431421757320643,"378":-0.0026287012122815446,"379":0.03794138855745122,"380":-0.0037773750672555825,"381":-0.16574806603847855,"382":-0.1138988282298349,"383":-0.10038553052533204,"384":-0.0999336975521418,"385":-0.1469879326073782,"386":0.03730105952740905,"387":-0.10720644621272142,"388":-0.023738989920198687,"389":-0.1260432452500496,"390":-0.07276704420973573,"391":0.08844524099095645,"392":-0.10403347056692126,"393":-0.0037352824150413584,"394":-0.10648318880403557,"395":0.04586598676757459,"396":0.08536001336762176,"397":-0.02723157223909099,"398":-0.22244289131012923,"399":0.05389472688845597,"400":-0.07777588461387867,"401":-0.21109454124186033,"402":-0.08177966181258835,"403":-0.15626875211749,"404":-0.011194975677279303,"405":-0.07170445862920342,"406":-0.10854785635336868,"407":-0.17925018594295283,"408":0.006686067421695946,"409":-0.03044766482723342,"410":-0.09650402067623262,"411":-0.0048877606426391985,"412":-0.09155992953536032,"413":-0.002470881965290995,"414":0.0461898913031569,"415":0.027578238110686458,"416":-0.3529602695959061,"417":0.21256391107479475,"418":-0.06891668560637197,"419":-0.09019702732440976,"420":-0.07303734120051711,"421":0.018461776053519403,"422":-0.025409933791572577,"423":-0.125381709862958,"424":-0.16993510656309746,"425":-0.05001242680770309,"426":-0.06236198188512899,"427":0.02859616953876291,"428":-0.10486024188250968,"429":0.0178021840232572,"430":-0.05919429753779533,"431":0.025764150632462842,"432":0.09831026418634903,"433":0.060741683757201105,"434":-0.3206616216752727,"435":0.029971344482566106,"436":-0.0733249265471685,"437":-0.17265701798294392,"438":-0.126558103795977,"439":0.14953068774924652,"440":0.014472519667794705,"441":-0.28241775760286525,"442":-0.05340765248540636,"443":0.039099175821218975,"444":-0.013130993597274808,"445":0.005323799746725755,"446":-0.16508271054917112,"447":0.030406326429107025,"448":0.05634418944275265,"449":0.00010672364143548913}},{"sx":1,"sy":1,"depth":450,"w":{"0":-0.024492324703603147,"1":-0.05951041294507395,"2":-0.0031606788208093073,"3":-0.09049563035528138,"4":0.036206112536511306,"5":-0.05539027684106144,"6":-0.04345539420533016,"7":0.05909818178719819,"8":-0.007212255115739315,"9":0.06000704239132984,"10":-0.12178143405418758,"11":-0.06436417617977924,"12":-0.01068817378645083,"13":-0.03517432711278823,"14":-0.03193454230095512,"15":0.06104508017806671,"16":-0.060511717348721863,"17":-0.04157969393660378,"18":-0.2720347846822851,"19":-0.16791656593582882,"20":-0.009314125396490581,"21":0.0743295238981838,"22":0.06165067481263256,"23":-0.04429440602199732,"24":0.03682273311179474,"25":0.1507955778519076,"26":-0.02684032623374698,"27":-0.021546793413933982,"28":-0.21184423355923873,"29":-0.024881190025171897,"30":0.016233011519375812,"31":-0.025736278242953874,"32":-0.05010739159043527,"33":0.006209269113478057,"34":-0.09676652603257672,"35":0.07614472686237202,"36":-0.17960589742056698,"37":-0.08339748611443595,"38":-0.01948108799640506,"39":-0.026212527264505958,"40":0.028834682181346133,"41":-0.1329117378247276,"42":-0.015702349669131702,"43":0.009757099252774336,"44":0.08848075109044327,"45":0.024780539749635424,"46":-0.15506444454865673,"47":0.06074198907945462,"48":0.007692397649581873,"49":0.02866532307794562,"50":-0.05363026584750951,"51":0.021687234640637165,"52":-0.051257054098172196,"53":0.011038136005540803,"54":-0.21853069604684658,"55":-0.15030874671615277,"56":-0.013588915324875462,"57":-0.07528095334544718,"58":-0.00973499641152363,"59":-0.03385686705976052,"60":-0.04775428539857127,"61":0.09809894575849645,"62":-0.02998872634529845,"63":-0.12470487581806981,"64":-0.18658766903445176,"65":0.05235019798807648,"66":-0.006334029185714764,"67":0.06843878657296644,"68":-0.014117396118813115,"69":0.04729618747445629,"70":-0.07426568454711083,"71":-0.05676556347965883,"72":-0.20940230544436378,"73":-0.028024215618461426,"74":-0.081628531109367,"75":-0.014620913969381796,"76":0.05768836058292435,"77":-0.10542587310774762,"78":0.05107544479694263,"79":-0.06629111286726515,"80":-0.011744972051932085,"81":-0.16321077871587938,"82":-0.1327651083598769,"83":0.0053536165613229806,"84":-0.054990313527148664,"85":0.018841249080062426,"86":-0.05380468222538344,"87":0.03955808256195161,"88":0.06924540191736485,"89":-0.017085412592881506,"90":-0.13271343978146707,"91":-0.02849348315325354,"92":0.03162612919747953,"93":0.011977401861491144,"94":-0.027759842951005344,"95":-0.04630891966314056,"96":-0.16920234355957672,"97":-0.09082410208963054,"98":0.0980971615372832,"99":-0.08446076624730728,"100":-0.2222524487986433,"101":-0.1598580284255353,"102":0.015149876960795628,"103":0.02175350991329112,"104":-0.08732356729481927,"105":-0.05718522972866724,"106":-0.0891529535995858,"107":0.01139756172576689,"108":-0.15043677583479018,"109":-0.04087929680979186,"110":-0.08171332204275437,"111":0.015149553802070427,"112":-0.0035896430692479845,"113":-0.06316338458308003,"114":-0.1101502907598146,"115":0.09260438465451372,"116":0.06773931265347387,"117":0.1917463934802301,"118":-0.26166359692727836,"119":-0.03659846907213168,"120":0.0011834733100337033,"121":-0.0030001899315656175,"122":0.09402706025199825,"123":0.0048512894164831726,"124":-0.14239425806503422,"125":-0.019252476040909915,"126":-0.17799801278954044,"127":0.15192953758785058,"128":-0.2010721618482221,"129":0.03299867613664364,"130":0.10282588202640201,"131":-0.1643150064783996,"132":-0.10887503391144109,"133":0.16265350586105443,"134":0.012319526796233186,"135":0.12457197069003294,"136":-0.19284782794986388,"137":-0.09204649177602667,"138":-0.07105330212547947,"139":0.004713084446946525,"140":0.003459848380163162,"141":0.00679287123030445,"142":-0.19497867107817107,"143":-0.0028648866959599803,"144":-0.11753773103744423,"145":0.012464192244106265,"146":-0.2182290659770681,"147":-0.06824468709556554,"148":-0.02642602842644751,"149":-0.29956369277035133,"150":-0.06769777706017664,"151":0.13015652000679673,"152":-0.016670540716963844,"153":0.0023292575401692253,"154":-0.18277530302422995,"155":-0.08048403922881754,"156":-0.08961002850180937,"157":0.02403874719143305,"158":0.061816104178351435,"159":0.06713136522852345,"160":-0.10954397186397419,"161":0.026663106050555253,"162":-0.18579498639950587,"163":0.03376990628342611,"164":-0.1809910947352703,"165":-0.031815888141503844,"166":0.023863761761374787,"167":-0.2391641658474548,"168":-0.0035501021883787504,"169":0.05775568720617829,"170":-0.03420246163230669,"171":-0.1460938089152885,"172":-0.11807317052413523,"173":-0.036322589822681633,"174":-0.012029756662375036,"175":0.05054710586405501,"176":-0.04545477848397366,"177":-0.007641695731342685,"178":-0.028909896133691104,"179":0.0396921355086422,"180":-0.005801805968920712,"181":-0.01552438330487174,"182":0.05555144903786564,"183":-0.003447880107132301,"184":0.032515610424623996,"185":-0.04608104776440336,"186":-0.158558535168568,"187":-0.13975696108259214,"188":-0.039747218928405874,"189":-0.14378308783996274,"190":-0.32068288314765797,"191":-0.058256189027874064,"192":0.01253901906684974,"193":0.04875284745121822,"194":-0.07090951552411988,"195":-0.013994613942938182,"196":-0.0258643426299146,"197":0.005518264636577064,"198":-0.16373555604155252,"199":-0.1412081752207323,"200":-0.11725366518799027,"201":-0.07426064622359037,"202":-0.06511568314654466,"203":0.007210659138571593,"204":-0.10517163776909243,"205":-0.046727442656973525,"206":0.004392435673313357,"207":0.035946861604276584,"208":-0.21453645278394046,"209":-0.00174637452303489,"210":0.023585093258960146,"211":0.04326766038379815,"212":0.057681875986397985,"213":0.008626364128879595,"214":-0.11578797130602009,"215":0.04368446681517559,"216":0.008807142742212283,"217":0.2568299511805557,"218":-0.21641197970970427,"219":-0.0523995928455644,"220":0.03726485903874068,"221":-0.08275130953020927,"222":-0.04093871663184374,"223":0.11904139253720507,"224":0.021243699765151607,"225":0.03981361274886671,"226":-0.23835704741368105,"227":-0.05701491087882361,"228":-0.055367359718874194,"229":-0.02140085617104547,"230":0.01642339826696652,"231":-0.007105191857758083,"232":-0.1503523901438001,"233":-0.10218207295567833,"234":-0.1404497354757048,"235":0.21705653010187206,"236":-0.163839927555213,"237":-0.10126882034697283,"238":-0.014281081646196066,"239":-0.18915263001218582,"240":-0.11272460230523267,"241":0.09945779486270774,"242":-0.0017090312725795915,"243":-0.0517788389469133,"244":-0.04710122503944098,"245":-0.10133901989299082,"246":0.026655792659637335,"247":0.06258403585221832,"248":0.011337127648545175,"249":-0.08237839780362392,"250":-0.09648443473552352,"251":0.06951138153705234,"252":-0.018429397622961,"253":0.11646051042168977,"254":-0.1370413071241095,"255":-0.121951334620004,"256":-0.03654949010984881,"257":-0.21561969426390443,"258":-0.12541960577025063,"259":0.017011489487748294,"260":-0.11337226393135413,"261":-0.15056309357338585,"262":-0.059876266244183254,"263":-0.16290406278269437,"264":-0.03847807248692126,"265":-0.06418571641750145,"266":0.011804104034208613,"267":0.00036594692047628327,"268":-0.13915248553150247,"269":-0.00479042319503654,"270":-0.0016412579807181867,"271":-0.03415084576625987,"272":-0.08376426321536265,"273":-0.06337837611992564,"274":-0.06010075983462627,"275":-0.183740174521538,"276":-0.09579069645508814,"277":-0.1016215843686067,"278":0.01024906556615827,"279":-0.17789268859144852,"280":-0.3801191727834852,"281":0.04147508284519643,"282":0.06385737483873931,"283":-0.009228310646639445,"284":-0.034369828423969344,"285":-0.028924121210981982,"286":-0.022147668079508392,"287":0.0004892546747406825,"288":-0.024380737829373486,"289":-0.07009757473871557,"290":-0.0813358312757347,"291":-0.2151427031725969,"292":0.024334465568025314,"293":-0.02150940455927228,"294":-0.132207177631772,"295":-0.09059620145103034,"296":-0.005090625162255869,"297":-0.10544775360789559,"298":-0.3284496676507404,"299":-0.07794316025894373,"300":-0.016897001940420497,"301":-0.05229467105640783,"302":-0.05517375712612204,"303":0.0823051335526826,"304":-0.05302977180029842,"305":-0.013132641970965597,"306":0.03301700670726432,"307":0.08472728159552781,"308":-0.05973358244562188,"309":-0.24450599854683852,"310":-0.0337361043256644,"311":-0.026415272498542027,"312":-0.13793481288318815,"313":-0.11509221064856476,"314":-0.017350728909337674,"315":-0.15255945401862783,"316":-0.24721227717170735,"317":-0.1491376980772204,"318":0.013755488371154388,"319":-0.05662645336180812,"320":-0.097978057242052,"321":-0.06372905928794954,"322":-0.09791010116617462,"323":0.034304772971782534,"324":0.11607224213549061,"325":0.11491977127344745,"326":-0.07077281880226814,"327":-0.2887184873393947,"328":0.006109300106375055,"329":-0.0025573051615485113,"330":-0.14492578450210955,"331":-0.02408538301986269,"332":-0.10341714397092666,"333":-0.009143528593056501,"334":-0.0548588071274227,"335":-0.11029177641078299,"336":0.06974527608617005,"337":-0.05236484113620292,"338":-0.012159475977032142,"339":-0.0412293369676151,"340":-0.07016735939657714,"341":-0.01549404993834679,"342":0.07770627600100209,"343":0.05698311307715307,"344":-0.2053908775580529,"345":-0.12535829910577093,"346":0.026139705438960367,"347":0.04763386203993685,"348":-0.029833776773371404,"349":-0.05785481788480705,"350":0.10505174907344753,"351":-0.1045839804905107,"352":-0.023043828232404077,"353":-0.17335342301309034,"354":-0.021590523840983086,"355":0.10059032504644583,"356":-0.022134057704643658,"357":0.041295019110993494,"358":-0.06985949065443463,"359":-0.01741599736289903,"360":-0.049566405114052046,"361":-0.003088192057592133,"362":0.03664069174913732,"363":-0.1228823561692285,"364":-0.04249538349057698,"365":-0.32860889639052887,"366":-0.09621266856494859,"367":-0.150232104260334,"368":-0.07722109146016522,"369":-0.20921390699906642,"370":-0.3264210195619156,"371":0.011426914423766242,"372":-0.032580681499845845,"373":-0.05652401639048543,"374":-0.056203760455743636,"375":0.0022712348608421276,"376":-0.03644991528591309,"377":0.0046398645577678315,"378":-0.06187961857414272,"379":0.0042374384955022,"380":-0.17312954370548012,"381":-0.24021418134025246,"382":-0.01284334235019542,"383":-0.23548921645157578,"384":0.004609933865375729,"385":-0.10743755062044581,"386":-0.01969606890259668,"387":-0.1582705924623004,"388":-0.30573560005434325,"389":0.01577943782671457,"390":-0.03257642933452999,"391":-0.044773775812823366,"392":-0.10819814328120808,"393":-0.043666524006924265,"394":0.05542778656929336,"395":0.003058819633553643,"396":-0.037960383548831654,"397":-0.16449066267884296,"398":0.04847724253059973,"399":-0.1381435560754263,"400":0.038087840745789754,"401":0.003062024220034629,"402":-0.14204245343692842,"403":-0.23150548934357273,"404":-0.0431824694398888,"405":-0.1836360709223496,"406":-0.24500425509053544,"407":-0.13679357455862745,"408":0.03562655445005082,"409":-0.03068419192179109,"410":-0.09787008997051397,"411":0.013546399428736982,"412":-0.051838606979804476,"413":-0.055080362216223706,"414":-0.0665619041122451,"415":-0.17341205108164537,"416":0.10218533764702556,"417":-0.33762927396559334,"418":-0.02108441690141036,"419":0.16102761478980118,"420":-0.04861058870663667,"421":-0.07535125308789853,"422":-0.024755903743779662,"423":-0.21465994475278324,"424":-0.16558010111173418,"425":-0.0856255510400659,"426":-0.0194787093313252,"427":-0.03991618985204692,"428":-0.056514847876123195,"429":0.02044882232146135,"430":-0.021335015263915454,"431":-0.17330828818350305,"432":0.017449044748173742,"433":-0.2018187458645409,"434":0.08359745622273781,"435":-0.24996030873000985,"436":-0.005529071570780195,"437":0.056085245258668745,"438":0.011325064584281428,"439":-0.10062107537450754,"440":-0.009159509252312898,"441":-0.03724030816130706,"442":-0.05253910824051132,"443":-0.04321718181153374,"444":-0.013357414245722378,"445":0.014391256936298539,"446":-0.012208342455527215,"447":-0.00785698204790065,"448":-0.11276231281608302,"449":-0.19768848581011075}},{"sx":1,"sy":1,"depth":450,"w":{"0":-0.10214392153485138,"1":0.0031369654814721805,"2":-0.0794240119541029,"3":-0.0031888264537655257,"4":0.0041706651312849955,"5":-0.08155304730565201,"6":-0.011553611118074026,"7":-0.08561385904515832,"8":-0.029728461839085764,"9":-0.07883405765894408,"10":-0.15147169815946332,"11":-0.04572720818934604,"12":0.04696114456848825,"13":-0.017756159357884063,"14":0.08171456942393543,"15":0.007769936696092894,"16":0.008989306615641618,"17":0.02980388886951751,"18":-0.035858051908150425,"19":-0.007101289151222765,"20":0.019208205661466717,"21":0.003047953779522494,"22":0.11087920994164303,"23":-0.19278413118404703,"24":0.03719393327238145,"25":-0.10794260189590335,"26":0.013832084168165216,"27":-0.07057540215620685,"28":-0.11932706178770085,"29":-0.35198839344255706,"30":-0.0751960709595491,"31":-0.10582658502866063,"32":0.03531186518417291,"33":-0.018977728634555907,"34":-0.04902479407515205,"35":-0.02568991042668544,"36":0.035210405964845,"37":0.030649771382787978,"38":-0.17527702504829162,"39":-0.09650237252831784,"40":-0.08039744875089937,"41":-0.05900266704707366,"42":-0.0663620809466033,"43":-0.243359416014107,"44":-0.0881257197550794,"45":-0.07671456544194054,"46":-0.11795107895416668,"47":-0.36347543703435786,"48":0.1414591925678916,"49":0.026096430185802037,"50":0.08821015050235316,"51":0.05155226890914633,"52":-0.06748917104407195,"53":-0.2539347031405501,"54":-0.005185639988563933,"55":0.06042549120185902,"56":-0.21107552548622807,"57":-0.14139772959159977,"58":-0.0027394621056139046,"59":-0.17508953004350575,"60":-0.00513475908893838,"61":-0.1893971577900909,"62":0.08671857179340066,"63":-0.1621901753505847,"64":-0.0871133499520148,"65":-0.3491832026629341,"66":0.0526266127249343,"67":-0.08243015578546412,"68":0.033641609407979806,"69":0.02535130010183006,"70":-0.016894231790257314,"71":-0.3746049054012656,"72":-0.028210131923108457,"73":0.0034888552367470078,"74":-0.19072897122712137,"75":-0.2025920947008545,"76":-0.05109130677433163,"77":-0.203303876455442,"78":0.047428262122847786,"79":-0.10126582037477426,"80":-0.024017582118320127,"81":-0.11375378841345657,"82":-0.10518693481278081,"83":-0.06875769346264615,"84":-0.05391323033723987,"85":-0.050022010339537376,"86":-0.1056275863409037,"87":0.10330625205350528,"88":-0.06718527926141286,"89":-0.3712633901658767,"90":-0.007864000721266086,"91":-0.018498229741523858,"92":-0.09948024279167207,"93":0.01555328923701239,"94":-0.0009299980949558702,"95":-0.2920279951820962,"96":0.0893806227577358,"97":-0.10162792479393425,"98":0.08424858508197597,"99":0.000017902195911817834,"100":-0.10399217186273138,"101":0.02915421813731873,"102":0.013791026424429113,"103":-0.0275180808544411,"104":0.04292052775683706,"105":-0.018314841112502287,"106":-0.0066268222917955965,"107":0.04123849316350081,"108":0.03357084544952396,"109":-0.034991645542093296,"110":-0.09328532452752608,"111":-0.11791417128853769,"112":0.018793445133487234,"113":-0.12159117450780363,"114":0.02522974553874529,"115":-0.09760266410694765,"116":-0.046345031653399,"117":0.02163397147931345,"118":0.05521836808663239,"119":-0.0756803308957827,"120":-0.03739894930644431,"121":-0.04332919821739631,"122":-0.06386499598463174,"123":0.036970217353399774,"124":-0.06741376207149641,"125":0.02020030849541349,"126":0.14844230834338407,"127":-0.03945058717541243,"128":-0.08002542558270234,"129":-0.2292275372712318,"130":0.07012628743542029,"131":0.19420869358193932,"132":-0.041265043292812185,"133":-0.22568984037984227,"134":-0.014081832170292439,"135":-0.10792710793695519,"136":-0.06820125383958686,"137":-0.10619906116198537,"138":0.004430817713246507,"139":0.04094003148361395,"140":0.17107406821777857,"141":-0.02964816950928822,"142":-0.07256257663314743,"143":-0.21985769159134744,"144":-0.011301020201559608,"145":-0.1258472081931522,"146":-0.04949172391801773,"147":-0.10273953842692694,"148":-0.059749102325758245,"149":0.12093166211069749,"150":-0.14018007707533195,"151":-0.11186694818431167,"152":0.07956130158324246,"153":-0.045540846078736465,"154":-0.1090260297050974,"155":-0.06711133945231197,"156":0.06795841633833244,"157":0.017862205020192142,"158":-0.04699870615214658,"159":0.04044381368456788,"160":-0.024808807876730163,"161":-0.22850628456800873,"162":-0.13465962030756912,"163":-0.14472219317615936,"164":-0.0963923529086322,"165":-0.1813160425331225,"166":-0.039338760739590424,"167":-0.19715244461433235,"168":-0.0736309410293942,"169":-0.28958484715964056,"170":-0.012624427010830363,"171":-0.19879423943242383,"172":-0.29559229610734306,"173":0.0383285958563145,"174":0.00718674749197184,"175":-0.01786585822852773,"176":-0.005960197200053967,"177":-0.011664052605082648,"178":0.033271356211927575,"179":-0.19719014952113723,"180":-0.04788676260914446,"181":0.001092251299262042,"182":-0.0493749469708303,"183":-0.07283906577888061,"184":0.04551112067348374,"185":-0.2939125386272673,"186":0.04948982354429589,"187":-0.22293288888105361,"188":-0.08617562913810987,"189":-0.0793353909457984,"190":-0.15255703876751497,"191":0.07450714469344438,"192":0.06968802270691998,"193":-0.053527513801002485,"194":-0.08714945645685863,"195":0.014861487960572645,"196":-0.007766848732219176,"197":-0.07611106994165819,"198":-0.07570058647176188,"199":-0.004478288581089735,"200":-0.04673920217371926,"201":-0.0901822702393795,"202":-0.009938444863166598,"203":-0.05953006594615546,"204":0.11722806912044473,"205":-0.03745960401938886,"206":0.008796752425269887,"207":-0.0484277888627298,"208":-0.08684166472912644,"209":0.07509702612795725,"210":-0.05845914309666892,"211":0.030027975817343584,"212":-0.023959198637852678,"213":-0.05889784630249662,"214":0.12187902222524061,"215":-0.06470578318509977,"216":-0.17874694938310035,"217":-0.07851519421027163,"218":0.043986286701320064,"219":-0.03558061980477206,"220":0.04990103429506728,"221":0.1976804649568174,"222":0.05344402356370289,"223":-0.08745561843710452,"224":-0.008906225124692994,"225":-0.032068580818537654,"226":-0.1043976674871144,"227":0.039030508654662004,"228":0.032241954374139535,"229":-0.011125262005149331,"230":-0.08052392839576428,"231":0.061674622201347826,"232":0.26052385368168046,"233":-0.03388885097229496,"234":-0.10585324301371762,"235":-0.1862100388808623,"236":0.011547392550224392,"237":0.03299446161832212,"238":0.04029751211108197,"239":0.025058654170709748,"240":-0.09749838176701515,"241":-0.03285468625616271,"242":-0.01836612851427006,"243":-0.01164109958158708,"244":-0.20620855058834378,"245":0.013455509334739667,"246":-0.011442697515310492,"247":0.04245952583604079,"248":-0.06173781610659901,"249":0.008693272141570976,"250":0.1653801465186193,"251":0.04571242334402338,"252":-0.39699699605707606,"253":-0.12938432997604404,"254":-0.09702758021096866,"255":-0.14594998005371593,"256":0.0191590305403291,"257":-0.16130264620033968,"258":-0.15366171459582986,"259":-0.16280386691380655,"260":-0.025354156644168818,"261":-0.041067394006582846,"262":-0.29692188717745716,"263":-0.003766211199351919,"264":-0.022003731661661023,"265":-0.02924779148523731,"266":-0.008240168549394146,"267":-0.01278208131003182,"268":0.1236479944155171,"269":-0.032960085020496466,"270":-0.01628154632332044,"271":-0.008086069293659025,"272":-0.0009875728975520352,"273":-0.06886403026879863,"274":0.11470376756408439,"275":-0.3492473052137491,"276":0.10760874977737776,"277":-0.1956696551252001,"278":-0.013033713456458264,"279":-0.1321437721887851,"280":-0.1550185323940547,"281":0.00047329504858541514,"282":0.06878486360096056,"283":0.08128068366571713,"284":0.0580373795494002,"285":0.08216161110367773,"286":-0.012987621650058567,"287":-0.0405329539470447,"288":0.022819631136628576,"289":-0.11944929019197083,"290":-0.1032280870539263,"291":-0.008909108666806345,"292":0.014424865428323164,"293":-0.16693366189601638,"294":0.05529479080452244,"295":-0.16020687619244334,"296":0.03493690327626614,"297":-0.09316979064112885,"298":-0.0797265118349812,"299":0.03783064081720794,"300":0.02577932034894411,"301":-0.03256563701742071,"302":0.07732565874591432,"303":0.00935559410404799,"304":0.12090443498095728,"305":-0.0310576602990231,"306":-0.23726670269638445,"307":-0.05246368829497037,"308":-0.056630808855376816,"309":0.072990726028193,"310":-0.06314621137295641,"311":-0.01675781018750792,"312":0.05060074960844848,"313":-0.16622886695201594,"314":0.002213617901566714,"315":-0.02588596022187852,"316":-0.05348299901085756,"317":-0.017744184239239787,"318":0.0014721991400862273,"319":0.022734689245515142,"320":-0.049064458010867035,"321":-0.06275020553646342,"322":0.08475351506058197,"323":0.12387189046045577,"324":-0.16624025730088188,"325":-0.03537126248939626,"326":0.014282405842964236,"327":0.08912036433245198,"328":-0.025556470028079543,"329":-0.1133386855786422,"330":-0.038604992258637394,"331":-0.02742145494684806,"332":0.03751896332903344,"333":-0.03457669938769918,"334":-0.1849543948357941,"335":0.10844786465250746,"336":0.08495465462002234,"337":0.026111473833520565,"338":-0.03736711973368626,"339":0.032158930729405406,"340":0.10154867058004328,"341":0.13266902639861106,"342":-0.3299968332965478,"343":-0.11996222926715308,"344":-0.0009301713944921171,"345":-0.19928487790860727,"346":-0.08205947018473872,"347":-0.21368535957008855,"348":-0.2167479951068638,"349":-0.16712455011669355,"350":-0.05370207440908615,"351":-0.2863770260310875,"352":-0.21489157255425267,"353":0.06755381309226581,"354":0.028218549323398207,"355":0.04290606908036115,"356":-0.021601598195865473,"357":-0.09018456127196568,"358":0.06197221939117128,"359":0.013942099798271304,"360":-0.12151687432565564,"361":-0.01744264018633744,"362":-0.06546416474278349,"363":-0.011779288033567004,"364":-0.1025774303520492,"365":-0.29020291860896874,"366":0.00013036542953633992,"367":-0.2131912067000739,"368":-0.06591937554610093,"369":-0.2359973097114191,"370":-0.18501014134562793,"371":0.03297981001417173,"372":0.0508471126025603,"373":0.005268193955563623,"374":0.0598984687995619,"375":-0.08179972388836734,"376":-0.04742232669965599,"377":0.0005552245751899819,"378":0.04365755028717309,"379":0.04559498494029497,"380":-0.18686276632920854,"381":0.02603892837604686,"382":-0.13308149145568948,"383":-0.1756731796024809,"384":0.01332255265335427,"385":-0.08652377546048642,"386":-0.043721603209874386,"387":-0.3102701421843425,"388":-0.0771042308223641,"389":0.023718023222006408,"390":0.024830244888310423,"391":-0.020557770266560894,"392":-0.07663930600259974,"393":-0.07246596250727652,"394":-0.0384004570732755,"395":0.007738989142409736,"396":0.0026848823924449667,"397":-0.0217804158453337,"398":-0.09434651845412755,"399":0.17547342535455449,"400":-0.11729475513156565,"401":-0.07555893173387544,"402":-0.0738581667162229,"403":-0.11536688412186252,"404":0.0036978581226270145,"405":-0.2652149582039408,"406":-0.0900531210071109,"407":-0.0774956789331816,"408":-0.001228533491630852,"409":0.006763445187837045,"410":-0.014192543421578942,"411":-0.02948049550098619,"412":-0.050717444908418216,"413":-0.0069260792252702034,"414":0.04413358692550329,"415":-0.06597832509821117,"416":-0.07463269024174797,"417":-0.017154616724042154,"418":-0.09711056202777425,"419":-0.15246295796863504,"420":-0.1174675120712374,"421":-0.01782063263391469,"422":-0.03451276036510947,"423":-0.2912239152253109,"424":-0.05013860188875737,"425":-0.03773083418447481,"426":0.029605329455041456,"427":0.02128664308197959,"428":-0.03127079705688169,"429":0.006468340729276338,"430":-0.0280777042933626,"431":-0.01851508981595773,"432":-0.13321991675982078,"433":-0.09250328427284395,"434":-0.11025911891580671,"435":-0.1271616990464557,"436":-0.030342393621416483,"437":-0.2612942375438981,"438":-0.038304600053287154,"439":-0.01806720114014685,"440":-0.04120352216927032,"441":-0.09041222423669117,"442":-0.2235093563056632,"443":-0.028517616539232123,"444":-0.06328124897770411,"445":-0.002003732501466102,"446":0.008256589465676418,"447":0.03295920595902689,"448":0.0492342856986583,"449":-0.012124277861636215}},{"sx":1,"sy":1,"depth":450,"w":{"0":-0.025137184956165518,"1":-0.03970728282752554,"2":-0.20472150949442972,"3":-0.11633802858838452,"4":0.043297591874750116,"5":-0.08328855036011967,"6":-0.05396908970153021,"7":0.018833229135131805,"8":0.04565020367516036,"9":0.0567761832256634,"10":-0.22580395546851098,"11":0.1933561382148692,"12":0.01024870197215571,"13":0.02535226762376525,"14":-0.20301442216924523,"15":0.007244501515625929,"16":0.010089254889836585,"17":0.01774968560432554,"18":-0.017546318350221125,"19":-0.0917299987280809,"20":0.03056300023760484,"21":-0.06010835331201491,"22":0.010900918589669361,"23":-0.22291133817682998,"24":0.035297326988690925,"25":0.061507210055091,"26":0.02845749840247082,"27":-0.07431877156338314,"28":-0.013887235182513741,"29":0.15872509997277712,"30":-0.1488999609260211,"31":0.03311873569477232,"32":-0.23836672038803006,"33":0.02439872761311189,"34":-0.006602247286102517,"35":-0.030543038476057233,"36":-0.08022497421106788,"37":-0.13859470573338104,"38":-0.001960803400775673,"39":-0.06790579463388645,"40":0.017511129446405992,"41":-0.2716302100242414,"42":0.02653997114673444,"43":-0.018682093674641825,"44":-0.053066179219729184,"45":-0.07121665253340843,"46":-0.0013035201295052297,"47":0.1394645105417698,"48":-0.14048458075201387,"49":0.005641760783839344,"50":0.0008734458492786593,"51":-0.0028484958676402556,"52":-0.013112539720906329,"53":0.05647299355957755,"54":-0.2451512733885106,"55":-0.14186969974228492,"56":-0.06469415978911061,"57":0.14320817233506938,"58":0.051285768788907775,"59":-0.2924180934224067,"60":0.08435144503835969,"61":0.022290348632129777,"62":0.018560530981142537,"63":-0.16909568220014629,"64":-0.04505662458734856,"65":0.12263557289387013,"66":-0.025581326435628386,"67":-0.02431657973638599,"68":-0.17124984770045046,"69":0.007343507941543594,"70":0.06876751751008402,"71":-0.0776807233734789,"72":-0.1547402155342806,"73":-0.1113115262918497,"74":-0.14197025989551562,"75":0.024103234934961738,"76":0.06189546924251077,"77":-0.12070267823788118,"78":0.024724238937529352,"79":-0.0007047462044978509,"80":0.03635597694720266,"81":-0.04189426072840113,"82":-0.13952422753989419,"83":-0.006978990171152818,"84":-0.046599383913225975,"85":-0.03589924395556407,"86":-0.1265473500332761,"87":0.05546926200090022,"88":-0.06963997927244726,"89":-0.1159413832707924,"90":0.01297275066473409,"91":-0.1132445243929342,"92":-0.15296077721647072,"93":-0.08630870267224887,"94":0.044946231508824576,"95":-0.3554160254139399,"96":-0.01678248865622017,"97":0.15016745561483744,"98":0.004055948202467542,"99":0.09694262070290967,"100":-0.23649509001959843,"101":0.10924774873201416,"102":-0.03811830706424031,"103":-0.02995701924348464,"104":-0.20090257573569217,"105":0.007750361216036583,"106":-0.08365157402634471,"107":0.04549430243041517,"108":-0.0417842049290056,"109":-0.059022052256506786,"110":-0.04225158658019006,"111":-0.11929575715783725,"112":-0.042432222716385457,"113":-0.1896093966700261,"114":0.034226434949197686,"115":0.10736899880574734,"116":-0.04939477281568308,"117":-0.22347903864284951,"118":-0.030477468889732653,"119":0.08087724776938862,"120":-0.06796656633849138,"121":0.06371576136541493,"122":-0.20217856068407095,"123":0.05785807871544896,"124":0.0667019284521745,"125":-0.011207650100480204,"126":-0.18563551625166674,"127":-0.14957943420728345,"128":0.17000825345329332,"129":-0.17256372007543122,"130":-0.028267365584397203,"131":-0.1549578175955119,"132":0.04969913257979858,"133":0.05202410617788815,"134":0.014539110298222802,"135":-0.14358662986283605,"136":0.048341056289457264,"137":0.12833042323133018,"138":-0.041882202628584345,"139":-0.034373408141569854,"140":-0.31874556316902447,"141":-0.05093362484359832,"142":0.028718318350022996,"143":0.01862956210356773,"144":-0.25149483501481296,"145":-0.2603699819582003,"146":0.08111698834876126,"147":0.13521462403722376,"148":0.032323706361126976,"149":-0.026837939613070322,"150":0.08443974305692144,"151":0.049294164117768074,"152":0.029597686345103128,"153":-0.16618738556823634,"154":-0.0553435528892502,"155":0.04043890362401677,"156":0.011833161282393043,"157":-0.03708522694930664,"158":-0.20194543484481606,"159":-0.05793648337186219,"160":0.02657349014361266,"161":-0.09170543541257138,"162":-0.18255251904110914,"163":-0.14713234607230957,"164":0.13711715358564378,"165":0.16369225211546296,"166":0.01367602533822066,"167":-0.2773976149074432,"168":0.1376152497175954,"169":0.03308853910241462,"170":-0.03282857901902489,"171":-0.03921021764038479,"172":-0.2824554983167187,"173":0.03311834548270444,"174":-0.07057944349143447,"175":-0.006193033684459274,"176":-0.13608537392130077,"177":-0.016054674910537487,"178":0.05785508732743813,"179":-0.05007395520589749,"180":-0.02247910370183018,"181":0.07036774858635615,"182":-0.2372173984952394,"183":-0.2055909687492049,"184":0.0005604916163321581,"185":-0.47004712857959213,"186":0.05998816384887153,"187":0.12629712306343432,"188":0.0018287158147828652,"189":-0.0004163060577809126,"190":-0.18279975364281337,"191":-0.07891818513750261,"192":0.06556658692663576,"193":-0.009983116490721628,"194":0.01602204404494854,"195":0.023552134231112846,"196":-0.07112717441829439,"197":0.05904126094086122,"198":0.03833976349570989,"199":-0.01644537632357196,"200":-0.11664710580385729,"201":-0.11461466866549275,"202":-0.005200658973896886,"203":-0.04484838216316678,"204":0.06361391682709626,"205":-0.03606533972418526,"206":-0.02275330089519671,"207":-0.29071019261178804,"208":-0.021868511828335695,"209":-0.23985408827155416,"210":0.016507354812471002,"211":-0.06287959864375324,"212":0.048858049337964185,"213":0.0032923616051267726,"214":-0.02562882727154021,"215":-0.006171362609704034,"216":-0.13019549884354506,"217":-0.2214235546270062,"218":0.10433554967690503,"219":-0.133012998128782,"220":0.025315988062952117,"221":0.014713698093845895,"222":0.05701126908444355,"223":-0.11287143824282984,"224":-0.026843051278970163,"225":-0.23330513357669097,"226":0.09983782578191525,"227":-0.14559420223679662,"228":-0.016495977676158718,"229":-0.04455282152775777,"230":-0.02916741651107564,"231":0.036558990168652494,"232":0.010737283042768136,"233":-0.03795362185365635,"234":-0.16874455720799417,"235":-0.1692578981366047,"236":0.12407226087191588,"237":0.04794116115353154,"238":-0.061379325982127884,"239":-0.11566970739566299,"240":-0.013527923958033072,"241":-0.17662256775981297,"242":0.046128393705323935,"243":-0.25885312908473707,"244":-0.04234517314642369,"245":-0.24835666947899462,"246":0.043237623361458116,"247":0.031266410905493605,"248":0.10541635462600045,"249":-0.010925710040317832,"250":0.05189978903936576,"251":-0.09347110072061215,"252":-0.20593242016999458,"253":-0.2594766878205429,"254":0.0510829512156028,"255":0.04380110144977806,"256":-0.00037890814328784883,"257":-0.3914157308727337,"258":0.15982936915964446,"259":-0.09737695163175028,"260":0.0010048120932891445,"261":-0.08667395907960146,"262":-0.25066260454037825,"263":-0.12749161879096474,"264":0.03528189663519734,"265":-0.03014432243239006,"266":-0.006594757475088765,"267":0.05268231616489895,"268":0.09253794636184727,"269":-0.16676400147917853,"270":0.007470471449673049,"271":0.030279759510093703,"272":-0.09286870184344725,"273":-0.2524588302774509,"274":0.04439909593478976,"275":-0.49686567204491144,"276":0.01841656652252224,"277":-0.06357659034260667,"278":0.00902324710893204,"279":-0.12303488853949897,"280":-0.11242133873188365,"281":-0.11759375132577324,"282":-0.0377571116218891,"283":0.04760700624099619,"284":0.027824734314949518,"285":0.05073208294115138,"286":-0.12616772151316666,"287":-0.015188110360006161,"288":-0.07189977580956376,"289":0.024678427820484725,"290":-0.06988281290290436,"291":-0.10129561857013543,"292":0.07742610387928955,"293":-0.04378490796753432,"294":0.03591026428514473,"295":-0.2514877386860498,"296":0.06171707836202589,"297":-0.3207154580090634,"298":-0.016812928866385503,"299":-0.15901872248712798,"300":0.00005567501044219384,"301":-0.0553642565258806,"302":0.10775057786189733,"303":-0.03851781216632673,"304":-0.032653116676718566,"305":0.07328001947264391,"306":-0.04723086880321687,"307":-0.004649358309547118,"308":0.026195591585496347,"309":0.04796708764377237,"310":-0.11059985326069842,"311":0.058186356609074306,"312":0.01609503606508691,"313":-0.23440500467711367,"314":-0.0009003628594949013,"315":-0.21389614788951852,"316":0.07004704180157999,"317":-0.2221758688607351,"318":-0.08652296298054508,"319":0.02545527877603327,"320":0.06382792389017511,"321":0.03477604993825352,"322":-0.14235442980028581,"323":-0.13540785587860754,"324":-0.009196628139233337,"325":-0.03205889023464456,"326":0.07841252338454466,"327":0.016389845361703567,"328":-0.06155360503502064,"329":-0.05409141615811985,"330":-0.06636232878070698,"331":-0.24617685311527973,"332":0.0009316568617716248,"333":-0.14002178173434474,"334":-0.08704485927075661,"335":-0.08436416260176667,"336":0.022191862587753675,"337":-0.009953662966473067,"338":-0.009473400547437779,"339":0.04998096992867709,"340":-0.07050129724753967,"341":-0.06187530427195808,"342":-0.09697889214752153,"343":-0.09792806398422145,"344":-0.0472940632624633,"345":0.06857720644802777,"346":-0.0784483004541539,"347":-0.3580807396412806,"348":0.05347708523427012,"349":-0.23443115034218473,"350":-0.02629212669783756,"351":-0.12490382828070555,"352":-0.1926682870922196,"353":-0.027787735414678546,"354":0.01190908153199385,"355":0.0018795857592344598,"356":-0.053018245362331684,"357":0.07852889528358344,"358":0.018402449253530486,"359":-0.1715141127027187,"360":-0.028566800359325604,"361":0.16000848926954062,"362":-0.01204506949931966,"363":-0.16514493677818495,"364":-0.12022299225200218,"365":-0.34771181741056306,"366":-0.09624406922668417,"367":-0.29823418113859823,"368":0.03903214371010338,"369":-0.12419884400675296,"370":0.10282145956844066,"371":-0.05691494676077798,"372":0.003476696667631746,"373":0.019392481889212276,"374":0.05614531171076289,"375":-0.05644640384752013,"376":-0.049321444892725004,"377":0.03650021797545666,"378":-0.005487584879238329,"379":0.057626897619515435,"380":-0.07567267599969166,"381":0.013899122853788973,"382":-0.06264361769220933,"383":0.04146213098177859,"384":-0.1433877726873787,"385":-0.33525800541141376,"386":-0.07229602461423626,"387":-0.06135231319904476,"388":0.09330673496265497,"389":-0.15445105706175186,"390":0.07021095009695823,"391":-0.025490786930589943,"392":0.05582612310204516,"393":-0.06907931560050276,"394":-0.10000210167815406,"395":-0.047015125627321484,"396":0.08272794449385754,"397":0.04290060453165524,"398":-0.09742082561901642,"399":-0.03279988295849726,"400":-0.062138546553062696,"401":0.1396479712543439,"402":-0.14503851557682235,"403":-0.37481333950008155,"404":0.04848587997200079,"405":-0.11363502627374915,"406":0.15855798793379167,"407":-0.002473955288318635,"408":-0.016783110807059836,"409":0.09324965273116866,"410":0.002736478878058754,"411":0.10178375638534144,"412":-0.004221147883137559,"413":-0.016061693300120274,"414":0.05641017167306327,"415":0.015059102210537759,"416":-0.1428948508285241,"417":-0.01284047027866167,"418":-0.1056443586757673,"419":0.06621994484373736,"420":-0.19516976927764088,"421":-0.25119603623177683,"422":-0.00839434189676875,"423":0.04108486971384033,"424":-0.08848992286424434,"425":-0.11177828399497876,"426":0.07121862320923679,"427":0.0525485402042129,"428":-0.04381569257403823,"429":0.014193536221738075,"430":-0.06750555712174182,"431":-0.1157631029592344,"432":0.07519154002842378,"433":-0.011809219361111274,"434":-0.15095309569668935,"435":-0.10882083468668106,"436":-0.07790803628466256,"437":-0.38609689709009876,"438":-0.10899551640537294,"439":-0.2072793194443408,"440":-0.026054954429567685,"441":0.041264855126964456,"442":-0.22155929090674545,"443":-0.12323107050030489,"444":0.013161237070577248,"445":0.0007489945224568802,"446":0.04417503895620208,"447":0.06460645479543468,"448":0.004793875780380735,"449":-0.10727949795010734}},{"sx":1,"sy":1,"depth":450,"w":{"0":0.05766552871939232,"1":-0.008261227639199486,"2":-0.06527690953794531,"3":0.01671431280160049,"4":0.028396569575646197,"5":-0.07019137830743387,"6":0.01750777316921767,"7":-0.09782234993795516,"8":-0.04607161582707373,"9":-0.000009926136479186637,"10":-0.10356959495665982,"11":-0.13749511798316563,"12":-0.01114291497366775,"13":-0.035206123493149846,"14":0.0347436723609965,"15":0.004601454371711787,"16":0.02722819158525157,"17":-0.07325206145500499,"18":0.020094944090275242,"19":-0.008261837806275478,"20":0.0008998170463848155,"21":-0.08176251206628056,"22":-0.02493672767006382,"23":-0.08828024222323629,"24":0.016188507931822315,"25":-0.15091868593556595,"26":-0.04038806662962713,"27":-0.20719354444944857,"28":-0.19970607134871993,"29":-0.0489482937802734,"30":-0.012916254584704412,"31":-0.019109759612605408,"32":-0.008569376679657395,"33":-0.03840548920072819,"34":-0.05496589222319744,"35":-0.031186511374346262,"36":-0.11876884548348118,"37":-0.26365603038723245,"38":-0.06896332256731508,"39":-0.09661102346402176,"40":-0.06872477318945532,"41":-0.10647835723228252,"42":0.0018406572533421442,"43":-0.21314265558674692,"44":0.0066362162393241615,"45":-0.23467981093523563,"46":-0.10776067491731069,"47":-0.13571013563778775,"48":0.0489347660150629,"49":0.04528257472879053,"50":0.02870711845398246,"51":0.01338037557579211,"52":-0.10885831098938778,"53":-0.03894171142348178,"54":-0.2363314176781209,"55":-0.3286030027054794,"56":-0.09308020421788357,"57":-0.05253229379209497,"58":0.024835924473328462,"59":-0.06026660080260599,"60":-0.00926969549722444,"61":-0.20823553259662758,"62":-0.030084853664074533,"63":-0.0755303556422949,"64":-0.05274072395439685,"65":-0.04495579262387258,"66":-0.016751535259482055,"67":0.036517536484914445,"68":-0.04749188269558029,"69":0.0425057085599326,"70":-0.12498916832196792,"71":-0.17195276727680048,"72":-0.11574650072035707,"73":-0.21961887509374428,"74":0.0043380347285505655,"75":-0.0549882459758084,"76":-0.018777915060194515,"77":0.06375212577022,"78":-0.0024871158659324185,"79":-0.11937485295513209,"80":0.021705428274710472,"81":0.011502548296874473,"82":0.012612816825469605,"83":-0.10207594660001482,"84":0.03260010167154919,"85":0.018417742173534854,"86":0.036150129428766935,"87":-0.08836866690976437,"88":-0.0363257253019132,"89":-0.1341126356928328,"90":-0.0265108212637804,"91":0.10389856606259198,"92":-0.036958946819706504,"93":-0.151570132702502,"94":-0.019565452773150558,"95":-0.11564372957929409,"96":-0.023409662275169066,"97":-0.18329021769016784,"98":-0.018570679684149122,"99":-0.14527678644114836,"100":-0.036223939167758436,"101":-0.10523435320256255,"102":-0.044321835541236095,"103":0.036531732259636365,"104":0.030068858635603515,"105":-0.0589765524925811,"106":0.04611170620586514,"107":0.021860129748668338,"108":-0.08310806826760424,"109":-0.02083476883162177,"110":0.04297777080585541,"111":-0.15061111516599607,"112":-0.09322820495666177,"113":-0.06701887861701152,"114":-0.03700540377625411,"115":-0.3125934501921552,"116":0.019640673120594195,"117":-0.36318113494010723,"118":-0.04524742947854526,"119":-0.13117064159113287,"120":-0.07853694915558493,"121":-0.037421783719733925,"122":0.010812313704787411,"123":-0.06328972005835404,"124":0.06090831980819856,"125":0.02210152688496096,"126":-0.19729505832205832,"127":-0.25873995483379164,"128":-0.16367972327620592,"129":-0.1733321360377149,"130":-0.01739513530085523,"131":-0.13557465147718364,"132":-0.03254807580834801,"133":-0.40355198815753485,"134":0.006180864304027237,"135":-0.2622996604772798,"136":0.03782137624812745,"137":-0.1331998402567074,"138":-0.061454125665357164,"139":0.02649683253727352,"140":0.0275244508890073,"141":-0.0220837067522379,"142":-0.16951922871270364,"143":-0.05900761925304398,"144":-0.023435999466697617,"145":-0.2257499740169159,"146":-0.08219217062003153,"147":-0.10662766205566865,"148":-0.08558012823707914,"149":-0.11396455974597731,"150":-0.039175231730344984,"151":-0.37883632443012205,"152":0.031618290737903954,"153":-0.07480144557102837,"154":0.04136114658816608,"155":-0.02143860150549036,"156":0.04502324939415689,"157":0.05431609335957808,"158":-0.05424435875324122,"159":-0.025536618782810706,"160":-0.08188462720068473,"161":-0.08442298685031871,"162":-0.0034280941842840763,"163":-0.15100177564103048,"164":0.08975310118372042,"165":-0.10894928919603207,"166":0.007821929806724241,"167":-0.06604147970542716,"168":-0.07394626563824057,"169":-0.28034829036660486,"170":-0.04529774882874444,"171":0.06461810933212031,"172":0.08685024237942399,"173":-0.14586614194639214,"174":0.026220446871711663,"175":0.05665689927833218,"176":0.09522517434156866,"177":0.07282754030582683,"178":-0.01049698846198956,"179":-0.1837423808489172,"180":-0.06170650897990479,"181":-0.054874299746829676,"182":-0.14920960577267423,"183":-0.027800888903277327,"184":0.015417059690002349,"185":-0.006704329218287535,"186":0.03261576078169755,"187":0.03956682803073063,"188":0.05758585970209524,"189":-0.1685251655118615,"190":-0.060834863015124134,"191":-0.0788839386951026,"192":-0.00920960077954852,"193":-0.021947409264828646,"194":-0.07208325481645377,"195":-0.03331573697909434,"196":0.021290587867451017,"197":-0.06268379868870223,"198":-0.12892104165354987,"199":-0.08218403684317326,"200":-0.03927087928929487,"201":-0.004191194082925046,"202":-0.049036864924993685,"203":-0.08353324400243248,"204":0.11826294080050502,"205":0.01531024703291198,"206":0.043642575409400385,"207":-0.24053578370650708,"208":0.06354282318325721,"209":0.010196176060652864,"210":-0.0545536054763058,"211":-0.08238310409338617,"212":-0.10278830854663387,"213":0.049174070435709455,"214":-0.007515775854474593,"215":0.09349546664337972,"216":-0.1427023309860286,"217":-0.04346653092664272,"218":-0.22286733530360672,"219":-0.1144601060083967,"220":-0.07913504318996334,"221":-0.15074351094508928,"222":-0.0535519157205122,"223":-0.08611573374697702,"224":0.028854240974501812,"225":-0.24943481912891097,"226":-0.014290038967586419,"227":0.000263879283843227,"228":-0.01407048983119837,"229":-0.025133303171157292,"230":-0.06848608164593221,"231":0.018644298274882377,"232":-0.17229258791132274,"233":-0.059685073874078565,"234":-0.05190985956328218,"235":-0.026016967751386212,"236":-0.14446877437693856,"237":-0.30974152906770586,"238":-0.030929280824912614,"239":-0.027717324316664443,"240":-0.07415600870272097,"241":-0.1614625730400993,"242":0.004656534208556972,"243":-0.15444190568403424,"244":0.072887654187971,"245":-0.13411883653208675,"246":-0.11385952809310419,"247":0.013903740267092445,"248":-0.26237755131645185,"249":0.02248481581255,"250":-0.11236913601381662,"251":-0.03141144426511339,"252":-0.128495249648188,"253":-0.14801075949275788,"254":-0.024167344853698244,"255":-0.10975232867788057,"256":0.06460607430855068,"257":0.031640313569109624,"258":-0.09391934618335634,"259":-0.29844176592272176,"260":-0.002592887605660932,"261":0.033839310377841554,"262":0.0059808311231170225,"263":-0.16702434938063954,"264":-0.051181693760394636,"265":0.04107893678881839,"266":-0.03715420339082625,"267":-0.00594810055460391,"268":-0.1768491079931406,"269":-0.013669408838298357,"270":-0.14554252361683098,"271":0.01441866229047446,"272":-0.08595914979160003,"273":0.05497894505587194,"274":0.041713880213923214,"275":0.056004213028373676,"276":0.07801007835359765,"277":0.026928482178711508,"278":-0.005530728727811434,"279":-0.16626670937001947,"280":0.06762915968364026,"281":-0.0730238061550081,"282":-0.06044780650027062,"283":-0.0509905510948883,"284":-0.12037264769255707,"285":-0.014738241431915851,"286":-0.006887414476934355,"287":-0.07825768549637399,"288":-0.04512851956453964,"289":-0.07440924884169463,"290":-0.05803220254411928,"291":0.07244581646363009,"292":0.0033912213408953144,"293":-0.18249174488307687,"294":-0.023595939740789586,"295":0.1694966766909313,"296":-0.019452746141184123,"297":-0.27336825554611927,"298":0.0022262855988036305,"299":-0.029388998488337644,"300":-0.038462165198239716,"301":0.01787791726813592,"302":-0.07075141419251067,"303":-0.0344801716366803,"304":-0.10611199832429428,"305":0.03716539862231617,"306":-0.06669968341443848,"307":-0.04380025922965996,"308":-0.07555371063276009,"309":0.07274082687748462,"310":0.12401575788645912,"311":-0.14087140225954287,"312":-0.06856659220822554,"313":0.09942668982293035,"314":0.0318987250588795,"315":-0.14961549405366265,"316":0.044865525885000854,"317":-0.06928725925265077,"318":-0.08132806314224184,"319":-0.04345017052866653,"320":-0.0525662168026599,"321":-0.027001494554149307,"322":0.04747452421768203,"323":-0.04055766270258219,"324":0.018779343655631952,"325":-0.005222799841138506,"326":-0.039184033607780895,"327":-0.19255504087905576,"328":0.020072760442186074,"329":-0.08809928334242342,"330":-0.27938505997291,"331":-0.08897597057771832,"332":0.11099768837405254,"333":-0.041983819475113295,"334":0.04245079414308418,"335":-0.11044090611581638,"336":-0.047485327589408,"337":0.025996539728903728,"338":-0.11861870305842723,"339":-0.027097271096524954,"340":-0.14808374387558507,"341":-0.033597575432622775,"342":-0.10476920319817071,"343":0.07305183766855672,"344":-0.06355313588580605,"345":-0.14933245169847245,"346":-0.034959717488244994,"347":-0.029218553764976344,"348":-0.11394215985694181,"349":-0.051239198507122434,"350":0.005874731834907053,"351":0.06234670737354666,"352":-0.041732323367938126,"353":-0.14444333203541726,"354":-0.04264906795631706,"355":0.023247022156754747,"356":-0.0594255444351207,"357":-0.0336348587383733,"358":-0.03352887235888279,"359":0.006430644240943251,"360":-0.003782315342285148,"361":0.10446644489971325,"362":0.007980895748305067,"363":-0.002069465705503669,"364":-0.031975621586525664,"365":-0.006097326942663898,"366":0.060184461221700056,"367":-0.1317982629735695,"368":0.035913772561881045,"369":-0.16262142545090075,"370":-0.09588653540314762,"371":0.08662875341665337,"372":0.08674395458216048,"373":0.0028580462222836185,"374":-0.04766556347672092,"375":-0.05719253658152207,"376":-0.10135469551970028,"377":-0.025222881863531495,"378":0.0260751978697302,"379":0.012488357153757705,"380":0.02899029690542855,"381":0.07813419838579544,"382":0.0823295937852787,"383":-0.16071165330293166,"384":0.05118844985235228,"385":0.033735992006316065,"386":-0.03845892169943295,"387":-0.34026935609039,"388":-0.18645576753084184,"389":-0.029975420234227373,"390":-0.05488638294573923,"391":0.014956778872434026,"392":0.0255273621256256,"393":-0.019472603320518894,"394":-0.09564015826923139,"395":-0.03536841946547981,"396":-0.07773991624058445,"397":-0.078988658154689,"398":-0.10793195001863048,"399":-0.03502467552581786,"400":0.05902271879148626,"401":-0.17046298806753338,"402":-0.07879871375387307,"403":0.11384001599544145,"404":-0.019296853271665384,"405":-0.10329023798969632,"406":-0.1604248900279243,"407":-0.08647203957893933,"408":-0.012399079126054162,"409":-0.02610498507826237,"410":0.12608607143530515,"411":0.03809913426514295,"412":0.09202597977511723,"413":-0.07908365196533707,"414":-0.19280448251528498,"415":-0.1421376810866679,"416":-0.13667880600662452,"417":-0.26114737411214073,"418":0.05313432327111635,"419":-0.22567084136905222,"420":-0.040375249035442,"421":-0.07271930965604476,"422":-0.0011002374737606078,"423":-0.01845409249363124,"424":-0.09623923955949384,"425":-0.06665779101828248,"426":-0.06322365112757211,"427":0.0016206911238056244,"428":-0.031190452100648216,"429":0.05365976641478616,"430":0.03190901919679592,"431":-0.16245662471264746,"432":-0.12259344839322,"433":-0.06462646813961595,"434":-0.04662534945129137,"435":-0.054296651582210975,"436":-0.012634747979482025,"437":-0.006879255024859774,"438":-0.1019050412692841,"439":-0.10707935335320437,"440":-0.05673818204055683,"441":0.005309044073079725,"442":-0.02066714655558347,"443":-0.06106509017985906,"444":0.002563794669841412,"445":-0.1007342693597828,"446":-0.09224777124759677,"447":-0.038163725878237034,"448":-0.019145140570486913,"449":-0.007879762635123903}},{"sx":1,"sy":1,"depth":450,"w":{"0":-0.06004482395781849,"1":0.053762415186916886,"2":-0.025406199922625786,"3":-0.003857403290883532,"4":0.034705422762545166,"5":-0.022287305020746283,"6":0.04570301549834717,"7":-0.08558169742642688,"8":-0.01489504761381482,"9":-0.18212561135419184,"10":-0.11882505752012586,"11":-0.1275786888556566,"12":-0.08361625399929669,"13":-0.0340779392528332,"14":-0.07936521138191797,"15":-0.0038081909558803535,"16":0.03818720283798152,"17":-0.030558564525901083,"18":0.011832492492491785,"19":0.010277360731808403,"20":-0.02231992060772127,"21":0.000670725046683734,"22":-0.050835557164744666,"23":-0.1253842719494737,"24":-0.052672154020108976,"25":0.003276530578409022,"26":-0.007372974134747776,"27":-0.20180637062232018,"28":-0.13275210444586422,"29":-0.12366272273279229,"30":-0.0860535607863674,"31":-0.0030823241272099236,"32":-0.002900477800363046,"33":0.009736330194560466,"34":-0.0806477515413576,"35":0.04512040092032565,"36":-0.095160486536694,"37":-0.08181799334468653,"38":-0.09398912961666532,"39":-0.057675255589472986,"40":0.0698538812250457,"41":-0.07787208106053753,"42":-0.08299939399950101,"43":-0.07032718994175861,"44":-0.04613237427774363,"45":-0.1674064113451951,"46":-0.03749544777786839,"47":-0.12513858953025578,"48":0.018450557323253857,"49":-0.05704376318992749,"50":0.022942174309227778,"51":0.026572658568323974,"52":-0.05031755081985433,"53":-0.019677275701911724,"54":-0.1398688882952326,"55":-0.21947804913928992,"56":-0.11440751735424418,"57":-0.1139751197602939,"58":-0.012833672514690373,"59":-0.13113745759816603,"60":-0.07756538189834412,"61":-0.1845382581117186,"62":0.04010209761876227,"63":0.006433545578636409,"64":-0.06381117622363124,"65":-0.09158237872276392,"66":0.029620235203639128,"67":-0.03959209355028048,"68":-0.028988103987105687,"69":0.014881110253560516,"70":-0.03383647551905939,"71":-0.11999121857880515,"72":-0.19089481682884082,"73":-0.1447394063512507,"74":-0.08047384645227369,"75":-0.06166451215300471,"76":-0.0712431366040478,"77":-0.0373805056994001,"78":-0.05655916021599164,"79":-0.13952982993122187,"80":-0.021582723717252443,"81":-0.041375546494397134,"82":0.012780500293598477,"83":0.030933876193883325,"84":0.08220357245760548,"85":-0.1113233989048488,"86":-0.000575093290631563,"87":0.10112531840432835,"88":-0.057969605775034565,"89":-0.0313849368251521,"90":0.004082444195386954,"91":-0.11191401454695893,"92":-0.016444586165693553,"93":0.023340652897881127,"94":-0.0057415617301373656,"95":-0.08683366785110358,"96":0.05951361755661905,"97":-0.17350846427228622,"98":0.05337300912828321,"99":-0.08342309946047853,"100":-0.010888116826927164,"101":-0.18418457392482127,"102":-0.011556852067573503,"103":0.0005249774572861786,"104":-0.08207083243920187,"105":0.00004725770240905965,"106":-0.010265871114765004,"107":-0.055172453651018624,"108":0.02499581408775789,"109":-0.012192825668552936,"110":-0.04543711474942127,"111":0.0006763331058225307,"112":-0.02967794023097928,"113":-0.08328376563219492,"114":0.030453273702945396,"115":-0.048061935005707636,"116":-0.01916130424179894,"117":-0.2606385073204165,"118":-0.06112914255498369,"119":-0.08393157731353505,"120":-0.038548208866385755,"121":0.04269571126889451,"122":-0.08026809229284963,"123":0.04948348097780638,"124":-0.20809700304871906,"125":0.07024708203955247,"126":0.10551321454859475,"127":-0.007656643270606583,"128":-0.2376261538369108,"129":0.07151104142444739,"130":-0.03370890339343288,"131":-0.16877319936435042,"132":0.048476178784209734,"133":-0.006546601971876129,"134":0.009269755890547092,"135":-0.048146569690350895,"136":-0.07626026697320189,"137":-0.10486381493994228,"138":-0.02720911346062514,"139":-0.014204754776284018,"140":-0.017035793519233514,"141":-0.005562739593278841,"142":-0.1667213505070315,"143":0.004017438246942826,"144":-0.0760912892840245,"145":-0.1503507925785068,"146":-0.15540081298366135,"147":-0.15064751058577647,"148":0.008233036562498674,"149":-0.12227740667416893,"150":-0.04602984806760914,"151":-0.06870804952012488,"152":-0.06577020636119758,"153":-0.02134065326982077,"154":-0.03948812906295715,"155":-0.0973282765712885,"156":-0.03415221235072039,"157":0.009744130466969696,"158":-0.06287006280406644,"159":-0.057032229550915546,"160":-0.09663248823481868,"161":-0.24380970122975953,"162":-0.2396881373210248,"163":-0.26195770184668843,"164":0.008140912510380951,"165":-0.06251059615539221,"166":-0.04008671463833607,"167":-0.047653039568675996,"168":-0.06551447610983384,"169":-0.21723634404689815,"170":-0.07066338455397117,"171":0.11750819094276188,"172":-0.06448948967789705,"173":-0.04764604818298989,"174":-0.026284045984145136,"175":0.06257458137919515,"176":-0.018328634374912153,"177":0.04770243121022927,"178":-0.07095138462271323,"179":-0.25140687213339824,"180":-0.13654644526922344,"181":-0.006313404025477443,"182":-0.09475640558902887,"183":0.05332387403068899,"184":0.010164879499883593,"185":-0.12441609021144412,"186":-0.013505550321010742,"187":-0.13375070542026976,"188":0.04578291062295534,"189":-0.2688974599753338,"190":-0.0917310768110583,"191":-0.16171118459477454,"192":0.03155732329636576,"193":-0.06348783892089424,"194":0.013900424764709561,"195":0.022794395385817928,"196":-0.06058693928821667,"197":0.10348170177767324,"198":0.018996850370476548,"199":0.005777441566045762,"200":-0.06428700611836957,"201":0.12594386046473838,"202":-0.0329354678520041,"203":-0.055080942259413554,"204":0.142980997031905,"205":-0.03441600454101797,"206":0.022831805104615563,"207":-0.31781426876578595,"208":-0.12718819037365786,"209":-0.045898837885315354,"210":0.04427939498461799,"211":-0.09933461315073996,"212":0.07971339967145,"213":-0.01956122025376473,"214":-0.2536368476185083,"215":-0.028275192352815136,"216":0.02542027599137364,"217":-0.046519717983813394,"218":0.008301386595964627,"219":0.0025646111612940606,"220":0.05550268287837001,"221":-0.13725448683283512,"222":0.04600442748183411,"223":0.1151726187544788,"224":-0.00884228227028781,"225":-0.18869183064603248,"226":-0.09855126955324447,"227":-0.10114061209839421,"228":-0.014338706131240428,"229":-0.024786011227336497,"230":-0.049763447357532846,"231":-0.012991258372636805,"232":-0.24048893708936542,"233":-0.10439314842760118,"234":-0.086539744822553,"235":-0.30807215524065856,"236":0.0027767694149224225,"237":-0.06567543783649181,"238":-0.013247530111078099,"239":-0.15085474797801968,"240":-0.11581151095797344,"241":-0.007142379419178454,"242":0.035183716412199244,"243":0.032373570770965136,"244":-0.054299047785616,"245":-0.18009271984139494,"246":0.0931392857991788,"247":0.02187716606555006,"248":-0.03657439345408715,"249":-0.02301424699009018,"250":-0.1940440728062356,"251":-0.1725891077885634,"252":-0.2504114574256626,"253":-0.31886787422788315,"254":-0.045712575874511246,"255":-0.10055501016656875,"256":-0.004844514603518648,"257":-0.042621432991124454,"258":-0.04486290041863058,"259":-0.2625853665772109,"260":0.014493737232108036,"261":0.15232760796868863,"262":-0.021820458596795437,"263":-0.0862646738598521,"264":-0.0526891361450858,"265":-0.05672093632554106,"266":0.034995284858061255,"267":-0.04672403905807722,"268":-0.11647447023823371,"269":-0.29739176394271805,"270":-0.04557321259809958,"271":0.06278702913456219,"272":-0.034732929477856105,"273":-0.05173278946722428,"274":-0.13208478394335874,"275":-0.07910056340160207,"276":0.05217940511422383,"277":-0.2505642834207957,"278":0.09249766455359491,"279":-0.42154447527609445,"280":-0.18114796077343015,"281":0.024059305579031534,"282":-0.07771370132892748,"283":-0.0333837448320679,"284":0.08076579201645027,"285":0.010318835437928716,"286":-0.12351089973832458,"287":-0.07774124011004271,"288":0.020071599281032252,"289":-0.01999704836075797,"290":-0.05354749310896205,"291":0.0918895171388018,"292":-0.06911638261433288,"293":0.0841193079541499,"294":0.015274916035559718,"295":0.035883026511427135,"296":0.04442579354356786,"297":-0.43242230424845,"298":-0.17321970868318348,"299":-0.14116174349204935,"300":-0.00108736023314116,"301":0.037609059454965434,"302":0.16595167171071937,"303":-0.037514970583650824,"304":-0.14016474481800772,"305":-0.00780178589449391,"306":-0.02188867820812331,"307":-0.22269090839266775,"308":0.05628199399643763,"309":-0.035520811780964896,"310":-0.11062892611226528,"311":0.010031805245878746,"312":0.09316212076106867,"313":0.06935844389045621,"314":-0.04532623140596704,"315":-0.0685246560562737,"316":-0.10902070021127594,"317":-0.23763732976666677,"318":0.0501887189457087,"319":-0.008677551046361606,"320":-0.054892226524896004,"321":0.011553678379984425,"322":-0.05135848187554186,"323":-0.12487638365150157,"324":-0.07757396808303724,"325":-0.35494214387325485,"326":-0.040164403355019744,"327":-0.1239877653861521,"328":-0.08899081812061492,"329":0.08728763570861454,"330":-0.10682620040150598,"331":0.03460099649221987,"332":0.0978257269822145,"333":0.05913449287236775,"334":-0.19482958236146866,"335":-0.21950375597631128,"336":-0.0531366250824962,"337":0.0063380100811722675,"338":0.015634117319339367,"339":-0.06652106728371696,"340":-0.14252320764883045,"341":-0.26337139746218524,"342":-0.1467044650778358,"343":-0.31201108454541365,"344":0.0003870421840149711,"345":-0.1369946504741799,"346":-0.0749040189193806,"347":-0.11542151465812701,"348":-0.04675212405575853,"349":-0.21157397104150213,"350":0.04898358797976376,"351":-0.001608352938291888,"352":-0.14223790893773863,"353":-0.1572063004703744,"354":0.055630838530713586,"355":-0.06429559327159524,"356":-0.010940281541427553,"357":0.041928495759873285,"358":-0.14926904611399996,"359":-0.21274631740762268,"360":-0.0628076396968116,"361":0.16237913964584677,"362":-0.01784576730295506,"363":0.041147498002507464,"364":-0.04999322341007114,"365":-0.16246106287481282,"366":0.030746928694668982,"367":-0.14271557430286913,"368":0.003266492296854734,"369":-0.3850820063346349,"370":-0.18022919157588657,"371":0.03359218294985388,"372":0.07074458652865685,"373":0.04135090554865027,"374":-0.049039490598795095,"375":0.01955114868830751,"376":-0.07356407643342831,"377":-0.06616217840157809,"378":0.002648625061759875,"379":0.02828117436276185,"380":-0.05081751945754471,"381":0.09981316379276321,"382":0.07236089384419922,"383":0.156578599899504,"384":0.015427083728384267,"385":-0.01579212367473083,"386":0.04634523172154534,"387":-0.3893073326257325,"388":-0.08825592420428713,"389":-0.04338007665200042,"390":0.004983535086267514,"391":-0.04765462409014256,"392":-0.005808470061769505,"393":0.07808724301132378,"394":-0.06773872692945229,"395":0.013386848493531759,"396":-0.08117659729683019,"397":-0.10448635559525968,"398":0.15281179017173918,"399":0.027895743794000137,"400":-0.06509374372641193,"401":0.11172440428744267,"402":0.02667133561350386,"403":0.025132898923274416,"404":0.04115912118851969,"405":-0.40250786362763374,"406":-0.21335352577739283,"407":-0.07748795454920149,"408":0.08200687025292405,"409":-0.02798745306018623,"410":0.014071525226692791,"411":-0.04934225776759057,"412":0.11717383390054725,"413":-0.011893677321750094,"414":-0.2273327519942336,"415":-0.058344162390093525,"416":0.1318259995872825,"417":0.04741579362923894,"418":-0.009938435236166719,"419":-0.03839565366482347,"420":-0.0057725129702461235,"421":-0.058317233741656704,"422":0.04478677904928721,"423":-0.047777691855382366,"424":-0.20144590978891372,"425":-0.03221501081248254,"426":-0.03191726204604186,"427":0.02387579881150539,"428":0.07585136543808442,"429":0.011591841662896498,"430":-0.016633389973448657,"431":-0.14553704415165666,"432":-0.30645129183721664,"433":-0.0481053110689129,"434":0.04206482294179703,"435":-0.2405659097091555,"436":-0.008802941025647456,"437":-0.26806897361340093,"438":-0.1764039175042765,"439":-0.21561960329697252,"440":0.01379816509418524,"441":-0.025244091018575218,"442":-0.22045673051781528,"443":-0.11170775848045568,"444":0.027380080988177805,"445":-0.03938036563961522,"446":-0.06164086331980625,"447":-0.0033797037145322593,"448":-0.04334231312742589,"449":-0.10965502156327439}},{"sx":1,"sy":1,"depth":450,"w":{"0":-0.024543501408703695,"1":0.0005815617623010254,"2":0.04937286414163754,"3":0.044364940770036436,"4":-0.024933079319636304,"5":0.05799001926389356,"6":0.09814348999969962,"7":-0.009175165047427342,"8":0.033140857215217596,"9":-0.16823647476955,"10":0.03101403167540372,"11":-0.055779249413477894,"12":-0.1220453795535955,"13":0.05366206015144127,"14":-0.09611963482538477,"15":0.014815052133460318,"16":0.07547918519506676,"17":0.029653630852471972,"18":0.009836732665777349,"19":-0.12306869923571896,"20":0.05456184367141744,"21":0.03474897758034522,"22":0.005749453446872742,"23":0.04858024118270879,"24":-0.12235254217344825,"25":-0.13569173347402907,"26":0.017393182167412424,"27":-0.0660362103100826,"28":0.026864282885691326,"29":-0.12764707666905772,"30":0.013875101215324306,"31":0.05204875752322587,"32":0.10232981275458777,"33":-0.019434188685615927,"34":-0.09532396014377736,"35":-0.08699468291699285,"36":-0.04173221798233021,"37":-0.16030995211728083,"38":-0.09923998772879779,"39":-0.027485298074487213,"40":0.031814968497455104,"41":-0.142463298332057,"42":-0.01626702520524238,"43":-0.3031555232510675,"44":0.027568493000634613,"45":-0.11791227272923212,"46":-0.017000694875158182,"47":-0.0009051841624987886,"48":-0.010093603677789277,"49":-0.06890780845099427,"50":0.06209645678238673,"51":-0.05852471076489583,"52":-0.16534440837893766,"53":-0.061282422877760534,"54":-0.18129424578526132,"55":-0.21460173125251025,"56":-0.22041508894116524,"57":-0.04680508318019593,"58":0.0181233527345747,"59":-0.000797688354653629,"60":-0.0021486048748771474,"61":-0.1499926718731644,"62":0.00738690303803864,"63":0.04236758394624177,"64":-0.06229120611686413,"65":-0.10070021697218316,"66":-0.013169923510432535,"67":-0.06800450702057348,"68":-0.06874716368117051,"69":-0.06863897940932157,"70":-0.153478920935393,"71":-0.13979063683122883,"72":-0.23944429049917945,"73":-0.28255162572947123,"74":-0.1335505629376415,"75":-0.0110567417232366,"76":-0.003405515722782876,"77":0.005377491888930406,"78":-0.08149883463665072,"79":-0.06767438081865285,"80":-0.04581466484882344,"81":-0.009312244124685235,"82":0.06923193688791873,"83":0.014003441601270832,"84":-0.04880424545995296,"85":-0.001755375578632226,"86":-0.09131025161944084,"87":-0.010625889645227262,"88":-0.19210891708593436,"89":-0.11376985085706495,"90":0.035944193546982736,"91":0.054600455594119794,"92":-0.08755879220751189,"93":0.08722104521490942,"94":-0.033300020496165934,"95":-0.009332629877498442,"96":0.0037299705019792537,"97":0.15394872187973194,"98":0.003772844042693986,"99":-0.262633675456733,"100":0.07473817381348834,"101":-0.09245499703266197,"102":-0.05916467484981153,"103":0.02065902759315898,"104":-0.011620146838393164,"105":-0.10067639998484655,"106":-0.07121724365059881,"107":0.0761895310367488,"108":0.0024116090790008457,"109":0.03004124242194258,"110":-0.02264746124392338,"111":0.13621440601825846,"112":0.04476130989199348,"113":-0.11088339039357148,"114":-0.0022734098507499498,"115":-0.1229770658454855,"116":0.0641616177265196,"117":-0.26383066349123363,"118":-0.06750078073022221,"119":-0.08540870474650726,"120":0.007557465711032979,"121":0.018061851441390404,"122":-0.04182666813284976,"123":0.01445431708172937,"124":-0.12685134560475061,"125":-0.07642149591100857,"126":0.036513787600403476,"127":0.004999671324978901,"128":-0.18839560947937056,"129":-0.044981278870681665,"130":0.02192150718707558,"131":-0.23957098649371766,"132":-0.03827709339658088,"133":-0.09716876416421803,"134":0.014549853723555562,"135":-0.09793359916613921,"136":-0.06569510062401145,"137":-0.11181066014655076,"138":-0.06773426121024685,"139":-0.048731004647545616,"140":0.0745922630609012,"141":0.02697550359179202,"142":-0.26960240449291084,"143":-0.06955311453051534,"144":-0.13879004647401372,"145":-0.2605132148919647,"146":-0.19821699116742394,"147":0.036147744325695605,"148":0.0006815502242771233,"149":-0.1688010321036525,"150":0.0191242311669261,"151":0.032663675126806166,"152":-0.012293411658593708,"153":-0.08706651585756245,"154":-0.03440434301688573,"155":-0.13884370073780986,"156":0.04193754088789094,"157":0.01703084882709092,"158":0.06872274038447493,"159":0.013854511135037108,"160":-0.14201354733520136,"161":-0.17076125753322602,"162":-0.14894604009298068,"163":-0.21865897473587048,"164":-0.09242872947051119,"165":-0.02707284806834328,"166":-0.05235423347097811,"167":-0.09493133659831948,"168":-0.05452830387414299,"169":0.1377266794063586,"170":0.04078790435065945,"171":0.049667340354324206,"172":0.0007988739350249398,"173":-0.08615674350228475,"174":-0.029123091509417668,"175":-0.01950397263744688,"176":0.01574080370865675,"177":-0.060883221396964365,"178":-0.19975631137684818,"179":-0.25565247610131114,"180":0.022399834936429202,"181":-0.03513989403637621,"182":-0.05434918728221165,"183":0.05049092587200041,"184":0.04725030007248707,"185":0.06222753368161526,"186":0.06315129749183951,"187":0.1943861467461255,"188":0.038858704582047605,"189":-0.19738604530593587,"190":0.09387334042498675,"191":0.05305210523323925,"192":-0.022652789390194706,"193":-0.10533397581539844,"194":-0.19165530592153351,"195":-0.031179578338995262,"196":-0.14512013188711578,"197":0.07109549855671095,"198":-0.02641780934635183,"199":-0.09643458765803566,"200":-0.028814671042612726,"201":0.06629237701019194,"202":0.04742214898464244,"203":-0.10220307258234362,"204":-0.09345890134739752,"205":0.004905063317728555,"206":-0.08380162028446514,"207":-0.22104444675868887,"208":-0.07971652992177906,"209":0.038209994469910954,"210":-0.023479516598917862,"211":0.010817996825983764,"212":-0.265522902252217,"213":-0.07194820096616077,"214":-0.24230798882287075,"215":-0.05632297066204796,"216":-0.0530276182828467,"217":-0.10450898672277001,"218":-0.13701445314817726,"219":-0.12221866376082,"220":-0.006039607899855835,"221":-0.25907033997879847,"222":-0.09185732184285772,"223":-0.027557150499254755,"224":-0.04198645738150304,"225":-0.095792269511336,"226":-0.08233871840487274,"227":0.018317883740892896,"228":0.013976013397939014,"229":0.056573665849326694,"230":-0.06627196365626932,"231":0.05360981609129213,"232":-0.36946931980165254,"233":-0.11483509029956354,"234":-0.1334875294936917,"235":-0.1545631592664494,"236":0.03072339969225308,"237":0.015411783211993884,"238":-0.0901443525885482,"239":-0.12990746349962998,"240":-0.09334600874063215,"241":0.03636264473911008,"242":-0.04813876126935061,"243":-0.05910692939962928,"244":-0.09420240824700653,"245":-0.11369776768559418,"246":-0.012931641565399905,"247":0.00221284661707655,"248":-0.0735421481525499,"249":0.02665626667206324,"250":-0.22564817175576754,"251":-0.1362550333881947,"252":-0.14066510610779495,"253":-0.26336169262427206,"254":0.07502480836192685,"255":-0.10460047359346078,"256":0.08210317244795012,"257":-0.11057998923486602,"258":-0.08213400687625115,"259":0.19863903324857773,"260":-0.05344222161669431,"261":0.1437337666024114,"262":0.06552283784094355,"263":-0.10937824730872951,"264":-0.0024154372796985814,"265":0.005406521379172262,"266":-0.05346600694818524,"267":-0.0503905639551204,"268":-0.17448847975708082,"269":-0.23774061233872812,"270":0.04872787709739245,"271":-0.08587414320140116,"272":-0.17971762535291932,"273":0.06467844795839602,"274":-0.08431123120629783,"275":-0.0022909840658672173,"276":0.051299949895197934,"277":0.18496904533163272,"278":-0.05030625568732149,"279":-0.2311206496917044,"280":-0.015183172334172868,"281":0.056606018926276855,"282":0.024315718949691617,"283":-0.01997774435239287,"284":-0.08736995709706065,"285":0.007411998456290724,"286":-0.1259989944857874,"287":-0.003585592684376007,"288":-0.1157185822836614,"289":-0.0397879571808891,"290":0.00271243159927244,"291":0.06361929015689707,"292":0.03612302179551297,"293":-0.23520778149194638,"294":-0.0538944928636442,"295":-0.032617833766562,"296":0.024023826121896425,"297":-0.20676046422482516,"298":-0.0040621991955727505,"299":-0.09741176720888171,"300":0.00023867022994797862,"301":-0.0032165832671374505,"302":-0.11338501835734703,"303":-0.010463686061328286,"304":-0.13707734185566803,"305":-0.006694608339932497,"306":-0.10563061541293259,"307":-0.16760795953573326,"308":-0.08996436662084409,"309":-0.10295932927437342,"310":0.022157872959264493,"311":-0.15955573877818557,"312":-0.08005098613665472,"313":0.006793855692304664,"314":-0.039850817550707185,"315":-0.06406552725152224,"316":-0.1276960792824976,"317":-0.1265089785605644,"318":-0.025968169007420747,"319":-0.007848078943852992,"320":-0.046122054295678394,"321":0.011584126422472495,"322":-0.18062232900505157,"323":-0.052816476523623486,"324":-0.026462217250485785,"325":-0.19981616258895915,"326":0.0144246633634834,"327":0.017339860288398103,"328":-0.03731036170450689,"329":-0.033844038425809866,"330":-0.000021906488913831393,"331":0.12229727778025488,"332":-0.07206049469006172,"333":-0.11013661614696799,"334":-0.16228106840369566,"335":-0.23431505159136495,"336":0.000173734484247667,"337":-0.03213714057909865,"338":-0.030011577604224897,"339":0.04913780506702418,"340":-0.039877312048863675,"341":-0.21167716399463854,"342":-0.14475816057593122,"343":-0.14670186471789343,"344":0.1224406305697815,"345":-0.001099613642981275,"346":-0.020539364234642015,"347":-0.036423200829231464,"348":-0.044775234289556674,"349":0.21967416851583338,"350":-0.07063189856046807,"351":0.048393957691299554,"352":-0.004299254246318004,"353":-0.18889143031605046,"354":-0.010556822671123274,"355":0.06101729559381712,"356":-0.04966050956438476,"357":-0.03519090037342469,"358":-0.09008125466950728,"359":-0.21618600638438473,"360":0.10273390706382578,"361":0.02663034146712547,"362":-0.012397529320491237,"363":-0.03874257950367323,"364":-0.05391154809660336,"365":0.004191232906268139,"366":0.07663401424547235,"367":0.12852219820624985,"368":0.038744907488051435,"369":-0.22746928177764678,"370":-0.048901273075197475,"371":-0.05061790007486602,"372":-0.046779383233891476,"373":0.04900026278482616,"374":0.0006767221472603947,"375":0.037390119999033244,"376":-0.08389633060053141,"377":-0.015875414349605755,"378":-0.10931180968644316,"379":-0.03821479533033554,"380":-0.002965350735346722,"381":-0.10023520822854547,"382":-0.0014843617045766089,"383":-0.20429079297983838,"384":0.01211237776590762,"385":-0.03456516481185776,"386":-0.0031854304554215793,"387":-0.18865579815218222,"388":-0.0989172422378398,"389":-0.05859576980714545,"390":-0.03590536582622421,"391":0.019172117201579558,"392":-0.05383017915510273,"393":-0.13489068562273923,"394":-0.1908712830979978,"395":-0.03699984449973053,"396":-0.11459769691406958,"397":-0.01417485270655554,"398":-0.08290546062245378,"399":-0.020459865016546588,"400":0.00023639288282121038,"401":-0.21859246853204342,"402":-0.054278388225358666,"403":-0.08578226417681432,"404":0.0003210892737720096,"405":-0.22934810994015817,"406":-0.080582632541561,"407":-0.11221814884860114,"408":0.014924206242624161,"409":0.014420939326428366,"410":0.14899618268063503,"411":-0.00785094044810887,"412":-0.1300773524308215,"413":0.01875149244402023,"414":-0.15753578977060684,"415":-0.08126863533741914,"416":0.045316247940471,"417":0.04191880775523947,"418":-0.06427819008765796,"419":-0.09126206208882955,"420":0.0038101590569930405,"421":-0.0009139602933980997,"422":-0.01101921503838889,"423":-0.2034088500428049,"424":-0.041516258642746655,"425":-0.08165804827553443,"426":0.06892461977310828,"427":-0.011794574770688345,"428":0.02875758881601152,"429":-0.04282065276942546,"430":-0.09313139796672296,"431":-0.11042830809965822,"432":-0.17833813989965192,"433":-0.07648076356215541,"434":0.2305733836629912,"435":0.046437753540368165,"436":-0.03551217625597312,"437":-0.03706151306253933,"438":-0.12821400425196108,"439":0.09113558369590118,"440":0.036871213789762186,"441":-0.020959462087349997,"442":-0.06608533390980606,"443":-0.02459019645935619,"444":-0.04633107007465811,"445":0.05476964329059313,"446":0.05039314813288453,"447":0.06449575510057567,"448":0.029608529299772507,"449":-0.1936981430295769}},{"sx":1,"sy":1,"depth":450,"w":{"0":-0.04058058456488198,"1":0.0090329107684079,"2":-0.05364976973752333,"3":0.009330787514835478,"4":0.019621926128083087,"5":-0.04882775001759376,"6":0.02613970637433979,"7":-0.0927159156832593,"8":0.06887387150803186,"9":-0.0672365192350039,"10":-0.22953208115986568,"11":-0.05642830421251168,"12":0.013979401194731686,"13":-0.021615705547267737,"14":-0.058081740665627414,"15":0.014692901810530866,"16":-0.02118724241761492,"17":-0.06670229272492173,"18":-0.04853688344637814,"19":0.06043925255407107,"20":0.06285016743730942,"21":-0.007026063990458521,"22":0.00833099387146174,"23":-0.10123754750132956,"24":-0.06508117026319202,"25":0.0419673278271416,"26":-0.019708261599217302,"27":-0.326473567488682,"28":-0.19516961488524223,"29":-0.07342894119400999,"30":-0.018565647672120357,"31":-0.1098136296324067,"32":-0.1020628262926057,"33":-0.060161220878841085,"34":-0.10674478064786004,"35":-0.04157458006684164,"36":-0.07953417658908357,"37":-0.13760122032403524,"38":0.007914871431526378,"39":0.019992802999013074,"40":0.009700481632944515,"41":-0.057708846792238276,"42":0.05605098010119067,"43":-0.08808838511788186,"44":-0.05184706250033584,"45":-0.10364879837818293,"46":-0.21609675765396227,"47":-0.021264724482040195,"48":-0.03454749470481356,"49":-0.010334135391564001,"50":-0.15830713973084926,"51":-0.08996084927330907,"52":-0.19018194342220474,"53":-0.1561194555005614,"54":-0.27711414485944635,"55":-0.3010439555796023,"56":0.0399683679801284,"57":-0.05450936740682803,"58":-0.024138033768793168,"59":-0.157377815894312,"60":-0.05335370236812703,"61":-0.04590306875630244,"62":-0.013869764311296684,"63":-0.04788296102949008,"64":-0.14594566844791382,"65":0.011146559150787952,"66":-0.04847139479765117,"67":0.002732576198114328,"68":-0.10043752153366832,"69":-0.06954246386991829,"70":-0.18528642948756896,"71":-0.06653055749290768,"72":-0.31114195088452323,"73":-0.4281991555450318,"74":-0.05269168532158798,"75":-0.04778402924313638,"76":0.010633744122311864,"77":0.028691863460263072,"78":-0.04832225190633845,"79":-0.060271275111972535,"80":0.03573448000632068,"81":0.05155001002109376,"82":-0.02494087597368098,"83":-0.012090361984231697,"84":-0.058419929769840936,"85":-0.09925196331686977,"86":-0.11278484861075426,"87":-0.07637682396725264,"88":-0.011607832665141147,"89":-0.024455235045928225,"90":-0.049511763667593814,"91":0.051951512421618946,"92":-0.06413790299988195,"93":0.19559230769575411,"94":-0.06919831555436505,"95":-0.09894011493607756,"96":-0.048734474801057644,"97":-0.1130256627261771,"98":-0.03590757940269397,"99":-0.2850852109975668,"100":-0.16674135748322824,"101":-0.07984503926176573,"102":0.008881098397562013,"103":-0.02667057554440256,"104":-0.02316137502583219,"105":0.03923880878067289,"106":-0.11561522753674838,"107":-0.04792336413297274,"108":0.0768079587611753,"109":-0.017802990472060302,"110":0.02358655386034804,"111":0.17283148054102268,"112":0.02569678860050042,"113":-0.2138260952118764,"114":-0.10178841097194351,"115":-0.021143405108499578,"116":0.02045387488718807,"117":-0.3210400688757043,"118":-0.1367944643094544,"119":-0.09406328584739784,"120":0.0633050046970732,"121":-0.03488562703334,"122":-0.07512183585610145,"123":-0.03185413516904078,"124":-0.06909489250522344,"125":-0.05495902327344481,"126":0.03393982671289074,"127":-0.06192209946765907,"128":-0.0994886489888957,"129":0.0876029798716967,"130":-0.07157080749875606,"131":-0.336597541942318,"132":-0.01688954905405617,"133":-0.003238495280751923,"134":0.025807856329507967,"135":-0.14955621775892794,"136":-0.12173952748044292,"137":-0.05680907187922774,"138":0.042921394674249456,"139":0.01691081135954442,"140":-0.015898115569534414,"141":-0.045649157571785136,"142":-0.10789221181049365,"143":-0.12969731921902378,"144":-0.0785526929845012,"145":-0.1436912347009052,"146":-0.021256883515324666,"147":-0.028845119903037203,"148":0.027829956143936442,"149":-0.18018335014979167,"150":-0.0030424980516661213,"151":-0.12136840615774218,"152":-0.060125915995195504,"153":-0.08034783726675511,"154":-0.17547184882815553,"155":-0.07929941003038325,"156":0.06050176628792089,"157":0.06023715510402445,"158":-0.06414702761528521,"159":0.03060277759580852,"160":-0.08957809394813475,"161":-0.04999919050144032,"162":-0.06956923302047449,"163":-0.08517949026870471,"164":-0.08548537367970334,"165":-0.07233466759884372,"166":0.016614584168926125,"167":-0.13278513165083777,"168":0.012928082262705688,"169":-0.10103506199118947,"170":0.07582036608925574,"171":-0.005027501044799494,"172":-0.1681171408114911,"173":-0.11910573185338048,"174":-0.07292461753270321,"175":-0.02574197365225532,"176":-0.14843235022705237,"177":0.0632297420727839,"178":-0.08822493922767344,"179":-0.005917855489527458,"180":-0.06299351040903461,"181":-0.03287742409973007,"182":-0.016200696716611052,"183":0.05830654923468498,"184":-0.013722952209518446,"185":-0.0664209585680877,"186":-0.03217878448419885,"187":-0.12949064264905025,"188":-0.019801644718419425,"189":-0.1484619870026079,"190":-0.1638677275235394,"191":-0.06851812480367643,"192":-0.024970264421952038,"193":0.09977772511118309,"194":-0.058374802962384835,"195":-0.05863786693438362,"196":-0.08677110508268739,"197":-0.013300511319372687,"198":0.009727079918145868,"199":-0.037946630803004776,"200":-0.06099219094330614,"201":0.14123395724485951,"202":0.028126558579157197,"203":-0.018285377111436373,"204":-0.0770224545192129,"205":-0.10914209265519714,"206":-0.02790534088715248,"207":-0.11319097513920069,"208":-0.12288248482961807,"209":-0.14185181923269222,"210":-0.021821080726936656,"211":0.008913307134370978,"212":-0.18002498653056948,"213":0.0034229128261857767,"214":-0.00619322971525417,"215":-0.02061206028032814,"216":0.034087523804327106,"217":-0.058010431483287724,"218":-0.05733696886210644,"219":0.0617403732762156,"220":0.01871381878312709,"221":-0.08658026925458835,"222":-0.06421556455811336,"223":-0.0177197721505971,"224":-0.03310338255673299,"225":-0.13711257039249108,"226":-0.22489061037008296,"227":-0.16907386574977684,"228":-0.0005805503803618728,"229":0.06162747023039772,"230":-0.12469703131373079,"231":0.0343355262027597,"232":0.021983868128566043,"233":-0.05917317046254337,"234":0.03933540848147528,"235":-0.030056169024108185,"236":-0.09459030551317858,"237":0.042192079440545774,"238":-0.002960464139860154,"239":-0.021583645068100957,"240":0.023329304292157266,"241":0.061173581547598575,"242":0.0646310828651243,"243":0.007376651542161369,"244":-0.1780330156011702,"245":0.00876321632880659,"246":0.06448987059353925,"247":0.0013266979239131478,"248":-0.03831665865253639,"249":-0.01849450814149759,"250":-0.003477199067420293,"251":-0.01953256304898585,"252":-0.05860085894336105,"253":-0.03266740228228391,"254":-0.08402873005287813,"255":-0.0188963143259323,"256":-0.04209174747030717,"257":-0.16109301801571727,"258":-0.0756463870165834,"259":-0.034211463592286495,"260":0.015973820768532036,"261":0.01715746761780021,"262":-0.16748712939502128,"263":-0.051570787368605285,"264":-0.01776316984931877,"265":0.004334390115228638,"266":-0.060939455308044864,"267":0.023306793426637953,"268":-0.17231307917278832,"269":-0.009018315877912011,"270":-0.06816858266803236,"271":-0.04556243788654818,"272":-0.0381784714761916,"273":-0.06942617021705287,"274":-0.03767385048846905,"275":-0.26448384938750963,"276":-0.1084875502314105,"277":-0.2148488228380015,"278":0.010844320690018628,"279":0.06569711243721603,"280":-0.18911099570894263,"281":-0.06241245524677232,"282":-0.07349745287609354,"283":0.08152983212842918,"284":-0.11818118131384724,"285":-0.024462846811509998,"286":-0.060080349238015515,"287":-0.018132940456301823,"288":0.04399412386916267,"289":0.013196085681773244,"290":-0.027209693443418503,"291":-0.021938220770786068,"292":0.023947668322695796,"293":-0.020122976775539002,"294":-0.14682183796932263,"295":-0.1569957399595779,"296":-0.039219857276250575,"297":0.03840224626950036,"298":-0.19814383526733415,"299":-0.17348796928703372,"300":0.06854018785514737,"301":-0.007621936218873621,"302":-0.12515464763931944,"303":-0.0011085836338565508,"304":-0.0744768756476631,"305":0.06036130488161163,"306":0.01520486544911026,"307":-0.024888687910635116,"308":-0.2007373213258619,"309":-0.03508955814348598,"310":0.04752976611352915,"311":-0.01165008728610567,"312":-0.12744417516574297,"313":-0.09812912700570568,"314":0.03965397360244709,"315":-0.0360125175695591,"316":-0.21804409902678656,"317":-0.07825231968319674,"318":-0.07932662912882663,"319":0.022862547748671733,"320":0.027574945725727995,"321":0.03287958701313195,"322":-0.11276863738247632,"323":-0.008999985416700851,"324":0.007124992284181121,"325":-0.05318488085765,"326":-0.1647727632255749,"327":0.042264105294060376,"328":-0.04018208503308691,"329":0.0015708084877127102,"330":-0.08625136757094348,"331":0.009390836973838973,"332":-0.017490412088392214,"333":-0.023992434890098367,"334":-0.29797752454032983,"335":-0.0853459595574646,"336":-0.009253193314695965,"337":-0.08679619570864403,"338":-0.047696236795449605,"339":0.04019873443108776,"340":0.02972947919316903,"341":-0.041038405661568494,"342":-0.025763653942995506,"343":0.03720884857558171,"344":-0.17407903263850755,"345":-0.03917385281362389,"346":0.017023702947795247,"347":-0.15842002355157211,"348":-0.1056362599434542,"349":0.056755475832174,"350":-0.03177694371917018,"351":-0.044582149205552965,"352":-0.08504130014859379,"353":-0.021354576291277714,"354":-0.006725485812015983,"355":0.0640541055593482,"356":-0.11017437428027506,"357":-0.01098775941170407,"358":0.020300396870898307,"359":0.0016011791165076352,"360":-0.031038702285533334,"361":-0.08748360730310109,"362":-0.1371838602479973,"363":-0.27015673986874805,"364":-0.02571144291165696,"365":-0.2121584142925094,"366":-0.09177670489367679,"367":-0.274301829254571,"368":0.05150496918480881,"369":0.09724283094588536,"370":-0.22313425742093734,"371":-0.062254647653488746,"372":0.050561801396375075,"373":-0.007801872407376946,"374":-0.07377280557272939,"375":-0.083093472363303,"376":-0.01621035014255414,"377":-0.03628785914650537,"378":-0.07052387053178451,"379":-0.0333469851288317,"380":-0.056236594405761293,"381":-0.11798367593536742,"382":0.022108332573508246,"383":-0.007153303784312625,"384":-0.25379408029288614,"385":-0.2826989908866541,"386":-0.08826316131082135,"387":0.13548525049660856,"388":-0.26414525588534055,"389":-0.0621611213844492,"390":-0.046067303612681104,"391":-0.010311691021161267,"392":-0.08528866979492492,"393":0.0069529486010386525,"394":-0.1496364038282147,"395":0.05758379628737135,"396":-0.008023395619169527,"397":-0.06639740521418416,"398":-0.24872527072570255,"399":-0.02164826401192097,"400":0.04134471515097651,"401":-0.046363468362348864,"402":-0.13796929556132267,"403":-0.13094908879858075,"404":-0.015488654681948436,"405":0.07088504056421106,"406":-0.269022244316315,"407":-0.0468666197854877,"408":-0.012651904355609348,"409":-0.04143255642774892,"410":-0.1266364753931821,"411":-0.030606843531578724,"412":-0.15277516071376415,"413":-0.03146782239130131,"414":0.009424606385342656,"415":0.015761780759227097,"416":-0.26066220710720106,"417":0.05057359430281131,"418":-0.046618040773579054,"419":0.08226884915546795,"420":-0.12392685387530343,"421":0.016847066909500986,"422":-0.007737434160924217,"423":-0.08460983997676609,"424":-0.2648988731276629,"425":-0.05118623801733898,"426":0.036560786989352174,"427":-0.08034155712021976,"428":-0.1062357120709618,"429":0.0213046530004753,"430":-0.05018491998836611,"431":-0.12026483613484272,"432":0.030217878086463652,"433":-0.03225090999509586,"434":-0.3351263171713843,"435":0.0060897860908257296,"436":-0.06034132507480314,"437":-0.09364206839959381,"438":-0.07585704818951407,"439":-0.021068438195511147,"440":-0.0666599255713483,"441":-0.06906470180860157,"442":-0.1030521711040537,"443":-0.17854007564562374,"444":-0.003965666994863151,"445":0.013723871920483601,"446":-0.10339050215707622,"447":-0.0012446414866060574,"448":-0.07071091752967865,"449":-0.00821547547262834}},{"sx":1,"sy":1,"depth":450,"w":{"0":-0.09997104455721749,"1":0.025601872065865512,"2":-0.031803397270937485,"3":0.037311931523172796,"4":-0.017554655487884166,"5":-0.06391109955082297,"6":-0.0021008753036727192,"7":-0.011456317091265001,"8":0.04760366083867631,"9":-0.2091141176248457,"10":-0.08844825716678069,"11":-0.19005583629757544,"12":0.01054358698217123,"13":0.028860170733158927,"14":0.0691053078252565,"15":-0.014951975667645208,"16":-0.07226260902468129,"17":-0.07122673789951502,"18":-0.08772419821233317,"19":0.03449102100460267,"20":0.11854464615381836,"21":0.0008046488194652872,"22":-0.005193211099262339,"23":-0.07356570981819481,"24":0.0150652543171485,"25":0.05251005597163971,"26":0.07893160737900164,"27":-0.20394971166961468,"28":-0.17634039009929595,"29":-0.16815476661159198,"30":0.059284709749234936,"31":-0.02305569763821813,"32":-0.08448876364970798,"33":0.03200801052099809,"34":-0.09710780365354484,"35":-0.029109356810780817,"36":-0.15329525261935975,"37":-0.06784754654496707,"38":-0.029557559633060445,"39":0.08427644006567016,"40":0.019299482889575323,"41":-0.012492146545330792,"42":-0.014434946449041279,"43":0.05958578888546637,"44":-0.01563547880720983,"45":-0.11335771383746929,"46":-0.19702289415985044,"47":-0.26480780307161966,"48":0.061794208105742036,"49":-0.005028925374024133,"50":-0.013785552188291975,"51":-0.07080217346501926,"52":-0.15194356358003516,"53":-0.09567962251580206,"54":-0.11121389931719212,"55":-0.14485714461116897,"56":-0.045921951910226765,"57":-0.08477608385042142,"58":0.042648542450556354,"59":-0.11074660963191936,"60":0.0453856022972298,"61":-0.012086230156546581,"62":-0.03051094127261096,"63":-0.04919354769510482,"64":-0.1892536312503222,"65":-0.17228288699584432,"66":-0.06708946978183619,"67":0.010336427559848932,"68":-0.04299182743355809,"69":-0.0013117520429895635,"70":-0.15405682576986843,"71":-0.07850159873458054,"72":-0.22358042465649647,"73":-0.2739658386264357,"74":-0.13128008782777661,"75":-0.08579268678540201,"76":-0.00010393457164127968,"77":-0.059444749603801535,"78":-0.041037208376763765,"79":-0.11790725507742333,"80":-0.06643058708037825,"81":0.07777661160881474,"82":-0.08082019486331128,"83":-0.10830852064074983,"84":0.02464890117737305,"85":-0.027788892779169367,"86":-0.0596478014961149,"87":0.014453165928807406,"88":-0.08481533955745994,"89":-0.06551983385809376,"90":-0.09425370156173318,"91":-0.05803956881816474,"92":-0.06892810974343644,"93":0.09658178963527839,"94":-0.08672463915293593,"95":-0.045274067105527435,"96":-0.058445070100623824,"97":-0.15356860968508848,"98":0.008906493864496183,"99":-0.19455243733836575,"100":-0.17824806755680153,"101":-0.11598743681189022,"102":0.014961908844559042,"103":-0.060442310283371506,"104":-0.03491259723617445,"105":-0.04492876318157264,"106":-0.010932515096367954,"107":0.04768882725296927,"108":-0.024704757149307196,"109":-0.03927477054502849,"110":0.009443519008091384,"111":0.08733445719237912,"112":-0.059886844469720917,"113":-0.07439834187717884,"114":0.034968566558129646,"115":0.013743384512425781,"116":-0.06507604058246899,"117":-0.19120669340797028,"118":-0.1959751251131552,"119":-0.17708013432872607,"120":0.02763212985750783,"121":-0.033746149839192906,"122":0.03493220536439534,"123":-0.024233502951867925,"124":-0.11155169651520812,"125":-0.054609695427212814,"126":0.00436920561351445,"127":-0.14917383769955347,"128":-0.06601754828569675,"129":0.10243288440723956,"130":-0.02025579424814844,"131":-0.0905569115368174,"132":0.06865756724055125,"133":-0.05853517109357783,"134":0.05695320261761282,"135":-0.06697539824488358,"136":-0.0839894414721376,"137":-0.10841252909544158,"138":0.020798515732008638,"139":0.011176576346868757,"140":0.0022707661941885914,"141":-0.03678526486050394,"142":-0.13748098809185008,"143":-0.13709029572709064,"144":-0.050327284346743044,"145":-0.0994743207673617,"146":-0.06504532415990007,"147":-0.06666640206424147,"148":-0.015760308695274013,"149":-0.16786573252262973,"150":-0.026501725424462132,"151":-0.010701303727798964,"152":0.09732807031064851,"153":0.027316224463160736,"154":-0.04538765297782402,"155":-0.1435235646133834,"156":-0.01961999885235118,"157":-0.007018590919895865,"158":-0.07675628100400364,"159":-0.030617259165389422,"160":-0.02017903158461241,"161":-0.11150293737691422,"162":-0.10029680359632874,"163":-0.31619255112271083,"164":-0.06478017137069844,"165":0.02275908570705503,"166":-0.04193513741342953,"167":-0.10890031839377375,"168":-0.048816049353617184,"169":-0.15021654623328762,"170":-0.045147532016654286,"171":0.1544866809446259,"172":-0.009896872373417671,"173":-0.11645611985439151,"174":0.03999752210221152,"175":0.05501358268655469,"176":-0.05053393655250892,"177":-0.016102166124845725,"178":-0.18719204173369097,"179":-0.1560054223836998,"180":0.007149756517530159,"181":-0.010727332227359379,"182":0.01065954559475449,"183":0.08359984415673911,"184":-0.02812534985165472,"185":0.046696647667875804,"186":-0.026268354120985146,"187":-0.11745218934765282,"188":0.030820615629997203,"189":-0.27233511494881885,"190":-0.0735087973958744,"191":-0.0036224944341004778,"192":-0.07299124633732935,"193":-0.002078000771581417,"194":-0.017598372625690206,"195":-0.002586535151366036,"196":-0.1089054331751338,"197":0.06812483355992838,"198":-0.03331430478182517,"199":0.05067155156414,"200":-0.061996757084655685,"201":0.27224948479520467,"202":0.04790983323508427,"203":-0.03968316806189592,"204":-0.03905962802023993,"205":0.1078828657128075,"206":-0.028433224395009876,"207":-0.3863544648496547,"208":-0.07192874197836828,"209":-0.06042089454049415,"210":-0.029908596215377385,"211":-0.04929585747273624,"212":0.020984013657340837,"213":-0.045831653394300266,"214":-0.1764824103109505,"215":-0.09611145923132187,"216":0.01660080980010115,"217":-0.06424365592691957,"218":-0.052336829851457524,"219":0.1048396421222024,"220":-0.08733918092225224,"221":-0.0873973083289411,"222":-0.0495684917404642,"223":0.08821034486783243,"224":0.0036129796754471198,"225":-0.16939570249615676,"226":0.0065384464711144155,"227":-0.14061980324442802,"228":0.06486919232495778,"229":-0.0581620344426465,"230":-0.09044751249187909,"231":0.04339592142120962,"232":-0.056440630080279,"233":-0.13747154082076388,"234":-0.15601018924159912,"235":-0.08523890207586259,"236":0.036423700620611316,"237":-0.17186639067337578,"238":-0.0076621690381961085,"239":-0.1672234889623935,"240":-0.07020374861164931,"241":0.015708625167113074,"242":0.003626464070472788,"243":-0.009402406565299429,"244":0.007063145223352611,"245":-0.07487194326006294,"246":0.06509795482176288,"247":-0.025927436157851383,"248":-0.10689474396734859,"249":-0.00606419866420506,"250":-0.0171160947409415,"251":-0.12877332678931908,"252":-0.13334201952393254,"253":-0.10394287539349334,"254":0.023046114527062955,"255":-0.1404474470338942,"256":0.007977900205532637,"257":-0.15512599114636622,"258":0.03677655160288096,"259":-0.12824173448077336,"260":-0.005036531671919564,"261":0.09822216315006176,"262":-0.08179029616162546,"263":-0.02315510447940772,"264":-0.04756180316927127,"265":0.015641008445405592,"266":-0.04247106719215592,"267":0.043802300692040434,"268":-0.10724015035370596,"269":-0.02468480379763817,"270":-0.1585796488773836,"271":-0.08397403074124386,"272":-0.005095201235926152,"273":0.0742781509386262,"274":0.010119278305002297,"275":-0.0928151723442523,"276":-0.0016649220978902969,"277":-0.19532823672178778,"278":-0.015370197520569466,"279":-0.2643727275358503,"280":-0.1704879647951867,"281":0.07802400720444166,"282":0.03197804264634529,"283":-0.014150964065181735,"284":-0.09678902644520743,"285":-0.028856106569378873,"286":-0.12749029822614202,"287":-0.020361693553499916,"288":-0.009460210574598829,"289":-0.02018744244289576,"290":-0.010607292393797037,"291":-0.024237326035175553,"292":-0.16575273083792513,"293":-0.038944023645499044,"294":-0.04725214678536727,"295":-0.034828393786252916,"296":0.020636129854097202,"297":-0.21753242881497514,"298":-0.05939702073380929,"299":0.021424275007477185,"300":0.04738994652141085,"301":-0.036249493503081605,"302":-0.02237838672544019,"303":-0.06511086086165707,"304":0.004184502756722317,"305":0.020715705761428158,"306":-0.03528522934655017,"307":-0.0446461650932624,"308":-0.0037453786324308943,"309":-0.04636717515362053,"310":-0.08337547296814458,"311":-0.073494754810665,"312":-0.12502621658845298,"313":-0.015393162059757904,"314":0.04033549379129591,"315":-0.12901756697179761,"316":0.0747597135881272,"317":-0.149712093300263,"318":0.052160360449081164,"319":-0.014576715311596279,"320":-0.120954865013901,"321":-0.05680910367548851,"322":0.059242132836705964,"323":-0.02325772530979458,"324":-0.1418435271674825,"325":-0.09791077321125664,"326":0.06056367576168337,"327":-0.2084350710135034,"328":-0.15143992642148105,"329":-0.04183502064717829,"330":-0.14824848253361894,"331":0.005623187625112731,"332":-0.029157704528507508,"333":-0.04595099967158618,"334":-0.04196807149600235,"335":-0.08559616449859332,"336":0.0002890477961213288,"337":-0.009612801756047505,"338":-0.06355752695582188,"339":0.007760964552415582,"340":0.06229795796319976,"341":-0.09003996458746029,"342":-0.14315376396895274,"343":-0.10919265412487997,"344":0.08286523507467482,"345":-0.23690912042194065,"346":-0.006228660076930068,"347":-0.03832175491719836,"348":-0.014914390492554223,"349":-0.2183304240733689,"350":-0.06843533181821124,"351":-0.0178864613584601,"352":-0.1595861685812462,"353":-0.06474650768447775,"354":0.02519651240145694,"355":-0.08644260359740935,"356":-0.15309967880791175,"357":0.004938148677109368,"358":-0.019330717317508083,"359":-0.02603580524619258,"360":-0.014552203963931537,"361":-0.053659427419563206,"362":0.04758505541325768,"363":-0.126399984395907,"364":-0.13856989787703655,"365":-0.10924079802780816,"366":-0.041529725065584465,"367":-0.15376252237659496,"368":-0.021472433358560975,"369":0.05433696513959195,"370":-0.1192651873640268,"371":-0.026185915655807718,"372":-0.0000639255066297422,"373":0.06570726268317216,"374":-0.12023597686278543,"375":0.031860839443745737,"376":-0.07731382870068652,"377":-0.05820952500579925,"378":-0.007522534444286815,"379":-0.01469762643685639,"380":-0.10583247599352605,"381":-0.21578083542638302,"382":-0.13729577993432127,"383":0.0956437866627583,"384":-0.09234448739189155,"385":-0.055688636066906404,"386":-0.004274524575534372,"387":0.07055740534007357,"388":0.06315073639787538,"389":0.007698188492533225,"390":-0.04034515737621266,"391":-0.025387229934474932,"392":-0.07667645377579133,"393":0.07671581095177156,"394":-0.05033346436742478,"395":0.07896069276293743,"396":-0.04695625862807351,"397":-0.045286976368364026,"398":-0.0003984467279912552,"399":-0.30030299161729024,"400":-0.13148339172656176,"401":0.11214121070131058,"402":-0.14717641857383384,"403":-0.052560478627966735,"404":-0.02415210741707701,"405":0.08469093726766615,"406":0.2037234788350215,"407":-0.06168405818907429,"408":-0.09570949994420101,"409":-0.04001698327562955,"410":-0.20230973001079,"411":0.11060818835985259,"412":-0.029368043743232288,"413":-0.07069998265756319,"414":-0.10282096316804602,"415":-0.06175204349120401,"416":0.033033701616723386,"417":-0.2894150306544823,"418":0.016589312910186206,"419":0.0782468300350755,"420":-0.1850224740153147,"421":-0.053689248248684415,"422":-0.06596518040396168,"423":-0.05621879499010267,"424":0.03241698189685238,"425":-0.05796143927955496,"426":-0.04861389205134679,"427":-0.03555979696096914,"428":-0.10218634036011094,"429":-0.012226813972577178,"430":-0.09215945835223883,"431":-0.08647572866069576,"432":-0.08096613812240162,"433":0.0507345488917933,"434":0.08244262845337069,"435":-0.20483567802992836,"436":-0.08587654221671544,"437":-0.07366974500856245,"438":0.02607237898152503,"439":-0.19524283450877955,"440":0.011751020707051129,"441":-0.06445551843754403,"442":-0.07735438407165576,"443":-0.08574178332191554,"444":-0.009494480556660826,"445":0.0443569916077627,"446":-0.04764039543744153,"447":0.03772383373237498,"448":-0.009652983822244584,"449":-0.062488275508434235}},{"sx":1,"sy":1,"depth":450,"w":{"0":-0.019105285892562898,"1":-0.0372366900109774,"2":-0.07673184273191869,"3":-0.15878357757424633,"4":0.06420075178503762,"5":-0.07313416561936477,"6":0.10110046780808876,"7":-0.03704201959834721,"8":0.073653207934317,"9":-0.07105673433287545,"10":-0.32644379068447343,"11":0.07666441171085168,"12":0.019523579884198134,"13":0.027910873239886096,"14":-0.015296894803011964,"15":0.02853142613822905,"16":-0.04401873281097397,"17":0.03405927264695703,"18":-0.008529245691782966,"19":-0.0360732895432194,"20":0.014650189866338838,"21":-0.1019971450282221,"22":-0.04426664465138739,"23":-0.04304259684075038,"24":0.021750782457503618,"25":-0.1149414499594618,"26":-0.0019498921374742463,"27":-0.16817259799872547,"28":-0.05877294347393887,"29":0.03555410862186302,"30":0.004014924315043066,"31":-0.009330963481694484,"32":-0.04555642414008888,"33":-0.004078665734348091,"34":0.010247573219155507,"35":0.06998067548786263,"36":-0.014807563387306572,"37":0.10312308206666083,"38":-0.032763643943332726,"39":-0.0739016986401841,"40":-0.036639353022182256,"41":-0.07813572565678675,"42":0.09947662711303654,"43":-0.08828228087087847,"44":-0.060283910518242764,"45":-0.14442691502109312,"46":-0.08966994419447252,"47":0.09554951374799477,"48":-0.04512095565661848,"49":-0.035431600061193856,"50":-0.020007890002350155,"51":0.03479255428949525,"52":-0.12618084260443044,"53":-0.06413322834977504,"54":0.019748953564108013,"55":-0.050368975663202795,"56":0.013430696250763033,"57":0.002546308188293141,"58":0.03449196241496053,"59":-0.08869102437976616,"60":0.045618987162767105,"61":-0.00033696361672506394,"62":0.04106279121703761,"63":-0.04245082094106787,"64":-0.033968902831891426,"65":-0.007585545048950989,"66":-0.05160548504267546,"67":0.03923165855630405,"68":-0.08389696228616932,"69":-0.02471904909432337,"70":-0.1303298372613948,"71":-0.07772871444110074,"72":-0.018385839998792897,"73":-0.06330954278470942,"74":-0.10177218068001949,"75":-0.10152608015769302,"76":-0.03999734165876002,"77":-0.08402334560362328,"78":-0.08464406508892175,"79":-0.0311264300735256,"80":-0.013584768773415704,"81":-0.14897735568733037,"82":-0.04206664076915527,"83":-0.031474304168285665,"84":0.010549551799264995,"85":0.013558863642373352,"86":-0.037161715647921784,"87":-0.024835818922708947,"88":-0.10128708108671779,"89":-0.12376826656649756,"90":-0.016084335208591226,"91":-0.051525680451177135,"92":-0.03470870086774106,"93":-0.057245463386211684,"94":0.04851401598690012,"95":-0.15819572403522864,"96":-0.12754474978935149,"97":-0.08706556041179672,"98":-0.0030235270325533058,"99":-0.11742575097162913,"100":-0.1957155048626939,"101":0.00022494745711400087,"102":0.01201787706340369,"103":-0.03521958017251769,"104":-0.020473653709840417,"105":0.06483815176698819,"106":-0.02127090281256222,"107":0.01712517453685494,"108":-0.05871099781287262,"109":-0.12584094399692825,"110":-0.013354080493137407,"111":-0.06417982181221107,"112":-0.07835682348123911,"113":-0.15614548656685448,"114":-0.11879647744309177,"115":-0.21872664440402875,"116":0.0048064080111918945,"117":-0.08515172089518605,"118":-0.15053038967411095,"119":-0.03296011869400175,"120":-0.06246740079504321,"121":0.005918026460223375,"122":-0.05099338542758075,"123":-0.013556218365072339,"124":-0.062081639014089245,"125":0.03162943155213834,"126":-0.0889203710037344,"127":-0.1124149448410572,"128":0.034869083623528675,"129":-0.03363973302952498,"130":-0.09267697071415026,"131":-0.07351068814495523,"132":-0.0477029999471812,"133":-0.20589129375041698,"134":-0.053322461401101896,"135":-0.09340381622395942,"136":-0.061308009681364475,"137":-0.09234572606236072,"138":-0.005024415875380777,"139":-0.051516045421087224,"140":-0.06813177498778042,"141":0.09538528333360556,"142":0.024159971361433278,"143":0.016528117743384026,"144":-0.08251963287296651,"145":0.02857271643246398,"146":-0.042819814307742725,"147":-0.019012046167608394,"148":0.020097668022923128,"149":-0.12292900567033248,"150":-0.051821501213486,"151":-0.2468058952671915,"152":-0.046062320929117294,"153":-0.04199657707495067,"154":-0.017083426549523398,"155":-0.019346108563269758,"156":0.014845426211956092,"157":0.03585055968174299,"158":-0.06346120120939736,"159":0.03131526325165863,"160":-0.03675475836296403,"161":-0.10347854665162955,"162":-0.11069312509381576,"163":-0.0007491934602713878,"164":0.022526439908274694,"165":0.020031452171749897,"166":-0.0008713173313487138,"167":0.012894536133708173,"168":-0.05436333509095912,"169":-0.08126143607218203,"170":0.04890479943759685,"171":-0.0911691843818089,"172":-0.13519479205361237,"173":-0.013519002539714593,"174":0.012531425364301305,"175":0.04260574237816703,"176":0.012338529530084257,"177":0.010738092298741049,"178":-0.08775099663902171,"179":-0.08482986566803402,"180":-0.021014369148052575,"181":-0.0846425236565724,"182":-0.03869724818523766,"183":-0.08639722523412167,"184":0.024131022434956496,"185":-0.2367624702569787,"186":-0.12028471613526513,"187":-0.11789486944050642,"188":-0.05708333118156494,"189":-0.042276868078594494,"190":-0.21603714909015773,"191":0.02455512469547505,"192":0.021409704404362597,"193":-0.0007129953925827054,"194":-0.06960953281077299,"195":0.044560330087289796,"196":-0.03383401497325765,"197":-0.0334797047651757,"198":-0.13281488799770144,"199":0.013984589903821211,"200":-0.003485412019116677,"201":-0.02810254089546326,"202":-0.026366470241636828,"203":-0.1682107200875815,"204":-0.17751305712155094,"205":-0.21691166353013752,"206":0.010978023460297508,"207":0.017771113643218633,"208":-0.15734030560575882,"209":-0.04999903101738338,"210":-0.00416890313799696,"211":-0.036856745943658786,"212":-0.043136760928461575,"213":-0.027928194267963297,"214":0.10345939715771695,"215":0.022026262228781446,"216":-0.12110375597396202,"217":-0.13164127882276508,"218":0.0645222421229276,"219":-0.16727888977417443,"220":0.06385950382442589,"221":-0.027720620803574826,"222":-0.04934362551798382,"223":-0.16474245275374177,"224":-0.03511563651940714,"225":0.01575319747198828,"226":-0.12020927085253154,"227":0.03910440950191939,"228":-0.02536246093516481,"229":-0.024211254946347592,"230":-0.059095376285325345,"231":0.017726814019827272,"232":0.07353144177968193,"233":-0.11598775785257599,"234":-0.12021777057278574,"235":-0.12041103886793961,"236":0.018783820627638132,"237":-0.1489442490255936,"238":-0.008980394533570989,"239":-0.019960163233152008,"240":-0.025864568095862173,"241":-0.19915281839610904,"242":0.09482637689821109,"243":0.05988110070634098,"244":-0.046879755448851035,"245":-0.0340741179136645,"246":0.01855693442383723,"247":-0.0005565980537131334,"248":-0.06586078175606819,"249":-0.04355804352751973,"250":-0.039638256410848866,"251":-0.046639364873383084,"252":-0.09531244576893015,"253":-0.11010871484386417,"254":-0.06632126081014675,"255":-0.09388159966084729,"256":-0.0550114956470406,"257":0.031819936645730164,"258":-0.065778066470723,"259":-0.13122297857204082,"260":-0.03561474583383345,"261":-0.05379843029206109,"262":-0.0707151492590855,"263":-0.011979475990757864,"264":0.034115072889016704,"265":0.039031197166716304,"266":-0.08994781304612116,"267":0.03272186087809372,"268":0.0048407038164114515,"269":-0.06831206730411105,"270":-0.020839034087560215,"271":0.04054446066511571,"272":-0.0778818565361639,"273":-0.1373774994385138,"274":-0.006538588931338503,"275":-0.11205342580635297,"276":-0.26172444426551433,"277":-0.13516404139750157,"278":-0.00255431214015608,"279":0.03753126470357883,"280":-0.1863422294037053,"281":-0.01718499402562287,"282":-0.015366174161852162,"283":-0.010026358959233471,"284":-0.0804079307217523,"285":0.008628198474641337,"286":-0.019575818686893766,"287":-0.06274174764927103,"288":-0.00551238280763301,"289":-0.09360075650309448,"290":-0.09050582435370795,"291":-0.15125339367516621,"292":-0.07523524837499694,"293":-0.022402669856762907,"294":-0.20373163817041964,"295":-0.22183200328438984,"296":0.03339609299277697,"297":0.09586120155611974,"298":-0.16727756698551255,"299":-0.03829071865148208,"300":0.03001819832350669,"301":0.004074497075736403,"302":-0.013630317296890114,"303":-0.008995875286341553,"304":0.042452832023343434,"305":0.000012197717375322364,"306":-0.2784304289669149,"307":-0.06011025289316907,"308":-0.11898054371209113,"309":-0.17879189938957044,"310":-0.06014672448018954,"311":-0.026420888857301993,"312":-0.15017774439020312,"313":-0.28234573354820003,"314":0.0028177465441646767,"315":0.07379063111979005,"316":-0.27779730904775585,"317":0.08960896142773404,"318":0.0631142252677982,"319":-0.045127539698166345,"320":-0.026569797131182276,"321":0.02175120813805404,"322":0.08971408478695228,"323":0.01846882622080379,"324":-0.3391383851156746,"325":-0.06742644733974333,"326":-0.09216764352300523,"327":-0.1876810556917897,"328":-0.07904601811496184,"329":-0.08439974842202976,"330":-0.1588332644742865,"331":-0.23025102044291612,"332":-0.002136574020860139,"333":0.11458539459441741,"334":-0.25273184434696505,"335":0.13112253974030083,"336":0.05330948983321757,"337":0.01611306457774117,"338":0.006227399999232391,"339":0.04677811216596529,"340":0.024649932046423337,"341":-0.008904610273985057,"342":-0.2854743542281969,"343":-0.010691620525668456,"344":-0.03605553270888555,"345":-0.11131951849053709,"346":-0.03098626014412936,"347":-0.13682691432495464,"348":-0.07771303544718794,"349":-0.08130890504150076,"350":0.018288247765076322,"351":-0.045123917084351636,"352":-0.16793705527476538,"353":0.04993741693670743,"354":-0.07878669604917354,"355":0.04208059863765762,"356":-0.08227073264958906,"357":0.03642449183885341,"358":-0.04929492845946612,"359":0.013107576784454658,"360":-0.0045829145585579625,"361":-0.06669168597724567,"362":0.00930927159204489,"363":-0.23276827990089397,"364":-0.005208279234756005,"365":-0.09342195522864113,"366":0.003498941068807022,"367":-0.1497526231605762,"368":0.0514680905273878,"369":0.012567931596889214,"370":-0.1632694105459662,"371":-0.03884067145614997,"372":0.07058999135849055,"373":0.025463935278594897,"374":-0.07731254732617307,"375":-0.013433270951039303,"376":-0.0447296507444819,"377":0.0077806167776132504,"378":0.01712852664256692,"379":-0.05193445210692889,"380":-0.015651789120687983,"381":-0.2429706439373115,"382":0.059074760793205366,"383":-0.02381718626219174,"384":-0.057067935274701484,"385":-0.23558568374164982,"386":0.03937571861997661,"387":0.10100744468599855,"388":-0.23485573664210238,"389":0.0019286713408039856,"390":-0.07411192801406066,"391":0.019339710662650025,"392":-0.058193032512115286,"393":-0.10635526901066891,"394":-0.03423064102918354,"395":-0.06463116942798497,"396":-0.14039375797364714,"397":-0.04224460174128556,"398":-0.1455543086574875,"399":-0.32381727249507986,"400":0.017220579740531042,"401":-0.09634509681495479,"402":-0.038594668489437135,"403":-0.15061735426620282,"404":0.0859967945724054,"405":0.05478388259501832,"406":-0.2757948132892415,"407":0.046574876032334685,"408":-0.05110692572543219,"409":0.06167065884232807,"410":-0.05924669588349737,"411":-0.0440265980415574,"412":-0.060978749805947065,"413":0.032633448110954213,"414":-0.16279191060114478,"415":-0.1008393727932451,"416":-0.13627510915271532,"417":-0.23175882652309637,"418":-0.01103207740700222,"419":-0.1454645410164153,"420":0.0058576054909735675,"421":-0.11088830105770284,"422":0.01842811760535343,"423":0.04640553732985221,"424":-0.3016595382639545,"425":0.02655068483736142,"426":-0.014939326852628429,"427":0.025541358001442076,"428":-0.03409043610433651,"429":-0.1627074806027485,"430":-0.009204196530609271,"431":-0.06253268002334823,"432":-0.12414196024478252,"433":-0.07061199429087614,"434":-0.27567613558184173,"435":-0.15251607979944568,"436":0.024825100377693244,"437":-0.3213090953718462,"438":-0.029760154717758103,"439":-0.09292074246245467,"440":-0.045753566361077136,"441":-0.007736321549982463,"442":-0.10962163612483622,"443":-0.0008945847986488299,"444":0.0239609400205643,"445":-0.01770910119374529,"446":-0.011812376743716203,"447":-0.042064108837387516,"448":0.028391080151633292,"449":-0.04908722042952552}},{"sx":1,"sy":1,"depth":450,"w":{"0":-0.02225565132218671,"1":0.003800733561004657,"2":-0.07538318788182549,"3":0.03452870860361461,"4":-0.055791795299470905,"5":-0.10938497490014304,"6":-0.05155676628889817,"7":-0.07108650107196127,"8":0.0059175778655941565,"9":-0.12814649029058017,"10":-0.23317507147732996,"11":0.09304113244703872,"12":-0.06637528655762173,"13":0.005069448516663395,"14":-0.04684606150221154,"15":-0.02774068494307658,"16":-0.07484522193213432,"17":-0.06322746677851566,"18":-0.05568063329725034,"19":-0.09793209683036436,"20":-0.044438451323085604,"21":-0.12687030150592787,"22":0.003069943805857977,"23":-0.05002155570568393,"24":-0.025791593274383535,"25":-0.039298705182994526,"26":-0.06574513069015143,"27":-0.08199411085889116,"28":-0.06311074137022303,"29":-0.017698552268333334,"30":-0.03337715783014845,"31":-0.01386664313901221,"32":-0.13958518175229293,"33":-0.04359210877451796,"34":-0.028170733802189096,"35":-0.05600383140225259,"36":-0.03402103873923606,"37":0.006863898613463947,"38":0.0032643626837393722,"39":-0.07025868839949326,"40":-0.042349558848665675,"41":-0.1358458631867264,"42":-0.047954950151984796,"43":-0.07368570949870014,"44":0.011511232978943863,"45":-0.0764182411182821,"46":-0.021455835421204432,"47":-0.018764625124413903,"48":-0.05602390475113901,"49":-0.060932912392645346,"50":-0.08889985472782476,"51":-0.012713780094445364,"52":0.018222402933930657,"53":-0.023584047536905708,"54":0.06738445048716492,"55":-0.01628602577279248,"56":-0.08126553644613126,"57":-0.025352320973452618,"58":0.009243666638028248,"59":-0.040744048539185215,"60":0.005947573101110252,"61":-0.06174405113161572,"62":-0.033884283867950414,"63":-0.22338166699522408,"64":-0.07023441886754062,"65":0.038101800600080456,"66":-0.04598483379776898,"67":-0.0022327236935503034,"68":0.0283606815941573,"69":-0.011020482406015757,"70":-0.000616657147823584,"71":-0.04922062666385323,"72":0.010940637389869848,"73":-0.07223171755337755,"74":0.08452841095528303,"75":0.03609139493258809,"76":0.011064625874567626,"77":-0.02985931614516737,"78":0.005134366727907244,"79":0.0030340208295388995,"80":0.034201767225109626,"81":-0.202528808644847,"82":-0.04448496415227712,"83":-0.12258539612579307,"84":-0.09586442219438841,"85":-0.005517301468743442,"86":-0.06859132108687398,"87":-0.02821224051790963,"88":-0.10827009722323179,"89":0.06328493707683742,"90":0.026229914488593693,"91":-0.055947027350740475,"92":0.003510293582708614,"93":-0.0625693162535579,"94":-0.16451722229330476,"95":-0.21257949998612027,"96":0.009555171719363284,"97":-0.07671195090479335,"98":0.07515348709868726,"99":-0.13704417940786676,"100":-0.4114410633628326,"101":-0.043838008183622296,"102":-0.06331559308111621,"103":-0.005106623770826413,"104":-0.08510639496228392,"105":0.011716435841405873,"106":-0.08327156786682216,"107":0.032176564041859576,"108":-0.15118122270918846,"109":-0.1007345802909992,"110":-0.0006578564842359622,"111":-0.03427211077785011,"112":-0.012984199653643773,"113":-0.1435271171053024,"114":-0.0394160958247448,"115":-0.030006464059295777,"116":-0.0124926778765548,"117":-0.12576663036380742,"118":-0.08474681925945252,"119":-0.15740663619366735,"120":-0.020795972253302143,"121":0.027266313063836305,"122":-0.017427683304004554,"123":0.04153402652086305,"124":-0.11905705641220335,"125":0.03679865101040808,"126":-0.001300804282980398,"127":-0.005663271783148948,"128":-0.0756923644711924,"129":-0.08859947282737388,"130":-0.02572154188250802,"131":0.032342534715970525,"132":-0.01524839748246988,"133":-0.043526794082427135,"134":-0.07172028031079422,"135":-0.1788149490176546,"136":-0.0055369162812528095,"137":-0.11221666664566023,"138":0.05213516393272253,"139":0.002770859585593855,"140":0.011454749551443209,"141":0.02070702140174437,"142":-0.02798386315288187,"143":0.09597432339550717,"144":-0.04940612142488504,"145":-0.04238385739104886,"146":0.004790447074987266,"147":-0.08380233819167267,"148":0.03393079009793712,"149":0.021843414677730443,"150":-0.048862778531038986,"151":-0.031470137777513514,"152":-0.008533683463071267,"153":-0.17672747295170052,"154":-0.06410543353998328,"155":-0.04777722231206615,"156":-0.09097781010028042,"157":-0.029086671866197258,"158":-0.08107080548792181,"159":0.01720597947429314,"160":0.024154046147696683,"161":0.0721216373338545,"162":-0.05843384536512203,"163":-0.0201652928996209,"164":-0.05445542588415378,"165":0.012080267117153895,"166":-0.0005805496263067633,"167":-0.0629424642851064,"168":-0.042156732566332816,"169":-0.029135859189250147,"170":0.06643984403835769,"171":-0.21153380362909394,"172":-0.08471632027135896,"173":0.07673551302986334,"174":-0.11496867378305592,"175":0.030275912838614496,"176":0.06463624368157579,"177":-0.07131120991074354,"178":-0.10733199346628124,"179":0.052635898323800355,"180":-0.060806783289625924,"181":0.00028062917450964297,"182":-0.014850287183996932,"183":-0.22998375907436316,"184":-0.04421767849649564,"185":-0.14774345684322446,"186":-0.08366060509264499,"187":-0.18320348265812003,"188":-0.0809082403512314,"189":-0.12487696530528695,"190":-0.35526781274162245,"191":0.006798908918805719,"192":0.026594920923037235,"193":0.008683822762844923,"194":-0.12638953956546906,"195":-0.06076877878380391,"196":0.006581062335501341,"197":-0.02143803571267663,"198":-0.060430804744102846,"199":-0.0518390558280048,"200":-0.030521720279574095,"201":-0.15538703194357964,"202":-0.07566991586968173,"203":-0.1332476873558317,"204":-0.1342552871286375,"205":0.01903731831373011,"206":0.024805657117254357,"207":-0.14153870516116032,"208":-0.05957086645263949,"209":-0.18416254598927176,"210":0.016921517236159703,"211":-0.032506313160413025,"212":-0.08711710598853974,"213":-0.06991231288047935,"214":0.013270196319850078,"215":-0.006794015897638128,"216":-0.04243494532593479,"217":0.09087973448704688,"218":-0.07099943307563984,"219":-0.18566114561917593,"220":-0.015356768281066656,"221":-0.04006772853563753,"222":0.029734801796242803,"223":-0.10146181178174073,"224":0.07840893656671229,"225":-0.20536654557533823,"226":-0.013260094900698363,"227":-0.08798413367753136,"228":-0.05892636052298392,"229":0.03233252427578263,"230":0.033904537086754005,"231":-0.006581027579718248,"232":-0.04229696649792893,"233":-0.051648680448134865,"234":-0.008628917973092426,"235":-0.01492470979271234,"236":-0.06855200925070286,"237":-0.13478479120005296,"238":-0.044089610657074445,"239":0.035168794311387676,"240":0.01991904783185493,"241":-0.06375614393394163,"242":-0.04915991217702189,"243":-0.13905348705723322,"244":-0.08505968266393513,"245":-0.02853680435818053,"246":0.017262853202533013,"247":0.05664186504248578,"248":-0.15458143599560614,"249":0.06516985207846347,"250":-0.011623956575261945,"251":-0.025799091177740655,"252":-0.005693508086884875,"253":0.0044890711384509546,"254":0.008228572970751441,"255":-0.008757004413369608,"256":0.04177757090728168,"257":-0.01877138414082031,"258":-0.03604210955267021,"259":-0.09689541965952814,"260":0.04424353612294998,"261":-0.07577345054563418,"262":-0.09733789521733313,"263":-0.06503589129593058,"264":-0.08614072620805185,"265":-0.01610519624288266,"266":-0.0808289964832972,"267":0.01931786678610098,"268":-0.1263558556049178,"269":-0.0053231270051738375,"270":-0.03470145416202298,"271":-0.07642081391582954,"272":-0.05030228023196895,"273":-0.12065665456841126,"274":-0.03456722837551233,"275":-0.2354696001002422,"276":-0.1512089393231306,"277":-0.1637235051592481,"278":-0.05258350311022899,"279":-0.11830675747557053,"280":-0.37904489593570173,"281":0.05144945680820618,"282":-0.10218532776661396,"283":0.031051281744157236,"284":-0.09018225803378922,"285":-0.007883897083351818,"286":-0.11276414419533845,"287":0.04076434145479371,"288":-0.015950715013598456,"289":-0.008871976769341459,"290":-0.026813148710126727,"291":-0.09501208425540146,"292":-0.043458173536241006,"293":-0.10877901721827146,"294":-0.17934563633217887,"295":-0.14023248048764986,"296":0.01746856122495349,"297":-0.1280522272477757,"298":-0.09205307720518006,"299":-0.07607571254526774,"300":0.057226694113449855,"301":0.03971140509526342,"302":-0.08276024472845195,"303":-0.025704094741214586,"304":-0.13054590882097017,"305":-0.0637746855418237,"306":-0.10100493592710805,"307":-0.1534483260471908,"308":-0.060590784431554065,"309":-0.15653479367756837,"310":-0.02512098423514373,"311":-0.037832523048480976,"312":-0.11408608922761784,"313":-0.06727090953712155,"314":-0.058373689039373046,"315":-0.0007940873997582028,"316":-0.10313245658824444,"317":-0.02928058299202076,"318":-0.00972839679226069,"319":-0.02319352311981459,"320":-0.11976157626736113,"321":0.04646107744070349,"322":-0.08173031209782106,"323":0.013277377859108501,"324":-0.12191908523981883,"325":-0.0696261384911044,"326":-0.049212457790555206,"327":-0.2653512722856425,"328":-0.01843543398136033,"329":-0.05992162287926219,"330":-0.09690251293427869,"331":-0.10888901891417828,"332":0.0036147298837218966,"333":-0.20176226262752756,"334":-0.03160003564098952,"335":-0.11602514470473434,"336":-0.02517702997651299,"337":-0.01462709168845317,"338":-0.04163715634936797,"339":-0.019216140491915158,"340":-0.020159956259565206,"341":-0.1279628004823191,"342":0.04379926450702884,"343":-0.12323658243415642,"344":-0.045406653931652025,"345":-0.09876022617094461,"346":-0.041674680330498884,"347":-0.025129480944746114,"348":-0.08699592685993954,"349":-0.15198536666698415,"350":0.04590101847385946,"351":-0.04679896010418185,"352":-0.08554357302248314,"353":-0.009644960989856064,"354":-0.004501859616232514,"355":-0.06606729109980503,"356":-0.03310521898899443,"357":-0.04103689794772257,"358":-0.13781345856948835,"359":-0.039444542219499626,"360":-0.08838529051381207,"361":-0.005481348588814894,"362":-0.005391031761814817,"363":-0.032889757612298405,"364":-0.03171608881598349,"365":-0.0939650607676724,"366":-0.04418927565323854,"367":-0.07864618450967757,"368":-0.03728517523892534,"369":-0.13016623049491516,"370":-0.15742742943076807,"371":0.00880103191669542,"372":-0.015012325203608347,"373":0.033008462101597975,"374":-0.18283063959634505,"375":-0.05920628198898736,"376":-0.049050253947427354,"377":0.0369228125787988,"378":-0.053803289214247194,"379":0.006298710905085006,"380":-0.07812479027105113,"381":-0.16854650809583654,"382":0.06955098412905741,"383":-0.22564248667796183,"384":0.07683609221212563,"385":-0.14326609050448377,"386":-0.04093748134752327,"387":0.01404122165094909,"388":-0.03724103789920566,"389":-0.009855668250973662,"390":-0.026089946203828977,"391":0.0021356450599057447,"392":-0.1716047896136394,"393":-0.008659817316849281,"394":-0.07140521577543676,"395":-0.057267518162932664,"396":-0.1125933178257712,"397":-0.07311320440991577,"398":-0.053896891187755834,"399":-0.15922884670175988,"400":0.026204893221206144,"401":-0.05013015767412728,"402":-0.03492864880481426,"403":-0.10239193039769,"404":0.009435607717054541,"405":-0.06709693437146796,"406":-0.07253580581427979,"407":-0.02574141226070931,"408":0.010946000055806138,"409":-0.040565455559498344,"410":-0.03806137269012135,"411":0.01676084723455984,"412":-0.08694466612812206,"413":-0.011681305971136473,"414":-0.12232756152042863,"415":-0.003654718896830809,"416":-0.026396859365772362,"417":-0.23436934665388365,"418":0.017474155233467115,"419":0.021447461905984257,"420":-0.11279861035865534,"421":-0.24723814432869176,"422":-0.03405808203470569,"423":-0.031486592844819666,"424":-0.0962220265464469,"425":-0.04973692658317046,"426":-0.07280728681457513,"427":0.09848220398163192,"428":-0.026592656278319176,"429":0.04984698543843581,"430":-0.1635423020605077,"431":-0.07974628926951666,"432":-0.11166940948830825,"433":-0.06507982625109959,"434":-0.004636219183336317,"435":-0.11421549662108194,"436":-0.031322511961098,"437":-0.060323398492057353,"438":-0.07158248531800752,"439":-0.1500674423316214,"440":-0.03898559196399424,"441":-0.06939569903232325,"442":-0.10247323133300608,"443":-0.07423096762102516,"444":0.03869103312230261,"445":-0.0022341322564428776,"446":-0.09811254593549787,"447":-0.09078644672119195,"448":-0.147789106024133,"449":-0.11308614999516241}},{"sx":1,"sy":1,"depth":450,"w":{"0":-0.02228834819818271,"1":-0.0538719114880427,"2":-0.03558153927910631,"3":-0.007995995297229766,"4":-0.05969377688342636,"5":-0.022740033060219062,"6":0.04939102974531604,"7":0.010854642963901503,"8":-0.016824848590827706,"9":-0.10643545940935478,"10":-0.0748399145223143,"11":-0.20546510276885085,"12":0.01958555165724063,"13":0.03386115188292505,"14":-0.026572057318338706,"15":-0.04317898936045226,"16":0.017606426730592453,"17":0.0008485399336737278,"18":-0.067370194045047,"19":-0.05899321452057468,"20":-0.030212507219363607,"21":0.025732641254387727,"22":-0.007144035552932661,"23":0.012181831395391187,"24":0.0023522049791512224,"25":-0.11360989440209662,"26":-0.014643324560689903,"27":-0.02757979451890218,"28":-0.08204301665941836,"29":-0.14190684850691493,"30":0.025543175507624936,"31":0.009842303977245748,"32":-0.0376805287304415,"33":0.003264716959546977,"34":-0.0367002957842774,"35":0.014188467260945862,"36":-0.012059427891569215,"37":-0.09934303448898317,"38":-0.044803303805647676,"39":-0.08668617777166898,"40":0.041914211958669935,"41":0.027982649627467923,"42":-0.06785145596243662,"43":-0.08876536832734842,"44":-0.03617054132816774,"45":-0.013571529894809399,"46":0.008140426444366225,"47":-0.08773840498172575,"48":0.0731049245022275,"49":-0.03649105656036841,"50":-0.1353364905492862,"51":0.01710873015253033,"52":-0.09487204023285033,"53":-0.004760119296804729,"54":-0.012316684785176557,"55":-0.10385498286424567,"56":-0.07590913392780262,"57":-0.0026780881129103056,"58":-0.04789561483315776,"59":-0.044494507730032856,"60":-0.022181308890395303,"61":-0.05193714908900404,"62":-0.01007870947679021,"63":0.06219228738697527,"64":-0.09260950226469628,"65":-0.1266442960756501,"66":-0.11721829587139847,"67":-0.07264245702497146,"68":-0.14471623913020343,"69":0.002181537570344889,"70":-0.027367198909325995,"71":0.020250835560088692,"72":0.04006169146628562,"73":-0.07983452960471919,"74":-0.025572560215770368,"75":-0.10364265691744455,"76":-0.04934077533874583,"77":-0.05678885462199582,"78":-0.0169068413660927,"79":-0.10888649941526397,"80":0.004741429713284305,"81":-0.09368073178953247,"82":-0.03529768235705516,"83":-0.023964168850113047,"84":-0.023899916986150647,"85":-0.0057769832373070935,"86":-0.05814065061659534,"87":-0.007296868090796925,"88":0.03596929704324714,"89":-0.12606797098403585,"90":-0.013044143193806772,"91":-0.11247625537054667,"92":-0.11057782704897998,"93":-0.04554867364529826,"94":0.03561885188684388,"95":-0.051214443321285406,"96":0.0038224432950104206,"97":-0.12112810717668439,"98":-0.03974035322308171,"99":-0.141696625939774,"100":-0.1387524710595965,"101":-0.08346725643419536,"102":0.006725365692298901,"103":0.046253618635392554,"104":-0.03812180463369219,"105":-0.12186812064349992,"106":-0.0720340303516755,"107":-0.04210086689363396,"108":-0.028241347825032383,"109":-0.07726669043840974,"110":-0.030062084693755268,"111":-0.008683388904697359,"112":0.050793191364525564,"113":-0.10354936228993794,"114":-0.005359767692295129,"115":-0.22772068885428423,"116":0.049267044949399055,"117":-0.0460272893656059,"118":-0.1039683008559662,"119":-0.09574938201835818,"120":-0.01645296905518981,"121":0.021293185610188534,"122":-0.13670758853423615,"123":0.013550363174173794,"124":-0.0476228337933727,"125":0.0595622170747471,"126":-0.05120633967055166,"127":-0.11503396847276388,"128":-0.10029650108339418,"129":-0.06317842904464738,"130":-0.057724083251517344,"131":-0.010567394065812682,"132":0.02637426258262541,"133":-0.21188141015234993,"134":-0.10727611871242043,"135":-0.09257407568891167,"136":-0.14775709817756927,"137":-0.08481379783306246,"138":-0.06811173448223792,"139":-0.016253690182301623,"140":-0.052608110449987804,"141":-0.014491244710421259,"142":0.04502206272721334,"143":0.014693638010205137,"144":-0.06896029482076056,"145":0.004658271599624264,"146":-0.023008684334016833,"147":-0.12164779920933369,"148":0.1110063447908638,"149":-0.07015423490783253,"150":-0.13814783255590085,"151":-0.1382576098932175,"152":0.09153652117272693,"153":-0.011557214411782252,"154":-0.034042332660299345,"155":-0.06809855089588539,"156":-0.09896667528848013,"157":-0.018633663238309946,"158":-0.015383068853873581,"159":-0.08949917490249473,"160":-0.02763079304021876,"161":-0.021780664952842622,"162":-0.06765210778639967,"163":-0.09055499536785282,"164":-0.11671993844641569,"165":-0.04224741938326398,"166":-0.013411902215552962,"167":-0.04813237495558397,"168":0.004706171966970086,"169":-0.10230950423874532,"170":0.024704450015982628,"171":-0.08616428756990874,"172":-0.003064382456875349,"173":-0.041576486296393184,"174":-0.05025492139356114,"175":0.045096889891687426,"176":-0.10823014722904266,"177":-0.06728614559071068,"178":-0.12648698354853427,"179":0.0016977698279522053,"180":-0.0038447881158454995,"181":-0.0840769907606223,"182":0.04018267816656993,"183":-0.12276695904708794,"184":-0.04975427414450714,"185":-0.07102821261829614,"186":-0.04403159197412737,"187":-0.10148276412835666,"188":-0.014577309316573235,"189":-0.040276245920841516,"190":-0.22757412672134444,"191":-0.1078784834942359,"192":0.03856885895765055,"193":0.05996511337868977,"194":-0.08013558640092056,"195":0.007448565260927135,"196":0.01637224332599091,"197":-0.05944504460251756,"198":-0.0931257738006447,"199":0.019864665845218888,"200":-0.026104172035934594,"201":-0.14035595629095696,"202":0.011211397895649683,"203":-0.18614132815650536,"204":-0.06281798163759825,"205":-0.01737937356109544,"206":0.10231141295729358,"207":-0.09658531214242505,"208":-0.1726059263607287,"209":-0.07178943972158387,"210":-0.04176169090157387,"211":-0.003276115970783576,"212":-0.12228998455607788,"213":0.10397389477653143,"214":-0.0827518619709793,"215":-0.008217970273572083,"216":-0.1340642670587612,"217":-0.08476400858519378,"218":-0.1346439624284398,"219":-0.18421756480646811,"220":-0.0038831986433540107,"221":-0.10737735623679241,"222":-0.029177542144495965,"223":-0.143511410413813,"224":-0.03731384718771875,"225":-0.15734918392276537,"226":-0.05507405095112298,"227":-0.12987486887889604,"228":-0.04039462078191815,"229":0.04442047017790625,"230":0.004960848870566919,"231":0.1320861484075779,"232":-0.0907047355337006,"233":-0.010084168505924394,"234":-0.05656840925637673,"235":-0.08310579007975187,"236":-0.11123535945174921,"237":-0.11911035850599908,"238":-0.11799810965009781,"239":-0.06544330621468475,"240":0.024443130722233808,"241":-0.08699949827208725,"242":0.018772601703062962,"243":-0.04617972090499709,"244":-0.09189254973537538,"245":-0.03427409825939253,"246":0.022311261687572435,"247":0.008017974065369724,"248":-0.060479061329725,"249":-0.0574789634767703,"250":-0.049485040023734765,"251":0.04593717451771332,"252":-0.05703982326855417,"253":-0.12318020109824177,"254":-0.015344425200773804,"255":0.009091217005150722,"256":-0.08260011374258512,"257":-0.060007924149370576,"258":-0.011978432517557347,"259":-0.05053893310526854,"260":0.07794576980630001,"261":-0.057769601125406495,"262":-0.13905220526583867,"263":0.008407787310695318,"264":0.03955632364790385,"265":-0.004504332173127618,"266":-0.11488459801034308,"267":0.031145407266203413,"268":-0.030603496150857747,"269":0.0713591158418053,"270":-0.025475471651692803,"271":-0.03798446312462368,"272":0.002870390680747106,"273":0.026425833903265285,"274":-0.007309603131418069,"275":-0.057830005556500155,"276":-0.12583350670001178,"277":-0.14915519034442246,"278":-0.021866754038010767,"279":0.028123225569326598,"280":-0.2674732860368518,"281":0.04390078599260175,"282":-0.04335047318285712,"283":-0.06550311735192768,"284":-0.024383252150349057,"285":0.016439276181425194,"286":-0.03130558076456123,"287":0.020709887673983546,"288":-0.049759713445051965,"289":-0.037556485154867314,"290":0.050304191003501864,"291":-0.07873108588283007,"292":0.04059953780487324,"293":-0.16841382498551652,"294":-0.03905830536380674,"295":-0.12005305586125929,"296":-0.02120750393953206,"297":-0.021126270221329835,"298":-0.09149918206603808,"299":-0.03720798723968948,"300":0.0778952662150726,"301":-0.024020735020226683,"302":-0.08281001127436831,"303":-0.06541088053055104,"304":-0.02804407495228205,"305":0.004154360374714258,"306":-0.08841355559817819,"307":-0.09048897454132544,"308":-0.062457772957611214,"309":-0.02123448061272521,"310":-0.04048310021908349,"311":-0.1262206994654838,"312":-0.0709291921794622,"313":-0.16267882859405247,"314":0.0022942915254721263,"315":-0.008722487890858869,"316":-0.1556918749548346,"317":0.0036538968036799414,"318":-0.042805239617211166,"319":-0.0005903998232358874,"320":0.022806184436672365,"321":-0.017305233060322184,"322":0.015192847947935424,"323":-0.12863446887643196,"324":-0.06800508247208535,"325":-0.08878316624147152,"326":-0.02707537665809474,"327":-0.026569101763405323,"328":-0.016940903140477057,"329":-0.07025020941683487,"330":-0.05566955405677454,"331":-0.08724108434715834,"332":-0.045162289478193916,"333":-0.10842204781960267,"334":0.005540163022819792,"335":0.06410227789739306,"336":-0.08619444609505897,"337":0.052924487838808223,"338":-0.11386004929684627,"339":-0.04663463542544864,"340":0.027191869040447143,"341":0.01572572157504155,"342":-0.05655191478955915,"343":-0.11339983470086798,"344":-0.07091759470191983,"345":-0.09423524739154683,"346":-0.03472945313891969,"347":-0.05941347291679458,"348":-0.055875878694777344,"349":-0.14532580988817853,"350":0.03612384275497427,"351":-0.09370068177685359,"352":-0.07754774040441846,"353":0.03609474932186065,"354":-0.07201786381893484,"355":0.06011214628767734,"356":-0.11708621389003594,"357":0.09064238430554188,"358":0.013384418324342144,"359":0.06179483183342662,"360":-0.004819735235493421,"361":-0.033815109171921744,"362":0.09367291171911273,"363":-0.0491391198162945,"364":-0.05803291705984447,"365":0.005271862438188695,"366":-0.005607999561030103,"367":-0.1311388521082799,"368":-0.059465164872487625,"369":-0.1166517911763297,"370":-0.1263146804769756,"371":0.0031304241158295045,"372":-0.013008653861640662,"373":-0.07672328477702753,"374":-0.1038844895385111,"375":-0.08159714433344831,"376":-0.0905740808047322,"377":0.08801829102194847,"378":-0.05666356099267431,"379":0.009072690564189514,"380":-0.12067383715197497,"381":-0.12320527051916308,"382":-0.06312466245427792,"383":-0.06985810142326788,"384":-0.08083043282584693,"385":-0.06972551334590688,"386":0.027062455836204532,"387":-0.07272922235580503,"388":-0.0779884150150269,"389":-0.11816848900896988,"390":0.0358022833045692,"391":-0.03824683904172263,"392":-0.10137557765406019,"393":-0.05685005706342288,"394":-0.028148127095268975,"395":-0.021210179408131382,"396":-0.1268828387950361,"397":-0.10014752173594071,"398":-0.08496843740925063,"399":-0.11006640638654051,"400":-0.05363720516590209,"401":-0.15650490168095404,"402":-0.040077488828558785,"403":-0.12102963840005428,"404":-0.027142938878139074,"405":0.0019631288470880605,"406":-0.07289279645260371,"407":0.06077239685431088,"408":-0.038079587246253856,"409":0.046135977806233214,"410":-0.058816949622430614,"411":-0.008226206880722484,"412":-0.04552945590918157,"413":-0.039356034503653096,"414":0.09574987847322952,"415":-0.057284520715488535,"416":-0.010743365459025109,"417":-0.10063797459960439,"418":-0.057979591503820024,"419":-0.07615265122247702,"420":0.043505575374271396,"421":-0.11571994495276905,"422":0.0040133462514701235,"423":-0.19327257981267945,"424":-0.05879976651815379,"425":-0.022202480521609277,"426":-0.024884985754068684,"427":0.009519646413235877,"428":-0.08980564470188071,"429":-0.0009600626028462807,"430":-0.08742297783590092,"431":-0.10506366845138942,"432":0.009130332975646445,"433":-0.08021740587431013,"434":-0.06464552503188592,"435":-0.09271072878470583,"436":-0.08174189178933837,"437":-0.030636164457138345,"438":-0.01840181512672455,"439":-0.1279014281717393,"440":0.042734941039442344,"441":-0.07346493237757858,"442":0.06126806359913193,"443":0.004861324415815477,"444":-0.05956976011105425,"445":-0.055088915827746394,"446":-0.11217333213425303,"447":-0.04020711797213782,"448":-0.1129260289196085,"449":-0.08305074395729976}},{"sx":1,"sy":1,"depth":450,"w":{"0":-0.030356678933888798,"1":-0.05079822180329446,"2":-0.006482194606834975,"3":-0.03297684429642615,"4":0.00671546367526376,"5":-0.046960896196341285,"6":-0.058825033596762596,"7":-0.011682678971502857,"8":-0.00455846225970872,"9":-0.0648472951046487,"10":-0.12007481544700777,"11":-0.02028071121841422,"12":-0.013979756348769929,"13":0.05580615067301198,"14":-0.10178616032944847,"15":-0.007403687392383257,"16":-0.06380820558484496,"17":-0.030430387905014407,"18":-0.06280915451801296,"19":0.007943056984917176,"20":0.10662677102636794,"21":-0.07608927641917547,"22":-0.050097985405831436,"23":-0.08001493097210231,"24":-0.02154817446727372,"25":-0.153168249488935,"26":0.0057784095264336865,"27":-0.11191767023749515,"28":-0.028921898947999253,"29":0.036699843439565685,"30":-0.04198368508840752,"31":-0.00003481745691684754,"32":-0.09160611250354567,"33":-0.03909986791273435,"34":-0.026544999243698502,"35":-0.07171098321604122,"36":-0.1366874324923641,"37":-0.06303689795791617,"38":-0.058946753857116424,"39":0.044525465893462915,"40":0.042020744343997114,"41":-0.08289834957997168,"42":0.060886070867028345,"43":0.03609152817670175,"44":-0.032337123385465315,"45":-0.1200492260730814,"46":-0.050519501298231365,"47":-0.061273793014134575,"48":-0.008555079197150369,"49":-0.012374434320035328,"50":-0.0895067212787883,"51":0.0161138107631376,"52":-0.026406311311346388,"53":-0.0569664152890775,"54":0.016011039606161494,"55":-0.0738077161146703,"56":-0.04479330372199514,"57":0.014749000033525595,"58":0.052567378257516006,"59":-0.0927810504119428,"60":-0.018319652822778837,"61":-0.005159354212156577,"62":0.05583540858319681,"63":-0.05734415877320125,"64":-0.07331734270166504,"65":-0.005343857606875836,"66":0.06086384437250729,"67":-0.058668090789297696,"68":-0.03746718282712415,"69":-0.03433236202374789,"70":-0.0012642415708205258,"71":0.027332075762537458,"72":0.006686731068400662,"73":-0.14360958880805755,"74":-0.0024857634956843297,"75":0.004701259376259618,"76":-0.09143367796834079,"77":-0.05823584416422952,"78":-0.011141931135249332,"79":0.006791815922774424,"80":0.016045779845040697,"81":-0.12948801550087471,"82":0.014917679930074278,"83":-0.02763218237120359,"84":0.00891544843929163,"85":0.07316342572919775,"86":-0.050973715967550765,"87":-0.019600596219067398,"88":-0.050105824707149325,"89":-0.02744487437176794,"90":-0.07397255613407472,"91":0.02166026104200077,"92":0.03822154107660707,"93":-0.006804929361388478,"94":-0.06449476043828736,"95":0.030556931348000315,"96":0.008410865672575736,"97":-0.03499027045304895,"98":-0.011570294047924565,"99":-0.053463354936987645,"100":-0.21243800367752,"101":-0.0623188356987476,"102":0.0022139651637423804,"103":0.00211541550086616,"104":-0.031093507380018922,"105":-0.11795534933089082,"106":-0.07685152161901584,"107":-0.012000036967111423,"108":-0.018993698597426528,"109":0.07144081828684802,"110":-0.04632522527231354,"111":-0.013985541849914724,"112":0.12241819491971138,"113":-0.2001422028701432,"114":0.02154969904553395,"115":-0.016066122983417752,"116":0.05218118016164979,"117":-0.09029942702042999,"118":-0.07296590099965711,"119":-0.125164845339217,"120":-0.01656802161164805,"121":-0.007334369537803803,"122":-0.09702335037387799,"123":-0.08447869535441714,"124":0.006410821176472467,"125":0.012096092466669255,"126":-0.11445568868211578,"127":-0.04496923513852367,"128":-0.11523877326142341,"129":0.037867703929261455,"130":0.017520276151010677,"131":-0.07322073064028134,"132":0.0025249778439076476,"133":-0.15159762887497,"134":-0.0492088678320469,"135":-0.17270718740286284,"136":-0.12532071037982484,"137":-0.13970904396247086,"138":-0.05149311244385108,"139":0.004023338584102561,"140":0.04979809430855663,"141":-0.05669118813643269,"142":-0.05095804376617938,"143":-0.04874608536616984,"144":-0.06724286499177765,"145":-0.1603236078242595,"146":0.02333436598413186,"147":-0.11416574035614505,"148":0.013052007513602356,"149":-0.04697490512666202,"150":0.05039217777235383,"151":-0.05928615773082856,"152":0.016782871958156483,"153":-0.07250915685086234,"154":-0.1015600114228364,"155":-0.08286623447121785,"156":-0.006031743877615886,"157":0.0009725288787348623,"158":-0.08239075564750752,"159":0.031257823404174476,"160":-0.0265193783373536,"161":0.04135808302087811,"162":-0.09498237203969578,"163":-0.14933712394953527,"164":-0.03948549881595168,"165":-0.12036269291353173,"166":-0.005669186595667294,"167":-0.10517524162950387,"168":0.01632241045823904,"169":-0.14850380325012794,"170":-0.047403385430062436,"171":-0.08920704215112144,"172":-0.10621480185822475,"173":0.005173281468918412,"174":0.048540896490857716,"175":-0.06957651399093763,"176":-0.04204454004120884,"177":-0.027796471755567424,"178":-0.009513494427220283,"179":-0.04088978024384534,"180":-0.0325948417631776,"181":0.007400520205797275,"182":0.038969890091099926,"183":-0.11257997750906419,"184":-0.014852119773060599,"185":-0.0844023320747599,"186":-0.007933575112876654,"187":-0.19503349048065335,"188":-0.0694587498574027,"189":-0.0799463992873995,"190":-0.3081907684065072,"191":-0.003551051884833301,"192":0.017355743288659894,"193":-0.014943700703158131,"194":-0.07549353238037725,"195":-0.04236263031700119,"196":-0.057011126016555475,"197":-0.03405890290630656,"198":-0.05541495245167099,"199":-0.005574448363533671,"200":0.04640385101732537,"201":-0.11138841889757059,"202":0.12486005915424517,"203":-0.14345549716444522,"204":-0.05661028745577768,"205":-0.11675592880363107,"206":-0.01885444485182998,"207":0.0022123168665233723,"208":-0.09426235757327185,"209":-0.15636239846499675,"210":-0.010434610958312046,"211":0.01530695740319444,"212":-0.008819391149311585,"213":-0.028669822288479224,"214":-0.0803473365026277,"215":-0.003464279668216792,"216":-0.1424833305843247,"217":-0.07747630474819658,"218":-0.006849313512816728,"219":-0.10799471831728027,"220":-0.03679708640552986,"221":-0.13111798255133814,"222":-0.0711086425721246,"223":-0.04774708742645543,"224":-0.009070780924465326,"225":-0.056400993364866606,"226":-0.026999611271218412,"227":-0.14701042770665249,"228":-0.000886123191122002,"229":0.037940877979581886,"230":0.003346937035376298,"231":0.01582112329359486,"232":0.03679829549072659,"233":-0.006645131948310735,"234":-0.1115679960677575,"235":-0.23437347599791478,"236":0.015359081215003581,"237":-0.09665558426436188,"238":0.08710841846005174,"239":-0.03822286414828749,"240":0.006423474226305769,"241":-0.12597016258303875,"242":-0.005762877607591249,"243":0.01697491124259698,"244":-0.012390265728672063,"245":-0.09056462400003015,"246":-0.02070016538592222,"247":-0.013710066224734035,"248":0.00006686696962667541,"249":0.039084552878175145,"250":-0.005056648124663947,"251":-0.04087258261151958,"252":-0.1454114540172786,"253":-0.10894613324007463,"254":0.024175953406577456,"255":0.0003176566543055179,"256":-0.02304019010903252,"257":-0.034487286429667106,"258":0.034995485002563706,"259":-0.10637340125626307,"260":0.007664663257079778,"261":-0.05830741506711673,"262":-0.07814990699768247,"263":-0.024603125879214847,"264":-0.04233866238358532,"265":-0.023840047837449824,"266":-0.10303202100271257,"267":0.03429556675158805,"268":0.006909668255429993,"269":-0.04950325647647292,"270":-0.02379482765500302,"271":-0.04847689472189789,"272":-0.013738891157577007,"273":-0.15178930907468527,"274":-0.04466758070339796,"275":-0.09642607107430486,"276":-0.08030593708739948,"277":-0.13367695352458397,"278":-0.02975441737460661,"279":-0.11676348695318761,"280":-0.1362825091989796,"281":0.0257403853317798,"282":-0.021999277280189987,"283":0.07657908039793875,"284":-0.05749905293533423,"285":0.012956029364596442,"286":0.03093823938301669,"287":0.0275661858568755,"288":0.0939127742635996,"289":-0.07194841879401245,"290":0.04889658576758015,"291":-0.14101972123402584,"292":0.058660195135332015,"293":-0.07060874309197764,"294":-0.016594523304345583,"295":-0.20560401598272077,"296":0.005726162372852182,"297":-0.08582474018368717,"298":-0.13027037850750528,"299":-0.07994166238582308,"300":-0.006486618216494657,"301":-0.026624735912536446,"302":-0.07611762360601176,"303":-0.052903998348284874,"304":-0.10446577301294141,"305":-0.0597024729960304,"306":-0.04832848409987366,"307":-0.11528775582454447,"308":-0.07106861664063553,"309":-0.24844754703006708,"310":-0.05046151937909192,"311":-0.007542316331578902,"312":-0.007689395469298888,"313":-0.22521036257223262,"314":0.07359122653139265,"315":-0.005525964475265296,"316":-0.1560131861293822,"317":-0.14707185080222523,"318":0.005977645072992515,"319":-0.05952205045322673,"320":0.0077349552429712325,"321":0.008519427160951632,"322":-0.05113997387276023,"323":-0.008314714847191729,"324":-0.1803697830605594,"325":-0.11592011824459579,"326":-0.07251613083616763,"327":-0.07524747612535335,"328":0.03949846980013496,"329":-0.12319068042840219,"330":-0.040213846877227094,"331":-0.1982545502311034,"332":0.06262396486359402,"333":0.002508198904300372,"334":-0.06369474493619179,"335":-0.041677521653410946,"336":-0.07632584287150943,"337":-0.016636727646576803,"338":-0.04370490704838025,"339":-0.055408158850303944,"340":-0.024215229376474863,"341":-0.0177976977006983,"342":-0.2384284324304422,"343":-0.10021804867437788,"344":0.0526817697828434,"345":-0.07280946014916537,"346":-0.007373154396339836,"347":-0.031552414762051985,"348":-0.02980779201037165,"349":-0.15326679355277134,"350":0.014958094929116043,"351":-0.054715957840037924,"352":-0.0529531510369853,"353":-0.06471916516916505,"354":-0.0017347808927111223,"355":0.017919778557194593,"356":-0.07714557960930941,"357":-0.0030852935273217364,"358":-0.08824505681988734,"359":-0.051915624587104615,"360":-0.09634574584978121,"361":-0.017256794132821947,"362":-0.020984817423150885,"363":-0.1285966132826695,"364":-0.05678627571354734,"365":-0.04526284547944289,"366":-0.05067855260479095,"367":-0.08176029513952905,"368":-0.017373503767332616,"369":-0.05810974794824571,"370":-0.13568930977552304,"371":-0.032568050461375,"372":-0.0651893509217736,"373":0.0032338015740983345,"374":-0.007890695549662392,"375":-0.02528183881279611,"376":-0.04371219059473978,"377":0.026905725900221722,"378":-0.005119825887850267,"379":-0.01393501072823633,"380":0.0044016231561394845,"381":-0.12324370233280317,"382":-0.02316289378724962,"383":0.03759169349226704,"384":-0.06906287758023266,"385":-0.2118923036422075,"386":0.0541856307830694,"387":-0.061879884309895966,"388":-0.05396384774125053,"389":0.04091409245352114,"390":-0.00447887843854056,"391":0.016509439766690392,"392":-0.0797854136449871,"393":-0.007493649910501061,"394":-0.02132410359244188,"395":0.06419262176229698,"396":-0.07140838907263582,"397":-0.012851513379102385,"398":-0.05126867620747492,"399":-0.13854403121694886,"400":-0.024552234278941328,"401":-0.06803505664110512,"402":-0.01970007252681184,"403":-0.24440290063828213,"404":0.02304458391349283,"405":-0.021095280313658815,"406":-0.10341830811841707,"407":0.004098202576308746,"408":-0.014133707720798522,"409":-0.030011952674600058,"410":0.014609411404397128,"411":0.012052454800215412,"412":-0.12422722739540447,"413":-0.007033018334232088,"414":-0.07005043688589992,"415":-0.068905896073578,"416":0.013682963404466985,"417":-0.10487685885356571,"418":-0.0029234506449940644,"419":-0.05621113270440983,"420":-0.07177270932743808,"421":-0.1622179175541539,"422":0.018468624893918047,"423":-0.04993752156223853,"424":-0.13068828692392165,"425":-0.03122905069808875,"426":-0.008699750311402509,"427":-0.06923513269507262,"428":-0.060961445122095684,"429":0.03226981878330104,"430":-0.13572829733537958,"431":0.012232838921952989,"432":-0.06503628017580688,"433":-0.07800681833677044,"434":0.015614799319360799,"435":-0.030238479138336948,"436":-0.03520405947594302,"437":-0.05515743255506632,"438":-0.004261356402244675,"439":-0.04564231136428252,"440":-0.006043738390450487,"441":-0.08458793403892946,"442":-0.0030310236387645346,"443":-0.0029527230759114104,"444":-0.02262195187523534,"445":0.06659327736506425,"446":-0.08295792731428717,"447":-0.03736704881028836,"448":-0.08872057246574878,"449":-0.005898525396417867}},{"sx":1,"sy":1,"depth":450,"w":{"0":-0.02292276837746492,"1":-0.0010224826496174444,"2":-0.038768263168428053,"3":0.016299770092942454,"4":-0.11979291604285312,"5":-0.07419860358706204,"6":-0.00985484430835578,"7":-0.00251124649853173,"8":-0.05409629449578516,"9":-0.14583021205149302,"10":-0.11977212835355103,"11":-0.05997434526104296,"12":-0.09919752999806318,"13":-0.05928485331449867,"14":-0.048177618894559814,"15":-0.06225704100288731,"16":-0.021802440638216625,"17":-0.03995231282165163,"18":-0.1293639943712161,"19":-0.018463342455965405,"20":0.014130269225631941,"21":-0.022628109169492205,"22":0.006834055116127948,"23":0.013552853956510978,"24":-0.003252964647616878,"25":-0.10901932265434261,"26":0.027933154038651216,"27":-0.020097192059958607,"28":-0.06017977793000887,"29":-0.08949520598049014,"30":-0.06972938657477823,"31":-0.045415287749412524,"32":-0.07449563570482123,"33":-0.10437287604241617,"34":-0.08169210755321905,"35":0.0032710173042087075,"36":-0.09110717912670392,"37":-0.029683895453221268,"38":-0.01953861046714243,"39":-0.04991430516046496,"40":-0.02407955255333591,"41":-0.06926799340163081,"42":-0.049869228566637586,"43":-0.048245173410031955,"44":-0.05307949369648497,"45":-0.01210773403513608,"46":-0.10174917265484358,"47":-0.1502996728596449,"48":0.031000308306414495,"49":0.02929261252713522,"50":-0.13082372194330535,"51":-0.08126276606662296,"52":0.0011903533976525824,"53":-0.0575133225539027,"54":-0.0692771220594102,"55":-0.2326647165181743,"56":-0.009472861264845353,"57":-0.06147580780451041,"58":0.02078464349441603,"59":-0.0009914523269578045,"60":0.05161348506440858,"61":0.01857137050297676,"62":-0.005483674099098012,"63":-0.11469946016100821,"64":-0.028491494741173594,"65":-0.06859640466693286,"66":-0.060326105460290706,"67":0.014400300161825945,"68":-0.09071928546174343,"69":-0.029821746279462318,"70":0.008849608704794837,"71":-0.03520681647257308,"72":-0.10097794581523234,"73":-0.07284780702775635,"74":-0.006614882161960035,"75":-0.015198096784906905,"76":0.05665979348203274,"77":-0.007948649422929315,"78":0.07113317892444529,"79":-0.06070847922976884,"80":-0.06960646243308556,"81":-0.03369741848863094,"82":-0.030969595289726762,"83":-0.06104579523365163,"84":-0.027332346846059827,"85":-0.015562425457054769,"86":-0.03128093623566887,"87":-0.04612198447334336,"88":0.01701033629587911,"89":0.01170525943330055,"90":-0.009377221728506661,"91":-0.07280695170888007,"92":-0.024419984630022453,"93":-0.0491512948609252,"94":-0.0662812217673063,"95":-0.047267379576310824,"96":-0.06696050184358589,"97":0.030274540368860382,"98":0.03381470461547638,"99":-0.1020024834054289,"100":-0.07342352876079992,"101":-0.06886698796804434,"102":-0.01272460511943525,"103":-0.026069085613099317,"104":-0.07709546020367791,"105":-0.058570701431167764,"106":-0.04448843759814745,"107":0.042341401269712885,"108":0.025113219188553335,"109":-0.05956317920454016,"110":-0.03238281145957644,"111":-0.043901196296385295,"112":-0.044033646021250136,"113":-0.07593321283401124,"114":0.021501858055190084,"115":-0.03526513862613638,"116":0.023694098163232848,"117":0.021063200039823773,"118":-0.1722518394575709,"119":-0.06218267543023678,"120":0.01333394311532837,"121":0.0161334126130531,"122":-0.10514254377330375,"123":0.036410239624724984,"124":-0.1130965564524564,"125":0.02875297312249816,"126":-0.120890569598608,"127":-0.12409099576380915,"128":0.008876635612812815,"129":-0.0775711879370451,"130":0.007016232093857745,"131":-0.06440692204331284,"132":-0.00022559443947813422,"133":-0.04159666109900917,"134":0.02544839651586354,"135":-0.07453868651088513,"136":-0.08349745129404124,"137":-0.03465769503684971,"138":-0.006079296439670462,"139":-0.054180434571887676,"140":-0.04494041600458679,"141":-0.024426629257496217,"142":-0.09898113866506067,"143":0.0014260399722956661,"144":-0.09887664724264016,"145":-0.05438121426214263,"146":-0.0633103455470828,"147":0.008681476808430197,"148":-0.009960107244557152,"149":-0.04636048260019212,"150":0.01961766012005892,"151":-0.107906966670411,"152":-0.05888972896798405,"153":-0.16363312811396988,"154":-0.061779975115725284,"155":-0.054881464441817025,"156":-0.008360902924883243,"157":0.10456789417936442,"158":-0.1292166652669144,"159":0.04757940373173071,"160":-0.05989916301405557,"161":-0.09220396364198452,"162":-0.11554663944931377,"163":-0.0738707595991572,"164":-0.0177643035711217,"165":0.006692961472025177,"166":0.019042602728677117,"167":-0.017020155026939727,"168":0.002640149013894409,"169":-0.1125531089531664,"170":0.022254460559432407,"171":-0.059919716155558675,"172":0.0007864507992271458,"173":0.023452105887753157,"174":-0.02288675264625712,"175":0.11958239850560866,"176":-0.09501177425744678,"177":-0.010406657082229582,"178":-0.11188134166721724,"179":-0.0181465821598932,"180":-0.05818176048348422,"181":-0.05456558018388275,"182":0.002172005402689726,"183":-0.03457684137351064,"184":-0.0853431862798456,"185":-0.07827848530400842,"186":-0.015204403664303145,"187":-0.1439572869440725,"188":-0.1176997882549056,"189":-0.043470907099679275,"190":-0.08737735341004854,"191":0.008694115337571981,"192":-0.0893497081803126,"193":-0.059642502302939784,"194":-0.13296831887653687,"195":-0.06815484254250587,"196":-0.10082965525124975,"197":-0.06547254169040988,"198":-0.05570463766100507,"199":-0.04170115176881052,"200":-0.030571344658928013,"201":-0.04974939380958485,"202":0.0061624910308053235,"203":-0.02142222343290593,"204":-0.043696829446769614,"205":-0.1008506936342436,"206":-0.025624752159622614,"207":-0.17038088083674838,"208":-0.11344500503440538,"209":-0.02793433932684085,"210":-0.05509520993862811,"211":0.044740729534547656,"212":-0.06502706549360057,"213":-0.04232821077595551,"214":-0.06404208665778241,"215":0.02022180652349237,"216":-0.0327710918104643,"217":-0.12058037640466598,"218":-0.14402819225514268,"219":-0.07940095297287025,"220":0.017471552289409477,"221":-0.07428909828634751,"222":0.021460034681627736,"223":-0.20947081013286506,"224":-0.010415036648368046,"225":-0.16347686337641396,"226":-0.13374672600564697,"227":0.009126117592661789,"228":0.03169224282435265,"229":0.03720634915323044,"230":-0.005574622300450543,"231":0.021782436266020284,"232":-0.07469020650542409,"233":-0.011144145290014952,"234":-0.1363983914607597,"235":-0.11332712109082611,"236":-0.01681493734915001,"237":-0.05100629209563952,"238":-0.02750914591045767,"239":-0.1816147803957394,"240":-0.029812030564158782,"241":-0.16693562071355694,"242":0.012384240723146901,"243":-0.14144312066084314,"244":-0.06089240974343878,"245":-0.10264400256416185,"246":-0.031930571308720394,"247":-0.044617445447991226,"248":-0.02812775339119704,"249":0.028884785093309474,"250":-0.038738635168866935,"251":-0.020731158894620526,"252":-0.13995239794462402,"253":-0.0896928809629309,"254":-0.06849751019924946,"255":-0.07243280607632524,"256":0.0019279209019304644,"257":-0.05156154175624003,"258":-0.08590200474671103,"259":-0.09762750616553212,"260":0.032854588674424215,"261":-0.14417614309714405,"262":-0.023707719938126266,"263":-0.1752239064320635,"264":0.02355893757957686,"265":0.04471530997099203,"266":-0.1642037046558974,"267":0.006624540693446448,"268":-0.01261559796807216,"269":0.018323062379028036,"270":-0.0014425108463854803,"271":-0.038397594166194565,"272":-0.05188634683540401,"273":-0.07419177698283841,"274":-0.045784543000214284,"275":-0.11592056077431179,"276":-0.06827370961360131,"277":-0.0954118457862608,"278":-0.03996212283444962,"279":-0.1289298383531258,"280":-0.16247058132240244,"281":0.024738114880590675,"282":-0.11534675825154697,"283":-0.07201377584728669,"284":-0.06307591091000297,"285":-0.10245787710788236,"286":0.004897241599308478,"287":0.0295520518727616,"288":0.024207180903479716,"289":-0.018601468942232538,"290":-0.005723991317564333,"291":-0.0203278281065466,"292":-0.05785271648238485,"293":-0.00784796758906393,"294":-0.06038617200819364,"295":-0.20087152977520537,"296":-0.01605650685790282,"297":-0.11437149704280827,"298":-0.1335401722963403,"299":-0.06662511305441243,"300":0.06826831341817996,"301":0.03417746432907523,"302":-0.1053111334533968,"303":0.03374135010422301,"304":-0.07199653626779395,"305":0.03826607343343434,"306":-0.06481547437406718,"307":-0.0839079472581264,"308":-0.05163407684479073,"309":-0.0721063859777239,"310":0.062377305074015406,"311":-0.12828472702293625,"312":-0.01817219640606382,"313":-0.2011990470587696,"314":-0.037803122801964024,"315":-0.07673500795304966,"316":-0.06785467308982476,"317":-0.03604142011391125,"318":0.015324250738387234,"319":0.08231369543116078,"320":-0.012719970753255825,"321":0.010897195071230997,"322":-0.07177653588410862,"323":-0.06693498150308344,"324":-0.03891092290881294,"325":-0.12252874573660467,"326":-0.07974453799143336,"327":-0.07668933119872269,"328":-0.02675444111372624,"329":-0.129114324172547,"330":-0.059494746021124756,"331":-0.18715302306472545,"332":0.0021523144441721125,"333":-0.0578917548463579,"334":-0.10730412881661121,"335":0.02916249286496398,"336":0.06663197291394084,"337":-0.023821283176344087,"338":-0.05277881573878657,"339":-0.023841772554130926,"340":-0.014800903414364368,"341":-0.10935430960587131,"342":-0.10821815802649719,"343":-0.024875529883588612,"344":-0.11082407723574259,"345":-0.07595184549139689,"346":-0.04232606594111331,"347":-0.06221903667362133,"348":-0.003724524408815478,"349":-0.06841039985008147,"350":-0.027354288866228302,"351":-0.08941457209408524,"352":-0.02254362030604219,"353":-0.014141546406473086,"354":-0.017992196866318446,"355":0.008025424227652733,"356":-0.09335920383107911,"357":-0.04027250890941647,"358":-0.0974859767382249,"359":-0.03407227048730653,"360":-0.039400356257977685,"361":-0.009842669988045834,"362":-0.05696572522527161,"363":-0.11758271347290794,"364":-0.01652781333499098,"365":-0.031553523830658514,"366":-0.10483327601197451,"367":-0.07178362818798449,"368":0.07003318483177551,"369":-0.08338821663007906,"370":-0.15423569815428287,"371":0.02152051275669521,"372":-0.10095912616533895,"373":-0.036524571728104555,"374":-0.1353943566342578,"375":0.05108881212773695,"376":-0.04531906691587395,"377":0.025523519300878796,"378":-0.10033361568554158,"379":-0.07864250910668301,"380":-0.030839667400285365,"381":-0.0019424888125205036,"382":-0.05506132013330704,"383":-0.11297631026454374,"384":-0.014587493870007812,"385":-0.07625595544112426,"386":-0.011692578024181588,"387":-0.12258491093055687,"388":-0.09194889676342659,"389":0.003923548858779505,"390":-0.005289436971614295,"391":0.014037949701263003,"392":-0.10833403130892602,"393":-0.05064979951548482,"394":-0.08746923847486182,"395":0.02251265971459015,"396":-0.09786305927278523,"397":-0.10370325112037372,"398":0.051209251764262435,"399":-0.179517502965003,"400":0.02706718199752565,"401":-0.09193652995949955,"402":-0.016924192217265484,"403":-0.05634707749223498,"404":-0.031451085239930836,"405":-0.012030485439664269,"406":0.009804696387087355,"407":0.01330037502354674,"408":-0.007638442517715158,"409":-0.002186800787610436,"410":-0.06970086529504352,"411":-0.002417372254994011,"412":-0.02190183398038067,"413":0.02809800301338127,"414":0.016750036659239076,"415":-0.05074214089467407,"416":-0.012001866930782605,"417":-0.13246540736012424,"418":-0.04044846312691517,"419":-0.05574980001824919,"420":0.015688921250950116,"421":-0.123291433546864,"422":0.030068636148658026,"423":-0.10537647421675686,"424":-0.044206822966996955,"425":-0.06289654420360323,"426":-0.04069158731197635,"427":-0.04443488355034786,"428":-0.07406565415639677,"429":0.02148793615558673,"430":-0.08281084044215,"431":0.011723093656558341,"432":-0.004983543192842618,"433":-0.05883952237362075,"434":-0.08288578424215635,"435":-0.09594495008301299,"436":0.0025461518051802566,"437":-0.053096100893703715,"438":0.012829272390343148,"439":-0.12349438512820474,"440":-0.030367647064150113,"441":-0.07538992028704207,"442":-0.056630169824696375,"443":0.043240626366542405,"444":-0.04952847909690334,"445":-0.01355869718967177,"446":-0.10449734099165597,"447":0.015119767234284431,"448":-0.005212097223456481,"449":-0.04820100884334916}}],"biases":{"sx":1,"sy":1,"depth":43,"w":{"0":0.00314607754569999,"1":-0.12606340234333088,"2":-0.10638678060094071,"3":-0.07321975190189396,"4":-0.1131934658089019,"5":-0.133300185728825,"6":-0.0804100992092028,"7":0.004350889451553926,"8":0.0036795776666220825,"9":-0.08737725696708647,"10":-0.02813004076814655,"11":-0.006674161314598037,"12":-0.12637658668002769,"13":-0.06697517326632588,"14":-0.10237054373441455,"15":0.08670962960811891,"16":-0.055080930461614275,"17":-0.06008844731058053,"18":-0.10181879936568303,"19":-0.10264646498619304,"20":0.023489334662522718,"21":-0.046458331288889015,"22":-0.033273339417083846,"23":-0.10778186003487687,"24":-0.155439531443572,"25":-0.041596961220431494,"26":-0.11264814983253789,"27":-0.12901640494830371,"28":-0.00908879974668263,"29":-0.10867036308092089,"30":0.012568917563257141,"31":-0.024804526126976742,"32":-0.04863608471701791,"33":-0.03004612271485829,"34":-0.02665479068774724,"35":0.030570333371281296,"36":-0.12134560083276748,"37":-0.07356905113806565,"38":-0.040437825405671354,"39":-0.08065910140361507,"40":-0.11159567071084754,"41":-0.07644727444789798,"42":-0.11879851383579663}}},{"out_depth":43,"out_sx":1,"out_sy":1,"layer_type":"softmax","num_inputs":43}]}