{
  "EDI-X": {
    "-Version": "1.3",
    "Settings": {
      "DocumentType": "Terminplan",
      "Currency": "EUR",
      "Campaign": {
        "-Name": "Kampagne 2021/00212 - Testkampagne (ALLE Termine werden wieder storniert)",
        "Id": {
          "-SSP": "2021/00212 - 2003020989",
          "-self-closing": "true"
        }
      },
      "Plan": {
        "-Name": "2021/00212 - Testkampagne (ALLE Termine werden wieder storniert)",
        "Id": {
          "-SSP": "2021/00212 - 2003020989",
          "-self-closing": "true"
        },
        "Periods": {
          "Period": {
            "-Start": "2021-12-01",
            "-End": "2021-12-31",
            "-self-closing": "true"
          }
        }
      },
      "Created": {
        "-By": "amily.traffic 2.87 SR 6",
        "-User": "Benedict Wege",
        "-Date": "2021-06-15",
        "-Time": "14:22:23",
        "-self-closing": "true"
      }
    },
    "Agency": {
      "Id": {
        "-SSP": "36032 - 74654",
        "-self-closing": "true"
      },
      "Address": {
        "-Name": "Testagency",
        "-Country": "D",
        "-ZipCode": "11111",
        "-Street": "Testroad 1",
        "-City": "Testtown",
        "-self-closing": "true"
      }
    },
    "Customer": {
      "Id": {
        "-SSP": "29080 - 74653",
        "-self-closing": "true"
      },
      "Address": {
        "-Name": "Test GmbH & Co. KG",
        "-Country": "D",
        "-ZipCode": "11111",
        "-Street": "Testroad 1",
        "-City": "Testtown",
        "-self-closing": "true"
      },
      "Product": {
        "-Name": "Testkampagne",
        "Id": {
          "-SSP": "27171 - 28174",
          "-self-closing": "true"
        },
        "Group": "46308"
      }
    },
    "Publisher": {
      "Id": {
        "-SSP": "1",
        "-self-closing": "true"
      },
      "Address": {
        "-Name": "RMS",
        "-Country": "",
        "-ZipCode": "",
        "-Street": "",
        "-City": "\" /",
        "-self-closing": "true"
      },
      "Requirements": {
        "-self-closing": "true"
      },
      "Channels": {
        "Audio": {
          "-Name": "Hamburg-Kombi",
          "Id": {
            "-EDI": "4901083",
            "-self-closing": "true"
          },
          "OrderNo": "2021/760110",
          "Conditions": {
            "Skonto": {
              "-Percent": "2.00",
              "-self-closing": "true"
            },
            "AE": {
              "-Percent": "15.00",
              "-self-closing": "true"
            },
            "Mwst": {
              "-Percent": "19.00",
              "-self-closing": "true"
            },
            "Discounts": {
              "Discount": {
                "-Name": "NT on top",
                "-Type": "4",
                "-Percent": "46.07",
                "-Index": "0",
                "-self-closing": "true"
              }
            }
          },
          "Spots": {
            "Spot": [
              {
                "-Date": "2021-12-01",
                "-Length": "20",
                "-Price": "640.00",
                "Time": {
                  "-Start": "14:00:00",
                  "-End": "15:00:00",
                  "-self-closing": "true"
                },
                "Id": {
                  "-SSP": "21956071",
                  "-self-closing": "true"
                },
                "PriceDetail": {
                  "Freespot": {
                    "-Name": "AE NR",
                    "-Rate": "640.00",
                    "-self-closing": "true"
                  }
                }
              },
              {
                "-Date": "2021-12-02",
                "-Length": "20",
                "-Price": "640.00",
                "Time": {
                  "-Start": "14:00:00",
                  "-End": "15:00:00",
                  "-self-closing": "true"
                },
                "Id": {
                  "-SSP": "21956061",
                  "-self-closing": "true"
                }
              },
              {
                "-Date": "2021-12-03",
                "-Length": "20",
                "-Price": "640.00",
                "Time": {
                  "-Start": "14:00:00",
                  "-End": "15:00:00",
                  "-self-closing": "true"
                },
                "Id": {
                  "-SSP": "21956062",
                  "-self-closing": "true"
                }
              },
              {
                "-Date": "2021-12-08",
                "-Length": "20",
                "-Price": "660.00",
                "Time": {
                  "-Start": "10:00:00",
                  "-End": "11:00:00",
                  "-self-closing": "true"
                },
                "Id": {
                  "-SSP": "21956072",
                  "-self-closing": "true"
                },
                "PriceDetail": {
                  "Freespot": {
                    "-Name": "AE NR",
                    "-Rate": "660.00",
                    "-self-closing": "true"
                  }
                }
              },
              {
                "-Date": "2021-12-09",
                "-Length": "20",
                "-Price": "660.00",
                "Time": {
                  "-Start": "10:00:00",
                  "-End": "11:00:00",
                  "-self-closing": "true"
                },
                "Id": {
                  "-SSP": "21956063",
                  "-self-closing": "true"
                }
              },
              {
                "-Date": "2021-12-13",
                "-Length": "20",
                "-Price": "620.00",
                "Time": {
                  "-Start": "12:00:00",
                  "-End": "13:00:00",
                  "-self-closing": "true"
                },
                "Id": {
                  "-SSP": "21956064",
                  "-self-closing": "true"
                }
              },
              {
                "-Date": "2021-12-14",
                "-Length": "20",
                "-Price": "620.00",
                "Time": {
                  "-Start": "12:00:00",
                  "-End": "13:00:00",
                  "-self-closing": "true"
                },
                "Id": {
                  "-SSP": "21956065",
                  "-self-closing": "true"
                }
              },
              {
                "-Date": "2021-12-16",
                "-Length": "20",
                "-Price": "620.00",
                "Time": {
                  "-Start": "12:00:00",
                  "-End": "13:00:00",
                  "-self-closing": "true"
                },
                "Id": {
                  "-SSP": "21956066",
                  "-self-closing": "true"
                }
              },
              {
                "-Date": "2021-12-17",
                "-Length": "20",
                "-Price": "620.00",
                "Time": {
                  "-Start": "12:00:00",
                  "-End": "13:00:00",
                  "-self-closing": "true"
                },
                "Id": {
                  "-SSP": "21956067",
                  "-self-closing": "true"
                }
              },
              {
                "-Date": "2021-12-21",
                "-Length": "20",
                "-Price": "1240.00",
                "Time": {
                  "-Start": "08:00:00",
                  "-End": "09:00:00",
                  "-self-closing": "true"
                },
                "Id": {
                  "-SSP": "21956068",
                  "-self-closing": "true"
                }
              },
              {
                "-Date": "2021-12-22",
                "-Length": "20",
                "-Price": "1240.00",
                "Time": {
                  "-Start": "08:00:00",
                  "-End": "09:00:00",
                  "-self-closing": "true"
                },
                "Id": {
                  "-SSP": "21956073",
                  "-self-closing": "true"
                },
                "PriceDetail": {
                  "Freespot": {
                    "-Name": "KUNDEN NR",
                    "-Rate": "1240.00",
                    "-self-closing": "true"
                  }
                }
              },
              {
                "-Date": "2021-12-28",
                "-Length": "20",
                "-Price": "860.00",
                "Time": {
                  "-Start": "09:00:00",
                  "-End": "10:00:00",
                  "-self-closing": "true"
                },
                "Id": {
                  "-SSP": "21956069",
                  "-self-closing": "true"
                }
              },
              {
                "-Date": "2021-12-29",
                "-Length": "20",
                "-Price": "860.00",
                "Time": {
                  "-Start": "09:00:00",
                  "-End": "10:00:00",
                  "-self-closing": "true"
                },
                "Id": {
                  "-SSP": "21956070",
                  "-self-closing": "true"
                }
              },
              {
                "-Date": "2021-12-31",
                "-Length": "20",
                "-Price": "860.00",
                "Time": {
                  "-Start": "09:00:00",
                  "-End": "10:00:00",
                  "-self-closing": "true"
                },
                "Id": {
                  "-SSP": "21956074",
                  "-self-closing": "true"
                },
                "PriceDetail": {
                  "Freespot": {
                    "-Name": "KUNDEN NR",
                    "-Rate": "860.00",
                    "-self-closing": "true"
                  }
                }
              }
            ]
          }
        }
      }
    }
  }
}