EESchema Schematic File Version 4
LIBS:universal_display_1-cache
EELAYER 26 0
EELAYER END
$Descr A4 11693 8268
encoding utf-8
Sheet 1 1
Title ""
Date ""
Rev ""
Comp ""
Comment1 ""
Comment2 ""
Comment3 ""
Comment4 ""
$EndDescr
$Comp
L SN74LVC1T45DPKR:SN74LVC1T45DPKR IC1
U 1 1 60B807DD
P 9660 2965
F 0 "IC1" H 10210 3230 50  0000 C CNN
F 1 "SN74LVC1T45DPKR" H 10210 3139 50  0000 C CNN
F 2 "SN74LVC1T45DPKR:SN74LVC1T45DPKR" H 10610 3065 50  0001 L CNN
F 3 "http://www.ti.com/lit/gpn/sn74lvc1t45" H 10610 2965 50  0001 L CNN
F 4 "Single-Bit Dual-Supply Bus Transceiver with Configurable Voltage-Level Shifting and 3-State Outputs" H 10610 2865 50  0001 L CNN "Description"
F 5 "" H 10610 2765 50  0001 L CNN "Height"
F 6 "Texas Instruments" H 10610 2665 50  0001 L CNN "Manufacturer_Name"
F 7 "SN74LVC1T45DPKR" H 10610 2565 50  0001 L CNN "Manufacturer_Part_Number"
F 8 "595-SN74LVC1T45DPKR" H 10610 2465 50  0001 L CNN "Mouser Part Number"
F 9 "https://www.mouser.co.uk/ProductDetail/Texas-Instruments/SN74LVC1T45DPKR?qs=2UFnnMkojnUfaS15YZ4fIg%3D%3D" H 10610 2365 50  0001 L CNN "Mouser Price/Stock"
F 10 "SN74LVC1T45DPKR" H 10610 2265 50  0001 L CNN "Arrow Part Number"
F 11 "https://www.arrow.com/en/products/sn74lvc1t45dpkr/texas-instruments" H 10610 2165 50  0001 L CNN "Arrow Price/Stock"
	1    9660 2965
	-1   0    0    -1  
$EndComp
$Comp
L ESP32-footprints-Shem-Lib:ESP32-WROOM U2
U 1 1 60B80967
P 5760 3015
F 0 "U2" H 5735 4402 60  0000 C CNN
F 1 "ESP32-WROOM" H 5735 4296 60  0000 C CNN
F 2 "RF_Module:ESP32-WROOM-32" H 6110 4365 60  0001 C CNN
F 3 "" H 5310 3465 60  0001 C CNN
	1    5760 3015
	1    0    0    -1  
$EndComp
Wire Wire Line
	8560 3065 8485 3065
Wire Wire Line
	8485 3065 8485 2615
Wire Wire Line
	8485 2615 9760 2615
Wire Wire Line
	9760 2615 9760 3065
Wire Wire Line
	9760 3065 9660 3065
$Comp
L Regulator_Linear:MIC5504-3.3YM5 U1
U 1 1 60B80B57
P 2710 2515
F 0 "U1" H 2710 2882 50  0000 C CNN
F 1 "MIC5504-3.3YM5" H 2710 2791 50  0000 C CNN
F 2 "Package_TO_SOT_SMD:SOT-23-5" H 2710 2115 50  0001 C CNN
F 3 "http://ww1.microchip.com/downloads/en/DeviceDoc/MIC550X.pdf" H 2460 2765 50  0001 C CNN
	1    2710 2515
	1    0    0    -1  
$EndComp
Wire Wire Line
	2310 2615 2260 2615
Wire Wire Line
	2260 2615 2260 2415
Wire Wire Line
	2260 2415 2310 2415
Wire Wire Line
	3110 2415 3160 2415
$Comp
L Device:C_Small C3
U 1 1 60B81006
P 3460 2590
F 0 "C3" H 3552 2636 50  0000 L CNN
F 1 "10u" H 3552 2545 50  0000 L CNN
F 2 "Capacitor_SMD:C_0805_2012Metric_Pad1.15x1.40mm_HandSolder" H 3460 2590 50  0001 C CNN
F 3 "~" H 3460 2590 50  0001 C CNN
	1    3460 2590
	1    0    0    -1  
$EndComp
$Comp
L Device:C_Small C2
U 1 1 60B810FD
P 3160 2590
F 0 "C2" H 3252 2636 50  0000 L CNN
F 1 "0.1u" H 3252 2545 50  0000 L CNN
F 2 "Capacitor_SMD:C_0603_1608Metric_Pad1.05x0.95mm_HandSolder" H 3160 2590 50  0001 C CNN
F 3 "~" H 3160 2590 50  0001 C CNN
	1    3160 2590
	1    0    0    -1  
$EndComp
Wire Wire Line
	3160 2490 3160 2415
Connection ~ 3160 2415
Wire Wire Line
	3160 2415 3460 2415
Wire Wire Line
	3460 2490 3460 2415
Connection ~ 3460 2415
Wire Wire Line
	3460 2415 3960 2415
Wire Wire Line
	3160 2690 3160 2815
Wire Wire Line
	3160 2815 2710 2815
Wire Wire Line
	3460 2690 3460 2815
Wire Wire Line
	3460 2815 3160 2815
Connection ~ 3160 2815
$Comp
L Device:C_Small C1
U 1 1 60B8163E
P 1985 2540
F 0 "C1" H 2077 2586 50  0000 L CNN
F 1 "10u" H 2077 2495 50  0000 L CNN
F 2 "Capacitor_SMD:C_0805_2012Metric_Pad1.15x1.40mm_HandSolder" H 1985 2540 50  0001 C CNN
F 3 "~" H 1985 2540 50  0001 C CNN
	1    1985 2540
	1    0    0    -1  
$EndComp
Wire Wire Line
	2260 2415 1985 2415
Wire Wire Line
	1985 2415 1985 2440
Connection ~ 2260 2415
Wire Wire Line
	1985 2640 1985 2815
Wire Wire Line
	1985 2815 2710 2815
Connection ~ 2710 2815
$Comp
L power:+3.3V #PWR03
U 1 1 60B81C89
P 3460 2340
F 0 "#PWR03" H 3460 2190 50  0001 C CNN
F 1 "+3.3V" H 3475 2513 50  0000 C CNN
F 2 "" H 3460 2340 50  0001 C CNN
F 3 "" H 3460 2340 50  0001 C CNN
	1    3460 2340
	1    0    0    -1  
$EndComp
$Comp
L power:+3.3V #PWR010
U 1 1 60B81CE1
P 8560 3590
F 0 "#PWR010" H 8560 3440 50  0001 C CNN
F 1 "+3.3V" H 8575 3763 50  0000 C CNN
F 2 "" H 8560 3590 50  0001 C CNN
F 3 "" H 8560 3590 50  0001 C CNN
	1    8560 3590
	-1   0    0    1   
$EndComp
$Comp
L power:+5V #PWR02
U 1 1 60B81D28
P 1985 2315
F 0 "#PWR02" H 1985 2165 50  0001 C CNN
F 1 "+5V" H 2000 2488 50  0000 C CNN
F 2 "" H 1985 2315 50  0001 C CNN
F 3 "" H 1985 2315 50  0001 C CNN
	1    1985 2315
	1    0    0    -1  
$EndComp
$Comp
L power:+5V #PWR08
U 1 1 60B81D5C
P 9660 2890
F 0 "#PWR08" H 9660 2740 50  0001 C CNN
F 1 "+5V" H 9675 3063 50  0000 C CNN
F 2 "" H 9660 2890 50  0001 C CNN
F 3 "" H 9660 2890 50  0001 C CNN
	1    9660 2890
	1    0    0    -1  
$EndComp
Wire Wire Line
	9660 2890 9660 2965
Wire Wire Line
	1985 2315 1985 2415
Connection ~ 1985 2415
Wire Wire Line
	3460 2340 3460 2415
Wire Wire Line
	6660 2965 8560 2965
$Comp
L Connector_Generic:Conn_01x04 J2
U 1 1 60B83531
P 8235 2515
F 0 "J2" H 8315 2507 50  0000 L CNN
F 1 "I2C" H 8315 2416 50  0000 L CNN
F 2 "Connector_PinHeader_2.54mm:PinHeader_1x04_P2.54mm_Vertical" H 8235 2515 50  0001 C CNN
F 3 "~" H 8235 2515 50  0001 C CNN
	1    8235 2515
	1    0    0    -1  
$EndComp
$Comp
L Connector_Generic:Conn_01x03 J1
U 1 1 60B835D1
P 7535 2640
F 0 "J1" H 7615 2682 50  0000 L CNN
F 1 "UART" H 7615 2591 50  0000 L CNN
F 2 "Connector_PinHeader_2.54mm:PinHeader_1x03_P2.54mm_Vertical" H 7535 2640 50  0001 C CNN
F 3 "~" H 7535 2640 50  0001 C CNN
	1    7535 2640
	1    0    0    -1  
$EndComp
$Comp
L power:Earth #PWR05
U 1 1 60B840CC
P 7335 2515
F 0 "#PWR05" H 7335 2265 50  0001 C CNN
F 1 "Earth" H 7335 2365 50  0001 C CNN
F 2 "" H 7335 2515 50  0001 C CNN
F 3 "~" H 7335 2515 50  0001 C CNN
	1    7335 2515
	1    0    0    1   
$EndComp
$Comp
L power:Earth #PWR04
U 1 1 60B84106
P 9860 2615
F 0 "#PWR04" H 9860 2365 50  0001 C CNN
F 1 "Earth" H 9860 2465 50  0001 C CNN
F 2 "" H 9860 2615 50  0001 C CNN
F 3 "~" H 9860 2615 50  0001 C CNN
	1    9860 2615
	1    0    0    -1  
$EndComp
$Comp
L power:Earth #PWR06
U 1 1 60B84145
P 8035 2365
F 0 "#PWR06" H 8035 2115 50  0001 C CNN
F 1 "Earth" H 8035 2215 50  0001 C CNN
F 2 "" H 8035 2365 50  0001 C CNN
F 3 "~" H 8035 2365 50  0001 C CNN
	1    8035 2365
	1    0    0    1   
$EndComp
$Comp
L power:Earth #PWR015
U 1 1 60B84498
P 4985 4140
F 0 "#PWR015" H 4985 3890 50  0001 C CNN
F 1 "Earth" H 4985 3990 50  0001 C CNN
F 2 "" H 4985 4140 50  0001 C CNN
F 3 "~" H 4985 4140 50  0001 C CNN
	1    4985 4140
	1    0    0    -1  
$EndComp
$Comp
L power:Earth #PWR07
U 1 1 60B847F3
P 2710 2890
F 0 "#PWR07" H 2710 2640 50  0001 C CNN
F 1 "Earth" H 2710 2740 50  0001 C CNN
F 2 "" H 2710 2890 50  0001 C CNN
F 3 "~" H 2710 2890 50  0001 C CNN
	1    2710 2890
	1    0    0    -1  
$EndComp
Wire Wire Line
	2710 2890 2710 2815
Wire Wire Line
	5310 4065 4985 4065
Wire Wire Line
	4810 4065 4810 3715
Wire Wire Line
	4985 4140 4985 4065
Connection ~ 4985 4065
Wire Wire Line
	4985 4065 4810 4065
Wire Wire Line
	8035 2365 8035 2415
$Comp
L power:+3.3V #PWR01
U 1 1 60B865CE
P 7760 2040
F 0 "#PWR01" H 7760 1890 50  0001 C CNN
F 1 "+3.3V" H 7775 2213 50  0000 C CNN
F 2 "" H 7760 2040 50  0001 C CNN
F 3 "" H 7760 2040 50  0001 C CNN
	1    7760 2040
	1    0    0    -1  
$EndComp
Wire Wire Line
	7760 2515 7760 2365
Wire Wire Line
	7760 2365 6660 2365
Wire Wire Line
	6660 2665 7110 2665
Wire Wire Line
	7110 2665 7110 2865
Wire Wire Line
	7110 2865 7760 2865
Wire Wire Line
	7760 2865 7760 2615
$Comp
L Device:R_Small R2
U 1 1 60B88958
P 7760 2265
F 0 "R2" H 7819 2311 50  0000 L CNN
F 1 "2.2k" H 7819 2220 50  0000 L CNN
F 2 "Resistor_SMD:R_0603_1608Metric_Pad1.05x0.95mm_HandSolder" H 7760 2265 50  0001 C CNN
F 3 "~" H 7760 2265 50  0001 C CNN
	1    7760 2265
	1    0    0    -1  
$EndComp
$Comp
L Device:R_Small R1
U 1 1 60B889D8
P 7535 2165
F 0 "R1" H 7594 2211 50  0000 L CNN
F 1 "2.2k" H 7594 2120 50  0000 L CNN
F 2 "Resistor_SMD:R_0603_1608Metric_Pad1.05x0.95mm_HandSolder" H 7535 2165 50  0001 C CNN
F 3 "~" H 7535 2165 50  0001 C CNN
	1    7535 2165
	0    -1   -1   0   
$EndComp
Connection ~ 7760 2365
Wire Wire Line
	7635 2165 7760 2165
Connection ~ 7760 2165
Wire Wire Line
	7760 2165 7760 2040
Wire Wire Line
	7435 2165 7110 2165
Wire Wire Line
	7110 2165 7110 2665
Connection ~ 7110 2665
Text Notes 7835 2515 0    50   ~ 0
SCL
Text Notes 7835 2615 0    50   ~ 0
SDA
$Comp
L Connector_Generic:Conn_01x05 J5
U 1 1 60B8CEE5
P 4760 5965
F 0 "J5" V 4633 6245 50  0000 L CNN
F 1 "SPI" V 4724 6245 50  0000 L CNN
F 2 "Connector_PinHeader_2.54mm:PinHeader_1x05_P2.54mm_Vertical" H 4760 5965 50  0001 C CNN
F 3 "~" H 4760 5965 50  0001 C CNN
	1    4760 5965
	0    1    1    0   
$EndComp
Wire Wire Line
	4810 3515 4560 3515
Wire Wire Line
	4810 3615 4660 3615
Wire Wire Line
	5410 4315 5410 4065
Wire Wire Line
	4760 4315 5410 4315
Wire Wire Line
	4860 4365 6110 4365
Wire Wire Line
	6110 4365 6110 4065
$Comp
L power:Earth #PWR019
U 1 1 60B90A95
P 5260 5765
F 0 "#PWR019" H 5260 5515 50  0001 C CNN
F 1 "Earth" H 5260 5615 50  0001 C CNN
F 2 "" H 5260 5765 50  0001 C CNN
F 3 "~" H 5260 5765 50  0001 C CNN
	1    5260 5765
	1    0    0    -1  
$EndComp
Wire Wire Line
	5260 5765 4960 5765
Text Notes 4560 5715 1    50   ~ 0
CLK
Text Notes 4660 5715 1    50   ~ 0
MISO
Text Notes 4760 5715 1    50   ~ 0
MOSI
Text Notes 4860 5690 1    50   ~ 0
CS
$Comp
L power:Earth #PWR013
U 1 1 60B92853
P 6685 3715
F 0 "#PWR013" H 6685 3465 50  0001 C CNN
F 1 "Earth" H 6685 3565 50  0001 C CNN
F 2 "" H 6685 3715 50  0001 C CNN
F 3 "~" H 6685 3715 50  0001 C CNN
	1    6685 3715
	1    0    0    -1  
$EndComp
Wire Wire Line
	6685 3715 6685 3665
Wire Wire Line
	6685 3665 6660 3665
$Comp
L Device:R_Small R21
U 1 1 60B975D4
P 4860 5315
F 0 "R21" H 4919 5361 50  0000 L CNN
F 1 "100" H 4919 5270 50  0000 L CNN
F 2 "Resistor_SMD:R_0603_1608Metric_Pad1.05x0.95mm_HandSolder" H 4860 5315 50  0001 C CNN
F 3 "~" H 4860 5315 50  0001 C CNN
	1    4860 5315
	1    0    0    -1  
$EndComp
$Comp
L Device:R_Small R20
U 1 1 60B9773B
P 4760 5315
F 0 "R20" H 4819 5361 50  0000 L CNN
F 1 "100" H 4819 5270 50  0000 L CNN
F 2 "Resistor_SMD:R_0603_1608Metric_Pad1.05x0.95mm_HandSolder" H 4760 5315 50  0001 C CNN
F 3 "~" H 4760 5315 50  0001 C CNN
	1    4760 5315
	1    0    0    -1  
$EndComp
$Comp
L Device:R_Small R19
U 1 1 60B985E6
P 4660 5315
F 0 "R19" H 4719 5361 50  0000 L CNN
F 1 "100" H 4719 5270 50  0000 L CNN
F 2 "Resistor_SMD:R_0603_1608Metric_Pad1.05x0.95mm_HandSolder" H 4660 5315 50  0001 C CNN
F 3 "~" H 4660 5315 50  0001 C CNN
	1    4660 5315
	1    0    0    -1  
$EndComp
$Comp
L Device:R_Small R18
U 1 1 60B99493
P 4560 5315
F 0 "R18" H 4619 5361 50  0000 L CNN
F 1 "100" H 4619 5270 50  0000 L CNN
F 2 "Resistor_SMD:R_0603_1608Metric_Pad1.05x0.95mm_HandSolder" H 4560 5315 50  0001 C CNN
F 3 "~" H 4560 5315 50  0001 C CNN
	1    4560 5315
	1    0    0    -1  
$EndComp
Wire Wire Line
	4860 5415 4860 5765
Wire Wire Line
	4760 5415 4760 5765
Wire Wire Line
	4660 5765 4660 5415
Wire Wire Line
	4560 5765 4560 5415
Wire Wire Line
	4860 5215 4860 4365
Wire Wire Line
	4760 5215 4760 4315
Wire Wire Line
	4660 5215 4660 3615
Wire Wire Line
	4560 5215 4560 3515
$Comp
L Device:R_Small R3
U 1 1 60BA26A5
P 3960 2540
F 0 "R3" H 4019 2586 50  0000 L CNN
F 1 "10k" H 4019 2495 50  0000 L CNN
F 2 "Resistor_SMD:R_0603_1608Metric_Pad1.05x0.95mm_HandSolder" H 3960 2540 50  0001 C CNN
F 3 "~" H 3960 2540 50  0001 C CNN
	1    3960 2540
	1    0    0    -1  
$EndComp
$Comp
L Device:C_Small C4
U 1 1 60BA3A82
P 3960 2940
F 0 "C4" H 4052 2986 50  0000 L CNN
F 1 "0.1u" H 4052 2895 50  0000 L CNN
F 2 "Capacitor_SMD:C_0603_1608Metric_Pad1.05x0.95mm_HandSolder" H 3960 2940 50  0001 C CNN
F 3 "~" H 3960 2940 50  0001 C CNN
	1    3960 2940
	1    0    0    -1  
$EndComp
$Comp
L Switch:SW_Push SW1
U 1 1 60BA4DC2
P 3785 2890
F 0 "SW1" V 3860 3115 50  0000 R CNN
F 1 "RESET" V 3685 3115 50  0000 R CNN
F 2 "Button_Switch_THT:SW_PUSH_6mm" H 3785 3090 50  0001 C CNN
F 3 "" H 3785 3090 50  0001 C CNN
	1    3785 2890
	0    -1   -1   0   
$EndComp
Wire Wire Line
	3960 2440 3960 2415
Connection ~ 3960 2415
Wire Wire Line
	3960 2415 4810 2415
Wire Wire Line
	3960 2840 3960 2690
Wire Wire Line
	3785 2690 3960 2690
Connection ~ 3960 2690
Wire Wire Line
	3960 2690 3960 2640
Wire Wire Line
	3960 3040 3960 3090
Wire Wire Line
	3960 3090 3785 3090
Wire Wire Line
	3785 3090 3460 3090
Wire Wire Line
	3460 3090 3460 2815
Connection ~ 3785 3090
Connection ~ 3460 2815
Wire Wire Line
	3960 2690 4185 2690
Wire Wire Line
	4185 2690 4185 2515
Wire Wire Line
	4185 2515 4810 2515
$Comp
L Device:R_Small R5
U 1 1 60BAD84C
P 7960 3315
F 0 "R5" H 8019 3361 50  0000 L CNN
F 1 "10k" H 8019 3270 50  0000 L CNN
F 2 "Resistor_SMD:R_0603_1608Metric_Pad1.05x0.95mm_HandSolder" H 7960 3315 50  0001 C CNN
F 3 "~" H 7960 3315 50  0001 C CNN
	1    7960 3315
	-1   0    0    -1  
$EndComp
$Comp
L Device:C_Small C5
U 1 1 60BAD853
P 7960 3715
F 0 "C5" H 8052 3761 50  0000 L CNN
F 1 "0.1u" H 8052 3670 50  0000 L CNN
F 2 "Capacitor_SMD:C_0603_1608Metric_Pad1.05x0.95mm_HandSolder" H 7960 3715 50  0001 C CNN
F 3 "~" H 7960 3715 50  0001 C CNN
	1    7960 3715
	-1   0    0    -1  
$EndComp
$Comp
L Switch:SW_Push SW2
U 1 1 60BAD85A
P 8135 3665
F 0 "SW2" V 8210 3890 50  0000 R CNN
F 1 "PROG" V 8035 3890 50  0000 R CNN
F 2 "Button_Switch_THT:SW_PUSH_6mm" H 8135 3865 50  0001 C CNN
F 3 "" H 8135 3865 50  0001 C CNN
	1    8135 3665
	0    1    -1   0   
$EndComp
Wire Wire Line
	7960 3615 7960 3465
Wire Wire Line
	8135 3465 7960 3465
Connection ~ 7960 3465
Wire Wire Line
	7960 3465 7960 3415
Wire Wire Line
	7960 3815 7960 3865
Wire Wire Line
	7960 3865 8135 3865
Wire Wire Line
	6660 3465 7960 3465
Wire Wire Line
	7960 3215 7960 3165
Wire Wire Line
	7960 3165 8560 3165
Connection ~ 8560 3165
$Comp
L power:Earth #PWR014
U 1 1 60BBD756
P 8135 3915
F 0 "#PWR014" H 8135 3665 50  0001 C CNN
F 1 "Earth" H 8135 3765 50  0001 C CNN
F 2 "" H 8135 3915 50  0001 C CNN
F 3 "~" H 8135 3915 50  0001 C CNN
	1    8135 3915
	1    0    0    -1  
$EndComp
Wire Wire Line
	8135 3915 8135 3865
Connection ~ 8135 3865
$Comp
L Connector_Generic:Conn_01x10 J4
U 1 1 60BC1C7D
P 3085 3890
F 0 "J4" H 3005 4507 50  0000 C CNN
F 1 "Parallel" H 3005 4416 50  0000 C CNN
F 2 "Connector_PinHeader_2.54mm:PinHeader_1x10_P2.54mm_Vertical" H 3085 3890 50  0001 C CNN
F 3 "~" H 3085 3890 50  0001 C CNN
	1    3085 3890
	-1   0    0    -1  
$EndComp
Wire Wire Line
	4235 3590 4235 2715
Wire Wire Line
	4235 2715 4810 2715
Wire Wire Line
	4260 3690 4260 2815
Wire Wire Line
	4260 2815 4810 2815
Wire Wire Line
	4285 3790 4285 2915
Wire Wire Line
	4285 2915 4810 2915
Wire Wire Line
	4310 3890 4310 3015
Wire Wire Line
	4310 3015 4810 3015
Wire Wire Line
	4335 3990 4335 3115
Wire Wire Line
	4335 3115 4810 3115
Wire Wire Line
	4360 4090 4360 3215
Wire Wire Line
	4360 3215 4810 3215
Wire Wire Line
	4385 4190 4385 3315
Wire Wire Line
	4385 3315 4810 3315
Wire Wire Line
	4410 4290 4410 3415
Wire Wire Line
	4410 3415 4810 3415
$Comp
L Device:R_Small R6
U 1 1 60BDB876
P 3510 3590
F 0 "R6" H 3569 3636 50  0000 L CNN
F 1 "100" H 3569 3545 50  0000 L CNN
F 2 "Resistor_SMD:R_0603_1608Metric_Pad1.05x0.95mm_HandSolder" H 3510 3590 50  0001 C CNN
F 3 "~" H 3510 3590 50  0001 C CNN
	1    3510 3590
	0    -1   -1   0   
$EndComp
$Comp
L Device:R_Small R7
U 1 1 60BDB87D
P 3510 3690
F 0 "R7" H 3569 3736 50  0000 L CNN
F 1 "100" H 3569 3645 50  0000 L CNN
F 2 "Resistor_SMD:R_0603_1608Metric_Pad1.05x0.95mm_HandSolder" H 3510 3690 50  0001 C CNN
F 3 "~" H 3510 3690 50  0001 C CNN
	1    3510 3690
	0    -1   -1   0   
$EndComp
$Comp
L Device:R_Small R8
U 1 1 60BDB884
P 3510 3790
F 0 "R8" H 3569 3836 50  0000 L CNN
F 1 "100" H 3569 3745 50  0000 L CNN
F 2 "Resistor_SMD:R_0603_1608Metric_Pad1.05x0.95mm_HandSolder" H 3510 3790 50  0001 C CNN
F 3 "~" H 3510 3790 50  0001 C CNN
	1    3510 3790
	0    -1   -1   0   
$EndComp
$Comp
L Device:R_Small R9
U 1 1 60BDB88B
P 3510 3890
F 0 "R9" H 3569 3936 50  0000 L CNN
F 1 "100" H 3569 3845 50  0000 L CNN
F 2 "Resistor_SMD:R_0603_1608Metric_Pad1.05x0.95mm_HandSolder" H 3510 3890 50  0001 C CNN
F 3 "~" H 3510 3890 50  0001 C CNN
	1    3510 3890
	0    -1   -1   0   
$EndComp
$Comp
L Device:R_Small R10
U 1 1 60BE47B6
P 3510 3990
F 0 "R10" H 3569 4036 50  0000 L CNN
F 1 "100" H 3569 3945 50  0000 L CNN
F 2 "Resistor_SMD:R_0603_1608Metric_Pad1.05x0.95mm_HandSolder" H 3510 3990 50  0001 C CNN
F 3 "~" H 3510 3990 50  0001 C CNN
	1    3510 3990
	0    -1   -1   0   
$EndComp
$Comp
L Device:R_Small R11
U 1 1 60BE47BD
P 3510 4090
F 0 "R11" H 3569 4136 50  0000 L CNN
F 1 "100" H 3569 4045 50  0000 L CNN
F 2 "Resistor_SMD:R_0603_1608Metric_Pad1.05x0.95mm_HandSolder" H 3510 4090 50  0001 C CNN
F 3 "~" H 3510 4090 50  0001 C CNN
	1    3510 4090
	0    -1   -1   0   
$EndComp
$Comp
L Device:R_Small R12
U 1 1 60BE47C4
P 3510 4190
F 0 "R12" H 3569 4236 50  0000 L CNN
F 1 "100" H 3569 4145 50  0000 L CNN
F 2 "Resistor_SMD:R_0603_1608Metric_Pad1.05x0.95mm_HandSolder" H 3510 4190 50  0001 C CNN
F 3 "~" H 3510 4190 50  0001 C CNN
	1    3510 4190
	0    -1   -1   0   
$EndComp
$Comp
L Device:R_Small R14
U 1 1 60BE47CB
P 3510 4290
F 0 "R14" H 3569 4336 50  0000 L CNN
F 1 "100" H 3569 4245 50  0000 L CNN
F 2 "Resistor_SMD:R_0603_1608Metric_Pad1.05x0.95mm_HandSolder" H 3510 4290 50  0001 C CNN
F 3 "~" H 3510 4290 50  0001 C CNN
	1    3510 4290
	0    -1   -1   0   
$EndComp
Wire Wire Line
	3285 3590 3410 3590
Wire Wire Line
	3410 3690 3285 3690
Wire Wire Line
	3410 3790 3285 3790
Wire Wire Line
	3285 3890 3410 3890
Wire Wire Line
	3285 3990 3410 3990
Wire Wire Line
	3285 4090 3410 4090
Wire Wire Line
	3285 4190 3410 4190
Wire Wire Line
	3285 4290 3410 4290
Wire Wire Line
	3610 4290 4410 4290
Wire Wire Line
	3610 4190 4385 4190
Wire Wire Line
	3610 4090 4360 4090
Wire Wire Line
	3610 3990 4335 3990
Wire Wire Line
	3610 3890 4310 3890
Wire Wire Line
	3610 3790 4285 3790
Wire Wire Line
	3610 3690 4260 3690
Wire Wire Line
	3610 3590 4235 3590
$Comp
L Switch:SW_DIP_x04 SW3
U 1 1 60C2695D
P 7510 4415
F 0 "SW3" H 7510 4882 50  0000 C CNN
F 1 "SW_DIP_x04" H 7510 4791 50  0000 C CNN
F 2 "Button_Switch_THT:SW_DIP_SPSTx04_Slide_6.7x11.72mm_W7.62mm_P2.54mm_LowProfile" H 7510 4415 50  0001 C CNN
F 3 "" H 7510 4415 50  0001 C CNN
	1    7510 4415
	1    0    0    -1  
$EndComp
$Comp
L Device:R_Small R13
U 1 1 60C26C82
P 6760 4215
F 0 "R13" V 6956 4215 50  0000 C CNN
F 1 "10k" V 6865 4215 50  0000 C CNN
F 2 "Resistor_SMD:R_0603_1608Metric_Pad1.05x0.95mm_HandSolder" H 6760 4215 50  0001 C CNN
F 3 "~" H 6760 4215 50  0001 C CNN
	1    6760 4215
	0    -1   -1   0   
$EndComp
$Comp
L Device:R_Small R15
U 1 1 60C26C89
P 6760 4315
F 0 "R15" V 6956 4315 50  0000 C CNN
F 1 "10k" V 6865 4315 50  0000 C CNN
F 2 "Resistor_SMD:R_0603_1608Metric_Pad1.05x0.95mm_HandSolder" H 6760 4315 50  0001 C CNN
F 3 "~" H 6760 4315 50  0001 C CNN
	1    6760 4315
	0    -1   -1   0   
$EndComp
$Comp
L Device:R_Small R16
U 1 1 60C26C90
P 6760 4415
F 0 "R16" V 6956 4415 50  0000 C CNN
F 1 "10k" V 6865 4415 50  0000 C CNN
F 2 "Resistor_SMD:R_0603_1608Metric_Pad1.05x0.95mm_HandSolder" H 6760 4415 50  0001 C CNN
F 3 "~" H 6760 4415 50  0001 C CNN
	1    6760 4415
	0    -1   -1   0   
$EndComp
$Comp
L Device:R_Small R17
U 1 1 60C26C97
P 6760 4515
F 0 "R17" V 6956 4515 50  0000 C CNN
F 1 "10k" V 6865 4515 50  0000 C CNN
F 2 "Resistor_SMD:R_0603_1608Metric_Pad1.05x0.95mm_HandSolder" H 6760 4515 50  0001 C CNN
F 3 "~" H 6760 4515 50  0001 C CNN
	1    6760 4515
	0    -1   -1   0   
$EndComp
Wire Wire Line
	6660 4215 6535 4215
Wire Wire Line
	6535 4215 6535 4315
Wire Wire Line
	6535 4515 6660 4515
Wire Wire Line
	6660 4415 6535 4415
Connection ~ 6535 4415
Wire Wire Line
	6535 4415 6535 4515
Wire Wire Line
	6660 4315 6535 4315
Connection ~ 6535 4315
Wire Wire Line
	6535 4315 6535 4415
Wire Wire Line
	7810 4215 7935 4215
Wire Wire Line
	7935 4215 7935 4315
Wire Wire Line
	7935 4515 7810 4515
Wire Wire Line
	7810 4415 7935 4415
Connection ~ 7935 4415
Wire Wire Line
	7935 4415 7935 4515
Wire Wire Line
	7810 4315 7935 4315
Connection ~ 7935 4315
Wire Wire Line
	7935 4315 7935 4415
$Comp
L power:Earth #PWR018
U 1 1 60C7EDA8
P 7935 4590
F 0 "#PWR018" H 7935 4340 50  0001 C CNN
F 1 "Earth" H 7935 4440 50  0001 C CNN
F 2 "" H 7935 4590 50  0001 C CNN
F 3 "~" H 7935 4590 50  0001 C CNN
	1    7935 4590
	1    0    0    -1  
$EndComp
$Comp
L power:+3.3V #PWR016
U 1 1 60C84ED7
P 6435 4315
F 0 "#PWR016" H 6435 4165 50  0001 C CNN
F 1 "+3.3V" H 6450 4488 50  0000 C CNN
F 2 "" H 6435 4315 50  0001 C CNN
F 3 "" H 6435 4315 50  0001 C CNN
	1    6435 4315
	0    -1   -1   0   
$EndComp
Wire Wire Line
	6435 4315 6535 4315
Wire Wire Line
	7935 4590 7935 4515
Connection ~ 7935 4515
Wire Wire Line
	9860 2615 9760 2615
Connection ~ 9760 2615
$Comp
L Connector:Screw_Terminal_01x03 J3
U 1 1 60CB6531
P 10410 3165
F 0 "J3" H 10489 3207 50  0000 L CNN
F 1 "STRIP" H 10489 3116 50  0000 L CNN
F 2 "TerminalBlock:TerminalBlock_bornier-3_P5.08mm" H 10410 3165 50  0001 C CNN
F 3 "~" H 10410 3165 50  0001 C CNN
	1    10410 3165
	1    0    0    1   
$EndComp
$Comp
L Device:R_Small R4
U 1 1 60CB66F2
P 10010 3165
F 0 "R4" H 10069 3211 50  0000 L CNN
F 1 "100" H 10069 3120 50  0000 L CNN
F 2 "Resistor_SMD:R_0603_1608Metric_Pad1.05x0.95mm_HandSolder" H 10010 3165 50  0001 C CNN
F 3 "~" H 10010 3165 50  0001 C CNN
	1    10010 3165
	0    -1   -1   0   
$EndComp
Wire Wire Line
	9660 3165 9910 3165
Wire Wire Line
	10110 3165 10210 3165
$Comp
L power:+5V #PWR09
U 1 1 60CCF7AA
P 10210 2965
F 0 "#PWR09" H 10210 2815 50  0001 C CNN
F 1 "+5V" H 10225 3138 50  0000 C CNN
F 2 "" H 10210 2965 50  0001 C CNN
F 3 "" H 10210 2965 50  0001 C CNN
	1    10210 2965
	1    0    0    -1  
$EndComp
$Comp
L power:Earth #PWR011
U 1 1 60CD5BBF
P 10210 3340
F 0 "#PWR011" H 10210 3090 50  0001 C CNN
F 1 "Earth" H 10210 3190 50  0001 C CNN
F 2 "" H 10210 3340 50  0001 C CNN
F 3 "~" H 10210 3340 50  0001 C CNN
	1    10210 3340
	1    0    0    -1  
$EndComp
Wire Wire Line
	10210 2965 10210 3065
Wire Wire Line
	10210 3340 10210 3265
Wire Wire Line
	6660 3565 6685 3565
Wire Wire Line
	6685 3565 6685 3665
Connection ~ 6685 3665
$Comp
L power:Earth #PWR012
U 1 1 60D23AA5
P 3360 3490
F 0 "#PWR012" H 3360 3240 50  0001 C CNN
F 1 "Earth" H 3360 3340 50  0001 C CNN
F 2 "" H 3360 3490 50  0001 C CNN
F 3 "~" H 3360 3490 50  0001 C CNN
	1    3360 3490
	-1   0    0    1   
$EndComp
Wire Wire Line
	3360 3490 3285 3490
$Comp
L power:+3.3V #PWR017
U 1 1 60D4451E
P 3335 4390
F 0 "#PWR017" H 3335 4240 50  0001 C CNN
F 1 "+3.3V" H 3350 4563 50  0000 C CNN
F 2 "" H 3335 4390 50  0001 C CNN
F 3 "" H 3335 4390 50  0001 C CNN
	1    3335 4390
	1    0    0    1   
$EndComp
Wire Wire Line
	3285 4390 3335 4390
$Comp
L Device:R_Small R23
U 1 1 60D64512
P 8210 1715
F 0 "R23" V 8406 1715 50  0000 C CNN
F 1 "220" V 8315 1715 50  0000 C CNN
F 2 "Resistor_SMD:R_0603_1608Metric_Pad1.05x0.95mm_HandSolder" H 8210 1715 50  0001 C CNN
F 3 "~" H 8210 1715 50  0001 C CNN
	1    8210 1715
	0    -1   -1   0   
$EndComp
$Comp
L Device:LED D2
U 1 1 60D71DB9
P 8535 1715
F 0 "D2" H 8527 1931 50  0000 C CNN
F 1 "LED" H 8527 1840 50  0000 C CNN
F 2 "LED_SMD:LED_0603_1608Metric_Pad1.05x0.95mm_HandSolder" H 8535 1715 50  0001 C CNN
F 3 "~" H 8535 1715 50  0001 C CNN
	1    8535 1715
	-1   0    0    -1  
$EndComp
Wire Wire Line
	8110 1715 6885 1715
Wire Wire Line
	6885 1715 6885 2265
Wire Wire Line
	6885 2265 6660 2265
Wire Wire Line
	8310 1715 8385 1715
$Comp
L power:Earth #PWR022
U 1 1 60D802A4
P 8785 1715
F 0 "#PWR022" H 8785 1465 50  0001 C CNN
F 1 "Earth" H 8785 1565 50  0001 C CNN
F 2 "" H 8785 1715 50  0001 C CNN
F 3 "~" H 8785 1715 50  0001 C CNN
	1    8785 1715
	0    -1   -1   0   
$EndComp
Wire Wire Line
	8785 1715 8685 1715
$Comp
L Device:R_Small R22
U 1 1 60D87658
P 8210 1340
F 0 "R22" V 8406 1340 50  0000 C CNN
F 1 "220" V 8315 1340 50  0000 C CNN
F 2 "Resistor_SMD:R_0603_1608Metric_Pad1.05x0.95mm_HandSolder" H 8210 1340 50  0001 C CNN
F 3 "~" H 8210 1340 50  0001 C CNN
	1    8210 1340
	0    -1   -1   0   
$EndComp
$Comp
L Device:LED D1
U 1 1 60D8765F
P 8535 1340
F 0 "D1" H 8527 1556 50  0000 C CNN
F 1 "LED" H 8527 1465 50  0000 C CNN
F 2 "LED_SMD:LED_0603_1608Metric_Pad1.05x0.95mm_HandSolder" H 8535 1340 50  0001 C CNN
F 3 "~" H 8535 1340 50  0001 C CNN
	1    8535 1340
	-1   0    0    -1  
$EndComp
Wire Wire Line
	8310 1340 8385 1340
$Comp
L power:Earth #PWR021
U 1 1 60D87667
P 8785 1340
F 0 "#PWR021" H 8785 1090 50  0001 C CNN
F 1 "Earth" H 8785 1190 50  0001 C CNN
F 2 "" H 8785 1340 50  0001 C CNN
F 3 "~" H 8785 1340 50  0001 C CNN
	1    8785 1340
	0    -1   -1   0   
$EndComp
Wire Wire Line
	8785 1340 8685 1340
$Comp
L power:+3.3V #PWR020
U 1 1 60D8EBBF
P 7960 1340
F 0 "#PWR020" H 7960 1190 50  0001 C CNN
F 1 "+3.3V" H 7975 1513 50  0000 C CNN
F 2 "" H 7960 1340 50  0001 C CNN
F 3 "" H 7960 1340 50  0001 C CNN
	1    7960 1340
	0    -1   -1   0   
$EndComp
Wire Wire Line
	7960 1340 8110 1340
Wire Wire Line
	7335 2515 7335 2540
Wire Wire Line
	7335 2640 7260 2640
Wire Wire Line
	7260 2640 7260 2465
Wire Wire Line
	7260 2465 6660 2465
Wire Wire Line
	7335 2740 7210 2740
Wire Wire Line
	7210 2740 7210 2565
Wire Wire Line
	7210 2565 6660 2565
$Comp
L power:+3.3V #PWR0101
U 1 1 60E1CA18
P 7985 2715
F 0 "#PWR0101" H 7985 2565 50  0001 C CNN
F 1 "+3.3V" H 8000 2888 50  0000 C CNN
F 2 "" H 7985 2715 50  0001 C CNN
F 3 "" H 7985 2715 50  0001 C CNN
	1    7985 2715
	1    0    0    1   
$EndComp
Wire Wire Line
	8035 2715 7985 2715
Wire Wire Line
	7760 2615 8035 2615
Wire Wire Line
	7760 2515 8035 2515
Wire Wire Line
	6860 4515 6935 4515
Wire Wire Line
	6860 4415 6985 4415
Wire Wire Line
	6860 4315 7035 4315
Wire Wire Line
	6860 4215 7110 4215
Wire Wire Line
	6935 4515 6935 3365
Wire Wire Line
	6935 3365 6660 3365
Connection ~ 6935 4515
Wire Wire Line
	6935 4515 7210 4515
Wire Wire Line
	6985 4415 6985 3265
Wire Wire Line
	6985 3265 6660 3265
Connection ~ 6985 4415
Wire Wire Line
	6985 4415 7210 4415
Wire Wire Line
	7035 4315 7035 3165
Wire Wire Line
	7035 3165 6660 3165
Connection ~ 7035 4315
Wire Wire Line
	7035 4315 7210 4315
Wire Wire Line
	7110 4215 7110 3065
Wire Wire Line
	7110 3065 6660 3065
Connection ~ 7110 4215
Wire Wire Line
	7110 4215 7210 4215
$Comp
L Device:C_Small C?
U 1 1 60E81B9D
P 9360 3465
F 0 "C?" H 9452 3511 50  0000 L CNN
F 1 "0.1u" H 9452 3420 50  0000 L CNN
F 2 "Capacitor_SMD:C_0603_1608Metric_Pad1.05x0.95mm_HandSolder" H 9360 3465 50  0001 C CNN
F 3 "~" H 9360 3465 50  0001 C CNN
	1    9360 3465
	0    -1   -1   0   
$EndComp
$Comp
L Device:C_Small C?
U 1 1 60E90E41
P 8810 3465
F 0 "C?" H 8902 3511 50  0000 L CNN
F 1 "0.1u" H 8902 3420 50  0000 L CNN
F 2 "Capacitor_SMD:C_0603_1608Metric_Pad1.05x0.95mm_HandSolder" H 8810 3465 50  0001 C CNN
F 3 "~" H 8810 3465 50  0001 C CNN
	1    8810 3465
	0    -1   -1   0   
$EndComp
Wire Wire Line
	8560 3165 8560 3465
Wire Wire Line
	8710 3465 8560 3465
Connection ~ 8560 3465
Wire Wire Line
	8560 3465 8560 3590
Wire Wire Line
	9660 2965 9710 2965
Wire Wire Line
	9710 2965 9710 3465
Wire Wire Line
	9710 3465 9460 3465
Connection ~ 9660 2965
Wire Wire Line
	9260 3465 9110 3465
$Comp
L power:Earth #PWR?
U 1 1 60EECA2F
P 9110 3540
F 0 "#PWR?" H 9110 3290 50  0001 C CNN
F 1 "Earth" H 9110 3390 50  0001 C CNN
F 2 "" H 9110 3540 50  0001 C CNN
F 3 "~" H 9110 3540 50  0001 C CNN
	1    9110 3540
	1    0    0    -1  
$EndComp
Wire Wire Line
	9110 3540 9110 3465
Connection ~ 9110 3465
Wire Wire Line
	9110 3465 8910 3465
$EndSCHEMATC
