PCBNEW-LibModule-V1  2021-01-05 21:17:47
# encoding utf-8
Units mm
$INDEX
SOP80P1193X250-43N
$EndINDEX
$MODULE SOP80P1193X250-43N
Po 0 0 0 15 5ff4d77b 00000000 ~~
Li SOP80P1193X250-43N
Cd PK42EP
Kw Integrated Circuit
Sc 0
At SMD
AR 
Op 0 0 0
T0 0 0 1.27 1.27 0 0.254 N V 21 N "IC**"
T1 0 0 1.27 1.27 0 0.254 N I 21 N "SOP80P1193X250-43N"
DS -6.825 -9.15 6.825 -9.15 0.05 24
DS 6.825 -9.15 6.825 9.15 0.05 24
DS 6.825 9.15 -6.825 9.15 0.05 24
DS -6.825 9.15 -6.825 -9.15 0.05 24
DS -4.2 -8.75 4.2 -8.75 0.1 24
DS 4.2 -8.75 4.2 8.75 0.1 24
DS 4.2 8.75 -4.2 8.75 0.1 24
DS -4.2 8.75 -4.2 -8.75 0.1 24
DS -4.2 -7.95 -3.4 -8.75 0.1 24
DS -6.575 -8.65 -4.775 -8.65 0.2 21
$PAD
Po -5.675 -8
Sh "1" R 0.6 1.8 0 0 900
At SMD N 00888000
Ne 0 ""
$EndPAD
$PAD
Po -5.675 -7.2
Sh "2" R 0.6 1.8 0 0 900
At SMD N 00888000
Ne 0 ""
$EndPAD
$PAD
Po -5.675 -6.4
Sh "3" R 0.6 1.8 0 0 900
At SMD N 00888000
Ne 0 ""
$EndPAD
$PAD
Po -5.675 -5.6
Sh "4" R 0.6 1.8 0 0 900
At SMD N 00888000
Ne 0 ""
$EndPAD
$PAD
Po -5.675 -4.8
Sh "5" R 0.6 1.8 0 0 900
At SMD N 00888000
Ne 0 ""
$EndPAD
$PAD
Po -5.675 -4
Sh "6" R 0.6 1.8 0 0 900
At SMD N 00888000
Ne 0 ""
$EndPAD
$PAD
Po -5.675 -3.2
Sh "7" R 0.6 1.8 0 0 900
At SMD N 00888000
Ne 0 ""
$EndPAD
$PAD
Po -5.675 -2.4
Sh "8" R 0.6 1.8 0 0 900
At SMD N 00888000
Ne 0 ""
$EndPAD
$PAD
Po -5.675 -1.6
Sh "9" R 0.6 1.8 0 0 900
At SMD N 00888000
Ne 0 ""
$EndPAD
$PAD
Po -5.675 -0.8
Sh "10" R 0.6 1.8 0 0 900
At SMD N 00888000
Ne 0 ""
$EndPAD
$PAD
Po -5.675 0
Sh "11" R 0.6 1.8 0 0 900
At SMD N 00888000
Ne 0 ""
$EndPAD
$PAD
Po -5.675 0.8
Sh "12" R 0.6 1.8 0 0 900
At SMD N 00888000
Ne 0 ""
$EndPAD
$PAD
Po -5.675 1.6
Sh "13" R 0.6 1.8 0 0 900
At SMD N 00888000
Ne 0 ""
$EndPAD
$PAD
Po -5.675 2.4
Sh "14" R 0.6 1.8 0 0 900
At SMD N 00888000
Ne 0 ""
$EndPAD
$PAD
Po -5.675 3.2
Sh "15" R 0.6 1.8 0 0 900
At SMD N 00888000
Ne 0 ""
$EndPAD
$PAD
Po -5.675 4
Sh "16" R 0.6 1.8 0 0 900
At SMD N 00888000
Ne 0 ""
$EndPAD
$PAD
Po -5.675 4.8
Sh "17" R 0.6 1.8 0 0 900
At SMD N 00888000
Ne 0 ""
$EndPAD
$PAD
Po -5.675 5.6
Sh "18" R 0.6 1.8 0 0 900
At SMD N 00888000
Ne 0 ""
$EndPAD
$PAD
Po -5.675 6.4
Sh "19" R 0.6 1.8 0 0 900
At SMD N 00888000
Ne 0 ""
$EndPAD
$PAD
Po -5.675 7.2
Sh "20" R 0.6 1.8 0 0 900
At SMD N 00888000
Ne 0 ""
$EndPAD
$PAD
Po -5.675 8
Sh "21" R 0.6 1.8 0 0 900
At SMD N 00888000
Ne 0 ""
$EndPAD
$PAD
Po 5.675 8
Sh "22" R 0.6 1.8 0 0 900
At SMD N 00888000
Ne 0 ""
$EndPAD
$PAD
Po 5.675 7.2
Sh "23" R 0.6 1.8 0 0 900
At SMD N 00888000
Ne 0 ""
$EndPAD
$PAD
Po 5.675 6.4
Sh "24" R 0.6 1.8 0 0 900
At SMD N 00888000
Ne 0 ""
$EndPAD
$PAD
Po 5.675 5.6
Sh "25" R 0.6 1.8 0 0 900
At SMD N 00888000
Ne 0 ""
$EndPAD
$PAD
Po 5.675 4.8
Sh "26" R 0.6 1.8 0 0 900
At SMD N 00888000
Ne 0 ""
$EndPAD
$PAD
Po 5.675 4
Sh "27" R 0.6 1.8 0 0 900
At SMD N 00888000
Ne 0 ""
$EndPAD
$PAD
Po 5.675 3.2
Sh "28" R 0.6 1.8 0 0 900
At SMD N 00888000
Ne 0 ""
$EndPAD
$PAD
Po 5.675 2.4
Sh "29" R 0.6 1.8 0 0 900
At SMD N 00888000
Ne 0 ""
$EndPAD
$PAD
Po 5.675 1.6
Sh "30" R 0.6 1.8 0 0 900
At SMD N 00888000
Ne 0 ""
$EndPAD
$PAD
Po 5.675 0.8
Sh "31" R 0.6 1.8 0 0 900
At SMD N 00888000
Ne 0 ""
$EndPAD
$PAD
Po 5.675 0
Sh "32" R 0.6 1.8 0 0 900
At SMD N 00888000
Ne 0 ""
$EndPAD
$PAD
Po 5.675 -0.8
Sh "33" R 0.6 1.8 0 0 900
At SMD N 00888000
Ne 0 ""
$EndPAD
$PAD
Po 5.675 -1.6
Sh "34" R 0.6 1.8 0 0 900
At SMD N 00888000
Ne 0 ""
$EndPAD
$PAD
Po 5.675 -2.4
Sh "35" R 0.6 1.8 0 0 900
At SMD N 00888000
Ne 0 ""
$EndPAD
$PAD
Po 5.675 -3.2
Sh "36" R 0.6 1.8 0 0 900
At SMD N 00888000
Ne 0 ""
$EndPAD
$PAD
Po 5.675 -4
Sh "37" R 0.6 1.8 0 0 900
At SMD N 00888000
Ne 0 ""
$EndPAD
$PAD
Po 5.675 -4.8
Sh "38" R 0.6 1.8 0 0 900
At SMD N 00888000
Ne 0 ""
$EndPAD
$PAD
Po 5.675 -5.6
Sh "39" R 0.6 1.8 0 0 900
At SMD N 00888000
Ne 0 ""
$EndPAD
$PAD
Po 5.675 -6.4
Sh "40" R 0.6 1.8 0 0 900
At SMD N 00888000
Ne 0 ""
$EndPAD
$PAD
Po 5.675 -7.2
Sh "41" R 0.6 1.8 0 0 900
At SMD N 00888000
Ne 0 ""
$EndPAD
$PAD
Po 5.675 -8
Sh "42" R 0.6 1.8 0 0 900
At SMD N 00888000
Ne 0 ""
$EndPAD
$PAD
Po 0 0
Sh "43" R 4.2 6.2 0 0 0
At SMD N 00888000
Ne 0 ""
$EndPAD
$EndMODULE SOP80P1193X250-43N
$EndLIBRARY
