EESchema Schematic File Version 4
LIBS:Yamaha_D-cache
EELAYER 26 0
EELAYER END
$Descr A4 11693 8268
encoding utf-8
Sheet 1 1
Title ""
Date ""
Rev ""
Comp ""
Comment1 ""
Comment2 ""
Comment3 ""
Comment4 ""
$EndDescr
$Comp
L YDA138-EZ:YDA138-EZ IC1
U 1 1 5FF4C207
P 3700 2650
F 0 "IC1" H 4400 2915 50  0000 C CNN
F 1 "YDA138-EZ" H 4400 2824 50  0000 C CNN
F 2 "YDA138-EZ:SOP80P1193X250-43N" H 4950 2750 50  0001 L CNN
F 3 "https://4donline.ihs.com/images/VipMasterIC/IC/YAMA/YAMAS00192/YAMAS00192-1.pdf?hkey=EF798316E3902B6ED9A73243A3159BB0" H 4950 2650 50  0001 L CNN
F 4 "Class D audio amplifier" H 4950 2550 50  0001 L CNN "Description"
F 5 "2.5" H 4950 2450 50  0001 L CNN "Height"
F 6 "Yamaha" H 4950 2350 50  0001 L CNN "Manufacturer_Name"
F 7 "YDA138-EZ" H 4950 2250 50  0001 L CNN "Manufacturer_Part_Number"
F 8 "" H 4950 2150 50  0001 L CNN "Mouser Part Number"
F 9 "" H 4950 2050 50  0001 L CNN "Mouser Price/Stock"
F 10 "" H 4950 1950 50  0001 L CNN "Arrow Part Number"
F 11 "" H 4950 1850 50  0001 L CNN "Arrow Price/Stock"
	1    3700 2650
	1    0    0    -1  
$EndComp
$Comp
L Jumper:SolderJumper_3_Open JP2
U 1 1 5FF4C321
P 6900 3850
F 0 "JP2" V 6854 3918 50  0000 L CNN
F 1 "vol1" V 6945 3918 50  0000 L CNN
F 2 "Jumper:SolderJumper-3_P2.0mm_Open_TrianglePad1.0x1.5mm" H 6900 3850 50  0001 C CNN
F 3 "~" H 6900 3850 50  0001 C CNN
	1    6900 3850
	0    1    1    0   
$EndComp
$Comp
L Jumper:SolderJumper_3_Open JP3
U 1 1 5FF4C4AB
P 7300 3850
F 0 "JP3" V 7254 3918 50  0000 L CNN
F 1 "vol0" V 7345 3918 50  0000 L CNN
F 2 "Jumper:SolderJumper-3_P2.0mm_Open_TrianglePad1.0x1.5mm" H 7300 3850 50  0001 C CNN
F 3 "~" H 7300 3850 50  0001 C CNN
	1    7300 3850
	0    1    1    0   
$EndComp
$Comp
L Jumper:SolderJumper_3_Open JP4
U 1 1 5FF4C4C7
P 7700 3850
F 0 "JP4" V 7654 3918 50  0000 L CNN
F 1 "m2" V 7745 3918 50  0000 L CNN
F 2 "Jumper:SolderJumper-3_P2.0mm_Open_TrianglePad1.0x1.5mm" H 7700 3850 50  0001 C CNN
F 3 "~" H 7700 3850 50  0001 C CNN
	1    7700 3850
	0    1    1    0   
$EndComp
$Comp
L Jumper:SolderJumper_3_Open JP5
U 1 1 5FF4C4E4
P 8100 3850
F 0 "JP5" V 8054 3918 50  0000 L CNN
F 1 "m1" V 8145 3918 50  0000 L CNN
F 2 "Jumper:SolderJumper-3_P2.0mm_Open_TrianglePad1.0x1.5mm" H 8100 3850 50  0001 C CNN
F 3 "~" H 8100 3850 50  0001 C CNN
	1    8100 3850
	0    1    1    0   
$EndComp
$Comp
L Jumper:SolderJumper_3_Open JP6
U 1 1 5FF4C4F9
P 8500 3850
F 0 "JP6" V 8454 3918 50  0000 L CNN
F 1 "m0" V 8545 3918 50  0000 L CNN
F 2 "Jumper:SolderJumper-3_P2.0mm_Open_TrianglePad1.0x1.5mm" H 8500 3850 50  0001 C CNN
F 3 "~" H 8500 3850 50  0001 C CNN
	1    8500 3850
	0    1    1    0   
$EndComp
Wire Wire Line
	5100 4150 6750 4150
Wire Wire Line
	6750 4150 6750 3850
Wire Wire Line
	5100 4250 7150 4250
Wire Wire Line
	7150 4250 7150 3850
Wire Wire Line
	5100 4350 7550 4350
Wire Wire Line
	7550 4350 7550 3850
Wire Wire Line
	5100 4450 7950 4450
Wire Wire Line
	7950 4450 7950 3850
Wire Wire Line
	5100 4550 8350 4550
Wire Wire Line
	8350 4550 8350 3850
Wire Wire Line
	5100 2750 5400 2750
Wire Wire Line
	5400 2750 5400 4650
Wire Wire Line
	5400 4650 5100 4650
$Comp
L Device:C_Small C23
U 1 1 5FF4C7A0
P 5400 4800
F 0 "C23" H 5492 4846 50  0000 L CNN
F 1 "0.1u" H 5492 4755 50  0000 L CNN
F 2 "Capacitor_SMD:C_0805_2012Metric_Pad1.15x1.40mm_HandSolder" H 5400 4800 50  0001 C CNN
F 3 "~" H 5400 4800 50  0001 C CNN
	1    5400 4800
	1    0    0    -1  
$EndComp
Wire Wire Line
	5400 4700 5400 4650
Connection ~ 5400 4650
$Comp
L power:Earth #PWR028
U 1 1 5FF4C956
P 5400 4950
F 0 "#PWR028" H 5400 4700 50  0001 C CNN
F 1 "Earth" H 5400 4800 50  0001 C CNN
F 2 "" H 5400 4950 50  0001 C CNN
F 3 "~" H 5400 4950 50  0001 C CNN
	1    5400 4950
	1    0    0    -1  
$EndComp
Wire Wire Line
	5400 4950 5400 4900
$Comp
L power:+5V #PWR09
U 1 1 5FF4CB55
P 5400 2700
F 0 "#PWR09" H 5400 2550 50  0001 C CNN
F 1 "+5V" H 5415 2873 50  0000 C CNN
F 2 "" H 5400 2700 50  0001 C CNN
F 3 "" H 5400 2700 50  0001 C CNN
	1    5400 2700
	1    0    0    -1  
$EndComp
Wire Wire Line
	5400 2700 5400 2750
Connection ~ 5400 2750
Wire Wire Line
	6900 3650 6900 3600
Wire Wire Line
	6900 3600 7300 3600
Wire Wire Line
	8500 3600 8500 3650
Wire Wire Line
	8100 3650 8100 3600
Connection ~ 8100 3600
Wire Wire Line
	8100 3600 8500 3600
Wire Wire Line
	7700 3650 7700 3600
Connection ~ 7700 3600
Wire Wire Line
	7700 3600 8100 3600
Wire Wire Line
	7300 3650 7300 3600
Connection ~ 7300 3600
Wire Wire Line
	7300 3600 7700 3600
Wire Wire Line
	6900 4050 6900 4100
Wire Wire Line
	6900 4100 7300 4100
Wire Wire Line
	8500 4100 8500 4050
Wire Wire Line
	8100 4050 8100 4100
Connection ~ 8100 4100
Wire Wire Line
	8100 4100 8500 4100
Wire Wire Line
	7700 4050 7700 4100
Connection ~ 7700 4100
Wire Wire Line
	7700 4100 8100 4100
Wire Wire Line
	7300 4050 7300 4100
Connection ~ 7300 4100
Wire Wire Line
	7300 4100 7700 4100
$Comp
L power:+5V #PWR019
U 1 1 5FF4E17E
P 7700 3550
F 0 "#PWR019" H 7700 3400 50  0001 C CNN
F 1 "+5V" H 7715 3723 50  0000 C CNN
F 2 "" H 7700 3550 50  0001 C CNN
F 3 "" H 7700 3550 50  0001 C CNN
	1    7700 3550
	1    0    0    -1  
$EndComp
Wire Wire Line
	7700 3550 7700 3600
$Comp
L power:Earth #PWR022
U 1 1 5FF4EA3F
P 7700 4150
F 0 "#PWR022" H 7700 3900 50  0001 C CNN
F 1 "Earth" H 7700 4000 50  0001 C CNN
F 2 "" H 7700 4150 50  0001 C CNN
F 3 "~" H 7700 4150 50  0001 C CNN
	1    7700 4150
	1    0    0    -1  
$EndComp
Wire Wire Line
	7700 4150 7700 4100
$Comp
L Jumper:SolderJumper_3_Open JP1
U 1 1 5FF4F494
P 2550 3150
F 0 "JP1" V 2504 3218 50  0000 L CNN
F 1 "m0" V 2595 3218 50  0000 L CNN
F 2 "Jumper:SolderJumper-3_P2.0mm_Open_TrianglePad1.0x1.5mm" H 2550 3150 50  0001 C CNN
F 3 "~" H 2550 3150 50  0001 C CNN
	1    2550 3150
	0    -1   1    0   
$EndComp
Wire Wire Line
	2700 3150 3150 3150
$Comp
L power:+5V #PWR010
U 1 1 5FF50865
P 2550 2900
F 0 "#PWR010" H 2550 2750 50  0001 C CNN
F 1 "+5V" H 2565 3073 50  0000 C CNN
F 2 "" H 2550 2900 50  0001 C CNN
F 3 "" H 2550 2900 50  0001 C CNN
	1    2550 2900
	1    0    0    -1  
$EndComp
Wire Wire Line
	2550 2900 2550 2950
$Comp
L power:VCC #PWR023
U 1 1 5FF51342
P 3650 4250
F 0 "#PWR023" H 3650 4100 50  0001 C CNN
F 1 "VCC" V 3668 4377 50  0000 L CNN
F 2 "" H 3650 4250 50  0001 C CNN
F 3 "" H 3650 4250 50  0001 C CNN
	1    3650 4250
	0    -1   -1   0   
$EndComp
Wire Wire Line
	3650 4250 3700 4250
Wire Wire Line
	3700 2750 3350 2750
Wire Wire Line
	3350 2750 3350 2850
Wire Wire Line
	3350 4350 3700 4350
Wire Wire Line
	3700 2850 3350 2850
Connection ~ 3350 2850
Wire Wire Line
	3350 2850 3350 4350
$Comp
L power:Earth #PWR029
U 1 1 5FF52884
P 3350 5050
F 0 "#PWR029" H 3350 4800 50  0001 C CNN
F 1 "Earth" H 3350 4900 50  0001 C CNN
F 2 "" H 3350 5050 50  0001 C CNN
F 3 "~" H 3350 5050 50  0001 C CNN
	1    3350 5050
	1    0    0    -1  
$EndComp
Wire Wire Line
	3350 5050 3350 4650
Connection ~ 3350 4350
$Comp
L Transistor_FET:2N7002 Q1
U 1 1 5FF53AF2
P 2400 4150
F 0 "Q1" H 2250 4250 50  0000 L CNN
F 1 "2N7002" H 2050 4050 50  0000 L CNN
F 2 "Package_TO_SOT_SMD:SOT-23" H 2600 4075 50  0001 L CIN
F 3 "https://www.fairchildsemi.com/datasheets/2N/2N7002.pdf" H 2400 4150 50  0001 L CNN
	1    2400 4150
	-1   0    0    -1  
$EndComp
$Comp
L Device:R_Small R4
U 1 1 5FF53C55
P 2300 3800
F 0 "R4" H 2359 3846 50  0000 L CNN
F 1 "1k" H 2359 3755 50  0000 L CNN
F 2 "Resistor_SMD:R_0805_2012Metric_Pad1.15x1.40mm_HandSolder" H 2300 3800 50  0001 C CNN
F 3 "~" H 2300 3800 50  0001 C CNN
	1    2300 3800
	1    0    0    -1  
$EndComp
$Comp
L Device:R_Small R5
U 1 1 5FF53D20
P 2600 3800
F 0 "R5" H 2659 3846 50  0000 L CNN
F 1 "100k" H 2659 3755 50  0000 L CNN
F 2 "Resistor_SMD:R_0805_2012Metric_Pad1.15x1.40mm_HandSolder" H 2600 3800 50  0001 C CNN
F 3 "~" H 2600 3800 50  0001 C CNN
	1    2600 3800
	1    0    0    -1  
$EndComp
Wire Wire Line
	2300 3950 2300 3900
Wire Wire Line
	2600 3900 2600 4150
Wire Wire Line
	2600 3700 2600 3600
Wire Wire Line
	2600 3600 2300 3600
Wire Wire Line
	2300 3600 2300 3700
Wire Wire Line
	3700 4150 2600 4150
Connection ~ 2600 4150
$Comp
L Device:LED D1
U 1 1 5FF57177
P 2000 4200
F 0 "D1" V 2038 4278 50  0000 L CNN
F 1 "LED" V 1947 4278 50  0000 L CNN
F 2 "TerminalBlock_TE-Connectivity:TerminalBlock_TE_282834-2_1x02_P2.54mm_Horizontal" H 2000 4200 50  0001 C CNN
F 3 "~" H 2000 4200 50  0001 C CNN
	1    2000 4200
	0    1    1    0   
$EndComp
Wire Wire Line
	2000 4050 2000 3950
Wire Wire Line
	2000 3950 2300 3950
Connection ~ 2300 3950
Wire Wire Line
	2000 4350 2150 4350
$Comp
L power:Earth #PWR024
U 1 1 5FF5BFDC
P 2150 4400
F 0 "#PWR024" H 2150 4150 50  0001 C CNN
F 1 "Earth" H 2150 4250 50  0001 C CNN
F 2 "" H 2150 4400 50  0001 C CNN
F 3 "~" H 2150 4400 50  0001 C CNN
	1    2150 4400
	1    0    0    -1  
$EndComp
Wire Wire Line
	2150 4400 2150 4350
Connection ~ 2150 4350
Wire Wire Line
	2150 4350 2300 4350
$Comp
L power:VCC #PWR018
U 1 1 5FF5EB74
P 2300 3550
F 0 "#PWR018" H 2300 3400 50  0001 C CNN
F 1 "VCC" V 2318 3677 50  0000 L CNN
F 2 "" H 2300 3550 50  0001 C CNN
F 3 "" H 2300 3550 50  0001 C CNN
	1    2300 3550
	1    0    0    -1  
$EndComp
Wire Wire Line
	2300 3550 2300 3600
Connection ~ 2300 3600
Wire Wire Line
	3700 4650 3350 4650
Connection ~ 3350 4650
Wire Wire Line
	3350 4650 3350 4350
$Comp
L Device:CP C9
U 1 1 5FF65A77
P 3700 1950
F 0 "C9" H 3582 1904 50  0000 R CNN
F 1 "330u" H 3582 1995 50  0000 R CNN
F 2 "Capacitor_SMD:CP_Elec_10x10.5" H 3738 1800 50  0001 C CNN
F 3 "~" H 3700 1950 50  0001 C CNN
	1    3700 1950
	-1   0    0    1   
$EndComp
$Comp
L Device:CP C10
U 1 1 5FF65BB1
P 5100 1950
F 0 "C10" H 4982 1904 50  0000 R CNN
F 1 "330u" H 4982 1995 50  0000 R CNN
F 2 "Capacitor_SMD:CP_Elec_10x10.5" H 5138 1800 50  0001 C CNN
F 3 "~" H 5100 1950 50  0001 C CNN
	1    5100 1950
	-1   0    0    1   
$EndComp
Wire Wire Line
	3700 2650 3700 2100
Wire Wire Line
	5100 2650 5100 2100
$Comp
L Device:R_Small R1
U 1 1 5FF69123
P 3900 1700
F 0 "R1" V 3704 1700 50  0000 C CNN
F 1 "1k" V 3795 1700 50  0000 C CNN
F 2 "Resistor_SMD:R_0805_2012Metric_Pad1.15x1.40mm_HandSolder" H 3900 1700 50  0001 C CNN
F 3 "~" H 3900 1700 50  0001 C CNN
	1    3900 1700
	0    1    1    0   
$EndComp
$Comp
L Device:R_Small R2
U 1 1 5FF6928F
P 4900 1700
F 0 "R2" V 4704 1700 50  0000 C CNN
F 1 "1k" V 4795 1700 50  0000 C CNN
F 2 "Resistor_SMD:R_0805_2012Metric_Pad1.15x1.40mm_HandSolder" H 4900 1700 50  0001 C CNN
F 3 "~" H 4900 1700 50  0001 C CNN
	1    4900 1700
	0    1    1    0   
$EndComp
Wire Wire Line
	3700 1800 3700 1700
Wire Wire Line
	3700 1700 3800 1700
Wire Wire Line
	5100 1800 5100 1700
Wire Wire Line
	5100 1700 5000 1700
Wire Wire Line
	4000 1700 4200 1700
$Comp
L power:Earth #PWR05
U 1 1 5FF6E1F0
P 4400 1750
F 0 "#PWR05" H 4400 1500 50  0001 C CNN
F 1 "Earth" H 4400 1600 50  0001 C CNN
F 2 "" H 4400 1750 50  0001 C CNN
F 3 "~" H 4400 1750 50  0001 C CNN
	1    4400 1750
	1    0    0    -1  
$EndComp
Wire Wire Line
	4400 1750 4400 1700
Connection ~ 4400 1700
Wire Wire Line
	4400 1700 4600 1700
$Comp
L Device:R_Small R3
U 1 1 5FF70E47
P 5600 1800
F 0 "R3" H 5659 1846 50  0000 L CNN
F 1 "100k" H 5659 1755 50  0000 L CNN
F 2 "Resistor_SMD:R_0805_2012Metric_Pad1.15x1.40mm_HandSolder" H 5600 1800 50  0001 C CNN
F 3 "~" H 5600 1800 50  0001 C CNN
	1    5600 1800
	1    0    0    -1  
$EndComp
Wire Wire Line
	5100 3150 5600 3150
Wire Wire Line
	5600 3150 5600 2100
$Comp
L power:+5V #PWR04
U 1 1 5FF73C1B
P 5600 1650
F 0 "#PWR04" H 5600 1500 50  0001 C CNN
F 1 "+5V" H 5615 1823 50  0000 C CNN
F 2 "" H 5600 1650 50  0001 C CNN
F 3 "" H 5600 1650 50  0001 C CNN
	1    5600 1650
	1    0    0    -1  
$EndComp
Wire Wire Line
	5600 1650 5600 1700
$Comp
L Connector_Generic:Conn_01x04 J2
U 1 1 5FF76C3A
P 4400 1150
F 0 "J2" V 4366 862 50  0000 R CNN
F 1 "phone" V 4275 862 50  0000 R CNN
F 2 "TerminalBlock_MetzConnect:TerminalBlock_MetzConnect_Type171_RT13704HBWC_1x04_P7.50mm_Horizontal" H 4400 1150 50  0001 C CNN
F 3 "~" H 4400 1150 50  0001 C CNN
	1    4400 1150
	0    -1   -1   0   
$EndComp
Wire Wire Line
	4600 1350 5450 1350
Wire Wire Line
	5450 1350 5450 2100
Wire Wire Line
	5450 2100 5600 2100
Connection ~ 5600 2100
Wire Wire Line
	5600 2100 5600 1900
Wire Wire Line
	4500 1350 4500 1450
Wire Wire Line
	4500 1450 5100 1450
Wire Wire Line
	5100 1450 5100 1700
Connection ~ 5100 1700
Wire Wire Line
	4400 1350 4400 1700
Wire Wire Line
	4300 1350 3700 1350
Wire Wire Line
	3700 1350 3700 1700
Connection ~ 3700 1700
$Comp
L Device:C_Small C12
U 1 1 5FF7E293
P 4200 2050
F 0 "C12" H 4292 2096 50  0000 L CNN
F 1 "1u" H 4292 2005 50  0000 L CNN
F 2 "Capacitor_SMD:C_0805_2012Metric_Pad1.15x1.40mm_HandSolder" H 4200 2050 50  0001 C CNN
F 3 "~" H 4200 2050 50  0001 C CNN
	1    4200 2050
	1    0    0    -1  
$EndComp
$Comp
L Device:C_Small C13
U 1 1 5FF8024B
P 4600 2050
F 0 "C13" H 4692 2096 50  0000 L CNN
F 1 "1u" H 4692 2005 50  0000 L CNN
F 2 "Capacitor_SMD:C_0805_2012Metric_Pad1.15x1.40mm_HandSolder" H 4600 2050 50  0001 C CNN
F 3 "~" H 4600 2050 50  0001 C CNN
	1    4600 2050
	1    0    0    -1  
$EndComp
Wire Wire Line
	3700 2950 3600 2950
Wire Wire Line
	3600 2950 3600 2150
Wire Wire Line
	3600 2150 4200 2150
Wire Wire Line
	5100 2950 5200 2950
Wire Wire Line
	5200 2950 5200 2150
Wire Wire Line
	5200 2150 4600 2150
Wire Wire Line
	4200 1950 4200 1700
Connection ~ 4200 1700
Wire Wire Line
	4200 1700 4400 1700
Wire Wire Line
	4600 1950 4600 1700
Connection ~ 4600 1700
Wire Wire Line
	4600 1700 4800 1700
$Comp
L Device:CP C8
U 1 1 5FF8B404
P 3200 1950
F 0 "C8" H 3082 1904 50  0000 R CNN
F 1 "1u" H 3082 1995 50  0000 R CNN
F 2 "Capacitor_SMD:CP_Elec_4x5.4" H 3238 1800 50  0001 C CNN
F 3 "~" H 3200 1950 50  0001 C CNN
	1    3200 1950
	-1   0    0    -1  
$EndComp
$Comp
L Device:CP C11
U 1 1 5FF929B4
P 6000 1950
F 0 "C11" H 5882 1904 50  0000 R CNN
F 1 "1u" H 5882 1995 50  0000 R CNN
F 2 "Capacitor_SMD:CP_Elec_4x5.4" H 6038 1800 50  0001 C CNN
F 3 "~" H 6000 1950 50  0001 C CNN
	1    6000 1950
	-1   0    0    -1  
$EndComp
Wire Wire Line
	3700 3050 3200 3050
Wire Wire Line
	3200 3050 3200 2100
Wire Wire Line
	5100 3050 6000 3050
Wire Wire Line
	6000 3050 6000 2100
$Comp
L Connector_Generic:Conn_01x03 J1
U 1 1 5FF9A46D
P 4450 750
F 0 "J1" V 4416 562 50  0000 R CNN
F 1 "input" V 4325 562 50  0000 R CNN
F 2 "TerminalBlock_MetzConnect:TerminalBlock_MetzConnect_Type171_RT13703HBWC_1x03_P7.50mm_Horizontal" H 4450 750 50  0001 C CNN
F 3 "~" H 4450 750 50  0001 C CNN
	1    4450 750 
	0    -1   -1   0   
$EndComp
Wire Wire Line
	4350 950  3200 950 
Wire Wire Line
	3200 950  3200 1800
Wire Wire Line
	4550 950  6000 950 
Wire Wire Line
	6000 950  6000 1800
$Comp
L power:Earth #PWR01
U 1 1 5FFA00D3
P 4450 1000
F 0 "#PWR01" H 4450 750 50  0001 C CNN
F 1 "Earth" H 4450 850 50  0001 C CNN
F 2 "" H 4450 1000 50  0001 C CNN
F 3 "~" H 4450 1000 50  0001 C CNN
	1    4450 1000
	1    0    0    -1  
$EndComp
Wire Wire Line
	4450 1000 4450 950 
$Comp
L Device:C_Small C21
U 1 1 5FFA9932
P 5750 3350
F 0 "C21" H 5842 3396 50  0000 L CNN
F 1 "4.7u" H 5842 3305 50  0000 L CNN
F 2 "Capacitor_SMD:C_0805_2012Metric_Pad1.15x1.40mm_HandSolder" H 5750 3350 50  0001 C CNN
F 3 "~" H 5750 3350 50  0001 C CNN
	1    5750 3350
	1    0    0    -1  
$EndComp
$Comp
L Device:C_Small C20
U 1 1 5FFAC9BB
P 2800 3350
F 0 "C20" H 2892 3396 50  0000 L CNN
F 1 "4.7u" H 2892 3305 50  0000 L CNN
F 2 "Capacitor_SMD:C_0805_2012Metric_Pad1.15x1.40mm_HandSolder" H 2800 3350 50  0001 C CNN
F 3 "~" H 2800 3350 50  0001 C CNN
	1    2800 3350
	1    0    0    -1  
$EndComp
Wire Wire Line
	3700 3250 2800 3250
Wire Wire Line
	5100 3250 5750 3250
$Comp
L power:Earth #PWR017
U 1 1 5FFB5A26
P 5750 3500
F 0 "#PWR017" H 5750 3250 50  0001 C CNN
F 1 "Earth" H 5750 3350 50  0001 C CNN
F 2 "" H 5750 3500 50  0001 C CNN
F 3 "~" H 5750 3500 50  0001 C CNN
	1    5750 3500
	1    0    0    -1  
$EndComp
$Comp
L power:Earth #PWR016
U 1 1 5FFB8B25
P 2800 3500
F 0 "#PWR016" H 2800 3250 50  0001 C CNN
F 1 "Earth" H 2800 3350 50  0001 C CNN
F 2 "" H 2800 3500 50  0001 C CNN
F 3 "~" H 2800 3500 50  0001 C CNN
	1    2800 3500
	1    0    0    -1  
$EndComp
Wire Wire Line
	2800 3500 2800 3450
Wire Wire Line
	5750 3500 5750 3450
$Comp
L power:VCC #PWR012
U 1 1 5FFC214B
P 2800 3100
F 0 "#PWR012" H 2800 2950 50  0001 C CNN
F 1 "VCC" V 2818 3227 50  0000 L CNN
F 2 "" H 2800 3100 50  0001 C CNN
F 3 "" H 2800 3100 50  0001 C CNN
	1    2800 3100
	1    0    0    -1  
$EndComp
$Comp
L power:VCC #PWR013
U 1 1 5FFC545D
P 5750 3200
F 0 "#PWR013" H 5750 3050 50  0001 C CNN
F 1 "VCC" V 5768 3327 50  0000 L CNN
F 2 "" H 5750 3200 50  0001 C CNN
F 3 "" H 5750 3200 50  0001 C CNN
	1    5750 3200
	1    0    0    -1  
$EndComp
Wire Wire Line
	5750 3200 5750 3250
Connection ~ 5750 3250
Wire Wire Line
	2800 3100 2800 3250
Connection ~ 2800 3250
$Comp
L Device:L_Core_Ferrite L3
U 1 1 5FFD297E
P 6950 2750
F 0 "L3" V 7175 2750 50  0000 C CNN
F 1 "22uH" V 7084 2750 50  0000 C CNN
F 2 "Inductor_SMD:L_12x12mm_H8mm" H 6950 2750 50  0001 C CNN
F 3 "~" H 6950 2750 50  0001 C CNN
	1    6950 2750
	0    -1   -1   0   
$EndComp
$Comp
L Device:L_Core_Ferrite L4
U 1 1 5FFD2B26
P 6950 3000
F 0 "L4" V 7175 3000 50  0000 C CNN
F 1 "22uH" V 7084 3000 50  0000 C CNN
F 2 "Inductor_SMD:L_12x12mm_H8mm" H 6950 3000 50  0001 C CNN
F 3 "~" H 6950 3000 50  0001 C CNN
	1    6950 3000
	0    -1   1    0   
$EndComp
$Comp
L Device:L_Core_Ferrite L1
U 1 1 5FFDCB4A
P 2200 2000
F 0 "L1" V 2425 2000 50  0000 C CNN
F 1 "22uH" V 2334 2000 50  0000 C CNN
F 2 "Inductor_SMD:L_12x12mm_H8mm" H 2200 2000 50  0001 C CNN
F 3 "~" H 2200 2000 50  0001 C CNN
	1    2200 2000
	0    -1   -1   0   
$EndComp
$Comp
L Device:L_Core_Ferrite L2
U 1 1 5FFDCB51
P 2200 2250
F 0 "L2" V 2425 2250 50  0000 C CNN
F 1 "22uH" V 2334 2250 50  0000 C CNN
F 2 "Inductor_SMD:L_12x12mm_H8mm" H 2200 2250 50  0001 C CNN
F 3 "~" H 2200 2250 50  0001 C CNN
	1    2200 2250
	0    -1   1    0   
$EndComp
Wire Wire Line
	5100 3350 5650 3350
Wire Wire Line
	5650 3350 5650 3600
Wire Wire Line
	5650 3600 6500 3600
Wire Wire Line
	6500 3600 6500 2750
Wire Wire Line
	6500 2750 6800 2750
Wire Wire Line
	5100 3950 6600 3950
Wire Wire Line
	6600 3950 6600 3000
Wire Wire Line
	6600 3000 6800 3000
Wire Wire Line
	3700 3350 3050 3350
Wire Wire Line
	3050 3350 3050 2000
Wire Wire Line
	3050 2000 2350 2000
Wire Wire Line
	3700 3950 2950 3950
Wire Wire Line
	2950 3950 2950 2250
Wire Wire Line
	2950 2250 2350 2250
$Comp
L Device:C_Small C16
U 1 1 5FFEF856
P 7250 2600
F 0 "C16" H 7342 2646 50  0000 L CNN
F 1 "0.01u" H 7342 2555 50  0000 L CNN
F 2 "Capacitor_SMD:C_0805_2012Metric_Pad1.15x1.40mm_HandSolder" H 7250 2600 50  0001 C CNN
F 3 "~" H 7250 2600 50  0001 C CNN
	1    7250 2600
	1    0    0    -1  
$EndComp
$Comp
L Device:C_Small C17
U 1 1 5FFF3C0A
P 7250 2900
F 0 "C17" H 7342 2946 50  0000 L CNN
F 1 "0.22u" H 7342 2855 50  0000 L CNN
F 2 "Capacitor_SMD:C_0805_2012Metric_Pad1.15x1.40mm_HandSolder" H 7250 2900 50  0001 C CNN
F 3 "~" H 7250 2900 50  0001 C CNN
	1    7250 2900
	1    0    0    -1  
$EndComp
$Comp
L Device:C_Small C19
U 1 1 5FFF7F2F
P 7250 3200
F 0 "C19" H 7342 3246 50  0000 L CNN
F 1 "0.01u" H 7342 3155 50  0000 L CNN
F 2 "Capacitor_SMD:C_0805_2012Metric_Pad1.15x1.40mm_HandSolder" H 7250 3200 50  0001 C CNN
F 3 "~" H 7250 3200 50  0001 C CNN
	1    7250 3200
	1    0    0    -1  
$EndComp
$Comp
L Device:C_Small C7
U 1 1 5FFFC31D
P 1700 1800
F 0 "C7" H 1792 1846 50  0000 L CNN
F 1 "0.01u" H 1792 1755 50  0000 L CNN
F 2 "Capacitor_SMD:C_0805_2012Metric_Pad1.15x1.40mm_HandSolder" H 1700 1800 50  0001 C CNN
F 3 "~" H 1700 1800 50  0001 C CNN
	1    1700 1800
	1    0    0    -1  
$EndComp
$Comp
L Device:C_Small C14
U 1 1 5FFFC324
P 1700 2100
F 0 "C14" H 1792 2146 50  0000 L CNN
F 1 "0.22u" H 1792 2055 50  0000 L CNN
F 2 "Capacitor_SMD:C_0805_2012Metric_Pad1.15x1.40mm_HandSolder" H 1700 2100 50  0001 C CNN
F 3 "~" H 1700 2100 50  0001 C CNN
	1    1700 2100
	1    0    0    -1  
$EndComp
$Comp
L Device:C_Small C15
U 1 1 5FFFC32B
P 1700 2400
F 0 "C15" H 1792 2446 50  0000 L CNN
F 1 "0.01u" H 1792 2355 50  0000 L CNN
F 2 "Capacitor_SMD:C_0805_2012Metric_Pad1.15x1.40mm_HandSolder" H 1700 2400 50  0001 C CNN
F 3 "~" H 1700 2400 50  0001 C CNN
	1    1700 2400
	1    0    0    -1  
$EndComp
$Comp
L Connector:Screw_Terminal_01x02 J5
U 1 1 60000BB0
P 7950 2850
F 0 "J5" H 8029 2842 50  0000 L CNN
F 1 "Left" H 8029 2751 50  0000 L CNN
F 2 "TerminalBlock_RND:TerminalBlock_RND_205-00023_1x02_P10.00mm_Horizontal" H 7950 2850 50  0001 C CNN
F 3 "~" H 7950 2850 50  0001 C CNN
	1    7950 2850
	1    0    0    -1  
$EndComp
$Comp
L Connector:Screw_Terminal_01x02 J4
U 1 1 60000CEB
P 1200 2050
F 0 "J4" H 1120 2267 50  0000 C CNN
F 1 "Right" H 1120 2176 50  0000 C CNN
F 2 "TerminalBlock_RND:TerminalBlock_RND_205-00023_1x02_P10.00mm_Horizontal" H 1200 2050 50  0001 C CNN
F 3 "~" H 1200 2050 50  0001 C CNN
	1    1200 2050
	-1   0    0    -1  
$EndComp
Wire Wire Line
	2050 2000 1700 2000
Wire Wire Line
	1400 2000 1400 2050
Connection ~ 1700 2000
Wire Wire Line
	1700 2000 1400 2000
Wire Wire Line
	2050 2250 1700 2250
Wire Wire Line
	1400 2250 1400 2150
Wire Wire Line
	1700 2200 1700 2250
Connection ~ 1700 2250
Wire Wire Line
	1700 2250 1400 2250
Wire Wire Line
	1700 2300 1700 2250
Wire Wire Line
	1700 1900 1700 2000
Wire Wire Line
	7750 2850 7750 2750
Wire Wire Line
	7750 2750 7250 2750
Wire Wire Line
	7750 2950 7750 3000
Wire Wire Line
	7750 3000 7250 3000
Connection ~ 7250 3000
Wire Wire Line
	7250 3000 7100 3000
Wire Wire Line
	7250 2800 7250 2750
Connection ~ 7250 2750
Wire Wire Line
	7250 2750 7100 2750
Wire Wire Line
	7250 2750 7250 2700
Wire Wire Line
	7250 3100 7250 3000
$Comp
L power:Earth #PWR015
U 1 1 60040108
P 7250 3350
F 0 "#PWR015" H 7250 3100 50  0001 C CNN
F 1 "Earth" H 7250 3200 50  0001 C CNN
F 2 "" H 7250 3350 50  0001 C CNN
F 3 "~" H 7250 3350 50  0001 C CNN
	1    7250 3350
	1    0    0    -1  
$EndComp
$Comp
L power:Earth #PWR08
U 1 1 6004B185
P 1700 2550
F 0 "#PWR08" H 1700 2300 50  0001 C CNN
F 1 "Earth" H 1700 2400 50  0001 C CNN
F 2 "" H 1700 2550 50  0001 C CNN
F 3 "~" H 1700 2550 50  0001 C CNN
	1    1700 2550
	1    0    0    -1  
$EndComp
$Comp
L power:Earth #PWR03
U 1 1 600509B1
P 1700 1650
F 0 "#PWR03" H 1700 1400 50  0001 C CNN
F 1 "Earth" H 1700 1500 50  0001 C CNN
F 2 "" H 1700 1650 50  0001 C CNN
F 3 "~" H 1700 1650 50  0001 C CNN
	1    1700 1650
	1    0    0    1   
$EndComp
$Comp
L power:Earth #PWR07
U 1 1 6006127D
P 7250 2450
F 0 "#PWR07" H 7250 2200 50  0001 C CNN
F 1 "Earth" H 7250 2300 50  0001 C CNN
F 2 "" H 7250 2450 50  0001 C CNN
F 3 "~" H 7250 2450 50  0001 C CNN
	1    7250 2450
	1    0    0    1   
$EndComp
Wire Wire Line
	7250 2450 7250 2500
Wire Wire Line
	7250 3350 7250 3300
Wire Wire Line
	1700 2550 1700 2500
Wire Wire Line
	1700 1700 1700 1650
Wire Wire Line
	3700 3450 3600 3450
Wire Wire Line
	3600 3450 3600 3550
Wire Wire Line
	3600 3850 3700 3850
Wire Wire Line
	3700 3750 3600 3750
Connection ~ 3600 3750
Wire Wire Line
	3600 3750 3600 3850
Wire Wire Line
	3700 3650 3600 3650
Connection ~ 3600 3650
Wire Wire Line
	3600 3650 3600 3750
Wire Wire Line
	3700 3550 3600 3550
Connection ~ 3600 3550
Wire Wire Line
	3600 3550 3600 3650
$Comp
L power:Earth #PWR020
U 1 1 6009C6A1
P 3550 3650
F 0 "#PWR020" H 3550 3400 50  0001 C CNN
F 1 "Earth" H 3550 3500 50  0001 C CNN
F 2 "" H 3550 3650 50  0001 C CNN
F 3 "~" H 3550 3650 50  0001 C CNN
	1    3550 3650
	0    1    -1   0   
$EndComp
Wire Wire Line
	3550 3650 3600 3650
Wire Wire Line
	5100 3450 5200 3450
Wire Wire Line
	5200 3450 5200 3550
Wire Wire Line
	5200 3850 5100 3850
Wire Wire Line
	5100 3750 5200 3750
Connection ~ 5200 3750
Wire Wire Line
	5200 3750 5200 3850
Wire Wire Line
	5100 3650 5200 3650
Connection ~ 5200 3650
Wire Wire Line
	5200 3650 5200 3750
Wire Wire Line
	5100 3550 5200 3550
Connection ~ 5200 3550
Wire Wire Line
	5200 3550 5200 3650
$Comp
L power:Earth #PWR021
U 1 1 600CCF90
P 5250 3650
F 0 "#PWR021" H 5250 3400 50  0001 C CNN
F 1 "Earth" H 5250 3500 50  0001 C CNN
F 2 "" H 5250 3650 50  0001 C CNN
F 3 "~" H 5250 3650 50  0001 C CNN
	1    5250 3650
	0    -1   1    0   
$EndComp
Wire Wire Line
	5250 3650 5200 3650
$Comp
L Device:C_Small C25
U 1 1 600F9FEB
P 6550 4900
F 0 "C25" H 6642 4946 50  0000 L CNN
F 1 "4.7u" H 6642 4855 50  0000 L CNN
F 2 "Capacitor_SMD:C_0805_2012Metric_Pad1.15x1.40mm_HandSolder" H 6550 4900 50  0001 C CNN
F 3 "~" H 6550 4900 50  0001 C CNN
	1    6550 4900
	1    0    0    -1  
$EndComp
Wire Wire Line
	5900 4800 6550 4800
$Comp
L power:Earth #PWR031
U 1 1 600F9FF3
P 6550 5050
F 0 "#PWR031" H 6550 4800 50  0001 C CNN
F 1 "Earth" H 6550 4900 50  0001 C CNN
F 2 "" H 6550 5050 50  0001 C CNN
F 3 "~" H 6550 5050 50  0001 C CNN
	1    6550 5050
	1    0    0    -1  
$EndComp
Wire Wire Line
	6550 5050 6550 5000
$Comp
L power:VCC #PWR026
U 1 1 600F9FFA
P 6550 4750
F 0 "#PWR026" H 6550 4600 50  0001 C CNN
F 1 "VCC" V 6568 4877 50  0000 L CNN
F 2 "" H 6550 4750 50  0001 C CNN
F 3 "" H 6550 4750 50  0001 C CNN
	1    6550 4750
	1    0    0    -1  
$EndComp
Wire Wire Line
	6550 4750 6550 4800
Connection ~ 6550 4800
Wire Wire Line
	5900 4800 5900 4050
Wire Wire Line
	5900 4050 5100 4050
$Comp
L Device:C_Small C22
U 1 1 60109ABB
P 2800 4650
F 0 "C22" H 2892 4696 50  0000 L CNN
F 1 "4.7u" H 2892 4605 50  0000 L CNN
F 2 "Capacitor_SMD:C_0805_2012Metric_Pad1.15x1.40mm_HandSolder" H 2800 4650 50  0001 C CNN
F 3 "~" H 2800 4650 50  0001 C CNN
	1    2800 4650
	1    0    0    -1  
$EndComp
$Comp
L power:Earth #PWR027
U 1 1 60109AC3
P 2800 4800
F 0 "#PWR027" H 2800 4550 50  0001 C CNN
F 1 "Earth" H 2800 4650 50  0001 C CNN
F 2 "" H 2800 4800 50  0001 C CNN
F 3 "~" H 2800 4800 50  0001 C CNN
	1    2800 4800
	1    0    0    -1  
$EndComp
Wire Wire Line
	2800 4800 2800 4750
$Comp
L power:VCC #PWR025
U 1 1 60109ACA
P 2800 4500
F 0 "#PWR025" H 2800 4350 50  0001 C CNN
F 1 "VCC" V 2818 4627 50  0000 L CNN
F 2 "" H 2800 4500 50  0001 C CNN
F 3 "" H 2800 4500 50  0001 C CNN
	1    2800 4500
	1    0    0    -1  
$EndComp
Wire Wire Line
	2800 4500 2800 4550
Wire Wire Line
	2800 4550 3050 4550
Wire Wire Line
	3050 4550 3050 4050
Wire Wire Line
	3050 4050 3700 4050
Connection ~ 2800 4550
$Comp
L Device:C_Small C18
U 1 1 6012B0B8
P 6150 3050
F 0 "C18" H 6242 3096 50  0000 L CNN
F 1 "0.1u" H 6242 3005 50  0000 L CNN
F 2 "Capacitor_SMD:C_0805_2012Metric_Pad1.15x1.40mm_HandSolder" H 6150 3050 50  0001 C CNN
F 3 "~" H 6150 3050 50  0001 C CNN
	1    6150 3050
	1    0    0    -1  
$EndComp
$Comp
L power:Earth #PWR014
U 1 1 6012B0BF
P 6150 3200
F 0 "#PWR014" H 6150 2950 50  0001 C CNN
F 1 "Earth" H 6150 3050 50  0001 C CNN
F 2 "" H 6150 3200 50  0001 C CNN
F 3 "~" H 6150 3200 50  0001 C CNN
	1    6150 3200
	1    0    0    -1  
$EndComp
Wire Wire Line
	6150 3200 6150 3150
$Comp
L power:VCC #PWR011
U 1 1 60133A20
P 6150 2900
F 0 "#PWR011" H 6150 2750 50  0001 C CNN
F 1 "VCC" V 6168 3027 50  0000 L CNN
F 2 "" H 6150 2900 50  0001 C CNN
F 3 "" H 6150 2900 50  0001 C CNN
	1    6150 2900
	1    0    0    -1  
$EndComp
Wire Wire Line
	6150 2900 6150 2950
Wire Wire Line
	5100 2850 5900 2850
Wire Wire Line
	5900 2850 5900 2950
Wire Wire Line
	5900 2950 6150 2950
Connection ~ 6150 2950
$Comp
L Device:CP C24
U 1 1 6014E1AA
P 5100 4850
F 0 "C24" H 4982 4896 50  0000 R CNN
F 1 "10u" H 4982 4805 50  0000 R CNN
F 2 "Capacitor_SMD:C_0805_2012Metric_Pad1.15x1.40mm_HandSolder" H 5138 4700 50  0001 C CNN
F 3 "~" H 5100 4850 50  0001 C CNN
	1    5100 4850
	-1   0    0    -1  
$EndComp
Wire Wire Line
	5100 4700 5100 4650
Connection ~ 5100 4650
$Comp
L power:Earth #PWR030
U 1 1 60160144
P 5100 5050
F 0 "#PWR030" H 5100 4800 50  0001 C CNN
F 1 "Earth" H 5100 4900 50  0001 C CNN
F 2 "" H 5100 5050 50  0001 C CNN
F 3 "~" H 5100 5050 50  0001 C CNN
	1    5100 5050
	1    0    0    -1  
$EndComp
Wire Wire Line
	5100 5050 5100 5000
$Comp
L Connector_Generic:Conn_01x08 J6
U 1 1 60172CCC
P 4900 6500
F 0 "J6" V 5024 6446 50  0000 C CNN
F 1 "controller" V 5115 6446 50  0000 C CNN
F 2 "TerminalBlock_Phoenix:TerminalBlock_Phoenix_MPT-0,5-8-2.54_1x08_P2.54mm_Horizontal" H 4900 6500 50  0001 C CNN
F 3 "~" H 4900 6500 50  0001 C CNN
	1    4900 6500
	0    1    1    0   
$EndComp
$Comp
L power:Earth #PWR033
U 1 1 601868BF
P 5450 6500
F 0 "#PWR033" H 5450 6250 50  0001 C CNN
F 1 "Earth" H 5450 6350 50  0001 C CNN
F 2 "" H 5450 6500 50  0001 C CNN
F 3 "~" H 5450 6500 50  0001 C CNN
	1    5450 6500
	1    0    0    -1  
$EndComp
$Comp
L power:+5V #PWR032
U 1 1 6018FB09
P 4500 6250
F 0 "#PWR032" H 4500 6100 50  0001 C CNN
F 1 "+5V" H 4515 6423 50  0000 C CNN
F 2 "" H 4500 6250 50  0001 C CNN
F 3 "" H 4500 6250 50  0001 C CNN
	1    4500 6250
	1    0    0    -1  
$EndComp
Wire Wire Line
	4500 6250 4500 6300
Wire Wire Line
	5200 6300 5450 6300
Wire Wire Line
	5450 6300 5450 6500
Wire Wire Line
	5100 6300 5100 6200
Wire Wire Line
	5100 6200 8350 6200
Wire Wire Line
	8350 6200 8350 4550
Connection ~ 8350 4550
Wire Wire Line
	5000 6300 5000 6100
Wire Wire Line
	5000 6100 7950 6100
Wire Wire Line
	7950 6100 7950 4450
Connection ~ 7950 4450
Wire Wire Line
	4900 6300 4900 6000
Wire Wire Line
	4900 6000 7550 6000
Wire Wire Line
	7550 6000 7550 4350
Connection ~ 7550 4350
Wire Wire Line
	4800 6300 4800 5900
Wire Wire Line
	4800 5900 7150 5900
Wire Wire Line
	7150 5900 7150 4250
Connection ~ 7150 4250
Wire Wire Line
	4700 6300 4700 5800
Wire Wire Line
	4700 5800 6750 5800
Wire Wire Line
	6750 5800 6750 4150
Connection ~ 6750 4150
Wire Wire Line
	4600 6300 4600 5500
Wire Wire Line
	4600 5500 3150 5500
Wire Wire Line
	3150 5500 3150 3150
Connection ~ 3150 3150
Wire Wire Line
	3150 3150 3700 3150
$Comp
L Connector:Screw_Terminal_01x02 J3
U 1 1 601EA6C3
P 10750 1350
F 0 "J3" H 10830 1342 50  0000 L CNN
F 1 "VCC" H 10830 1251 50  0000 L CNN
F 2 "TerminalBlock_RND:TerminalBlock_RND_205-00023_1x02_P10.00mm_Horizontal" H 10750 1350 50  0001 C CNN
F 3 "~" H 10750 1350 50  0001 C CNN
	1    10750 1350
	1    0    0    -1  
$EndComp
$Comp
L Device:CP C6
U 1 1 601F5F5B
P 8350 1500
F 0 "C6" H 8232 1546 50  0000 R CNN
F 1 "3300u" H 8232 1455 50  0000 R CNN
F 2 "Capacitor_THT:CP_Radial_D16.0mm_P7.50mm" H 8388 1350 50  0001 C CNN
F 3 "~" H 8350 1500 50  0001 C CNN
	1    8350 1500
	-1   0    0    -1  
$EndComp
$Comp
L Device:CP C5
U 1 1 6020CE57
P 7850 1500
F 0 "C5" H 7732 1546 50  0000 R CNN
F 1 "3300u" H 7732 1455 50  0000 R CNN
F 2 "Capacitor_THT:CP_Radial_D16.0mm_P7.50mm" H 7888 1350 50  0001 C CNN
F 3 "~" H 7850 1500 50  0001 C CNN
	1    7850 1500
	-1   0    0    -1  
$EndComp
$Comp
L Device:C_Small C4
U 1 1 602185DE
P 7500 1500
F 0 "C4" H 7592 1546 50  0000 L CNN
F 1 "0.1u" H 7592 1455 50  0000 L CNN
F 2 "Capacitor_SMD:C_0805_2012Metric_Pad1.15x1.40mm_HandSolder" H 7500 1500 50  0001 C CNN
F 3 "~" H 7500 1500 50  0001 C CNN
	1    7500 1500
	1    0    0    -1  
$EndComp
$Comp
L Device:C_Small C3
U 1 1 60223D05
P 7150 1500
F 0 "C3" H 7242 1546 50  0000 L CNN
F 1 "0.1u" H 7242 1455 50  0000 L CNN
F 2 "Capacitor_SMD:C_0805_2012Metric_Pad1.15x1.40mm_HandSolder" H 7150 1500 50  0001 C CNN
F 3 "~" H 7150 1500 50  0001 C CNN
	1    7150 1500
	1    0    0    -1  
$EndComp
$Comp
L Device:C_Small C2
U 1 1 6022F434
P 6800 1500
F 0 "C2" H 6892 1546 50  0000 L CNN
F 1 "100p" H 6892 1455 50  0000 L CNN
F 2 "Capacitor_SMD:C_0603_1608Metric_Pad1.05x0.95mm_HandSolder" H 6800 1500 50  0001 C CNN
F 3 "~" H 6800 1500 50  0001 C CNN
	1    6800 1500
	1    0    0    -1  
$EndComp
$Comp
L Device:C_Small C1
U 1 1 6023AB63
P 6450 1500
F 0 "C1" H 6542 1546 50  0000 L CNN
F 1 "100p" H 6542 1455 50  0000 L CNN
F 2 "Capacitor_SMD:C_0603_1608Metric_Pad1.05x0.95mm_HandSolder" H 6450 1500 50  0001 C CNN
F 3 "~" H 6450 1500 50  0001 C CNN
	1    6450 1500
	1    0    0    -1  
$EndComp
Wire Wire Line
	6450 1650 6450 1600
Connection ~ 7850 1650
Wire Wire Line
	7850 1650 7500 1650
Wire Wire Line
	8350 1650 7850 1650
Wire Wire Line
	8850 1350 8350 1350
Wire Wire Line
	6450 1350 6450 1400
Connection ~ 7850 1350
Wire Wire Line
	7850 1350 7500 1350
Connection ~ 8350 1350
Wire Wire Line
	8350 1350 7850 1350
Wire Wire Line
	6800 1400 6800 1350
Connection ~ 6800 1350
Wire Wire Line
	6800 1350 6450 1350
Wire Wire Line
	7150 1400 7150 1350
Connection ~ 7150 1350
Wire Wire Line
	7150 1350 6800 1350
Wire Wire Line
	7500 1400 7500 1350
Connection ~ 7500 1350
Wire Wire Line
	7500 1350 7150 1350
Wire Wire Line
	7500 1600 7500 1650
Connection ~ 7500 1650
Wire Wire Line
	7500 1650 7150 1650
Wire Wire Line
	7150 1600 7150 1650
Connection ~ 7150 1650
Wire Wire Line
	7150 1650 6800 1650
Wire Wire Line
	6800 1600 6800 1650
Connection ~ 6800 1650
Wire Wire Line
	6800 1650 6450 1650
$Comp
L power:Earth #PWR06
U 1 1 602AA431
P 7500 1700
F 0 "#PWR06" H 7500 1450 50  0001 C CNN
F 1 "Earth" H 7500 1550 50  0001 C CNN
F 2 "" H 7500 1700 50  0001 C CNN
F 3 "~" H 7500 1700 50  0001 C CNN
	1    7500 1700
	1    0    0    -1  
$EndComp
$Comp
L power:VCC #PWR02
U 1 1 602B783A
P 7500 1300
F 0 "#PWR02" H 7500 1150 50  0001 C CNN
F 1 "VCC" V 7518 1427 50  0000 L CNN
F 2 "" H 7500 1300 50  0001 C CNN
F 3 "" H 7500 1300 50  0001 C CNN
	1    7500 1300
	1    0    0    -1  
$EndComp
Wire Wire Line
	7500 1300 7500 1350
$Comp
L Transistor_FET:FDS4559 Q2
U 1 1 5FF6AF28
P 9800 2000
F 0 "Q2" H 9700 2300 50  0000 L CNN
F 1 "FDS4559" H 9500 2200 50  0000 L CNN
F 2 "Package_SO:SOIC-8_3.9x4.9mm_P1.27mm" H 10000 1925 50  0001 L CNN
F 3 "https://www.fairchildsemi.com/datasheets/FD/FDS4559.pdf" H 9800 2000 50  0001 L CNN
	1    9800 2000
	1    0    0    -1  
$EndComp
$Comp
L Transistor_FET:FDS4559 Q2
U 2 1 5FF6B057
P 9900 1450
F 0 "Q2" H 10091 1496 50  0000 L CNN
F 1 "FDS4559" H 10091 1405 50  0000 L CNN
F 2 "Package_SO:SOIC-8_3.9x4.9mm_P1.27mm" H 10100 1375 50  0001 L CNN
F 3 "https://www.fairchildsemi.com/datasheets/FD/FDS4559.pdf" H 9900 1450 50  0001 L CNN
	2    9900 1450
	0    -1   -1   0   
$EndComp
Wire Wire Line
	9900 1800 9900 1750
$Comp
L Device:R_Small R9
U 1 1 5FFFF5C6
P 10400 1950
F 0 "R9" H 10459 1996 50  0000 L CNN
F 1 "100k" H 10459 1905 50  0000 L CNN
F 2 "Resistor_SMD:R_0805_2012Metric_Pad1.15x1.40mm_HandSolder" H 10400 1950 50  0001 C CNN
F 3 "~" H 10400 1950 50  0001 C CNN
	1    10400 1950
	-1   0    0    -1  
$EndComp
$Comp
L Device:R_Small R8
U 1 1 6000CF08
P 10400 1550
F 0 "R8" H 10459 1596 50  0000 L CNN
F 1 "10k" H 10459 1505 50  0000 L CNN
F 2 "Resistor_SMD:R_0805_2012Metric_Pad1.15x1.40mm_HandSolder" H 10400 1550 50  0001 C CNN
F 3 "~" H 10400 1550 50  0001 C CNN
	1    10400 1550
	-1   0    0    -1  
$EndComp
$Comp
L Device:R_Small R7
U 1 1 6001A7E4
P 9500 1550
F 0 "R7" H 9559 1596 50  0000 L CNN
F 1 "10k" H 9559 1505 50  0000 L CNN
F 2 "Resistor_SMD:R_0805_2012Metric_Pad1.15x1.40mm_HandSolder" H 9500 1550 50  0001 C CNN
F 3 "~" H 9500 1550 50  0001 C CNN
	1    9500 1550
	-1   0    0    -1  
$EndComp
$Comp
L Device:R_Small R6
U 1 1 60027FD4
P 9250 1550
F 0 "R6" H 9309 1596 50  0000 L CNN
F 1 "10k" H 9309 1505 50  0000 L CNN
F 2 "Resistor_SMD:R_0805_2012Metric_Pad1.15x1.40mm_HandSolder" H 9250 1550 50  0001 C CNN
F 3 "~" H 9250 1550 50  0001 C CNN
	1    9250 1550
	-1   0    0    -1  
$EndComp
$Comp
L Device:C_Small C26
U 1 1 60035B6A
P 10400 2300
F 0 "C26" H 10492 2346 50  0000 L CNN
F 1 "1u" H 10492 2255 50  0000 L CNN
F 2 "Capacitor_SMD:C_0805_2012Metric_Pad1.15x1.40mm_HandSolder" H 10400 2300 50  0001 C CNN
F 3 "~" H 10400 2300 50  0001 C CNN
	1    10400 2300
	-1   0    0    -1  
$EndComp
$Comp
L Device:D_Schottky_Small D2
U 1 1 60043CA3
P 8950 1350
F 0 "D2" H 8950 1555 50  0000 C CNN
F 1 "D_Schottky_Small" H 8950 1464 50  0000 C CNN
F 2 "Diode_SMD:D_SMC" V 8950 1350 50  0001 C CNN
F 3 "~" V 8950 1350 50  0001 C CNN
	1    8950 1350
	1    0    0    -1  
$EndComp
$Comp
L Connector:Screw_Terminal_01x02 J7
U 1 1 60043EE1
P 9700 2700
F 0 "J7" H 9780 2692 50  0000 L CNN
F 1 "button" H 9780 2601 50  0000 L CNN
F 2 "TerminalBlock_TE-Connectivity:TerminalBlock_TE_282834-2_1x02_P2.54mm_Horizontal" H 9700 2700 50  0001 C CNN
F 3 "~" H 9700 2700 50  0001 C CNN
	1    9700 2700
	0    -1   1    0   
$EndComp
Wire Wire Line
	10100 1350 10400 1350
Wire Wire Line
	10400 1350 10400 1450
Wire Wire Line
	10400 1850 10400 1750
Wire Wire Line
	10400 1750 9900 1750
Connection ~ 10400 1750
Wire Wire Line
	10400 1750 10400 1650
Connection ~ 9900 1750
Wire Wire Line
	9900 1750 9900 1650
Wire Wire Line
	10400 2050 10400 2150
$Comp
L power:Earth #PWR036
U 1 1 60096621
P 10400 2450
F 0 "#PWR036" H 10400 2200 50  0001 C CNN
F 1 "Earth" H 10400 2300 50  0001 C CNN
F 2 "" H 10400 2450 50  0001 C CNN
F 3 "~" H 10400 2450 50  0001 C CNN
	1    10400 2450
	-1   0    0    -1  
$EndComp
Wire Wire Line
	10400 2450 10400 2400
$Comp
L power:Earth #PWR035
U 1 1 600B2C5A
P 9900 2250
F 0 "#PWR035" H 9900 2000 50  0001 C CNN
F 1 "Earth" H 9900 2100 50  0001 C CNN
F 2 "" H 9900 2250 50  0001 C CNN
F 3 "~" H 9900 2250 50  0001 C CNN
	1    9900 2250
	-1   0    0    -1  
$EndComp
Wire Wire Line
	9900 2250 9900 2200
$Comp
L power:Earth #PWR034
U 1 1 600C10F7
P 9250 1700
F 0 "#PWR034" H 9250 1450 50  0001 C CNN
F 1 "Earth" H 9250 1550 50  0001 C CNN
F 2 "" H 9250 1700 50  0001 C CNN
F 3 "~" H 9250 1700 50  0001 C CNN
	1    9250 1700
	-1   0    0    -1  
$EndComp
Wire Wire Line
	9250 1700 9250 1650
Wire Wire Line
	9500 1450 9500 1350
Wire Wire Line
	9500 1350 9700 1350
Wire Wire Line
	9500 1650 9500 2000
Wire Wire Line
	9500 2000 9600 2000
Wire Wire Line
	9700 2500 9500 2500
Wire Wire Line
	9500 2500 9500 2000
Connection ~ 9500 2000
Wire Wire Line
	10400 2150 10050 2150
Wire Wire Line
	10050 2150 10050 2500
Wire Wire Line
	10050 2500 9800 2500
Connection ~ 10400 2150
Wire Wire Line
	10400 2150 10400 2200
Wire Wire Line
	9050 1350 9250 1350
Connection ~ 9500 1350
Wire Wire Line
	9250 1450 9250 1350
Connection ~ 9250 1350
Wire Wire Line
	9250 1350 9500 1350
Wire Wire Line
	10550 1350 10400 1350
Connection ~ 10400 1350
Wire Wire Line
	10550 1450 10550 2400
Wire Wire Line
	10550 2400 10400 2400
Connection ~ 10400 2400
Wire Wire Line
	7500 1700 7500 1650
$EndSCHEMATC
