G04 #@! TF.GenerationSoftware,KiCad,Pcbnew,5.1.10-1.fc32*
G04 #@! TF.CreationDate,2021-09-06T19:17:53+03:00*
G04 #@! TF.ProjectId,STA333_classD,53544133-3333-45f6-936c-617373442e6b,rev?*
G04 #@! TF.SameCoordinates,Original*
G04 #@! TF.FileFunction,Legend,Top*
G04 #@! TF.FilePolarity,Positive*
%FSLAX46Y46*%
G04 Gerber Fmt 4.6, Leading zero omitted, Abs format (unit mm)*
G04 Created by KiCad (PCBNEW 5.1.10-1.fc32) date 2021-09-06 19:17:53*
%MOMM*%
%LPD*%
G01*
G04 APERTURE LIST*
G04 #@! TA.AperFunction,Profile*
%ADD10C,0.050000*%
G04 #@! TD*
%ADD11C,0.120000*%
%ADD12C,0.200000*%
%ADD13C,0.150000*%
%ADD14C,0.254000*%
G04 APERTURE END LIST*
D10*
X139192000Y-84328000D02*
X68072000Y-84328000D01*
X139192000Y-154940000D02*
X139192000Y-84328000D01*
X68072000Y-154940000D02*
X139192000Y-154940000D01*
X68072000Y-154432000D02*
X68072000Y-154940000D01*
X68072000Y-84328000D02*
X68072000Y-154432000D01*
D11*
G04 #@! TO.C,SW1*
X127208000Y-110384000D02*
X127508000Y-110384000D01*
X130348000Y-114524000D02*
X130048000Y-114524000D01*
X127508000Y-114524000D02*
X127208000Y-114524000D01*
X130348000Y-110384000D02*
X130348000Y-114524000D01*
X130048000Y-110384000D02*
X130348000Y-110384000D01*
X127208000Y-114524000D02*
X127208000Y-110384000D01*
G04 #@! TO.C,R10*
X128989064Y-117629000D02*
X128534936Y-117629000D01*
X128989064Y-119099000D02*
X128534936Y-119099000D01*
G04 #@! TO.C,R9*
X114962000Y-132122936D02*
X114962000Y-132577064D01*
X116432000Y-132122936D02*
X116432000Y-132577064D01*
G04 #@! TO.C,R8*
X114908000Y-126989064D02*
X114908000Y-126534936D01*
X113438000Y-126989064D02*
X113438000Y-126534936D01*
G04 #@! TO.C,R7*
X117210064Y-110771000D02*
X116755936Y-110771000D01*
X117210064Y-112241000D02*
X116755936Y-112241000D01*
G04 #@! TO.C,R6*
X102764000Y-104587064D02*
X102764000Y-103132936D01*
X100944000Y-104587064D02*
X100944000Y-103132936D01*
G04 #@! TO.C,R5*
X103018000Y-145888064D02*
X103018000Y-144433936D01*
X101198000Y-145888064D02*
X101198000Y-144433936D01*
G04 #@! TO.C,L7*
X120286000Y-135255000D02*
X121666000Y-135255000D01*
X128286000Y-135255000D02*
X126906000Y-135255000D01*
X121666000Y-137175000D02*
X126906000Y-137175000D01*
X121666000Y-133335000D02*
X121666000Y-137175000D01*
X126906000Y-133335000D02*
X121666000Y-133335000D01*
X126906000Y-137175000D02*
X126906000Y-133335000D01*
G04 #@! TO.C,L6*
X119380000Y-123047000D02*
X119380000Y-124427000D01*
X119380000Y-131047000D02*
X119380000Y-129667000D01*
X117460000Y-124427000D02*
X117460000Y-129667000D01*
X121300000Y-124427000D02*
X117460000Y-124427000D01*
X121300000Y-129667000D02*
X121300000Y-124427000D01*
X117460000Y-129667000D02*
X121300000Y-129667000D01*
G04 #@! TO.C,L5*
X110744000Y-135111000D02*
X110744000Y-133731000D01*
X110744000Y-127111000D02*
X110744000Y-128491000D01*
X112664000Y-133731000D02*
X112664000Y-128491000D01*
X108824000Y-133731000D02*
X112664000Y-133731000D01*
X108824000Y-128491000D02*
X108824000Y-133731000D01*
X112664000Y-128491000D02*
X108824000Y-128491000D01*
G04 #@! TO.C,L4*
X85778000Y-111583000D02*
X85778000Y-108583000D01*
X98378000Y-111583000D02*
X85778000Y-111583000D01*
X98378000Y-108583000D02*
X98378000Y-111583000D01*
X98378000Y-98983000D02*
X98378000Y-101983000D01*
X85778000Y-98983000D02*
X98378000Y-98983000D01*
X85778000Y-101983000D02*
X85778000Y-98983000D01*
G04 #@! TO.C,L3*
X98251000Y-85394000D02*
X98251000Y-88394000D01*
X85651000Y-85394000D02*
X98251000Y-85394000D01*
X85651000Y-88394000D02*
X85651000Y-85394000D01*
X85651000Y-97994000D02*
X85651000Y-94994000D01*
X98251000Y-97994000D02*
X85651000Y-97994000D01*
X98251000Y-94994000D02*
X98251000Y-97994000D01*
G04 #@! TO.C,L2*
X85648000Y-153112000D02*
X85648000Y-150112000D01*
X98248000Y-153112000D02*
X85648000Y-153112000D01*
X98248000Y-150112000D02*
X98248000Y-153112000D01*
X98248000Y-140512000D02*
X98248000Y-143512000D01*
X85648000Y-140512000D02*
X98248000Y-140512000D01*
X85648000Y-143512000D02*
X85648000Y-140512000D01*
G04 #@! TO.C,L1*
X98251000Y-126923000D02*
X98251000Y-129923000D01*
X85651000Y-126923000D02*
X98251000Y-126923000D01*
X85651000Y-129923000D02*
X85651000Y-126923000D01*
X85651000Y-139523000D02*
X85651000Y-136523000D01*
X98251000Y-139523000D02*
X85651000Y-139523000D01*
X98251000Y-136523000D02*
X98251000Y-139523000D01*
G04 #@! TO.C,J7*
X127448000Y-120336000D02*
X128778000Y-120336000D01*
X127448000Y-121666000D02*
X127448000Y-120336000D01*
X127448000Y-122936000D02*
X130108000Y-122936000D01*
X130108000Y-122936000D02*
X130108000Y-128076000D01*
X127448000Y-122936000D02*
X127448000Y-128076000D01*
X127448000Y-128076000D02*
X130108000Y-128076000D01*
G04 #@! TO.C,J6*
X123130000Y-110176000D02*
X124460000Y-110176000D01*
X123130000Y-111506000D02*
X123130000Y-110176000D01*
X123130000Y-112776000D02*
X125790000Y-112776000D01*
X125790000Y-112776000D02*
X125790000Y-128076000D01*
X123130000Y-112776000D02*
X123130000Y-128076000D01*
X123130000Y-128076000D02*
X125790000Y-128076000D01*
G04 #@! TO.C,J5*
X118191000Y-153247000D02*
X118691000Y-153247000D01*
X118191000Y-152507000D02*
X118191000Y-153247000D01*
X124755000Y-148268000D02*
X124648000Y-148375000D01*
X127340000Y-145683000D02*
X126949000Y-146073000D01*
X124964000Y-148530000D02*
X124883000Y-148611000D01*
X127575000Y-145918000D02*
X127225000Y-146268000D01*
X122260000Y-145683000D02*
X122044000Y-145898000D01*
X128711000Y-141887000D02*
X128711000Y-153007000D01*
X118431000Y-141887000D02*
X118431000Y-153007000D01*
X118431000Y-153007000D02*
X128711000Y-153007000D01*
X118431000Y-141887000D02*
X128711000Y-141887000D01*
X118431000Y-143747000D02*
X128711000Y-143747000D01*
X118431000Y-149947000D02*
X128711000Y-149947000D01*
X118431000Y-152447000D02*
X128711000Y-152447000D01*
X128041000Y-147147000D02*
G75*
G03*
X128041000Y-147147000I-1930000J0D01*
G01*
X121064269Y-149077336D02*
G75*
G02*
X120434000Y-148983000I-33269J1930336D01*
G01*
X119509355Y-148335175D02*
G75*
G02*
X119510000Y-145958000I1521645J1188175D01*
G01*
X119530683Y-145932391D02*
G75*
G02*
X122531000Y-145932000I1500317J-1214609D01*
G01*
X122552645Y-145958825D02*
G75*
G02*
X122552000Y-148336000I-1521645J-1188175D01*
G01*
X121627403Y-148982539D02*
G75*
G02*
X121031000Y-149077000I-596403J1835539D01*
G01*
G04 #@! TO.C,J4*
X137778000Y-145271000D02*
X132478000Y-145271000D01*
X137778000Y-94251000D02*
X137778000Y-145271000D01*
X132478000Y-94251000D02*
X137778000Y-94251000D01*
X132478000Y-145271000D02*
X132478000Y-94251000D01*
G04 #@! TO.C,J3*
X81111000Y-124125000D02*
X81111000Y-123625000D01*
X80371000Y-124125000D02*
X81111000Y-124125000D01*
X76132000Y-117561000D02*
X76239000Y-117668000D01*
X73547000Y-114976000D02*
X73937000Y-115367000D01*
X76394000Y-117352000D02*
X76475000Y-117433000D01*
X73782000Y-114741000D02*
X74132000Y-115091000D01*
X73547000Y-120056000D02*
X73762000Y-120272000D01*
X69751000Y-113605000D02*
X80871000Y-113605000D01*
X69751000Y-123885000D02*
X80871000Y-123885000D01*
X80871000Y-123885000D02*
X80871000Y-113605000D01*
X69751000Y-123885000D02*
X69751000Y-113605000D01*
X71611000Y-123885000D02*
X71611000Y-113605000D01*
X77811000Y-123885000D02*
X77811000Y-113605000D01*
X80311000Y-123885000D02*
X80311000Y-113605000D01*
X76941000Y-116205000D02*
G75*
G03*
X76941000Y-116205000I-1930000J0D01*
G01*
X76941336Y-121251731D02*
G75*
G02*
X76847000Y-121882000I-1930336J-33269D01*
G01*
X76199175Y-122806645D02*
G75*
G02*
X73822000Y-122806000I-1188175J1521645D01*
G01*
X73796391Y-122785317D02*
G75*
G02*
X73796000Y-119785000I1214609J1500317D01*
G01*
X73822825Y-119763355D02*
G75*
G02*
X76200000Y-119764000I1188175J-1521645D01*
G01*
X76846539Y-120688597D02*
G75*
G02*
X76941000Y-121285000I-1835539J-596403D01*
G01*
G04 #@! TO.C,J2*
X80349000Y-103805000D02*
X80349000Y-103305000D01*
X79609000Y-103805000D02*
X80349000Y-103805000D01*
X75370000Y-97241000D02*
X75477000Y-97348000D01*
X72785000Y-94656000D02*
X73175000Y-95047000D01*
X75632000Y-97032000D02*
X75713000Y-97113000D01*
X73020000Y-94421000D02*
X73370000Y-94771000D01*
X72785000Y-99736000D02*
X73000000Y-99952000D01*
X68989000Y-93285000D02*
X80109000Y-93285000D01*
X68989000Y-103565000D02*
X80109000Y-103565000D01*
X80109000Y-103565000D02*
X80109000Y-93285000D01*
X68989000Y-103565000D02*
X68989000Y-93285000D01*
X70849000Y-103565000D02*
X70849000Y-93285000D01*
X77049000Y-103565000D02*
X77049000Y-93285000D01*
X79549000Y-103565000D02*
X79549000Y-93285000D01*
X76179000Y-95885000D02*
G75*
G03*
X76179000Y-95885000I-1930000J0D01*
G01*
X76179336Y-100931731D02*
G75*
G02*
X76085000Y-101562000I-1930336J-33269D01*
G01*
X75437175Y-102486645D02*
G75*
G02*
X73060000Y-102486000I-1188175J1521645D01*
G01*
X73034391Y-102465317D02*
G75*
G02*
X73034000Y-99465000I1214609J1500317D01*
G01*
X73060825Y-99443355D02*
G75*
G02*
X75438000Y-99444000I1188175J-1521645D01*
G01*
X76084539Y-100368597D02*
G75*
G02*
X76179000Y-100965000I-1835539J-596403D01*
G01*
G04 #@! TO.C,J1*
X80349000Y-145207000D02*
X80349000Y-144707000D01*
X79609000Y-145207000D02*
X80349000Y-145207000D01*
X75370000Y-138643000D02*
X75477000Y-138750000D01*
X72785000Y-136058000D02*
X73175000Y-136449000D01*
X75632000Y-138434000D02*
X75713000Y-138515000D01*
X73020000Y-135823000D02*
X73370000Y-136173000D01*
X72785000Y-141138000D02*
X73000000Y-141354000D01*
X68989000Y-134687000D02*
X80109000Y-134687000D01*
X68989000Y-144967000D02*
X80109000Y-144967000D01*
X80109000Y-144967000D02*
X80109000Y-134687000D01*
X68989000Y-144967000D02*
X68989000Y-134687000D01*
X70849000Y-144967000D02*
X70849000Y-134687000D01*
X77049000Y-144967000D02*
X77049000Y-134687000D01*
X79549000Y-144967000D02*
X79549000Y-134687000D01*
X76179000Y-137287000D02*
G75*
G03*
X76179000Y-137287000I-1930000J0D01*
G01*
X76179336Y-142333731D02*
G75*
G02*
X76085000Y-142964000I-1930336J-33269D01*
G01*
X75437175Y-143888645D02*
G75*
G02*
X73060000Y-143888000I-1188175J1521645D01*
G01*
X73034391Y-143867317D02*
G75*
G02*
X73034000Y-140867000I1214609J1500317D01*
G01*
X73060825Y-140845355D02*
G75*
G02*
X75438000Y-140846000I1188175J-1521645D01*
G01*
X76084539Y-141770597D02*
G75*
G02*
X76179000Y-142367000I-1835539J-596403D01*
G01*
D12*
G04 #@! TO.C,IC1*
X103087000Y-114122000D02*
X104887000Y-114122000D01*
D11*
G04 #@! TO.C,C26*
X113155000Y-132060733D02*
X113155000Y-132353267D01*
X114175000Y-132060733D02*
X114175000Y-132353267D01*
G04 #@! TO.C,C25*
X114954267Y-136650000D02*
X114661733Y-136650000D01*
X114954267Y-137670000D02*
X114661733Y-137670000D01*
G04 #@! TO.C,C24*
X128797267Y-115822000D02*
X128504733Y-115822000D01*
X128797267Y-116842000D02*
X128504733Y-116842000D01*
G04 #@! TO.C,C23*
X114954267Y-134745000D02*
X114661733Y-134745000D01*
X114954267Y-135765000D02*
X114661733Y-135765000D01*
G04 #@! TO.C,C22*
X115695000Y-126753233D02*
X115695000Y-127045767D01*
X116715000Y-126753233D02*
X116715000Y-127045767D01*
G04 #@! TO.C,C21*
X120902000Y-122027733D02*
X120902000Y-122320267D01*
X121922000Y-122027733D02*
X121922000Y-122320267D01*
G04 #@! TO.C,C20*
X120784233Y-112016000D02*
X121076767Y-112016000D01*
X120784233Y-110996000D02*
X121076767Y-110996000D01*
G04 #@! TO.C,C19*
X100582000Y-123144233D02*
X100582000Y-123436767D01*
X101602000Y-123144233D02*
X101602000Y-123436767D01*
G04 #@! TO.C,C18*
X100582000Y-114561233D02*
X100582000Y-114853767D01*
X101602000Y-114561233D02*
X101602000Y-114853767D01*
G04 #@! TO.C,C17*
X94612569Y-123491000D02*
X94612569Y-122191000D01*
X95262569Y-122841000D02*
X93962569Y-122841000D01*
X81577000Y-119601000D02*
X81577000Y-118651000D01*
X81617000Y-119976000D02*
X81617000Y-118276000D01*
X81657000Y-120233000D02*
X81657000Y-118019000D01*
X81697000Y-120441000D02*
X81697000Y-117811000D01*
X81737000Y-120620000D02*
X81737000Y-117632000D01*
X81777000Y-120779000D02*
X81777000Y-117473000D01*
X81817000Y-120924000D02*
X81817000Y-117328000D01*
X81857000Y-121057000D02*
X81857000Y-117195000D01*
X81897000Y-121181000D02*
X81897000Y-117071000D01*
X81937000Y-121297000D02*
X81937000Y-116955000D01*
X81977000Y-121407000D02*
X81977000Y-116845000D01*
X82017000Y-121511000D02*
X82017000Y-116741000D01*
X82057000Y-121610000D02*
X82057000Y-116642000D01*
X82097000Y-121705000D02*
X82097000Y-116547000D01*
X82137000Y-121796000D02*
X82137000Y-116456000D01*
X82177000Y-121884000D02*
X82177000Y-116368000D01*
X82217000Y-121968000D02*
X82217000Y-116284000D01*
X82257000Y-122049000D02*
X82257000Y-116203000D01*
X82297000Y-122128000D02*
X82297000Y-116124000D01*
X82337000Y-122204000D02*
X82337000Y-116048000D01*
X82377000Y-122278000D02*
X82377000Y-115974000D01*
X82417000Y-122349000D02*
X82417000Y-115903000D01*
X82457000Y-122419000D02*
X82457000Y-115833000D01*
X82497000Y-122487000D02*
X82497000Y-115765000D01*
X82537000Y-122553000D02*
X82537000Y-115699000D01*
X82577000Y-122617000D02*
X82577000Y-115635000D01*
X82617000Y-122680000D02*
X82617000Y-115572000D01*
X82657000Y-122741000D02*
X82657000Y-115511000D01*
X82697000Y-122801000D02*
X82697000Y-115451000D01*
X82737000Y-122859000D02*
X82737000Y-115393000D01*
X82777000Y-122916000D02*
X82777000Y-115336000D01*
X82817000Y-122972000D02*
X82817000Y-115280000D01*
X82857000Y-123026000D02*
X82857000Y-115226000D01*
X82897000Y-123080000D02*
X82897000Y-115172000D01*
X82937000Y-123132000D02*
X82937000Y-115120000D01*
X82977000Y-123183000D02*
X82977000Y-115069000D01*
X83017000Y-123234000D02*
X83017000Y-115018000D01*
X83057000Y-123283000D02*
X83057000Y-114969000D01*
X83097000Y-123331000D02*
X83097000Y-114921000D01*
X83137000Y-123379000D02*
X83137000Y-114873000D01*
X83177000Y-123425000D02*
X83177000Y-114827000D01*
X83217000Y-123471000D02*
X83217000Y-114781000D01*
X83257000Y-123516000D02*
X83257000Y-114736000D01*
X83297000Y-123560000D02*
X83297000Y-114692000D01*
X83337000Y-123603000D02*
X83337000Y-114649000D01*
X83377000Y-123645000D02*
X83377000Y-114607000D01*
X83417000Y-123687000D02*
X83417000Y-114565000D01*
X83457000Y-123728000D02*
X83457000Y-114524000D01*
X83497000Y-123769000D02*
X83497000Y-114483000D01*
X83537000Y-123808000D02*
X83537000Y-114444000D01*
X83577000Y-123847000D02*
X83577000Y-114405000D01*
X83617000Y-123886000D02*
X83617000Y-114366000D01*
X83657000Y-123923000D02*
X83657000Y-114329000D01*
X83697000Y-123960000D02*
X83697000Y-114292000D01*
X83737000Y-123997000D02*
X83737000Y-114255000D01*
X83777000Y-124033000D02*
X83777000Y-114219000D01*
X83817000Y-124068000D02*
X83817000Y-114184000D01*
X83857000Y-124103000D02*
X83857000Y-114149000D01*
X83897000Y-124137000D02*
X83897000Y-114115000D01*
X83937000Y-124170000D02*
X83937000Y-114082000D01*
X83977000Y-124204000D02*
X83977000Y-114048000D01*
X84017000Y-124236000D02*
X84017000Y-114016000D01*
X84057000Y-124268000D02*
X84057000Y-113984000D01*
X84097000Y-124300000D02*
X84097000Y-113952000D01*
X84137000Y-124331000D02*
X84137000Y-113921000D01*
X84177000Y-124361000D02*
X84177000Y-113891000D01*
X84217000Y-124391000D02*
X84217000Y-113861000D01*
X84257000Y-117686000D02*
X84257000Y-113831000D01*
X84257000Y-124421000D02*
X84257000Y-120566000D01*
X84297000Y-117686000D02*
X84297000Y-113802000D01*
X84297000Y-124450000D02*
X84297000Y-120566000D01*
X84337000Y-117686000D02*
X84337000Y-113773000D01*
X84337000Y-124479000D02*
X84337000Y-120566000D01*
X84377000Y-117686000D02*
X84377000Y-113745000D01*
X84377000Y-124507000D02*
X84377000Y-120566000D01*
X84417000Y-117686000D02*
X84417000Y-113717000D01*
X84417000Y-124535000D02*
X84417000Y-120566000D01*
X84457000Y-117686000D02*
X84457000Y-113690000D01*
X84457000Y-124562000D02*
X84457000Y-120566000D01*
X84497000Y-117686000D02*
X84497000Y-113663000D01*
X84497000Y-124589000D02*
X84497000Y-120566000D01*
X84537000Y-117686000D02*
X84537000Y-113636000D01*
X84537000Y-124616000D02*
X84537000Y-120566000D01*
X84577000Y-117686000D02*
X84577000Y-113610000D01*
X84577000Y-124642000D02*
X84577000Y-120566000D01*
X84617000Y-117686000D02*
X84617000Y-113584000D01*
X84617000Y-124668000D02*
X84617000Y-120566000D01*
X84657000Y-117686000D02*
X84657000Y-113559000D01*
X84657000Y-124693000D02*
X84657000Y-120566000D01*
X84697000Y-117686000D02*
X84697000Y-113534000D01*
X84697000Y-124718000D02*
X84697000Y-120566000D01*
X84737000Y-117686000D02*
X84737000Y-113509000D01*
X84737000Y-124743000D02*
X84737000Y-120566000D01*
X84777000Y-117686000D02*
X84777000Y-113485000D01*
X84777000Y-124767000D02*
X84777000Y-120566000D01*
X84817000Y-117686000D02*
X84817000Y-113462000D01*
X84817000Y-124790000D02*
X84817000Y-120566000D01*
X84857000Y-117686000D02*
X84857000Y-113438000D01*
X84857000Y-124814000D02*
X84857000Y-120566000D01*
X84897000Y-117686000D02*
X84897000Y-113415000D01*
X84897000Y-124837000D02*
X84897000Y-120566000D01*
X84937000Y-117686000D02*
X84937000Y-113393000D01*
X84937000Y-124859000D02*
X84937000Y-120566000D01*
X84977000Y-117686000D02*
X84977000Y-113370000D01*
X84977000Y-124882000D02*
X84977000Y-120566000D01*
X85017000Y-117686000D02*
X85017000Y-113348000D01*
X85017000Y-124904000D02*
X85017000Y-120566000D01*
X85057000Y-117686000D02*
X85057000Y-113327000D01*
X85057000Y-124925000D02*
X85057000Y-120566000D01*
X85097000Y-117686000D02*
X85097000Y-113306000D01*
X85097000Y-124946000D02*
X85097000Y-120566000D01*
X85137000Y-117686000D02*
X85137000Y-113285000D01*
X85137000Y-124967000D02*
X85137000Y-120566000D01*
X85177000Y-117686000D02*
X85177000Y-113264000D01*
X85177000Y-124988000D02*
X85177000Y-120566000D01*
X85217000Y-117686000D02*
X85217000Y-113244000D01*
X85217000Y-125008000D02*
X85217000Y-120566000D01*
X85257000Y-117686000D02*
X85257000Y-113224000D01*
X85257000Y-125028000D02*
X85257000Y-120566000D01*
X85297000Y-117686000D02*
X85297000Y-113205000D01*
X85297000Y-125047000D02*
X85297000Y-120566000D01*
X85337000Y-117686000D02*
X85337000Y-113186000D01*
X85337000Y-125066000D02*
X85337000Y-120566000D01*
X85377000Y-117686000D02*
X85377000Y-113167000D01*
X85377000Y-125085000D02*
X85377000Y-120566000D01*
X85417000Y-117686000D02*
X85417000Y-113148000D01*
X85417000Y-125104000D02*
X85417000Y-120566000D01*
X85457000Y-117686000D02*
X85457000Y-113130000D01*
X85457000Y-125122000D02*
X85457000Y-120566000D01*
X85497000Y-117686000D02*
X85497000Y-113112000D01*
X85497000Y-125140000D02*
X85497000Y-120566000D01*
X85537000Y-117686000D02*
X85537000Y-113095000D01*
X85537000Y-125157000D02*
X85537000Y-120566000D01*
X85577000Y-117686000D02*
X85577000Y-113077000D01*
X85577000Y-125175000D02*
X85577000Y-120566000D01*
X85617000Y-117686000D02*
X85617000Y-113061000D01*
X85617000Y-125191000D02*
X85617000Y-120566000D01*
X85657000Y-117686000D02*
X85657000Y-113044000D01*
X85657000Y-125208000D02*
X85657000Y-120566000D01*
X85697000Y-117686000D02*
X85697000Y-113028000D01*
X85697000Y-125224000D02*
X85697000Y-120566000D01*
X85737000Y-117686000D02*
X85737000Y-113012000D01*
X85737000Y-125240000D02*
X85737000Y-120566000D01*
X85777000Y-117686000D02*
X85777000Y-112996000D01*
X85777000Y-125256000D02*
X85777000Y-120566000D01*
X85817000Y-117686000D02*
X85817000Y-112980000D01*
X85817000Y-125272000D02*
X85817000Y-120566000D01*
X85857000Y-117686000D02*
X85857000Y-112965000D01*
X85857000Y-125287000D02*
X85857000Y-120566000D01*
X85897000Y-117686000D02*
X85897000Y-112951000D01*
X85897000Y-125301000D02*
X85897000Y-120566000D01*
X85937000Y-117686000D02*
X85937000Y-112936000D01*
X85937000Y-125316000D02*
X85937000Y-120566000D01*
X85977000Y-117686000D02*
X85977000Y-112922000D01*
X85977000Y-125330000D02*
X85977000Y-120566000D01*
X86017000Y-117686000D02*
X86017000Y-112908000D01*
X86017000Y-125344000D02*
X86017000Y-120566000D01*
X86057000Y-117686000D02*
X86057000Y-112894000D01*
X86057000Y-125358000D02*
X86057000Y-120566000D01*
X86097000Y-117686000D02*
X86097000Y-112881000D01*
X86097000Y-125371000D02*
X86097000Y-120566000D01*
X86137000Y-117686000D02*
X86137000Y-112868000D01*
X86137000Y-125384000D02*
X86137000Y-120566000D01*
X86177000Y-117686000D02*
X86177000Y-112855000D01*
X86177000Y-125397000D02*
X86177000Y-120566000D01*
X86217000Y-117686000D02*
X86217000Y-112842000D01*
X86217000Y-125410000D02*
X86217000Y-120566000D01*
X86257000Y-117686000D02*
X86257000Y-112830000D01*
X86257000Y-125422000D02*
X86257000Y-120566000D01*
X86297000Y-117686000D02*
X86297000Y-112818000D01*
X86297000Y-125434000D02*
X86297000Y-120566000D01*
X86337000Y-117686000D02*
X86337000Y-112806000D01*
X86337000Y-125446000D02*
X86337000Y-120566000D01*
X86377000Y-117686000D02*
X86377000Y-112795000D01*
X86377000Y-125457000D02*
X86377000Y-120566000D01*
X86417000Y-117686000D02*
X86417000Y-112784000D01*
X86417000Y-125468000D02*
X86417000Y-120566000D01*
X86457000Y-117686000D02*
X86457000Y-112773000D01*
X86457000Y-125479000D02*
X86457000Y-120566000D01*
X86497000Y-117686000D02*
X86497000Y-112762000D01*
X86497000Y-125490000D02*
X86497000Y-120566000D01*
X86537000Y-117686000D02*
X86537000Y-112752000D01*
X86537000Y-125500000D02*
X86537000Y-120566000D01*
X86577000Y-117686000D02*
X86577000Y-112742000D01*
X86577000Y-125510000D02*
X86577000Y-120566000D01*
X86617000Y-117686000D02*
X86617000Y-112732000D01*
X86617000Y-125520000D02*
X86617000Y-120566000D01*
X86657000Y-117686000D02*
X86657000Y-112722000D01*
X86657000Y-125530000D02*
X86657000Y-120566000D01*
X86697000Y-117686000D02*
X86697000Y-112713000D01*
X86697000Y-125539000D02*
X86697000Y-120566000D01*
X86737000Y-117686000D02*
X86737000Y-112704000D01*
X86737000Y-125548000D02*
X86737000Y-120566000D01*
X86777000Y-117686000D02*
X86777000Y-112695000D01*
X86777000Y-125557000D02*
X86777000Y-120566000D01*
X86817000Y-117686000D02*
X86817000Y-112687000D01*
X86817000Y-125565000D02*
X86817000Y-120566000D01*
X86857000Y-117686000D02*
X86857000Y-112678000D01*
X86857000Y-125574000D02*
X86857000Y-120566000D01*
X86897000Y-117686000D02*
X86897000Y-112670000D01*
X86897000Y-125582000D02*
X86897000Y-120566000D01*
X86937000Y-117686000D02*
X86937000Y-112663000D01*
X86937000Y-125589000D02*
X86937000Y-120566000D01*
X86977000Y-117686000D02*
X86977000Y-112655000D01*
X86977000Y-125597000D02*
X86977000Y-120566000D01*
X87017000Y-117686000D02*
X87017000Y-112648000D01*
X87017000Y-125604000D02*
X87017000Y-120566000D01*
X87057000Y-117686000D02*
X87057000Y-112641000D01*
X87057000Y-125611000D02*
X87057000Y-120566000D01*
X87097000Y-117686000D02*
X87097000Y-112634000D01*
X87097000Y-125618000D02*
X87097000Y-120566000D01*
X87137000Y-125624000D02*
X87137000Y-112628000D01*
X87177000Y-125631000D02*
X87177000Y-112621000D01*
X87217000Y-125637000D02*
X87217000Y-112615000D01*
X87257000Y-125642000D02*
X87257000Y-112610000D01*
X87297000Y-125648000D02*
X87297000Y-112604000D01*
X87337000Y-125653000D02*
X87337000Y-112599000D01*
X87377000Y-125658000D02*
X87377000Y-112594000D01*
X87417000Y-125663000D02*
X87417000Y-112589000D01*
X87457000Y-125667000D02*
X87457000Y-112585000D01*
X87498000Y-125671000D02*
X87498000Y-112581000D01*
X87538000Y-125675000D02*
X87538000Y-112577000D01*
X87578000Y-125679000D02*
X87578000Y-112573000D01*
X87618000Y-125683000D02*
X87618000Y-112569000D01*
X87658000Y-125686000D02*
X87658000Y-112566000D01*
X87698000Y-125689000D02*
X87698000Y-112563000D01*
X87738000Y-125692000D02*
X87738000Y-112560000D01*
X87778000Y-125694000D02*
X87778000Y-112558000D01*
X87818000Y-125697000D02*
X87818000Y-112555000D01*
X87858000Y-125699000D02*
X87858000Y-112553000D01*
X87898000Y-125701000D02*
X87898000Y-112551000D01*
X87938000Y-125702000D02*
X87938000Y-112550000D01*
X87978000Y-125703000D02*
X87978000Y-112549000D01*
X88018000Y-125705000D02*
X88018000Y-112547000D01*
X88058000Y-125705000D02*
X88058000Y-112547000D01*
X88098000Y-125706000D02*
X88098000Y-112546000D01*
X88138000Y-125706000D02*
X88138000Y-112546000D01*
X88178000Y-125706000D02*
X88178000Y-112546000D01*
X94798000Y-119126000D02*
G75*
G03*
X94798000Y-119126000I-6620000J0D01*
G01*
G04 #@! TO.C,C16*
X95404000Y-116684248D02*
X95404000Y-117206752D01*
X96874000Y-116684248D02*
X96874000Y-117206752D01*
G04 #@! TO.C,C15*
X97661000Y-116974233D02*
X97661000Y-117266767D01*
X98681000Y-116974233D02*
X98681000Y-117266767D01*
G04 #@! TO.C,C14*
X96874000Y-121292252D02*
X96874000Y-120769748D01*
X95404000Y-121292252D02*
X95404000Y-120769748D01*
G04 #@! TO.C,C13*
X98681000Y-120923267D02*
X98681000Y-120630733D01*
X97661000Y-120923267D02*
X97661000Y-120630733D01*
G04 #@! TO.C,C12*
X99611000Y-90554000D02*
X104351000Y-90554000D01*
X99611000Y-97994000D02*
X104351000Y-97994000D01*
X104351000Y-97994000D02*
X104351000Y-90554000D01*
X99611000Y-97994000D02*
X99611000Y-90554000D01*
G04 #@! TO.C,C11*
X99611000Y-131956000D02*
X104351000Y-131956000D01*
X99611000Y-139396000D02*
X104351000Y-139396000D01*
X104351000Y-139396000D02*
X104351000Y-131956000D01*
X99611000Y-139396000D02*
X99611000Y-131956000D01*
G04 #@! TO.C,C10*
X78148000Y-104270000D02*
X82888000Y-104270000D01*
X78148000Y-111710000D02*
X82888000Y-111710000D01*
X82888000Y-111710000D02*
X82888000Y-104270000D01*
X78148000Y-111710000D02*
X78148000Y-104270000D01*
G04 #@! TO.C,C9*
X78148000Y-85093000D02*
X82888000Y-85093000D01*
X78148000Y-92533000D02*
X82888000Y-92533000D01*
X82888000Y-92533000D02*
X82888000Y-85093000D01*
X78148000Y-92533000D02*
X78148000Y-85093000D01*
G04 #@! TO.C,C8*
X78275000Y-146100000D02*
X83015000Y-146100000D01*
X78275000Y-153540000D02*
X83015000Y-153540000D01*
X83015000Y-153540000D02*
X83015000Y-146100000D01*
X78275000Y-153540000D02*
X78275000Y-146100000D01*
G04 #@! TO.C,C7*
X78275000Y-126034000D02*
X83015000Y-126034000D01*
X78275000Y-133474000D02*
X83015000Y-133474000D01*
X83015000Y-133474000D02*
X83015000Y-126034000D01*
X78275000Y-133474000D02*
X78275000Y-126034000D01*
G04 #@! TO.C,C6*
X72941000Y-104143000D02*
X77681000Y-104143000D01*
X72941000Y-111583000D02*
X77681000Y-111583000D01*
X77681000Y-111583000D02*
X77681000Y-104143000D01*
X72941000Y-111583000D02*
X72941000Y-104143000D01*
G04 #@! TO.C,C5*
X72941000Y-85220000D02*
X77681000Y-85220000D01*
X72941000Y-92660000D02*
X77681000Y-92660000D01*
X77681000Y-92660000D02*
X77681000Y-85220000D01*
X72941000Y-92660000D02*
X72941000Y-85220000D01*
G04 #@! TO.C,C4*
X72941000Y-146100000D02*
X77681000Y-146100000D01*
X72941000Y-153540000D02*
X77681000Y-153540000D01*
X77681000Y-153540000D02*
X77681000Y-146100000D01*
X72941000Y-153540000D02*
X72941000Y-146100000D01*
G04 #@! TO.C,C3*
X72941000Y-125987000D02*
X77681000Y-125987000D01*
X72941000Y-133427000D02*
X77681000Y-133427000D01*
X77681000Y-133427000D02*
X77681000Y-125987000D01*
X72941000Y-133427000D02*
X72941000Y-125987000D01*
G04 #@! TO.C,C2*
X80434000Y-94792000D02*
X85174000Y-94792000D01*
X80434000Y-102232000D02*
X85174000Y-102232000D01*
X85174000Y-102232000D02*
X85174000Y-94792000D01*
X80434000Y-102232000D02*
X80434000Y-94792000D01*
G04 #@! TO.C,C1*
X80434000Y-136194000D02*
X85174000Y-136194000D01*
X80434000Y-143634000D02*
X85174000Y-143634000D01*
X85174000Y-143634000D02*
X85174000Y-136194000D01*
X80434000Y-143634000D02*
X80434000Y-136194000D01*
G04 #@! TD*
G04 #@! TO.C,SW1*
D13*
X129182761Y-113787333D02*
X129230380Y-113644476D01*
X129230380Y-113406380D01*
X129182761Y-113311142D01*
X129135142Y-113263523D01*
X129039904Y-113215904D01*
X128944666Y-113215904D01*
X128849428Y-113263523D01*
X128801809Y-113311142D01*
X128754190Y-113406380D01*
X128706571Y-113596857D01*
X128658952Y-113692095D01*
X128611333Y-113739714D01*
X128516095Y-113787333D01*
X128420857Y-113787333D01*
X128325619Y-113739714D01*
X128278000Y-113692095D01*
X128230380Y-113596857D01*
X128230380Y-113358761D01*
X128278000Y-113215904D01*
X128230380Y-112882571D02*
X129230380Y-112644476D01*
X128516095Y-112454000D01*
X129230380Y-112263523D01*
X128230380Y-112025428D01*
X129230380Y-111120666D02*
X129230380Y-111692095D01*
X129230380Y-111406380D02*
X128230380Y-111406380D01*
X128373238Y-111501619D01*
X128468476Y-111596857D01*
X128516095Y-111692095D01*
G04 #@! TO.C,R10*
X131770380Y-119768857D02*
X131294190Y-120102190D01*
X131770380Y-120340285D02*
X130770380Y-120340285D01*
X130770380Y-119959333D01*
X130818000Y-119864095D01*
X130865619Y-119816476D01*
X130960857Y-119768857D01*
X131103714Y-119768857D01*
X131198952Y-119816476D01*
X131246571Y-119864095D01*
X131294190Y-119959333D01*
X131294190Y-120340285D01*
X131770380Y-118816476D02*
X131770380Y-119387904D01*
X131770380Y-119102190D02*
X130770380Y-119102190D01*
X130913238Y-119197428D01*
X131008476Y-119292666D01*
X131056095Y-119387904D01*
X130770380Y-118197428D02*
X130770380Y-118102190D01*
X130818000Y-118006952D01*
X130865619Y-117959333D01*
X130960857Y-117911714D01*
X131151333Y-117864095D01*
X131389428Y-117864095D01*
X131579904Y-117911714D01*
X131675142Y-117959333D01*
X131722761Y-118006952D01*
X131770380Y-118102190D01*
X131770380Y-118197428D01*
X131722761Y-118292666D01*
X131675142Y-118340285D01*
X131579904Y-118387904D01*
X131389428Y-118435523D01*
X131151333Y-118435523D01*
X130960857Y-118387904D01*
X130865619Y-118340285D01*
X130818000Y-118292666D01*
X130770380Y-118197428D01*
G04 #@! TO.C,R9*
X117799380Y-132516666D02*
X117323190Y-132850000D01*
X117799380Y-133088095D02*
X116799380Y-133088095D01*
X116799380Y-132707142D01*
X116847000Y-132611904D01*
X116894619Y-132564285D01*
X116989857Y-132516666D01*
X117132714Y-132516666D01*
X117227952Y-132564285D01*
X117275571Y-132611904D01*
X117323190Y-132707142D01*
X117323190Y-133088095D01*
X117799380Y-132040476D02*
X117799380Y-131850000D01*
X117751761Y-131754761D01*
X117704142Y-131707142D01*
X117561285Y-131611904D01*
X117370809Y-131564285D01*
X116989857Y-131564285D01*
X116894619Y-131611904D01*
X116847000Y-131659523D01*
X116799380Y-131754761D01*
X116799380Y-131945238D01*
X116847000Y-132040476D01*
X116894619Y-132088095D01*
X116989857Y-132135714D01*
X117227952Y-132135714D01*
X117323190Y-132088095D01*
X117370809Y-132040476D01*
X117418428Y-131945238D01*
X117418428Y-131754761D01*
X117370809Y-131659523D01*
X117323190Y-131611904D01*
X117227952Y-131564285D01*
G04 #@! TO.C,R8*
X112975380Y-126928666D02*
X112499190Y-127262000D01*
X112975380Y-127500095D02*
X111975380Y-127500095D01*
X111975380Y-127119142D01*
X112023000Y-127023904D01*
X112070619Y-126976285D01*
X112165857Y-126928666D01*
X112308714Y-126928666D01*
X112403952Y-126976285D01*
X112451571Y-127023904D01*
X112499190Y-127119142D01*
X112499190Y-127500095D01*
X112403952Y-126357238D02*
X112356333Y-126452476D01*
X112308714Y-126500095D01*
X112213476Y-126547714D01*
X112165857Y-126547714D01*
X112070619Y-126500095D01*
X112023000Y-126452476D01*
X111975380Y-126357238D01*
X111975380Y-126166761D01*
X112023000Y-126071523D01*
X112070619Y-126023904D01*
X112165857Y-125976285D01*
X112213476Y-125976285D01*
X112308714Y-126023904D01*
X112356333Y-126071523D01*
X112403952Y-126166761D01*
X112403952Y-126357238D01*
X112451571Y-126452476D01*
X112499190Y-126500095D01*
X112594428Y-126547714D01*
X112784904Y-126547714D01*
X112880142Y-126500095D01*
X112927761Y-126452476D01*
X112975380Y-126357238D01*
X112975380Y-126166761D01*
X112927761Y-126071523D01*
X112880142Y-126023904D01*
X112784904Y-125976285D01*
X112594428Y-125976285D01*
X112499190Y-126023904D01*
X112451571Y-126071523D01*
X112403952Y-126166761D01*
G04 #@! TO.C,R7*
X116816333Y-113608380D02*
X116483000Y-113132190D01*
X116244904Y-113608380D02*
X116244904Y-112608380D01*
X116625857Y-112608380D01*
X116721095Y-112656000D01*
X116768714Y-112703619D01*
X116816333Y-112798857D01*
X116816333Y-112941714D01*
X116768714Y-113036952D01*
X116721095Y-113084571D01*
X116625857Y-113132190D01*
X116244904Y-113132190D01*
X117149666Y-112608380D02*
X117816333Y-112608380D01*
X117387761Y-113608380D01*
G04 #@! TO.C,R6*
X104338380Y-104052666D02*
X103862190Y-104386000D01*
X104338380Y-104624095D02*
X103338380Y-104624095D01*
X103338380Y-104243142D01*
X103386000Y-104147904D01*
X103433619Y-104100285D01*
X103528857Y-104052666D01*
X103671714Y-104052666D01*
X103766952Y-104100285D01*
X103814571Y-104147904D01*
X103862190Y-104243142D01*
X103862190Y-104624095D01*
X103338380Y-103195523D02*
X103338380Y-103386000D01*
X103386000Y-103481238D01*
X103433619Y-103528857D01*
X103576476Y-103624095D01*
X103766952Y-103671714D01*
X104147904Y-103671714D01*
X104243142Y-103624095D01*
X104290761Y-103576476D01*
X104338380Y-103481238D01*
X104338380Y-103290761D01*
X104290761Y-103195523D01*
X104243142Y-103147904D01*
X104147904Y-103100285D01*
X103909809Y-103100285D01*
X103814571Y-103147904D01*
X103766952Y-103195523D01*
X103719333Y-103290761D01*
X103719333Y-103481238D01*
X103766952Y-103576476D01*
X103814571Y-103624095D01*
X103909809Y-103671714D01*
G04 #@! TO.C,R5*
X104592380Y-145327666D02*
X104116190Y-145661000D01*
X104592380Y-145899095D02*
X103592380Y-145899095D01*
X103592380Y-145518142D01*
X103640000Y-145422904D01*
X103687619Y-145375285D01*
X103782857Y-145327666D01*
X103925714Y-145327666D01*
X104020952Y-145375285D01*
X104068571Y-145422904D01*
X104116190Y-145518142D01*
X104116190Y-145899095D01*
X103592380Y-144422904D02*
X103592380Y-144899095D01*
X104068571Y-144946714D01*
X104020952Y-144899095D01*
X103973333Y-144803857D01*
X103973333Y-144565761D01*
X104020952Y-144470523D01*
X104068571Y-144422904D01*
X104163809Y-144375285D01*
X104401904Y-144375285D01*
X104497142Y-144422904D01*
X104544761Y-144470523D01*
X104592380Y-144565761D01*
X104592380Y-144803857D01*
X104544761Y-144899095D01*
X104497142Y-144946714D01*
G04 #@! TO.C,L7*
X124293333Y-136342380D02*
X123817142Y-136342380D01*
X123817142Y-135342380D01*
X124531428Y-135342380D02*
X125198095Y-135342380D01*
X124769523Y-136342380D01*
G04 #@! TO.C,L6*
X119832380Y-127420666D02*
X119832380Y-127896857D01*
X118832380Y-127896857D01*
X118832380Y-126658761D02*
X118832380Y-126849238D01*
X118880000Y-126944476D01*
X118927619Y-126992095D01*
X119070476Y-127087333D01*
X119260952Y-127134952D01*
X119641904Y-127134952D01*
X119737142Y-127087333D01*
X119784761Y-127039714D01*
X119832380Y-126944476D01*
X119832380Y-126754000D01*
X119784761Y-126658761D01*
X119737142Y-126611142D01*
X119641904Y-126563523D01*
X119403809Y-126563523D01*
X119308571Y-126611142D01*
X119260952Y-126658761D01*
X119213333Y-126754000D01*
X119213333Y-126944476D01*
X119260952Y-127039714D01*
X119308571Y-127087333D01*
X119403809Y-127134952D01*
G04 #@! TO.C,L5*
X111196380Y-130976666D02*
X111196380Y-131452857D01*
X110196380Y-131452857D01*
X110196380Y-130167142D02*
X110196380Y-130643333D01*
X110672571Y-130690952D01*
X110624952Y-130643333D01*
X110577333Y-130548095D01*
X110577333Y-130310000D01*
X110624952Y-130214761D01*
X110672571Y-130167142D01*
X110767809Y-130119523D01*
X111005904Y-130119523D01*
X111101142Y-130167142D01*
X111148761Y-130214761D01*
X111196380Y-130310000D01*
X111196380Y-130548095D01*
X111148761Y-130643333D01*
X111101142Y-130690952D01*
G04 #@! TO.C,L4*
X92543333Y-105608380D02*
X92067142Y-105608380D01*
X92067142Y-104608380D01*
X93305238Y-104941714D02*
X93305238Y-105608380D01*
X93067142Y-104560761D02*
X92829047Y-105275047D01*
X93448095Y-105275047D01*
G04 #@! TO.C,L3*
X92543333Y-92146380D02*
X92067142Y-92146380D01*
X92067142Y-91146380D01*
X92781428Y-91146380D02*
X93400476Y-91146380D01*
X93067142Y-91527333D01*
X93210000Y-91527333D01*
X93305238Y-91574952D01*
X93352857Y-91622571D01*
X93400476Y-91717809D01*
X93400476Y-91955904D01*
X93352857Y-92051142D01*
X93305238Y-92098761D01*
X93210000Y-92146380D01*
X92924285Y-92146380D01*
X92829047Y-92098761D01*
X92781428Y-92051142D01*
G04 #@! TO.C,L2*
X92543333Y-147518380D02*
X92067142Y-147518380D01*
X92067142Y-146518380D01*
X92829047Y-146613619D02*
X92876666Y-146566000D01*
X92971904Y-146518380D01*
X93210000Y-146518380D01*
X93305238Y-146566000D01*
X93352857Y-146613619D01*
X93400476Y-146708857D01*
X93400476Y-146804095D01*
X93352857Y-146946952D01*
X92781428Y-147518380D01*
X93400476Y-147518380D01*
G04 #@! TO.C,L1*
X92289333Y-133294380D02*
X91813142Y-133294380D01*
X91813142Y-132294380D01*
X93146476Y-133294380D02*
X92575047Y-133294380D01*
X92860761Y-133294380D02*
X92860761Y-132294380D01*
X92765523Y-132437238D01*
X92670285Y-132532476D01*
X92575047Y-132580095D01*
G04 #@! TO.C,J7*
X130516380Y-124539333D02*
X131230666Y-124539333D01*
X131373523Y-124586952D01*
X131468761Y-124682190D01*
X131516380Y-124825047D01*
X131516380Y-124920285D01*
X130516380Y-124158380D02*
X130516380Y-123491714D01*
X131516380Y-123920285D01*
G04 #@! TO.C,J6*
X121626380Y-115903333D02*
X122340666Y-115903333D01*
X122483523Y-115950952D01*
X122578761Y-116046190D01*
X122626380Y-116189047D01*
X122626380Y-116284285D01*
X121626380Y-114998571D02*
X121626380Y-115189047D01*
X121674000Y-115284285D01*
X121721619Y-115331904D01*
X121864476Y-115427142D01*
X122054952Y-115474761D01*
X122435904Y-115474761D01*
X122531142Y-115427142D01*
X122578761Y-115379523D01*
X122626380Y-115284285D01*
X122626380Y-115093809D01*
X122578761Y-114998571D01*
X122531142Y-114950952D01*
X122435904Y-114903333D01*
X122197809Y-114903333D01*
X122102571Y-114950952D01*
X122054952Y-114998571D01*
X122007333Y-115093809D01*
X122007333Y-115284285D01*
X122054952Y-115379523D01*
X122102571Y-115427142D01*
X122197809Y-115474761D01*
G04 #@! TO.C,J5*
X123364666Y-150582380D02*
X123364666Y-151296666D01*
X123317047Y-151439523D01*
X123221809Y-151534761D01*
X123078952Y-151582380D01*
X122983714Y-151582380D01*
X124317047Y-150582380D02*
X123840857Y-150582380D01*
X123793238Y-151058571D01*
X123840857Y-151010952D01*
X123936095Y-150963333D01*
X124174190Y-150963333D01*
X124269428Y-151010952D01*
X124317047Y-151058571D01*
X124364666Y-151153809D01*
X124364666Y-151391904D01*
X124317047Y-151487142D01*
X124269428Y-151534761D01*
X124174190Y-151582380D01*
X123936095Y-151582380D01*
X123840857Y-151534761D01*
X123793238Y-151487142D01*
G04 #@! TO.C,J4*
X134580380Y-147145333D02*
X135294666Y-147145333D01*
X135437523Y-147192952D01*
X135532761Y-147288190D01*
X135580380Y-147431047D01*
X135580380Y-147526285D01*
X134913714Y-146240571D02*
X135580380Y-146240571D01*
X134532761Y-146478666D02*
X135247047Y-146716761D01*
X135247047Y-146097714D01*
G04 #@! TO.C,J3*
X72350380Y-119078333D02*
X73064666Y-119078333D01*
X73207523Y-119125952D01*
X73302761Y-119221190D01*
X73350380Y-119364047D01*
X73350380Y-119459285D01*
X72350380Y-118697380D02*
X72350380Y-118078333D01*
X72731333Y-118411666D01*
X72731333Y-118268809D01*
X72778952Y-118173571D01*
X72826571Y-118125952D01*
X72921809Y-118078333D01*
X73159904Y-118078333D01*
X73255142Y-118125952D01*
X73302761Y-118173571D01*
X73350380Y-118268809D01*
X73350380Y-118554523D01*
X73302761Y-118649761D01*
X73255142Y-118697380D01*
G04 #@! TO.C,J2*
X69556380Y-98758333D02*
X70270666Y-98758333D01*
X70413523Y-98805952D01*
X70508761Y-98901190D01*
X70556380Y-99044047D01*
X70556380Y-99139285D01*
X69651619Y-98329761D02*
X69604000Y-98282142D01*
X69556380Y-98186904D01*
X69556380Y-97948809D01*
X69604000Y-97853571D01*
X69651619Y-97805952D01*
X69746857Y-97758333D01*
X69842095Y-97758333D01*
X69984952Y-97805952D01*
X70556380Y-98377380D01*
X70556380Y-97758333D01*
G04 #@! TO.C,J1*
X71588380Y-140033333D02*
X72302666Y-140033333D01*
X72445523Y-140080952D01*
X72540761Y-140176190D01*
X72588380Y-140319047D01*
X72588380Y-140414285D01*
X72588380Y-139033333D02*
X72588380Y-139604761D01*
X72588380Y-139319047D02*
X71588380Y-139319047D01*
X71731238Y-139414285D01*
X71826476Y-139509523D01*
X71874095Y-139604761D01*
G04 #@! TO.C,IC1*
D14*
X107218238Y-112588523D02*
X107218238Y-111318523D01*
X108548714Y-112467571D02*
X108488238Y-112528047D01*
X108306809Y-112588523D01*
X108185857Y-112588523D01*
X108004428Y-112528047D01*
X107883476Y-112407095D01*
X107823000Y-112286142D01*
X107762523Y-112044238D01*
X107762523Y-111862809D01*
X107823000Y-111620904D01*
X107883476Y-111499952D01*
X108004428Y-111379000D01*
X108185857Y-111318523D01*
X108306809Y-111318523D01*
X108488238Y-111379000D01*
X108548714Y-111439476D01*
X109758238Y-112588523D02*
X109032523Y-112588523D01*
X109395380Y-112588523D02*
X109395380Y-111318523D01*
X109274428Y-111499952D01*
X109153476Y-111620904D01*
X109032523Y-111681380D01*
G04 #@! TO.C,C26*
D13*
X112371142Y-132722857D02*
X112418761Y-132770476D01*
X112466380Y-132913333D01*
X112466380Y-133008571D01*
X112418761Y-133151428D01*
X112323523Y-133246666D01*
X112228285Y-133294285D01*
X112037809Y-133341904D01*
X111894952Y-133341904D01*
X111704476Y-133294285D01*
X111609238Y-133246666D01*
X111514000Y-133151428D01*
X111466380Y-133008571D01*
X111466380Y-132913333D01*
X111514000Y-132770476D01*
X111561619Y-132722857D01*
X111561619Y-132341904D02*
X111514000Y-132294285D01*
X111466380Y-132199047D01*
X111466380Y-131960952D01*
X111514000Y-131865714D01*
X111561619Y-131818095D01*
X111656857Y-131770476D01*
X111752095Y-131770476D01*
X111894952Y-131818095D01*
X112466380Y-132389523D01*
X112466380Y-131770476D01*
X111466380Y-130913333D02*
X111466380Y-131103809D01*
X111514000Y-131199047D01*
X111561619Y-131246666D01*
X111704476Y-131341904D01*
X111894952Y-131389523D01*
X112275904Y-131389523D01*
X112371142Y-131341904D01*
X112418761Y-131294285D01*
X112466380Y-131199047D01*
X112466380Y-131008571D01*
X112418761Y-130913333D01*
X112371142Y-130865714D01*
X112275904Y-130818095D01*
X112037809Y-130818095D01*
X111942571Y-130865714D01*
X111894952Y-130913333D01*
X111847333Y-131008571D01*
X111847333Y-131199047D01*
X111894952Y-131294285D01*
X111942571Y-131341904D01*
X112037809Y-131389523D01*
G04 #@! TO.C,C25*
X110863142Y-138279142D02*
X110815523Y-138326761D01*
X110672666Y-138374380D01*
X110577428Y-138374380D01*
X110434571Y-138326761D01*
X110339333Y-138231523D01*
X110291714Y-138136285D01*
X110244095Y-137945809D01*
X110244095Y-137802952D01*
X110291714Y-137612476D01*
X110339333Y-137517238D01*
X110434571Y-137422000D01*
X110577428Y-137374380D01*
X110672666Y-137374380D01*
X110815523Y-137422000D01*
X110863142Y-137469619D01*
X111244095Y-137469619D02*
X111291714Y-137422000D01*
X111386952Y-137374380D01*
X111625047Y-137374380D01*
X111720285Y-137422000D01*
X111767904Y-137469619D01*
X111815523Y-137564857D01*
X111815523Y-137660095D01*
X111767904Y-137802952D01*
X111196476Y-138374380D01*
X111815523Y-138374380D01*
X112720285Y-137374380D02*
X112244095Y-137374380D01*
X112196476Y-137850571D01*
X112244095Y-137802952D01*
X112339333Y-137755333D01*
X112577428Y-137755333D01*
X112672666Y-137802952D01*
X112720285Y-137850571D01*
X112767904Y-137945809D01*
X112767904Y-138183904D01*
X112720285Y-138279142D01*
X112672666Y-138326761D01*
X112577428Y-138374380D01*
X112339333Y-138374380D01*
X112244095Y-138326761D01*
X112196476Y-138279142D01*
G04 #@! TO.C,C24*
X131675142Y-116720857D02*
X131722761Y-116768476D01*
X131770380Y-116911333D01*
X131770380Y-117006571D01*
X131722761Y-117149428D01*
X131627523Y-117244666D01*
X131532285Y-117292285D01*
X131341809Y-117339904D01*
X131198952Y-117339904D01*
X131008476Y-117292285D01*
X130913238Y-117244666D01*
X130818000Y-117149428D01*
X130770380Y-117006571D01*
X130770380Y-116911333D01*
X130818000Y-116768476D01*
X130865619Y-116720857D01*
X130865619Y-116339904D02*
X130818000Y-116292285D01*
X130770380Y-116197047D01*
X130770380Y-115958952D01*
X130818000Y-115863714D01*
X130865619Y-115816095D01*
X130960857Y-115768476D01*
X131056095Y-115768476D01*
X131198952Y-115816095D01*
X131770380Y-116387523D01*
X131770380Y-115768476D01*
X131103714Y-114911333D02*
X131770380Y-114911333D01*
X130722761Y-115149428D02*
X131437047Y-115387523D01*
X131437047Y-114768476D01*
G04 #@! TO.C,C23*
X110609142Y-134723142D02*
X110561523Y-134770761D01*
X110418666Y-134818380D01*
X110323428Y-134818380D01*
X110180571Y-134770761D01*
X110085333Y-134675523D01*
X110037714Y-134580285D01*
X109990095Y-134389809D01*
X109990095Y-134246952D01*
X110037714Y-134056476D01*
X110085333Y-133961238D01*
X110180571Y-133866000D01*
X110323428Y-133818380D01*
X110418666Y-133818380D01*
X110561523Y-133866000D01*
X110609142Y-133913619D01*
X110990095Y-133913619D02*
X111037714Y-133866000D01*
X111132952Y-133818380D01*
X111371047Y-133818380D01*
X111466285Y-133866000D01*
X111513904Y-133913619D01*
X111561523Y-134008857D01*
X111561523Y-134104095D01*
X111513904Y-134246952D01*
X110942476Y-134818380D01*
X111561523Y-134818380D01*
X111894857Y-133818380D02*
X112513904Y-133818380D01*
X112180571Y-134199333D01*
X112323428Y-134199333D01*
X112418666Y-134246952D01*
X112466285Y-134294571D01*
X112513904Y-134389809D01*
X112513904Y-134627904D01*
X112466285Y-134723142D01*
X112418666Y-134770761D01*
X112323428Y-134818380D01*
X112037714Y-134818380D01*
X111942476Y-134770761D01*
X111894857Y-134723142D01*
G04 #@! TO.C,C22*
X116435142Y-124340857D02*
X116482761Y-124388476D01*
X116530380Y-124531333D01*
X116530380Y-124626571D01*
X116482761Y-124769428D01*
X116387523Y-124864666D01*
X116292285Y-124912285D01*
X116101809Y-124959904D01*
X115958952Y-124959904D01*
X115768476Y-124912285D01*
X115673238Y-124864666D01*
X115578000Y-124769428D01*
X115530380Y-124626571D01*
X115530380Y-124531333D01*
X115578000Y-124388476D01*
X115625619Y-124340857D01*
X115625619Y-123959904D02*
X115578000Y-123912285D01*
X115530380Y-123817047D01*
X115530380Y-123578952D01*
X115578000Y-123483714D01*
X115625619Y-123436095D01*
X115720857Y-123388476D01*
X115816095Y-123388476D01*
X115958952Y-123436095D01*
X116530380Y-124007523D01*
X116530380Y-123388476D01*
X115625619Y-123007523D02*
X115578000Y-122959904D01*
X115530380Y-122864666D01*
X115530380Y-122626571D01*
X115578000Y-122531333D01*
X115625619Y-122483714D01*
X115720857Y-122436095D01*
X115816095Y-122436095D01*
X115958952Y-122483714D01*
X116530380Y-123055142D01*
X116530380Y-122436095D01*
G04 #@! TO.C,C21*
X121515142Y-119768857D02*
X121562761Y-119816476D01*
X121610380Y-119959333D01*
X121610380Y-120054571D01*
X121562761Y-120197428D01*
X121467523Y-120292666D01*
X121372285Y-120340285D01*
X121181809Y-120387904D01*
X121038952Y-120387904D01*
X120848476Y-120340285D01*
X120753238Y-120292666D01*
X120658000Y-120197428D01*
X120610380Y-120054571D01*
X120610380Y-119959333D01*
X120658000Y-119816476D01*
X120705619Y-119768857D01*
X120705619Y-119387904D02*
X120658000Y-119340285D01*
X120610380Y-119245047D01*
X120610380Y-119006952D01*
X120658000Y-118911714D01*
X120705619Y-118864095D01*
X120800857Y-118816476D01*
X120896095Y-118816476D01*
X121038952Y-118864095D01*
X121610380Y-119435523D01*
X121610380Y-118816476D01*
X121610380Y-117864095D02*
X121610380Y-118435523D01*
X121610380Y-118149809D02*
X120610380Y-118149809D01*
X120753238Y-118245047D01*
X120848476Y-118340285D01*
X120896095Y-118435523D01*
G04 #@! TO.C,C20*
X120287642Y-110433142D02*
X120240023Y-110480761D01*
X120097166Y-110528380D01*
X120001928Y-110528380D01*
X119859071Y-110480761D01*
X119763833Y-110385523D01*
X119716214Y-110290285D01*
X119668595Y-110099809D01*
X119668595Y-109956952D01*
X119716214Y-109766476D01*
X119763833Y-109671238D01*
X119859071Y-109576000D01*
X120001928Y-109528380D01*
X120097166Y-109528380D01*
X120240023Y-109576000D01*
X120287642Y-109623619D01*
X120668595Y-109623619D02*
X120716214Y-109576000D01*
X120811452Y-109528380D01*
X121049547Y-109528380D01*
X121144785Y-109576000D01*
X121192404Y-109623619D01*
X121240023Y-109718857D01*
X121240023Y-109814095D01*
X121192404Y-109956952D01*
X120620976Y-110528380D01*
X121240023Y-110528380D01*
X121859071Y-109528380D02*
X121954309Y-109528380D01*
X122049547Y-109576000D01*
X122097166Y-109623619D01*
X122144785Y-109718857D01*
X122192404Y-109909333D01*
X122192404Y-110147428D01*
X122144785Y-110337904D01*
X122097166Y-110433142D01*
X122049547Y-110480761D01*
X121954309Y-110528380D01*
X121859071Y-110528380D01*
X121763833Y-110480761D01*
X121716214Y-110433142D01*
X121668595Y-110337904D01*
X121620976Y-110147428D01*
X121620976Y-109909333D01*
X121668595Y-109718857D01*
X121716214Y-109623619D01*
X121763833Y-109576000D01*
X121859071Y-109528380D01*
G04 #@! TO.C,C19*
X101449142Y-127134857D02*
X101496761Y-127182476D01*
X101544380Y-127325333D01*
X101544380Y-127420571D01*
X101496761Y-127563428D01*
X101401523Y-127658666D01*
X101306285Y-127706285D01*
X101115809Y-127753904D01*
X100972952Y-127753904D01*
X100782476Y-127706285D01*
X100687238Y-127658666D01*
X100592000Y-127563428D01*
X100544380Y-127420571D01*
X100544380Y-127325333D01*
X100592000Y-127182476D01*
X100639619Y-127134857D01*
X101544380Y-126182476D02*
X101544380Y-126753904D01*
X101544380Y-126468190D02*
X100544380Y-126468190D01*
X100687238Y-126563428D01*
X100782476Y-126658666D01*
X100830095Y-126753904D01*
X101544380Y-125706285D02*
X101544380Y-125515809D01*
X101496761Y-125420571D01*
X101449142Y-125372952D01*
X101306285Y-125277714D01*
X101115809Y-125230095D01*
X100734857Y-125230095D01*
X100639619Y-125277714D01*
X100592000Y-125325333D01*
X100544380Y-125420571D01*
X100544380Y-125611047D01*
X100592000Y-125706285D01*
X100639619Y-125753904D01*
X100734857Y-125801523D01*
X100972952Y-125801523D01*
X101068190Y-125753904D01*
X101115809Y-125706285D01*
X101163428Y-125611047D01*
X101163428Y-125420571D01*
X101115809Y-125325333D01*
X101068190Y-125277714D01*
X100972952Y-125230095D01*
G04 #@! TO.C,C18*
X101449142Y-111894857D02*
X101496761Y-111942476D01*
X101544380Y-112085333D01*
X101544380Y-112180571D01*
X101496761Y-112323428D01*
X101401523Y-112418666D01*
X101306285Y-112466285D01*
X101115809Y-112513904D01*
X100972952Y-112513904D01*
X100782476Y-112466285D01*
X100687238Y-112418666D01*
X100592000Y-112323428D01*
X100544380Y-112180571D01*
X100544380Y-112085333D01*
X100592000Y-111942476D01*
X100639619Y-111894857D01*
X101544380Y-110942476D02*
X101544380Y-111513904D01*
X101544380Y-111228190D02*
X100544380Y-111228190D01*
X100687238Y-111323428D01*
X100782476Y-111418666D01*
X100830095Y-111513904D01*
X100972952Y-110371047D02*
X100925333Y-110466285D01*
X100877714Y-110513904D01*
X100782476Y-110561523D01*
X100734857Y-110561523D01*
X100639619Y-110513904D01*
X100592000Y-110466285D01*
X100544380Y-110371047D01*
X100544380Y-110180571D01*
X100592000Y-110085333D01*
X100639619Y-110037714D01*
X100734857Y-109990095D01*
X100782476Y-109990095D01*
X100877714Y-110037714D01*
X100925333Y-110085333D01*
X100972952Y-110180571D01*
X100972952Y-110371047D01*
X101020571Y-110466285D01*
X101068190Y-110513904D01*
X101163428Y-110561523D01*
X101353904Y-110561523D01*
X101449142Y-110513904D01*
X101496761Y-110466285D01*
X101544380Y-110371047D01*
X101544380Y-110180571D01*
X101496761Y-110085333D01*
X101449142Y-110037714D01*
X101353904Y-109990095D01*
X101163428Y-109990095D01*
X101068190Y-110037714D01*
X101020571Y-110085333D01*
X100972952Y-110180571D01*
G04 #@! TO.C,C17*
X90035142Y-116689142D02*
X89987523Y-116736761D01*
X89844666Y-116784380D01*
X89749428Y-116784380D01*
X89606571Y-116736761D01*
X89511333Y-116641523D01*
X89463714Y-116546285D01*
X89416095Y-116355809D01*
X89416095Y-116212952D01*
X89463714Y-116022476D01*
X89511333Y-115927238D01*
X89606571Y-115832000D01*
X89749428Y-115784380D01*
X89844666Y-115784380D01*
X89987523Y-115832000D01*
X90035142Y-115879619D01*
X90987523Y-116784380D02*
X90416095Y-116784380D01*
X90701809Y-116784380D02*
X90701809Y-115784380D01*
X90606571Y-115927238D01*
X90511333Y-116022476D01*
X90416095Y-116070095D01*
X91320857Y-115784380D02*
X91987523Y-115784380D01*
X91558952Y-116784380D01*
G04 #@! TO.C,C16*
X96369142Y-114180857D02*
X96416761Y-114228476D01*
X96464380Y-114371333D01*
X96464380Y-114466571D01*
X96416761Y-114609428D01*
X96321523Y-114704666D01*
X96226285Y-114752285D01*
X96035809Y-114799904D01*
X95892952Y-114799904D01*
X95702476Y-114752285D01*
X95607238Y-114704666D01*
X95512000Y-114609428D01*
X95464380Y-114466571D01*
X95464380Y-114371333D01*
X95512000Y-114228476D01*
X95559619Y-114180857D01*
X96464380Y-113228476D02*
X96464380Y-113799904D01*
X96464380Y-113514190D02*
X95464380Y-113514190D01*
X95607238Y-113609428D01*
X95702476Y-113704666D01*
X95750095Y-113799904D01*
X95464380Y-112371333D02*
X95464380Y-112561809D01*
X95512000Y-112657047D01*
X95559619Y-112704666D01*
X95702476Y-112799904D01*
X95892952Y-112847523D01*
X96273904Y-112847523D01*
X96369142Y-112799904D01*
X96416761Y-112752285D01*
X96464380Y-112657047D01*
X96464380Y-112466571D01*
X96416761Y-112371333D01*
X96369142Y-112323714D01*
X96273904Y-112276095D01*
X96035809Y-112276095D01*
X95940571Y-112323714D01*
X95892952Y-112371333D01*
X95845333Y-112466571D01*
X95845333Y-112657047D01*
X95892952Y-112752285D01*
X95940571Y-112799904D01*
X96035809Y-112847523D01*
G04 #@! TO.C,C15*
X98401142Y-114434857D02*
X98448761Y-114482476D01*
X98496380Y-114625333D01*
X98496380Y-114720571D01*
X98448761Y-114863428D01*
X98353523Y-114958666D01*
X98258285Y-115006285D01*
X98067809Y-115053904D01*
X97924952Y-115053904D01*
X97734476Y-115006285D01*
X97639238Y-114958666D01*
X97544000Y-114863428D01*
X97496380Y-114720571D01*
X97496380Y-114625333D01*
X97544000Y-114482476D01*
X97591619Y-114434857D01*
X98496380Y-113482476D02*
X98496380Y-114053904D01*
X98496380Y-113768190D02*
X97496380Y-113768190D01*
X97639238Y-113863428D01*
X97734476Y-113958666D01*
X97782095Y-114053904D01*
X97496380Y-112577714D02*
X97496380Y-113053904D01*
X97972571Y-113101523D01*
X97924952Y-113053904D01*
X97877333Y-112958666D01*
X97877333Y-112720571D01*
X97924952Y-112625333D01*
X97972571Y-112577714D01*
X98067809Y-112530095D01*
X98305904Y-112530095D01*
X98401142Y-112577714D01*
X98448761Y-112625333D01*
X98496380Y-112720571D01*
X98496380Y-112958666D01*
X98448761Y-113053904D01*
X98401142Y-113101523D01*
G04 #@! TO.C,C14*
X96369142Y-125102857D02*
X96416761Y-125150476D01*
X96464380Y-125293333D01*
X96464380Y-125388571D01*
X96416761Y-125531428D01*
X96321523Y-125626666D01*
X96226285Y-125674285D01*
X96035809Y-125721904D01*
X95892952Y-125721904D01*
X95702476Y-125674285D01*
X95607238Y-125626666D01*
X95512000Y-125531428D01*
X95464380Y-125388571D01*
X95464380Y-125293333D01*
X95512000Y-125150476D01*
X95559619Y-125102857D01*
X96464380Y-124150476D02*
X96464380Y-124721904D01*
X96464380Y-124436190D02*
X95464380Y-124436190D01*
X95607238Y-124531428D01*
X95702476Y-124626666D01*
X95750095Y-124721904D01*
X95797714Y-123293333D02*
X96464380Y-123293333D01*
X95416761Y-123531428D02*
X96131047Y-123769523D01*
X96131047Y-123150476D01*
G04 #@! TO.C,C13*
X98655142Y-124594857D02*
X98702761Y-124642476D01*
X98750380Y-124785333D01*
X98750380Y-124880571D01*
X98702761Y-125023428D01*
X98607523Y-125118666D01*
X98512285Y-125166285D01*
X98321809Y-125213904D01*
X98178952Y-125213904D01*
X97988476Y-125166285D01*
X97893238Y-125118666D01*
X97798000Y-125023428D01*
X97750380Y-124880571D01*
X97750380Y-124785333D01*
X97798000Y-124642476D01*
X97845619Y-124594857D01*
X98750380Y-123642476D02*
X98750380Y-124213904D01*
X98750380Y-123928190D02*
X97750380Y-123928190D01*
X97893238Y-124023428D01*
X97988476Y-124118666D01*
X98036095Y-124213904D01*
X97750380Y-123309142D02*
X97750380Y-122690095D01*
X98131333Y-123023428D01*
X98131333Y-122880571D01*
X98178952Y-122785333D01*
X98226571Y-122737714D01*
X98321809Y-122690095D01*
X98559904Y-122690095D01*
X98655142Y-122737714D01*
X98702761Y-122785333D01*
X98750380Y-122880571D01*
X98750380Y-123166285D01*
X98702761Y-123261523D01*
X98655142Y-123309142D01*
G04 #@! TO.C,C12*
X102465142Y-94876857D02*
X102512761Y-94924476D01*
X102560380Y-95067333D01*
X102560380Y-95162571D01*
X102512761Y-95305428D01*
X102417523Y-95400666D01*
X102322285Y-95448285D01*
X102131809Y-95495904D01*
X101988952Y-95495904D01*
X101798476Y-95448285D01*
X101703238Y-95400666D01*
X101608000Y-95305428D01*
X101560380Y-95162571D01*
X101560380Y-95067333D01*
X101608000Y-94924476D01*
X101655619Y-94876857D01*
X102560380Y-93924476D02*
X102560380Y-94495904D01*
X102560380Y-94210190D02*
X101560380Y-94210190D01*
X101703238Y-94305428D01*
X101798476Y-94400666D01*
X101846095Y-94495904D01*
X101655619Y-93543523D02*
X101608000Y-93495904D01*
X101560380Y-93400666D01*
X101560380Y-93162571D01*
X101608000Y-93067333D01*
X101655619Y-93019714D01*
X101750857Y-92972095D01*
X101846095Y-92972095D01*
X101988952Y-93019714D01*
X102560380Y-93591142D01*
X102560380Y-92972095D01*
G04 #@! TO.C,C11*
X102211142Y-136278857D02*
X102258761Y-136326476D01*
X102306380Y-136469333D01*
X102306380Y-136564571D01*
X102258761Y-136707428D01*
X102163523Y-136802666D01*
X102068285Y-136850285D01*
X101877809Y-136897904D01*
X101734952Y-136897904D01*
X101544476Y-136850285D01*
X101449238Y-136802666D01*
X101354000Y-136707428D01*
X101306380Y-136564571D01*
X101306380Y-136469333D01*
X101354000Y-136326476D01*
X101401619Y-136278857D01*
X102306380Y-135326476D02*
X102306380Y-135897904D01*
X102306380Y-135612190D02*
X101306380Y-135612190D01*
X101449238Y-135707428D01*
X101544476Y-135802666D01*
X101592095Y-135897904D01*
X102306380Y-134374095D02*
X102306380Y-134945523D01*
X102306380Y-134659809D02*
X101306380Y-134659809D01*
X101449238Y-134755047D01*
X101544476Y-134850285D01*
X101592095Y-134945523D01*
G04 #@! TO.C,C10*
X80875142Y-108592857D02*
X80922761Y-108640476D01*
X80970380Y-108783333D01*
X80970380Y-108878571D01*
X80922761Y-109021428D01*
X80827523Y-109116666D01*
X80732285Y-109164285D01*
X80541809Y-109211904D01*
X80398952Y-109211904D01*
X80208476Y-109164285D01*
X80113238Y-109116666D01*
X80018000Y-109021428D01*
X79970380Y-108878571D01*
X79970380Y-108783333D01*
X80018000Y-108640476D01*
X80065619Y-108592857D01*
X80970380Y-107640476D02*
X80970380Y-108211904D01*
X80970380Y-107926190D02*
X79970380Y-107926190D01*
X80113238Y-108021428D01*
X80208476Y-108116666D01*
X80256095Y-108211904D01*
X79970380Y-107021428D02*
X79970380Y-106926190D01*
X80018000Y-106830952D01*
X80065619Y-106783333D01*
X80160857Y-106735714D01*
X80351333Y-106688095D01*
X80589428Y-106688095D01*
X80779904Y-106735714D01*
X80875142Y-106783333D01*
X80922761Y-106830952D01*
X80970380Y-106926190D01*
X80970380Y-107021428D01*
X80922761Y-107116666D01*
X80875142Y-107164285D01*
X80779904Y-107211904D01*
X80589428Y-107259523D01*
X80351333Y-107259523D01*
X80160857Y-107211904D01*
X80065619Y-107164285D01*
X80018000Y-107116666D01*
X79970380Y-107021428D01*
G04 #@! TO.C,C9*
X80875142Y-89066666D02*
X80922761Y-89114285D01*
X80970380Y-89257142D01*
X80970380Y-89352380D01*
X80922761Y-89495238D01*
X80827523Y-89590476D01*
X80732285Y-89638095D01*
X80541809Y-89685714D01*
X80398952Y-89685714D01*
X80208476Y-89638095D01*
X80113238Y-89590476D01*
X80018000Y-89495238D01*
X79970380Y-89352380D01*
X79970380Y-89257142D01*
X80018000Y-89114285D01*
X80065619Y-89066666D01*
X80970380Y-88590476D02*
X80970380Y-88400000D01*
X80922761Y-88304761D01*
X80875142Y-88257142D01*
X80732285Y-88161904D01*
X80541809Y-88114285D01*
X80160857Y-88114285D01*
X80065619Y-88161904D01*
X80018000Y-88209523D01*
X79970380Y-88304761D01*
X79970380Y-88495238D01*
X80018000Y-88590476D01*
X80065619Y-88638095D01*
X80160857Y-88685714D01*
X80398952Y-88685714D01*
X80494190Y-88638095D01*
X80541809Y-88590476D01*
X80589428Y-88495238D01*
X80589428Y-88304761D01*
X80541809Y-88209523D01*
X80494190Y-88161904D01*
X80398952Y-88114285D01*
G04 #@! TO.C,C8*
X81129142Y-149986666D02*
X81176761Y-150034285D01*
X81224380Y-150177142D01*
X81224380Y-150272380D01*
X81176761Y-150415238D01*
X81081523Y-150510476D01*
X80986285Y-150558095D01*
X80795809Y-150605714D01*
X80652952Y-150605714D01*
X80462476Y-150558095D01*
X80367238Y-150510476D01*
X80272000Y-150415238D01*
X80224380Y-150272380D01*
X80224380Y-150177142D01*
X80272000Y-150034285D01*
X80319619Y-149986666D01*
X80652952Y-149415238D02*
X80605333Y-149510476D01*
X80557714Y-149558095D01*
X80462476Y-149605714D01*
X80414857Y-149605714D01*
X80319619Y-149558095D01*
X80272000Y-149510476D01*
X80224380Y-149415238D01*
X80224380Y-149224761D01*
X80272000Y-149129523D01*
X80319619Y-149081904D01*
X80414857Y-149034285D01*
X80462476Y-149034285D01*
X80557714Y-149081904D01*
X80605333Y-149129523D01*
X80652952Y-149224761D01*
X80652952Y-149415238D01*
X80700571Y-149510476D01*
X80748190Y-149558095D01*
X80843428Y-149605714D01*
X81033904Y-149605714D01*
X81129142Y-149558095D01*
X81176761Y-149510476D01*
X81224380Y-149415238D01*
X81224380Y-149224761D01*
X81176761Y-149129523D01*
X81129142Y-149081904D01*
X81033904Y-149034285D01*
X80843428Y-149034285D01*
X80748190Y-149081904D01*
X80700571Y-149129523D01*
X80652952Y-149224761D01*
G04 #@! TO.C,C7*
X81129142Y-129920666D02*
X81176761Y-129968285D01*
X81224380Y-130111142D01*
X81224380Y-130206380D01*
X81176761Y-130349238D01*
X81081523Y-130444476D01*
X80986285Y-130492095D01*
X80795809Y-130539714D01*
X80652952Y-130539714D01*
X80462476Y-130492095D01*
X80367238Y-130444476D01*
X80272000Y-130349238D01*
X80224380Y-130206380D01*
X80224380Y-130111142D01*
X80272000Y-129968285D01*
X80319619Y-129920666D01*
X80224380Y-129587333D02*
X80224380Y-128920666D01*
X81224380Y-129349238D01*
G04 #@! TO.C,C6*
X75541142Y-108116666D02*
X75588761Y-108164285D01*
X75636380Y-108307142D01*
X75636380Y-108402380D01*
X75588761Y-108545238D01*
X75493523Y-108640476D01*
X75398285Y-108688095D01*
X75207809Y-108735714D01*
X75064952Y-108735714D01*
X74874476Y-108688095D01*
X74779238Y-108640476D01*
X74684000Y-108545238D01*
X74636380Y-108402380D01*
X74636380Y-108307142D01*
X74684000Y-108164285D01*
X74731619Y-108116666D01*
X74636380Y-107259523D02*
X74636380Y-107450000D01*
X74684000Y-107545238D01*
X74731619Y-107592857D01*
X74874476Y-107688095D01*
X75064952Y-107735714D01*
X75445904Y-107735714D01*
X75541142Y-107688095D01*
X75588761Y-107640476D01*
X75636380Y-107545238D01*
X75636380Y-107354761D01*
X75588761Y-107259523D01*
X75541142Y-107211904D01*
X75445904Y-107164285D01*
X75207809Y-107164285D01*
X75112571Y-107211904D01*
X75064952Y-107259523D01*
X75017333Y-107354761D01*
X75017333Y-107545238D01*
X75064952Y-107640476D01*
X75112571Y-107688095D01*
X75207809Y-107735714D01*
G04 #@! TO.C,C5*
X75541142Y-89106666D02*
X75588761Y-89154285D01*
X75636380Y-89297142D01*
X75636380Y-89392380D01*
X75588761Y-89535238D01*
X75493523Y-89630476D01*
X75398285Y-89678095D01*
X75207809Y-89725714D01*
X75064952Y-89725714D01*
X74874476Y-89678095D01*
X74779238Y-89630476D01*
X74684000Y-89535238D01*
X74636380Y-89392380D01*
X74636380Y-89297142D01*
X74684000Y-89154285D01*
X74731619Y-89106666D01*
X74636380Y-88201904D02*
X74636380Y-88678095D01*
X75112571Y-88725714D01*
X75064952Y-88678095D01*
X75017333Y-88582857D01*
X75017333Y-88344761D01*
X75064952Y-88249523D01*
X75112571Y-88201904D01*
X75207809Y-88154285D01*
X75445904Y-88154285D01*
X75541142Y-88201904D01*
X75588761Y-88249523D01*
X75636380Y-88344761D01*
X75636380Y-88582857D01*
X75588761Y-88678095D01*
X75541142Y-88725714D01*
G04 #@! TO.C,C4*
X75541142Y-150026666D02*
X75588761Y-150074285D01*
X75636380Y-150217142D01*
X75636380Y-150312380D01*
X75588761Y-150455238D01*
X75493523Y-150550476D01*
X75398285Y-150598095D01*
X75207809Y-150645714D01*
X75064952Y-150645714D01*
X74874476Y-150598095D01*
X74779238Y-150550476D01*
X74684000Y-150455238D01*
X74636380Y-150312380D01*
X74636380Y-150217142D01*
X74684000Y-150074285D01*
X74731619Y-150026666D01*
X74969714Y-149169523D02*
X75636380Y-149169523D01*
X74588761Y-149407619D02*
X75303047Y-149645714D01*
X75303047Y-149026666D01*
G04 #@! TO.C,C3*
X75795142Y-129873666D02*
X75842761Y-129921285D01*
X75890380Y-130064142D01*
X75890380Y-130159380D01*
X75842761Y-130302238D01*
X75747523Y-130397476D01*
X75652285Y-130445095D01*
X75461809Y-130492714D01*
X75318952Y-130492714D01*
X75128476Y-130445095D01*
X75033238Y-130397476D01*
X74938000Y-130302238D01*
X74890380Y-130159380D01*
X74890380Y-130064142D01*
X74938000Y-129921285D01*
X74985619Y-129873666D01*
X74890380Y-129540333D02*
X74890380Y-128921285D01*
X75271333Y-129254619D01*
X75271333Y-129111761D01*
X75318952Y-129016523D01*
X75366571Y-128968904D01*
X75461809Y-128921285D01*
X75699904Y-128921285D01*
X75795142Y-128968904D01*
X75842761Y-129016523D01*
X75890380Y-129111761D01*
X75890380Y-129397476D01*
X75842761Y-129492714D01*
X75795142Y-129540333D01*
G04 #@! TO.C,C2*
X83161142Y-98718666D02*
X83208761Y-98766285D01*
X83256380Y-98909142D01*
X83256380Y-99004380D01*
X83208761Y-99147238D01*
X83113523Y-99242476D01*
X83018285Y-99290095D01*
X82827809Y-99337714D01*
X82684952Y-99337714D01*
X82494476Y-99290095D01*
X82399238Y-99242476D01*
X82304000Y-99147238D01*
X82256380Y-99004380D01*
X82256380Y-98909142D01*
X82304000Y-98766285D01*
X82351619Y-98718666D01*
X82351619Y-98337714D02*
X82304000Y-98290095D01*
X82256380Y-98194857D01*
X82256380Y-97956761D01*
X82304000Y-97861523D01*
X82351619Y-97813904D01*
X82446857Y-97766285D01*
X82542095Y-97766285D01*
X82684952Y-97813904D01*
X83256380Y-98385333D01*
X83256380Y-97766285D01*
G04 #@! TO.C,C1*
X83161142Y-140080666D02*
X83208761Y-140128285D01*
X83256380Y-140271142D01*
X83256380Y-140366380D01*
X83208761Y-140509238D01*
X83113523Y-140604476D01*
X83018285Y-140652095D01*
X82827809Y-140699714D01*
X82684952Y-140699714D01*
X82494476Y-140652095D01*
X82399238Y-140604476D01*
X82304000Y-140509238D01*
X82256380Y-140366380D01*
X82256380Y-140271142D01*
X82304000Y-140128285D01*
X82351619Y-140080666D01*
X83256380Y-139128285D02*
X83256380Y-139699714D01*
X83256380Y-139414000D02*
X82256380Y-139414000D01*
X82399238Y-139509238D01*
X82494476Y-139604476D01*
X82542095Y-139699714D01*
G04 #@! TD*
M02*
