G04 #@! TF.GenerationSoftware,KiCad,Pcbnew,5.1.10-1.fc32*
G04 #@! TF.CreationDate,2021-09-06T19:17:53+03:00*
G04 #@! TF.ProjectId,STA333_classD,53544133-3333-45f6-936c-617373442e6b,rev?*
G04 #@! TF.SameCoordinates,Original*
G04 #@! TF.FileFunction,Profile,NP*
%FSLAX46Y46*%
G04 Gerber Fmt 4.6, Leading zero omitted, Abs format (unit mm)*
G04 Created by KiCad (PCBNEW 5.1.10-1.fc32) date 2021-09-06 19:17:53*
%MOMM*%
%LPD*%
G01*
G04 APERTURE LIST*
G04 #@! TA.AperFunction,Profile*
%ADD10C,0.050000*%
G04 #@! TD*
G04 APERTURE END LIST*
D10*
X139192000Y-84328000D02*
X68072000Y-84328000D01*
X139192000Y-154940000D02*
X139192000Y-84328000D01*
X68072000Y-154940000D02*
X139192000Y-154940000D01*
X68072000Y-154432000D02*
X68072000Y-154940000D01*
X68072000Y-84328000D02*
X68072000Y-154432000D01*
M02*
