EESchema Schematic File Version 4
EELAYER 30 0
EELAYER END
$Descr A4 11693 8268
encoding utf-8
Sheet 1 1
Title ""
Date ""
Rev ""
Comp ""
Comment1 ""
Comment2 ""
Comment3 ""
Comment4 ""
$EndDescr
$Comp
L STA333W:STA333W IC1
U 1 1 61311F9D
P 4025 2300
F 0 "IC1" H 4925 2565 50  0000 C CNN
F 1 "STA333W" H 4925 2474 50  0000 C CNN
F 2 "STA333W:SOP50P1030X247-37N" H 5675 2400 50  0001 L CNN
F 3 "https://www.st.com/resource/en/datasheet/sta333w.pdf" H 5675 2300 50  0001 L CNN
F 4 "up to 20 W + 20 W of power." H 5675 2200 50  0001 L CNN "Description"
F 5 "2.47" H 5675 2100 50  0001 L CNN "Height"
F 6 "STMicroelectronics" H 5675 2000 50  0001 L CNN "Manufacturer_Name"
F 7 "STA333W" H 5675 1900 50  0001 L CNN "Manufacturer_Part_Number"
F 8 "" H 5675 1800 50  0001 L CNN "Mouser Part Number"
F 9 "" H 5675 1700 50  0001 L CNN "Mouser Price/Stock"
F 10 "" H 5675 1600 50  0001 L CNN "Arrow Part Number"
F 11 "" H 5675 1500 50  0001 L CNN "Arrow Price/Stock"
	1    4025 2300
	1    0    0    -1  
$EndComp
$Comp
L Device:R_Small R7
U 1 1 61313ED4
P 5975 2300
F 0 "R7" V 5779 2300 50  0000 C CNN
F 1 "3.3E" V 5870 2300 50  0000 C CNN
F 2 "Resistor_SMD:R_0805_2012Metric_Pad1.20x1.40mm_HandSolder" H 5975 2300 50  0001 C CNN
F 3 "~" H 5975 2300 50  0001 C CNN
	1    5975 2300
	0    1    1    0   
$EndComp
$Comp
L Device:C_Small C20
U 1 1 613144B0
P 6350 2400
F 0 "C20" H 6442 2446 50  0000 L CNN
F 1 "0.1u" H 6442 2355 50  0000 L CNN
F 2 "Capacitor_SMD:C_0603_1608Metric_Pad1.08x0.95mm_HandSolder" H 6350 2400 50  0001 C CNN
F 3 "~" H 6350 2400 50  0001 C CNN
	1    6350 2400
	1    0    0    -1  
$EndComp
$Comp
L Device:C_Small C21
U 1 1 613169B8
P 6350 3400
F 0 "C21" H 6442 3446 50  0000 L CNN
F 1 "0.1u" H 6442 3355 50  0000 L CNN
F 2 "Capacitor_SMD:C_0603_1608Metric_Pad1.08x0.95mm_HandSolder" H 6350 3400 50  0001 C CNN
F 3 "~" H 6350 3400 50  0001 C CNN
	1    6350 3400
	1    0    0    -1  
$EndComp
$Comp
L Device:C_Small C22
U 1 1 61317568
P 6350 3700
F 0 "C22" H 6442 3746 50  0000 L CNN
F 1 "0.1u" H 6442 3655 50  0000 L CNN
F 2 "Capacitor_SMD:C_0603_1608Metric_Pad1.08x0.95mm_HandSolder" H 6350 3700 50  0001 C CNN
F 3 "~" H 6350 3700 50  0001 C CNN
	1    6350 3700
	1    0    0    -1  
$EndComp
$Comp
L Device:R_Small R8
U 1 1 61317FB6
P 5975 3800
F 0 "R8" V 5779 3800 50  0000 C CNN
F 1 "3.3E" V 5870 3800 50  0000 C CNN
F 2 "Resistor_SMD:R_0805_2012Metric_Pad1.20x1.40mm_HandSolder" H 5975 3800 50  0001 C CNN
F 3 "~" H 5975 3800 50  0001 C CNN
	1    5975 3800
	0    1    1    0   
$EndComp
$Comp
L Device:C_Small C19
U 1 1 61319E9B
P 3675 3650
F 0 "C19" H 3767 3696 50  0000 L CNN
F 1 "0.1u" H 3767 3605 50  0000 L CNN
F 2 "Capacitor_SMD:C_0603_1608Metric_Pad1.08x0.95mm_HandSolder" H 3675 3650 50  0001 C CNN
F 3 "~" H 3675 3650 50  0001 C CNN
	1    3675 3650
	1    0    0    -1  
$EndComp
$Comp
L Device:C_Small C18
U 1 1 6131A3D1
P 3675 2675
F 0 "C18" H 3767 2721 50  0000 L CNN
F 1 "0.1u" H 3767 2630 50  0000 L CNN
F 2 "Capacitor_SMD:C_0603_1608Metric_Pad1.08x0.95mm_HandSolder" H 3675 2675 50  0001 C CNN
F 3 "~" H 3675 2675 50  0001 C CNN
	1    3675 2675
	1    0    0    -1  
$EndComp
Wire Wire Line
	3675 2575 3875 2575
Wire Wire Line
	3875 2575 3875 2600
Wire Wire Line
	3875 2600 4025 2600
Wire Wire Line
	3675 2775 3875 2775
Wire Wire Line
	3875 2775 3875 2700
Wire Wire Line
	3875 2700 4025 2700
Wire Wire Line
	3675 3550 3875 3550
Wire Wire Line
	3875 3550 3875 3600
Wire Wire Line
	3875 3600 4025 3600
Wire Wire Line
	3675 3750 3875 3750
Wire Wire Line
	3875 3750 3875 3700
Wire Wire Line
	3875 3700 4025 3700
$Comp
L Device:C_Small C15
U 1 1 6131AFC1
P 3300 3300
F 0 "C15" H 3392 3346 50  0000 L CNN
F 1 "0.1u" H 3392 3255 50  0000 L CNN
F 2 "Capacitor_SMD:C_0603_1608Metric_Pad1.08x0.95mm_HandSolder" H 3300 3300 50  0001 C CNN
F 3 "~" H 3300 3300 50  0001 C CNN
	1    3300 3300
	0    -1   -1   0   
$EndComp
$Comp
L Device:C_Small C14
U 1 1 6131CBDF
P 3300 3025
F 0 "C14" V 3529 3025 50  0000 C CNN
F 1 "1u" V 3438 3025 50  0000 C CNN
F 2 "Capacitor_SMD:C_0805_2012Metric_Pad1.18x1.45mm_HandSolder" H 3300 3025 50  0001 C CNN
F 3 "~" H 3300 3025 50  0001 C CNN
	1    3300 3025
	0    -1   -1   0   
$EndComp
$Comp
L Device:C_Small C16
U 1 1 6131D191
P 3300 3600
F 0 "C16" V 3529 3600 50  0000 C CNN
F 1 "1u" V 3438 3600 50  0000 C CNN
F 2 "Capacitor_SMD:C_0805_2012Metric_Pad1.18x1.45mm_HandSolder" H 3300 3600 50  0001 C CNN
F 3 "~" H 3300 3600 50  0001 C CNN
	1    3300 3600
	0    -1   -1   0   
$EndComp
$Comp
L Device:C_Small C13
U 1 1 6131D5D4
P 3300 2750
F 0 "C13" H 3392 2796 50  0000 L CNN
F 1 "0.1u" H 3392 2705 50  0000 L CNN
F 2 "Capacitor_SMD:C_0603_1608Metric_Pad1.08x0.95mm_HandSolder" H 3300 2750 50  0001 C CNN
F 3 "~" H 3300 2750 50  0001 C CNN
	1    3300 2750
	0    -1   -1   0   
$EndComp
Wire Wire Line
	3400 3600 3400 3300
Wire Wire Line
	4025 3300 3625 3300
Connection ~ 3400 3300
Wire Wire Line
	3400 2750 3400 3000
Wire Wire Line
	4025 3000 3625 3000
Connection ~ 3400 3000
Wire Wire Line
	3400 3000 3400 3025
Wire Wire Line
	4025 3400 3425 3400
Wire Wire Line
	3425 3400 3425 3725
Wire Wire Line
	3425 3725 3200 3725
Wire Wire Line
	3200 3725 3200 3600
Connection ~ 3200 3600
Wire Wire Line
	4025 2900 3425 2900
Wire Wire Line
	3425 2900 3425 2625
Wire Wire Line
	3425 2625 3200 2625
Wire Wire Line
	3200 2625 3200 2750
Wire Wire Line
	3200 2750 3200 3025
Connection ~ 3200 2750
Wire Wire Line
	3200 3025 3200 3150
Connection ~ 3200 3025
Connection ~ 3200 3300
$Comp
L Device:CP_Small C17
U 1 1 61320C4C
P 3525 3150
F 0 "C17" V 3300 3150 50  0000 C CNN
F 1 "1000u" V 3391 3150 50  0000 C CNN
F 2 "Capacitor_THT:CP_Radial_D13.0mm_P5.00mm" H 3525 3150 50  0001 C CNN
F 3 "~" H 3525 3150 50  0001 C CNN
	1    3525 3150
	0    1    1    0   
$EndComp
Wire Wire Line
	3625 3150 3625 3000
Connection ~ 3625 3000
Wire Wire Line
	3625 3000 3400 3000
Wire Wire Line
	3625 3150 3625 3225
Connection ~ 3625 3150
Connection ~ 3625 3300
Wire Wire Line
	3625 3300 3400 3300
Wire Wire Line
	3425 3150 3200 3150
Connection ~ 3200 3150
Wire Wire Line
	3200 3150 3200 3300
$Comp
L power:Earth #PWR03
U 1 1 61322D60
P 3200 3725
F 0 "#PWR03" H 3200 3475 50  0001 C CNN
F 1 "Earth" H 3200 3575 50  0001 C CNN
F 2 "" H 3200 3725 50  0001 C CNN
F 3 "~" H 3200 3725 50  0001 C CNN
	1    3200 3725
	1    0    0    -1  
$EndComp
Connection ~ 3200 3725
$Comp
L power:Earth #PWR04
U 1 1 613242FE
P 3975 2400
F 0 "#PWR04" H 3975 2150 50  0001 C CNN
F 1 "Earth" H 3975 2250 50  0001 C CNN
F 2 "" H 3975 2400 50  0001 C CNN
F 3 "~" H 3975 2400 50  0001 C CNN
	1    3975 2400
	0    1    1    0   
$EndComp
Wire Wire Line
	3975 2400 3975 2300
Wire Wire Line
	3975 2300 4025 2300
Wire Wire Line
	3975 2400 3975 2500
Wire Wire Line
	3975 2500 4025 2500
Connection ~ 3975 2400
Wire Wire Line
	4025 2400 3975 2400
Wire Wire Line
	5825 2300 5875 2300
Wire Wire Line
	6075 2300 6350 2300
Wire Wire Line
	5875 3800 5825 3800
Wire Wire Line
	6075 3800 6350 3800
Wire Wire Line
	5825 3700 6175 3700
Wire Wire Line
	6175 3700 6175 3600
Wire Wire Line
	6175 3600 6350 3600
Wire Wire Line
	5825 2400 6225 2400
Wire Wire Line
	6225 2400 6225 2500
Wire Wire Line
	6225 2500 6350 2500
Wire Wire Line
	5825 3500 6350 3500
Wire Wire Line
	5825 3300 6350 3300
$Comp
L power:GNDD #PWR014
U 1 1 6132CA99
P 6700 2500
F 0 "#PWR014" H 6700 2250 50  0001 C CNN
F 1 "GNDD" H 6704 2345 50  0000 C CNN
F 2 "" H 6700 2500 50  0001 C CNN
F 3 "" H 6700 2500 50  0001 C CNN
	1    6700 2500
	-1   0    0    1   
$EndComp
$Comp
L power:GNDD #PWR013
U 1 1 6132D4EE
P 6650 3600
F 0 "#PWR013" H 6650 3350 50  0001 C CNN
F 1 "GNDD" H 6654 3445 50  0000 C CNN
F 2 "" H 6650 3600 50  0001 C CNN
F 3 "" H 6650 3600 50  0001 C CNN
	1    6650 3600
	1    0    0    -1  
$EndComp
Wire Wire Line
	6650 3600 6350 3600
Connection ~ 6350 3600
Wire Wire Line
	6700 2500 6350 2500
Connection ~ 6350 2500
Wire Wire Line
	4025 3800 3425 3800
Wire Wire Line
	3425 3800 3425 3725
Connection ~ 3425 3725
Wire Wire Line
	4025 4000 4025 3900
Wire Wire Line
	5825 4000 5825 3900
Wire Wire Line
	4925 4500 3425 4500
Wire Wire Line
	3425 4500 3425 3800
Connection ~ 3425 3800
Wire Wire Line
	4025 4000 4025 4575
Wire Wire Line
	4025 4575 5825 4575
Wire Wire Line
	5825 4575 5825 4000
Connection ~ 4025 4000
Connection ~ 5825 4000
$Comp
L power:+3.3V #PWR09
U 1 1 61335E87
P 6350 2250
F 0 "#PWR09" H 6350 2100 50  0001 C CNN
F 1 "+3.3V" H 6365 2423 50  0000 C CNN
F 2 "" H 6350 2250 50  0001 C CNN
F 3 "" H 6350 2250 50  0001 C CNN
	1    6350 2250
	1    0    0    -1  
$EndComp
$Comp
L power:+3.3V #PWR010
U 1 1 61336EA3
P 6350 3850
F 0 "#PWR010" H 6350 3700 50  0001 C CNN
F 1 "+3.3V" H 6365 4023 50  0000 C CNN
F 2 "" H 6350 3850 50  0001 C CNN
F 3 "" H 6350 3850 50  0001 C CNN
	1    6350 3850
	-1   0    0    1   
$EndComp
Wire Wire Line
	6350 3850 6350 3800
Connection ~ 6350 3800
Wire Wire Line
	6350 2250 6350 2300
Connection ~ 6350 2300
$Comp
L Device:R_Small R10
U 1 1 6133E7E8
P 7175 2575
F 0 "R10" H 7234 2621 50  0000 L CNN
F 1 "10k" H 7234 2530 50  0000 L CNN
F 2 "Resistor_SMD:R_0805_2012Metric_Pad1.20x1.40mm_HandSolder" H 7175 2575 50  0001 C CNN
F 3 "~" H 7175 2575 50  0001 C CNN
	1    7175 2575
	1    0    0    -1  
$EndComp
$Comp
L Device:C_Small C24
U 1 1 61345FEC
P 7175 2825
F 0 "C24" H 7267 2871 50  0000 L CNN
F 1 "0.01u" H 7267 2780 50  0000 L CNN
F 2 "Capacitor_SMD:C_0603_1608Metric_Pad1.08x0.95mm_HandSolder" H 7175 2825 50  0001 C CNN
F 3 "~" H 7175 2825 50  0001 C CNN
	1    7175 2825
	1    0    0    -1  
$EndComp
Wire Wire Line
	7175 2725 7175 2700
Wire Wire Line
	5825 2800 6950 2800
Wire Wire Line
	6950 2800 6950 2700
Wire Wire Line
	6950 2700 7175 2700
Connection ~ 7175 2700
Wire Wire Line
	7175 2700 7175 2675
$Comp
L power:+3.3V #PWR015
U 1 1 6134A6B7
P 7175 2400
F 0 "#PWR015" H 7175 2250 50  0001 C CNN
F 1 "+3.3V" H 7190 2573 50  0000 C CNN
F 2 "" H 7175 2400 50  0001 C CNN
F 3 "" H 7175 2400 50  0001 C CNN
	1    7175 2400
	1    0    0    -1  
$EndComp
$Comp
L power:GNDD #PWR016
U 1 1 6134C3CC
P 7175 2975
F 0 "#PWR016" H 7175 2725 50  0001 C CNN
F 1 "GNDD" H 7179 2820 50  0000 C CNN
F 2 "" H 7175 2975 50  0001 C CNN
F 3 "" H 7175 2975 50  0001 C CNN
	1    7175 2975
	1    0    0    -1  
$EndComp
Wire Wire Line
	7175 2975 7175 2925
Wire Wire Line
	7175 2475 7175 2400
$Comp
L Switch:SW_Push SW1
U 1 1 61351104
P 7625 2800
F 0 "SW1" V 7579 2948 50  0000 L CNN
F 1 "Reset" V 7670 2948 50  0000 L CNN
F 2 "Button_Switch_SMD:SW_Push_SPST_NO_Alps_SKRK" H 7625 3000 50  0001 C CNN
F 3 "~" H 7625 3000 50  0001 C CNN
	1    7625 2800
	0    1    1    0   
$EndComp
Wire Wire Line
	7625 2600 7375 2600
Wire Wire Line
	7375 2600 7375 2700
Wire Wire Line
	7375 2700 7175 2700
Wire Wire Line
	7625 3000 7375 3000
Wire Wire Line
	7375 3000 7375 2925
Wire Wire Line
	7375 2925 7175 2925
Connection ~ 7175 2925
$Comp
L Device:L_Core_Ferrite_Small L6
U 1 1 6135521F
P 7000 3500
F 0 "L6" V 6819 3500 50  0000 C CNN
F 1 "BEAD" V 6910 3500 50  0000 C CNN
F 2 "Inductor_THT:L_Axial_L5.0mm_D3.6mm_P10.00mm_Horizontal_Murata_BL01RN1A2A2" H 7000 3500 50  0001 C CNN
F 3 "~" H 7000 3500 50  0001 C CNN
	1    7000 3500
	0    1    1    0   
$EndComp
$Comp
L power:+3.3V #PWR017
U 1 1 61357422
P 7200 3500
F 0 "#PWR017" H 7200 3350 50  0001 C CNN
F 1 "+3.3V" H 7215 3673 50  0000 C CNN
F 2 "" H 7200 3500 50  0001 C CNN
F 3 "" H 7200 3500 50  0001 C CNN
	1    7200 3500
	0    1    1    0   
$EndComp
Wire Wire Line
	7200 3500 7100 3500
Wire Wire Line
	6900 3500 6350 3500
Connection ~ 6350 3500
$Comp
L power:GNDREF #PWR019
U 1 1 6136072F
P 7525 3300
F 0 "#PWR019" H 7525 3050 50  0001 C CNN
F 1 "GNDREF" H 7530 3127 50  0000 C CNN
F 2 "" H 7525 3300 50  0001 C CNN
F 3 "" H 7525 3300 50  0001 C CNN
	1    7525 3300
	1    0    0    -1  
$EndComp
Wire Wire Line
	7525 3300 6350 3300
Connection ~ 6350 3300
$Comp
L Device:L_Core_Ferrite_Small L7
U 1 1 6136427F
P 7800 3300
F 0 "L7" V 7619 3300 50  0000 C CNN
F 1 "BEAD" V 7710 3300 50  0000 C CNN
F 2 "Inductor_THT:L_Axial_L5.0mm_D3.6mm_P10.00mm_Horizontal_Murata_BL01RN1A2A2" H 7800 3300 50  0001 C CNN
F 3 "~" H 7800 3300 50  0001 C CNN
	1    7800 3300
	0    1    1    0   
$EndComp
Wire Wire Line
	8000 3300 7900 3300
Wire Wire Line
	7700 3300 7525 3300
Connection ~ 7525 3300
$Comp
L power:GNDD #PWR021
U 1 1 61368BC8
P 8000 3300
F 0 "#PWR021" H 8000 3050 50  0001 C CNN
F 1 "GNDD" H 8004 3145 50  0000 C CNN
F 2 "" H 8000 3300 50  0001 C CNN
F 3 "" H 8000 3300 50  0001 C CNN
	1    8000 3300
	1    0    0    -1  
$EndComp
Text Label 5825 3600 0    50   ~ 0
pwr
Wire Wire Line
	6950 2700 6950 2150
Wire Wire Line
	6950 2150 7150 2150
Wire Wire Line
	7150 2150 7150 1825
Connection ~ 6950 2700
Wire Wire Line
	5825 2700 6900 2700
Wire Wire Line
	6900 2700 6900 2100
Wire Wire Line
	6900 2100 7050 2100
Wire Wire Line
	7050 2100 7050 1825
Wire Wire Line
	5825 2600 6850 2600
Wire Wire Line
	6850 2600 6850 2050
Wire Wire Line
	6850 2050 6950 2050
Wire Wire Line
	6950 2050 6950 1825
Wire Wire Line
	5825 2500 6175 2500
Wire Wire Line
	6175 2500 6175 2550
Wire Wire Line
	6175 2550 6800 2550
Wire Wire Line
	6800 2550 6800 1950
Wire Wire Line
	6800 1950 6850 1950
Wire Wire Line
	6850 1950 6850 1825
$Comp
L power:GNDD #PWR012
U 1 1 61383072
P 6625 1825
F 0 "#PWR012" H 6625 1575 50  0001 C CNN
F 1 "GNDD" H 6629 1670 50  0000 C CNN
F 2 "" H 6625 1825 50  0001 C CNN
F 3 "" H 6625 1825 50  0001 C CNN
	1    6625 1825
	0    1    1    0   
$EndComp
Wire Wire Line
	6625 1825 6750 1825
$Comp
L Connector_Generic:Conn_01x07 J6
U 1 1 6139296E
P 7050 1625
F 0 "J6" V 7014 1237 50  0000 R CNN
F 1 "Conn_01x07" V 6923 1237 50  0000 R CNN
F 2 "Connector_PinHeader_2.54mm:PinHeader_1x07_P2.54mm_Vertical" H 7050 1625 50  0001 C CNN
F 3 "~" H 7050 1625 50  0001 C CNN
	1    7050 1625
	0    -1   -1   0   
$EndComp
Wire Wire Line
	7350 1825 7450 1825
Wire Wire Line
	7250 1825 7250 1950
$Comp
L power:+3.3V #PWR018
U 1 1 6139B8CB
P 7450 1825
F 0 "#PWR018" H 7450 1675 50  0001 C CNN
F 1 "+3.3V" H 7465 1998 50  0000 C CNN
F 2 "" H 7450 1825 50  0001 C CNN
F 3 "" H 7450 1825 50  0001 C CNN
	1    7450 1825
	0    1    1    0   
$EndComp
Text Label 7250 1950 0    50   ~ 0
pwr
$Comp
L power:GNDD #PWR022
U 1 1 6139FED0
P 8700 3125
F 0 "#PWR022" H 8700 2875 50  0001 C CNN
F 1 "GNDD" H 8704 2970 50  0000 C CNN
F 2 "" H 8700 3125 50  0001 C CNN
F 3 "" H 8700 3125 50  0001 C CNN
	1    8700 3125
	-1   0    0    1   
$EndComp
$Comp
L power:+3.3V #PWR023
U 1 1 613A371F
P 8725 3425
F 0 "#PWR023" H 8725 3275 50  0001 C CNN
F 1 "+3.3V" H 8740 3598 50  0000 C CNN
F 2 "" H 8725 3425 50  0001 C CNN
F 3 "" H 8725 3425 50  0001 C CNN
	1    8725 3425
	-1   0    0    1   
$EndComp
Wire Wire Line
	8725 3425 8725 3350
Wire Wire Line
	8725 3350 8775 3350
Wire Wire Line
	8775 3150 8700 3150
Wire Wire Line
	8700 3150 8700 3125
$Comp
L Connector_Generic:Conn_01x03 J7
U 1 1 613B7C6B
P 8975 3250
F 0 "J7" H 9055 3292 50  0000 L CNN
F 1 "freq" H 9055 3201 50  0000 L CNN
F 2 "Connector_PinHeader_2.54mm:PinHeader_1x03_P2.54mm_Vertical" H 8975 3250 50  0001 C CNN
F 3 "~" H 8975 3250 50  0001 C CNN
	1    8975 3250
	1    0    0    -1  
$EndComp
Wire Wire Line
	5825 3200 8475 3200
Wire Wire Line
	8475 3200 8475 3250
Wire Wire Line
	8475 3250 8775 3250
$Comp
L Device:R_Small R9
U 1 1 613C1940
P 6825 4200
F 0 "R9" H 6884 4246 50  0000 L CNN
F 1 "2.2k" H 6884 4155 50  0000 L CNN
F 2 "Resistor_SMD:R_0805_2012Metric_Pad1.20x1.40mm_HandSolder" H 6825 4200 50  0001 C CNN
F 3 "~" H 6825 4200 50  0001 C CNN
	1    6825 4200
	1    0    0    -1  
$EndComp
$Comp
L Device:C_Small C23
U 1 1 613C2495
P 6825 4500
F 0 "C23" H 6917 4546 50  0000 L CNN
F 1 "4.7n" H 6917 4455 50  0000 L CNN
F 2 "Capacitor_SMD:C_0603_1608Metric_Pad1.08x0.95mm_HandSolder" H 6825 4500 50  0001 C CNN
F 3 "~" H 6825 4500 50  0001 C CNN
	1    6825 4500
	1    0    0    -1  
$EndComp
$Comp
L Device:C_Small C25
U 1 1 613C3A96
P 7275 4500
F 0 "C25" H 7367 4546 50  0000 L CNN
F 1 "100p" H 7367 4455 50  0000 L CNN
F 2 "Capacitor_SMD:C_0603_1608Metric_Pad1.08x0.95mm_HandSolder" H 7275 4500 50  0001 C CNN
F 3 "~" H 7275 4500 50  0001 C CNN
	1    7275 4500
	1    0    0    -1  
$EndComp
$Comp
L Device:C_Small C26
U 1 1 613C6C46
P 7650 4300
F 0 "C26" H 7742 4346 50  0000 L CNN
F 1 "680p" H 7742 4255 50  0000 L CNN
F 2 "Capacitor_SMD:C_0603_1608Metric_Pad1.08x0.95mm_HandSolder" H 7650 4300 50  0001 C CNN
F 3 "~" H 7650 4300 50  0001 C CNN
	1    7650 4300
	1    0    0    -1  
$EndComp
$Comp
L Device:L_Core_Ferrite_Small L5
U 1 1 613CC395
P 6575 4675
F 0 "L5" V 6394 4675 50  0000 C CNN
F 1 "BEAD" V 6485 4675 50  0000 C CNN
F 2 "Inductor_THT:L_Axial_L5.0mm_D3.6mm_P10.00mm_Horizontal_Murata_BL01RN1A2A2" H 6575 4675 50  0001 C CNN
F 3 "~" H 6575 4675 50  0001 C CNN
	1    6575 4675
	0    -1   1    0   
$EndComp
Wire Wire Line
	6375 4675 6475 4675
$Comp
L power:GNDD #PWR011
U 1 1 613CC39C
P 6375 4675
F 0 "#PWR011" H 6375 4425 50  0001 C CNN
F 1 "GNDD" H 6379 4520 50  0000 C CNN
F 2 "" H 6375 4675 50  0001 C CNN
F 3 "" H 6375 4675 50  0001 C CNN
	1    6375 4675
	-1   0    0    -1  
$EndComp
Wire Wire Line
	6675 4675 6825 4675
Wire Wire Line
	7650 4675 7650 4400
Wire Wire Line
	7275 4600 7275 4675
Connection ~ 7275 4675
Wire Wire Line
	7275 4675 7650 4675
Wire Wire Line
	6825 4600 6825 4675
Connection ~ 6825 4675
Wire Wire Line
	6825 4675 7275 4675
Wire Wire Line
	6825 4300 6825 4350
Wire Wire Line
	7275 4400 7275 4350
Wire Wire Line
	7275 4350 6825 4350
Connection ~ 6825 4350
Wire Wire Line
	6825 4350 6825 4400
Wire Wire Line
	7650 4200 7650 4050
Wire Wire Line
	7650 4050 6825 4050
Wire Wire Line
	6825 4050 6825 4100
$Comp
L power:GNDREF #PWR020
U 1 1 613F2B0B
P 7650 4700
F 0 "#PWR020" H 7650 4450 50  0001 C CNN
F 1 "GNDREF" H 7655 4527 50  0000 C CNN
F 2 "" H 7650 4700 50  0001 C CNN
F 3 "" H 7650 4700 50  0001 C CNN
	1    7650 4700
	1    0    0    -1  
$EndComp
Wire Wire Line
	7650 4700 7650 4675
Connection ~ 7650 4675
Wire Wire Line
	5825 3400 6175 3400
Wire Wire Line
	6175 3400 6175 3550
Wire Wire Line
	6175 3550 6825 3550
Wire Wire Line
	6825 3550 6825 4050
Connection ~ 6825 4050
$Comp
L Device:R_Small R6
U 1 1 6141C2C0
P 2900 1950
F 0 "R6" H 2959 1996 50  0000 L CNN
F 1 "22E" H 2959 1905 50  0000 L CNN
F 2 "Resistor_SMD:R_1206_3216Metric_Pad1.30x1.75mm_HandSolder" H 2900 1950 50  0001 C CNN
F 3 "~" H 2900 1950 50  0001 C CNN
	1    2900 1950
	-1   0    0    1   
$EndComp
$Comp
L Device:R_Small R4
U 1 1 6141CDF1
P 2450 1600
F 0 "R4" H 2509 1646 50  0000 L CNN
F 1 "6.2E" H 2509 1555 50  0000 L CNN
F 2 "Resistor_SMD:R_1206_3216Metric_Pad1.30x1.75mm_HandSolder" H 2450 1600 50  0001 C CNN
F 3 "~" H 2450 1600 50  0001 C CNN
	1    2450 1600
	-1   0    0    1   
$EndComp
$Comp
L Device:R_Small R3
U 1 1 61420CAF
P 2450 1275
F 0 "R3" H 2509 1321 50  0000 L CNN
F 1 "6.2E" H 2509 1230 50  0000 L CNN
F 2 "Resistor_SMD:R_1206_3216Metric_Pad1.30x1.75mm_HandSolder" H 2450 1275 50  0001 C CNN
F 3 "~" H 2450 1275 50  0001 C CNN
	1    2450 1275
	-1   0    0    1   
$EndComp
$Comp
L Device:C_Small C12
U 1 1 61424DD4
P 2900 1425
F 0 "C12" H 2992 1471 50  0000 L CNN
F 1 "330p" H 2992 1380 50  0000 L CNN
F 2 "Capacitor_THT:C_Rect_L7.2mm_W4.5mm_P5.00mm_FKS2_FKP2_MKS2_MKP2" H 2900 1425 50  0001 C CNN
F 3 "~" H 2900 1425 50  0001 C CNN
	1    2900 1425
	-1   0    0    1   
$EndComp
$Comp
L Device:C_Small C6
U 1 1 61425898
P 2075 1600
F 0 "C6" H 2167 1646 50  0000 L CNN
F 1 "0.1u" H 2167 1555 50  0000 L CNN
F 2 "Capacitor_THT:C_Rect_L7.2mm_W4.5mm_P5.00mm_FKS2_FKP2_MKS2_MKP2" H 2075 1600 50  0001 C CNN
F 3 "~" H 2075 1600 50  0001 C CNN
	1    2075 1600
	-1   0    0    1   
$EndComp
$Comp
L Device:C_Small C5
U 1 1 61429985
P 2075 1275
F 0 "C5" H 2167 1321 50  0000 L CNN
F 1 "0.1u" H 2167 1230 50  0000 L CNN
F 2 "Capacitor_THT:C_Rect_L7.2mm_W4.5mm_P5.00mm_FKS2_FKP2_MKS2_MKP2" H 2075 1275 50  0001 C CNN
F 3 "~" H 2075 1275 50  0001 C CNN
	1    2075 1275
	-1   0    0    1   
$EndComp
$Comp
L Device:C_Small C9
U 1 1 6142D871
P 2450 1000
F 0 "C9" H 2542 1046 50  0000 L CNN
F 1 "0.1u" H 2542 955 50  0000 L CNN
F 2 "Capacitor_THT:C_Rect_L7.2mm_W4.5mm_P5.00mm_FKS2_FKP2_MKS2_MKP2" H 2450 1000 50  0001 C CNN
F 3 "~" H 2450 1000 50  0001 C CNN
	1    2450 1000
	-1   0    0    1   
$EndComp
$Comp
L Device:C_Small C10
U 1 1 61431840
P 2450 1875
F 0 "C10" H 2542 1921 50  0000 L CNN
F 1 "0.1u" H 2542 1830 50  0000 L CNN
F 2 "Capacitor_THT:C_Rect_L7.2mm_W4.5mm_P5.00mm_FKS2_FKP2_MKS2_MKP2" H 2450 1875 50  0001 C CNN
F 3 "~" H 2450 1875 50  0001 C CNN
	1    2450 1875
	-1   0    0    1   
$EndComp
$Comp
L Device:C_Small C2
U 1 1 61435847
P 1600 1425
F 0 "C2" H 1692 1471 50  0000 L CNN
F 1 "0.47u" H 1692 1380 50  0000 L CNN
F 2 "Capacitor_THT:C_Rect_L7.2mm_W4.5mm_P5.00mm_FKS2_FKP2_MKS2_MKP2" H 1600 1425 50  0001 C CNN
F 3 "~" H 1600 1425 50  0001 C CNN
	1    1600 1425
	-1   0    0    1   
$EndComp
$Comp
L Device:L_Core_Iron_Small L4
U 1 1 614399F4
P 2650 2100
F 0 "L4" V 2855 2100 50  0000 C CNN
F 1 "22uH" V 2764 2100 50  0000 C CNN
F 2 "Inductor_SMD:L_12x12mm_H4.5mm" H 2650 2100 50  0001 C CNN
F 3 "~" H 2650 2100 50  0001 C CNN
	1    2650 2100
	0    1    1    0   
$EndComp
$Comp
L Device:L_Core_Iron_Small L3
U 1 1 6143CE75
P 2650 850
F 0 "L3" V 2855 850 50  0000 C CNN
F 1 "22uH" V 2764 850 50  0000 C CNN
F 2 "Inductor_SMD:L_12x12mm_H4.5mm" H 2650 850 50  0001 C CNN
F 3 "~" H 2650 850 50  0001 C CNN
	1    2650 850 
	0    -1   -1   0   
$EndComp
$Comp
L Connector:Screw_Terminal_01x02 J2
U 1 1 614419FC
P 1000 1500
F 0 "J2" H 918 1175 50  0000 C CNN
F 1 "right" H 918 1266 50  0000 C CNN
F 2 "TerminalBlock_MetzConnect:TerminalBlock_MetzConnect_Type073_RT02602HBLU_1x02_P5.08mm_Horizontal" H 1000 1500 50  0001 C CNN
F 3 "~" H 1000 1500 50  0001 C CNN
	1    1000 1500
	-1   0    0    1   
$EndComp
Wire Wire Line
	1200 1500 1200 2100
Wire Wire Line
	1200 2100 1600 2100
Wire Wire Line
	1600 1525 1600 2100
Connection ~ 1600 2100
Wire Wire Line
	1600 2100 2450 2100
Wire Wire Line
	2450 1700 2450 1750
Wire Wire Line
	2450 1975 2450 2100
Connection ~ 2450 2100
Wire Wire Line
	2450 2100 2550 2100
Wire Wire Line
	2075 1700 2075 1750
Wire Wire Line
	2075 1750 2450 1750
Connection ~ 2450 1750
Wire Wire Line
	2450 1750 2450 1775
Wire Wire Line
	2450 1375 2450 1450
Wire Wire Line
	2075 1375 2075 1450
Wire Wire Line
	2075 1450 2450 1450
Connection ~ 2075 1450
Wire Wire Line
	2075 1450 2075 1500
Connection ~ 2450 1450
Wire Wire Line
	2450 1450 2450 1500
Wire Wire Line
	2450 1175 2450 1150
Wire Wire Line
	2550 850  2450 850 
Wire Wire Line
	1200 850  1200 1400
Wire Wire Line
	1600 1325 1600 850 
Connection ~ 1600 850 
Wire Wire Line
	1600 850  1200 850 
Wire Wire Line
	2450 900  2450 850 
Connection ~ 2450 850 
Wire Wire Line
	2450 850  1600 850 
Wire Wire Line
	2075 1175 2075 1150
Wire Wire Line
	2075 1150 2450 1150
Connection ~ 2450 1150
Wire Wire Line
	2450 1150 2450 1100
Wire Wire Line
	2750 2100 2900 2100
Wire Wire Line
	2900 2100 2900 2050
Wire Wire Line
	2900 850  2900 1325
Wire Wire Line
	2900 1525 2900 1850
$Comp
L power:Earth #PWR02
U 1 1 614A7281
P 2500 1450
F 0 "#PWR02" H 2500 1200 50  0001 C CNN
F 1 "Earth" H 2500 1300 50  0001 C CNN
F 2 "" H 2500 1450 50  0001 C CNN
F 3 "~" H 2500 1450 50  0001 C CNN
	1    2500 1450
	0    -1   -1   0   
$EndComp
Wire Wire Line
	2500 1450 2450 1450
Wire Wire Line
	2750 850  2900 850 
$Comp
L Device:R_Small R5
U 1 1 614D95E8
P 2875 5375
F 0 "R5" H 2934 5421 50  0000 L CNN
F 1 "22E" H 2934 5330 50  0000 L CNN
F 2 "Resistor_SMD:R_1206_3216Metric_Pad1.30x1.75mm_HandSolder" H 2875 5375 50  0001 C CNN
F 3 "~" H 2875 5375 50  0001 C CNN
	1    2875 5375
	-1   0    0    1   
$EndComp
$Comp
L Device:R_Small R2
U 1 1 614D95EE
P 2425 5025
F 0 "R2" H 2484 5071 50  0000 L CNN
F 1 "6.2E" H 2484 4980 50  0000 L CNN
F 2 "Resistor_SMD:R_1206_3216Metric_Pad1.30x1.75mm_HandSolder" H 2425 5025 50  0001 C CNN
F 3 "~" H 2425 5025 50  0001 C CNN
	1    2425 5025
	-1   0    0    1   
$EndComp
$Comp
L Device:R_Small R1
U 1 1 614D95F4
P 2425 4700
F 0 "R1" H 2484 4746 50  0000 L CNN
F 1 "6.2E" H 2484 4655 50  0000 L CNN
F 2 "Resistor_SMD:R_1206_3216Metric_Pad1.30x1.75mm_HandSolder" H 2425 4700 50  0001 C CNN
F 3 "~" H 2425 4700 50  0001 C CNN
	1    2425 4700
	-1   0    0    1   
$EndComp
$Comp
L Device:C_Small C11
U 1 1 614D95FA
P 2875 4850
F 0 "C11" H 2967 4896 50  0000 L CNN
F 1 "330p" H 2967 4805 50  0000 L CNN
F 2 "Capacitor_THT:C_Rect_L7.2mm_W4.5mm_P5.00mm_FKS2_FKP2_MKS2_MKP2" H 2875 4850 50  0001 C CNN
F 3 "~" H 2875 4850 50  0001 C CNN
	1    2875 4850
	-1   0    0    1   
$EndComp
$Comp
L Device:C_Small C4
U 1 1 614D9600
P 2050 5025
F 0 "C4" H 2142 5071 50  0000 L CNN
F 1 "0.1u" H 2142 4980 50  0000 L CNN
F 2 "Capacitor_THT:C_Rect_L7.2mm_W4.5mm_P5.00mm_FKS2_FKP2_MKS2_MKP2" H 2050 5025 50  0001 C CNN
F 3 "~" H 2050 5025 50  0001 C CNN
	1    2050 5025
	-1   0    0    1   
$EndComp
$Comp
L Device:C_Small C3
U 1 1 614D9606
P 2050 4700
F 0 "C3" H 2142 4746 50  0000 L CNN
F 1 "0.1u" H 2142 4655 50  0000 L CNN
F 2 "Capacitor_THT:C_Rect_L7.2mm_W4.5mm_P5.00mm_FKS2_FKP2_MKS2_MKP2" H 2050 4700 50  0001 C CNN
F 3 "~" H 2050 4700 50  0001 C CNN
	1    2050 4700
	-1   0    0    1   
$EndComp
$Comp
L Device:C_Small C7
U 1 1 614D960C
P 2425 4425
F 0 "C7" H 2517 4471 50  0000 L CNN
F 1 "0.1u" H 2517 4380 50  0000 L CNN
F 2 "Capacitor_THT:C_Rect_L7.2mm_W4.5mm_P5.00mm_FKS2_FKP2_MKS2_MKP2" H 2425 4425 50  0001 C CNN
F 3 "~" H 2425 4425 50  0001 C CNN
	1    2425 4425
	-1   0    0    1   
$EndComp
$Comp
L Device:C_Small C8
U 1 1 614D9612
P 2425 5300
F 0 "C8" H 2517 5346 50  0000 L CNN
F 1 "0.1u" H 2517 5255 50  0000 L CNN
F 2 "Capacitor_THT:C_Rect_L7.2mm_W4.5mm_P5.00mm_FKS2_FKP2_MKS2_MKP2" H 2425 5300 50  0001 C CNN
F 3 "~" H 2425 5300 50  0001 C CNN
	1    2425 5300
	-1   0    0    1   
$EndComp
$Comp
L Device:C_Small C1
U 1 1 614D9618
P 1575 4850
F 0 "C1" H 1667 4896 50  0000 L CNN
F 1 "0.47u" H 1667 4805 50  0000 L CNN
F 2 "Capacitor_THT:C_Rect_L7.2mm_W4.5mm_P5.00mm_FKS2_FKP2_MKS2_MKP2" H 1575 4850 50  0001 C CNN
F 3 "~" H 1575 4850 50  0001 C CNN
	1    1575 4850
	-1   0    0    1   
$EndComp
$Comp
L Device:L_Core_Iron_Small L2
U 1 1 614D961E
P 2625 5525
F 0 "L2" V 2830 5525 50  0000 C CNN
F 1 "22uH" V 2739 5525 50  0000 C CNN
F 2 "Inductor_SMD:L_12x12mm_H4.5mm" H 2625 5525 50  0001 C CNN
F 3 "~" H 2625 5525 50  0001 C CNN
	1    2625 5525
	0    1    1    0   
$EndComp
$Comp
L Device:L_Core_Iron_Small L1
U 1 1 614D9624
P 2625 4275
F 0 "L1" V 2830 4275 50  0000 C CNN
F 1 "22uH" V 2739 4275 50  0000 C CNN
F 2 "Inductor_SMD:L_12x12mm_H4.5mm" H 2625 4275 50  0001 C CNN
F 3 "~" H 2625 4275 50  0001 C CNN
	1    2625 4275
	0    -1   -1   0   
$EndComp
Wire Wire Line
	1175 4925 1175 5525
Wire Wire Line
	1175 5525 1575 5525
Wire Wire Line
	1575 4950 1575 5525
Connection ~ 1575 5525
Wire Wire Line
	1575 5525 2425 5525
Wire Wire Line
	2425 5125 2425 5175
Wire Wire Line
	2425 5400 2425 5525
Connection ~ 2425 5525
Wire Wire Line
	2425 5525 2525 5525
Wire Wire Line
	2050 5125 2050 5175
Wire Wire Line
	2050 5175 2425 5175
Connection ~ 2425 5175
Wire Wire Line
	2425 5175 2425 5200
Wire Wire Line
	2425 4800 2425 4875
Wire Wire Line
	2050 4800 2050 4875
Wire Wire Line
	2050 4875 2425 4875
Connection ~ 2050 4875
Wire Wire Line
	2050 4875 2050 4925
Connection ~ 2425 4875
Wire Wire Line
	2425 4875 2425 4925
Wire Wire Line
	2425 4600 2425 4575
Wire Wire Line
	2525 4275 2425 4275
Wire Wire Line
	1175 4275 1175 4825
Wire Wire Line
	1575 4750 1575 4275
Connection ~ 1575 4275
Wire Wire Line
	1575 4275 1175 4275
Wire Wire Line
	2425 4325 2425 4275
Connection ~ 2425 4275
Wire Wire Line
	2425 4275 1575 4275
Wire Wire Line
	2050 4600 2050 4575
Wire Wire Line
	2050 4575 2425 4575
Connection ~ 2425 4575
Wire Wire Line
	2425 4575 2425 4525
Wire Wire Line
	2725 5525 2875 5525
Wire Wire Line
	2875 5525 2875 5475
Wire Wire Line
	2875 4275 2875 4750
Wire Wire Line
	2875 4950 2875 5275
$Comp
L power:Earth #PWR01
U 1 1 614D9655
P 2475 4875
F 0 "#PWR01" H 2475 4625 50  0001 C CNN
F 1 "Earth" H 2475 4725 50  0001 C CNN
F 2 "" H 2475 4875 50  0001 C CNN
F 3 "~" H 2475 4875 50  0001 C CNN
	1    2475 4875
	0    -1   -1   0   
$EndComp
Wire Wire Line
	2475 4875 2425 4875
Wire Wire Line
	2725 4275 2875 4275
Wire Wire Line
	4025 3500 3575 3500
Wire Wire Line
	3575 3500 3575 5525
Wire Wire Line
	3575 5525 2875 5525
Connection ~ 2875 5525
Wire Wire Line
	4025 3200 3725 3200
Wire Wire Line
	3725 3200 3725 3450
Wire Wire Line
	3725 3450 3500 3450
Wire Wire Line
	3500 3450 3500 4275
Wire Wire Line
	3500 4275 2875 4275
Connection ~ 2875 4275
Wire Wire Line
	4025 3100 3700 3100
Wire Wire Line
	3700 3100 3700 2850
Wire Wire Line
	3700 2850 3475 2850
Wire Wire Line
	3475 2850 3475 2100
Wire Wire Line
	3475 2100 2900 2100
Connection ~ 2900 2100
Wire Wire Line
	4025 2800 3550 2800
Wire Wire Line
	3550 2800 3550 850 
Wire Wire Line
	3550 850  2900 850 
Connection ~ 2900 850 
$Comp
L Connector:Screw_Terminal_01x02 J3
U 1 1 61563596
P 2775 3325
F 0 "J3" H 2693 3000 50  0000 C CNN
F 1 "POWER" H 2693 3091 50  0000 C CNN
F 2 "TerminalBlock_MetzConnect:TerminalBlock_MetzConnect_Type073_RT02602HBLU_1x02_P5.08mm_Horizontal" H 2775 3325 50  0001 C CNN
F 3 "~" H 2775 3325 50  0001 C CNN
	1    2775 3325
	-1   0    0    1   
$EndComp
Wire Wire Line
	2975 3225 3625 3225
Connection ~ 3625 3225
Wire Wire Line
	3625 3225 3625 3300
Wire Wire Line
	3200 3600 3200 3300
Wire Wire Line
	3200 3300 2975 3300
Wire Wire Line
	2975 3300 2975 3325
$Comp
L Connector:Screw_Terminal_01x02 J1
U 1 1 615A6BE7
P 975 4925
F 0 "J1" H 893 4600 50  0000 C CNN
F 1 "left" H 893 4691 50  0000 C CNN
F 2 "TerminalBlock_MetzConnect:TerminalBlock_MetzConnect_Type073_RT02602HBLU_1x02_P5.08mm_Horizontal" H 975 4925 50  0001 C CNN
F 3 "~" H 975 4925 50  0001 C CNN
	1    975  4925
	-1   0    0    1   
$EndComp
$Comp
L Connector_Generic:Conn_02x20_Odd_Even J4
U 1 1 615DFAD8
P 5050 6275
F 0 "J4" H 5100 7392 50  0000 C CNN
F 1 "RPI" H 5100 7301 50  0000 C CNN
F 2 "Connector_Samtec_HLE_THT:Samtec_HLE-120-02-xx-DV-TE_2x20_P2.54mm_Horizontal" H 5050 6275 50  0001 C CNN
F 3 "~" H 5050 6275 50  0001 C CNN
	1    5050 6275
	1    0    0    -1  
$EndComp
$Comp
L power:+3.3V #PWR06
U 1 1 615E849B
P 4700 5375
F 0 "#PWR06" H 4700 5225 50  0001 C CNN
F 1 "+3.3V" H 4715 5548 50  0000 C CNN
F 2 "" H 4700 5375 50  0001 C CNN
F 3 "" H 4700 5375 50  0001 C CNN
	1    4700 5375
	0    -1   -1   0   
$EndComp
$Comp
L power:+3.3V #PWR07
U 1 1 6160AC13
P 4700 6175
F 0 "#PWR07" H 4700 6025 50  0001 C CNN
F 1 "+3.3V" H 4715 6348 50  0000 C CNN
F 2 "" H 4700 6175 50  0001 C CNN
F 3 "" H 4700 6175 50  0001 C CNN
	1    4700 6175
	0    -1   -1   0   
$EndComp
Wire Wire Line
	4700 6175 4850 6175
Wire Wire Line
	4700 5375 4850 5375
Wire Wire Line
	4850 5775 4750 5775
Wire Wire Line
	4750 5775 4750 6575
Wire Wire Line
	4750 6575 4850 6575
Wire Wire Line
	4750 6575 4750 7275
Wire Wire Line
	4750 7275 4850 7275
Connection ~ 4750 6575
Wire Wire Line
	5350 5975 5525 5975
Wire Wire Line
	5525 5975 5525 6275
Wire Wire Line
	5525 6775 5350 6775
Wire Wire Line
	5350 6275 5525 6275
Connection ~ 5525 6275
Wire Wire Line
	5525 6275 5525 6775
$Comp
L Connector:Screw_Terminal_01x02 J5
U 1 1 616757B6
P 5675 5575
F 0 "J5" H 5593 5250 50  0000 C CNN
F 1 "5V" H 5593 5341 50  0000 C CNN
F 2 "TerminalBlock_MetzConnect:TerminalBlock_MetzConnect_Type073_RT02602HBLU_1x02_P5.08mm_Horizontal" H 5675 5575 50  0001 C CNN
F 3 "~" H 5675 5575 50  0001 C CNN
	1    5675 5575
	1    0    0    1   
$EndComp
Wire Wire Line
	5350 5575 5475 5575
Wire Wire Line
	5475 5475 5350 5475
Wire Wire Line
	5350 5475 5350 5375
Connection ~ 5350 5475
$Comp
L power:GNDD #PWR08
U 1 1 616EA64E
P 5625 6275
F 0 "#PWR08" H 5625 6025 50  0001 C CNN
F 1 "GNDD" H 5629 6120 50  0000 C CNN
F 2 "" H 5625 6275 50  0001 C CNN
F 3 "" H 5625 6275 50  0001 C CNN
	1    5625 6275
	0    -1   1    0   
$EndComp
$Comp
L power:GNDD #PWR05
U 1 1 6170B3C0
P 4650 6575
F 0 "#PWR05" H 4650 6325 50  0001 C CNN
F 1 "GNDD" H 4654 6420 50  0000 C CNN
F 2 "" H 4650 6575 50  0001 C CNN
F 3 "" H 4650 6575 50  0001 C CNN
	1    4650 6575
	0    1    -1   0   
$EndComp
Wire Wire Line
	4650 6575 4750 6575
Wire Wire Line
	5625 6275 5525 6275
Wire Wire Line
	4850 7075 4475 7075
Text Label 4475 7075 0    50   ~ 0
LRCK
Wire Wire Line
	5350 7275 5600 7275
Text Label 5600 7275 0    50   ~ 0
DATA
Wire Wire Line
	5350 5875 5700 5875
Text Label 5700 5875 0    50   ~ 0
BCK
Wire Wire Line
	5825 2900 6125 2900
Wire Wire Line
	5825 3000 6125 3000
Wire Wire Line
	5825 3100 6125 3100
Text Label 6125 2900 0    50   ~ 0
DATA
Text Label 6125 3000 0    50   ~ 0
LRCK
Text Label 6125 3100 0    50   ~ 0
BCK
$EndSCHEMATC
