PCBNEW-LibModule-V1  2021-09-02 19:38:47
# encoding utf-8
Units mm
$INDEX
SOP50P1030X247-37N
$EndINDEX
$MODULE SOP50P1030X247-37N
Po 0 0 0 15 61311a37 00000000 ~~
Li SOP50P1030X247-37N
Cd PowerSSO-36 EPD-ren1
Kw Integrated Circuit
Sc 0
At SMD
AR 
Op 0 0 0
T0 0 0 1.27 1.27 0 0.254 N V 21 N "IC**"
T1 0 0 1.27 1.27 0 0.254 N I 21 N "SOP50P1030X247-37N"
DS -5.875 -5.5 5.875 -5.5 0.05 24
DS 5.875 -5.5 5.875 5.5 0.05 24
DS 5.875 5.5 -5.875 5.5 0.05 24
DS -5.875 5.5 -5.875 -5.5 0.05 24
DS -3.75 -5.15 3.75 -5.15 0.1 24
DS 3.75 -5.15 3.75 5.15 0.1 24
DS 3.75 5.15 -3.75 5.15 0.1 24
DS -3.75 5.15 -3.75 -5.15 0.1 24
DS -3.75 -4.65 -3.25 -5.15 0.1 24
DS -5.625 -4.75 -3.825 -4.75 0.2 21
$PAD
Po -4.725 -4.25
Sh "1" R 0.3 1.8 0 0 900
At SMD N 00888000
Ne 0 ""
$EndPAD
$PAD
Po -4.725 -3.75
Sh "2" R 0.3 1.8 0 0 900
At SMD N 00888000
Ne 0 ""
$EndPAD
$PAD
Po -4.725 -3.25
Sh "3" R 0.3 1.8 0 0 900
At SMD N 00888000
Ne 0 ""
$EndPAD
$PAD
Po -4.725 -2.75
Sh "4" R 0.3 1.8 0 0 900
At SMD N 00888000
Ne 0 ""
$EndPAD
$PAD
Po -4.725 -2.25
Sh "5" R 0.3 1.8 0 0 900
At SMD N 00888000
Ne 0 ""
$EndPAD
$PAD
Po -4.725 -1.75
Sh "6" R 0.3 1.8 0 0 900
At SMD N 00888000
Ne 0 ""
$EndPAD
$PAD
Po -4.725 -1.25
Sh "7" R 0.3 1.8 0 0 900
At SMD N 00888000
Ne 0 ""
$EndPAD
$PAD
Po -4.725 -0.75
Sh "8" R 0.3 1.8 0 0 900
At SMD N 00888000
Ne 0 ""
$EndPAD
$PAD
Po -4.725 -0.25
Sh "9" R 0.3 1.8 0 0 900
At SMD N 00888000
Ne 0 ""
$EndPAD
$PAD
Po -4.725 0.25
Sh "10" R 0.3 1.8 0 0 900
At SMD N 00888000
Ne 0 ""
$EndPAD
$PAD
Po -4.725 0.75
Sh "11" R 0.3 1.8 0 0 900
At SMD N 00888000
Ne 0 ""
$EndPAD
$PAD
Po -4.725 1.25
Sh "12" R 0.3 1.8 0 0 900
At SMD N 00888000
Ne 0 ""
$EndPAD
$PAD
Po -4.725 1.75
Sh "13" R 0.3 1.8 0 0 900
At SMD N 00888000
Ne 0 ""
$EndPAD
$PAD
Po -4.725 2.25
Sh "14" R 0.3 1.8 0 0 900
At SMD N 00888000
Ne 0 ""
$EndPAD
$PAD
Po -4.725 2.75
Sh "15" R 0.3 1.8 0 0 900
At SMD N 00888000
Ne 0 ""
$EndPAD
$PAD
Po -4.725 3.25
Sh "16" R 0.3 1.8 0 0 900
At SMD N 00888000
Ne 0 ""
$EndPAD
$PAD
Po -4.725 3.75
Sh "17" R 0.3 1.8 0 0 900
At SMD N 00888000
Ne 0 ""
$EndPAD
$PAD
Po -4.725 4.25
Sh "18" R 0.3 1.8 0 0 900
At SMD N 00888000
Ne 0 ""
$EndPAD
$PAD
Po 4.725 4.25
Sh "19" R 0.3 1.8 0 0 900
At SMD N 00888000
Ne 0 ""
$EndPAD
$PAD
Po 4.725 3.75
Sh "20" R 0.3 1.8 0 0 900
At SMD N 00888000
Ne 0 ""
$EndPAD
$PAD
Po 4.725 3.25
Sh "21" R 0.3 1.8 0 0 900
At SMD N 00888000
Ne 0 ""
$EndPAD
$PAD
Po 4.725 2.75
Sh "22" R 0.3 1.8 0 0 900
At SMD N 00888000
Ne 0 ""
$EndPAD
$PAD
Po 4.725 2.25
Sh "23" R 0.3 1.8 0 0 900
At SMD N 00888000
Ne 0 ""
$EndPAD
$PAD
Po 4.725 1.75
Sh "24" R 0.3 1.8 0 0 900
At SMD N 00888000
Ne 0 ""
$EndPAD
$PAD
Po 4.725 1.25
Sh "25" R 0.3 1.8 0 0 900
At SMD N 00888000
Ne 0 ""
$EndPAD
$PAD
Po 4.725 0.75
Sh "26" R 0.3 1.8 0 0 900
At SMD N 00888000
Ne 0 ""
$EndPAD
$PAD
Po 4.725 0.25
Sh "27" R 0.3 1.8 0 0 900
At SMD N 00888000
Ne 0 ""
$EndPAD
$PAD
Po 4.725 -0.25
Sh "28" R 0.3 1.8 0 0 900
At SMD N 00888000
Ne 0 ""
$EndPAD
$PAD
Po 4.725 -0.75
Sh "29" R 0.3 1.8 0 0 900
At SMD N 00888000
Ne 0 ""
$EndPAD
$PAD
Po 4.725 -1.25
Sh "30" R 0.3 1.8 0 0 900
At SMD N 00888000
Ne 0 ""
$EndPAD
$PAD
Po 4.725 -1.75
Sh "31" R 0.3 1.8 0 0 900
At SMD N 00888000
Ne 0 ""
$EndPAD
$PAD
Po 4.725 -2.25
Sh "32" R 0.3 1.8 0 0 900
At SMD N 00888000
Ne 0 ""
$EndPAD
$PAD
Po 4.725 -2.75
Sh "33" R 0.3 1.8 0 0 900
At SMD N 00888000
Ne 0 ""
$EndPAD
$PAD
Po 4.725 -3.25
Sh "34" R 0.3 1.8 0 0 900
At SMD N 00888000
Ne 0 ""
$EndPAD
$PAD
Po 4.725 -3.75
Sh "35" R 0.3 1.8 0 0 900
At SMD N 00888000
Ne 0 ""
$EndPAD
$PAD
Po 4.725 -4.25
Sh "36" R 0.3 1.8 0 0 900
At SMD N 00888000
Ne 0 ""
$EndPAD
$PAD
Po 0 0
Sh "37" R 4.7 7.1 0 0 0
At SMD N 00888000
Ne 0 ""
$EndPAD
$EndMODULE SOP50P1030X247-37N
$EndLIBRARY
