module gobn.github.io/rdf4go

go 1.16

require (
	github.com/antlr/antlr4 v0.0.0-20210427155808-62554204404f
	github.com/joho/godotenv v1.3.0
	github.com/sirupsen/logrus v1.8.1
	github.com/spf13/cobra v1.1.3
	github.com/spf13/viper v1.7.0
	github.com/stretchr/testify v1.7.0
	gopkg.in/yaml.v2 v2.4.0
	modernc.org/mathutil v1.2.2
)
