module gitlab.com/atyos/public/aws-config-ecs-check-image-signature

go 1.17

require (
	github.com/aws/aws-lambda-go v1.28.0
	github.com/awslabs/amazon-ecr-credential-helper/ecr-login v0.0.0-20220216180153-3d7835abdf40
	github.com/google/go-containerregistry v0.8.1-0.20220209165246-a44adc326839
	github.com/sigstore/cosign v1.6.0
)

require (
	cloud.google.com/go v0.100.2 // indirect
	cloud.google.com/go/compute v1.3.0 // indirect
	cloud.google.com/go/iam v0.1.1 // indirect
	cloud.google.com/go/kms v1.3.0 // indirect
	cloud.google.com/go/storage v1.21.0 // indirect
	github.com/Azure/azure-sdk-for-go v61.5.0+incompatible // indirect
	github.com/Azure/go-autorest v14.2.0+incompatible // indirect
	github.com/Azure/go-autorest/autorest v0.11.24 // indirect
	github.com/Azure/go-autorest/autorest/adal v0.9.18 // indirect
	github.com/Azure/go-autorest/autorest/azure/auth v0.5.11 // indirect
	github.com/Azure/go-autorest/autorest/azure/cli v0.4.5 // indirect
	github.com/Azure/go-autorest/autorest/date v0.3.0 // indirect
	github.com/Azure/go-autorest/autorest/to v0.4.0 // indirect
	github.com/Azure/go-autorest/autorest/validation v0.3.1 // indirect
	github.com/Azure/go-autorest/logger v0.2.1 // indirect
	github.com/Azure/go-autorest/tracing v0.6.0 // indirect
	github.com/PuerkitoBio/purell v1.1.1 // indirect
	github.com/PuerkitoBio/urlesc v0.0.0-20170810143723-de5bf2ad4578 // indirect
	github.com/ReneKroon/ttlcache/v2 v2.11.0 // indirect
	github.com/ThalesIgnite/crypto11 v1.2.5 // indirect
	github.com/armon/go-metrics v0.3.10 // indirect
	github.com/armon/go-radix v1.0.0 // indirect
	github.com/asaskevich/govalidator v0.0.0-20210307081110-f21760c49a8d // indirect
	github.com/aws/aws-sdk-go v1.43.22 // indirect
	github.com/aws/aws-sdk-go-v2 v1.13.0 // indirect
	github.com/aws/aws-sdk-go-v2/config v1.13.1 // indirect
	github.com/aws/aws-sdk-go-v2/credentials v1.8.0 // indirect
	github.com/aws/aws-sdk-go-v2/feature/ec2/imds v1.10.0 // indirect
	github.com/aws/aws-sdk-go-v2/internal/configsources v1.1.4 // indirect
	github.com/aws/aws-sdk-go-v2/internal/endpoints/v2 v2.2.0 // indirect
	github.com/aws/aws-sdk-go-v2/internal/ini v1.3.5 // indirect
	github.com/aws/aws-sdk-go-v2/service/ecr v1.14.0 // indirect
	github.com/aws/aws-sdk-go-v2/service/ecrpublic v1.11.0 // indirect
	github.com/aws/aws-sdk-go-v2/service/internal/presigned-url v1.7.0 // indirect
	github.com/aws/aws-sdk-go-v2/service/sso v1.9.0 // indirect
	github.com/aws/aws-sdk-go-v2/service/sts v1.14.0 // indirect
	github.com/aws/smithy-go v1.10.0 // indirect
	github.com/blang/semver v3.5.1+incompatible // indirect
	github.com/cenkalti/backoff/v3 v3.2.2 // indirect
	github.com/containerd/stargz-snapshotter/estargz v0.10.1 // indirect
	github.com/cyberphone/json-canonicalization v0.0.0-20210823021906-dc406ceaf94b // indirect
	github.com/davecgh/go-spew v1.1.1 // indirect
	github.com/dimchansky/utfbom v1.1.1 // indirect
	github.com/docker/cli v20.10.12+incompatible // indirect
	github.com/docker/distribution v2.7.1+incompatible // indirect
	github.com/docker/docker v20.10.12+incompatible // indirect
	github.com/docker/docker-credential-helpers v0.6.4 // indirect
	github.com/fatih/color v1.13.0 // indirect
	github.com/fsnotify/fsnotify v1.5.1 // indirect
	github.com/go-chi/chi v4.1.2+incompatible // indirect
	github.com/go-logr/logr v1.2.2 // indirect
	github.com/go-openapi/analysis v0.21.2 // indirect
	github.com/go-openapi/errors v0.20.2 // indirect
	github.com/go-openapi/jsonpointer v0.19.5 // indirect
	github.com/go-openapi/jsonreference v0.19.6 // indirect
	github.com/go-openapi/loads v0.21.1 // indirect
	github.com/go-openapi/runtime v0.23.1 // indirect
	github.com/go-openapi/spec v0.20.4 // indirect
	github.com/go-openapi/strfmt v0.21.2 // indirect
	github.com/go-openapi/swag v0.21.1 // indirect
	github.com/go-openapi/validate v0.21.0 // indirect
	github.com/go-playground/locales v0.14.0 // indirect
	github.com/go-playground/universal-translator v0.18.0 // indirect
	github.com/go-playground/validator/v10 v10.10.0 // indirect
	github.com/go-stack/stack v1.8.1 // indirect
	github.com/gogo/protobuf v1.3.2 // indirect
	github.com/golang-jwt/jwt/v4 v4.2.0 // indirect
	github.com/golang/groupcache v0.0.0-20210331224755-41bb18bfe9da // indirect
	github.com/golang/protobuf v1.5.2 // indirect
	github.com/golang/snappy v0.0.4 // indirect
	github.com/google/go-cmp v0.5.7 // indirect
	github.com/google/go-github/v42 v42.0.0 // indirect
	github.com/google/go-querystring v1.1.0 // indirect
	github.com/google/gofuzz v1.2.0 // indirect
	github.com/google/trillian v1.4.0 // indirect
	github.com/googleapis/gax-go/v2 v2.1.1 // indirect
	github.com/googleapis/gnostic v0.5.5 // indirect
	github.com/hashicorp/errwrap v1.1.0 // indirect
	github.com/hashicorp/go-cleanhttp v0.5.2 // indirect
	github.com/hashicorp/go-hclog v1.1.0 // indirect
	github.com/hashicorp/go-immutable-radix v1.3.1 // indirect
	github.com/hashicorp/go-multierror v1.1.1 // indirect
	github.com/hashicorp/go-plugin v1.4.3 // indirect
	github.com/hashicorp/go-retryablehttp v0.7.0 // indirect
	github.com/hashicorp/go-rootcerts v1.0.2 // indirect
	github.com/hashicorp/go-secure-stdlib/mlock v0.1.2 // indirect
	github.com/hashicorp/go-secure-stdlib/parseutil v0.1.2 // indirect
	github.com/hashicorp/go-secure-stdlib/strutil v0.1.2 // indirect
	github.com/hashicorp/go-sockaddr v1.0.2 // indirect
	github.com/hashicorp/go-uuid v1.0.2 // indirect
	github.com/hashicorp/go-version v1.4.0 // indirect
	github.com/hashicorp/golang-lru v0.5.4 // indirect
	github.com/hashicorp/hcl v1.0.0 // indirect
	github.com/hashicorp/vault/api v1.3.1 // indirect
	github.com/hashicorp/vault/sdk v0.4.1 // indirect
	github.com/hashicorp/yamux v0.0.0-20211028200310-0bc27b27de87 // indirect
	github.com/imdario/mergo v0.3.12 // indirect
	github.com/in-toto/in-toto-golang v0.3.4-0.20211211042327-af1f9fb822bf // indirect
	github.com/inconshreveable/mousetrap v1.0.0 // indirect
	github.com/jedisct1/go-minisign v0.0.0-20210703085342-c1f07ee84431 // indirect
	github.com/jmespath/go-jmespath v0.4.0 // indirect
	github.com/josharian/intern v1.0.0 // indirect
	github.com/json-iterator/go v1.1.12 // indirect
	github.com/klauspost/compress v1.14.2 // indirect
	github.com/leodido/go-urn v1.2.1 // indirect
	github.com/magiconair/properties v1.8.5 // indirect
	github.com/mailru/easyjson v0.7.7 // indirect
	github.com/mattn/go-colorable v0.1.12 // indirect
	github.com/mattn/go-isatty v0.0.14 // indirect
	github.com/miekg/pkcs11 v1.1.1 // indirect
	github.com/mitchellh/copystructure v1.2.0 // indirect
	github.com/mitchellh/go-homedir v1.1.0 // indirect
	github.com/mitchellh/go-testing-interface v1.14.1 // indirect
	github.com/mitchellh/mapstructure v1.4.3 // indirect
	github.com/mitchellh/reflectwalk v1.0.2 // indirect
	github.com/modern-go/concurrent v0.0.0-20180306012644-bacd9c7ef1dd // indirect
	github.com/modern-go/reflect2 v1.0.2 // indirect
	github.com/oklog/run v1.1.0 // indirect
	github.com/oklog/ulid v1.3.1 // indirect
	github.com/opencontainers/go-digest v1.0.0 // indirect
	github.com/opencontainers/image-spec v1.0.3-0.20220114050600-8b9d41f48198 // indirect
	github.com/opentracing/opentracing-go v1.2.0 // indirect
	github.com/pelletier/go-toml v1.9.4 // indirect
	github.com/pierrec/lz4 v2.6.1+incompatible // indirect
	github.com/pkg/errors v0.9.1 // indirect
	github.com/ryanuber/go-glob v1.0.0 // indirect
	github.com/sassoftware/relic v0.0.0-20210427151427-dfb082b79b74 // indirect
	github.com/secure-systems-lab/go-securesystemslib v0.3.1 // indirect
	github.com/shibumi/go-pathspec v1.3.0 // indirect
	github.com/sigstore/rekor v0.4.1-0.20220114213500-23f583409af3 // indirect
	github.com/sigstore/sigstore v1.1.1-0.20220217212907-e48ca03a5ba7 // indirect
	github.com/sirupsen/logrus v1.8.1 // indirect
	github.com/spf13/afero v1.8.0 // indirect
	github.com/spf13/cast v1.4.1 // indirect
	github.com/spf13/cobra v1.3.0 // indirect
	github.com/spf13/jwalterweatherman v1.1.0 // indirect
	github.com/spf13/pflag v1.0.5 // indirect
	github.com/spf13/viper v1.10.1 // indirect
	github.com/subosito/gotenv v1.2.0 // indirect
	github.com/syndtr/goleveldb v1.0.1-0.20210819022825-2ae1ddf74ef7 // indirect
	github.com/tent/canonical-json-go v0.0.0-20130607151641-96e4ba3a7613 // indirect
	github.com/thales-e-security/pool v0.0.2 // indirect
	github.com/theupdateframework/go-tuf v0.0.0-20220211205608-f0c3294f63b9 // indirect
	github.com/vbatts/tar-split v0.11.2 // indirect
	github.com/xanzy/go-gitlab v0.56.0 // indirect
	go.mongodb.org/mongo-driver v1.8.3 // indirect
	go.opencensus.io v0.23.0 // indirect
	go.uber.org/atomic v1.9.0 // indirect
	go.uber.org/multierr v1.7.0 // indirect
	go.uber.org/zap v1.21.0 // indirect
	golang.org/x/crypto v0.0.0-20220213190939-1e6e3497d506 // indirect
	golang.org/x/net v0.0.0-20220127200216-cd36cc0744dd // indirect
	golang.org/x/oauth2 v0.0.0-20211104180415-d3ed0bb246c8 // indirect
	golang.org/x/sync v0.0.0-20210220032951-036812b2e83c // indirect
	golang.org/x/sys v0.0.0-20220209214540-3681064d5158 // indirect
	golang.org/x/term v0.0.0-20210927222741-03fcf44c2211 // indirect
	golang.org/x/text v0.3.7 // indirect
	golang.org/x/time v0.0.0-20211116232009-f0f3c7e86c11 // indirect
	golang.org/x/xerrors v0.0.0-20200804184101-5ec99f83aff1 // indirect
	google.golang.org/api v0.70.0 // indirect
	google.golang.org/appengine v1.6.7 // indirect
	google.golang.org/genproto v0.0.0-20220218161850-94dd64e39d7c // indirect
	google.golang.org/grpc v1.44.0 // indirect
	google.golang.org/protobuf v1.27.1 // indirect
	gopkg.in/inf.v0 v0.9.1 // indirect
	gopkg.in/ini.v1 v1.66.2 // indirect
	gopkg.in/square/go-jose.v2 v2.6.0 // indirect
	gopkg.in/yaml.v2 v2.4.0 // indirect
	gopkg.in/yaml.v3 v3.0.0-20210107192922-496545a6307b // indirect
	k8s.io/api v0.23.3 // indirect
	k8s.io/apimachinery v0.23.3 // indirect
	k8s.io/client-go v0.23.3 // indirect
	k8s.io/klog/v2 v2.40.1 // indirect
	k8s.io/kube-openapi v0.0.0-20220124234850-424119656bbf // indirect
	k8s.io/utils v0.0.0-20220127004650-9b3446523e65 // indirect
	knative.dev/pkg v0.0.0-20220202132633-df430fa0dd96 // indirect
	sigs.k8s.io/json v0.0.0-20211020170558-c049b76a60c6 // indirect
	sigs.k8s.io/structured-merge-diff/v4 v4.2.1 // indirect
	sigs.k8s.io/yaml v1.3.0 // indirect
)
