Kerri Philis,84258058,2014-05-22,2014-05-23,5
Bryan Ambrosine,96112202,2016-11-15,2016-11-18,2
Leland Hollie,45431352,2013-02-09,2013-02-11,3
Ryley Trev,29118351,2017-12-01,2017-12-06,4
Dunstan Sebastian,64093350,2017-05-11,2017-05-12,3
Gyles Hadley,99250783,2015-08-12,2015-08-14,1
Kaycee Rena,21433903,2016-03-03,2016-03-05,2
Madilyn Jemima,43037918,2015-09-19,2015-09-21,3
Krista Kory,26120432,2017-05-05,2017-05-10,6
Niles Gerald,99864073,2014-01-01,2014-01-06,2
Rosaline Kizzy,41536340,2017-07-21,2017-07-30,5
Mathew Oswald,58908044,2016-12-11,2016-12-15,3
Alise Scottie,22566090,2015-06-17,2015-06-20,2
Joby Clarette,84954906,2017-02-19,2017-02-24,4
Ariella Alysa,16048767,2014-10-03,2014-10-04,2
