{
  "name": "Test Driven Development Tutorial",
  "key": "tddtut_ts",
  "repo": "https://gitlab.com/atomi-cloud/project-aldehyde/tutorials/test-driven-development-tutorial.git",
  "email": "kirinnee97@gmail.com",
  "readme": "README.MD"
}
