<svg xmlns="http://www.w3.org/2000/svg" preserveAspectRatio="xMidYMid" viewBox="0 0 100 100">
    <defs/>
    <path fill="#f3b72e" d="M32 19H14L5 34l9 16h18l8-16z">
        <animate attributeName="opacity" begin="0s" dur="0.9009009009009008s" keyTimes="0;0.5;1"
                 repeatCount="indefinite" values="1;0.5;1"/>
    </path>
    <path fill="#3869c5" d="M59 3H41l-9 15 9 16h18l9-16z">
        <animate attributeName="opacity" begin="-0.1287001287001287s" dur="0.9009009009009008s" keyTimes="0;0.5;1"
                 repeatCount="indefinite" values="1;0.5;1"/>
    </path>
    <path fill="#4686f4" d="M59 35H41l-9 15 9 15h18l9-15z">
        <animate attributeName="opacity" begin="-0.2574002574002574s" dur="0.9009009009009008s" keyTimes="0;0.5;1"
                 repeatCount="indefinite" values="1;0.5;1"/>
    </path>
    <path fill="#f3b72e" d="M59 66H41l-9 16 9 15h18l9-15z">
        <animate attributeName="opacity" begin="-0.38610038610038605s" dur="0.9009009009009008s" keyTimes="0;0.5;1"
                 repeatCount="indefinite" values="1;0.5;1"/>
    </path>
    <path fill="#3869c5" d="M86 51H68l-8 15 8 15h18l9-15z">
        <animate attributeName="opacity" begin="-0.5148005148005148s" dur="0.9009009009009008s" keyTimes="0;0.5;1"
                 repeatCount="indefinite" values="1;0.5;1"/>
    </path>
    <path fill="#4686f4" d="M86 19H68l-8 15 8 16h18l9-16z">
        <animate attributeName="opacity" begin="-0.6435006435006435s" dur="0.9009009009009008s" keyTimes="0;0.5;1"
                 repeatCount="indefinite" values="1;0.5;1"/>
    </path>
    <path fill="#f3b72e" d="M32 51H14L5 66l9 15h18l8-15z">
        <animate attributeName="opacity" begin="-0.7722007722007721s" dur="0.9009009009009008s" keyTimes="0;0.5;1"
                 repeatCount="indefinite" values="1;0.5;1"/>
    </path>
</svg>