solid Cache cables BT3
facet normal -0.0 1.0 -0.0
  outer loop
    vertex 0.0 37.1 3.825
    vertex 87.0 37.1 2.5
    vertex 0.0 37.1 2.5
  endloop
endfacet
facet normal -0.0 1.0 -0.0
  outer loop
    vertex 87.0 37.1 2.5
    vertex 0.0 37.1 3.825
    vertex 87.0081042742199 37.1 3.825
  endloop
endfacet
facet normal -0.805253455812611 -0.000145599154239213 -0.592930730104904
  outer loop
    vertex -0.5 37.5593362484119 4.49481992324184
    vertex 0.0 0.0 3.825
    vertex -0.499999999999994 -0.519073769339648 4.51304672085839
  endloop
endfacet
facet normal -0.805253455812611 -0.000145599154239213 -0.592930730104904
  outer loop
    vertex 0.0 0.0 3.825
    vertex -0.5 37.5593362484119 4.49481992324184
    vertex 0.0 37.1 3.825
  endloop
endfacet
facet normal 0.0 -1.0 0.0
  outer loop
    vertex 87.0081042742199 0.0 3.825
    vertex 0.0 0.0 2.5
    vertex 87.0 0.0 2.5
  endloop
endfacet
facet normal 0.0 -1.0 0.0
  outer loop
    vertex 0.0 0.0 2.5
    vertex 87.0081042742199 0.0 3.825
    vertex 0.0 0.0 3.825
  endloop
endfacet
facet normal 0.999981295146214 -0.0 -0.00611631896654538
  outer loop
    vertex 87.0 37.1 2.5
    vertex 87.0081042742199 0.0 3.825
    vertex 87.0 0.0 2.5
  endloop
endfacet
facet normal 0.999981295146214 -0.0 -0.00611631896654538
  outer loop
    vertex 87.0081042742199 0.0 3.825
    vertex 87.0 37.1 2.5
    vertex 87.0081042742199 37.1 3.825
  endloop
endfacet
facet normal -0.932214363923074 -0.000113327519265597 0.361906571993894
  outer loop
    vertex 0.0 0.0 7.8
    vertex -0.5 37.5553926502717 6.5237923946979
    vertex -0.499999999999994 -0.519073769339648 6.50054672085839
  endloop
endfacet
facet normal -0.932214363923074 -0.000113327519265597 0.361906571993894
  outer loop
    vertex -0.5 37.5553926502717 6.5237923946979
    vertex 0.0 0.0 7.8
    vertex 0.0 37.1000005905212 7.79999724425573
  endloop
endfacet
facet normal -1.0 0.0 0.0
  outer loop
    vertex 0.0 37.1 3.825
    vertex 0.0 0.0 2.5
    vertex 0.0 0.0 3.825
  endloop
endfacet
facet normal -1.0 0.0 0.0
  outer loop
    vertex 0.0 0.0 2.5
    vertex 0.0 37.1 3.825
    vertex 0.0 37.1 2.5
  endloop
endfacet
facet normal -0.790892740835355 0.000150231125704024 0.611954777679323
  outer loop
    vertex 0.0 0.0 5.15
    vertex -0.5 37.5593362484119 4.49481992324184
    vertex -0.499999999999994 -0.519073769339648 4.51304672085839
  endloop
endfacet
facet normal -0.790892740835355 0.000150231125704024 0.611954777679323
  outer loop
    vertex -0.5 37.5593362484119 4.49481992324184
    vertex 0.0 0.0 5.15
    vertex 0.0 37.1 5.1500053164638
  endloop
endfacet
facet normal -0.93876495320424 0.000107933102164985 -0.344558196805541
  outer loop
    vertex -0.5 37.5553926502717 6.5237923946979
    vertex 0.0 0.0 5.15
    vertex -0.499999999999994 -0.519073769339648 6.50054672085839
  endloop
endfacet
facet normal -0.93876495320424 0.000107933102164985 -0.344558196805541
  outer loop
    vertex 0.0 0.0 5.15
    vertex -0.5 37.5553926502717 6.5237923946979
    vertex 0.0 37.1 5.1500053164638
  endloop
endfacet
facet normal -2.14695990539275e-09 0.941834253062672 0.336077728744226
  outer loop
    vertex 0.0 37.1000005905212 7.79999724425573
    vertex 87.5038217492793 37.5553930469571 6.5237923946979
    vertex -0.5 37.5553926502717 6.5237923946979
  endloop
endfacet
facet normal -2.14695990539275e-09 0.941834253062672 0.336077728744226
  outer loop
    vertex 87.5038217492793 37.5553930469571 6.5237923946979
    vertex 0.0 37.1000005905212 7.79999724425573
    vertex 87.0038217609511 37.1000005905212 7.79999724425573
  endloop
endfacet
facet normal 0.781677116214547 -0.000161133066680751 0.62368330106124
  outer loop
    vertex 87.007643464111 37.1 5.1500053164638
    vertex 87.0 0.0 5.15
    vertex 87.5081042742199 -0.519073769339648 4.51304672085839
  endloop
endfacet
facet normal 0.794589079060712 0.000290620195674585 0.607147519946636
  outer loop
    vertex 87.5081042742199 37.5593362454095 4.49481992324184
    vertex 87.007643464111 37.1 5.1500053164638
    vertex 87.5081042742199 -0.519073769339648 4.51304672085839
  endloop
endfacet
facet normal -2.16367408082424e-09 0.949207692863641 -0.314650211836072
  outer loop
    vertex -0.5 37.5553926502717 6.5237923946979
    vertex 87.007643464111 37.1 5.1500053164638
    vertex 0.0 37.1 5.1500053164638
  endloop
endfacet
facet normal -2.16367408082424e-09 0.949207692863641 -0.314650211836072
  outer loop
    vertex 87.007643464111 37.1 5.1500053164638
    vertex -0.5 37.5553926502717 6.5237923946979
    vertex 87.5038217492793 37.5553930469571 6.5237923946979
  endloop
endfacet
facet normal 2.09763012736268e-19 -0.933430630721618 -0.358757937376503
  outer loop
    vertex 87.5 -0.519073769339648 6.50054672085839
    vertex 0.0 0.0 5.15
    vertex 87.0 0.0 5.15
  endloop
endfacet
facet normal 2.09763012736268e-19 -0.933430630721618 -0.358757937376503
  outer loop
    vertex 0.0 0.0 5.15
    vertex 87.5 -0.519073769339648 6.50054672085839
    vertex -0.499999999999994 -0.519073769339648 6.50054672085839
  endloop
endfacet
facet normal 1.42284956145887e-11 0.824710959364414 -0.565554447868839
  outer loop
    vertex -0.5 37.5593362484119 4.49481992324184
    vertex 87.0081042742199 37.1 3.825
    vertex 0.0 37.1 3.825
  endloop
endfacet
facet normal 1.42284956145887e-11 0.824710959364414 -0.565554447868839
  outer loop
    vertex 87.0081042742199 37.1 3.825
    vertex -0.5 37.5593362484119 4.49481992324184
    vertex 87.5081042742199 37.5593362454095 4.49481992324184
  endloop
endfacet
facet normal 1.41268813964792e-11 0.81881691541973 0.574054752634728
  outer loop
    vertex 0.0 37.1 5.1500053164638
    vertex 87.5081042742199 37.5593362454095 4.49481992324184
    vertex -0.5 37.5593362484119 4.49481992324184
  endloop
endfacet
facet normal 1.41268813964792e-11 0.81881691541973 0.574054752634728
  outer loop
    vertex 87.5081042742199 37.5593362454095 4.49481992324184
    vertex 0.0 37.1 5.1500053164638
    vertex 87.007643464111 37.1 5.1500053164638
  endloop
endfacet
facet normal 0.808857377273845 -0.000281457255709878 -0.588004816316577
  outer loop
    vertex 87.5081042742199 37.5593362454095 4.49481992324184
    vertex 87.5081042742199 -0.519073769339648 4.51304672085839
    vertex 87.0081042742199 0.0 3.825
  endloop
endfacet
facet normal 0.801356042882101 -0.0 -0.598187673340349
  outer loop
    vertex 87.5081042742199 37.5593362454095 4.49481992324184
    vertex 87.0081042742199 0.0 3.825
    vertex 87.0081042742199 37.1 3.825
  endloop
endfacet
facet normal 0.937809282429304 0.000117813449185141 -0.347150883492215
  outer loop
    vertex 87.5038217492793 37.5553930469571 6.5237923946979
    vertex 87.5 -0.519073769339648 6.50054672085839
    vertex 87.0 0.0 5.15
  endloop
endfacet
facet normal 0.940555039262975 -0.000193727574032087 -0.339641252775117
  outer loop
    vertex 87.5038217492793 37.5553930469571 6.5237923946979
    vertex 87.0 0.0 5.15
    vertex 87.007643464111 37.1 5.1500053164638
  endloop
endfacet
facet normal 0.933282123057766 -9.61129759649071e-05 0.359144079086771
  outer loop
    vertex 87.0038217609511 37.1000005905212 7.79999724425573
    vertex 87.0 0.0 7.8
    vertex 87.5 -0.519073769339648 6.50054672085839
  endloop
endfacet
facet normal 0.931128580031173 -0.000316118049102667 0.364690920532046
  outer loop
    vertex 87.5038217492793 37.5553930469571 6.5237923946979
    vertex 87.0038217609511 37.1000005905212 7.79999724425573
    vertex 87.5 -0.519073769339648 6.50054672085839
  endloop
endfacet
facet normal 6.14260898092499e-20 -0.798304492661777 -0.602254046890531
  outer loop
    vertex 87.5081042742199 -0.519073769339648 4.51304672085839
    vertex 0.0 0.0 3.825
    vertex 87.0081042742199 0.0 3.825
  endloop
endfacet
facet normal 6.14260898092499e-20 -0.798304492661777 -0.602254046890531
  outer loop
    vertex 0.0 0.0 3.825
    vertex 87.5081042742199 -0.519073769339648 4.51304672085839
    vertex -0.499999999999994 -0.519073769339648 4.51304672085839
  endloop
endfacet
facet normal 6.18571921562547e-20 -0.775190404134219 0.631727660735404
  outer loop
    vertex 87.0 0.0 5.15
    vertex -0.499999999999994 -0.519073769339648 4.51304672085839
    vertex 87.5081042742199 -0.519073769339648 4.51304672085839
  endloop
endfacet
facet normal 6.18571921562547e-20 -0.775190404134219 0.631727660735404
  outer loop
    vertex -0.499999999999994 -0.519073769339648 4.51304672085839
    vertex 87.0 0.0 5.15
    vertex 0.0 0.0 5.15
  endloop
endfacet
facet normal 0.0 -0.928650948321122 0.370954736028914
  outer loop
    vertex 87.0 0.0 7.8
    vertex -0.499999999999994 -0.519073769339648 6.50054672085839
    vertex 87.5 -0.519073769339648 6.50054672085839
  endloop
endfacet
facet normal 0.0 -0.928650948321122 0.370954736028914
  outer loop
    vertex -0.499999999999994 -0.519073769339648 6.50054672085839
    vertex 87.0 0.0 7.8
    vertex 0.0 0.0 7.8
  endloop
endfacet
facet normal 1.0 -0.0 -0.0
  outer loop
    vertex 5.00420455726499 32.095795442735 6.55
    vertex 5.00420455726499 5.00420455726499 13.1
    vertex 5.00420455726499 5.00420455726499 6.55
  endloop
endfacet
facet normal 1.0 -0.0 -0.0
  outer loop
    vertex 5.00420455726499 5.00420455726499 13.1
    vertex 5.00420455726499 32.095795442735 6.55
    vertex 5.00420455726499 32.095795442735 13.1
  endloop
endfacet
facet normal -0.0 1.0 -0.0
  outer loop
    vertex 5.00420455726499 5.00420455726499 13.1
    vertex 81.995795442735 5.00420455726499 6.55
    vertex 5.00420455726499 5.00420455726499 6.55
  endloop
endfacet
facet normal -0.0 1.0 -0.0
  outer loop
    vertex 81.995795442735 5.00420455726499 6.55
    vertex 5.00420455726499 5.00420455726499 13.1
    vertex 81.995795442735 5.00420455726499 13.1
  endloop
endfacet
facet normal -1.0 0.0 0.0
  outer loop
    vertex 81.995795442735 32.095795442735 13.1
    vertex 81.995795442735 5.00420455726499 6.55
    vertex 81.995795442735 5.00420455726499 13.1
  endloop
endfacet
facet normal -1.0 0.0 0.0
  outer loop
    vertex 81.995795442735 5.00420455726499 6.55
    vertex 81.995795442735 32.095795442735 13.1
    vertex 81.995795442735 32.095795442735 6.55
  endloop
endfacet
facet normal 0.0 -1.0 0.0
  outer loop
    vertex 81.995795442735 32.095795442735 13.1
    vertex 5.00420455726499 32.095795442735 6.55
    vertex 81.995795442735 32.095795442735 6.55
  endloop
endfacet
facet normal 0.0 -1.0 0.0
  outer loop
    vertex 5.00420455726499 32.095795442735 6.55
    vertex 81.995795442735 32.095795442735 13.1
    vertex 5.00420455726499 32.095795442735 13.1
  endloop
endfacet
facet normal 0.938953514033331 -4.00796200641969e-18 -0.344044035676335
  outer loop
    vertex 2.60420455726499 34.595795442735 0.0
    vertex 5.00420455726499 5.00420455726499 6.55
    vertex 2.60420455726499 2.62992560320542 0.0
  endloop
endfacet
facet normal 0.938953514033331 -4.00796200641969e-18 -0.344044035676335
  outer loop
    vertex 5.00420455726499 5.00420455726499 6.55
    vertex 2.60420455726499 34.595795442735 0.0
    vertex 5.00420455726499 32.095795442735 6.55
  endloop
endfacet
facet normal -0.934261589689732 -2.44569058107289e-18 -0.356588393011347
  outer loop
    vertex 81.995795442735 5.00420455726499 6.55
    vertex 84.495795442735 34.6299256032054 0.0
    vertex 84.495795442735 2.62992560320542 0.0
  endloop
endfacet
facet normal -0.934261589689732 -2.44569058107289e-18 -0.356588393011347
  outer loop
    vertex 84.495795442735 34.6299256032054 0.0
    vertex 81.995795442735 5.00420455726499 6.55
    vertex 81.995795442735 32.095795442735 6.55
  endloop
endfacet
facet normal 6.77557804612542e-19 0.940140482007296 -0.340787138975473
  outer loop
    vertex 5.00420455726499 5.00420455726499 6.55
    vertex 84.495795442735 2.62992560320542 0.0
    vertex 2.60420455726499 2.62992560320542 0.0
  endloop
endfacet
facet normal 6.77557804612542e-19 0.940140482007296 -0.340787138975473
  outer loop
    vertex 84.495795442735 2.62992560320542 0.0
    vertex 5.00420455726499 5.00420455726499 6.55
    vertex 81.995795442735 5.00420455726499 6.55
  endloop
endfacet
facet normal 0.938953514033358 -0.0 -0.344044035676262
  outer loop
    vertex 2.60420455726499 34.6299256032054 0.0
    vertex 5.00420455726499 32.095795442735 6.55
    vertex 2.60420455726499 34.595795442735 0.0
  endloop
endfacet
facet normal -1.86357044954184e-18 -0.932632972931541 -0.360826464939694
  outer loop
    vertex 81.995795442735 32.095795442735 6.55
    vertex 2.60420455726499 34.6299256032054 0.0
    vertex 84.495795442735 34.6299256032054 0.0
  endloop
endfacet
facet normal -1.86357044954184e-18 -0.932632972931541 -0.360826464939694
  outer loop
    vertex 2.60420455726499 34.6299256032054 0.0
    vertex 81.995795442735 32.095795442735 6.55
    vertex 5.00420455726499 32.095795442735 6.55
  endloop
endfacet
facet normal -0.0 -0.0 1.0
  outer loop
    vertex 97.1921720605197 -10.1921720605197 2.5
    vertex 0.0 0.0 2.5
    vertex -9.76895288002126 -10.1921720605197 2.5
  endloop
endfacet
facet normal -0.0 -0.0 1.0
  outer loop
    vertex 0.0 0.0 2.5
    vertex 97.1921720605197 -10.1921720605197 2.5
    vertex 87.0 0.0 2.5
  endloop
endfacet
facet normal -0.0 -0.0 1.0
  outer loop
    vertex 87.0 0.0 2.5
    vertex 97.1921720605197 -10.1921720605197 2.5
    vertex 87.0 37.1 2.5
  endloop
endfacet
facet normal -0.0 -0.0 1.0
  outer loop
    vertex 87.0 37.1 2.5
    vertex 97.1921720605197 -10.1921720605197 2.5
    vertex 96.7689528800213 47.2921720605197 2.5
  endloop
endfacet
facet normal -0.0 -0.0 1.0
  outer loop
    vertex 96.7689528800213 47.2921720605197 2.5
    vertex 97.1921720605197 -10.1921720605197 2.5
    vertex 97.1921720605197 46.3565541659286 2.5
  endloop
endfacet
facet normal -0.0 -0.0 1.0
  outer loop
    vertex 97.1921720605197 46.3565541659286 2.5
    vertex 97.1921720605197 -10.1921720605197 2.5
    vertex 102.801677189688 4.68375040528384 2.5
  endloop
endfacet
facet normal -0.0 -0.0 1.0
  outer loop
    vertex 97.1921720605197 46.3565541659286 2.5
    vertex 102.801677189688 4.68375040528384 2.5
    vertex 101.789883730652 36.1923141906043 2.5
  endloop
endfacet
facet normal -0.0 -0.0 1.0
  outer loop
    vertex 101.789883730652 36.1923141906043 2.5
    vertex 102.801677189688 4.68375040528384 2.5
    vertex 104.369871019035 20.5046348659064 2.5
  endloop
endfacet
facet normal -0.0 -0.0 1.0
  outer loop
    vertex -14.7898837306524 0.907685809395641 2.5
    vertex -15.8016771896884 32.4162495947161 2.5
    vertex -17.369871019035 16.5953651340936 2.5
  endloop
endfacet
facet normal -0.0 -0.0 1.0
  outer loop
    vertex -15.8016771896884 32.4162495947161 2.5
    vertex -14.7898837306524 0.907685809395641 2.5
    vertex -10.1921720605197 47.2921720605197 2.5
  endloop
endfacet
facet normal -0.0 -0.0 1.0
  outer loop
    vertex -10.1921720605197 47.2921720605197 2.5
    vertex -14.7898837306524 0.907685809395641 2.5
    vertex -10.1921720605197 -9.25655416592861 2.5
  endloop
endfacet
facet normal -0.0 -0.0 1.0
  outer loop
    vertex -10.1921720605197 47.2921720605197 2.5
    vertex -10.1921720605197 -9.25655416592861 2.5
    vertex -9.76895288002126 -10.1921720605197 2.5
  endloop
endfacet
facet normal -0.0 -0.0 1.0
  outer loop
    vertex -10.1921720605197 47.2921720605197 2.5
    vertex -9.76895288002126 -10.1921720605197 2.5
    vertex 0.0 37.1 2.5
  endloop
endfacet
facet normal -0.0 -0.0 1.0
  outer loop
    vertex -10.1921720605197 47.2921720605197 2.5
    vertex 0.0 37.1 2.5
    vertex 96.7689528800213 47.2921720605197 2.5
  endloop
endfacet
facet normal -0.0 -0.0 1.0
  outer loop
    vertex 0.0 37.1 2.5
    vertex -9.76895288002126 -10.1921720605197 2.5
    vertex 0.0 0.0 2.5
  endloop
endfacet
facet normal -0.0 -0.0 1.0
  outer loop
    vertex 96.7689528800213 47.2921720605197 2.5
    vertex 0.0 37.1 2.5
    vertex 87.0 37.1 2.5
  endloop
endfacet
facet normal -0.0 -0.0 1.0
  outer loop
    vertex 2.09872640607698 2.09872640607698 13.1
    vertex 5.00420455726499 5.00420455726499 13.1
    vertex 2.09872640607698 35.001273593923 13.1
  endloop
endfacet
facet normal -0.0 -0.0 1.0
  outer loop
    vertex 5.00420455726499 5.00420455726499 13.1
    vertex 2.09872640607698 2.09872640607698 13.1
    vertex 84.901273593923 2.09872640607698 13.1
  endloop
endfacet
facet normal -0.0 -0.0 1.0
  outer loop
    vertex 5.00420455726499 5.00420455726499 13.1
    vertex 84.901273593923 2.09872640607698 13.1
    vertex 81.995795442735 5.00420455726499 13.1
  endloop
endfacet
facet normal -0.0 -0.0 1.0
  outer loop
    vertex 81.995795442735 5.00420455726499 13.1
    vertex 84.901273593923 2.09872640607698 13.1
    vertex 81.995795442735 32.095795442735 13.1
  endloop
endfacet
facet normal -0.0 -0.0 1.0
  outer loop
    vertex 2.09872640607698 35.001273593923 13.1
    vertex 5.00420455726499 32.095795442735 13.1
    vertex 84.901273593923 35.001273593923 13.1
  endloop
endfacet
facet normal -0.0 -0.0 1.0
  outer loop
    vertex 5.00420455726499 32.095795442735 13.1
    vertex 2.09872640607698 35.001273593923 13.1
    vertex 5.00420455726499 5.00420455726499 13.1
  endloop
endfacet
facet normal -0.0 -0.0 1.0
  outer loop
    vertex 84.901273593923 35.001273593923 13.1
    vertex 5.00420455726499 32.095795442735 13.1
    vertex 81.995795442735 32.095795442735 13.1
  endloop
endfacet
facet normal -0.0 -0.0 1.0
  outer loop
    vertex 84.901273593923 35.001273593923 13.1
    vertex 81.995795442735 32.095795442735 13.1
    vertex 84.901273593923 2.09872640607698 13.1
  endloop
endfacet
facet normal 0.0 -0.929757993692741 0.368171255212095
  outer loop
    vertex 84.901273593923 2.09872640607698 13.1
    vertex 0.0 0.0 7.8
    vertex 87.0 0.0 7.8
  endloop
endfacet
facet normal 0.0 -0.929757993692741 0.368171255212095
  outer loop
    vertex 0.0 0.0 7.8
    vertex 84.901273593923 2.09872640607698 13.1
    vertex 2.09872640607698 2.09872640607698 13.1
  endloop
endfacet
facet normal -0.929758026457175 1.53075702460841e-08 0.368171172470713
  outer loop
    vertex 2.09872640607698 2.09872640607698 13.1
    vertex 0.0 37.1000005905212 7.79999724425573
    vertex 0.0 0.0 7.8
  endloop
endfacet
facet normal -0.929758026457175 1.53075702460841e-08 0.368171172470713
  outer loop
    vertex 0.0 37.1000005905212 7.79999724425573
    vertex 2.09872640607698 2.09872640607698 13.1
    vertex 2.09872640607698 35.001273593923 13.1
  endloop
endfacet
facet normal -5.55934898973124e-19 0.929758023760734 0.368171179280148
  outer loop
    vertex 2.09872640607698 35.001273593923 13.1
    vertex 87.0038217609511 37.1000005905212 7.79999724425573
    vertex 0.0 37.1000005905212 7.79999724425573
  endloop
endfacet
facet normal -5.55934898973124e-19 0.929758023760734 0.368171179280148
  outer loop
    vertex 87.0038217609511 37.1000005905212 7.79999724425573
    vertex 2.09872640607698 35.001273593923 13.1
    vertex 84.901273593923 35.001273593923 13.1
  endloop
endfacet
facet normal 0.929643245569399 -5.35887058672008e-05 0.368460897647831
  outer loop
    vertex 87.0038217609511 37.1000005905212 7.79999724425573
    vertex 84.901273593923 2.09872640607698 13.1
    vertex 87.0 0.0 7.8
  endloop
endfacet
facet normal 0.929643245569399 -5.35887058672008e-05 0.368460897647831
  outer loop
    vertex 84.901273593923 2.09872640607698 13.1
    vertex 87.0038217609511 37.1000005905212 7.79999724425573
    vertex 84.901273593923 35.001273593923 13.1
  endloop
endfacet
facet normal 0.70430179845637 0.0219174366087876 -0.709562261301729
  outer loop
    vertex 101.854718724524 20.3724159592123 0.0
    vertex 102.801677189688 4.68375040528384 2.5
    vertex 100.403745070198 5.65155149504179 0.0
  endloop
endfacet
facet normal 0.704058625284824 0.0235448343437507 -0.70975143038797
  outer loop
    vertex 104.369871019035 20.5046348659064 2.5
    vertex 102.801677189688 4.68375040528384 2.5
    vertex 101.854718724524 20.3724159592123 0.0
  endloop
endfacet
facet normal -0.683101504349751 0.152445985444615 -0.714235644781838
  outer loop
    vertex -13.4037450701985 31.4484485049581 0.0
    vertex -14.8547187245244 16.7275840407876 0.0
    vertex -17.369871019035 16.5953651340936 2.5
  endloop
endfacet
facet normal -0.679150461716767 0.164863135603848 -0.715244571366165
  outer loop
    vertex -15.8016771896884 32.4162495947161 2.5
    vertex -13.4037450701985 31.4484485049581 0.0
    vertex -17.369871019035 16.5953651340936 2.5
  endloop
endfacet
facet normal -0.666568743484962 -0.193049829528969 -0.720012412065039
  outer loop
    vertex -12.4462115668026 2.13278125386272 0.0
    vertex -14.7898837306524 0.907685809395641 2.5
    vertex -14.8547187245244 16.7275840407876 0.0
  endloop
endfacet
facet normal -0.660571734463266 -0.207657781635718 -0.721472958158741
  outer loop
    vertex -14.7898837306524 0.907685809395641 2.5
    vertex -17.369871019035 16.5953651340936 2.5
    vertex -14.8547187245244 16.7275840407876 0.0
  endloop
endfacet
facet normal -0.666568743484962 -0.193049829528969 -0.720012412065039
  outer loop
    vertex -12.4462115668026 2.13278125386272 0.0
    vertex -10.1921720605197 -9.25655416592861 2.5
    vertex -14.7898837306524 0.907685809395641 2.5
  endloop
endfacet
facet normal -0.625851750126253 -0.283291612930131 -0.726674238505364
  outer loop
    vertex -10.1921720605197 -9.25655416592861 2.5
    vertex -12.4462115668026 2.13278125386272 0.0
    vertex -8.16320359712686 -7.32187163010301 0.0
  endloop
endfacet
facet normal -0.625851750126253 -0.283291612930131 -0.726674238505364
  outer loop
    vertex -10.1921720605197 -9.25655416592861 2.5
    vertex -8.16320359712686 -7.32187163010301 0.0
    vertex -9.76895288002126 -10.1921720605197 2.5
  endloop
endfacet
facet normal -0.625851750126253 -0.283291612930131 -0.726674238505364
  outer loop
    vertex -9.76895288002126 -10.1921720605197 2.5
    vertex -8.16320359712686 -7.32187163010301 0.0
    vertex -7.76895288002126 -8.19217206051996 0.0
  endloop
endfacet
facet normal 0.704058625284824 0.0235448343437507 -0.70975143038797
  outer loop
    vertex 104.369871019035 20.5046348659064 2.5
    vertex 101.854718724524 20.3724159592123 0.0
    vertex 99.4462115668026 34.9672187461371 0.0
  endloop
endfacet
facet normal 0.704058625284824 0.0235448343437507 -0.70975143038797
  outer loop
    vertex 104.369871019035 20.5046348659064 2.5
    vertex 99.4462115668026 34.9672187461371 0.0
    vertex 101.789883730652 36.1923141906043 2.5
  endloop
endfacet
facet normal 0.0 0.0 -1.0
  outer loop
    vertex -13.4037450701985 31.4484485049581 0.0
    vertex -12.4462115668026 2.13278125386272 0.0
    vertex -14.8547187245244 16.7275840407876 0.0
  endloop
endfacet
facet normal 0.0 0.0 -1.0
  outer loop
    vertex -12.4462115668026 2.13278125386272 0.0
    vertex -13.4037450701985 31.4484485049581 0.0
    vertex -8.19217206051973 45.2921720605199 0.0
  endloop
endfacet
facet normal 0.0 0.0 -1.0
  outer loop
    vertex -12.4462115668026 2.13278125386272 0.0
    vertex -8.19217206051973 45.2921720605199 0.0
    vertex -8.16320359712686 -7.32187163010301 0.0
  endloop
endfacet
facet normal 0.0 0.0 -1.0
  outer loop
    vertex -8.16320359712686 -7.32187163010301 0.0
    vertex -8.19217206051973 45.2921720605199 0.0
    vertex 2.60420455726499 34.6299256032054 0.0
  endloop
endfacet
facet normal 0.0 0.0 -1.0
  outer loop
    vertex 2.60420455726499 34.6299256032054 0.0
    vertex -8.19217206051973 45.2921720605199 0.0
    vertex 94.7689528800213 45.2921720605199 0.0
  endloop
endfacet
facet normal 0.0 0.0 -1.0
  outer loop
    vertex -8.16320359712686 -7.32187163010301 0.0
    vertex 2.60420455726499 34.6299256032054 0.0
    vertex -7.76895288002126 -8.19217206051996 0.0
  endloop
endfacet
facet normal 0.0 0.0 -1.0
  outer loop
    vertex 2.60420455726499 34.6299256032054 0.0
    vertex 94.7689528800213 45.2921720605199 0.0
    vertex 84.495795442735 34.6299256032054 0.0
  endloop
endfacet
facet normal 0.0 0.0 -1.0
  outer loop
    vertex 84.495795442735 34.6299256032054 0.0
    vertex 94.7689528800213 45.2921720605199 0.0
    vertex 84.495795442735 2.62992560320542 0.0
  endloop
endfacet
facet normal 0.0 0.0 -1.0
  outer loop
    vertex -7.76895288002126 -8.19217206051996 0.0
    vertex 2.60420455726499 2.62992560320542 0.0
    vertex 95.1921720605197 -8.19217206051992 0.0
  endloop
endfacet
facet normal 0.0 0.0 -1.0
  outer loop
    vertex 2.60420455726499 2.62992560320542 0.0
    vertex -7.76895288002126 -8.19217206051996 0.0
    vertex 2.60420455726499 34.6299256032054 0.0
  endloop
endfacet
facet normal 0.0 0.0 -1.0
  outer loop
    vertex 2.60420455726499 2.62992560320542 0.0
    vertex 2.60420455726499 34.6299256032054 0.0
    vertex 2.60420455726499 34.595795442735 0.0
  endloop
endfacet
facet normal 0.0 0.0 -1.0
  outer loop
    vertex 95.1921720605197 -8.19217206051992 0.0
    vertex 2.60420455726499 2.62992560320542 0.0
    vertex 84.495795442735 2.62992560320542 0.0
  endloop
endfacet
facet normal 0.0 0.0 -1.0
  outer loop
    vertex 95.1921720605197 -8.19217206051992 0.0
    vertex 84.495795442735 2.62992560320542 0.0
    vertex 94.7689528800213 45.2921720605199 0.0
  endloop
endfacet
facet normal 0.0 0.0 -1.0
  outer loop
    vertex 95.1921720605197 -8.19217206051992 0.0
    vertex 94.7689528800213 45.2921720605199 0.0
    vertex 95.1632035971269 44.4218716301029 0.0
  endloop
endfacet
facet normal 0.0 0.0 -1.0
  outer loop
    vertex 95.1921720605197 -8.19217206051992 0.0
    vertex 95.1632035971269 44.4218716301029 0.0
    vertex 99.4462115668026 34.9672187461371 0.0
  endloop
endfacet
facet normal 0.0 0.0 -1.0
  outer loop
    vertex 95.1921720605197 -8.19217206051992 0.0
    vertex 99.4462115668026 34.9672187461371 0.0
    vertex 100.403745070198 5.65155149504179 0.0
  endloop
endfacet
facet normal 0.0 0.0 -1.0
  outer loop
    vertex 100.403745070198 5.65155149504179 0.0
    vertex 99.4462115668026 34.9672187461371 0.0
    vertex 101.854718724524 20.3724159592123 0.0
  endloop
endfacet
facet normal 1.29540891376147e-16 -0.780868809443062 -0.624695047554385
  outer loop
    vertex 97.1921720605197 -10.1921720605197 2.5
    vertex -7.76895288002126 -8.19217206051996 0.0
    vertex 95.1921720605197 -8.19217206051992 0.0
  endloop
endfacet
facet normal 1.29540891376147e-16 -0.780868809443062 -0.624695047554385
  outer loop
    vertex -7.76895288002126 -8.19217206051996 0.0
    vertex 97.1921720605197 -10.1921720605197 2.5
    vertex -9.76895288002126 -10.1921720605197 2.5
  endloop
endfacet
facet normal 0.625661351046366 0.283336488985602 -0.726820684774552
  outer loop
    vertex 96.7689528800213 47.2921720605197 2.5
    vertex 95.1632035971269 44.4218716301029 0.0
    vertex 94.7689528800213 45.2921720605199 0.0
  endloop
endfacet
facet normal 0.625440229177588 0.283327745502574 -0.727014379744111
  outer loop
    vertex 95.1632035971269 44.4218716301029 0.0
    vertex 96.7689528800213 47.2921720605197 2.5
    vertex 99.4462115668026 34.9672187461371 0.0
  endloop
endfacet
facet normal 0.626444929500013 0.283367292591474 -0.726133409087546
  outer loop
    vertex 97.1921720605197 46.3565541659286 2.5
    vertex 99.4462115668026 34.9672187461371 0.0
    vertex 96.7689528800213 47.2921720605197 2.5
  endloop
endfacet
facet normal 0.66690849186799 0.192921275574271 -0.71973220360434
  outer loop
    vertex 99.4462115668026 34.9672187461371 0.0
    vertex 97.1921720605197 46.3565541659286 2.5
    vertex 101.789883730652 36.1923141906043 2.5
  endloop
endfacet
facet normal 0.683243336292858 -0.152278348166132 -0.714135735061059
  outer loop
    vertex 100.403745070198 5.65155149504179 0.0
    vertex 97.1921720605197 -10.1921720605197 2.5
    vertex 95.1921720605197 -8.19217206051992 0.0
  endloop
endfacet
facet normal 0.679108886635273 -0.164707602486413 -0.715319876542081
  outer loop
    vertex 102.801677189688 4.68375040528384 2.5
    vertex 97.1921720605197 -10.1921720605197 2.5
    vertex 100.403745070198 5.65155149504179 0.0
  endloop
endfacet
facet normal -8.24697153716892e-17 0.78086880944305 -0.6246950475544
  outer loop
    vertex -10.1921720605197 47.2921720605197 2.5
    vertex 94.7689528800213 45.2921720605199 0.0
    vertex -8.19217206051973 45.2921720605199 0.0
  endloop
endfacet
facet normal -8.24697153716892e-17 0.78086880944305 -0.6246950475544
  outer loop
    vertex 94.7689528800213 45.2921720605199 0.0
    vertex -10.1921720605197 47.2921720605197 2.5
    vertex 96.7689528800213 47.2921720605197 2.5
  endloop
endfacet
facet normal -0.651508561998044 0.245337383370895 -0.717876146674316
  outer loop
    vertex -10.1921720605197 47.2921720605197 2.5
    vertex -13.4037450701985 31.4484485049581 0.0
    vertex -15.8016771896884 32.4162495947161 2.5
  endloop
endfacet
facet normal -0.651733919725874 0.245350096157541 -0.717667212706721
  outer loop
    vertex -8.19217206051973 45.2921720605199 0.0
    vertex -13.4037450701985 31.4484485049581 0.0
    vertex -10.1921720605197 47.2921720605197 2.5
  endloop
endfacet
endsolid Cache cables BT3
