{
  "manifestVersion": "3.1",
  "impls": {
    "22e9dd89eeed397af7cc15556683442631c29f27eea3b164d8281fb59908be2a": {
      "address": "0x45E27eA9838e1225AC73851E613CA10A0A389621",
      "txHash": "0x6db1cc1250165d00463afe814a36d8985c133183d68d09845d987f7a8b16296c",
      "layout": {
        "storage": [
          {
            "contract": "Initializable",
            "label": "_initialized",
            "type": "t_bool",
            "src": "@openzeppelin/contracts-upgradeable/proxy/utils/Initializable.sol:39"
          },
          {
            "contract": "Initializable",
            "label": "_initializing",
            "type": "t_bool",
            "src": "@openzeppelin/contracts-upgradeable/proxy/utils/Initializable.sol:44"
          },
          {
            "contract": "ContextUpgradeable",
            "label": "__gap",
            "type": "t_array(t_uint256)50_storage",
            "src": "@openzeppelin/contracts-upgradeable/utils/ContextUpgradeable.sol:36"
          },
          {
            "contract": "OwnableUpgradeable",
            "label": "_owner",
            "type": "t_address",
            "src": "@openzeppelin/contracts-upgradeable/access/OwnableUpgradeable.sol:22"
          },
          {
            "contract": "OwnableUpgradeable",
            "label": "__gap",
            "type": "t_array(t_uint256)49_storage",
            "src": "@openzeppelin/contracts-upgradeable/access/OwnableUpgradeable.sol:87"
          },
          {
            "contract": "SignatureVerifier",
            "label": "userNoncesUsed",
            "type": "t_mapping(t_address,t_mapping(t_uint256,t_bool))",
            "src": "src/contracts/utils/SignatureVerifier.sol:31"
          },
          {
            "contract": "SignatureVerifier",
            "label": "_gap",
            "type": "t_array(t_uint256)49_storage",
            "src": "src/contracts/utils/SignatureVerifier.sol:66"
          },
          {
            "contract": "ClaimsRegistry",
            "label": "registryProposedClaims",
            "type": "t_mapping(t_string_memory_ptr,t_mapping(t_address,t_mapping(t_bytes32,t_struct(ClaimProposal)1118_storage)))",
            "src": "src/contracts/ClaimsRegistry.sol:58"
          },
          {
            "contract": "ClaimsRegistry",
            "label": "registryAuditedClaims",
            "type": "t_mapping(t_string_memory_ptr,t_mapping(t_address,t_mapping(t_bytes32,t_struct(ClaimAudit)1132_storage)))",
            "src": "src/contracts/ClaimsRegistry.sol:60"
          },
          {
            "contract": "ClaimsRegistry",
            "label": "_gap",
            "type": "t_array(t_uint256)48_storage",
            "src": "src/contracts/ClaimsRegistry.sol:201"
          }
        ],
        "types": {
          "t_mapping(t_string_memory_ptr,t_mapping(t_address,t_mapping(t_bytes32,t_struct(ClaimProposal)1118_storage)))": {
            "label": "mapping(string => mapping(address => mapping(bytes32 => struct ClaimsRegistry.ClaimProposal)))"
          },
          "t_mapping(t_string_memory_ptr,t_mapping(t_address,t_mapping(t_bytes32,t_struct(ClaimAudit)1132_storage)))": {
            "label": "mapping(string => mapping(address => mapping(bytes32 => struct ClaimsRegistry.ClaimAudit)))"
          },
          "t_array(t_uint256)48_storage": {
            "label": "uint256[48]"
          },
          "t_mapping(t_address,t_mapping(t_uint256,t_bool))": {
            "label": "mapping(address => mapping(uint256 => bool))"
          },
          "t_array(t_uint256)49_storage": {
            "label": "uint256[49]"
          },
          "t_address": {
            "label": "address"
          },
          "t_array(t_uint256)50_storage": {
            "label": "uint256[50]"
          },
          "t_bool": {
            "label": "bool"
          }
        }
      }
    },
    "92c6620c95b3e9bdf33a12eddee5294055bf9d94202a44f1b567f0d5a7d93f3d": {
      "address": "0xFB1EBf2E12139936367e911508D46A679508833d",
      "txHash": "0x1e569aa12399d16fb073460ec1af27d60b79266d72e57e86e1e552402fdd1441",
      "layout": {
        "storage": [
          {
            "contract": "Initializable",
            "label": "_initialized",
            "type": "t_bool",
            "src": "@openzeppelin/contracts-upgradeable/proxy/utils/Initializable.sol:39"
          },
          {
            "contract": "Initializable",
            "label": "_initializing",
            "type": "t_bool",
            "src": "@openzeppelin/contracts-upgradeable/proxy/utils/Initializable.sol:44"
          },
          {
            "contract": "ContextUpgradeable",
            "label": "__gap",
            "type": "t_array(t_uint256)50_storage",
            "src": "@openzeppelin/contracts-upgradeable/utils/ContextUpgradeable.sol:36"
          },
          {
            "contract": "OwnableUpgradeable",
            "label": "_owner",
            "type": "t_address",
            "src": "@openzeppelin/contracts-upgradeable/access/OwnableUpgradeable.sol:22"
          },
          {
            "contract": "OwnableUpgradeable",
            "label": "__gap",
            "type": "t_array(t_uint256)49_storage",
            "src": "@openzeppelin/contracts-upgradeable/access/OwnableUpgradeable.sol:87"
          },
          {
            "contract": "SignatureVerifier",
            "label": "userNoncesUsed",
            "type": "t_mapping(t_address,t_mapping(t_uint256,t_bool))",
            "src": "src/contracts/utils/SignatureVerifier.sol:31"
          },
          {
            "contract": "SignatureVerifier",
            "label": "_gap",
            "type": "t_array(t_uint256)49_storage",
            "src": "src/contracts/utils/SignatureVerifier.sol:66"
          },
          {
            "contract": "ProjectsRegistry",
            "label": "projectIds",
            "type": "t_array(t_string_storage)dyn_storage",
            "src": "src/contracts/ProjectsRegistry.sol:48"
          },
          {
            "contract": "ProjectsRegistry",
            "label": "pendingEdits",
            "type": "t_mapping(t_string_memory_ptr,t_mapping(t_address,t_struct(ProjectDescription)1519_storage))",
            "src": "src/contracts/ProjectsRegistry.sol:51"
          },
          {
            "contract": "ProjectsRegistry",
            "label": "projectsDescription",
            "type": "t_mapping(t_string_memory_ptr,t_struct(ProjectDescription)1519_storage)",
            "src": "src/contracts/ProjectsRegistry.sol:54"
          },
          {
            "contract": "ProjectsRegistry",
            "label": "_gap",
            "type": "t_array(t_uint256)47_storage",
            "src": "src/contracts/ProjectsRegistry.sol:160"
          }
        ],
        "types": {
          "t_array(t_string_storage)dyn_storage": {
            "label": "string[]"
          },
          "t_mapping(t_string_memory_ptr,t_mapping(t_address,t_struct(ProjectDescription)1519_storage))": {
            "label": "mapping(string => mapping(address => struct ProjectsRegistry.ProjectDescription))"
          },
          "t_mapping(t_string_memory_ptr,t_struct(ProjectDescription)1519_storage)": {
            "label": "mapping(string => struct ProjectsRegistry.ProjectDescription)"
          },
          "t_array(t_uint256)47_storage": {
            "label": "uint256[47]"
          },
          "t_mapping(t_address,t_mapping(t_uint256,t_bool))": {
            "label": "mapping(address => mapping(uint256 => bool))"
          },
          "t_array(t_uint256)49_storage": {
            "label": "uint256[49]"
          },
          "t_address": {
            "label": "address"
          },
          "t_array(t_uint256)50_storage": {
            "label": "uint256[50]"
          },
          "t_bool": {
            "label": "bool"
          }
        }
      }
    }
  },
  "admin": {
    "address": "0x0902da402B988be0a78B411021E65311d89bF439",
    "txHash": "0xee3d46441d72806cd1d9287e709fe42a623dbeba053a48c50da089c21d8d866a"
  }
}
