{
  "_format": "hh-sol-artifact-1",
  "contractName": "Strings",
  "sourceName": "@openzeppelin/contracts/utils/Strings.sol",
  "abi": [],
  "bytecode": "0x60566037600b82828239805160001a607314602a57634e487b7160e01b600052600060045260246000fd5b30600052607381538281f3fe73000000000000000000000000000000000000000030146080604052600080fdfea2646970667358221220d9c38d739a33070a1ef8dd4bc7d06de7c1d507465bac301d7177d1231867b0cc64736f6c63430008090033",
  "deployedBytecode": "0x73000000000000000000000000000000000000000030146080604052600080fdfea2646970667358221220d9c38d739a33070a1ef8dd4bc7d06de7c1d507465bac301d7177d1231867b0cc64736f6c63430008090033",
  "linkReferences": {},
  "deployedLinkReferences": {}
}
