{
  "_format": "hh-sol-artifact-1",
  "contractName": "AddressUpgradeable",
  "sourceName": "@openzeppelin/contracts-upgradeable/utils/AddressUpgradeable.sol",
  "abi": [],
  "bytecode": "0x60566037600b82828239805160001a607314602a57634e487b7160e01b600052600060045260246000fd5b30600052607381538281f3fe73000000000000000000000000000000000000000030146080604052600080fdfea2646970667358221220bb5309eac98a6b29ca913ef5e267875be223c45117f2c279a4b0d84a90bd389e64736f6c63430008090033",
  "deployedBytecode": "0x73000000000000000000000000000000000000000030146080604052600080fdfea2646970667358221220bb5309eac98a6b29ca913ef5e267875be223c45117f2c279a4b0d84a90bd389e64736f6c63430008090033",
  "linkReferences": {},
  "deployedLinkReferences": {}
}
