{
  "_format": "hh-sol-artifact-1",
  "contractName": "StringUtils",
  "sourceName": "src/contracts/utils/StringUtils.sol",
  "abi": [],
  "bytecode": "0x60566037600b82828239805160001a607314602a57634e487b7160e01b600052600060045260246000fd5b30600052607381538281f3fe73000000000000000000000000000000000000000030146080604052600080fdfea26469706673582212203e315572c6890c6887c466c1a14162c48ee1cb2b90b7456709cc7a0ff6c2ce5064736f6c63430008090033",
  "deployedBytecode": "0x73000000000000000000000000000000000000000030146080604052600080fdfea26469706673582212203e315572c6890c6887c466c1a14162c48ee1cb2b90b7456709cc7a0ff6c2ce5064736f6c63430008090033",
  "linkReferences": {},
  "deployedLinkReferences": {}
}
