{
  "_format": "hh-sol-artifact-1",
  "contractName": "UpgradeableToV1",
  "sourceName": "src/contracts/utils/UpgradeableToV1.sol",
  "abi": [
    {
      "inputs": [],
      "name": "version",
      "outputs": [
        {
          "internalType": "uint16",
          "name": "",
          "type": "uint16"
        }
      ],
      "stateMutability": "pure",
      "type": "function"
    }
  ],
  "bytecode": "0x6080604052348015600f57600080fd5b50607780601d6000396000f3fe6080604052348015600f57600080fd5b506004361060285760003560e01c806354fd4d5014602d575b600080fd5b604080516001815290519081900360200190f3fea2646970667358221220bc0bd704c9905956e68761bf23f9d386ac28bb71e23e76c1523dcf02cc877e2964736f6c63430008090033",
  "deployedBytecode": "0x6080604052348015600f57600080fd5b506004361060285760003560e01c806354fd4d5014602d575b600080fd5b604080516001815290519081900360200190f3fea2646970667358221220bc0bd704c9905956e68761bf23f9d386ac28bb71e23e76c1523dcf02cc877e2964736f6c63430008090033",
  "linkReferences": {},
  "deployedLinkReferences": {}
}
