{
  "_format": "hh-sol-artifact-1",
  "contractName": "ECDSA",
  "sourceName": "@openzeppelin/contracts/utils/cryptography/ECDSA.sol",
  "abi": [],
  "bytecode": "0x60566037600b82828239805160001a607314602a57634e487b7160e01b600052600060045260246000fd5b30600052607381538281f3fe73000000000000000000000000000000000000000030146080604052600080fdfea2646970667358221220a1b3b6a5d3c5974880b9d1356fa43eaadced91c0f140a62e2ec2d639ecca70f964736f6c63430008090033",
  "deployedBytecode": "0x73000000000000000000000000000000000000000030146080604052600080fdfea2646970667358221220a1b3b6a5d3c5974880b9d1356fa43eaadced91c0f140a62e2ec2d639ecca70f964736f6c63430008090033",
  "linkReferences": {},
  "deployedLinkReferences": {}
}
