#include "core/nn.h"
#include "mnist.h"

#define IN_DIM 784
#define HL1_DIM 512
#define OUT_DIM 10


fixed_point_t fc1_weight_fp[784*512]=
{
64, -64, 64, 64, 64, 64, 64, 64, 64, -64, -64, -64, 64, 64, -64, -64, 64, 64, 64, 64, 64, 64, 64, -64, 64, 64, 64, 64, 64, 64, -64, -64, -64, -64, 64, -64, 64, -64, 64, -64, 64, 64, 64, 64, 64, 64, 64, 64, 64, -64, 64, -64, -64, -64, -64, -64, 64, 64, -64, 64, 64, -64, 64, 64, 64, 64, -64, 64, -64, -64, -64, -64, -64, -64, -64, 64, -64, -64, -64, -64, 64, -64, 64, 64, -64, -64, -64, 64, 64, -64, -64, -64, 64, -64, -64, -64, -64, 64, -64, -64, -64, -64, -64, -64, -64, -64, -64, -64, 64, -64, 64, 64, -64, 64, 64, 64, 64, 64, -64, -64, -64, -64, -64, -64, -64, -64, -64, -64, -64, -64, -64, -64, -64, -64, -64, 64, -64, 64, 64, -64, 64, 64, 64, -64, 64, -64, -64, 64, 64, -64, -64, -64, -64, -64, -64, -64, -64, -64, 64, -64, 64, 64, -64, -64, -64, -64, 64, 64, -64, -64, 64, -64, -64, 64, 64, 64, 64, 64, 64, 64, 64, -64, 64, 64, -64, 64, 64, 64, 64, 64, -64, -64, -64, 64, -64, -64, -64, 64, -64, 64, 64, 64, 64, 64, 64, 64, 64, 64, 64, 64, -64, 64, 64, 64, 64, 64, 64, 64, 64, 64, -64, 64, 64, 64, 64, 64, 64, 64, 64, 64, 64, 64, 64, 64, 64, -64, -64, 64, 64, 64, 64, 64, 64, 64, 64, 64, -64, 64, 64, 64, -64, 64, 64, 64, 64, 64, 64, 64, 64, 64, 64, 64, 64, 64, 64, 64, 64, 64, 64, 64, 64, 64, -64, 64, 64, 64, -64, 64, -64, -64, 64, -64, 64, -64, 64, 64, -64, 64, -64, -64, 64, 64, 64, 64, -64, -64, 64, 64, 64, -64, -64, 64, -64, 64, -64, -64, 64, -64, 64, -64, -64, 64, 64, 64, -64, -64, -64, -64, -64, -64, -64, -64, -64, -64, -64, 64, -64, 64, 64, -64, -64, -64, -64, -64, -64, -64, 64, 64, -64, -64, 64, -64, -64, -64, -64, -64, -64, -64, -64, -64, -64, -64, 64, -64, -64, -64, 64, -64, -64, -64, -64, 64, 64, -64, 64, -64, 64, -64, -64, -64, -64, -64, -64, -64, -64, -64, -64, -64, -64, -64, -64, 64, 64, -64, -64, -64, -64, 64, 64, 64, -64, -64, -64, 64, -64, -64, -64, -64, -64, -64, -64, -64, -64, -64, -64, -64, 64, -64, -64, -64, 64, -64, -64, -64, 64, 64, -64, 64, 64, -64, -64, -64, -64, -64, -64, -64, -64, -64, -64, -64, -64, -64, -64, 64, 64, -64, -64, -64, -64, -64, -64, -64, -64, -64, 64, -64, -64, -64, -64, -64, 64, -64, -64, -64, -64, -64, -64, 64, -64, -64, 64, -64, -64, -64, -64, -64, -64, 64, -64, -64, -64, -64, 64, 64, -64, -64, 64, -64, -64, -64, -64, -64, -64, -64, -64, -64, -64, -64, -64, 64, -64, -64, -64, -64, -64, -64, -64, 64, 64, 64, -64, 64, 64, -64, 64, -64, -64, -64, -64, -64, -64, -64, -64, 64, -64, 64, 64, -64, -64, -64, -64, -64, -64, 64, 64, 64, -64, 64, 64, 64, 64, 64, -64, 64, 64, -64, -64, -64, -64, -64, -64, -64, 64, 64, 64, -64, -64, -64, -64, -64, -64, -64, -64, 64, -64, 64, 64, 64, 64, -64, -64, 64, -64, -64, -64, -64, -64, -64, -64, -64, -64, 64, 64, -64, -64, -64, -64, -64, -64, -64, -64, 64, 64, 64, 64, 64, -64, -64, 64, -64, -64, -64, -64, 64, -64, -64, -64, -64, -64, -64, -64, -64, -64, -64, -64, -64, -64, -64, 64, 64, 64, 64, 64, 64, 64, 64, 64, 64, 64, -64, 64, 64, 64, 64, 64, -64, 64, 64, 64, -64, 64, 64, 64, -64, -64, -64, 64, 64, 64, 64, 64, -64, -64, -64, -64, 64, -64, -64, 64, 64, 64, 64, 64, 64, 64, 64, 64, -64, -64, -64, 64, -64, -64, 64, 64, 64, 64, 64, -64, 64, -64, 64, 64, -64, 64, 64, 64, 64, 64, 64, 64, 64, 64, 64, 64, 64, 64, 64, 64, 64, 64, 64, 64, 64, 64, 64, 64, -64, -64, -64, -64, -64, 64, 64, -64, -64, -64, -64, 64, 64, 64, 64, -64, -64, -64, 64, 64, -64, -64, 64, 64, 64, 64, 64, -64, 64, 64, -64, -64, -64, 64, 64, 64, -64, 64, -64, -64, 64, 64, 64, 64, 64, 64, -64, 64, 64, -64, 64, 64, 64, 64, 64, -64, 64, -64, 64, -64, -64, -64, -64, 64, 64, -64, -64, 64, 64, 64, 64, 64, -64, -64, -64, -64, -64, 64, -64, -64, 64, 64, -64, 64, 64, -64, 64, -64, -64, -64, -64, -64, 64, -64, 64, -64, 64, -64, -64, -64, 64, 64, -64, 64, 64, 64, -64, 64, -64, 64, 64, 64, -64, 64, 64, -64, -64, -64, -64, 64, 64, 64, 64, -64, 64, -64, 64, -64, -64, -64, 64, -64, -64, 64, 64, -64, 64, -64, -64, -64, 64, -64, 64, -64, 64, -64, -64, 64, -64, -64, -64, 64, -64, 64, -64, -64, -64, -64, -64, -64, -64, -64, -64, 64, -64, -64, -64, 64, 64, 64, -64, -64, 64, 64, 64, -64, -64, -64, 64, 64, -64, -64, -64, -64, -64, 64, 64, -64, -64, -64, -64, 64, -64, -64, 64, -64, 64, 64, -64, -64, 64, -64, 64, -64, -64, 64, -64, -64, -64, 64, 64, 64, 64, 64, -64, -64, -64, -64, 64, -64, 64, -64, -64, -64, 64, -64, -64, -64, -64, 64, 64, 64, -64, 64, 64, 64, 64, 64, -64, 64, -64, -64, 64, -64, -64, 64, 64, -64, 64, 64, 64, 64, 64, -64, -64, 64, -64, 64, 64, -64, 64, -64, -64, -64, -64, -64, -64, -64, -64, 64, -64, -64, 64, 64, -64, 64, 64, -64, -64, 64, 64, -64, -64, -64, -64, 64, -64, -64, -64, -64, -64, -64, -64, -64, -64, -64, 64, 64, -64, -64, -64, 64, -64, -64, 64, -64, -64, 64, 64, 64, 64, -64, -64, 64, -64, -64, -64, -64, -64, 64, -64, -64, 64, -64, -64, -64, 64, -64, -64, -64, 64, -64, -64, -64, -64, 64, -64, 64, -64, 64, -64, -64, -64, -64, -64, -64, -64, 64, -64, 64, 64, 64, -64, -64, -64, -64, -64, -64, -64, -64, -64, -64, 64, 64, 64, 64, -64, 64, -64, -64, -64, -64, -64, 64, 64, 64, 64, 64, 64, -64, -64, -64, -64, -64, -64, -64, -64, -64, -64, 64, -64, 64, 64, 64, -64, -64, 64, -64, -64, 64, 64, 64, 64, -64, 64, 64, -64, -64, -64, -64, -64, -64, 64, 64, -64, 64, 64, 64, -64, 64, 64, 64, 64, -64, 64, -64, -64, -64, 64, 64, 64, 64, -64, -64, -64, -64, 64, 64, -64, 64, -64, -64, 64, 64, 64, -64, -64, -64, 64, 64, -64, -64, -64, -64, 64, -64, 64, 64, 64, -64, -64, -64, -64, 64, 64, 64, 64, -64, -64, -64, -64, 64, -64, -64, -64, 64, 64, 64, -64, -64, -64, -64, 64, 64, 64, 64, 64, -64, -64, -64, 64, -64, 64, 64, -64, -64, -64, -64, -64, -64, -64, -64, -64, 64, -64, 64, 64, -64, 64, 64, 64, 64, -64, -64, -64, -64, -64, -64, -64, -64, 64, 64, -64, -64, -64, -64, -64, -64, -64, -64, -64, 64, 64, -64, -64, -64, 64, -64, 64, 64, -64, -64, -64, -64, -64, -64, -64, -64, 64, -64, 64, -64, -64, -64, -64, -64, -64, -64, -64, 64, -64, 64, -64, -64, 64, 64, 64, 64, -64, -64, 64, -64, -64, -64, -64, -64, 64, -64, -64, 64, -64, -64, -64, -64, -64, -64, 64, -64, -64, -64, 64, -64, 64, 64, 64, 64, 64, 64, -64, -64, -64, -64, -64, -64, -64, -64, -64, 64, -64, -64, -64, 64, 64, 64, 64, 64, -64, 64, -64, 64, 64, 64, -64, 64, 64, -64, -64, -64, -64, -64, -64, -64, -64, -64, 64, 64, -64, 64, -64, -64, 64, 64, 64, -64, 64, 64, 64, -64, 64, 64, 64, 64, 64, 64, -64, -64, 64, -64, -64, -64, -64, -64, -64, 64, 64, 64, 64, -64, -64, -64, 64, 64, 64, 64, -64, 64, 64, 64, 64, 64, 64, 64, -64, -64, -64, -64, -64, -64, -64, -64, 64, -64, 64, 64, 64, -64, -64, -64, 64, 64, 64, -64, -64, -64, -64, 64, 64, 64, -64, -64, -64, -64, -64, 64, -64, 64, -64, 64, -64, -64, -64, 64, 64, -64, 64, 64, 64, 64, 64, -64, 64, -64, 64, -64, 64, -64, -64, -64, -64, -64, 64, -64, -64, -64, -64, -64, -64, -64, 64, 64, -64, 64, 64, 64, 64, -64, -64, -64, -64, 64, 64, -64, -64, 64, -64, -64, -64, -64, 64, -64, -64, 64, 64, 64, 64, -64, 64, 64, 64, 64, 64, 64, 64, -64, -64, -64, 64, 64, -64, 64, -64, -64, -64, -64, 64, -64, -64, 64, -64, -64, -64, -64, -64, 64, 64, 64, 64, 64, -64, 64, 64, 64, -64, -64, 64, -64, -64, 64, -64, 64, -64, -64, 64, -64, -64, -64, 64, 64, -64, 64, 64, -64, -64, 64, -64, 64, 64, 64, -64, -64, -64, 64, -64, -64, 64, -64, 64, -64, 64, -64, 64, -64, -64, 64, 64, -64, -64, -64, 64, -64, -64, -64, 64, -64, -64, -64, -64, -64, -64, -64, -64, 64, 64, 64, 64, -64, 64, -64, 64, -64, 64, -64, 64, -64, -64, -64, 64, 64, 64, -64, 64, 64, -64, 64, -64, 64, -64, -64, -64, 64, 64, -64, -64, -64, 64, 64, -64, -64, 64, 64, -64, -64, 64, 64, -64, 64, 64, 64, -64, -64, -64, 64, -64, 64, -64, -64, -64, -64, 64, -64, 64, -64, -64, -64, -64, -64, -64, -64, -64, -64, -64, -64, -64, -64, -64, -64, -64, -64, -64, 64, 64, 64, -64, 64, 64, -64, -64, 64, -64, 64, 64, -64, -64, -64, -64, -64, -64, -64, -64, -64, 64, -64, -64, 64, 64, -64, -64, 64, -64, 64, 64, 64, -64, -64, 64, -64, -64, -64, 64, -64, -64, 64, 64, -64, -64, -64, -64, -64, -64, -64, 64, -64, 64, 64, 64, -64, -64, -64, -64, -64, -64, 64, 64, -64, -64, -64, -64, -64, -64, 64, -64, 64, 64, -64, -64, -64, -64, 64, 64, 64, 64, -64, -64, 64, -64, 64, 64, -64, 64, -64, -64, -64, -64, -64, -64, -64, 64, 64, 64, 64, 64, 64, 64, 64, -64, 64, 64, -64, 64, -64, 64, -64, 64, 64, -64, 64, 64, 64, 64, -64, -64, -64, -64, 64, -64, -64, 64, 64, 64, -64, 64, 64, 64, 64, 64, 64, -64, -64, -64, 64, -64, -64, -64, -64, 64, 64, 64, -64, -64, 64, -64, -64, 64, 64, -64, 64, -64, 64, 64, 64, 64, 64, 64, -64, -64, -64, 64, 64, -64, -64, -64, 64, 64, -64, 64, -64, 64, -64, -64, 64, 64, -64, -64, -64, 64, 64, 64, 64, -64, 64, 64, 64, -64, -64, -64, -64, -64, -64, -64, -64, -64, 64, 64, 64, 64, -64, -64, -64, -64, -64, -64, 64, -64, -64, 64, 64, -64, 64, 64, -64, -64, -64, -64, -64, -64, -64, -64, -64, 64, -64, 64, -64, -64, -64, -64, -64, 64, 64, -64, -64, 64, 64, -64, 64, 64, 64, 64, 64, -64, -64, -64, -64, -64, -64, -64, -64, 64, -64, 64, -64, 64, 64, -64, -64, 64, 64, -64, 64, 64, 64, -64, 64, 64, 64, -64, -64, -64, -64, -64, -64, -64, -64, 64, -64, 64, -64, 64, 64, -64, 64, -64, -64, 64, 64, 64, 64, 64, -64, -64, 64, 64, 64, 64, 64, -64, -64, -64, -64, -64, -64, 64, -64, -64, 64, -64, -64, 64, 64, -64, -64, 64, 64, 64, 64, 64, -64, -64, 64, 64, 64, 64, -64, 64, -64, 64, 64, -64, -64, -64, 64, -64, 64, 64, 64, 64, -64, -64, 64, -64, 64, -64, 64, -64, 64, -64, -64, 64, 64, 64, 64, 64, 64, 64, -64, -64, 64, -64, 64, -64, 64, -64, 64, -64, 64, 64, 64, -64, 64, 64, 64, -64, 64, 64, 64, 64, 64, 64, 64, 64, 64, -64, -64, -64, 64, -64, 64, -64, 64, -64, -64, -64, 64, -64, 64, -64, 64, -64, -64, -64, -64, -64, -64, 64, 64, 64, 64, 64, -64, -64, -64, -64, 64, 64, 64, 64, 64, -64, 64, 64, -64, -64, -64, 64, -64, -64, -64, -64, -64, -64, -64, 64, -64, 64, -64, -64, -64, -64, -64, -64, 64, -64, 64, -64, 64, -64, -64, -64, -64, -64, -64, -64, -64, -64, -64, -64, -64, -64, -64, -64, 64, 64, -64, -64, -64, -64, -64, -64, -64, -64, 64, 64, -64, 64, 64, -64, -64, -64, -64, -64, -64, -64, -64, -64, 64, -64, -64, -64, -64, 64, 64, -64, -64, -64, -64, 64, -64, -64, -64, 64, -64, -64, 64, 64, -64, -64, -64, -64, -64, -64, -64, -64, 64, -64, 64, -64, -64, 64, -64, -64, -64, -64, -64, 64, -64, -64, -64, 64, -64, -64, -64, 64, -64, -64, -64, -64, -64, -64, -64, 64, 64, 64, 64, 64, 64, 64, -64, -64, -64, 64, -64, -64, -64, -64, -64, 64, -64, 64, 64, 64, -64, -64, -64, -64, -64, -64, -64, 64, -64, -64, 64, 64, -64, -64, -64, -64, 64, -64, -64, -64, -64, -64, 64, 64, -64, 64, -64, -64, -64, -64, 64, -64, -64, 64, -64, -64, -64, -64, 64, 64, 64, -64, 64, 64, 64, -64, -64, -64, 64, 64, -64, 64, 64, 64, -64, -64, 64, 64, 64, 64, 64, 64, 64, -64, -64, 64, 64, 64, 64, 64, 64, 64, 64, 64, -64, -64, 64, 64, -64, 64, -64, 64, 64, 64, -64, -64, -64, 64, 64, 64, 64, 64, 64, -64, 64, -64, -64, 64, 64, -64, -64, -64, -64, -64, -64, -64, 64, 64, -64, 64, 64, -64, -64, 64, 64, 64, 64, 64, 64, 64, -64, -64, 64, 64, -64, 64, 64, -64, 64, -64, -64, 64, 64, 64, 64, -64, 64, 64, 64, -64, -64, -64, -64, -64, -64, -64, -64, 64, 64, -64, -64, 64, -64, -64, 64, -64, 64, 64, -64, 64, -64, 64, 64, -64, 64, -64, 64, -64, 64, 64, -64, 64, -64, 64, -64, -64, 64, -64, -64, -64, -64, -64, 64, -64, -64, 64, 64, -64, -64, 64, -64, 64, -64, 64, -64, -64, -64, -64, 64, 64, -64, 64, -64, 64, 64, -64, 64, -64, 64, -64, 64, 64, 64, 64, -64, -64, -64, 64, 64, 64, 64, -64, -64, -64, 64, -64, 64, -64, -64, -64, 64, -64, 64, -64, -64, -64, -64, 64, 64, -64, -64, 64, 64, 64, -64, 64, 64, -64, -64, -64, 64, 64, 64, -64, -64, -64, -64, 64, -64, -64, 64, -64, 64, -64, 64, 64, 64, -64, 64, -64, -64, 64, 64, -64, -64, 64, 64, 64, -64, 64, 64, 64, -64, -64, 64, -64, -64, -64, -64, -64, -64, 64, -64, -64, 64, 64, -64, 64, -64, -64, -64, 64, -64, 64, -64, 64, -64, 64, 64, 64, -64, -64, 64, -64, 64, 64, 64, -64, -64, -64, -64, -64, 64, 64, -64, -64, -64, 64, 64, -64, -64, -64, -64, 64, -64, -64, 64, -64, -64, -64, 64, -64, 64, 64, -64, -64, -64, -64, 64, 64, -64, -64, -64, -64, -64, 64, 64, -64, 64, 64, -64, -64, 64, 64, -64, -64, -64, -64, -64, -64, 64, -64, -64, 64, 64, -64, -64, 64, -64, 64, -64, 64, 64, -64, -64, -64, 64, 64, -64, 64, -64, -64, 64, -64, 64, 64, 64, -64, -64, 64, -64, -64, 64, -64, -64, -64, -64, -64, -64, -64, 64, -64, 64, 64, 64, 64, -64, -64, 64, -64, -64, 64, 64, -64, -64, -64, -64, -64, -64, 64, -64, -64, 64, 64, -64, -64, -64, -64, 64, 64, -64, -64, 64, 64, 64, -64, -64, 64, -64, -64, -64, -64, -64, 64, -64, 64, -64, 64, -64, -64, -64, -64, 64, 64, -64, 64, -64, -64, -64, -64, 64, -64, 64, -64, -64, -64, 64, -64, 64, 64, 64, 64, 64, 64, -64, -64, -64, -64, -64, -64, 64, -64, -64, 64, -64, -64, -64, -64, 64, -64, 64, -64, 64, -64, 64, 64, 64, 64, 64, 64, -64, -64, -64, -64, 64, -64, 64, 64, -64, -64, -64, -64, 64, 64, 64, 64, -64, -64, -64, -64, 64, -64, -64, 64, -64, -64, -64, 64, 64, -64, -64, -64, -64, -64, 64, -64, -64, -64, -64, -64, -64, -64, 64, -64, 64, -64, -64, 64, -64, -64, -64, -64, -64, -64, -64, -64, 64, 64, -64, -64, -64, -64, -64, -64, -64, 64, 64, 64, -64, 64, -64, -64, -64, 64, 64, -64, -64, 64, 64, -64, -64, 64, -64, -64, 64, -64, -64, 64, -64, -64, -64, -64, -64, 64, -64, -64, -64, -64, -64, -64, 64, 64, 64, -64, 64, 64, -64, -64, 64, 64, -64, -64, -64, -64, 64, 64, 64, -64, 64, -64, 64, -64, 64, 64, 64, 64, -64, 64, 64, -64, 64, 64, -64, -64, -64, -64, -64, -64, -64, -64, 64, 64, -64, -64, -64, -64, 64, -64, -64, -64, -64, -64, -64, 64, -64, 64, 64, 64, -64, -64, 64, 64, -64, -64, 64, -64, -64, -64, -64, -64, -64, -64, -64, 64, -64, 64, 64, -64, 64, -64, 64, 64, -64, -64, 64, 64, -64, 64, -64, -64, -64, 64, 64, -64, -64, 64, -64, -64, -64, -64, -64, -64, -64, 64, -64, -64, -64, 64, -64, -64, -64, -64, -64, -64, 64, 64, -64, 64, -64, -64, 64, 64, -64, 64, -64, -64, -64, 64, -64, -64, -64, -64, -64, -64, -64, -64, 64, -64, -64, 64, -64, 64, -64, 64, -64, -64, 64, 64, -64, 64, -64, -64, 64, -64, -64, -64, -64, 64, -64, -64, -64, -64, 64, -64, -64, -64, 64, 64, 64, -64, -64, -64, -64, 64, -64, -64, -64, 64, -64, 64, -64, 64, -64, -64, -64, -64, -64, -64, 64, 64, 64, -64, -64, 64, -64, -64, -64, 64, 64, -64, -64, 64, -64, 64, 64, -64, -64, -64, -64, -64, -64, -64, -64, 64, 64, -64, -64, -64, 64, -64, -64, -64, 64, -64, -64, 64, -64, -64, 64, 64, 64, -64, -64, -64, 64, 64, 64, 64, -64, -64, -64, -64, 64, 64, 64, 64, 64, 64, 64, -64, -64, -64, 64, 64, 64, -64, 64, 64, -64, 64, 64, -64, 64, -64, 64, 64, -64, 64, 64, -64, -64, -64, 64, 64, -64, 64, 64, 64, -64, -64, -64, 64, 64, -64, -64, 64, 64, -64, 64, -64, -64, -64, 64, 64, 64, -64, -64, -64, 64, 64, 64, -64, -64, -64, -64, 64, 64, 64, -64, -64, 64, 64, -64, 64, 64, -64, 64, 64, -64, 64, 64, 64, 64, -64, 64, -64, -64, 64, -64, 64, 64, -64, 64, 64, 64, 64, -64, -64, 64, -64, 64, -64, 64, 64, 64, 64, -64, 64, -64, -64, 64, 64, 64, -64, 64, -64, -64, -64, -64, 64, 64, 64, -64, -64, -64, -64, 64, 64, -64, -64, 64, -64, 64, -64, 64, 64, 64, 64, 64, 64, 64, 64, 64, -64, -64, 64, 64, 64, 64, 64, 64, 64, -64, 64, -64, 64, 64, 64, -64, 64, -64, -64, 64, -64, -64, 64, 64, 64, 64, 64, -64, 64, 64, 64, 64, 64, 64, 64, 64, 64, -64, -64, -64, -64, 64, -64, 64, 64, 64, -64, -64, -64, 64, -64, 64, 64, 64, 64, 64, 64, 64, 64, 64, 64, 64, 64, 64, -64, 64, -64, 64, 64, 64, 64, 64, 64, -64, -64, 64, 64, 64, 64, 64, 64, 64, -64, 64, 64, 64, 64, 64, 64, 64, -64, 64, 64, 64, 64, -64, -64, -64, -64, 64, -64, 64, 64, 64, 64, 64, 64, 64, 64, 64, 64, 64, 64, -64, 64, -64, -64, -64, -64, -64, -64, -64, 64, -64, 64, -64, 64, -64, -64, 64, 64, 64, 64, 64, 64, 64, -64, 64, -64, 64, -64, -64, -64, -64, -64, -64, -64, 64, -64, -64, 64, 64, 64, 64, -64, -64, 64, 64, 64, -64, -64, 64, 64, -64, -64, -64, 64, -64, -64, -64, -64, -64, -64, -64, -64, -64, 64, -64, 64, 64, -64, -64, 64, 64, 64, -64, 64, 64, 64, -64, -64, -64, -64, -64, -64, 64, -64, -64, -64, -64, 64, -64, -64, -64, 64, 64, -64, 64, 64, -64, 64, 64, 64, 64, 64, 64, 64, -64, -64, -64, -64, -64, 64, -64, -64, -64, -64, -64, -64, -64, -64, -64, -64, 64, 64, -64, 64, 64, 64, -64, -64, 64, 64, 64, 64, -64, -64, -64, -64, 64, 64, -64, -64, -64, -64, -64, -64, 64, -64, 64, 64, 64, 64, -64, 64, -64, 64, -64, 64, 64, 64, 64, 64, -64, -64, -64, -64, 64, 64, 64, 64, -64, -64, -64, -64, 64, -64, 64, 64, 64, 64, -64, 64, 64, -64, -64, 64, -64, 64, -64, -64, -64, -64, -64, 64, 64, 64, 64, -64, 64, -64, -64, 64, -64, 64, 64, 64, -64, -64, 64, -64, 64, -64, 64, -64, -64, -64, -64, -64, -64, -64, -64, 64, 64, 64, -64, -64, -64, -64, -64, 64, 64, 64, 64, 64, 64, 64, 64, 64, -64, -64, -64, -64, 64, -64, -64, -64, -64, -64, 64, 64, 64, 64, 64, 64, -64, -64, -64, -64, -64, -64, 64, 64, 64, -64, -64, 64, 64, 64, -64, 64, -64, 64, 64, -64, -64, 64, -64, 64, 64, -64, -64, -64, -64, -64, 64, 64, -64, -64, 64, 64, 64, 64, 64, -64, 64, 64, 64, -64, -64, 64, -64, -64, 64, 64, 64, 64, -64, -64, -64, -64, -64, -64, -64, 64, -64, 64, 64, 64, 64, 64, 64, 64, 64, 64, -64, -64, 64, 64, 64, -64, 64, 64, 64, 64, 64, 64, 64, 64, -64, -64, -64, 64, 64, 64, 64, 64, 64, -64, -64, -64, 64, -64, -64, -64, 64, 64, -64, 64, 64, 64, 64, 64, -64, 64, 64, 64, 64, -64, -64, 64, 64, 64, 64, 64, -64, -64, -64, 64, 64, 64, -64, -64, 64, 64, 64, 64, 64, 64, -64, 64, 64, 64, 64, -64, 64, 64, -64, 64, 64, 64, 64, -64, -64, -64, -64, 64, -64, 64, 64, -64, -64, 64, 64, 64, 64, 64, 64, 64, 64, 64, 64, 64, 64, -64, -64, 64, 64, 64, 64, 64, 64, -64, 64, -64, -64, 64, -64, -64, -64, 64, 64, -64, -64, -64, 64, -64, -64, 64, 64, 64, 64, 64, 64, 64, 64, 64, 64, -64, 64, -64, -64, -64, 64, 64, 64, 64, 64, -64, 64, -64, -64, -64, -64, 64, 64, 64, 64, 64, 64, 64, 64, 64, 64, 64, 64, 64, 64, -64, 64, -64, -64, 64, 64, 64, -64, -64, 64, -64, -64, -64, -64, -64, 64, 64, 64, 64, 64, 64, -64, 64, 64, 64, 64, 64, 64, -64, -64, -64, -64, -64, -64, -64, -64, -64, -64, -64, -64, -64, -64, 64, 64, 64, 64, 64, 64, 64, -64, 64, 64, 64, -64, 64, 64, -64, 64, -64, -64, -64, -64, -64, -64, -64, -64, 64, 64, -64, -64, -64, -64, -64, -64, 64, -64, -64, -64, 64, 64, -64, 64, -64, -64, -64, -64, 64, -64, 64, -64, -64, -64, 64, 64, 64, -64, -64, 64, -64, -64, -64, -64, 64, 64, -64, -64, 64, -64, -64, 64, 64, -64, -64, -64, -64, -64, -64, 64, -64, 64, -64, -64, -64, -64, 64, 64, 64, 64, 64, -64, -64, 64, -64, 64, 64, 64, 64, -64, -64, 64, 64, -64, 64, -64, -64, 64, -64, -64, -64, 64, -64, 64, -64, 64, 64, -64, 64, 64, -64, 64, -64, 64, -64, 64, 64, -64, 64, 64, -64, 64, -64, -64, -64, 64, -64, -64, 64, 64, 64, 64, 64, 64, 64, 64, 64, 64, 64, 64, -64, -64, 64, 64, -64, 64, 64, 64, 64, 64, 64, 64, 64, 64, -64, -64, 64, -64, 64, -64, 64, 64, 64, -64, 64, -64, -64, 64, 64, 64, 64, 64, 64, 64, -64, 64, -64, -64, -64, 64, -64, -64, 64, -64, 64, 64, 64, 64, 64, -64, 64, -64, -64, -64, -64, 64, 64, 64, -64, -64, -64, 64, 64, -64, -64, -64, 64, -64, -64, -64, -64, 64, -64, -64, 64, -64, 64, -64, -64, 64, 64, 64, -64, -64, -64, -64, -64, -64, -64, 64, -64, 64, -64, -64, 64, 64, -64, 64, 64, 64, 64, -64, -64, -64, -64, -64, 64, -64, -64, 64, -64, -64, -64, -64, -64, -64, -64, 64, -64, 64, 64, -64, 64, -64, 64, -64, 64, 64, -64, -64, -64, -64, -64, 64, -64, -64, -64, 64, -64, -64, -64, -64, -64, -64, -64, -64, -64, 64, 64, -64, 64, -64, 64, 64, -64, -64, -64, -64, -64, -64, 64, -64, -64, -64, -64, -64, -64, -64, -64, -64, -64, -64, -64, -64, -64, 64, 64, 64, 64, -64, 64, -64, -64, -64, -64, -64, -64, -64, -64, -64, -64, -64, -64, -64, -64, -64, -64, -64, -64, -64, -64, -64, -64, -64, -64, 64, -64, -64, -64, 64, -64, -64, -64, -64, -64, 64, -64, -64, 64, -64, 64, -64, -64, -64, -64, -64, -64, -64, -64, -64, -64, 64, -64, -64, -64, -64, -64, 64, 64, -64, -64, -64, 64, 64, 64, -64, -64, -64, -64, -64, -64, -64, -64, -64, 64, -64, 64, -64, -64, 64, 64, 64, 64, -64, 64, 64, -64, -64, -64, -64, -64, -64, -64, -64, -64, -64, -64, -64, -64, -64, -64, -64, 64, -64, -64, -64, -64, 64, 64, -64, 64, 64, 64, -64, -64, -64, -64, -64, -64, -64, 64, -64, 64, -64, -64, -64, -64, -64, 64, 64, -64, 64, 64, -64, 64, -64, -64, -64, -64, -64, -64, -64, -64, -64, -64, 64, -64, 64, 64, -64, -64, -64, -64, -64, -64, 64, -64, 64, 64, 64, 64, -64, -64, 64, -64, 64, -64, -64, -64, -64, -64, -64, -64, 64, -64, -64, -64, 64, -64, -64, -64, -64, -64, -64, 64, -64, -64, -64, -64, -64, -64, -64, -64, -64, -64, 64, -64, -64, -64, -64, 64, 64, -64, 64, -64, -64, 64, -64, -64, -64, -64, -64, 64, -64, -64, -64, -64, -64, -64, -64, 64, 64, -64, -64, -64, 64, -64, -64, -64, -64, -64, 64, 64, -64, -64, -64, -64, -64, -64, -64, -64, 64, -64, -64, -64, -64, -64, 64, -64, 64, -64, -64, 64, -64, 64, -64, -64, -64, 64, 64, 64, -64, 64, -64, -64, -64, -64, -64, -64, -64, -64, -64, -64, -64, -64, 64, -64, 64, -64, -64, 64, 64, 64, 64, -64, -64, 64, -64, -64, 64, 64, -64, 64, 64, -64, 64, -64, -64, -64, -64, -64, 64, -64, -64, -64, 64, -64, -64, 64, -64, -64, 64, -64, 64, -64, 64, 64, 64, 64, 64, -64, -64, 64, 64, 64, 64, -64, -64, -64, -64, -64, 64, 64, -64, -64, 64, 64, -64, -64, -64, -64, 64, 64, -64, 64, 64, -64, 64, -64, 64, 64, -64, -64, -64, 64, -64, -64, -64, -64, 64, -64, -64, 64, 64, 64, -64, 64, -64, -64, -64, -64, 64, 64, 64, -64, 64, 64, -64, -64, -64, -64, -64, -64, -64, -64, -64, -64, -64, -64, 64, -64, -64, 64, -64, -64, 64, -64, -64, -64, -64, -64, 64, -64, -64, -64, -64, 64, -64, -64, -64, -64, -64, -64, -64, -64, 64, -64, -64, 64, 64, 64, 64, -64, -64, -64, -64, -64, -64, -64, -64, -64, -64, 64, -64, -64, -64, -64, -64, -64, 64, -64, 64, -64, -64, 64, -64, -64, -64, 64, -64, -64, -64, 64, -64, -64, 64, 64, -64, 64, -64, 64, 64, -64, -64, -64, -64, 64, 64, -64, -64, -64, -64, 64, -64, -64, 64, -64, 64, -64, -64, -64, -64, 64, -64, -64, 64, -64, -64, 64, 64, -64, -64, 64, 64, 64, -64, -64, -64, 64, -64, 64, 64, -64, -64, 64, 64, -64, 64, 64, 64, 64, -64, -64, 64, 64, 64, -64, 64, 64, -64, 64, 64, 64, 64, -64, 64, 64, -64, -64, -64, 64, 64, -64, -64, -64, 64, 64, 64, -64, 64, -64, -64, 64, 64, -64, -64, 64, 64, 64, -64, 64, 64, -64, -64, 64, 64, -64, -64, 64, 64, 64, -64, 64, -64, 64, -64, 64, 64, 64, 64, 64, 64, -64, 64, -64, 64, -64, -64, -64, -64, -64, 64, -64, 64, -64, -64, -64, -64, 64, -64, 64, 64, -64, 64, -64, -64, -64, -64, 64, 64, -64, 64, 64, -64, -64, 64, -64, 64, -64, 64, 64, -64, -64, -64, -64, -64, -64, 64, 64, -64, 64, 64, -64, -64, -64, -64, -64, -64, 64, 64, 64, -64, -64, -64, -64, -64, -64, 64, -64, 64, -64, -64, -64, 64, -64, -64, -64, 64, 64, 64, -64, -64, -64, -64, -64, -64, -64, -64, 64, 64, 64, -64, -64, 64, -64, 64, -64, -64, 64, 64, -64, 64, 64, -64, -64, 64, 64, 64, 64, 64, 64, 64, 64, 64, -64, 64, 64, 64, 64, 64, -64, -64, -64, 64, 64, 64, -64, -64, 64, 64, 64, 64, -64, 64, 64, -64, 64, 64, 64, 64, 64, 64, -64, 64, -64, -64, 64, 64, 64, -64, 64, 64, -64, 64, -64, -64, 64, 64, -64, -64, 64, -64, -64, -64, 64, 64, 64, 64, -64, -64, -64, -64, -64, -64, 64, 64, 64, -64, -64, 64, -64, -64, 64, 64, -64, -64, -64, 64, -64, -64, 64, 64, -64, 64, 64, 64, -64, -64, -64, -64, -64, -64, -64, 64, 64, -64, -64, 64, 64, -64, 64, 64, 64, 64, 64, 64, -64, -64, -64, -64, 64, 64, 64, 64, -64, -64, -64, -64, -64, -64, -64, -64, -64, -64, -64, 64, 64, 64, 64, -64, 64, 64, -64, 64, -64, -64, 64, -64, -64, 64, 64, 64, -64, -64, -64, -64, 64, -64, -64, -64, 64, -64, 64, 64, 64, 64, 64, -64, -64, 64, -64, -64, -64, 64, -64, 64, -64, -64, 64, 64, 64, -64, 64, 64, 64, 64, -64, -64, -64, -64, -64, -64, -64, 64, 64, 64, -64, 64, -64, 64, 64, -64, 64, -64, -64, 64, 64, -64, 64, -64, -64, -64, -64, -64, 64, 64, -64, -64, -64, 64, 64, 64, -64, 64, -64, -64, 64, -64, -64, -64, -64, -64, -64, -64, -64, 64, -64, 64, -64, -64, -64, -64, 64, -64, 64, 64, -64, -64, 64, -64, 64, 64, 64, 64, 64, -64, -64, -64, 64, -64, -64, -64, 64, -64, 64, 64, 64, 64, 64, 64, -64, -64, -64, -64, -64, -64, -64, -64, -64, -64, 64, -64, 64, 64, 64, 64, -64, 64, -64, 64, 64, -64, 64, -64, -64, 64, -64, 64, 64, -64, 64, -64, -64, -64, 64, -64, -64, 64, -64, -64, -64, -64, -64, -64, -64, 64, -64, -64, -64, 64, -64, 64, -64, 64, -64, -64, 64, 64, -64, 64, 64, -64, -64, -64, 64, 64, 64, -64, -64, -64, 64, -64, -64, -64, -64, -64, -64, -64, -64, -64, -64, 64, -64, -64, 64, 64, -64, 64, -64, -64, -64, -64, 64, 64, 64, 64, -64, -64, 64, -64, -64, -64, -64, 64, 64, 64, -64, -64, -64, -64, -64, -64, 64, 64, 64, 64, 64, -64, 64, 64, 64, 64, 64, 64, 64, 64, -64, 64, -64, -64, -64, -64, -64, -64, -64, -64, -64, -64, -64, 64, 64, -64, -64, -64, -64, -64, 64, -64, 64, -64, -64, -64, 64, 64, 64, 64, -64, -64, -64, -64, -64, -64, -64, -64, 64, 64, 64, 64, 64, 64, -64, -64, -64, -64, 64, -64, -64, 64, -64, -64, 64, -64, 64, 64, 64, 64, -64, -64, -64, -64, -64, 64, 64, -64, -64, -64, -64, -64, -64, -64, 64, 64, -64, 64, 64, -64, 64, 64, 64, 64, -64, 64, 64, 64, 64, -64, -64, -64, -64, 64, 64, 64, 64, -64, -64, -64, -64, 64, -64, 64, 64, -64, -64, 64, -64, 64, 64, -64, 64, 64, 64, 64, 64, 64, 64, 64, 64, 64, -64, 64, -64, -64, -64, -64, -64, -64, 64, 64, -64, 64, -64, 64, -64, 64, -64, -64, -64, 64, 64, 64, 64, 64, -64, -64, 64, -64, -64, -64, -64, -64, 64, 64, -64, -64, -64, -64, 64, -64, -64, 64, 64, 64, -64, -64, -64, -64, -64, -64, 64, -64, -64, -64, -64, -64, -64, -64, -64, 64, 64, -64, -64, -64, -64, 64, -64, -64, 64, 64, -64, -64, 64, -64, 64, -64, -64, 64, -64, -64, -64, -64, -64, -64, 64, 64, 64, 64, 64, -64, 64, -64, -64, 64, 64, 64, 64, -64, 64, -64, -64, 64, -64, 64, 64, -64, -64, 64, -64, -64, -64, 64, -64, -64, -64, 64, 64, 64, 64, -64, 64, -64, -64, -64, -64, 64, 64, -64, -64, 64, -64, 64, -64, -64, -64, -64, 64, -64, 64, 64, -64, 64, -64, 64, 64, -64, 64, 64, -64, 64, -64, -64, 64, 64, -64, 64, 64, -64, 64, -64, -64, 64, 64, -64, 64, 64, 64, 64, 64, -64, -64, 64, -64, 64, -64, -64, -64, 64, -64, -64, -64, 64, -64, 64, -64, 64, 64, 64, 64, 64, -64, 64, 64, -64, 64, 64, 64, -64, -64, -64, -64, 64, 64, -64, -64, -64, -64, -64, 64, 64, -64, 64, -64, 64, -64, 64, 64, 64, 64, -64, 64, -64, -64, -64, -64, -64, -64, -64, 64, 64, -64, -64, 64, 64, -64, 64, 64, 64, 64, 64, -64, 64, -64, -64, -64, 64, 64, 64, 64, 64, 64, -64, 64, -64, 64, -64, 64, 64, 64, 64, -64, -64, 64, 64, 64, -64, 64, -64, 64, 64, 64, 64, 64, 64, 64, -64, 64, 64, 64, 64, 64, 64, 64, 64, -64, -64, 64, -64, -64, -64, 64, -64, 64, 64, -64, 64, -64, 64, -64, -64, -64, 64, 64, -64, -64, -64, 64, 64, 64, 64, -64, -64, 64, -64, 64, 64, 64, 64, 64, -64, -64, -64, -64, -64, -64, -64, 64, -64, 64, 64, 64, -64, 64, 64, 64, -64, 64, 64, 64, -64, 64, -64, -64, 64, 64, 64, -64, 64, 64, -64, 64, 64, 64, 64, -64, -64, 64, 64, 64, 64, -64, 64, 64, 64, 64, 64, -64, 64, 64, -64, 64, -64, 64, -64, 64, -64, 64, 64, -64, -64, 64, -64, -64, 64, 64, 64, 64, 64, -64, 64, 64, -64, 64, 64, 64, -64, -64, 64, 64, 64, 64, 64, 64, 64, 64, -64, -64, -64, -64, -64, -64, 64, -64, 64, -64, 64, 64, -64, 64, 64, 64, -64, 64, -64, 64, 64, -64, 64, -64, 64, -64, 64, 64, -64, -64, 64, 64, -64, 64, -64, -64, 64, 64, 64, 64, -64, 64, -64, -64, 64, -64, -64, -64, 64, 64, 64, -64, -64, -64, -64, 64, -64, 64, 64, 64, -64, -64, -64, 64, 64, 64, 64, -64, -64, 64, -64, 64, 64, 64, 64, 64, -64, -64, -64, -64, -64, -64, 64, 64, -64, -64, -64, 64, -64, -64, -64, -64, 64, 64, 64, -64, 64, 64, 64, 64, 64, 64, 64, -64, -64, 64, -64, -64, 64, -64, -64, 64, -64, 64, 64, -64, 64, -64, -64, -64, 64, 64, 64, -64, -64, -64, -64, -64, 64, 64, 64, 64, 64, 64, 64, 64, -64, -64, 64, 64, 64, 64, -64, -64, -64, 64, 64, -64, 64, 64, 64, -64, 64, 64, 64, 64, 64, 64, -64, 64, 64, -64, 64, 64, 64, 64, -64, -64, 64, 64, 64, 64, 64, -64, 64, 64, 64, 64, 64, -64, -64, 64, 64, 64, 64, -64, -64, -64, 64, 64, 64, 64, 64, 64, -64, -64, 64, 64, 64, -64, -64, -64, 64, 64, 64, -64, 64, 64, 64, 64, 64, 64, 64, 64, 64, -64, 64, -64, 64, -64, 64, 64, 64, -64, 64, 64, 64, -64, -64, 64, 64, 64, -64, 64, -64, 64, 64, 64, -64, 64, 64, 64, -64, 64, 64, 64, -64, 64, -64, -64, -64, 64, -64, 64, 64, 64, -64, -64, 64, 64, 64, 64, -64, 64, 64, 64, 64, 64, 64, 64, 64, 64, -64, 64, 64, -64, 64, 64, -64, 64, -64, 64, -64, -64, -64, -64, 64, -64, 64, -64, 64, 64, 64, -64, -64, 64, 64, 64, 64, -64, 64, 64, 64, 64, 64, 64, 64, -64, -64, 64, 64, -64, -64, 64, -64, 64, -64, -64, 64, -64, -64, -64, 64, 64, 64, 64, 64, 64, 64, 64, -64, 64, -64, -64, -64, -64, -64, -64, 64, 64, -64, 64, -64, -64, -64, 64, 64, 64, -64, -64, 64, 64, 64, 64, -64, 64, 64, -64, 64, 64, -64, 64, 64, -64, -64, -64, -64, 64, -64, -64, -64, -64, 64, -64, 64, 64, 64, 64, -64, -64, -64, -64, 64, -64, -64, 64, 64, 64, -64, -64, -64, 64, -64, 64, -64, -64, 64, 64, -64, 64, 64, 64, 64, 64, -64, -64, -64, -64, 64, -64, 64, 64, -64, -64, -64, 64, -64, -64, 64, -64, -64, -64, 64, -64, -64, 64, -64, 64, -64, 64, -64, 64, 64, 64, -64, -64, 64, 64, 64, 64, -64, -64, -64, -64, -64, -64, -64, -64, -64, 64, 64, 64, -64, -64, -64, -64, 64, 64, 64, -64, -64, 64, -64, -64, 64, -64, 64, -64, -64, -64, 64, 64, 64, -64, -64, -64, -64, 64, -64, 64, -64, 64, 64, -64, -64, 64, -64, 64, -64, 64, -64, -64, 64, -64, -64, -64, -64, -64, -64, -64, 64, -64, -64, -64, 64, -64, -64, 64, 64, -64, 64, 64, 64, 64, -64, 64, -64, 64, 64, 64, 64, -64, 64, -64, -64, 64, 64, -64, 64, -64, 64, -64, -64, 64, -64, -64, 64, 64, -64, 64, 64, -64, 64, -64, 64, -64, 64, 64, 64, 64, -64, 64, -64, -64, -64, 64, -64, -64, -64, 64, -64, 64, 64, -64, 64, 64, 64, 64, 64, -64, -64, -64, 64, 64, 64, 64, 64, 64, -64, 64, -64, -64, 64, -64, -64, 64, 64, 64, -64, 64, 64, 64, 64, 64, -64, 64, 64, -64, -64, 64, 64, 64, -64, 64, -64, 64, -64, -64, -64, -64, 64, 64, 64, -64, -64, -64, -64, 64, 64, 64, -64, -64, -64, -64, 64, 64, -64, 64, 64, 64, -64, 64, 64, 64, -64, -64, -64, -64, -64, -64, 64, 64, 64, 64, 64, 64, -64, -64, -64, 64, -64, -64, 64, 64, 64, 64, 64, 64, -64, 64, 64, -64, 64, -64, -64, -64, -64, 64, 64, 64, -64, -64, 64, -64, 64, 64, -64, 64, -64, 64, -64, -64, 64, 64, 64, 64, 64, 64, 64, 64, 64, -64, 64, 64, -64, 64, 64, 64, 64, -64, -64, -64, -64, 64, -64, -64, -64, -64, 64, 64, 64, 64, 64, 64, 64, 64, 64, 64, 64, 64, -64, 64, 64, -64, -64, -64, -64, 64, -64, -64, 64, 64, -64, -64, -64, -64, -64, 64, 64, 64, 64, 64, 64, 64, 64, 64, 64, 64, -64, -64, 64, -64, -64, -64, -64, 64, 64, -64, 64, -64, -64, 64, -64, -64, 64, 64, 64, -64, 64, 64, 64, 64, 64, -64, -64, -64, -64, -64, 64, 64, 64, 64, 64, 64, -64, -64, -64, 64, 64, 64, -64, 64, 64, 64, 64, 64, 64, 64, 64, 64, -64, -64, -64, 64, 64, 64, 64, -64, 64, -64, -64, -64, 64, -64, 64, 64, 64, -64, 64, 64, 64, 64, 64, 64, 64, 64, 64, 64, -64, -64, -64, -64, 64, 64, -64, -64, -64, -64, 64, 64, 64, 64, 64, -64, 64, 64, 64, 64, 64, 64, 64, 64, -64, 64, -64, -64, -64, -64, -64, -64, 64, -64, -64, -64, 64, 64, -64, 64, 64, 64, 64, -64, 64, 64, 64, 64, 64, 64, 64, -64, -64, -64, -64, -64, -64, -64, -64, 64, 64, -64, -64, -64, 64, -64, 64, -64, 64, -64, 64, -64, 64, -64, 64, 64, 64, 64, 64, -64, -64, -64, -64, 64, -64, -64, 64, 64, 64, -64, 64, 64, -64, -64, -64, -64, -64, 64, 64, -64, -64, -64, 64, 64, -64, 64, 64, -64, -64, -64, -64, -64, -64, 64, 64, 64, 64, -64, 64, 64, 64, -64, 64, 64, 64, 64, -64, -64, -64, -64, -64, -64, 64, -64, 64, -64, -64, -64, -64, 64, 64, 64, 64, 64, -64, -64, 64, 64, -64, 64, 64, 64, 64, 64, -64, 64, -64, 64, 64, 64, 64, 64, 64, 64, -64, -64, -64, -64, -64, 64, -64, 64, 64, 64, -64, 64, 64, 64, 64, 64, 64, -64, -64, 64, -64, 64, -64, 64, 64, 64, 64, 64, 64, 64, 64, 64, -64, -64, 64, 64, 64, 64, 64, 64, 64, 64, 64, 64, 64, 64, -64, -64, -64, -64, 64, -64, 64, 64, 64, 64, 64, 64, 64, 64, -64, 64, 64, 64, 64, -64, -64, 64, -64, 64, -64, 64, 64, -64, -64, -64, -64, 64, 64, 64, 64, -64, 64, 64, 64, 64, -64, 64, 64, 64, -64, 64, 64, -64, -64, 64, -64, -64, -64, -64, -64, -64, -64, -64, -64, -64, -64, 64, 64, 64, -64, 64, 64, 64, 64, -64, 64, 64, 64, 64, 64, -64, 64, -64, 64, 64, 64, -64, 64, -64, -64, -64, -64, -64, -64, 64, 64, 64, 64, 64, 64, -64, -64, -64, 64, -64, -64, 64, 64, 64, 64, 64, 64, 64, 64, -64, 64, 64, -64, -64, -64, -64, -64, -64, 64, -64, 64, 64, 64, -64, -64, -64, 64, 64, 64, 64, 64, 64, -64, 64, 64, 64, -64, -64, -64, -64, -64, -64, -64, -64, -64, 64, 64, 64, 64, -64, -64, 64, -64, 64, 64, 64, 64, 64, 64, 64, -64, -64, 64, 64, -64, 64, -64, 64, -64, -64, 64, -64, 64, 64, 64, 64, 64, 64, 64, 64, 64, 64, 64, 64, 64, -64, 64, 64, 64, -64, -64, 64, 64, -64, -64, -64, -64, -64, -64, 64, -64, 64, -64, -64, -64, 64, 64, 64, 64, -64, 64, -64, 64, -64, -64, 64, -64, -64, 64, 64, -64, 64, 64, 64, -64, -64, -64, 64, 64, 64, 64, 64, -64, 64, -64, 64, 64, -64, -64, -64, -64, -64, 64, -64, 64, -64, -64, 64, 64, 64, 64, 64, -64, -64, -64, -64, 64, 64, 64, 64, -64, 64, -64, 64, 64, -64, 64, 64, 64, 64, 64, -64, -64, 64, -64, -64, 64, 64, 64, 64, -64, 64, 64, -64, -64, 64, -64, -64, -64, 64, 64, 64, 64, -64, 64, -64, 64, -64, 64, 64, 64, -64, 64, 64, 64, 64, 64, -64, 64, 64, 64, 64, -64, 64, 64, -64, -64, -64, 64, 64, -64, -64, 64, 64, 64, -64, 64, 64, 64, 64, 64, -64, 64, 64, 64, -64, 64, 64, 64, 64, 64, -64, -64, 64, 64, -64, -64, 64, 64, -64, 64, 64, 64, -64, 64, 64, -64, 64, 64, -64, -64, 64, 64, 64, 64, -64, 64, 64, 64, 64, -64, 64, 64, 64, 64, 64, -64, -64, 64, -64, -64, -64, -64, 64, 64, 64, 64, 64, 64, 64, 64, -64, -64, -64, 64, 64, 64, -64, -64, 64, -64, 64, -64, 64, -64, 64, 64, -64, 64, 64, 64, -64, 64, -64, -64, -64, 64, -64, -64, -64, 64, -64, 64, -64, -64, -64, -64, -64, -64, 64, -64, -64, -64, -64, -64, -64, -64, -64, -64, -64, -64, -64, -64, 64, 64, 64, 64, 64, -64, 64, -64, 64, -64, -64, -64, -64, -64, -64, 64, -64, -64, -64, -64, -64, -64, -64, 64, -64, -64, 64, -64, -64, 64, 64, 64, 64, 64, 64, -64, -64, 64, -64, -64, -64, 64, 64, -64, -64, -64, -64, 64, 64, -64, -64, 64, 64, 64, -64, -64, 64, 64, 64, -64, -64, -64, -64, -64, 64, -64, -64, -64, -64, -64, -64, -64, -64, 64, -64, -64, 64, -64, -64, -64, -64, -64, 64, -64, 64, -64, -64, 64, -64, 64, 64, -64, -64, -64, -64, -64, -64, -64, 64, -64, 64, 64, -64, 64, -64, 64, -64, -64, -64, -64, -64, -64, -64, 64, 64, 64, 64, 64, 64, 64, -64, -64, 64, -64, -64, -64, -64, -64, -64, -64, -64, 64, -64, -64, -64, -64, -64, -64, -64, -64, -64, -64, -64, 64, -64, 64, -64, 64, 64, 64, 64, -64, -64, -64, -64, -64, -64, -64, -64, -64, 64, 64, -64, -64, 64, -64, -64, -64, 64, 64, 64, -64, 64, -64, -64, 64, 64, -64, -64, -64, -64, -64, -64, -64, -64, -64, -64, -64, -64, 64, -64, 64, 64, 64, 64, -64, 64, -64, 64, -64, -64, -64, -64, -64, -64, 64, 64, 64, -64, -64, -64, -64, -64, -64, -64, -64, -64, -64, 64, 64, -64, -64, -64, -64, 64, -64, -64, -64, -64, -64, -64, 64, 64, 64, -64, -64, -64, 64, -64, -64, -64, -64, -64, -64, -64, -64, 64, -64, -64, -64, 64, -64, -64, -64, 64, 64, -64, 64, -64, -64, -64, 64, 64, 64, -64, -64, 64, -64, -64, 64, -64, 64, -64, -64, -64, -64, 64, -64, -64, 64, -64, 64, 64, -64, -64, 64, -64, 64, -64, 64, 64, 64, -64, -64, 64, -64, -64, -64, -64, -64, -64, 64, 64, -64, 64, 64, 64, 64, 64, -64, -64, 64, -64, -64, 64, -64, -64, -64, 64, 64, -64, -64, -64, 64, 64, -64, -64, -64, -64, 64, -64, 64, -64, -64, 64, -64, 64, 64, 64, -64, -64, -64, 64, -64, -64, -64, -64, -64, -64, 64, 64, -64, -64, -64, -64, -64, -64, 64, -64, -64, -64, -64, 64, -64, 64, 64, 64, -64, -64, 64, -64, -64, -64, -64, -64, -64, 64, 64, -64, -64, -64, -64, -64, -64, 64, 64, -64, 64, 64, -64, -64, -64, -64, 64, -64, -64, 64, -64, -64, 64, 64, 64, 64, 64, -64, 64, 64, -64, 64, -64, -64, 64, 64, -64, 64, 64, -64, -64, -64, -64, 64, -64, 64, -64, -64, -64, 64, 64, -64, -64, -64, -64, 64, -64, 64, -64, -64, -64, 64, 64, 64, -64, -64, 64, -64, -64, 64, -64, -64, 64, 64, 64, -64, -64, 64, 64, -64, -64, -64, -64, 64, -64, -64, -64, -64, -64, 64, -64, -64, -64, -64, -64, -64, 64, -64, 64, -64, 64, -64, -64, 64, -64, 64, 64, 64, 64, -64, -64, -64, -64, -64, -64, -64, -64, -64, -64, -64, -64, -64, -64, 64, -64, 64, -64, -64, 64, -64, 64, 64, -64, 64, 64, -64, 64, 64, -64, -64, -64, -64, -64, -64, -64, -64, -64, 64, -64, -64, -64, -64, -64, 64, -64, -64, -64, 64, -64, -64, 64, 64, -64, 64, -64, -64, -64, 64, 64, -64, 64, 64, 64, 64, 64, 64, -64, -64, 64, 64, -64, -64, -64, -64, 64, 64, -64, 64, -64, -64, -64, -64, 64, 64, -64, -64, -64, -64, -64, -64, -64, -64, -64, 64, 64, 64, 64, -64, 64, -64, -64, 64, -64, -64, -64, -64, -64, -64, 64, -64, 64, 64, -64, 64, 64, 64, -64, 64, -64, -64, -64, 64, -64, -64, -64, -64, -64, 64, 64, 64, -64, -64, -64, -64, -64, -64, -64, 64, 64, -64, 64, 64, -64, -64, 64, 64, -64, 64, -64, 64, -64, 64, -64, -64, -64, 64, -64, -64, -64, 64, 64, -64, -64, -64, 64, 64, 64, -64, 64, 64, -64, 64, -64, 64, 64, 64, 64, -64, -64, -64, 64, 64, 64, 64, -64, -64, -64, -64, -64, -64, -64, -64, -64, -64, 64, 64, 64, 64, 64, 64, 64, 64, 64, 64, 64, 64, 64, -64, 64, -64, -64, -64, 64, 64, 64, 64, -64, -64, 64, 64, 64, 64, 64, 64, 64, 64, 64, 64, 64, 64, 64, 64, 64, 64, 64, 64, 64, 64, -64, -64, -64, -64, -64, -64, -64, 64, -64, 64, 64, 64, 64, 64, 64, 64, -64, 64, -64, 64, 64, 64, 64, 64, 64, -64, -64, -64, -64, -64, -64, -64, 64, -64, -64, 64, 64, 64, 64, -64, 64, 64, 64, 64, 64, -64, -64, 64, -64, 64, -64, -64, -64, -64, -64, -64, -64, -64, -64, -64, 64, -64, -64, -64, -64, 64, 64, 64, 64, 64, 64, 64, -64, -64, -64, -64, 64, -64, 64, -64, -64, -64, -64, 64, 64, 64, -64, -64, -64, -64, -64, 64, -64, 64, 64, 64, 64, 64, 64, 64, 64, -64, -64, -64, 64, 64, 64, -64, -64, 64, -64, 64, 64, 64, -64, -64, -64, -64, 64, 64, 64, 64, 64, 64, 64, 64, 64, 64, -64, -64, -64, -64, 64, 64, 64, 64, 64, -64, 64, 64, 64, 64, -64, -64, -64, 64, 64, 64, 64, 64, 64, 64, 64, 64, 64, 64, -64, -64, -64, 64, 64, 64, 64, -64, 64, 64, 64, 64, 64, 64, -64, 64, -64, 64, -64, 64, 64, 64, 64, 64, 64, 64, 64, 64, -64, -64, -64, 64, 64, 64, 64, 64, 64, 64, 64, 64, 64, 64, -64, -64, 64, -64, 64, 64, 64, 64, 64, 64, 64, 64, 64, -64, -64, -64, -64, 64, -64, 64, -64, 64, 64, 64, 64, 64, 64, 64, 64, 64, 64, -64, 64, 64, 64, -64, 64, 64, 64, 64, 64, -64, -64, -64, -64, -64, 64, -64, 64, 64, -64, 64, 64, 64, 64, 64, 64, 64, -64, -64, 64, 64, -64, -64, -64, 64, 64, -64, -64, 64, -64, -64, -64, -64, -64, -64, -64, -64, -64, 64, 64, 64, 64, 64, 64, 64, 64, -64, -64, 64, 64, -64, 64, 64, 64, 64, 64, 64, -64, -64, -64, -64, -64, 64, -64, 64, -64, 64, 64, 64, 64, 64, 64, 64, 64, 64, 64, -64, -64, -64, 64, 64, 64, 64, 64, 64, 64, -64, 64, 64, -64, -64, -64, 64, -64, 64, -64, 64, 64, 64, 64, 64, -64, -64, -64, -64, -64, -64, 64, -64, 64, 64, 64, 64, 64, 64, 64, -64, 64, -64, 64, -64, 64, 64, 64, 64, 64, 64, 64, 64, -64, -64, 64, -64, -64, 64, -64, -64, -64, -64, 64, 64, 64, 64, 64, 64, -64, -64, 64, -64, -64, -64, 64, 64, 64, 64, 64, 64, -64, -64, 64, 64, 64, -64, -64, -64, -64, -64, 64, 64, 64, 64, 64, 64, -64, -64, 64, 64, 64, 64, 64, -64, 64, 64, 64, 64, 64, 64, -64, -64, -64, -64, -64, -64, 64, 64, 64, 64, 64, 64, 64, 64, 64, 64, -64, -64, 64, 64, 64, 64, 64, 64, -64, -64, 64, 64, -64, -64, -64, -64, -64, 64, 64, 64, -64, -64, 64, 64, 64, 64, 64, -64, -64, -64, 64, 64, 64, 64, 64, -64, -64, -64, -64, -64, -64, -64, 64, 64, 64, -64, 64, 64, 64, 64, 64, 64, -64, -64, -64, 64, -64, 64, -64, 64, 64, 64, 64, 64, -64, 64, -64, -64, -64, -64, -64, 64, 64, 64, 64, 64, -64, -64, -64, 64, -64, -64, 64, -64, -64, -64, -64, 64, 64, 64, -64, 64, 64, 64, 64, 64, -64, -64, 64, 64, 64, -64, -64, -64, -64, -64, 64, 64, -64, 64, -64, -64, -64, -64, -64, 64, 64, -64, -64, -64, -64, 64, 64, 64, -64, 64, -64, 64, -64, 64, 64, 64, -64, -64, -64, 64, -64, 64, 64, 64, -64, -64, 64, -64, -64, 64, -64, 64, -64, 64, 64, 64, -64, -64, -64, 64, -64, -64, -64, -64, 64, -64, -64, -64, -64, 64, 64, 64, 64, 64, 64, 64, 64, 64, -64, -64, 64, -64, -64, -64, -64, -64, 64, 64, -64, -64, -64, -64, -64, 64, 64, 64, -64, -64, 64, -64, -64, -64, -64, 64, 64, 64, 64, -64, 64, 64, -64, -64, 64, -64, 64, -64, -64, -64, -64, 64, 64, -64, -64, 64, -64, -64, 64, -64, -64, -64, -64, -64, 64, -64, 64, 64, -64, 64, -64, -64, -64, 64, -64, 64, -64, -64, 64, -64, 64, 64, 64, 64, -64, 64, 64, -64, -64, 64, 64, 64, 64, -64, 64, -64, 64, 64, 64, 64, -64, 64, 64, 64, 64, -64, 64, 64, 64, -64, 64, -64, 64, 64, 64, -64, -64, 64, 64, 64, -64, -64, 64, 64, 64, -64, 64, -64, 64, -64, 64, -64, 64, -64, -64, -64, 64, 64, -64, 64, -64, -64, -64, -64, -64, 64, 64, -64, -64, 64, 64, 64, -64, -64, 64, 64, -64, -64, 64, 64, 64, -64, 64, 64, -64, 64, 64, 64, 64, -64, 64, -64, -64, 64, 64, 64, -64, 64, -64, 64, -64, -64, 64, -64, 64, 64, 64, -64, -64, 64, 64, 64, 64, 64, 64, 64, 64, -64, -64, -64, -64, 64, 64, -64, -64, 64, -64, 64, 64, -64, -64, 64, -64, -64, 64, 64, 64, -64, 64, 64, 64, -64, -64, 64, 64, -64, 64, 64, 64, 64, 64, 64, -64, 64, -64, 64, 64, 64, -64, 64, -64, -64, -64, -64, -64, 64, 64, 64, -64, 64, 64, 64, 64, -64, -64, -64, 64, 64, 64, 64, 64, 64, 64, -64, -64, -64, 64, -64, 64, -64, 64, 64, 64, 64, -64, 64, 64, 64, 64, 64, 64, 64, 64, 64, 64, -64, 64, -64, 64, -64, -64, 64, 64, 64, 64, -64, -64, -64, -64, -64, -64, 64, -64, -64, 64, 64, -64, 64, 64, 64, -64, -64, 64, 64, -64, 64, 64, -64, 64, 64, -64, 64, -64, 64, -64, 64, -64, -64, 64, 64, -64, 64, 64, 64, 64, -64, 64, 64, 64, -64, 64, 64, 64, -64, 64, -64, 64, 64, 64, 64, 64, 64, 64, 64, 64, -64, -64, 64, -64, 64, 64, 64, 64, 64, 64, -64, 64, -64, 64, 64, 64, 64, 64, -64, 64, 64, -64, 64, -64, 64, 64, 64, -64, 64, 64, 64, -64, 64, -64, -64, 64, 64, 64, 64, 64, -64, 64, 64, -64, -64, 64, -64, 64, 64, 64, -64, -64, 64, -64, 64, 64, -64, 64, 64, 64, -64, 64, -64, 64, 64, 64, 64, 64, 64, 64, 64, 64, 64, -64, -64, 64, -64, 64, -64, 64, 64, -64, -64, 64, -64, 64, 64, 64, 64, 64, 64, 64, 64, 64, 64, -64, -64, 64, 64, 64, 64, 64, 64, 64, 64, 64, 64, -64, 64, 64, 64, -64, -64, -64, 64, 64, 64, -64, 64, 64, 64, 64, 64, 64, 64, 64, 64, 64, 64, -64, -64, -64, -64, 64, 64, 64, -64, 64, -64, 64, -64, 64, 64, -64, -64, 64, 64, 64, 64, 64, -64, 64, 64, 64, 64, 64, 64, 64, 64, 64, -64, -64, -64, -64, 64, 64, 64, 64, -64, 64, 64, 64, 64, -64, 64, 64, 64, 64, -64, -64, -64, 64, 64, 64, 64, -64, 64, -64, 64, 64, -64, 64, 64, 64, -64, -64, 64, -64, -64, -64, -64, 64, 64, -64, 64, 64, 64, -64, 64, 64, -64, -64, 64, 64, 64, -64, 64, 64, 64, -64, -64, 64, -64, 64, -64, 64, 64, -64, 64, -64, 64, 64, 64, 64, 64, 64, -64, 64, 64, -64, 64, 64, 64, -64, 64, -64, 64, 64, 64, -64, 64, 64, -64, 64, -64, 64, 64, 64, 64, 64, 64, 64, 64, -64, 64, -64, -64, -64, 64, -64, 64, 64, 64, 64, -64, -64, -64, 64, -64, 64, 64, 64, 64, -64, -64, 64, 64, 64, 64, 64, 64, 64, -64, 64, 64, -64, 64, -64, 64, -64, -64, 64, 64, -64, -64, -64, 64, -64, -64, -64, 64, 64, -64, 64, -64, -64, 64, 64, -64, -64, -64, -64, 64, 64, 64, 64, 64, -64, -64, -64, 64, -64, 64, 64, 64, -64, 64, 64, 64, 64, -64, 64, 64, 64, 64, 64, 64, 64, -64, -64, -64, -64, -64, -64, 64, -64, -64, 64, 64, -64, -64, -64, 64, -64, -64, -64, 64, 64, 64, 64, 64, 64, -64, 64, 64, 64, 64, 64, 64, 64, -64, 64, -64, -64, -64, 64, 64, -64, 64, 64, -64, 64, -64, 64, -64, -64, 64, -64, 64, 64, 64, 64, 64, 64, 64, 64, 64, 64, 64, -64, -64, 64, -64, 64, -64, 64, 64, -64, 64, -64, -64, 64, 64, -64, -64, 64, -64, 64, -64, -64, -64, -64, 64, -64, -64, 64, -64, 64, 64, 64, -64, -64, 64, -64, -64, 64, -64, 64, -64, 64, -64, -64, 64, 64, -64, -64, 64, -64, 64, 64, -64, -64, -64, 64, 64, 64, 64, 64, -64, 64, -64, -64, -64, -64, -64, -64, 64, -64, -64, -64, -64, 64, 64, 64, 64, 64, 64, 64, -64, 64, 64, 64, -64, 64, 64, 64, -64, 64, 64, -64, -64, -64, 64, 64, -64, -64, 64, -64, 64, -64, -64, 64, 64, -64, 64, 64, 64, -64, -64, 64, 64, 64, 64, 64, -64, -64, 64, 64, -64, 64, -64, 64, -64, 64, 64, 64, -64, -64, -64, 64, 64, -64, 64, 64, 64, -64, 64, 64, -64, -64, -64, -64, 64, 64, 64, -64, 64, -64, -64, -64, -64, 64, -64, -64, -64, 64, 64, 64, 64, 64, 64, 64, 64, 64, 64, -64, -64, 64, -64, -64, -64, -64, -64, -64, -64, 64, 64, 64, -64, 64, 64, 64, 64, 64, 64, 64, 64, 64, 64, 64, -64, 64, -64, 64, 64, 64, 64, 64, -64, -64, -64, -64, 64, 64, 64, -64, 64, 64, 64, 64, 64, 64, 64, -64, -64, 64, 64, -64, 64, -64, -64, 64, 64, 64, 64, 64, 64, 64, 64, 64, -64, -64, -64, 64, -64, 64, -64, 64, 64, -64, -64, -64, 64, -64, -64, -64, -64, 64, 64, 64, -64, 64, 64, 64, -64, -64, 64, -64, 64, -64, -64, 64, 64, -64, 64, -64, 64, -64, -64, -64, -64, -64, -64, -64, -64, -64, -64, 64, 64, 64, -64, 64, -64, -64, -64, -64, -64, -64, 64, 64, -64, 64, -64, -64, -64, -64, -64, -64, -64, -64, -64, -64, -64, -64, 64, 64, 64, -64, -64, -64, -64, -64, -64, -64, -64, 64, 64, -64, -64, -64, -64, -64, -64, -64, -64, -64, -64, -64, -64, -64, -64, -64, 64, 64, 64, -64, -64, -64, -64, -64, -64, -64, -64, 64, -64, -64, -64, -64, -64, -64, -64, -64, -64, -64, -64, -64, -64, -64, 64, 64, 64, 64, 64, -64, -64, -64, -64, -64, 64, -64, 64, -64, 64, 64, -64, -64, -64, -64, -64, -64, -64, 64, -64, -64, -64, 64, 64, 64, 64, 64, -64, -64, -64, -64, -64, -64, -64, -64, 64, 64, 64, -64, -64, 64, 64, 64, 64, 64, -64, 64, -64, 64, 64, 64, 64, 64, 64, 64, -64, -64, -64, -64, -64, 64, -64, -64, -64, -64, -64, 64, -64, -64, 64, -64, -64, -64, -64, -64, -64, -64, -64, -64, 64, -64, -64, -64, 64, -64, 64, -64, -64, -64, 64, -64, -64, 64, 64, 64, 64, 64, 64, 64, -64, -64, -64, -64, -64, -64, -64, -64, -64, 64, -64, -64, -64, 64, 64, -64, -64, -64, -64, -64, 64, -64, 64, 64, -64, -64, 64, -64, -64, -64, -64, -64, -64, -64, -64, -64, -64, -64, -64, -64, 64, 64, -64, 64, -64, -64, 64, -64, 64, 64, 64, 64, 64, 64, 64, 64, 64, -64, -64, -64, -64, -64, -64, -64, -64, -64, -64, -64, -64, 64, -64, 64, 64, 64, -64, -64, 64, -64, -64, 64, -64, 64, 64, 64, 64, -64, -64, -64, -64, -64, -64, -64, -64, -64, -64, -64, -64, -64, 64, 64, 64, -64, -64, 64, 64, -64, -64, 64, 64, 64, 64, 64, 64, 64, -64, 64, -64, 64, -64, -64, -64, -64, -64, 64, 64, 64, -64, -64, 64, -64, -64, -64, 64, 64, 64, 64, -64, 64, 64, 64, 64, -64, 64, -64, -64, -64, 64, -64, -64, -64, 64, -64, 64, -64, -64, -64, -64, -64, 64, -64, 64, 64, 64, 64, 64, -64, -64, -64, 64, 64, 64, 64, -64, -64, -64, -64, -64, 64, -64, -64, -64, -64, -64, -64, 64, -64, 64, -64, 64, -64, 64, 64, 64, 64, -64, 64, 64, 64, -64, 64, 64, -64, -64, -64, -64, 64, 64, -64, -64, -64, -64, -64, 64, 64, -64, 64, 64, -64, 64, 64, -64, -64, -64, 64, -64, -64, 64, -64, -64, -64, -64, -64, 64, 64, 64, -64, -64, -64, 64, 64, -64, -64, -64, 64, -64, 64, 64, 64, 64, -64, 64, -64, 64, -64, -64, -64, 64, -64, 64, -64, 64, 64, -64, 64, -64, -64, -64, -64, 64, -64, 64, 64, 64, -64, -64, 64, 64, -64, 64, -64, -64, -64, -64, -64, 64, -64, -64, -64, -64, -64, -64, -64, 64, -64, 64, 64, 64, 64, -64, -64, 64, 64, 64, -64, 64, -64, 64, -64, -64, -64, 64, -64, 64, 64, -64, -64, 64, -64, -64, -64, -64, -64, 64, 64, -64, -64, 64, 64, -64, -64, -64, 64, -64, 64, 64, 64, 64, 64, 64, 64, -64, -64, -64, 64, -64, -64, -64, -64, -64, 64, -64, 64, -64, -64, 64, 64, 64, -64, -64, 64, 64, -64, 64, -64, -64, -64, -64, 64, 64, 64, -64, 64, -64, -64, 64, -64, -64, 64, -64, -64, 64, -64, 64, -64, -64, 64, -64, -64, -64, 64, -64, -64, -64, 64, -64, 64, 64, 64, -64, 64, -64, -64, -64, 64, -64, 64, -64, -64, -64, -64, -64, 64, -64, 64, 64, 64, 64, 64, 64, 64, -64, -64, -64, 64, 64, 64, -64, -64, 64, -64, 64, 64, -64, 64, -64, 64, 64, -64, 64, -64, 64, 64, 64, -64, 64, -64, -64, 64, -64, 64, 64, 64, -64, -64, -64, -64, -64, -64, -64, 64, 64, -64, 64, 64, -64, -64, 64, -64, 64, 64, 64, -64, -64, 64, -64, 64, 64, 64, 64, 64, 64, -64, -64, -64, -64, -64, -64, -64, 64, -64, -64, -64, -64, 64, -64, 64, -64, 64, 64, 64, -64, -64, -64, -64, -64, 64, -64, 64, -64, -64, -64, 64, 64, -64, -64, -64, 64, -64, -64, 64, -64, 64, 64, 64, 64, 64, 64, 64, 64, -64, -64, 64, 64, 64, 64, 64, -64, -64, -64, -64, -64, -64, -64, -64, 64, -64, -64, -64, -64, -64, -64, -64, -64, -64, 64, -64, -64, -64, -64, -64, 64, 64, 64, 64, -64, -64, -64, 64, 64, -64, -64, -64, -64, -64, -64, 64, -64, -64, 64, -64, -64, -64, -64, -64, -64, -64, -64, -64, -64, 64, -64, -64, -64, -64, 64, 64, -64, -64, -64, 64, 64, -64, -64, -64, -64, -64, 64, -64, -64, -64, -64, -64, -64, -64, -64, -64, 64, -64, -64, -64, -64, -64, -64, 64, -64, 64, 64, 64, -64, -64, -64, -64, -64, 64, -64, -64, -64, 64, -64, -64, -64, -64, -64, 64, -64, -64, -64, -64, -64, 64, 64, 64, 64, 64, 64, 64, -64, -64, -64, -64, -64, 64, -64, 64, 64, -64, -64, -64, -64, -64, -64, -64, -64, -64, -64, 64, 64, 64, 64, 64, 64, 64, 64, -64, -64, -64, -64, -64, -64, 64, 64, 64, -64, -64, -64, 64, 64, 64, 64, 64, -64, -64, -64, 64, 64, 64, 64, 64, 64, 64, -64, -64, -64, -64, -64, -64, -64, 64, -64, 64, 64, -64, -64, 64, 64, 64, 64, -64, -64, 64, 64, 64, 64, 64, 64, 64, 64, 64, 64, -64, -64, -64, -64, 64, -64, 64, -64, -64, -64, -64, -64, 64, 64, 64, 64, -64, -64, 64, -64, -64, 64, -64, -64, 64, 64, 64, -64, -64, -64, -64, -64, 64, 64, -64, -64, 64, -64, 64, -64, 64, 64, 64, -64, -64, -64, -64, -64, -64, -64, -64, -64, -64, -64, -64, 64, 64, -64, 64, -64, 64, 64, 64, 64, -64, 64, -64, 64, -64, 64, -64, -64, -64, -64, -64, -64, -64, -64, 64, -64, -64, 64, -64, 64, -64, -64, 64, 64, -64, 64, 64, -64, 64, 64, 64, -64, -64, 64, -64, 64, -64, -64, -64, 64, -64, -64, -64, -64, 64, -64, -64, -64, -64, -64, -64, -64, -64, -64, 64, -64, -64, 64, -64, -64, -64, -64, -64, 64, -64, -64, -64, 64, -64, -64, -64, -64, -64, 64, -64, -64, -64, -64, -64, -64, -64, -64, -64, -64, -64, 64, 64, -64, -64, -64, -64, -64, -64, -64, -64, -64, -64, 64, 64, -64, 64, -64, -64, -64, -64, -64, 64, 64, -64, -64, -64, -64, 64, -64, 64, 64, 64, -64, -64, -64, -64, -64, -64, -64, -64, -64, -64, 64, -64, -64, -64, -64, -64, -64, -64, -64, -64, -64, -64, -64, 64, 64, -64, 64, -64, -64, 64, -64, -64, -64, -64, -64, -64, -64, -64, -64, -64, -64, -64, -64, -64, -64, -64, -64, -64, -64, 64, -64, -64, 64, 64, 64, -64, -64, -64, -64, -64, 64, 64, -64, -64, -64, -64, -64, -64, 64, -64, -64, 64, -64, -64, 64, 64, -64, 64, -64, 64, 64, 64, 64, -64, -64, 64, 64, 64, -64, 64, -64, -64, -64, 64, 64, 64, -64, 64, 64, -64, 64, -64, -64, -64, 64, 64, 64, 64, -64, 64, 64, 64, -64, 64, 64, -64, -64, -64, 64, -64, 64, 64, 64, 64, -64, -64, 64, -64, 64, -64, 64, -64, -64, -64, -64, -64, 64, 64, -64, -64, 64, 64, -64, -64, -64, -64, 64, 64, 64, 64, 64, 64, 64, 64, 64, 64, 64, 64, -64, -64, -64, -64, -64, 64, -64, -64, -64, -64, 64, 64, 64, 64, 64, 64, -64, 64, 64, 64, 64, 64, 64, 64, 64, -64, 64, 64, 64, 64, -64, 64, -64, -64, -64, 64, 64, 64, 64, 64, 64, 64, 64, -64, 64, 64, 64, 64, 64, 64, 64, -64, 64, 64, 64, -64, 64, -64, 64, -64, -64, 64, 64, -64, 64, -64, 64, -64, -64, 64, -64, -64, -64, 64, 64, 64, 64, -64, -64, 64, 64, -64, 64, 64, -64, 64, 64, -64, 64, 64, -64, 64, 64, 64, -64, 64, -64, 64, -64, -64, 64, 64, -64, -64, 64, -64, 64, 64, -64, 64, -64, -64, 64, 64, 64, 64, 64, 64, -64, 64, -64, 64, -64, -64, 64, 64, 64, 64, 64, 64, 64, 64, 64, 64, 64, 64, 64, 64, 64, 64, 64, 64, -64, -64, 64, 64, -64, -64, -64, -64, -64, 64, 64, 64, 64, 64, 64, 64, 64, 64, 64, -64, -64, 64, 64, 64, 64, 64, 64, 64, 64, 64, -64, 64, 64, -64, 64, -64, 64, -64, -64, 64, 64, 64, 64, 64, 64, 64, 64, 64, -64, -64, 64, 64, 64, -64, -64, 64, -64, -64, 64, 64, -64, 64, 64, 64, 64, 64, -64, 64, -64, 64, 64, 64, 64, 64, 64, -64, -64, -64, -64, -64, -64, -64, -64, 64, -64, -64, 64, -64, 64, 64, -64, 64, -64, -64, 64, -64, -64, -64, 64, 64, 64, -64, -64, -64, -64, -64, 64, -64, -64, -64, -64, -64, 64, -64, -64, -64, -64, -64, -64, 64, -64, 64, -64, -64, -64, -64, 64, 64, -64, -64, -64, -64, -64, -64, -64, -64, -64, -64, -64, -64, -64, -64, -64, 64, -64, 64, 64, -64, -64, -64, -64, -64, -64, -64, -64, 64, 64, -64, -64, -64, -64, -64, -64, -64, -64, -64, -64, 64, 64, 64, 64, 64, 64, -64, 64, 64, -64, -64, 64, -64, -64, 64, -64, 64, -64, -64, -64, -64, -64, -64, -64, -64, -64, -64, -64, -64, -64, -64, 64, -64, 64, -64, -64, 64, -64, -64, -64, 64, -64, 64, 64, -64, -64, -64, -64, -64, -64, -64, -64, -64, -64, -64, -64, 64, -64, -64, -64, 64, -64, -64, -64, -64, -64, -64, 64, -64, -64, -64, 64, 64, -64, 64, -64, -64, -64, -64, -64, -64, -64, 64, -64, 64, -64, -64, -64, 64, 64, 64, 64, 64, -64, -64, -64, -64, -64, -64, 64, -64, -64, 64, -64, -64, -64, -64, -64, -64, 64, 64, 64, 64, 64, -64, -64, -64, -64, -64, -64, 64, -64, -64, -64, -64, -64, -64, 64, 64, 64, 64, -64, -64, -64, 64, -64, -64, 64, 64, 64, 64, 64, 64, -64, 64, 64, -64, -64, -64, -64, -64, -64, -64, -64, -64, -64, 64, -64, -64, 64, 64, -64, 64, -64, 64, -64, -64, -64, 64, 64, 64, 64, 64, -64, -64, 64, 64, 64, -64, -64, -64, -64, 64, -64, 64, -64, 64, 64, 64, -64, -64, 64, 64, -64, 64, -64, 64, 64, 64, 64, -64, -64, 64, 64, -64, -64, 64, -64, -64, -64, 64, 64, -64, 64, -64, -64, 64, 64, 64, -64, -64, -64, -64, -64, 64, 64, -64, 64, -64, -64, 64, -64, 64, -64, -64, -64, 64, 64, -64, -64, 64, -64, -64, -64, 64, 64, -64, -64, -64, 64, 64, -64, -64, 64, 64, 64, -64, -64, -64, -64, -64, -64, 64, -64, -64, -64, -64, 64, 64, 64, 64, 64, 64, 64, -64, -64, -64, 64, -64, -64, 64, -64, 64, 64, 64, 64, -64, 64, -64, -64, 64, 64, 64, 64, 64, -64, 64, -64, -64, 64, 64, -64, 64, -64, 64, 64, 64, -64, 64, 64, 64, 64, 64, 64, -64, -64, -64, -64, 64, 64, 64, 64, -64, -64, 64, -64, -64, 64, 64, -64, 64, -64, -64, -64, -64, -64, -64, 64, -64, 64, 64, -64, -64, -64, -64, -64, 64, 64, 64, -64, -64, -64, -64, -64, -64, 64, -64, -64, 64, 64, -64, -64, 64, -64, -64, -64, 64, 64, -64, 64, 64, -64, 64, -64, 64, 64, 64, 64, -64, -64, -64, -64, -64, -64, 64, -64, -64, -64, 64, -64, -64, -64, -64, -64, 64, -64, 64, 64, 64, 64, -64, 64, 64, 64, 64, 64, 64, -64, -64, -64, -64, -64, -64, -64, -64, -64, -64, -64, 64, -64, -64, -64, -64, -64, 64, -64, 64, -64, 64, -64, 64, 64, -64, -64, -64, -64, -64, -64, -64, -64, -64, -64, -64, -64, -64, -64, 64, -64, -64, 64, -64, -64, -64, 64, 64, 64, -64, -64, -64, -64, -64, -64, -64, -64, -64, -64, -64, -64, -64, 64, 64, -64, -64, 64, -64, -64, -64, -64, 64, -64, 64, 64, 64, -64, -64, -64, -64, -64, -64, 64, -64, -64, -64, -64, -64, -64, 64, -64, -64, -64, -64, -64, -64, 64, 64, -64, 64, 64, -64, -64, 64, 64, 64, 64, 64, 64, 64, 64, -64, 64, -64, -64, 64, -64, -64, -64, -64, -64, -64, 64, 64, -64, -64, 64, 64, 64, -64, -64, 64, -64, -64, -64, -64, 64, 64, 64, -64, 64, -64, 64, -64, 64, 64, -64, 64, -64, -64, 64, -64, -64, 64, 64, 64, 64, -64, 64, 64, -64, 64, 64, -64, -64, 64, -64, 64, -64, 64, 64, 64, 64, -64, 64, 64, -64, -64, -64, -64, 64, -64, -64, -64, -64, -64, -64, 64, 64, 64, -64, -64, -64, 64, 64, 64, 64, 64, 64, 64, 64, -64, -64, 64, 64, -64, 64, -64, -64, 64, -64, -64, 64, -64, 64, -64, -64, 64, 64, 64, -64, 64, 64, 64, 64, 64, 64, 64, 64, 64, 64, 64, 64, 64, 64, 64, 64, 64, -64, -64, 64, -64, -64, 64, -64, -64, 64, 64, -64, -64, 64, -64, 64, 64, 64, 64, 64, 64, -64, -64, 64, 64, 64, 64, 64, 64, -64, -64, 64, 64, 64, 64, -64, -64, 64, -64, -64, -64, -64, -64, 64, -64, 64, 64, 64, 64, 64, 64, 64, 64, 64, 64, 64, -64, -64, -64, -64, 64, 64, 64, -64, 64, 64, -64, -64, -64, 64, 64, -64, 64, 64, 64, 64, 64, -64, -64, 64, 64, 64, 64, 64, -64, 64, -64, -64, 64, -64, 64, 64, 64, -64, -64, -64, -64, -64, -64, 64, 64, 64, 64, 64, -64, -64, -64, 64, 64, 64, 64, 64, 64, 64, -64, -64, -64, 64, -64, 64, 64, 64, -64, -64, -64, -64, 64, 64, 64, 64, 64, 64, 64, -64, -64, -64, -64, 64, 64, 64, 64, -64, 64, 64, 64, 64, 64, 64, -64, -64, -64, -64, -64, 64, 64, 64, 64, -64, 64, -64, -64, -64, -64, -64, -64, -64, 64, 64, -64, -64, 64, 64, 64, -64, -64, -64, -64, -64, -64, -64, -64, 64, 64, 64, 64, -64, 64, -64, -64, -64, -64, -64, 64, 64, 64, 64, 64, 64, 64, 64, 64, -64, 64, -64, -64, -64, -64, -64, -64, -64, 64, 64, 64, -64, 64, -64, -64, -64, -64, -64, -64, -64, 64, -64, -64, 64, 64, 64, 64, -64, -64, -64, 64, 64, -64, -64, -64, 64, 64, 64, 64, 64, 64, -64, -64, -64, -64, 64, 64, 64, -64, -64, -64, 64, 64, 64, 64, -64, -64, -64, 64, -64, -64, 64, 64, -64, 64, 64, 64, 64, 64, 64, -64, -64, 64, 64, -64, 64, 64, -64, -64, 64, 64, 64, -64, 64, 64, -64, 64, -64, -64, -64, -64, -64, 64, 64, 64, 64, 64, 64, 64, 64, 64, 64, 64, 64, -64, 64, 64, 64, 64, -64, -64, -64, 64, 64, -64, -64, -64, -64, -64, -64, -64, 64, 64, -64, 64, 64, 64, 64, 64, 64, 64, -64, -64, 64, -64, 64, 64, -64, -64, -64, 64, -64, -64, -64, -64, -64, -64, -64, -64, 64, 64, -64, 64, 64, 64, 64, 64, 64, -64, 64, -64, 64, 64, 64, 64, -64, -64, -64, 64, 64, -64, -64, -64, -64, -64, -64, -64, -64, -64, -64, 64, 64, 64, 64, -64, -64, -64, -64, -64, -64, -64, 64, -64, 64, 64, -64, 64, -64, -64, -64, -64, -64, -64, -64, -64, -64, 64, 64, 64, -64, 64, -64, -64, 64, 64, 64, 64, -64, -64, -64, -64, -64, -64, -64, 64, 64, -64, -64, -64, -64, 64, -64, -64, 64, 64, 64, 64, 64, -64, 64, -64, -64, 64, 64, 64, 64, -64, -64, -64, 64, -64, -64, -64, -64, 64, -64, -64, -64, -64, -64, -64, 64, 64, 64, 64, 64, 64, 64, -64, 64, 64, 64, 64, -64, -64, -64, 64, -64, -64, 64, 64, -64, -64, 64, -64, -64, -64, -64, -64, 64, 64, 64, 64, 64, 64, 64, -64, -64, 64, 64, -64, -64, 64, -64, -64, 64, -64, -64, -64, 64, -64, 64, -64, -64, 64, -64, 64, 64, 64, 64, 64, 64, 64, -64, -64, -64, 64, 64, -64, -64, -64, -64, 64, -64, 64, -64, 64, -64, 64, 64, -64, -64, -64, -64, -64, -64, 64, 64, 64, 64, 64, 64, -64, 64, 64, 64, 64, 64, -64, -64, -64, -64, 64, 64, 64, 64, 64, -64, -64, -64, -64, -64, 64, 64, 64, 64, 64, 64, 64, -64, -64, 64, -64, 64, 64, -64, -64, -64, -64, 64, 64, 64, 64, 64, -64, -64, -64, -64, 64, 64, -64, -64, -64, -64, -64, -64, 64, -64, 64, -64, -64, -64, 64, -64, -64, -64, 64, 64, -64, -64, -64, -64, 64, -64, -64, 64, 64, 64, 64, 64, -64, -64, -64, -64, -64, 64, 64, -64, -64, -64, -64, -64, 64, -64, -64, -64, 64, -64, 64, 64, 64, -64, 64, -64, -64, -64, -64, -64, -64, -64, -64, -64, 64, 64, 64, 64, 64, 64, -64, 64, 64, 64, -64, -64, 64, 64, 64, 64, 64, -64, -64, -64, 64, 64, -64, -64, 64, 64, -64, 64, -64, -64, -64, 64, 64, -64, -64, -64, -64, 64, 64, 64, 64, -64, 64, 64, -64, -64, 64, 64, 64, -64, -64, 64, -64, 64, 64, -64, 64, -64, -64, 64, -64, 64, -64, 64, 64, 64, -64, -64, 64, -64, 64, 64, 64, 64, -64, 64, -64, 64, 64, 64, -64, -64, -64, 64, 64, -64, -64, -64, -64, -64, -64, -64, 64, -64, 64, -64, 64, 64, 64, 64, 64, 64, -64, -64, 64, 64, -64, -64, 64, -64, 64, -64, -64, 64, -64, 64, -64, 64, 64, -64, -64, -64, 64, -64, 64, -64, 64, -64, -64, -64, 64, -64, -64, -64, -64, -64, -64, -64, -64, -64, -64, -64, -64, -64, -64, 64, -64, -64, 64, 64, -64, 64, 64, -64, 64, -64, -64, 64, 64, -64, -64, -64, -64, -64, -64, -64, -64, -64, -64, -64, -64, -64, -64, -64, -64, -64, -64, -64, -64, -64, -64, 64, -64, -64, 64, 64, -64, -64, 64, 64, 64, -64, -64, -64, -64, -64, -64, -64, 64, -64, -64, -64, -64, -64, -64, -64, -64, -64, -64, 64, 64, -64, -64, 64, 64, 64, 64, 64, -64, -64, -64, -64, -64, -64, -64, -64, 64, 64, -64, 64, -64, 64, -64, -64, -64, -64, -64, -64, 64, -64, -64, 64, 64, 64, 64, 64, 64, 64, 64, -64, 64, -64, 64, -64, -64, 64, -64, -64, -64, -64, 64, -64, -64, -64, -64, -64, -64, 64, 64, 64, 64, 64, 64, 64, 64, 64, -64, 64, -64, 64, 64, 64, 64, -64, 64, 64, 64, 64, -64, 64, -64, -64, 64, -64, -64, -64, -64, 64, 64, 64, 64, 64, 64, 64, 64, 64, 64, 64, 64, 64, -64, -64, 64, -64, -64, -64, -64, -64, -64, -64, 64, -64, 64, 64, -64, -64, 64, 64, 64, 64, 64, -64, 64, 64, 64, 64, 64, 64, 64, -64, -64, 64, -64, -64, 64, -64, -64, -64, 64, 64, 64, -64, 64, -64, -64, -64, 64, -64, -64, 64, -64, -64, -64, -64, -64, 64, 64, -64, 64, -64, -64, -64, -64, -64, -64, -64, -64, 64, 64, 64, -64, -64, -64, -64, -64, -64, -64, -64, -64, -64, -64, -64, -64, -64, 64, 64, -64, -64, -64, -64, -64, -64, -64, 64, 64, 64, 64, -64, 64, -64, -64, -64, -64, -64, -64, -64, -64, -64, -64, -64, -64, -64, -64, -64, -64, -64, -64, -64, -64, -64, -64, 64, 64, 64, -64, 64, -64, -64, -64, -64, -64, -64, -64, -64, -64, -64, -64, -64, -64, 64, -64, -64, 64, 64, 64, -64, 64, 64, 64, 64, 64, -64, 64, -64, -64, -64, -64, -64, -64, -64, -64, -64, -64, -64, -64, -64, 64, 64, -64, -64, -64, 64, 64, 64, 64, 64, 64, 64, -64, -64, -64, 64, -64, 64, -64, -64, -64, -64, -64, 64, -64, -64, -64, -64, -64, -64, 64, 64, -64, 64, 64, 64, 64, 64, 64, 64, 64, -64, -64, -64, 64, -64, -64, -64, -64, -64, -64, -64, -64, 64, 64, 64, -64, 64, -64, -64, -64, -64, -64, -64, -64, 64, 64, -64, 64, -64, -64, -64, 64, -64, -64, -64, -64, -64, -64, -64, 64, -64, -64, 64, 64, -64, -64, -64, -64, -64, -64, -64, -64, -64, -64, 64, -64, 64, 64, -64, -64, -64, -64, -64, -64, -64, -64, -64, 64, 64, 64, 64, 64, 64, -64, 64, -64, -64, -64, -64, -64, -64, -64, 64, 64, -64, 64, 64, -64, -64, -64, -64, -64, -64, -64, -64, 64, 64, 64, 64, 64, -64, -64, -64, -64, -64, -64, -64, 64, 64, -64, -64, 64, 64, 64, 64, 64, -64, -64, -64, -64, -64, -64, 64, 64, 64, 64, -64, 64, -64, -64, -64, -64, -64, -64, -64, -64, 64, 64, -64, -64, 64, 64, 64, -64, -64, -64, -64, -64, 64, 64, 64, 64, 64, -64, 64, -64, 64, -64, -64, -64, -64, -64, -64, -64, -64, -64, 64, 64, -64, 64, 64, 64, -64, -64, -64, 64, 64, 64, 64, 64, 64, 64, -64, -64, 64, 64, -64, -64, -64, -64, 64, -64, -64, -64, 64, 64, 64, -64, -64, 64, 64, -64, -64, -64, 64, 64, 64, -64, 64, -64, -64, -64, -64, -64, -64, 64, 64, 64, -64, 64, -64, 64, 64, 64, 64, 64, -64, -64, 64, -64, -64, 64, 64, 64, 64, -64, 64, -64, -64, -64, -64, 64, -64, 64, 64, -64, -64, -64, -64, 64, 64, 64, -64, 64, -64, -64, -64, -64, -64, 64, -64, 64, -64, -64, -64, -64, -64, -64, 64, -64, -64, 64, 64, -64, -64, -64, -64, -64, 64, -64, -64, -64, -64, -64, 64, -64, 64, 64, 64, 64, 64, 64, 64, 64, -64, -64, 64, -64, 64, -64, 64, -64, -64, 64, -64, -64, 64, -64, -64, 64, 64, 64, -64, 64, 64, -64, -64, 64, -64, 64, 64, -64, -64, -64, -64, 64, -64, -64, 64, 64, 64, 64, -64, -64, -64, 64, -64, -64, -64, 64, 64, 64, 64, -64, 64, 64, -64, -64, 64, -64, 64, -64, 64, 64, -64, 64, 64, 64, 64, 64, 64, -64, -64, 64, 64, -64, 64, -64, 64, -64, -64, -64, 64, 64, -64, -64, -64, -64, -64, -64, 64, -64, -64, -64, -64, 64, 64, 64, -64, 64, -64, -64, 64, -64, -64, -64, 64, -64, 64, -64, -64, -64, -64, 64, -64, 64, -64, -64, 64, -64, -64, -64, -64, 64, -64, 64, 64, 64, 64, 64, 64, -64, 64, -64, 64, -64, -64, -64, -64, -64, -64, 64, 64, -64, -64, -64, -64, 64, -64, -64, -64, -64, 64, -64, 64, 64, -64, -64, 64, 64, 64, 64, 64, -64, -64, -64, 64, 64, 64, -64, -64, -64, -64, -64, -64, -64, -64, -64, -64, -64, 64, 64, 64, -64, -64, 64, -64, 64, 64, -64, -64, -64, -64, -64, 64, -64, -64, -64, -64, 64, -64, -64, -64, -64, -64, -64, 64, -64, -64, -64, -64, -64, -64, -64, 64, -64, -64, 64, -64, 64, -64, 64, -64, 64, 64, -64, -64, 64, -64, -64, 64, -64, -64, -64, -64, -64, 64, -64, -64, -64, -64, -64, -64, 64, 64, -64, -64, 64, 64, -64, 64, -64, -64, 64, 64, 64, -64, -64, -64, -64, -64, -64, -64, 64, -64, -64, -64, -64, 64, 64, 64, 64, -64, 64, -64, -64, 64, -64, 64, -64, -64, 64, -64, 64, -64, -64, 64, -64, -64, -64, 64, -64, -64, -64, -64, -64, 64, -64, 64, 64, 64, -64, 64, -64, 64, -64, 64, -64, -64, 64, -64, -64, -64, -64, -64, -64, -64, -64, -64, -64, 64, 64, -64, 64, -64, -64, -64, 64, 64, -64, 64, -64, 64, 64, 64, 64, -64, 64, 64, -64, -64, -64, 64, -64, -64, 64, -64, 64, 64, -64, -64, 64, 64, 64, 64, -64, -64, 64, 64, -64, -64, -64, -64, 64, 64, 64, -64, 64, -64, -64, 64, -64, -64, 64, 64, 64, 64, 64, 64, -64, 64, 64, 64, 64, 64, -64, 64, -64, 64, 64, -64, 64, 64, -64, -64, -64, 64, -64, -64, 64, 64, 64, -64, -64, 64, 64, 64, -64, -64, -64, -64, -64, 64, 64, 64, 64, -64, -64, 64, -64, -64, -64, -64, -64, 64, -64, 64, 64, 64, 64, -64, -64, 64, 64, 64, -64, -64, -64, 64, 64, -64, 64, 64, 64, 64, -64, -64, -64, -64, -64, -64, -64, -64, 64, -64, 64, -64, -64, -64, -64, -64, -64, -64, -64, -64, -64, -64, -64, -64, -64, -64, -64, -64, 64, -64, -64, -64, -64, -64, -64, 64, -64, -64, 64, -64, -64, -64, -64, -64, -64, -64, 64, -64, -64, -64, 64, 64, -64, -64, -64, -64, -64, -64, -64, -64, 64, -64, 64, 64, -64, -64, 64, 64, 64, 64, 64, 64, -64, -64, 64, 64, -64, -64, 64, 64, -64, -64, -64, -64, -64, 64, -64, -64, 64, 64, -64, 64, 64, 64, -64, -64, -64, -64, -64, -64, -64, -64, 64, 64, 64, -64, 64, 64, -64, -64, -64, -64, -64, -64, -64, -64, -64, -64, -64, 64, -64, -64, -64, -64, -64, -64, 64, -64, 64, -64, 64, 64, 64, -64, -64, -64, 64, -64, -64, 64, -64, -64, -64, -64, -64, -64, -64, -64, -64, -64, -64, -64, -64, -64, -64, 64, -64, -64, 64, -64, 64, -64, 64, 64, 64, 64, -64, 64, -64, -64, -64, -64, 64, -64, -64, -64, -64, -64, -64, -64, -64, -64, -64, -64, 64, -64, -64, -64, -64, -64, 64, 64, -64, -64, 64, 64, -64, -64, -64, 64, -64, -64, -64, -64, -64, 64, -64, 64, -64, -64, -64, -64, 64, 64, 64, -64, -64, 64, -64, 64, 64, 64, -64, -64, 64, -64, -64, -64, -64, -64, -64, -64, -64, -64, -64, -64, -64, -64, -64, 64, 64, 64, 64, 64, -64, -64, 64, -64, 64, 64, 64, 64, -64, -64, -64, -64, 64, -64, -64, 64, -64, 64, 64, -64, 64, 64, 64, 64, 64, 64, 64, -64, -64, 64, -64, 64, -64, 64, -64, 64, -64, 64, 64, 64, 64, -64, 64, 64, -64, 64, 64, -64, 64, -64, -64, 64, -64, -64, 64, 64, 64, 64, 64, -64, -64, -64, 64, -64, 64, -64, 64, -64, -64, -64, -64, 64, -64, -64, 64, -64, 64, 64, 64, 64, -64, 64, -64, 64, 64, 64, 64, 64, -64, 64, 64, -64, -64, 64, 64, -64, 64, 64, 64, 64, 64, -64, 64, 64, -64, 64, -64, -64, -64, -64, -64, 64, 64, -64, -64, -64, 64, 64, -64, -64, -64, 64, -64, -64, 64, 64, -64, -64, -64, -64, -64, 64, -64, 64, 64, 64, -64, 64, 64, 64, 64, -64, 64, 64, -64, -64, -64, -64, 64, 64, 64, 64, 64, -64, 64, 64, 64, 64, 64, -64, 64, 64, 64, -64, 64, -64, 64, -64, -64, 64, 64, 64, 64, 64, 64, 64, 64, -64, 64, -64, -64, -64, 64, 64, 64, 64, -64, 64, 64, -64, -64, -64, -64, -64, -64, 64, 64, -64, 64, 64, -64, -64, 64, -64, -64, 64, -64, 64, 64, 64, -64, 64, -64, -64, 64, 64, -64, -64, -64, -64, 64, -64, 64, 64, -64, 64, -64, 64, -64, 64, 64, -64, -64, -64, -64, -64, -64, -64, 64, -64, -64, 64, 64, 64, 64, -64, -64, -64, -64, -64, -64, -64, 64, 64, -64, -64, -64, -64, 64, -64, -64, -64, -64, 64, -64, -64, -64, -64, -64, -64, -64, -64, 64, -64, -64, -64, 64, 64, 64, 64, 64, -64, -64, 64, -64, 64, 64, 64, 64, 64, 64, -64, -64, 64, 64, -64, -64, -64, 64, -64, 64, 64, 64, -64, -64, 64, 64, 64, 64, 64, 64, 64, -64, -64, 64, -64, 64, 64, -64, -64, 64, -64, -64, 64, 64, -64, 64, -64, 64, -64, 64, -64, -64, -64, 64, 64, 64, 64, 64, 64, 64, -64, -64, 64, 64, 64, -64, 64, -64, -64, -64, -64, -64, -64, -64, 64, -64, -64, 64, -64, 64, 64, 64, -64, 64, 64, 64, -64, -64, -64, 64, 64, -64, -64, 64, -64, -64, -64, 64, -64, -64, -64, -64, -64, -64, 64, 64, -64, 64, -64, -64, 64, 64, 64, -64, -64, 64, -64, -64, -64, -64, -64, -64, -64, 64, -64, -64, 64, -64, -64, -64, 64, -64, 64, 64, -64, -64, 64, -64, 64, -64, 64, 64, -64, 64, -64, -64, 64, -64, -64, -64, -64, -64, -64, -64, 64, 64, 64, -64, -64, 64, -64, -64, 64, -64, 64, 64, 64, 64, 64, -64, -64, -64, -64, 64, 64, -64, -64, 64, -64, 64, 64, -64, -64, 64, -64, -64, -64, -64, -64, -64, -64, -64, 64, -64, -64, -64, 64, -64, -64, 64, 64, 64, 64, -64, -64, -64, -64, -64, 64, -64, -64, 64, 64, -64, -64, -64, 64, -64, -64, -64, 64, -64, -64, -64, -64, 64, 64, -64, 64, 64, 64, 64, -64, 64, -64, -64, -64, -64, -64, 64, -64, -64, -64, 64, -64, -64, -64, 64, 64, 64, -64, 64, 64, 64, 64, -64, 64, -64, 64, 64, 64, -64, -64, -64, 64, -64, -64, -64, -64, -64, -64, 64, -64, 64, -64, -64, 64, -64, -64, -64, 64, -64, -64, 64, 64, -64, 64, -64, 64, -64, 64, -64, -64, -64, -64, -64, 64, -64, -64, -64, -64, -64, -64, 64, -64, -64, 64, -64, 64, 64, -64, 64, -64, 64, -64, -64, -64, 64, -64, 64, 64, 64, 64, -64, 64, -64, -64, -64, 64, 64, 64, -64, -64, -64, -64, -64, 64, 64, 64, 64, -64, -64, -64, -64, -64, 64, 64, -64, -64, -64, -64, -64, -64, 64, -64, -64, -64, -64, 64, -64, -64, -64, 64, 64, 64, 64, 64, -64, -64, -64, 64, -64, -64, -64, -64, -64, -64, -64, -64, 64, -64, 64, -64, -64, 64, -64, -64, 64, 64, -64, 64, -64, 64, -64, 64, -64, 64, -64, -64, 64, 64, 64, -64, -64, -64, -64, 64, -64, -64, -64, -64, -64, 64, -64, 64, -64, -64, -64, -64, -64, -64, -64, -64, -64, 64, 64, 64, 64, -64, -64, 64, -64, -64, -64, -64, -64, -64, 64, 64, 64, 64, -64, -64, 64, -64, -64, -64, 64, 64, -64, 64, 64, -64, 64, 64, 64, 64, -64, 64, 64, -64, -64, -64, -64, -64, 64, -64, -64, -64, -64, -64, 64, -64, 64, 64, 64, 64, -64, -64, 64, 64, -64, -64, 64, 64, 64, -64, -64, -64, -64, -64, 64, -64, -64, -64, 64, -64, -64, -64, -64, -64, -64, 64, -64, -64, 64, 64, -64, 64, -64, -64, 64, 64, -64, 64, 64, 64, -64, -64, -64, 64, 64, -64, 64, 64, 64, -64, -64, -64, -64, -64, 64, 64, 64, 64, 64, -64, -64, 64, 64, 64, -64, -64, -64, -64, 64, 64, 64, 64, -64, -64, 64, -64, 64, 64, -64, -64, -64, -64, -64, -64, 64, -64, -64, -64, 64, -64, -64, 64, -64, -64, 64, 64, -64, -64, -64, 64, 64, -64, -64, 64, -64, 64, -64, 64, -64, 64, -64, 64, 64, 64, -64, -64, 64, -64, 64, -64, 64, -64, -64, -64, -64, -64, -64, 64, 64, -64, 64, -64, 64, -64, 64, 64, 64, 64, -64, 64, 64, 64, 64, 64, 64, 64, 64, 64, -64, 64, 64, -64, -64, 64, 64, -64, 64, 64, -64, -64, 64, 64, -64, -64, 64, 64, 64, 64, -64, 64, 64, -64, 64, 64, 64, -64, -64, -64, 64, -64, 64, -64, 64, 64, -64, 64, -64, -64, 64, -64, -64, -64, -64, -64, 64, -64, 64, -64, -64, 64, 64, -64, -64, 64, 64, 64, -64, 64, -64, 64, -64, -64, 64, -64, -64, 64, 64, 64, 64, 64, -64, 64, -64, -64, -64, -64, 64, -64, -64, -64, -64, -64, 64, 64, -64, 64, -64, 64, 64, -64, 64, -64, 64, 64, 64, -64, 64, -64, -64, 64, -64, 64, -64, -64, 64, -64, -64, -64, 64, 64, 64, 64, -64, 64, 64, 64, -64, 64, -64, -64, 64, 64, 64, -64, 64, 64, -64, -64, 64, 64, -64, -64, -64, -64, 64, 64, 64, 64, 64, 64, 64, 64, 64, 64, 64, 64, 64, 64, 64, 64, 64, 64, -64, -64, 64, 64, -64, -64, 64, -64, -64, 64, 64, -64, 64, -64, 64, 64, 64, 64, 64, 64, 64, 64, 64, 64, 64, 64, 64, 64, 64, 64, -64, 64, -64, -64, -64, 64, 64, 64, -64, 64, -64, -64, -64, -64, 64, 64, 64, 64, -64, -64, 64, 64, 64, 64, 64, -64, 64, 64, -64, -64, 64, 64, 64, -64, 64, -64, -64, -64, -64, -64, 64, 64, -64, 64, 64, 64, -64, -64, 64, -64, -64, 64, 64, -64, 64, 64, 64, 64, -64, -64, -64, -64, -64, -64, -64, 64, -64, -64, -64, 64, -64, -64, -64, -64, -64, 64, 64, -64, -64, -64, -64, 64, 64, 64, 64, 64, 64, -64, 64, -64, -64, -64, -64, -64, -64, -64, -64, -64, -64, -64, -64, 64, 64, 64, 64, 64, -64, -64, -64, -64, -64, 64, -64, 64, 64, -64, 64, -64, -64, -64, -64, 64, -64, -64, -64, -64, 64, -64, -64, -64, 64, -64, -64, -64, -64, 64, 64, 64, 64, 64, -64, -64, -64, -64, 64, 64, -64, -64, 64, 64, -64, -64, -64, 64, 64, 64, 64, 64, 64, 64, 64, -64, -64, -64, 64, 64, 64, 64, -64, -64, 64, -64, -64, -64, 64, 64, 64, 64, -64, -64, -64, 64, 64, 64, 64, 64, 64, 64, -64, -64, -64, 64, 64, 64, 64, -64, -64, -64, 64, -64, -64, 64, -64, 64, 64, -64, 64, -64, -64, 64, 64, 64, 64, 64, 64, 64, 64, 64, 64, -64, -64, 64, 64, -64, -64, -64, 64, -64, -64, 64, 64, -64, 64, -64, 64, 64, 64, 64, 64, 64, 64, 64, 64, -64, 64, 64, -64, -64, -64, -64, 64, -64, -64, 64, -64, 64, 64, -64, -64, 64, 64, 64, 64, -64, -64, 64, 64, 64, 64, 64, 64, 64, 64, -64, -64, 64, 64, -64, -64, 64, -64, -64, -64, -64, -64, 64, 64, 64, 64, 64, -64, 64, 64, -64, 64, -64, 64, -64, 64, 64, 64, -64, -64, -64, 64, 64, 64, 64, 64, -64, 64, -64, 64, 64, -64, 64, 64, 64, 64, 64, 64, 64, 64, 64, 64, -64, -64, 64, 64, 64, -64, -64, 64, 64, 64, 64, 64, -64, 64, -64, 64, 64, 64, -64, 64, -64, -64, 64, 64, 64, 64, 64, 64, 64, 64, 64, 64, -64, -64, 64, 64, 64, 64, 64, 64, -64, -64, -64, -64, 64, -64, -64, 64, 64, 64, 64, 64, 64, 64, -64, -64, 64, 64, 64, -64, 64, 64, 64, 64, 64, 64, 64, -64, 64, 64, 64, -64, 64, -64, 64, 64, 64, 64, 64, 64, 64, 64, 64, 64, 64, 64, 64, -64, -64, 64, 64, 64, 64, 64, 64, 64, 64, -64, 64, 64, -64, -64, 64, -64, 64, 64, 64, 64, -64, 64, -64, 64, 64, 64, -64, 64, -64, 64, -64, 64, 64, -64, -64, 64, -64, 64, -64, -64, 64, -64, -64, 64, -64, 64, 64, 64, 64, -64, 64, 64, 64, 64, 64, -64, -64, -64, -64, 64, 64, 64, -64, -64, 64, -64, 64, 64, 64, -64, 64, 64, 64, 64, 64, -64, 64, -64, 64, 64, 64, -64, 64, 64, -64, -64, 64, 64, 64, 64, 64, 64, 64, 64, 64, 64, 64, -64, -64, -64, 64, 64, -64, -64, -64, -64, 64, 64, -64, -64, -64, -64, -64, -64, 64, 64, 64, 64, 64, -64, 64, -64, -64, -64, -64, -64, -64, -64, 64, 64, -64, -64, -64, -64, -64, -64, -64, -64, 64, -64, -64, -64, 64, 64, 64, 64, 64, -64, 64, 64, -64, -64, 64, 64, 64, -64, 64, 64, -64, -64, -64, -64, 64, 64, -64, -64, 64, 64, 64, -64, -64, -64, 64, 64, 64, -64, 64, 64, -64, 64, 64, -64, 64, 64, 64, -64, -64, -64, 64, 64, 64, 64, -64, -64, -64, -64, -64, 64, -64, -64, 64, -64, 64, 64, -64, 64, -64, -64, 64, 64, -64, 64, -64, 64, -64, 64, -64, 64, 64, -64, 64, 64, 64, -64, 64, -64, 64, -64, -64, -64, -64, -64, 64, 64, -64, -64, 64, 64, -64, 64, -64, 64, 64, 64, 64, 64, -64, -64, 64, -64, -64, -64, -64, -64, 64, -64, 64, 64, -64, 64, 64, -64, 64, -64, -64, 64, 64, 64, -64, -64, -64, -64, 64, -64, -64, -64, -64, -64, 64, -64, 64, 64, 64, 64, 64, 64, 64, 64, -64, 64, -64, 64, 64, 64, -64, -64, 64, 64, 64, 64, -64, 64, -64, -64, -64, -64, 64, 64, -64, 64, 64, 64, 64, 64, -64, -64, -64, -64, -64, 64, 64, 64, -64, 64, -64, 64, 64, 64, -64, 64, 64, -64, -64, -64, 64, 64, -64, 64, -64, 64, -64, -64, 64, -64, 64, 64, -64, -64, -64, 64, 64, 64, 64, -64, -64, -64, 64, -64, -64, 64, -64, -64, -64, -64, 64, -64, 64, -64, -64, 64, 64, -64, 64, -64, -64, -64, 64, -64, 64, -64, -64, -64, -64, -64, -64, -64, -64, -64, -64, -64, 64, -64, -64, -64, -64, -64, -64, -64, -64, -64, -64, -64, 64, 64, 64, -64, -64, -64, 64, -64, -64, -64, -64, -64, -64, -64, -64, -64, -64, -64, -64, -64, -64, -64, -64, 64, -64, -64, 64, 64, -64, -64, 64, -64, -64, 64, 64, -64, -64, -64, -64, -64, -64, -64, -64, 64, 64, 64, -64, -64, -64, -64, -64, -64, -64, -64, -64, -64, -64, 64, 64, 64, -64, -64, -64, 64, -64, 64, -64, 64, -64, -64, -64, -64, 64, -64, -64, -64, -64, -64, -64, -64, -64, 64, -64, -64, -64, 64, -64, 64, -64, -64, -64, 64, 64, 64, 64, 64, 64, -64, -64, 64, -64, 64, -64, -64, -64, 64, -64, 64, -64, 64, 64, 64, 64, -64, -64, 64, -64, -64, -64, 64, -64, -64, 64, -64, -64, -64, -64, -64, 64, -64, -64, 64, 64, 64, -64, -64, -64, -64, 64, -64, -64, 64, -64, -64, 64, -64, -64, -64, -64, -64, -64, -64, -64, -64, 64, 64, -64, -64, 64, -64, -64, -64, -64, -64, -64, -64, 64, 64, 64, 64, -64, -64, -64, -64, 64, 64, -64, 64, -64, -64, 64, -64, 64, 64, -64, -64, -64, -64, -64, -64, 64, -64, -64, -64, -64, 64, 64, 64, -64, -64, 64, -64, -64, -64, -64, -64, -64, -64, -64, 64, 64, -64, 64, 64, 64, -64, -64, -64, -64, -64, -64, -64, -64, -64, 64, -64, -64, 64, 64, 64, 64, -64, -64, -64, -64, 64, 64, 64, 64, -64, -64, 64, -64, -64, -64, 64, -64, 64, -64, -64, -64, 64, -64, -64, -64, 64, -64, 64, -64, -64, -64, 64, 64, -64, 64, -64, -64, -64, 64, -64, -64, -64, -64, -64, -64, -64, -64, -64, -64, -64, -64, 64, 64, -64, 64, 64, -64, -64, -64, -64, 64, 64, 64, -64, -64, -64, 64, 64, 64, -64, -64, -64, 64, 64, -64, -64, -64, 64, 64, 64, -64, 64, 64, 64, 64, -64, -64, -64, 64, -64, 64, -64, -64, 64, 64, -64, -64, -64, -64, -64, -64, -64, 64, 64, 64, 64, 64, 64, 64, 64, 64, 64, -64, -64, 64, -64, 64, -64, 64, -64, -64, 64, 64, -64, -64, -64, -64, -64, 64, -64, -64, 64, 64, 64, 64, -64, 64, -64, 64, -64, -64, -64, -64, -64, 64, 64, 64, 64, 64, -64, -64, -64, -64, -64, -64, -64, 64, 64, -64, 64, 64, -64, 64, 64, 64, 64, -64, 64, -64, -64, 64, -64, -64, -64, -64, 64, -64, 64, -64, 64, -64, -64, -64, 64, -64, -64, 64, 64, 64, 64, -64, -64, 64, -64, -64, 64, 64, -64, -64, -64, -64, -64, -64, -64, 64, -64, -64, -64, -64, 64, -64, 64, -64, 64, 64, 64, 64, 64, -64, -64, -64, 64, 64, -64, -64, 64, 64, -64, 64, -64, -64, -64, -64, -64, -64, -64, -64, 64, 64, 64, -64, -64, -64, -64, 64, 64, -64, -64, -64, 64, 64, 64, -64, 64, 64, 64, -64, 64, -64, 64, -64, -64, 64, -64, -64, -64, 64, 64, -64, 64, 64, -64, -64, -64, 64, 64, -64, 64, 64, -64, 64, -64, -64, -64, 64, 64, -64, -64, -64, 64, -64, -64, -64, 64, -64, 64, 64, -64, -64, 64, -64, -64, 64, -64, -64, -64, 64, 64, 64, -64, 64, 64, 64, -64, -64, 64, 64, -64, 64, 64, 64, -64, 64, -64, 64, 64, -64, 64, -64, 64, 64, 64, 64, 64, 64, -64, 64, 64, 64, 64, 64, -64, -64, 64, -64, -64, -64, -64, 64, 64, -64, 64, -64, 64, 64, -64, -64, -64, 64, 64, 64, 64, 64, -64, -64, -64, 64, -64, 64, 64, -64, 64, -64, -64, 64, 64, -64, -64, -64, -64, 64, 64, 64, -64, 64, -64, 64, 64, -64, 64, -64, 64, 64, -64, -64, -64, -64, -64, 64, -64, -64, -64, -64, -64, -64, 64, -64, -64, -64, -64, 64, -64, 64, -64, 64, -64, 64, -64, 64, 64, 64, 64, 64, -64, -64, -64, 64, -64, 64, -64, -64, -64, 64, -64, -64, -64, -64, -64, -64, 64, -64, -64, -64, 64, -64, -64, -64, 64, 64, 64, -64, -64, -64, -64, 64, -64, -64, -64, -64, -64, 64, 64, -64, -64, -64, -64, -64, 64, 64, 64, 64, -64, 64, -64, 64, 64, 64, -64, -64, 64, 64, 64, -64, -64, 64, -64, -64, 64, -64, -64, -64, -64, -64, -64, -64, 64, -64, -64, -64, -64, 64, 64, 64, 64, 64, 64, 64, -64, -64, -64, 64, 64, -64, 64, 64, -64, -64, -64, -64, -64, -64, -64, -64, -64, 64, -64, 64, -64, 64, 64, 64, 64, 64, 64, 64, 64, 64, 64, 64, 64, 64, -64, 64, -64, -64, -64, -64, -64, -64, -64, -64, -64, 64, 64, 64, 64, 64, 64, 64, 64, 64, 64, 64, 64, 64, 64, 64, 64, 64, 64, -64, -64, -64, -64, -64, -64, -64, -64, -64, -64, -64, 64, 64, 64, -64, 64, 64, 64, 64, 64, 64, 64, -64, -64, -64, -64, 64, 64, 64, 64, 64, -64, -64, 64, 64, 64, -64, -64, -64, -64, 64, -64, -64, 64, 64, 64, 64, 64, -64, -64, -64, -64, -64, 64, 64, 64, 64, 64, 64, -64, -64, 64, 64, -64, 64, -64, -64, -64, 64, 64, 64, 64, 64, 64, 64, -64, -64, -64, -64, -64, -64, 64, 64, 64, -64, 64, 64, 64, -64, 64, -64, -64, -64, -64, -64, -64, 64, 64, 64, 64, 64, 64, 64, -64, -64, -64, -64, -64, -64, 64, 64, 64, 64, 64, 64, -64, -64, -64, -64, -64, -64, -64, 64, -64, -64, 64, 64, 64, 64, 64, 64, 64, 64, -64, -64, -64, -64, 64, 64, 64, -64, 64, 64, 64, -64, -64, -64, -64, -64, -64, -64, 64, 64, -64, -64, -64, -64, 64, 64, -64, 64, 64, -64, -64, 64, 64, 64, -64, 64, 64, -64, -64, -64, -64, -64, -64, 64, -64, -64, 64, -64, 64, 64, 64, 64, -64, -64, -64, 64, -64, -64, -64, -64, -64, -64, -64, 64, 64, -64, -64, 64, 64, 64, -64, -64, -64, -64, 64, 64, -64, 64, 64, -64, -64, -64, -64, -64, -64, -64, -64, -64, -64, -64, -64, -64, -64, 64, 64, 64, 64, -64, 64, -64, -64, -64, 64, 64, 64, 64, 64, 64, 64, -64, -64, -64, -64, -64, -64, -64, -64, -64, -64, -64, -64, 64, 64, 64, 64, 64, 64, -64, -64, -64, 64, 64, 64, -64, 64, 64, -64, -64, -64, -64, -64, -64, -64, -64, -64, -64, -64, -64, 64, -64, 64, 64, -64, -64, -64, 64, -64, -64, -64, 64, -64, 64, 64, 64, 64, -64, -64, -64, -64, 64, -64, -64, -64, -64, -64, -64, -64, -64, 64, -64, 64, -64, 64, 64, -64, -64, 64, -64, 64, -64, 64, -64, 64, 64, -64, -64, 64, -64, -64, -64, -64, -64, -64, -64, -64, 64, 64, 64, -64, -64, 64, -64, -64, -64, -64, -64, -64, -64, -64, 64, -64, 64, 64, 64, -64, -64, -64, -64, -64, -64, -64, -64, 64, 64, -64, 64, -64, 64, 64, 64, 64, 64, -64, 64, 64, 64, -64, -64, 64, 64, 64, 64, 64, -64, -64, -64, -64, -64, -64, 64, 64, 64, -64, -64, -64, -64, -64, 64, -64, -64, 64, 64, -64, -64, 64, -64, -64, 64, -64, 64, 64, 64, -64, -64, -64, -64, -64, 64, 64, 64, -64, 64, -64, 64, 64, 64, 64, -64, -64, 64, 64, 64, 64, -64, 64, -64, -64, 64, -64, -64, -64, 64, -64, -64, -64, -64, 64, -64, -64, 64, -64, -64, 64, 64, 64, 64, 64, 64, -64, -64, -64, -64, 64, 64, -64, 64, -64, -64, -64, -64, 64, 64, -64, -64, -64, -64, 64, 64, 64, 64, -64, 64, 64, 64, 64, 64, 64, 64, 64, 64, -64, 64, 64, -64, 64, -64, -64, 64, 64, 64, 64, 64, 64, 64, 64, 64, 64, -64, 64, -64, -64, -64, -64, 64, -64, -64, 64, -64, -64, 64, -64, -64, -64, -64, -64, 64, -64, 64, 64, -64, -64, 64, 64, 64, -64, 64, 64, 64, -64, 64, 64, 64, -64, 64, 64, 64, -64, -64, 64, 64, 64, -64, -64, -64, -64, 64, 64, 64, 64, 64, -64, -64, -64, 64, -64, 64, -64, -64, 64, 64, -64, -64, -64, 64, -64, -64, 64, -64, -64, 64, 64, -64, -64, -64, 64, 64, -64, -64, 64, 64, -64, -64, -64, -64, -64, 64, 64, -64, -64, -64, 64, -64, 64, 64, -64, 64, -64, -64, -64, -64, 64, 64, 64, 64, -64, 64, 64, 64, -64, 64, 64, 64, 64, -64, 64, 64, 64, -64, 64, 64, -64, -64, 64, 64, 64, 64, 64, 64, -64, 64, 64, 64, 64, 64, -64, -64, 64, -64, 64, -64, 64, -64, -64, 64, -64, 64, -64, 64, 64, 64, -64, -64, 64, -64, -64, 64, 64, 64, 64, 64, 64, 64, 64, -64, -64, 64, -64, 64, -64, -64, 64, -64, -64, 64, 64, 64, 64, -64, -64, 64, -64, 64, 64, 64, 64, 64, 64, -64, 64, 64, 64, 64, 64, 64, 64, -64, 64, 64, 64, 64, -64, -64, 64, -64, 64, 64, 64, 64, -64, -64, 64, 64, 64, 64, -64, -64, 64, 64, 64, 64, 64, 64, 64, 64, 64, 64, -64, 64, -64, 64, -64, 64, 64, 64, 64, 64, -64, -64, 64, -64, -64, -64, -64, -64, 64, -64, 64, -64, 64, 64, 64, 64, 64, 64, 64, 64, -64, 64, 64, -64, 64, 64, 64, 64, -64, 64, -64, -64, -64, 64, -64, -64, -64, 64, 64, 64, 64, 64, -64, 64, 64, 64, 64, -64, 64, -64, -64, 64, -64, 64, -64, 64, 64, 64, -64, 64, -64, -64, -64, 64, 64, 64, 64, 64, -64, 64, -64, -64, -64, 64, 64, 64, 64, 64, 64, -64, -64, -64, -64, -64, 64, 64, -64, 64, 64, -64, 64, 64, 64, -64, -64, -64, 64, 64, 64, -64, 64, 64, 64, 64, 64, -64, -64, 64, 64, 64, -64, -64, -64, 64, 64, 64, 64, 64, 64, 64, -64, 64, -64, -64, -64, 64, 64, 64, -64, 64, -64, 64, -64, 64, 64, -64, 64, 64, -64, -64, 64, 64, 64, 64, 64, 64, -64, -64, 64, -64, -64, -64, -64, -64, -64, 64, -64, 64, 64, 64, 64, 64, 64, 64, -64, 64, -64, -64, 64, 64, 64, 64, 64, -64, 64, -64, 64, -64, -64, 64, -64, 64, -64, 64, -64, 64, -64, -64, 64, -64, 64, 64, 64, 64, -64, -64, -64, 64, 64, 64, 64, -64, 64, 64, 64, -64, 64, 64, 64, 64, 64, 64, 64, 64, -64, 64, 64, 64, 64, -64, -64, -64, 64, -64, -64, 64, 64, 64, 64, 64, 64, -64, 64, -64, 64, 64, 64, 64, 64, -64, 64, -64, 64, 64, -64, -64, 64, -64, 64, 64, 64, 64, 64, 64, -64, -64, 64, 64, 64, -64, 64, 64, -64, 64, 64, 64, 64, 64, -64, 64, 64, 64, 64, 64, 64, -64, 64, 64, 64, -64, -64, 64, 64, 64, 64, -64, -64, 64, -64, 64, 64, 64, -64, 64, -64, 64, 64, 64, 64, -64, -64, -64, -64, -64, 64, 64, 64, 64, 64, -64, -64, 64, -64, 64, 64, 64, 64, 64, -64, 64, 64, 64, -64, 64, -64, 64, -64, 64, 64, 64, -64, -64, 64, 64, 64, -64, 64, 64, 64, -64, 64, 64, 64, 64, -64, -64, 64, 64, -64, -64, 64, -64, 64, -64, -64, 64, 64, -64, -64, -64, 64, 64, 64, 64, 64, 64, 64, 64, 64, 64, 64, 64, -64, -64, -64, -64, 64, 64, 64, 64, -64, -64, -64, -64, 64, -64, -64, 64, 64, 64, 64, 64, -64, 64, 64, -64, -64, 64, 64, 64, -64, -64, 64, 64, 64, -64, 64, -64, 64, -64, 64, -64, -64, -64, 64, -64, -64, 64, 64, -64, 64, 64, 64, 64, 64, 64, 64, 64, -64, -64, -64, 64, 64, 64, 64, 64, 64, -64, -64, 64, 64, -64, 64, 64, -64, -64, 64, -64, 64, -64, 64, 64, 64, 64, 64, 64, -64, -64, -64, 64, 64, 64, -64, 64, 64, -64, 64, -64, 64, -64, -64, -64, -64, -64, -64, -64, -64, -64, 64, 64, 64, 64, -64, 64, -64, -64, -64, 64, -64, -64, 64, 64, 64, -64, 64, -64, -64, 64, 64, -64, 64, 64, 64, -64, 64, 64, -64, 64, 64, 64, -64, 64, -64, -64, -64, -64, -64, -64, -64, 64, 64, 64, 64, -64, -64, 64, 64, 64, 64, -64, -64, -64, 64, 64, -64, -64, 64, 64, -64, -64, -64, -64, -64, 64, 64, 64, 64, 64, 64, -64, 64, 64, 64, 64, -64, -64, 64, -64, -64, 64, 64, -64, -64, -64, 64, 64, 64, -64, -64, 64, -64, -64, -64, 64, 64, 64, -64, -64, 64, -64, 64, 64, -64, -64, 64, -64, -64, 64, -64, -64, 64, 64, 64, -64, -64, -64, 64, -64, -64, 64, -64, 64, -64, 64, -64, -64, -64, -64, 64, -64, 64, -64, 64, -64, 64, 64, 64, 64, 64, 64, 64, 64, 64, 64, 64, -64, -64, 64, 64, -64, -64, 64, -64, 64, 64, 64, 64, 64, -64, -64, -64, 64, 64, 64, 64, -64, -64, 64, 64, 64, 64, 64, -64, -64, -64, 64, -64, -64, 64, 64, -64, -64, 64, -64, 64, -64, 64, 64, 64, 64, 64, 64, -64, -64, -64, 64, 64, 64, -64, 64, -64, -64, -64, -64, -64, 64, -64, 64, -64, 64, -64, -64, 64, 64, -64, 64, -64, -64, 64, 64, -64, 64, 64, 64, 64, 64, 64, 64, -64, -64, -64, 64, -64, 64, -64, 64, 64, 64, 64, 64, -64, 64, 64, 64, -64, 64, 64, 64, 64, -64, 64, 64, 64, -64, -64, -64, -64, -64, -64, 64, -64, 64, 64, -64, 64, 64, -64, 64, -64, 64, -64, 64, -64, 64, 64, 64, 64, -64, 64, 64, 64, -64, -64, -64, -64, -64, -64, 64, -64, -64, 64, 64, 64, -64, 64, -64, 64, 64, -64, -64, -64, 64, 64, 64, 64, 64, -64, -64, -64, -64, -64, -64, -64, -64, -64, 64, 64, -64, 64, 64, 64, 64, 64, 64, 64, -64, -64, 64, 64, 64, 64, 64, 64, 64, 64, -64, -64, -64, -64, -64, -64, -64, -64, 64, 64, 64, 64, 64, 64, 64, 64, -64, -64, -64, -64, -64, -64, 64, 64, 64, 64, 64, -64, -64, -64, -64, -64, -64, -64, -64, 64, 64, 64, 64, 64, 64, 64, 64, 64, -64, -64, 64, -64, -64, -64, 64, 64, 64, 64, 64, 64, 64, -64, -64, -64, -64, 64, 64, 64, 64, 64, 64, 64, 64, 64, 64, 64, -64, -64, 64, -64, -64, 64, 64, 64, 64, 64, 64, 64, -64, -64, -64, -64, 64, 64, 64, 64, -64, -64, 64, 64, 64, 64, -64, -64, 64, 64, -64, -64, 64, 64, -64, 64, 64, 64, 64, 64, 64, -64, -64, 64, -64, 64, 64, 64, 64, 64, 64, 64, 64, 64, 64, 64, -64, 64, 64, 64, -64, 64, -64, 64, 64, 64, 64, 64, -64, -64, -64, 64, -64, 64, -64, 64, -64, 64, 64, 64, 64, -64, -64, -64, -64, -64, 64, -64, -64, -64, 64, -64, 64, 64, 64, 64, 64, -64, 64, 64, 64, -64, -64, -64, -64, 64, -64, 64, 64, 64, -64, -64, -64, -64, 64, -64, -64, -64, 64, 64, 64, 64, 64, 64, 64, -64, 64, 64, 64, -64, 64, -64, -64, 64, -64, 64, 64, -64, 64, -64, -64, -64, 64, -64, -64, 64, 64, 64, 64, 64, 64, -64, 64, 64, -64, -64, -64, -64, -64, -64, -64, -64, 64, 64, 64, -64, 64, -64, -64, -64, -64, -64, -64, -64, 64, 64, 64, 64, -64, -64, 64, -64, -64, 64, -64, -64, -64, -64, -64, -64, 64, 64, 64, 64, 64, 64, -64, 64, 64, -64, -64, -64, -64, -64, 64, 64, 64, -64, -64, 64, 64, -64, 64, -64, -64, -64, -64, 64, 64, 64, -64, -64, 64, -64, -64, -64, 64, 64, -64, -64, 64, -64, -64, 64, -64, -64, -64, 64, -64, 64, -64, 64, -64, 64, -64, -64, 64, 64, 64, 64, 64, 64, -64, -64, -64, -64, -64, -64, -64, -64, -64, -64, -64, 64, -64, -64, -64, 64, 64, 64, -64, -64, -64, -64, 64, 64, -64, -64, -64, -64, 64, 64, 64, -64, -64, -64, -64, 64, -64, -64, -64, 64, -64, -64, -64, 64, 64, -64, 64, -64, -64, -64, 64, 64, 64, -64, -64, -64, 64, -64, -64, 64, -64, -64, -64, -64, -64, 64, -64, 64, -64, -64, 64, 64, -64, 64, 64, -64, 64, 64, -64, 64, -64, 64, 64, -64, -64, -64, -64, -64, 64, 64, 64, 64, -64, -64, 64, -64, -64, -64, -64, -64, 64, 64, 64, 64, 64, -64, -64, 64, -64, -64, -64, 64, 64, -64, 64, -64, 64, 64, -64, -64, -64, -64, -64, -64, 64, 64, -64, -64, -64, -64, 64, -64, -64, 64, -64, -64, -64, -64, -64, -64, -64, 64, -64, 64, -64, -64, -64, 64, -64, -64, -64, -64, -64, -64, 64, 64, 64, 64, -64, -64, -64, -64, 64, 64, -64, -64, 64, 64, 64, 64, 64, -64, 64, 64, 64, -64, -64, -64, 64, -64, -64, 64, 64, -64, 64, 64, -64, -64, -64, -64, -64, 64, 64, -64, 64, -64, -64, 64, -64, 64, -64, -64, -64, -64, 64, 64, 64, 64, 64, 64, 64, 64, 64, 64, 64, -64, 64, 64, 64, -64, -64, -64, 64, 64, 64, -64, 64, -64, -64, 64, -64, 64, 64, -64, 64, 64, 64, -64, 64, 64, -64, 64, -64, -64, -64, 64, -64, -64, 64, -64, 64, 64, -64, 64, 64, -64, 64, 64, -64, -64, -64, 64, -64, -64, 64, -64, -64, 64, 64, -64, 64, 64, -64, 64, 64, -64, 64, 64, 64, -64, -64, 64, 64, -64, -64, 64, -64, 64, 64, 64, 64, 64, -64, -64, 64, 64, -64, 64, 64, 64, 64, 64, -64, 64, -64, 64, 64, -64, -64, 64, 64, -64, 64, -64, -64, -64, -64, -64, -64, 64, 64, 64, -64, 64, 64, 64, 64, -64, 64, 64, 64, 64, 64, 64, 64, -64, 64, 64, 64, -64, 64, 64, -64, -64, 64, -64, -64, -64, 64, 64, 64, -64, -64, 64, -64, 64, 64, -64, 64, 64, -64, 64, -64, 64, 64, 64, 64, -64, 64, -64, 64, 64, -64, 64, 64, -64, -64, -64, -64, 64, 64, 64, 64, 64, 64, 64, 64, -64, 64, 64, -64, 64, -64, 64, -64, -64, 64, 64, -64, 64, 64, 64, 64, 64, -64, 64, 64, -64, 64, 64, 64, 64, 64, 64, 64, 64, 64, 64, -64, -64, 64, -64, 64, 64, -64, -64, 64, 64, 64, 64, 64, 64, -64, 64, 64, 64, 64, 64, 64, -64, 64, 64, 64, 64, 64, 64, 64, -64, -64, -64, -64, -64, 64, -64, 64, 64, 64, 64, 64, 64, 64, 64, 64, 64, 64, 64, 64, 64, 64, 64, 64, 64, 64, 64, 64, -64, -64, -64, 64, 64, -64, -64, -64, 64, 64, 64, 64, 64, 64, -64, 64, -64, 64, -64, -64, 64, 64, 64, 64, 64, 64, 64, 64, -64, 64, -64, -64, 64, 64, 64, 64, 64, 64, 64, 64, 64, -64, 64, 64, -64, -64, 64, 64, 64, 64, 64, 64, 64, 64, 64, 64, -64, -64, -64, 64, 64, 64, 64, 64, 64, 64, 64, 64, -64, 64, -64, 64, 64, -64, -64, 64, 64, 64, -64, 64, 64, 64, 64, 64, -64, -64, -64, 64, -64, 64, -64, 64, 64, 64, -64, -64, 64, 64, 64, -64, -64, -64, 64, 64, 64, 64, -64, 64, 64, 64, -64, -64, -64, 64, 64, 64, 64, 64, -64, 64, 64, 64, 64, -64, -64, -64, 64, -64, -64, 64, 64, -64, 64, 64, -64, -64, -64, -64, -64, 64, 64, 64, -64, 64, -64, 64, -64, 64, -64, -64, 64, 64, 64, 64, 64, 64, -64, 64, 64, 64, 64, 64, 64, -64, -64, -64, -64, -64, -64, -64, 64, -64, 64, -64, -64, -64, -64, -64, -64, -64, 64, -64, -64, -64, -64, -64, -64, -64, 64, -64, -64, -64, -64, 64, -64, -64, -64, 64, -64, -64, 64, 64, 64, -64, -64, -64, 64, 64, 64, 64, -64, -64, 64, -64, -64, -64, 64, -64, 64, -64, -64, -64, -64, -64, -64, 64, -64, 64, 64, 64, 64, -64, -64, -64, -64, -64, -64, 64, -64, 64, -64, 64, -64, 64, 64, 64, 64, -64, -64, -64, -64, -64, -64, -64, 64, 64, 64, 64, 64, 64, 64, 64, 64, -64, 64, 64, -64, 64, 64, 64, -64, 64, 64, -64, -64, 64, 64, -64, 64, -64, -64, 64, 64, 64, -64, 64, -64, 64, 64, 64, 64, 64, 64, 64, 64, 64, 64, 64, 64, -64, 64, 64, 64, -64, 64, -64, -64, -64, 64, -64, -64, -64, 64, 64, 64, -64, -64, -64, 64, 64, 64, -64, 64, 64, 64, 64, 64, 64, 64, -64, -64, -64, 64, 64, -64, -64, -64, -64, 64, -64, 64, -64, -64, -64, 64, 64, 64, 64, 64, -64, 64, 64, 64, 64, 64, -64, -64, 64, 64, -64, 64, 64, -64, -64, 64, 64, -64, -64, 64, 64, 64, -64, -64, 64, -64, 64, 64, 64, 64, -64, 64, 64, 64, -64, 64, -64, 64, -64, 64, 64, -64, 64, 64, 64, 64, -64, -64, 64, -64, -64, 64, -64, 64, -64, -64, 64, 64, 64, 64, -64, 64, -64, -64, -64, 64, 64, 64, -64, 64, 64, 64, -64, -64, 64, -64, 64, -64, 64, 64, 64, 64, 64, -64, 64, 64, 64, -64, 64, 64, -64, -64, -64, 64, 64, 64, 64, 64, 64, 64, 64, 64, -64, -64, -64, 64, 64, -64, -64, -64, -64, -64, 64, 64, 64, 64, -64, 64, -64, -64, -64, -64, 64, 64, 64, -64, -64, 64, -64, -64, -64, 64, -64, -64, 64, 64, -64, -64, -64, -64, -64, 64, 64, -64, 64, 64, 64, -64, 64, -64, 64, -64, -64, -64, -64, 64, -64, 64, -64, 64, 64, 64, -64, 64, -64, 64, 64, 64, 64, 64, -64, -64, 64, -64, 64, 64, 64, 64, 64, -64, 64, 64, 64, -64, -64, 64, 64, 64, -64, 64, -64, -64, 64, -64, 64, 64, 64, 64, 64, 64, -64, -64, 64, -64, -64, 64, -64, -64, 64, -64, 64, 64, 64, -64, -64, 64, -64, -64, 64, -64, -64, 64, -64, 64, -64, 64, 64, -64, 64, 64, 64, -64, -64, -64, 64, -64, -64, -64, 64, 64, -64, -64, -64, 64, -64, 64, -64, 64, 64, -64, 64, 64, -64, -64, 64, 64, -64, 64, -64, -64, -64, -64, -64, -64, -64, -64, 64, 64, 64, 64, -64, 64, 64, -64, -64, -64, 64, -64, 64, -64, -64, 64, 64, 64, 64, 64, -64, 64, -64, -64, -64, -64, -64, -64, -64, 64, 64, -64, 64, 64, -64, -64, 64, 64, -64, -64, -64, 64, 64, 64, 64, -64, 64, 64, -64, -64, 64, 64, -64, -64, 64, 64, -64, 64, -64, -64, -64, 64, 64, -64, -64, -64, -64, -64, -64, -64, 64, -64, -64, 64, -64, -64, -64, 64, -64, -64, -64, -64, -64, -64, 64, -64, 64, 64, -64, 64, 64, 64, -64, -64, -64, 64, -64, 64, -64, -64, -64, -64, 64, -64, -64, 64, -64, -64, 64, 64, -64, 64, 64, 64, 64, -64, 64, 64, 64, -64, -64, -64, -64, -64, -64, -64, 64, -64, -64, -64, -64, -64, 64, -64, -64, -64, -64, 64, 64, -64, 64, 64, 64, 64, 64, -64, 64, 64, -64, -64, -64, -64, -64, -64, -64, -64, 64, 64, -64, -64, -64, -64, -64, -64, -64, -64, -64, 64, -64, 64, -64, 64, 64, -64, 64, -64, 64, 64, -64, -64, -64, 64, -64, -64, 64, -64, -64, -64, -64, -64, 64, 64, -64, -64, -64, 64, -64, 64, -64, -64, 64, -64, -64, 64, 64, 64, -64, 64, -64, -64, -64, -64, 64, 64, 64, -64, 64, -64, 64, 64, 64, -64, -64, -64, 64, -64, 64, 64, 64, -64, 64, 64, 64, -64, -64, -64, 64, -64, -64, -64, 64, -64, -64, 64, 64, -64, -64, -64, -64, -64, -64, -64, -64, 64, -64, 64, -64, 64, 64, 64, 64, -64, 64, -64, 64, -64, 64, -64, 64, -64, 64, 64, -64, 64, -64, -64, -64, -64, -64, -64, -64, -64, 64, -64, 64, 64, -64, -64, -64, 64, -64, -64, -64, -64, -64, 64, 64, -64, 64, 64, 64, 64, -64, -64, -64, -64, -64, -64, -64, -64, -64, -64, -64, 64, 64, 64, 64, 64, 64, 64, 64, 64, -64, -64, -64, -64, -64, 64, 64, 64, -64, -64, 64, -64, -64, 64, -64, 64, -64, 64, 64, 64, -64, -64, -64, -64, -64, -64, -64, 64, -64, -64, 64, -64, -64, 64, 64, -64, 64, 64, -64, -64, -64, -64, -64, 64, -64, 64, -64, 64, -64, -64, -64, -64, -64, -64, -64, 64, -64, -64, -64, -64, -64, -64, 64, -64, 64, 64, -64, -64, -64, -64, 64, -64, 64, 64, -64, -64, 64, -64, 64, -64, -64, -64, 64, -64, 64, -64, -64, -64, -64, 64, -64, -64, 64, -64, -64, -64, -64, -64, 64, -64, -64, 64, -64, 64, -64, 64, 64, -64, -64, -64, 64, 64, 64, -64, -64, -64, 64, -64, -64, 64, 64, -64, 64, -64, 64, 64, -64, -64, -64, 64, 64, -64, -64, -64, -64, 64, -64, -64, 64, -64, -64, -64, 64, -64, -64, -64, -64, -64, 64, 64, -64, -64, -64, 64, 64, 64, 64, 64, -64, -64, 64, -64, -64, -64, -64, -64, -64, 64, -64, -64, 64, -64, -64, -64, -64, -64, -64, -64, -64, 64, 64, -64, 64, 64, -64, -64, 64, 64, -64, -64, -64, -64, -64, 64, -64, -64, -64, -64, -64, -64, -64, -64, -64, -64, 64, -64, -64, -64, -64, 64, -64, 64, 64, -64, 64, -64, -64, -64, -64, -64, -64, -64, 64, 64, 64, -64, -64, 64, -64, -64, -64, -64, 64, -64, 64, 64, 64, -64, -64, -64, -64, 64, -64, -64, 64, -64, -64, 64, 64, 64, 64, 64, -64, 64, 64, -64, -64, 64, -64, -64, 64, -64, -64, 64, 64, 64, 64, -64, -64, 64, -64, 64, -64, -64, 64, 64, 64, -64, -64, 64, 64, -64, -64, -64, -64, 64, -64, -64, -64, -64, -64, -64, -64, 64, 64, -64, 64, -64, -64, -64, -64, -64, 64, 64, 64, 64, 64, 64, 64, -64, -64, -64, -64, -64, 64, -64, -64, -64, 64, -64, 64, 64, 64, -64, -64, -64, 64, 64, 64, -64, 64, 64, 64, 64, -64, 64, 64, 64, -64, 64, 64, -64, 64, 64, -64, 64, 64, -64, -64, -64, -64, 64, 64, -64, -64, 64, -64, 64, 64, 64, 64, -64, 64, -64, 64, -64, 64, 64, -64, 64, 64, -64, -64, 64, -64, 64, -64, -64, 64, -64, -64, -64, 64, -64, -64, -64, -64, -64, -64, -64, -64, -64, 64, 64, 64, 64, 64, 64, 64, 64, -64, -64, 64, 64, 64, 64, -64, -64, 64, 64, 64, -64, 64, 64, -64, -64, -64, -64, -64, 64, -64, -64, 64, 64, 64, 64, 64, -64, -64, 64, 64, 64, 64, 64, -64, -64, 64, -64, 64, -64, 64, 64, 64, -64, 64, 64, -64, 64, 64, -64, -64, 64, 64, 64, -64, -64, 64, -64, -64, -64, -64, -64, 64, -64, 64, 64, 64, -64, 64, 64, 64, -64, 64, -64, -64, -64, -64, -64, 64, -64, 64, -64, -64, -64, -64, -64, -64, -64, 64, 64, 64, 64, 64, 64, -64, 64, -64, -64, -64, -64, -64, -64, -64, 64, 64, -64, -64, 64, -64, -64, -64, -64, -64, -64, -64, -64, -64, -64, -64, 64, -64, 64, 64, -64, -64, -64, -64, 64, -64, -64, -64, -64, -64, -64, -64, -64, -64, -64, -64, -64, -64, -64, -64, 64, 64, -64, -64, -64, -64, 64, 64, -64, -64, 64, -64, -64, -64, -64, -64, -64, -64, -64, 64, 64, -64, 64, 64, 64, 64, 64, 64, -64, 64, 64, 64, 64, -64, 64, -64, -64, -64, -64, 64, -64, -64, -64, -64, -64, -64, -64, -64, -64, 64, -64, 64, 64, 64, 64, 64, 64, -64, -64, -64, -64, 64, 64, -64, 64, 64, 64, 64, -64, -64, -64, -64, -64, -64, 64, -64, 64, 64, 64, -64, -64, 64, 64, -64, 64, -64, -64, -64, -64, -64, 64, 64, -64, -64, -64, -64, -64, -64, -64, -64, -64, -64, 64, 64, -64, -64, -64, -64, -64, -64, -64, -64, 64, -64, 64, -64, -64, -64, 64, -64, 64, 64, -64, -64, -64, -64, -64, -64, -64, -64, 64, 64, 64, -64, -64, -64, -64, -64, -64, -64, -64, 64, 64, -64, -64, 64, 64, -64, 64, -64, -64, -64, -64, -64, -64, -64, -64, 64, 64, 64, -64, -64, -64, -64, -64, 64, 64, 64, -64, 64, -64, 64, 64, -64, -64, 64, -64, 64, 64, -64, -64, -64, -64, -64, -64, 64, 64, 64, 64, -64, -64, -64, -64, 64, -64, -64, -64, 64, 64, -64, -64, 64, 64, -64, -64, -64, -64, -64, -64, -64, -64, -64, -64, -64, -64, 64, -64, 64, -64, 64, 64, -64, -64, -64, 64, 64, 64, 64, -64, -64, -64, 64, 64, -64, -64, -64, -64, -64, -64, 64, 64, 64, -64, 64, -64, -64, 64, 64, -64, -64, -64, 64, -64, -64, -64, -64, 64, 64, -64, 64, 64, 64, 64, -64, -64, -64, -64, -64, -64, -64, 64, -64, 64, -64, -64, -64, -64, 64, 64, -64, 64, -64, -64, -64, -64, -64, -64, 64, -64, 64, -64, 64, 64, -64, -64, -64, -64, -64, -64, -64, -64, 64, 64, -64, -64, -64, -64, 64, -64, -64, -64, -64, -64, 64, 64, 64, -64, -64, -64, -64, 64, 64, -64, -64, -64, -64, -64, -64, 64, 64, -64, -64, -64, -64, -64, -64, -64, -64, -64, -64, 64, 64, -64, 64, 64, -64, -64, -64, -64, -64, 64, 64, 64, -64, -64, -64, 64, -64, -64, -64, -64, 64, 64, -64, -64, -64, 64, 64, -64, 64, 64, -64, -64, -64, -64, 64, 64, 64, -64, -64, -64, -64, -64, -64, 64, 64, -64, -64, -64, -64, 64, -64, -64, -64, -64, -64, 64, -64, -64, 64, -64, 64, -64, 64, 64, -64, 64, -64, -64, -64, -64, 64, -64, -64, -64, -64, 64, -64, -64, -64, -64, -64, 64, 64, -64, -64, 64, 64, -64, -64, -64, 64, 64, -64, 64, -64, -64, -64, -64, -64, -64, -64, -64, -64, -64, -64, -64, -64, -64, -64, -64, 64, 64, -64, 64, 64, -64, -64, -64, -64, 64, 64, 64, -64, 64, 64, -64, -64, -64, -64, -64, -64, -64, 64, -64, -64, -64, 64, -64, 64, 64, 64, -64, 64, 64, -64, -64, -64, -64, 64, 64, 64, 64, 64, 64, 64, -64, -64, -64, -64, -64, -64, -64, -64, -64, -64, -64, 64, -64, -64, 64, 64, -64, 64, -64, -64, -64, 64, 64, 64, 64, 64, 64, -64, -64, -64, -64, 64, -64, -64, -64, -64, -64, -64, 64, -64, -64, 64, -64, -64, -64, -64, -64, 64, 64, 64, 64, 64, 64, 64, -64, -64, -64, -64, -64, -64, -64, -64, 64, -64, -64, -64, 64, -64, 64, -64, 64, -64, -64, 64, -64, -64, 64, 64, 64, 64, 64, 64, -64, -64, 64, -64, -64, 64, -64, -64, 64, 64, 64, -64, -64, -64, 64, -64, 64, 64, 64, -64, 64, 64, 64, 64, -64, 64, -64, 64, 64, 64, 64, 64, -64, 64, -64, -64, -64, 64, -64, -64, -64, 64, 64, -64, 64, -64, 64, 64, 64, -64, 64, -64, 64, 64, -64, -64, -64, -64, -64, 64, 64, -64, -64, 64, 64, 64, -64, 64, 64, -64, -64, 64, -64, -64, 64, -64, 64, 64, 64, 64, 64, -64, -64, 64, -64, 64, -64, -64, -64, 64, 64, 64, -64, -64, -64, 64, -64, -64, 64, -64, -64, -64, -64, -64, -64, 64, 64, -64, 64, 64, -64, 64, -64, 64, 64, -64, -64, -64, -64, -64, -64, -64, -64, -64, 64, -64, 64, 64, -64, -64, -64, 64, -64, -64, 64, 64, 64, 64, 64, 64, 64, 64, 64, -64, -64, -64, -64, -64, 64, -64, -64, -64, -64, -64, 64, 64, -64, 64, -64, 64, 64, 64, 64, 64, 64, 64, 64, 64, 64, 64, 64, 64, 64, 64, 64, -64, -64, -64, -64, -64, -64, 64, 64, 64, -64, -64, -64, -64, 64, 64, 64, 64, 64, 64, 64, 64, 64, 64, 64, -64, 64, 64, 64, -64, -64, -64, -64, -64, -64, 64, 64, -64, 64, 64, 64, 64, 64, 64, 64, 64, 64, -64, 64, -64, -64, 64, 64, 64, 64, 64, 64, -64, -64, -64, -64, -64, -64, 64, 64, 64, -64, 64, 64, 64, 64, 64, 64, 64, 64, 64, 64, 64, 64, -64, -64, -64, -64, 64, -64, 64, 64, -64, -64, -64, -64, 64, -64, -64, 64, 64, 64, 64, 64, 64, 64, 64, 64, 64, 64, 64, 64, 64, -64, -64, 64, 64, -64, 64, 64, -64, 64, -64, -64, -64, 64, 64, -64, -64, 64, -64, 64, 64, 64, 64, 64, 64, 64, -64, -64, -64, 64, -64, 64, 64, 64, -64, -64, 64, -64, 64, -64, -64, 64, -64, -64, -64, 64, 64, 64, 64, 64, 64, 64, -64, 64, -64, -64, -64, -64, 64, -64, 64, 64, 64, 64, 64, 64, -64, -64, -64, -64, -64, 64, -64, 64, 64, 64, 64, 64, 64, 64, -64, -64, -64, -64, -64, -64, 64, -64, -64, -64, 64, 64, 64, 64, 64, -64, -64, -64, 64, -64, -64, 64, 64, 64, 64, 64, 64, 64, -64, 64, -64, -64, -64, -64, -64, -64, -64, 64, 64, 64, 64, 64, 64, 64, 64, 64, 64, -64, 64, 64, 64, 64, 64, 64, 64, 64, -64, -64, -64, -64, -64, -64, -64, -64, -64, 64, 64, 64, 64, 64, 64, 64, 64, -64, 64, 64, 64, 64, -64, 64, 64, 64, 64, 64, -64, -64, -64, -64, -64, -64, -64, -64, 64, 64, -64, 64, 64, 64, 64, 64, 64, -64, 64, -64, 64, 64, -64, 64, 64, 64, 64, 64, 64, 64, 64, -64, -64, -64, -64, -64, -64, 64, 64, 64, 64, 64, 64, 64, 64, -64, -64, 64, -64, 64, 64, 64, 64, 64, 64, 64, 64, -64, 64, 64, 64, -64, 64, 64, 64, 64, 64, 64, 64, 64, 64, 64, 64, 64, 64, 64, 64, 64, 64, -64, 64, 64, 64, 64, -64, -64, -64, 64, 64, -64, -64, 64, 64, 64, 64, 64, 64, 64, 64, 64, 64, 64, 64, -64, -64, 64, 64, -64, -64, 64, 64, 64, 64, 64, -64, 64, -64, -64, -64, 64, 64, 64, 64, 64, 64, 64, 64, 64, 64, 64, -64, -64, 64, 64, -64, -64, -64, -64, 64, 64, -64, -64, -64, 64, -64, -64, -64, -64, 64, 64, -64, 64, 64, 64, 64, 64, 64, 64, 64, -64, 64, 64, 64, 64, -64, 64, -64, 64, 64, -64, -64, -64, 64, -64, 64, 64, -64, 64, 64, 64, 64, 64, 64, -64, -64, 64, -64, 64, 64, 64, 64, -64, -64, 64, -64, 64, 64, -64, -64, -64, -64, 64, -64, -64, 64, -64, -64, 64, 64, 64, 64, 64, -64, 64, -64, -64, -64, -64, -64, -64, -64, -64, 64, -64, -64, -64, -64, 64, 64, -64, 64, -64, -64, 64, 64, 64, 64, 64, 64, -64, 64, 64, -64, 64, 64, 64, 64, -64, -64, 64, -64, 64, -64, -64, 64, 64, -64, -64, -64, -64, -64, 64, 64, 64, 64, 64, 64, -64, -64, 64, 64, 64, 64, 64, 64, 64, 64, 64, -64, -64, -64, 64, -64, 64, 64, 64, 64, 64, -64, 64, 64, -64, -64, 64, 64, 64, 64, 64, -64, 64, 64, 64, 64, -64, -64, -64, -64, -64, -64, 64, 64, -64, -64, -64, -64, 64, 64, 64, 64, 64, -64, 64, 64, 64, 64, 64, 64, 64, 64, -64, 64, -64, 64, 64, 64, 64, -64, 64, -64, -64, -64, -64, -64, -64, 64, -64, 64, 64, -64, 64, -64, 64, 64, -64, 64, -64, 64, 64, 64, 64, -64, -64, -64, -64, 64, 64, 64, 64, 64, -64, 64, -64, -64, -64, -64, -64, -64, -64, -64, 64, 64, 64, 64, 64, -64, 64, 64, 64, 64, -64, 64, -64, -64, 64, 64, 64, -64, 64, -64, -64, 64, 64, -64, 64, 64, -64, -64, 64, -64, -64, -64, 64, -64, 64, -64, 64, 64, 64, 64, -64, -64, 64, 64, -64, 64, 64, -64, 64, 64, 64, -64, 64, 64, -64, -64, -64, -64, -64, 64, -64, -64, 64, 64, 64, 64, 64, 64, 64, 64, 64, -64, 64, -64, 64, 64, -64, 64, 64, 64, -64, 64, 64, 64, -64, -64, -64, 64, 64, 64, 64, -64, -64, -64, -64, 64, 64, 64, -64, -64, -64, -64, -64, 64, -64, -64, -64, 64, 64, 64, 64, 64, -64, 64, 64, 64, -64, -64, -64, -64, -64, -64, -64, 64, 64, 64, 64, 64, 64, 64, -64, -64, 64, 64, -64, 64, 64, 64, -64, -64, 64, -64, 64, -64, -64, -64, -64, -64, -64, -64, 64, 64, -64, 64, -64, 64, 64, -64, 64, 64, 64, 64, 64, 64, 64, 64, -64, 64, 64, -64, -64, -64, -64, -64, 64, 64, 64, -64, 64, -64, -64, -64, -64, -64, -64, -64, -64, -64, -64, 64, 64, 64, -64, -64, 64, 64, 64, -64, -64, -64, 64, 64, -64, -64, 64, -64, 64, 64, -64, -64, -64, -64, -64, 64, 64, -64, 64, -64, 64, 64, -64, 64, -64, 64, 64, -64, -64, 64, -64, -64, 64, -64, 64, -64, -64, 64, -64, -64, 64, -64, 64, 64, -64, -64, -64, -64, 64, -64, 64, 64, 64, 64, -64, 64, -64, 64, 64, -64, -64, -64, 64, -64, 64, -64, -64, -64, 64, 64, -64, -64, -64, -64, -64, -64, -64, -64, 64, -64, -64, -64, -64, 64, 64, -64, 64, -64, 64, 64, -64, 64, -64, -64, 64, -64, 64, 64, -64, -64, -64, -64, -64, 64, 64, 64, 64, 64, -64, -64, -64, -64, 64, 64, 64, 64, -64, -64, 64, 64, 64, 64, 64, 64, 64, 64, -64, -64, -64, -64, -64, -64, -64, 64, -64, 64, -64, -64, -64, -64, 64, 64, -64, 64, 64, 64, 64, 64, 64, 64, 64, 64, 64, -64, -64, -64, -64, -64, 64, 64, -64, 64, -64, 64, -64, 64, 64, 64, -64, -64, -64, 64, -64, 64, 64, 64, 64, 64, 64, 64, 64, -64, 64, 64, 64, 64, 64, -64, 64, -64, -64, -64, -64, -64, -64, -64, -64, 64, -64, 64, 64, 64, 64, 64, 64, 64, 64, 64, 64, 64, 64, 64, 64, 64, 64, 64, -64, -64, -64, -64, -64, -64, -64, -64, -64, 64, -64, -64, -64, 64, 64, 64, 64, 64, 64, 64, -64, 64, 64, 64, 64, 64, 64, 64, 64, 64, -64, -64, -64, -64, -64, 64, 64, -64, -64, 64, 64, -64, -64, -64, 64, 64, 64, 64, 64, 64, 64, 64, 64, 64, 64, 64, 64, -64, -64, -64, -64, -64, -64, -64, 64, 64, 64, 64, 64, -64, -64, -64, -64, 64, 64, 64, 64, 64, 64, 64, 64, 64, 64, 64, 64, -64, -64, -64, -64, -64, -64, -64, -64, 64, -64, -64, 64, -64, -64, -64, -64, -64, 64, 64, 64, 64, 64, 64, 64, 64, 64, -64, 64, 64, 64, 64, -64, 64, 64, -64, 64, 64, 64, 64, 64, -64, 64, -64, -64, -64, -64, 64, 64, -64, 64, 64, 64, 64, 64, 64, -64, 64, -64, -64, -64, -64, 64, -64, 64, 64, 64, -64, 64, 64, 64, -64, -64, -64, -64, 64, 64, -64, -64, -64, 64, 64, 64, -64, -64, -64, -64, -64, 64, -64, 64, 64, 64, 64, 64, 64, -64, 64, 64, 64, -64, -64, 64, 64, -64, 64, 64, -64, -64, 64, 64, 64, -64, -64, -64, -64, -64, -64, 64, 64, -64, -64, 64, 64, -64, 64, -64, 64, -64, 64, 64, 64, -64, 64, -64, -64, -64, 64, 64, 64, -64, -64, -64, 64, 64, -64, -64, 64, 64, -64, -64, 64, 64, 64, -64, 64, -64, -64, 64, -64, -64, 64, -64, -64, -64, 64, 64, -64, -64, -64, 64, 64, -64, -64, -64, 64, 64, -64, -64, 64, 64, -64, -64, -64, -64, -64, -64, -64, -64, -64, -64, 64, 64, 64, -64, -64, -64, 64, 64, 64, 64, -64, -64, 64, 64, -64, 64, -64, 64, -64, 64, -64, -64, -64, -64, -64, -64, -64, 64, 64, -64, 64, 64, -64, -64, 64, 64, -64, -64, -64, -64, 64, -64, -64, -64, -64, -64, -64, -64, 64, 64, -64, -64, -64, -64, -64, -64, -64, -64, -64, 64, 64, 64, 64, 64, -64, -64, -64, 64, -64, 64, -64, -64, -64, -64, -64, 64, 64, 64, -64, 64, -64, -64, 64, -64, -64, -64, -64, 64, -64, -64, -64, -64, 64, -64, 64, -64, 64, 64, 64, 64, -64, 64, 64, 64, -64, -64, 64, -64, 64, -64, -64, 64, 64, 64, -64, -64, 64, 64, -64, 64, 64, 64, 64, 64, -64, 64, -64, 64, 64, 64, 64, 64, 64, 64, -64, -64, -64, 64, 64, -64, -64, 64, 64, 64, 64, 64, 64, -64, 64, -64, 64, 64, -64, 64, -64, -64, -64, 64, 64, 64, 64, 64, 64, -64, -64, 64, -64, -64, 64, 64, 64, 64, 64, 64, 64, 64, 64, 64, 64, 64, 64, 64, -64, 64, -64, 64, 64, 64, 64, 64, 64, -64, 64, 64, 64, 64, -64, 64, 64, 64, -64, 64, 64, 64, -64, 64, 64, 64, 64, 64, -64, 64, -64, 64, -64, -64, 64, -64, -64, -64, -64, 64, -64, 64, 64, 64, 64, 64, -64, -64, 64, 64, 64, 64, -64, -64, -64, -64, 64, -64, 64, 64, 64, -64, -64, -64, -64, 64, 64, 64, 64, 64, 64, 64, 64, -64, 64, -64, 64, -64, -64, -64, 64, 64, -64, 64, 64, -64, -64, 64, 64, -64, -64, -64, 64, 64, 64, -64, 64, 64, 64, 64, -64, 64, 64, -64, -64, -64, -64, -64, 64, 64, -64, -64, -64, -64, -64, 64, 64, -64, 64, -64, -64, 64, -64, 64, 64, -64, 64, 64, 64, -64, 64, -64, -64, -64, -64, -64, -64, -64, -64, -64, -64, 64, 64, -64, -64, -64, -64, 64, -64, -64, 64, 64, 64, 64, 64, 64, 64, 64, 64, 64, 64, -64, -64, 64, -64, -64, -64, 64, 64, -64, 64, -64, 64, -64, 64, 64, 64, -64, 64, 64, -64, 64, 64, 64, 64, 64, 64, 64, 64, -64, -64, -64, -64, -64, -64, -64, 64, 64, 64, 64, 64, -64, -64, -64, -64, 64, 64, -64, 64, 64, 64, 64, 64, 64, -64, -64, 64, -64, -64, -64, -64, 64, -64, -64, -64, -64, 64, 64, -64, 64, -64, 64, -64, 64, 64, -64, 64, 64, 64, -64, -64, -64, -64, 64, 64, 64, -64, -64, -64, -64, -64, -64, 64, 64, 64, 64, -64, -64, -64, -64, 64, 64, 64, 64, 64, -64, 64, -64, -64, -64, -64, -64, 64, 64, -64, -64, 64, 64, -64, -64, -64, 64, 64, 64, -64, 64, 64, -64, 64, 64, 64, 64, 64, 64, -64, -64, -64, -64, -64, 64, 64, 64, -64, 64, -64, 64, 64, -64, -64, 64, 64, 64, -64, -64, 64, -64, 64, 64, 64, 64, 64, -64, -64, -64, -64, -64, -64, -64, 64, 64, 64, 64, 64, 64, 64, -64, -64, 64, -64, -64, 64, -64, 64, -64, 64, 64, 64, 64, 64, -64, -64, 64, 64, -64, 64, 64, 64, 64, 64, 64, 64, 64, 64, -64, -64, -64, 64, -64, 64, 64, 64, 64, 64, 64, 64, 64, 64, -64, -64, 64, 64, -64, 64, 64, 64, 64, 64, -64, -64, -64, 64, -64, -64, 64, 64, -64, 64, 64, -64, -64, 64, 64, -64, -64, 64, 64, 64, 64, 64, 64, 64, 64, 64, 64, 64, -64, 64, -64, 64, 64, -64, -64, 64, -64, 64, 64, 64, -64, 64, 64, 64, 64, 64, 64, 64, -64, -64, -64, 64, 64, 64, -64, 64, 64, -64, -64, 64, -64, -64, -64, -64, 64, -64, 64, -64, -64, 64, 64, 64, 64, 64, 64, -64, -64, -64, -64, -64, 64, 64, 64, 64, 64, 64, -64, -64, 64, 64, -64, 64, 64, -64, -64, 64, 64, 64, 64, 64, 64, 64, 64, -64, 64, 64, 64, 64, 64, 64, -64, -64, 64, -64, -64, -64, 64, 64, 64, 64, -64, -64, -64, 64, 64, 64, 64, 64, 64, 64, 64, -64, -64, 64, 64, 64, 64, 64, 64, 64, 64, 64, 64, -64, 64, -64, 64, 64, -64, -64, 64, -64, -64, 64, 64, -64, 64, 64, 64, 64, -64, 64, 64, 64, 64, -64, -64, -64, -64, 64, 64, 64, -64, 64, 64, 64, 64, 64, -64, 64, -64, -64, 64, -64, -64, -64, -64, 64, 64, 64, -64, 64, 64, 64, -64, 64, 64, -64, -64, 64, -64, 64, -64, -64, -64, -64, 64, 64, -64, -64, -64, -64, -64, -64, 64, 64, 64, 64, 64, 64, -64, 64, -64, 64, 64, 64, 64, -64, -64, 64, -64, 64, -64, -64, -64, 64, -64, 64, 64, 64, -64, -64, -64, -64, -64, 64, 64, 64, -64, -64, 64, -64, 64, 64, 64, 64, 64, 64, 64, 64, -64, 64, 64, 64, -64, 64, 64, 64, 64, -64, -64, -64, -64, -64, 64, 64, -64, -64, -64, 64, 64, 64, -64, 64, -64, -64, -64, -64, -64, -64, 64, -64, 64, 64, -64, -64, -64, -64, 64, -64, -64, 64, -64, 64, 64, -64, 64, 64, -64, 64, -64, -64, 64, -64, 64, 64, -64, 64, -64, -64, -64, 64, 64, 64, 64, 64, -64, 64, -64, 64, -64, 64, -64, -64, 64, 64, -64, -64, 64, -64, 64, -64, 64, -64, 64, 64, 64, 64, -64, 64, 64, -64, 64, -64, -64, 64, 64, -64, 64, 64, -64, -64, -64, -64, 64, 64, 64, -64, -64, -64, -64, 64, -64, 64, 64, 64, 64, -64, -64, 64, 64, 64, -64, -64, 64, 64, -64, -64, -64, -64, -64, -64, -64, -64, 64, 64, 64, 64, 64, -64, -64, 64, -64, 64, 64, 64, -64, -64, 64, 64, 64, 64, 64, 64, 64, -64, -64, -64, -64, -64, -64, -64, -64, -64, 64, 64, 64, -64, -64, 64, 64, 64, 64, -64, 64, 64, 64, 64, 64, 64, 64, 64, 64, 64, 64, 64, -64, -64, -64, -64, -64, -64, -64, -64, -64, -64, 64, 64, 64, 64, 64, -64, -64, 64, 64, 64, 64, 64, 64, 64, 64, 64, 64, 64, 64, -64, -64, -64, 64, 64, 64, -64, 64, 64, -64, 64, 64, -64, -64, -64, -64, 64, 64, 64, 64, 64, 64, 64, 64, -64, 64, 64, 64, -64, -64, -64, 64, -64, -64, 64, -64, -64, -64, -64, 64, 64, -64, -64, -64, -64, 64, 64, -64, -64, 64, 64, 64, 64, 64, -64, 64, 64, 64, -64, 64, -64, 64, -64, 64, 64, -64, -64, 64, -64, -64, 64, 64, 64, 64, -64, 64, 64, 64, 64, -64, -64, 64, 64, 64, 64, 64, 64, 64, 64, 64, -64, 64, 64, -64, -64, -64, -64, -64, -64, 64, -64, -64, -64, -64, -64, -64, 64, -64, -64, -64, 64, 64, 64, 64, 64, 64, 64, 64, 64, -64, -64, -64, -64, -64, -64, -64, -64, 64, 64, 64, -64, -64, -64, 64, 64, 64, 64, -64, 64, -64, -64, -64, 64, 64, 64, 64, 64, -64, 64, -64, 64, -64, -64, -64, 64, 64, 64, -64, -64, -64, -64, 64, -64, -64, -64, 64, -64, -64, -64, -64, 64, 64, 64, 64, 64, -64, 64, -64, -64, 64, -64, -64, 64, 64, 64, -64, -64, -64, 64, -64, -64, -64, 64, -64, -64, -64, -64, -64, 64, 64, 64, 64, -64, 64, 64, 64, -64, -64, -64, 64, 64, 64, -64, 64, -64, 64, -64, 64, -64, -64, 64, -64, -64, -64, -64, -64, -64, -64, 64, -64, 64, 64, 64, -64, -64, -64, -64, -64, -64, 64, -64, -64, -64, 64, 64, 64, -64, -64, -64, -64, -64, -64, -64, -64, -64, -64, -64, -64, -64, 64, -64, 64, -64, -64, -64, -64, 64, 64, -64, -64, -64, -64, -64, -64, -64, 64, -64, -64, -64, -64, -64, -64, -64, -64, -64, 64, 64, 64, -64, 64, 64, -64, -64, -64, -64, -64, -64, -64, -64, 64, -64, -64, -64, -64, -64, -64, -64, -64, -64, -64, -64, -64, -64, -64, 64, 64, 64, 64, -64, -64, 64, -64, -64, -64, -64, -64, -64, -64, -64, -64, -64, 64, -64, -64, 64, 64, -64, 64, -64, -64, 64, -64, 64, 64, -64, -64, 64, -64, -64, -64, -64, -64, -64, -64, -64, -64, -64, -64, -64, -64, 64, 64, 64, -64, -64, -64, 64, 64, -64, -64, -64, -64, -64, -64, 64, 64, 64, 64, 64, 64, -64, 64, -64, -64, 64, 64, 64, 64, 64, 64, 64, 64, 64, 64, -64, -64, 64, -64, -64, -64, -64, 64, 64, 64, -64, -64, 64, 64, 64, 64, 64, 64, 64, 64, 64, 64, 64, 64, -64, 64, -64, 64, -64, 64, 64, 64, 64, -64, 64, -64, 64, 64, -64, 64, 64, 64, 64, 64, 64, 64, 64, 64, 64, 64, 64, 64, 64, 64, -64, 64, 64, 64, 64, -64, -64, 64, 64, 64, -64, 64, -64, 64, 64, 64, 64, 64, 64, 64, 64, 64, 64, 64, 64, 64, 64, -64, 64, 64, 64, -64, 64, 64, -64, 64, 64, 64, 64, 64, 64, 64, 64, 64, 64, 64, 64, -64, -64, 64, 64, 64, 64, 64, -64, -64, 64, -64, -64, 64, -64, 64, -64, -64, 64, -64, 64, 64, 64, 64, -64, -64, -64, 64, 64, 64, -64, 64, 64, 64, 64, -64, -64, 64, -64, 64, -64, -64, 64, -64, -64, 64, -64, 64, 64, -64, -64, 64, -64, -64, -64, -64, 64, 64, 64, 64, 64, -64, 64, 64, 64, -64, -64, -64, 64, -64, -64, 64, -64, 64, -64, 64, -64, -64, -64, -64, -64, -64, -64, -64, -64, -64, 64, 64, -64, -64, -64, -64, -64, 64, 64, 64, 64, -64, 64, -64, -64, -64, 64, -64, -64, 64, -64, 64, 64, -64, 64, -64, -64, 64, -64, -64, 64, 64, 64, 64, -64, -64, 64, -64, 64, 64, 64, -64, 64, 64, -64, 64, 64, -64, 64, 64, -64, -64, -64, -64, 64, -64, 64, 64, 64, 64, -64, -64, 64, 64, -64, -64, -64, -64, -64, -64, -64, -64, -64, 64, 64, 64, -64, 64, -64, 64, 64, 64, -64, -64, 64, 64, -64, 64, -64, 64, 64, -64, -64, -64, -64, 64, 64, -64, -64, -64, 64, -64, 64, -64, 64, -64, 64, -64, 64, -64, 64, 64, 64, -64, 64, 64, 64, 64, 64, 64, -64, -64, 64, 64, 64, 64, 64, -64, -64, 64, -64, -64, -64, 64, -64, -64, 64, -64, -64, 64, 64, -64, 64, 64, 64, 64, -64, -64, 64, -64, -64, 64, 64, -64, 64, 64, 64, 64, -64, 64, 64, 64, 64, -64, -64, 64, -64, -64, -64, -64, 64, 64, -64, -64, -64, -64, 64, -64, -64, 64, 64, -64, -64, -64, -64, 64, -64, 64, 64, 64, 64, -64, 64, -64, 64, -64, -64, -64, -64, -64, -64, -64, -64, -64, -64, -64, 64, -64, 64, -64, 64, -64, -64, 64, 64, 64, -64, -64, -64, 64, -64, -64, 64, -64, 64, -64, -64, 64, 64, 64, -64, 64, -64, -64, -64, -64, -64, 64, 64, 64, -64, -64, 64, -64, 64, 64, -64, 64, 64, -64, -64, 64, 64, 64, 64, 64, 64, 64, -64, -64, -64, -64, -64, 64, -64, -64, -64, 64, 64, -64, 64, 64, 64, 64, 64, 64, 64, 64, -64, 64, -64, -64, -64, -64, 64, 64, -64, 64, -64, 64, 64, -64, -64, 64, 64, -64, -64, -64, -64, -64, 64, 64, -64, -64, -64, -64, -64, -64, 64, -64, -64, -64, -64, -64, 64, -64, -64, 64, 64, -64, -64, -64, -64, -64, -64, -64, 64, 64, -64, 64, 64, -64, -64, -64, -64, -64, -64, -64, -64, -64, 64, 64, 64, 64, -64, -64, 64, -64, -64, -64, -64, -64, 64, 64, -64, 64, -64, -64, -64, -64, -64, -64, -64, -64, -64, -64, -64, -64, -64, -64, 64, -64, -64, -64, 64, -64, -64, 64, -64, -64, -64, -64, -64, 64, 64, 64, 64, -64, 64, 64, -64, -64, -64, -64, -64, -64, -64, -64, -64, -64, -64, -64, -64, -64, -64, -64, -64, -64, -64, 64, -64, 64, 64, 64, 64, 64, 64, -64, -64, -64, -64, 64, -64, 64, 64, -64, -64, -64, 64, -64, -64, -64, -64, -64, 64, 64, -64, -64, -64, -64, 64, 64, -64, -64, -64, -64, 64, -64, -64, -64, -64, -64, -64, -64, -64, -64, -64, 64, 64, -64, 64, -64, -64, -64, -64, 64, -64, 64, 64, 64, -64, -64, -64, -64, -64, -64, -64, 64, 64, -64, -64, -64, -64, -64, 64, 64, -64, 64, 64, 64, 64, -64, 64, -64, 64, 64, 64, -64, -64, -64, -64, -64, -64, -64, -64, -64, -64, -64, -64, 64, 64, -64, -64, -64, 64, -64, -64, -64, -64, -64, -64, 64, 64, 64, 64, -64, -64, -64, -64, -64, -64, -64, -64, -64, -64, -64, -64, -64, -64, -64, -64, 64, 64, -64, -64, 64, -64, 64, 64, 64, 64, 64, -64, -64, -64, -64, -64, -64, -64, -64, -64, -64, -64, -64, 64, -64, -64, -64, -64, 64, -64, -64, 64, 64, -64, 64, 64, 64, 64, -64, -64, 64, -64, -64, -64, -64, -64, -64, -64, -64, -64, -64, -64, -64, -64, 64, -64, -64, -64, -64, -64, 64, -64, -64, 64, 64, 64, 64, 64, 64, 64, -64, 64, -64, -64, -64, -64, 64, -64, -64, -64, -64, -64, -64, 64, 64, 64, 64, 64, -64, -64, 64, -64, 64, -64, -64, -64, -64, -64, 64, 64, -64, 64, -64, 64, -64, 64, -64, -64, 64, 64, 64, 64, 64, 64, -64, 64, -64, 64, 64, 64, -64, 64, 64, 64, -64, 64, 64, -64, -64, 64, 64, -64, -64, 64, -64, -64, 64, 64, 64, -64, -64, -64, -64, 64, -64, -64, 64, 64, 64, -64, 64, -64, -64, -64, -64, 64, -64, -64, -64, 64, 64, -64, 64, 64, 64, 64, 64, -64, 64, -64, 64, 64, 64, 64, -64, -64, 64, 64, -64, 64, -64, 64, 64, 64, 64, 64, 64, -64, 64, 64, -64, 64, 64, 64, -64, -64, -64, -64, -64, 64, -64, 64, 64, -64, 64, -64, -64, -64, -64, -64, 64, 64, 64, 64, 64, 64, -64, -64, 64, -64, -64, 64, 64, 64, -64, 64, 64, -64, -64, 64, -64, -64, -64, -64, -64, -64, 64, -64, -64, -64, -64, -64, -64, -64, 64, 64, -64, -64, -64, -64, -64, -64, -64, -64, -64, -64, -64, 64, -64, -64, -64, -64, 64, 64, -64, -64, 64, -64, -64, -64, 64, 64, 64, 64, 64, -64, 64, -64, 64, 64, 64, 64, -64, 64, -64, -64, -64, 64, 64, 64, 64, 64, -64, 64, -64, 64, -64, 64, -64, 64, -64, -64, -64, 64, -64, -64, -64, -64, 64, -64, -64, -64, 64, -64, 64, 64, -64, 64, 64, -64, -64, 64, -64, 64, -64, 64, 64, -64, -64, -64, -64, 64, 64, 64, 64, -64, -64, 64, -64, 64, 64, 64, -64, -64, 64, -64, 64, -64, 64, -64, -64, 64, 64, -64, -64, 64, -64, 64, 64, -64, -64, 64, -64, -64, 64, 64, -64, -64, 64, 64, -64, 64, -64, -64, 64, -64, -64, -64, 64, 64, 64, 64, 64, 64, 64, -64, 64, -64, 64, 64, -64, -64, -64, 64, -64, -64, 64, 64, -64, 64, -64, 64, 64, 64, 64, 64, 64, 64, 64, 64, -64, 64, -64, 64, 64, 64, 64, -64, -64, -64, -64, 64, -64, 64, 64, 64, -64, -64, -64, 64, 64, -64, 64, 64, 64, 64, 64, 64, 64, 64, 64, 64, 64, 64, -64, 64, 64, -64, -64, -64, 64, 64, -64, 64, -64, -64, 64, 64, -64, 64, -64, 64, 64, 64, -64, 64, 64, -64, 64, 64, 64, 64, 64, 64, 64, 64, 64, -64, -64, 64, 64, -64, 64, -64, -64, 64, -64, 64, 64, 64, -64, 64, -64, -64, 64, 64, 64, -64, 64, 64, -64, -64, 64, 64, -64, -64, -64, -64, -64, -64, -64, -64, 64, -64, 64, 64, 64, 64, -64, 64, 64, -64, -64, 64, -64, 64, 64, -64, -64, 64, 64, 64, -64, -64, -64, 64, 64, 64, 64, 64, 64, -64, 64, -64, 64, 64, 64, -64, 64, -64, 64, 64, 64, 64, -64, -64, 64, -64, -64, 64, -64, -64, -64, -64, 64, -64, -64, -64, 64, 64, 64, 64, -64, 64, 64, -64, -64, 64, 64, 64, 64, 64, 64, -64, 64, -64, -64, 64, 64, -64, 64, 64, -64, 64, -64, 64, -64, -64, 64, 64, 64, -64, 64, -64, 64, 64, 64, -64, 64, 64, 64, 64, -64, 64, 64, 64, 64, 64, 64, 64, -64, -64, -64, 64, 64, -64, 64, -64, -64, -64, -64, -64, 64, -64, -64, -64, -64, 64, 64, 64, 64, -64, 64, 64, 64, 64, -64, 64, 64, 64, 64, 64, -64, 64, -64, -64, -64, 64, 64, -64, 64, -64, 64, -64, 64, 64, -64, 64, -64, -64, 64, 64, 64, 64, 64, 64, -64, -64, -64, -64, 64, -64, -64, -64, 64, -64, 64, -64, 64, 64, 64, 64, 64, 64, 64, 64, 64, 64, -64, 64, 64, 64, 64, 64, -64, 64, -64, 64, 64, -64, 64, 64, -64, 64, 64, 64, 64, 64, 64, 64, 64, 64, 64, -64, 64, 64, 64, -64, 64, 64, -64, 64, 64, 64, -64, -64, 64, -64, 64, -64, -64, -64, 64, 64, -64, 64, 64, 64, 64, 64, -64, 64, -64, 64, -64, -64, 64, -64, -64, 64, 64, 64, 64, -64, 64, 64, 64, -64, -64, -64, -64, -64, -64, 64, 64, 64, 64, 64, 64, 64, 64, 64, -64, -64, 64, -64, -64, -64, -64, -64, 64, -64, 64, 64, -64, -64, -64, -64, -64, -64, -64, 64, 64, 64, -64, 64, -64, 64, 64, -64, -64, 64, 64, 64, 64, 64, 64, 64, 64, -64, 64, 64, -64, 64, -64, -64, -64, 64, -64, -64, 64, -64, -64, 64, 64, 64, 64, 64, 64, 64, 64, 64, 64, 64, 64, -64, 64, -64, -64, -64, 64, -64, 64, -64, 64, 64, 64, 64, 64, -64, 64, 64, 64, -64, 64, -64, 64, 64, 64, 64, -64, 64, 64, -64, -64, 64, -64, -64, 64, -64, 64, 64, 64, 64, -64, 64, 64, -64, 64, 64, -64, -64, 64, 64, 64, -64, 64, 64, 64, 64, 64, -64, -64, -64, -64, 64, 64, 64, 64, 64, 64, -64, -64, -64, 64, -64, 64, 64, 64, 64, -64, 64, 64, -64, 64, 64, 64, 64, 64, 64, 64, -64, -64, -64, 64, 64, 64, 64, 64, 64, -64, -64, -64, 64, 64, 64, -64, 64, -64, 64, -64, 64, -64, -64, 64, 64, 64, -64, -64, -64, 64, 64, 64, -64, 64, -64, -64, 64, -64, -64, 64, 64, 64, 64, -64, -64, 64, 64, -64, -64, 64, 64, -64, 64, 64, -64, -64, -64, -64, -64, -64, 64, -64, -64, 64, 64, -64, -64, -64, 64, -64, 64, 64, 64, -64, 64, 64, 64, -64, -64, -64, -64, -64, 64, -64, 64, 64, 64, -64, 64, -64, 64, 64, -64, -64, 64, -64, 64, 64, 64, -64, -64, 64, 64, -64, -64, -64, -64, -64, -64, -64, -64, 64, -64, -64, -64, -64, -64, 64, -64, -64, 64, -64, 64, -64, 64, -64, 64, 64, 64, 64, -64, 64, 64, 64, -64, -64, 64, 64, -64, 64, -64, -64, 64, -64, -64, -64, 64, -64, 64, 64, -64, -64, 64, -64, 64, 64, 64, 64, -64, -64, 64, -64, -64, -64, -64, 64, -64, 64, -64, -64, -64, -64, 64, -64, 64, 64, 64, -64, -64, 64, -64, 64, 64, -64, -64, 64, -64, 64, 64, -64, 64, -64, -64, 64, 64, 64, 64, -64, 64, 64, -64, -64, 64, 64, 64, 64, 64, 64, 64, 64, 64, 64, 64, -64, 64, 64, 64, 64, 64, -64, -64, -64, -64, -64, -64, -64, -64, -64, -64, 64, 64, 64, -64, 64, 64, -64, 64, 64, -64, -64, -64, -64, -64, -64, -64, -64, -64, -64, 64, -64, 64, 64, 64, -64, 64, -64, -64, 64, 64, 64, 64, 64, -64, -64, -64, -64, -64, -64, -64, -64, -64, -64, -64, -64, -64, -64, -64, 64, -64, 64, 64, 64, -64, -64, 64, -64, 64, 64, 64, -64, 64, 64, -64, -64, -64, -64, -64, -64, -64, -64, -64, -64, -64, -64, 64, 64, 64, -64, 64, -64, -64, -64, 64, -64, 64, 64, 64, 64, 64, 64, 64, 64, -64, -64, -64, -64, -64, -64, -64, 64, -64, -64, -64, -64, 64, -64, -64, 64, -64, -64, -64, 64, 64, 64, 64, 64, 64, 64, 64, -64, -64, -64, -64, -64, -64, -64, -64, -64, -64, -64, -64, 64, 64, 64, 64, -64, -64, -64, -64, 64, 64, 64, 64, 64, 64, -64, 64, -64, -64, -64, -64, -64, -64, -64, -64, -64, -64, -64, 64, -64, -64, 64, 64, 64, -64, -64, 64, 64, 64, -64, -64, 64, -64, -64, 64, 64, 64, -64, -64, -64, -64, -64, -64, -64, -64, -64, -64, -64, 64, -64, 64, -64, -64, -64, -64, -64, 64, -64, -64, -64, -64, -64, 64, -64, 64, -64, -64, 64, -64, -64, -64, -64, -64, -64, -64, 64, 64, -64, -64, -64, -64, -64, -64, -64, -64, -64, -64, -64, -64, -64, -64, 64, 64, 64, 64, -64, 64, 64, -64, -64, 64, -64, -64, -64, -64, -64, 64, -64, -64, -64, -64, -64, -64, 64, -64, -64, -64, -64, -64, 64, -64, -64, -64, -64, -64, -64, 64, -64, 64, 64, 64, -64, 64, -64, -64, 64, -64, -64, -64, -64, 64, 64, -64, -64, -64, -64, -64, -64, 64, -64, -64, 64, 64, -64, 64, -64, 64, -64, 64, 64, 64, 64, 64, 64, -64, -64, -64, -64, -64, -64, -64, -64, -64, -64, -64, -64, -64, -64, -64, -64, -64, -64, 64, -64, 64, -64, 64, 64, -64, 64, -64, 64, -64, -64, -64, -64, -64, 64, -64, -64, 64, 64, -64, -64, -64, -64, 64, -64, -64, -64, 64, -64, -64, 64, -64, -64, -64, -64, -64, -64, -64, -64, -64, -64, -64, -64, -64, -64, -64, -64, -64, -64, 64, 64, -64, -64, -64, -64, -64, -64, 64, 64, 64, -64, 64, 64, -64, -64, -64, -64, -64, -64, -64, -64, 64, 64, -64, -64, -64, -64, 64, 64, -64, -64, -64, 64, -64, 64, 64, 64, 64, -64, 64, -64, 64, 64, -64, -64, -64, -64, -64, -64, -64, 64, 64, 64, 64, 64, -64, 64, 64, 64, 64, -64, 64, -64, 64, 64, 64, -64, -64, -64, 64, -64, -64, -64, -64, -64, -64, -64, -64, 64, 64, 64, 64, -64, 64, 64, 64, -64, -64, -64, -64, 64, 64, 64, 64, 64, 64, -64, -64, 64, 64, -64, -64, -64, -64, -64, -64, 64, 64, 64, -64, 64, -64, -64, -64, 64, 64, -64, -64, -64, -64, -64, 64, -64, 64, 64, 64, 64, -64, -64, -64, -64, -64, -64, -64, -64, 64, 64, -64, -64, -64, -64, -64, 64, 64, -64, -64, -64, -64, 64, 64, 64, -64, 64, -64, 64, 64, 64, -64, -64, -64, -64, -64, -64, -64, -64, -64, -64, -64, -64, 64, -64, -64, -64, -64, -64, -64, 64, -64, -64, 64, -64, 64, -64, -64, -64, -64, -64, -64, -64, -64, -64, -64, -64, -64, 64, -64, 64, 64, -64, -64, -64, -64, -64, 64, 64, -64, 64, 64, -64, -64, 64, 64, 64, 64, -64, -64, -64, -64, -64, -64, -64, -64, -64, 64, 64, 64, 64, -64, -64, -64, -64, 64, 64, 64, -64, 64, -64, -64, -64, 64, -64, 64, -64, -64, -64, 64, -64, -64, 64, 64, 64, -64, 64, 64, 64, 64, 64, 64, -64, 64, -64, -64, -64, -64, 64, 64, 64, 64, -64, 64, -64, -64, -64, -64, 64, 64, 64, 64, -64, 64, 64, 64, 64, 64, 64, 64, 64, -64, -64, -64, 64, -64, -64, -64, 64, 64, 64, 64, -64, -64, -64, -64, 64, -64, 64, 64, 64, 64, -64, 64, -64, 64, -64, 64, 64, -64, -64, 64, 64, 64, 64, -64, -64, 64, -64, 64, -64, 64, 64, -64, 64, -64, -64, -64, -64, 64, -64, -64, 64, 64, 64, -64, -64, -64, 64, 64, 64, 64, -64, 64, 64, 64, -64, -64, -64, -64, 64, -64, -64, 64, 64, 64, 64, -64, -64, 64, -64, -64, -64, 64, -64, -64, -64, -64, 64, -64, 64, 64, -64, 64, -64, -64, 64, -64, 64, -64, -64, -64, -64, 64, -64, -64, -64, -64, -64, -64, -64, 64, -64, 64, 64, 64, -64, 64, -64, 64, -64, -64, -64, 64, -64, -64, -64, -64, -64, -64, -64, -64, 64, -64, -64, -64, -64, -64, -64, -64, -64, -64, 64, -64, -64, -64, 64, -64, 64, -64, -64, 64, -64, -64, -64, -64, -64, -64, -64, -64, -64, -64, -64, 64, -64, -64, -64, -64, 64, -64, 64, -64, -64, -64, 64, 64, -64, -64, 64, 64, -64, 64, -64, -64, -64, -64, -64, -64, -64, -64, 64, 64, 64, -64, -64, 64, 64, -64, 64, -64, -64, -64, 64, 64, 64, 64, 64, 64, 64, -64, 64, 64, -64, 64, -64, -64, -64, -64, -64, -64, 64, -64, -64, 64, 64, -64, -64, -64, -64, 64, -64, -64, 64, -64, 64, 64, 64, -64, -64, 64, 64, -64, -64, 64, 64, 64, 64, 64, 64, -64, -64, 64, -64, -64, -64, -64, -64, 64, -64, -64, 64, -64, -64, 64, -64, 64, 64, 64, 64, -64, 64, 64, 64, -64, -64, 64, 64, -64, -64, -64, 64, 64, -64, -64, -64, 64, -64, -64, -64, -64, -64, 64, -64, 64, -64, 64, 64, 64, 64, 64, 64, 64, 64, 64, -64, -64, -64, -64, -64, -64, -64, 64, 64, 64, -64, -64, -64, -64, -64, 64, -64, 64, -64, -64, -64, 64, 64, 64, 64, 64, 64, -64, -64, -64, 64, -64, -64, -64, -64, -64, -64, 64, 64, -64, 64, -64, -64, 64, -64, 64, 64, -64, 64, 64, 64, 64, 64, 64, 64, 64, -64, -64, 64, -64, -64, -64, -64, -64, -64, 64, -64, 64, -64, 64, -64, 64, -64, 64, 64, 64, 64, 64, 64, 64, 64, 64, 64, 64, 64, 64, 64, 64, 64, -64, -64, -64, -64, -64, -64, 64, 64, 64, -64, -64, -64, 64, 64, 64, 64, -64, 64, 64, 64, 64, 64, 64, 64, 64, 64, 64, -64, 64, -64, -64, -64, -64, -64, 64, -64, 64, 64, -64, 64, 64, 64, 64, -64, 64, -64, 64, 64, 64, 64, 64, 64, 64, 64, 64, -64, 64, -64, 64, -64, -64, -64, 64, 64, -64, 64, -64, -64, -64, 64, -64, -64, 64, -64, 64, 64, 64, 64, 64, 64, 64, 64, 64, 64, -64, -64, -64, 64, 64, -64, 64, -64, -64, -64, -64, -64, -64, -64, -64, 64, 64, 64, 64, 64, 64, 64, 64, -64, 64, 64, -64, -64, -64, -64, -64, -64, -64, 64, -64, -64, -64, -64, 64, 64, -64, -64, -64, -64, -64, -64, 64, 64, 64, 64, -64, -64, -64, 64, -64, -64, -64, -64, -64, -64, 64, -64, 64, 64, -64, -64, -64, -64, -64, -64, -64, -64, -64, 64, 64, 64, 64, -64, -64, -64, -64, -64, -64, -64, -64, -64, -64, 64, -64, 64, 64, 64, -64, 64, -64, 64, -64, -64, -64, -64, 64, 64, -64, 64, -64, -64, -64, -64, -64, -64, -64, -64, -64, 64, -64, -64, 64, 64, 64, -64, -64, -64, -64, -64, -64, -64, -64, 64, 64, 64, 64, -64, 64, -64, -64, -64, -64, -64, -64, -64, -64, -64, -64, -64, -64, -64, -64, -64, -64, -64, -64, -64, -64, 64, -64, 64, -64, -64, -64, 64, -64, -64, -64, -64, -64, -64, -64, 64, -64, -64, -64, 64, 64, -64, 64, -64, 64, -64, -64, 64, 64, 64, 64, 64, -64, 64, -64, -64, -64, -64, -64, -64, 64, -64, -64, -64, -64, -64, 64, -64, -64, 64, 64, 64, 64, 64, 64, 64, 64, 64, 64, 64, 64, 64, -64, 64, 64, -64, 64, -64, 64, 64, 64, 64, 64, -64, -64, -64, 64, 64, -64, 64, 64, 64, 64, 64, 64, 64, -64, -64, 64, 64, 64, 64, -64, -64, -64, -64, 64, 64, 64, 64, 64, -64, 64, 64, -64, 64, -64, 64, -64, 64, 64, 64, -64, -64, -64, -64, 64, 64, 64, -64, -64, -64, -64, -64, -64, 64, 64, 64, 64, -64, 64, 64, 64, 64, 64, 64, -64, -64, 64, 64, -64, -64, -64, 64, 64, 64, -64, 64, -64, 64, 64, 64, 64, 64, 64, 64, -64, -64, -64, -64, 64, -64, 64, 64, -64, -64, 64, -64, -64, 64, 64, 64, -64, -64, 64, 64, 64, -64, -64, 64, -64, 64, -64, 64, 64, -64, -64, -64, 64, -64, -64, -64, -64, -64, 64, 64, 64, -64, 64, 64, 64, 64, -64, -64, -64, 64, 64, 64, -64, -64, -64, -64, -64, -64, -64, 64, 64, -64, -64, 64, -64, 64, 64, -64, -64, 64, -64, -64, 64, -64, -64, 64, 64, 64, -64, 64, 64, 64, -64, -64, 64, -64, 64, 64, -64, 64, 64, 64, -64, -64, 64, 64, 64, -64, 64, -64, 64, -64, -64, -64, -64, 64, -64, 64, -64, -64, -64, 64, 64, 64, 64, 64, -64, -64, 64, -64, -64, 64, 64, 64, 64, -64, 64, 64, 64, 64, 64, 64, 64, 64, 64, -64, -64, 64, -64, -64, -64, -64, -64, 64, 64, -64, -64, -64, -64, 64, 64, 64, -64, -64, 64, 64, -64, -64, 64, 64, -64, 64, 64, -64, -64, -64, -64, 64, -64, 64, 64, -64, -64, 64, -64, -64, 64, -64, 64, 64, -64, -64, -64, 64, 64, -64, 64, -64, -64, 64, 64, 64, 64, 64, -64, -64, -64, -64, -64, 64, 64, -64, 64, -64, 64, -64, 64, 64, -64, 64, 64, -64, -64, 64, 64, -64, 64, -64, -64, 64, -64, 64, 64, 64, 64, -64, -64, 64, -64, 64, 64, 64, 64, -64, -64, -64, 64, 64, -64, 64, 64, 64, 64, -64, 64, 64, 64, 64, -64, 64, -64, 64, 64, -64, 64, -64, -64, -64, -64, -64, 64, -64, -64, -64, 64, 64, 64, 64, -64, 64, -64, 64, -64, -64, 64, -64, -64, 64, 64, 64, 64, -64, 64, -64, -64, -64, 64, -64, 64, -64, 64, -64, 64, 64, -64, -64, -64, 64, 64, 64, -64, 64, -64, 64, 64, -64, 64, -64, 64, 64, 64, -64, 64, 64, 64, -64, -64, 64, 64, -64, -64, 64, -64, -64, 64, 64, 64, -64, 64, -64, -64, -64, 64, -64, -64, 64, 64, 64, 64, 64, -64, 64, -64, -64, -64, -64, 64, -64, 64, -64, 64, -64, 64, -64, 64, 64, 64, 64, 64, 64, 64, -64, 64, 64, 64, -64, 64, 64, -64, 64, -64, -64, -64, 64, -64, -64, 64, -64, -64, 64, -64, 64, 64, 64, -64, -64, -64, 64, 64, 64, -64, 64, 64, 64, -64, 64, 64, -64, -64, -64, -64, 64, -64, 64, 64, 64, -64, -64, 64, 64, 64, 64, 64, 64, 64, -64, 64, 64, 64, 64, 64, 64, 64, 64, -64, 64, -64, 64, -64, 64, -64, -64, 64, 64, -64, 64, 64, 64, 64, 64, 64, 64, -64, -64, 64, -64, -64, -64, -64, 64, -64, 64, -64, -64, 64, 64, -64, -64, -64, -64, -64, 64, -64, 64, 64, 64, 64, 64, 64, -64, 64, -64, 64, 64, -64, -64, -64, 64, 64, -64, -64, 64, -64, 64, -64, 64, 64, 64, 64, 64, 64, 64, 64, 64, 64, -64, 64, 64, 64, -64, 64, 64, 64, 64, 64, -64, -64, -64, -64, 64, -64, -64, -64, 64, 64, -64, 64, 64, 64, 64, 64, 64, -64, 64, 64, 64, 64, 64, -64, -64, 64, -64, -64, -64, -64, -64, -64, 64, -64, 64, 64, -64, -64, 64, 64, 64, -64, 64, 64, -64, 64, 64, 64, 64, 64, -64, 64, 64, -64, 64, -64, 64, 64, -64, -64, 64, -64, -64, 64, 64, -64, -64, 64, 64, -64, -64, -64, -64, -64, 64, -64, 64, 64, 64, 64, 64, 64, 64, 64, 64, -64, -64, -64, 64, -64, -64, -64, 64, -64, 64, 64, 64, -64, 64, 64, -64, 64, 64, -64, 64, 64, 64, 64, -64, 64, 64, -64, 64, -64, 64, -64, 64, -64, -64, -64, -64, -64, -64, 64, 64, 64, 64, -64, 64, 64, 64, -64, 64, -64, 64, 64, 64, -64, -64, 64, -64, -64, 64, 64, 64, 64, 64, 64, 64, 64, -64, -64, -64, -64, 64, -64, 64, -64, -64, 64, -64, 64, 64, -64, 64, 64, -64, -64, -64, -64, 64, -64, -64, 64, 64, 64, 64, 64, 64, 64, -64, 64, -64, 64, 64, 64, 64, -64, 64, 64, 64, 64, 64, 64, 64, -64, 64, 64, 64, -64, -64, 64, 64, -64, 64, 64, 64, 64, -64, -64, 64, 64, -64, 64, 64, 64, 64, -64, 64, 64, 64, 64, -64, -64, 64, 64, -64, -64, 64, -64, -64, 64, 64, -64, -64, -64, -64, 64, 64, 64, -64, 64, -64, -64, 64, 64, 64, 64, -64, -64, 64, 64, 64, -64, 64, 64, 64, -64, 64, 64, 64, -64, 64, -64, -64, -64, 64, -64, 64, 64, -64, -64, 64, 64, -64, 64, 64, -64, -64, -64, 64, 64, -64, 64, 64, -64, -64, 64, -64, 64, -64, -64, -64, -64, 64, 64, -64, 64, -64, 64, -64, 64, 64, 64, -64, -64, 64, -64, 64, -64, 64, -64, -64, -64, 64, 64, -64, -64, 64, 64, -64, -64, 64, 64, -64, -64, 64, -64, 64, 64, -64, -64, 64, -64, 64, -64, 64, 64, 64, 64, -64, -64, -64, 64, 64, 64, -64, 64, 64, 64, 64, -64, 64, -64, 64, 64, 64, 64, -64, -64, 64, -64, 64, 64, -64, -64, 64, 64, 64, -64, -64, -64, 64, 64, -64, -64, 64, 64, 64, -64, 64, 64, -64, 64, 64, -64, 64, -64, 64, 64, -64, 64, -64, 64, 64, 64, 64, 64, -64, -64, 64, 64, 64, 64, 64, 64, -64, -64, -64, 64, 64, 64, 64, -64, 64, 64, 64, -64, -64, 64, 64, 64, -64, -64, 64, -64, -64, 64, -64, 64, -64, -64, -64, 64, -64, -64, -64, -64, -64, 64, 64, -64, -64, -64, -64, -64, -64, -64, -64, -64, 64, 64, 64, -64, -64, -64, -64, 64, 64, -64, -64, -64, 64, 64, 64, -64, -64, -64, -64, -64, 64, 64, 64, -64, -64, 64, -64, -64, -64, -64, 64, -64, 64, -64, 64, 64, -64, -64, -64, -64, -64, 64, -64, -64, -64, -64, -64, -64, -64, -64, -64, 64, 64, -64, -64, -64, -64, -64, -64, -64, -64, -64, -64, -64, -64, -64, 64, 64, -64, 64, -64, -64, -64, -64, -64, -64, -64, -64, 64, -64, 64, -64, -64, -64, -64, 64, -64, -64, -64, -64, -64, -64, -64, -64, -64, -64, -64, -64, -64, 64, -64, -64, -64, -64, -64, 64, 64, 64, 64, 64, -64, -64, -64, 64, 64, -64, -64, -64, -64, -64, -64, -64, 64, 64, -64, 64, -64, -64, -64, -64, -64, -64, -64, -64, 64, 64, 64, -64, -64, -64, -64, 64, 64, -64, -64, -64, -64, -64, -64, 64, 64, 64, 64, 64, -64, -64, -64, -64, -64, -64, -64, -64, -64, 64, 64, -64, -64, -64, -64, 64, -64, -64, 64, -64, -64, 64, 64, 64, 64, 64, -64, -64, -64, -64, -64, -64, -64, -64, -64, -64, -64, 64, 64, 64, 64, -64, -64, -64, 64, -64, -64, -64, -64, 64, 64, 64, 64, -64, -64, -64, -64, -64, -64, -64, -64, -64, -64, -64, -64, -64, 64, 64, 64, -64, -64, 64, 64, -64, -64, -64, -64, 64, 64, 64, 64, 64, -64, -64, -64, -64, -64, -64, -64, -64, 64, -64, 64, 64, 64, 64, 64, -64, -64, -64, -64, -64, -64, -64, -64, -64, 64, 64, 64, -64, -64, -64, -64, -64, -64, -64, 64, -64, 64, 64, 64, 64, 64, 64, 64, 64, 64, -64, -64, -64, 64, 64, -64, -64, -64, 64, 64, 64, 64, -64, 64, -64, -64, 64, 64, 64, 64, 64, 64, 64, 64, 64, 64, -64, 64, -64, -64, -64, 64, -64, 64, 64, 64, -64, 64, 64, 64, 64, 64, 64, 64, 64, 64, 64, 64, -64, 64, -64, -64, -64, -64, 64, -64, -64, -64, -64, -64, 64, -64, 64, -64, -64, -64, -64, 64, 64, 64, 64, 64, 64, 64, 64, 64, -64, -64, -64, -64, -64, -64, -64, -64, -64, 64, -64, 64, 64, 64, 64, -64, -64, -64, 64, 64, 64, 64, 64, 64, 64, 64, 64, 64, -64, 64, -64, -64, -64, -64, -64, -64, -64, 64, -64, -64, 64, 64, 64, 64, 64, 64, 64, 64, -64, 64, 64, 64, 64, -64, 64, 64, -64, 64, -64, -64, -64, 64, -64, -64, 64, -64, 64, -64, 64, 64, 64, 64, -64, -64, -64, -64, -64, -64, -64, 64, -64, -64, -64, -64, -64, 64, -64, -64, 64, 64, 64, -64, -64, -64, -64, 64, 64, 64, 64, 64, -64, -64, -64, -64, -64, -64, -64, -64, -64, -64, -64, -64, 64, 64, -64, -64, -64, 64, -64, 64, -64, -64, 64, 64, -64, 64, 64, 64, -64, -64, -64, -64, -64, -64, -64, -64, -64, 64, 64, 64, 64, 64, 64, -64, 64, -64, 64, 64, 64, 64, -64, 64, 64, -64, 64, -64, -64, -64, -64, -64, -64, -64, -64, -64, -64, -64, 64, 64, 64, 64, 64, -64, -64, 64, 64, 64, 64, 64, 64, 64, -64, -64, -64, -64, -64, -64, -64, -64, -64, -64, -64, -64, 64, 64, 64, -64, -64, -64, 64, -64, 64, 64, -64, -64, -64, 64, 64, -64, -64, -64, -64, -64, -64, -64, -64, -64, 64, -64, 64, 64, -64, -64, 64, -64, -64, -64, -64, -64, 64, -64, 64, 64, 64, -64, 64, -64, -64, 64, -64, 64, -64, -64, 64, -64, 64, 64, -64, -64, -64, -64, -64, -64, -64, 64, -64, 64, -64, 64, 64, -64, -64, -64, 64, 64, -64, 64, 64, 64, 64, -64, -64, 64, 64, -64, 64, -64, -64, -64, -64, -64, -64, -64, -64, -64, 64, 64, -64, -64, -64, -64, -64, 64, 64, 64, 64, 64, 64, -64, -64, 64, -64, 64, -64, 64, 64, -64, -64, -64, -64, 64, 64, -64, -64, 64, 64, -64, -64, 64, 64, 64, -64, 64, 64, 64, -64, 64, 64, -64, -64, 64, -64, 64, 64, 64, 64, 64, 64, -64, -64, 64, 64, 64, -64, -64, 64, 64, -64, -64, -64, -64, 64, -64, -64, 64, -64, -64, -64, -64, -64, -64, -64, 64, 64, -64, -64, 64, 64, 64, -64, 64, 64, 64, 64, -64, 64, 64, -64, 64, 64, -64, -64, -64, 64, 64, 64, 64, 64, -64, -64, -64, -64, 64, -64, -64, 64, -64, 64, -64, -64, 64, 64, -64, -64, 64, -64, 64, 64, -64, -64, -64, -64, -64, 64, 64, 64, 64, -64, 64, -64, -64, -64, -64, -64, -64, 64, -64, -64, -64, -64, -64, -64, 64, 64, 64, -64, -64, -64, -64, 64, -64, 64, 64, 64, 64, 64, 64, -64, -64, 64, 64, 64, 64, 64, 64, 64, -64, 64, 64, -64, -64, 64, 64, -64, -64, -64, 64, 64, 64, 64, 64, -64, 64, 64, 64, 64, 64, 64, -64, 64, -64, 64, -64, 64, 64, -64, -64, -64, 64, -64, -64, -64, -64, -64, 64, 64, 64, 64, 64, 64, 64, 64, -64, -64, 64, -64, 64, -64, -64, 64, -64, -64, -64, -64, -64, 64, -64, -64, -64, -64, -64, 64, 64, 64, 64, 64, -64, -64, 64, -64, -64, -64, 64, -64, 64, -64, 64, -64, 64, -64, -64, -64, 64, 64, -64, -64, 64, 64, -64, 64, 64, 64, 64, 64, 64, -64, -64, -64, -64, -64, 64, 64, 64, 64, -64, -64, 64, 64, -64, -64, -64, 64, 64, 64, 64, 64, 64, 64, -64, 64, 64, -64, -64, 64, 64, 64, -64, 64, 64, -64, 64, 64, 64, -64, -64, -64, 64, 64, 64, -64, -64, -64, 64, -64, 64, -64, 64, 64, 64, -64, -64, 64, 64, 64, 64, 64, 64, 64, -64, -64, -64, -64, -64, -64, -64, -64, -64, -64, 64, 64, 64, -64, -64, 64, 64, 64, 64, -64, -64, 64, 64, 64, 64, 64, 64, 64, 64, 64, -64, -64, -64, -64, -64, -64, 64, -64, 64, -64, -64, -64, -64, -64, -64, 64, -64, -64, 64, 64, 64, 64, 64, 64, 64, 64, 64, 64, -64, -64, -64, 64, 64, 64, 64, -64, -64, 64, 64, -64, -64, -64, 64, -64, -64, -64, 64, 64, 64, 64, 64, 64, -64, 64, 64, -64, -64, -64, -64, -64, -64, 64, 64, -64, 64, -64, 64, -64, -64, -64, -64, -64, 64, 64, 64, 64, 64, 64, -64, 64, -64, 64, -64, 64, -64, -64, -64, -64, -64, 64, -64, -64, -64, -64, -64, -64, -64, -64, -64, 64, 64, 64, 64, 64, 64, 64, 64, 64, 64, 64, 64, -64, -64, -64, -64, -64, 64, -64, 64, 64, -64, 64, -64, -64, -64, -64, 64, -64, 64, 64, 64, 64, 64, 64, 64, -64, 64, 64, -64, -64, -64, -64, -64, -64, -64, -64, 64, 64, 64, 64, -64, -64, -64, -64, 64, -64, 64, 64, -64, -64, 64, 64, -64, -64, 64, -64, -64, -64, -64, 64, -64, -64, -64, -64, 64, -64, -64, 64, 64, -64, -64, -64, -64, -64, -64, 64, -64, 64, 64, 64, 64, 64, 64, -64, -64, -64, -64, 64, -64, -64, 64, 64, -64, 64, 64, 64, -64, -64, 64, -64, 64, 64, -64, 64, 64, 64, 64, 64, 64, 64, 64, -64, -64, -64, -64, -64, 64, -64, 64, 64, -64, 64, -64, -64, 64, -64, -64, -64, 64, 64, 64, 64, -64, 64, 64, -64, -64, 64, -64, -64, 64, -64, -64, -64, -64, -64, -64, 64, 64, -64, -64, -64, -64, -64, 64, -64, 64, -64, 64, 64, 64, 64, 64, 64, 64, -64, 64, 64, 64, -64, -64, -64, 64, 64, 64, 64, 64, -64, -64, -64, 64, -64, -64, -64, -64, -64, 64, 64, 64, 64, 64, 64, 64, 64, 64, 64, 64, 64, -64, -64, 64, 64, -64, -64, 64, 64, 64, -64, 64, 64, 64, 64, 64, 64, 64, 64, 64, -64, 64, 64, 64, -64, 64, 64, 64, 64, -64, -64, -64, -64, -64, -64, -64, -64, -64, 64, -64, 64, 64, 64, -64, 64, 64, 64, 64, 64, 64, 64, 64, -64, 64, 64, 64, -64, 64, -64, 64, -64, -64, -64, -64, -64, -64, 64, -64, -64, 64, 64, 64, 64, 64, 64, -64, -64, 64, 64, 64, 64, 64, -64, 64, 64, 64, -64, -64, 64, 64, -64, -64, 64, 64, -64, 64, 64, -64, 64, -64, -64, 64, 64, 64, 64, 64, 64, -64, -64, 64, -64, 64, 64, 64, -64, -64, -64, 64, 64, 64, 64, 64, -64, -64, 64, 64, 64, 64, 64, 64, 64, -64, 64, 64, 64, 64, -64, 64, 64, -64, -64, 64, -64, -64, 64, -64, 64, -64, -64, 64, 64, 64, -64, 64, 64, -64, -64, -64, 64, 64, -64, 64, 64, 64, 64, -64, 64, 64, 64, -64, -64, 64, 64, -64, -64, 64, -64, 64, -64, -64, 64, 64, -64, 64, -64, 64, -64, 64, 64, 64, 64, -64, -64, 64, -64, 64, 64, -64, -64, 64, 64, -64, -64, 64, 64, 64, 64, 64, -64, -64, 64, -64, -64, 64, -64, 64, 64, 64, 64, 64, 64, 64, 64, -64, 64, 64, 64, -64, -64, 64, -64, 64, -64, 64, -64, -64, -64, -64, -64, -64, -64, -64, -64, -64, 64, -64, 64, 64, 64, 64, 64, 64, -64, -64, 64, 64, 64, -64, -64, -64, 64, -64, 64, -64, -64, -64, -64, -64, -64, -64, -64, 64, 64, 64, -64, -64, 64, 64, 64, 64, 64, -64, -64, -64, -64, -64, -64, -64, -64, -64, -64, 64, -64, -64, -64, -64, -64, 64, -64, 64, 64, 64, -64, 64, 64, 64, 64, -64, 64, -64, -64, -64, -64, -64, -64, 64, -64, 64, 64, -64, -64, 64, -64, -64, -64, -64, -64, 64, 64, 64, 64, 64, 64, 64, 64, -64, -64, -64, 64, 64, -64, -64, -64, 64, -64, -64, -64, 64, -64, -64, -64, 64, 64, -64, 64, -64, 64, -64, -64, 64, 64, 64, -64, -64, 64, -64, 64, 64, 64, -64, -64, 64, -64, 64, 64, -64, -64, 64, 64, 64, -64, -64, 64, 64, 64, 64, -64, -64, -64, 64, -64, -64, -64, -64, -64, 64, -64, -64, 64, 64, -64, 64, 64, -64, 64, 64, 64, 64, -64, -64, 64, 64, 64, -64, -64, -64, -64, -64, -64, -64, -64, -64, -64, -64, -64, -64, 64, -64, 64, 64, 64, 64, -64, 64, 64, 64, -64, -64, -64, 64, 64, 64, -64, -64, -64, 64, -64, -64, -64, -64, -64, -64, -64, -64, -64, -64, 64, 64, 64, 64, -64, 64, -64, -64, -64, -64, 64, -64, 64, 64, -64, 64, 64, 64, 64, -64, -64, -64, 64, -64, 64, 64, 64, -64, 64, -64, 64, 64, -64, -64, -64, -64, -64, 64, -64, 64, -64, 64, 64, 64, 64, 64, 64, -64, -64, -64, -64, 64, 64, -64, 64, -64, -64, 64, 64, 64, -64, -64, -64, -64, -64, 64, 64, 64, 64, 64, 64, -64, 64, 64, -64, -64, -64, -64, -64, 64, 64, 64, 64, 64, 64, 64, -64, -64, -64, -64, -64, -64, -64, -64, -64, -64, -64, 64, -64, -64, -64, -64, -64, -64, -64, -64, -64, 64, 64, 64, -64, -64, -64, 64, -64, -64, -64, -64, -64, -64, -64, -64, -64, -64, -64, -64, -64, -64, -64, -64, -64, -64, -64, -64, -64, 64, 64, 64, -64, -64, -64, 64, -64, -64, -64, -64, -64, -64, -64, -64, 64, -64, -64, -64, -64, -64, -64, -64, -64, -64, -64, 64, -64, -64, 64, -64, -64, 64, -64, 64, -64, -64, -64, -64, -64, -64, -64, 64, 64, -64, 64, 64, -64, -64, -64, -64, -64, -64, -64, -64, -64, -64, 64, 64, 64, 64, 64, -64, -64, -64, -64, -64, -64, 64, 64, -64, 64, 64, 64, 64, -64, -64, -64, -64, -64, 64, -64, -64, -64, 64, 64, 64, 64, -64, 64, 64, 64, -64, -64, 64, -64, -64, 64, 64, -64, 64, 64, 64, 64, -64, -64, 64, -64, 64, 64, -64, -64, -64, 64, -64, -64, -64, -64, -64, -64, -64, -64, -64, 64, 64, 64, 64, 64, 64, 64, 64, 64, -64, -64, -64, 64, 64, 64, -64, -64, -64, 64, -64, -64, -64, 64, 64, -64, -64, -64, -64, -64, 64, 64, 64, 64, 64, 64, 64, 64, -64, -64, -64, -64, 64, -64, 64, 64, 64, -64, 64, -64, -64, 64, -64, -64, 64, -64, -64, -64, 64, 64, 64, 64, 64, 64, 64, 64, -64, -64, -64, -64, 64, -64, 64, 64, -64, 64, -64, 64, 64, 64, 64, -64, -64, -64, -64, -64, 64, 64, 64, 64, 64, 64, 64, 64, 64, -64, -64, -64, 64, 64, 64, -64, -64, 64, 64, -64, 64, 64, -64, 64, 64, -64, 64, 64, 64, 64, 64, 64, 64, 64, 64, 64, 64, -64, 64, 64, -64, 64, 64, -64, 64, -64, 64, 64, 64, -64, -64, -64, 64, -64, 64, 64, -64, 64, 64, -64, 64, 64, 64, -64, 64, 64, -64, -64, -64, -64, 64, 64, -64, -64, 64, -64, 64, 64, -64, -64, 64, -64, -64, -64, 64, 64, -64, 64, -64, 64, 64, -64, -64, 64, -64, 64, 64, -64, 64, 64, 64, -64, 64, 64, 64, 64, 64, -64, 64, -64, -64, 64, -64, -64, -64, 64, 64, -64, -64, 64, 64, -64, 64, -64, 64, -64, -64, -64, 64, 64, 64, 64, 64, 64, -64, -64, -64, -64, -64, -64, -64, 64, -64, 64, 64, -64, 64, 64, -64, 64, 64, 64, -64, 64, -64, -64, -64, -64, 64, 64, 64, 64, 64, 64, -64, 64, -64, -64, 64, 64, -64, -64, 64, 64, 64, -64, 64, 64, -64, 64, -64, 64, -64, 64, 64, 64, 64, 64, -64, -64, -64, 64, -64, -64, 64, 64, 64, 64, -64, -64, -64, -64, 64, 64, 64, -64, -64, 64, 64, -64, 64, 64, 64, 64, 64, -64, -64, 64, 64, 64, -64, 64, 64, -64, -64, 64, -64, -64, -64, -64, -64, -64, -64, -64, 64, -64, 64, 64, -64, -64, -64, -64, 64, 64, 64, 64, 64, 64, -64, 64, -64, 64, -64, -64, 64, 64, 64, -64, 64, 64, -64, 64, 64, -64, -64, -64, 64, -64, -64, 64, -64, -64, -64, 64, -64, 64, 64, 64, -64, 64, 64, -64, 64, -64, 64, -64, -64, -64, -64, -64, -64, 64, -64, 64, -64, 64, 64, 64, 64, 64, -64, -64, 64, -64, 64, -64, -64, -64, -64, -64, 64, -64, -64, -64, 64, -64, 64, 64, -64, 64, 64, -64, -64, -64, 64, 64, 64, -64, 64, 64, -64, -64, -64, -64, -64, -64, -64, -64, -64, 64, 64, 64, -64, -64, -64, -64, -64, 64, 64, 64, 64, 64, -64, 64, 64, -64, 64, -64, -64, 64, -64, -64, -64, -64, -64, -64, -64, -64, -64, 64, -64, -64, -64, -64, -64, -64, -64, 64, -64, -64, -64, -64, -64, 64, 64, 64, -64, -64, 64, 64, -64, -64, -64, -64, -64, -64, -64, -64, -64, -64, -64, 64, -64, -64, 64, -64, 64, 64, -64, 64, 64, 64, -64, -64, -64, -64, -64, 64, -64, 64, -64, -64, -64, -64, -64, -64, -64, -64, -64, -64, -64, -64, -64, -64, -64, -64, -64, -64, 64, -64, -64, -64, 64, 64, -64, -64, -64, -64, -64, 64, -64, -64, -64, -64, -64, -64, 64, -64, 64, -64, -64, -64, -64, 64, 64, -64, -64, -64, 64, 64, 64, 64, -64, 64, 64, -64, -64, -64, -64, 64, -64, -64, -64, -64, -64, 64, 64, 64, -64, -64, -64, -64, 64, 64, -64, 64, -64, 64, -64, -64, -64, 64, 64, -64, -64, 64, -64, -64, -64, 64, -64, 64, -64, -64, -64, 64, -64, 64, -64, -64, -64, -64, -64, -64, -64, 64, -64, -64, 64, -64, 64, 64, -64, 64, 64, 64, 64, -64, -64, -64, -64, -64, 64, 64, 64, 64, -64, 64, -64, 64, -64, -64, -64, 64, 64, 64, 64, 64, 64, -64, 64, -64, 64, -64, -64, 64, 64, 64, -64, 64, -64, 64, -64, 64, -64, 64, 64, 64, 64, -64, 64, 64, 64, -64, -64, -64, 64, -64, -64, 64, -64, -64, 64, -64, 64, 64, -64, -64, -64, -64, -64, -64, 64, 64, 64, -64, -64, -64, 64, 64, -64, -64, -64, -64, -64, 64, -64, -64, -64, 64, -64, -64, 64, -64, 64, -64, -64, -64, -64, 64, 64, 64, -64, 64, -64, -64, -64, -64, -64, 64, 64, 64, 64, -64, -64, -64, -64, 64, -64, -64, -64, -64, -64, -64, -64, -64, -64, -64, 64, 64, 64, -64, 64, 64, -64, -64, 64, 64, -64, 64, 64, -64, -64, 64, 64, -64, 64, -64, -64, -64, -64, 64, -64, -64, -64, 64, -64, 64, 64, 64, -64, -64, 64, -64, 64, -64, -64, 64, -64, 64, 64, -64, -64, -64, -64, -64, -64, 64, -64, -64, 64, -64, 64, 64, 64, 64, -64, 64, -64, -64, 64, 64, 64, 64, 64, 64, -64, -64, -64, -64, -64, -64, 64, 64, -64, 64, 64, 64, -64, -64, 64, -64, -64, -64, 64, 64, -64, -64, 64, 64, -64, 64, 64, 64, -64, -64, -64, -64, -64, -64, -64, 64, -64, -64, 64, -64, -64, -64, 64, -64, 64, 64, 64, -64, -64, 64, 64, -64, 64, 64, 64, -64, -64, -64, -64, -64, -64, -64, -64, 64, 64, 64, -64, -64, -64, 64, -64, -64, 64, 64, -64, 64, 64, 64, 64, 64, 64, -64, 64, -64, 64, 64, 64, 64, 64, 64, 64, 64, 64, -64, -64, -64, -64, -64, 64, -64, -64, 64, 64, 64, -64, -64, 64, -64, 64, 64, 64, 64, -64, -64, 64, -64, -64, 64, 64, 64, 64, 64, 64, 64, -64, -64, 64, -64, 64, 64, -64, -64, 64, 64, -64, 64, -64, 64, 64, 64, 64, -64, -64, -64, 64, 64, -64, -64, 64, 64, 64, 64, -64, -64, -64, -64, -64, -64, 64, 64, -64, -64, -64, -64, 64, 64, 64, 64, -64, 64, -64, -64, -64, 64, 64, -64, -64, 64, -64, -64, 64, -64, -64, 64, -64, -64, 64, 64, -64, -64, 64, 64, 64, 64, 64, 64, -64, 64, 64, -64, 64, 64, -64, -64, -64, 64, 64, -64, -64, 64, -64, -64, 64, -64, 64, 64, 64, -64, 64, 64, -64, -64, -64, -64, -64, 64, -64, 64, 64, 64, -64, 64, 64, 64, 64, -64, -64, -64, -64, -64, -64, -64, -64, -64, 64, -64, -64, -64, -64, -64, -64, 64, 64, 64, -64, 64, 64, 64, -64, -64, -64, -64, -64, 64, 64, -64, -64, -64, -64, -64, 64, -64, 64, 64, -64, 64, 64, -64, -64, -64, -64, 64, -64, 64, 64, -64, 64, -64, -64, -64, -64, -64, -64, 64, -64, -64, -64, 64, 64, 64, 64, -64, -64, -64, 64, -64, -64, 64, 64, 64, 64, 64, 64, 64, 64, 64, -64, 64, -64, 64, -64, 64, 64, -64, 64, 64, 64, 64, 64, -64, -64, 64, 64, -64, -64, -64, 64, -64, 64, 64, 64, 64, 64, 64, 64, 64, -64, -64, -64, 64, 64, -64, -64, 64, -64, -64, 64, -64, -64, -64, -64, -64, 64, -64, -64, -64, -64, -64, 64, -64, -64, -64, -64, -64, -64, -64, 64, 64, 64, -64, -64, 64, -64, 64, -64, 64, -64, -64, 64, 64, 64, 64, -64, -64, -64, -64, -64, -64, -64, -64, 64, 64, -64, -64, 64, 64, 64, -64, 64, -64, 64, -64, -64, -64, 64, -64, 64, 64, 64, -64, -64, -64, -64, -64, -64, 64, 64, 64, -64, -64, -64, 64, 64, 64, 64, 64, -64, 64, 64, 64, 64, 64, -64, 64, 64, 64, 64, 64, 64, -64, -64, -64, 64, -64, 64, -64, -64, -64, -64, 64, 64, -64, -64, 64, 64, 64, 64, 64, 64, 64, -64, -64, 64, 64, -64, 64, -64, -64, -64, -64, -64, 64, -64, -64, -64, -64, -64, -64, -64, -64, 64, 64, -64, 64, 64, 64, -64, 64, 64, -64, 64, 64, 64, -64, -64, -64, -64, -64, -64, -64, -64, 64, -64, -64, -64, -64, -64, -64, 64, -64, 64, -64, -64, 64, -64, -64, -64, 64, 64, 64, 64, -64, -64, -64, -64, -64, -64, 64, -64, -64, -64, -64, -64, -64, 64, -64, 64, 64, 64, -64, -64, -64, 64, 64, -64, 64, -64, 64, -64, 64, -64, -64, -64, -64, -64, -64, -64, -64, -64, 64, -64, -64, -64, -64, -64, 64, -64, 64, -64, 64, -64, 64, 64, -64, -64, -64, -64, -64, 64, -64, 64, -64, -64, 64, -64, -64, -64, -64, -64, -64, 64, -64, -64, -64, 64, 64, 64, 64, 64, -64, 64, 64, -64, 64, 64, 64, 64, -64, -64, -64, 64, -64, 64, -64, -64, -64, -64, 64, -64, 64, 64, -64, -64, -64, 64, -64, 64, 64, -64, -64, -64, -64, 64, 64, 64, -64, 64, 64, -64, 64, 64, -64, -64, -64, -64, -64, -64, -64, 64, 64, -64, 64, -64, 64, -64, 64, 64, 64, 64, 64, 64, 64, 64, 64, -64, 64, 64, -64, -64, -64, -64, -64, -64, -64, -64, -64, 64, -64, -64, -64, 64, 64, 64, -64, 64, 64, -64, -64, -64, 64, 64, 64, -64, -64, 64, 64, 64, -64, -64, 64, -64, -64, -64, -64, 64, 64, 64, 64, 64, 64, 64, -64, 64, -64, 64, -64, -64, -64, -64, 64, -64, 64, -64, -64, -64, -64, -64, -64, -64, -64, -64, -64, 64, -64, 64, 64, 64, 64, 64, 64, 64, -64, 64, 64, 64, -64, 64, 64, -64, -64, 64, 64, -64, 64, -64, -64, -64, -64, -64, 64, -64, -64, -64, 64, -64, -64, 64, -64, 64, -64, 64, -64, 64, -64, -64, 64, 64, 64, 64, -64, 64, 64, -64, -64, -64, -64, -64, -64, -64, -64, 64, 64, -64, 64, -64, -64, -64, 64, -64, -64, 64, 64, 64, 64, -64, 64, 64, 64, 64, 64, 64, 64, -64, -64, -64, -64, 64, 64, 64, 64, 64, 64, -64, 64, -64, 64, 64, 64, -64, 64, 64, 64, 64, 64, -64, -64, -64, 64, 64, 64, -64, -64, -64, 64, 64, -64, -64, -64, -64, 64, -64, -64, 64, -64, 64, -64, -64, -64, -64, 64, 64, 64, -64, -64, -64, -64, -64, -64, 64, -64, -64, -64, -64, 64, 64, 64, 64, 64, -64, 64, 64, -64, 64, 64, -64, -64, 64, 64, 64, -64, -64, 64, 64, 64, 64, -64, 64, -64, -64, -64, 64, 64, 64, -64, 64, -64, 64, -64, -64, 64, -64, -64, 64, 64, 64, 64, -64, -64, 64, 64, -64, -64, 64, -64, 64, 64, -64, -64, -64, -64, -64, 64, -64, 64, 64, 64, 64, -64, -64, 64, -64, -64, 64, -64, -64, -64, -64, -64, -64, -64, -64, 64, 64, 64, -64, 64, 64, -64, 64, 64, 64, 64, -64, -64, 64, 64, -64, -64, 64, -64, -64, 64, -64, -64, -64, 64, 64, -64, -64, 64, -64, 64, 64, -64, 64, -64, 64, -64, 64, -64, 64, -64, -64, 64, -64, 64, 64, 64, -64, 64, -64, 64, 64, 64, 64, 64, -64, -64, 64, 64, -64, 64, 64, -64, 64, -64, -64, -64, 64, 64, 64, 64, -64, -64, 64, 64, -64, -64, -64, -64, -64, -64, 64, -64, -64, -64, -64, 64, 64, 64, 64, 64, -64, 64, -64, -64, -64, 64, 64, -64, -64, 64, -64, -64, -64, -64, -64, -64, 64, -64, 64, 64, 64, 64, -64, -64, -64, -64, -64, -64, -64, -64, -64, -64, -64, 64, 64, -64, 64, 64, -64, -64, -64, -64, -64, -64, 64, 64, 64, 64, 64, 64, 64, -64, -64, -64, -64, -64, -64, -64, -64, 64, 64, -64, 64, -64, 64, 64, 64, -64, -64, -64, 64, 64, 64, 64, 64, 64, 64, 64, 64, 64, 64, -64, 64, -64, -64, -64, -64, -64, 64, 64, 64, 64, 64, 64, -64, -64, -64, -64, -64, 64, 64, 64, 64, 64, 64, 64, 64, 64, 64, 64, 64, 64, -64, -64, -64, -64, 64, 64, 64, 64, 64, -64, 64, -64, -64, -64, -64, 64, -64, -64, -64, 64, 64, 64, 64, 64, 64, 64, 64, 64, 64, -64, -64, 64, 64, -64, -64, 64, -64, 64, 64, -64, 64, -64, -64, 64, -64, 64, 64, 64, 64, 64, 64, 64, 64, 64, 64, 64, -64, -64, 64, 64, -64, -64, 64, -64, 64, -64, -64, -64, -64, -64, 64, -64, 64, -64, -64, -64, 64, 64, 64, 64, 64, 64, 64, 64, 64, 64, 64, 64, -64, -64, -64, -64, -64, 64, -64, 64, -64, 64, 64, 64, -64, -64, -64, -64, -64, -64, -64, 64, 64, 64, -64, -64, -64, 64, 64, -64, 64, -64, 64, -64, 64, 64, -64, 64, 64, -64, 64, -64, -64, -64, -64, -64, -64, -64, -64, -64, -64, 64, -64, 64, -64, -64, -64, 64, -64, 64, 64, 64, -64, -64, -64, -64, -64, -64, -64, -64, -64, -64, -64, -64, -64, -64, -64, -64, -64, -64, -64, -64, -64, -64, -64, -64, 64, -64, 64, 64, 64, -64, -64, -64, 64, 64, -64, -64, -64, -64, -64, -64, -64, -64, -64, -64, -64, -64, -64, -64, -64, -64, -64, -64, 64, -64, 64, -64, -64, -64, -64, 64, 64, -64, 64, 64, -64, 64, 64, 64, -64, -64, -64, -64, -64, -64, -64, -64, -64, -64, -64, -64, -64, -64, -64, -64, 64, 64, 64, 64, -64, -64, -64, -64, 64, -64, -64, -64, -64, -64, 64, -64, -64, -64, -64, -64, -64, -64, -64, -64, -64, 64, -64, 64, 64, 64, 64, 64, 64, -64, -64, -64, -64, -64, -64, -64, -64, -64, 64, -64, -64, -64, -64, -64, -64, -64, -64, -64, 64, -64, 64, -64, 64, 64, 64, 64, -64, -64, 64, 64, -64, -64, -64, -64, -64, -64, 64, 64, -64, -64, -64, -64, -64, -64, -64, -64, 64, 64, 64, 64, 64, 64, 64, 64, 64, 64, 64, 64, -64, -64, -64, -64, -64, -64, -64, 64, 64, -64, -64, -64, -64, 64, -64, 64, 64, -64, 64, 64, 64, 64, 64, 64, 64, -64, 64, -64, -64, -64, -64, -64, -64, -64, -64, 64, -64, 64, 64, 64, -64, -64, 64, -64, 64, -64, -64, 64, -64, 64, 64, 64, 64, 64, -64, -64, -64, -64, -64, 64, -64, -64, -64, -64, 64, -64, 64, 64, -64, 64, 64, -64, -64, 64, 64, 64, 64, -64, -64, -64, -64, -64, 64, -64, -64, -64, -64, -64, 64, -64, -64, -64, -64, -64, -64, -64, -64, 64, -64, -64, -64, 64, -64, 64, 64, -64, 64, -64, 64, 64, 64, -64, 64, 64, 64, 64, -64, 64, -64, 64, 64, -64, 64, 64, -64, -64, -64, -64, -64, 64, -64, -64, 64, 64, -64, -64, 64, -64, -64, 64, 64, 64, 64, 64, 64, 64, 64, 64, 64, 64, 64, 64, -64, 64, -64, -64, -64, 64, 64, -64, -64, 64, -64, -64, 64, 64, 64, 64, 64, 64, 64, 64, 64, 64, -64, 64, 64, 64, 64, 64, 64, -64, 64, -64, 64, -64, 64, 64, 64, 64, 64, 64, -64, 64, 64, 64, 64, 64, 64, 64, 64, 64, 64, 64, 64, 64, 64, 64, 64, 64, -64, 64, 64, -64, -64, 64, 64, 64, 64, -64, 64, 64, -64, -64, 64, 64, 64, 64, 64, 64, 64, 64, -64, -64, 64, -64, 64, 64, 64, 64, 64, 64, -64, 64, 64, -64, 64, 64, -64, -64, -64, -64, -64, -64, -64, 64, -64, 64, 64, 64, 64, -64, 64, 64, -64, -64, -64, 64, -64, 64, -64, -64, 64, 64, 64, -64, -64, -64, 64, -64, 64, -64, 64, 64, 64, 64, 64, -64, -64, 64, -64, -64, -64, 64, 64, 64, -64, 64, 64, -64, 64, -64, -64, 64, -64, 64, -64, 64, -64, -64, -64, 64, -64, 64, 64, -64, 64, -64, -64, 64, 64, -64, -64, 64, 64, -64, 64, -64, 64, 64, -64, 64, 64, 64, 64, -64, 64, -64, 64, -64, -64, 64, 64, -64, -64, 64, -64, -64, -64, 64, -64, 64, -64, -64, -64, -64, -64, -64, 64, -64, 64, 64, -64, -64, 64, 64, 64, 64, 64, 64, 64, 64, -64, 64, -64, 64, -64, -64, 64, -64, -64, -64, 64, 64, 64, 64, 64, -64, 64, 64, -64, 64, -64, 64, 64, 64, -64, -64, 64, -64, 64, -64, -64, 64, -64, 64, -64, 64, -64, -64, 64, 64, 64, -64, 64, 64, 64, 64, -64, 64, -64, -64, 64, 64, 64, 64, -64, 64, 64, -64, -64, -64, 64, 64, -64, 64, 64, 64, -64, 64, -64, 64, -64, 64, 64, 64, 64, 64, 64, -64, 64, 64, 64, -64, -64, 64, 64, 64, 64, 64, -64, 64, -64, 64, -64, -64, -64, 64, -64, 64, 64, 64, 64, 64, 64, -64, 64, 64, 64, 64, 64, 64, 64, 64, 64, 64, 64, 64, 64, -64, 64, 64, 64, -64, 64, -64, 64, -64, 64, 64, -64, 64, 64, -64, 64, 64, 64, 64, 64, 64, 64, 64, -64, 64, 64, -64, 64, -64, 64, -64, 64, 64, 64, -64, -64, 64, 64, 64, -64, 64, 64, -64, 64, -64, -64, 64, 64, 64, 64, -64, -64, 64, 64, -64, 64, -64, -64, -64, -64, 64, 64, 64, 64, -64, 64, -64, 64, 64, -64, -64, 64, 64, -64, 64, 64, 64, 64, 64, 64, -64, 64, 64, 64, -64, 64, 64, 64, 64, 64, -64, -64, -64, 64, 64, -64, 64, 64, 64, 64, -64, 64, -64, 64, -64, -64, -64, 64, 64, -64, -64, -64, 64, 64, -64, -64, 64, -64, -64, -64, -64, -64, 64, 64, -64, 64, 64, 64, -64, 64, 64, 64, 64, -64, 64, 64, 64, -64, 64, 64, -64, 64, -64, -64, -64, -64, 64, -64, 64, -64, -64, 64, 64, 64, 64, -64, -64, 64, 64, 64, -64, -64, 64, 64, 64, 64, -64, 64, -64, 64, 64, 64, 64, 64, -64, 64, -64, 64, -64, 64, 64, 64, 64, 64, 64, 64, 64, 64, 64, 64, 64, 64, 64, 64, 64, -64, -64, 64, -64, -64, 64, -64, 64, 64, 64, 64, 64, 64, -64, 64, 64, -64, -64, 64, 64, 64, 64, -64, 64, 64, -64, 64, 64, 64, -64, 64, -64, -64, -64, 64, -64, 64, -64, 64, -64, 64, -64, -64, -64, -64, 64, 64, 64, 64, 64, 64, -64, 64, 64, 64, 64, -64, -64, -64, -64, 64, 64, -64, -64, -64, -64, -64, 64, -64, 64, 64, 64, -64, 64, 64, 64, 64, 64, 64, -64, 64, 64, 64, -64, -64, -64, -64, 64, 64, 64, 64, -64, -64, 64, 64, 64, 64, 64, 64, 64, -64, 64, 64, 64, 64, 64, -64, 64, 64, -64, 64, 64, 64, -64, -64, -64, -64, -64, 64, 64, -64, 64, 64, -64, -64, 64, 64, 64, -64, 64, 64, 64, 64, 64, 64, 64, 64, -64, -64, -64, 64, -64, -64, 64, -64, -64, 64, -64, -64, -64, 64, 64, 64, 64, 64, -64, 64, 64, -64, 64, 64, 64, 64, 64, 64, -64, -64, -64, 64, 64, 64, -64, 64, -64, 64, -64, -64, -64, -64, 64, -64, 64, 64, 64, 64, -64, -64, 64, 64, -64, -64, -64, 64, -64, -64, 64, 64, -64, -64, -64, -64, 64, -64, -64, -64, 64, 64, 64, -64, -64, 64, 64, 64, 64, 64, -64, -64, -64, 64, 64, 64, 64, 64, -64, 64, 64, 64, -64, 64, -64, 64, -64, 64, 64, -64, 64, 64, 64, 64, 64, -64, -64, -64, -64, 64, -64, -64, 64, 64, -64, 64, -64, -64, 64, -64, -64, -64, -64, -64, -64, -64, -64, -64, 64, 64, -64, -64, 64, 64, -64, -64, 64, 64, -64, -64, -64, -64, -64, 64, -64, -64, -64, 64, -64, -64, -64, -64, 64, 64, -64, 64, -64, -64, 64, 64, -64, -64, 64, 64, 64, 64, 64, 64, 64, -64, -64, -64, 64, -64, 64, 64, -64, 64, -64, 64, 64, 64, -64, -64, 64, -64, -64, 64, -64, -64, -64, -64, -64, -64, 64, -64, -64, 64, 64, -64, 64, 64, 64, 64, -64, 64, -64, -64, 64, 64, 64, -64, 64, 64, -64, 64, -64, -64, -64, 64, 64, 64, 64, 64, -64, -64, -64, -64, -64, 64, 64, -64, -64, -64, -64, 64, 64, -64, 64, -64, 64, 64, -64, 64, 64, -64, -64, 64, -64, 64, 64, 64, -64, 64, -64, 64, 64, 64, 64, -64, 64, -64, 64, 64, -64, -64, -64, -64, -64, 64, 64, 64, 64, 64, -64, -64, 64, 64, -64, -64, -64, -64, -64, 64, 64, 64, 64, -64, 64, 64, 64, 64, 64, 64, 64, -64, -64, 64, 64, 64, 64, 64, 64, 64, -64, -64, 64, 64, 64, -64, -64, -64, 64, 64, -64, -64, 64, -64, -64, -64, 64, -64, -64, -64, 64, 64, 64, 64, 64, 64, -64, 64, 64, -64, 64, 64, -64, 64, -64, -64, -64, -64, -64, -64, -64, 64, 64, -64, 64, -64, 64, 64, 64, 64, 64, 64, 64, 64, 64, 64, -64, -64, -64, -64, -64, -64, -64, -64, -64, -64, -64, -64, -64, -64, 64, 64, -64, 64, 64, -64, -64, -64, -64, 64, -64, -64, 64, 64, 64, -64, -64, -64, -64, -64, -64, -64, -64, -64, -64, -64, -64, -64, 64, -64, -64, 64, 64, 64, -64, 64, -64, 64, -64, -64, 64, 64, 64, 64, 64, 64, -64, -64, -64, -64, 64, -64, 64, -64, -64, 64, 64, 64, -64, 64, 64, 64, 64, 64, 64, -64, -64, -64, 64, 64, 64, 64, 64, 64, 64, -64, 64, 64, -64, 64, 64, 64, 64, -64, 64, -64, 64, 64, 64, 64, 64, 64, -64, -64, -64, 64, 64, 64, 64, 64, 64, 64, 64, 64, -64, 64, 64, 64, 64, 64, 64, -64, 64, 64, -64, 64, 64, 64, -64, 64, -64, -64, 64, 64, 64, 64, 64, 64, 64, 64, 64, 64, 64, -64, 64, 64, 64, 64, 64, 64, 64, 64, -64, 64, -64, 64, 64, -64, -64, 64, 64, 64, 64, 64, 64, 64, 64, 64, 64, -64, -64, -64, 64, 64, 64, 64, 64, 64, 64, 64, -64, 64, -64, -64, 64, -64, -64, -64, 64, 64, 64, 64, 64, 64, 64, 64, 64, 64, -64, -64, -64, -64, 64, -64, 64, 64, -64, -64, -64, 64, 64, -64, -64, -64, -64, 64, 64, 64, 64, 64, 64, 64, 64, 64, 64, -64, -64, -64, 64, 64, -64, 64, 64, 64, 64, -64, 64, -64, 64, -64, -64, -64, -64, -64, -64, -64, 64, 64, 64, 64, 64, 64, 64, -64, -64, -64, -64, 64, 64, -64, 64, 64, -64, 64, -64, 64, -64, -64, -64, -64, -64, -64, -64, -64, 64, 64, 64, 64, 64, 64, 64, 64, -64, 64, 64, -64, -64, 64, 64, 64, -64, 64, 64, -64, -64, 64, -64, -64, -64, -64, -64, -64, 64, 64, 64, 64, 64, 64, 64, -64, -64, -64, 64, -64, 64, -64, 64, 64, -64, -64, 64, 64, 64, 64, 64, -64, -64, -64, -64, -64, 64, -64, -64, -64, 64, 64, 64, -64, -64, 64, 64, 64, -64, -64, 64, 64, 64, -64, -64, 64, 64, 64, -64, -64, -64, -64, -64, -64, -64, -64, 64, 64, 64, 64, -64, -64, 64, -64, 64, 64, -64, -64, 64, -64, -64, -64, 64, -64, 64, 64, -64, -64, -64, -64, -64, -64, 64, 64, 64, -64, 64, -64, -64, -64, -64, -64, 64, 64, -64, -64, 64, -64, -64, -64, -64, 64, -64, -64, 64, -64, 64, 64, -64, -64, -64, 64, 64, -64, 64, 64, 64, 64, -64, -64, 64, -64, -64, -64, -64, 64, 64, 64, 64, 64, 64, -64, 64, 64, 64, -64, -64, -64, 64, -64, 64, 64, 64, -64, -64, 64, 64, -64, 64, -64, -64, -64, 64, 64, 64, 64, -64, 64, -64, 64, 64, 64, 64, 64, -64, -64, -64, -64, -64, 64, 64, 64, -64, -64, 64, -64, 64, -64, -64, -64, -64, 64, 64, -64, 64, 64, 64, 64, 64, 64, 64, 64, 64, 64, 64, -64, 64, 64, 64, -64, 64, -64, -64, -64, -64, -64, -64, -64, -64, -64, -64, 64, 64, -64, 64, -64, 64, 64, 64, 64, 64, 64, 64, 64, 64, 64, 64, 64, 64, -64, 64, -64, 64, -64, -64, -64, -64, 64, -64, -64, 64, 64, 64, -64, 64, 64, -64, -64, 64, 64, 64, 64, 64, 64, 64, 64, 64, 64, 64, -64, 64, 64, -64, -64, -64, -64, -64, -64, 64, 64, -64, -64, 64, -64, 64, 64, -64, -64, 64, 64, 64, 64, 64, 64, 64, 64, -64, 64, -64, -64, -64, -64, -64, 64, 64, 64, 64, 64, -64, 64, -64, 64, -64, 64, -64, 64, 64, -64, 64, -64, -64, 64, 64, 64, -64, -64, -64, 64, -64, 64, -64, -64, -64, 64, -64, 64, 64, 64, -64, 64, -64, 64, -64, 64, 64, -64, -64, -64, 64, 64, -64, 64, 64, 64, -64, 64, 64, -64, 64, -64, 64, 64, -64, 64, -64, 64, -64, -64, -64, -64, 64, -64, 64, 64, -64, -64, 64, -64, 64, 64, 64, 64, -64, -64, -64, 64, 64, 64, 64, -64, -64, -64, 64, -64, -64, -64, 64, -64, -64, -64, -64, 64, 64, -64, 64, 64, 64, -64, 64, -64, 64, -64, -64, -64, 64, -64, 64, -64, 64, 64, 64, -64, 64, 64, 64, -64, -64, 64, -64, 64, -64, -64, 64, 64, 64, 64, -64, 64, -64, 64, 64, 64, 64, 64, 64, -64, 64, 64, 64, -64, 64, -64, 64, 64, -64, 64, -64, 64, -64, -64, -64, 64, 64, -64, 64, -64, -64, -64, 64, 64, -64, -64, -64, 64, 64, -64, -64, -64, -64, 64, -64, 64, -64, -64, -64, 64, 64, 64, 64, -64, -64, 64, 64, 64, -64, 64, -64, -64, 64, -64, -64, 64, 64, -64, -64, 64, -64, 64, 64, -64, 64, 64, 64, 64, 64, 64, -64, -64, -64, 64, 64, -64, -64, 64, -64, 64, 64, 64, 64, 64, -64, -64, 64, 64, 64, 64, -64, 64, 64, 64, -64, 64, 64, -64, 64, 64, 64, 64, 64, -64, 64, -64, 64, 64, 64, 64, 64, 64, -64, 64, -64, 64, 64, 64, -64, 64, -64, 64, 64, 64, -64, -64, -64, 64, 64, -64, -64, -64, 64, -64, 64, 64, 64, -64, 64, -64, 64, -64, -64, 64, 64, -64, 64, 64, 64, 64, 64, -64, 64, -64, 64, -64, 64, -64, 64, -64, 64, 64, 64, 64, 64, -64, -64, -64, 64, 64, -64, 64, 64, 64, -64, 64, -64, -64, 64, 64, 64, -64, -64, 64, 64, 64, -64, 64, 64, -64, 64, 64, -64, -64, 64, 64, -64, 64, 64, -64, 64, 64, 64, -64, -64, 64, 64, -64, 64, 64, 64, -64, 64, -64, 64, 64, 64, 64, -64, 64, -64, 64, 64, 64, 64, -64, 64, 64, 64, -64, 64, 64, -64, 64, 64, -64, 64, 64, 64, -64, 64, 64, 64, 64, -64, 64, -64, -64, 64, -64, 64, -64, 64, -64, -64, 64, 64, 64, -64, 64, -64, 64, 64, -64, -64, 64, -64, -64, -64, 64, 64, -64, 64, 64, 64, 64, -64, 64, 64, 64, -64, -64, -64, -64, 64, 64, -64, -64, -64, -64, -64, -64, 64, 64, 64, 64, -64, 64, 64, -64, 64, -64, 64, 64, -64, 64, -64, 64, -64, -64, -64, -64, -64, 64, 64, 64, 64, 64, 64, 64, -64, -64, 64, 64, 64, 64, 64, -64, -64, 64, -64, 64, 64, 64, 64, 64, 64, -64, -64, 64, -64, 64, 64, -64, 64, 64, -64, 64, -64, 64, 64, -64, 64, 64, -64, 64, -64, 64, 64, -64, -64, -64, -64, 64, -64, -64, -64, 64, 64, -64, 64, 64, -64, -64, -64, -64, 64, 64, -64, -64, 64, 64, -64, 64, -64, 64, 64, 64, 64, 64, -64, -64, 64, -64, 64, 64, 64, -64, 64, 64, 64, -64, -64, 64, 64, -64, 64, 64, 64, 64, 64, 64, -64, 64, -64, 64, -64, 64, -64, 64, 64, 64, -64, -64, 64, -64, 64, 64, 64, -64, 64, 64, 64, 64, 64, 64, 64, 64, 64, -64, 64, -64, 64, -64, 64, 64, -64, 64, 64, 64, 64, -64, -64, 64, -64, 64, 64, 64, 64, -64, 64, 64, 64, -64, 64, -64, -64, -64, -64, -64, -64, 64, -64, 64, 64, -64, -64, 64, -64, 64, 64, -64, -64, -64, 64, 64, -64, 64, 64, 64, 64, 64, -64, 64, 64, 64, 64, 64, 64, 64, 64, 64, -64, 64, 64, -64, -64, -64, 64, 64, 64, -64, -64, 64, 64, 64, 64, 64, 64, -64, 64, -64, 64, 64, -64, 64, 64, -64, 64, -64, -64, 64, 64, -64, -64, -64, -64, 64, 64, 64, 64, 64, 64, 64, 64, 64, -64, 64, 64, -64, -64, -64, 64, -64, -64, 64, -64, -64, 64, 64, 64, -64, 64, -64, 64, -64, 64, 64, -64, 64, -64, 64, -64, 64, -64, 64, -64, 64, -64, 64, 64, 64, 64, 64, -64, -64, 64, 64, 64, -64, 64, 64, 64, 64, -64, 64, -64, 64, 64, 64, 64, 64, 64, 64, 64, -64, -64, 64, -64, 64, -64, 64, 64, -64, -64, -64, -64, 64, -64, -64, 64, -64, -64, 64, -64, 64, -64, 64, -64, -64, -64, -64, 64, -64, -64, 64, -64, -64, -64, -64, 64, -64, -64, -64, 64, -64, 64, 64, 64, -64, 64, -64, 64, -64, 64, 64, -64, -64, 64, -64, -64, 64, -64, -64, -64, 64, 64, -64, 64, -64, 64, -64, -64, -64, -64, 64, -64, 64, -64, 64, -64, -64, -64, -64, 64, -64, 64, 64, 64, 64, 64, -64, -64, -64, 64, 64, 64, -64, -64, -64, 64, 64, -64, -64, 64, 64, -64, 64, -64, 64, -64, -64, -64, -64, -64, -64, -64, -64, 64, 64, 64, -64, -64, 64, -64, 64, -64, 64, -64, -64, -64, 64, -64, -64, -64, 64, -64, -64, -64, -64, -64, 64, 64, -64, -64, -64, -64, 64, -64, -64, 64, 64, 64, 64, -64, -64, -64, 64, -64, -64, -64, -64, -64, 64, 64, -64, -64, -64, -64, 64, -64, -64, -64, -64, -64, -64, 64, 64, 64, -64, -64, -64, -64, -64, 64, -64, 64, -64, -64, 64, -64, 64, 64, 64, 64, 64, -64, -64, -64, -64, -64, 64, 64, -64, -64, -64, 64, -64, -64, -64, 64, -64, -64, -64, -64, 64, -64, -64, -64, -64, -64, 64, -64, -64, -64, 64, -64, 64, -64, 64, 64, 64, -64, -64, -64, -64, -64, -64, 64, -64, 64, 64, -64, -64, -64, -64, -64, 64, 64, 64, -64, -64, 64, 64, 64, -64, 64, 64, 64, 64, -64, 64, 64, -64, 64, -64, -64, 64, -64, -64, -64, 64, -64, -64, -64, -64, 64, 64, -64, -64, 64, 64, -64, 64, 64, -64, -64, -64, 64, -64, 64, 64, 64, 64, 64, 64, -64, -64, 64, -64, -64, -64, -64, -64, 64, 64, 64, -64, 64, -64, -64, -64, -64, 64, -64, 64, -64, 64, 64, 64, 64, -64, 64, -64, -64, -64, 64, -64, -64, -64, -64, -64, 64, 64, 64, -64, -64, -64, -64, 64, -64, 64, -64, 64, 64, 64, 64, 64, 64, 64, 64, 64, 64, -64, -64, 64, 64, -64, -64, -64, 64, 64, -64, -64, -64, -64, -64, -64, -64, -64, 64, 64, 64, 64, 64, 64, 64, 64, 64, 64, 64, 64, 64, 64, -64, 64, 64, 64, 64, 64, -64, -64, -64, -64, 64, 64, -64, -64, 64, 64, 64, 64, 64, 64, -64, 64, 64, -64, 64, 64, 64, 64, -64, 64, 64, 64, 64, -64, -64, -64, -64, -64, -64, -64, -64, -64, 64, 64, 64, 64, 64, 64, 64, -64, 64, -64, 64, 64, 64, 64, -64, 64, 64, 64, 64, 64, -64, -64, -64, -64, 64, -64, -64, -64, 64, 64, 64, 64, 64, 64, -64, -64, -64, 64, 64, 64, 64, 64, 64, 64, 64, 64, 64, -64, -64, -64, 64, 64, -64, -64, -64, -64, -64, -64, 64, 64, 64, 64, 64, 64, 64, 64, -64, -64, -64, 64, -64, 64, 64, 64, 64, -64, -64, -64, -64, -64, -64, -64, -64, -64, -64, -64, 64, 64, 64, 64, 64, -64, -64, 64, 64, -64, -64, 64, 64, -64, -64, -64, -64, -64, 64, 64, -64, -64, -64, -64, -64, -64, -64, 64, -64, 64, 64, 64, -64, -64, -64, -64, -64, -64, -64, 64, 64, -64, -64, -64, -64, -64, -64, -64, -64, -64, -64, -64, -64, -64, -64, 64, 64, 64, -64, 64, -64, 64, 64, 64, -64, 64, -64, 64, -64, -64, -64, -64, -64, 64, -64, -64, -64, -64, -64, -64, -64, -64, 64, 64, 64, 64, 64, -64, -64, 64, -64, 64, -64, 64, -64, -64, 64, -64, 64, 64, -64, -64, 64, -64, -64, -64, -64, -64, -64, 64, 64, 64, 64, 64, -64, -64, -64, -64, 64, -64, 64, 64, -64, -64, -64, -64, -64, 64, 64, 64, 64, 64, -64, -64, -64, -64, -64, -64, 64, 64, 64, -64, -64, -64, -64, -64, -64, 64, 64, -64, -64, -64, 64, 64, -64, 64, 64, 64, 64, 64, -64, -64, -64, -64, -64, 64, 64, -64, 64, -64, -64, -64, 64, 64, 64, -64, -64, -64, 64, -64, 64, 64, 64, 64, 64, 64, -64, 64, -64, -64, -64, 64, 64, -64, 64, -64, -64, -64, -64, -64, 64, 64, 64, 64, -64, -64, -64, 64, 64, 64, 64, 64, 64, -64, 64, -64, -64, -64, -64, 64, 64, 64, -64, -64, 64, 64, 64, 64, -64, -64, -64, 64, -64, 64, 64, 64, 64, 64, 64, 64, 64, -64, -64, -64, 64, 64, 64, 64, 64, -64, -64, -64, 64, 64, 64, -64, 64, 64, 64, 64, -64, -64, 64, 64, 64, 64, 64, -64, -64, 64, -64, 64, 64, 64, 64, -64, -64, -64, 64, -64, 64, 64, 64, -64, -64, -64, 64, 64, 64, -64, -64, 64, 64, 64, -64, -64, 64, 64, 64, 64, 64, 64, 64, 64, -64, -64, 64, 64, 64, -64, 64, -64, 64, -64, 64, -64, 64, 64, 64, 64, 64, 64, -64, 64, 64, -64, -64, 64, -64, -64, 64, 64, 64, -64, 64, 64, -64, -64, -64, 64, 64, 64, 64, 64, -64, -64, 64, 64, 64, 64, -64, 64, 64, -64, -64, -64, -64, -64, 64, 64, -64, -64, 64, 64, 64, 64, -64, -64, -64, 64, -64, 64, 64, -64, -64, 64, -64, 64, 64, -64, -64, -64, -64, -64, 64, -64, -64, 64, -64, 64, -64, 64, 64, -64, -64, -64, -64, -64, -64, 64, 64, 64, -64, -64, 64, -64, 64, -64, 64, 64, -64, -64, 64, -64, -64, 64, 64, 64, -64, -64, -64, -64, 64, -64, 64, -64, -64, 64, 64, -64, 64, 64, -64, 64, 64, -64, 64, -64, 64, 64, 64, -64, -64, -64, -64, 64, 64, -64, 64, -64, -64, -64, 64, -64, -64, -64, 64, 64, -64, 64, 64, -64, -64, 64, -64, -64, 64, 64, 64, 64, -64, -64, -64, -64, 64, 64, -64, 64, -64, 64, 64, 64, -64, -64, -64, 64, -64, 64, -64, -64, -64, -64, -64, -64, -64, -64, 64, -64, -64, -64, 64, -64, -64, -64, -64, -64, 64, -64, -64, -64, 64, 64, -64, -64, -64, -64, -64, -64, 64, 64, -64, 64, 64, -64, -64, -64, 64, 64, -64, -64, -64, -64, -64, -64, -64, -64, -64, 64, -64, -64, -64, -64, -64, 64, 64, 64, 64, -64, -64, 64, 64, -64, -64, -64, -64, -64, -64, -64, -64, -64, -64, -64, 64, -64, -64, -64, 64, 64, 64, 64, 64, -64, 64, 64, 64, -64, -64, -64, -64, 64, 64, -64, -64, -64, -64, -64, -64, -64, -64, -64, 64, -64, 64, -64, -64, 64, 64, 64, 64, -64, 64, -64, -64, -64, -64, -64, -64, -64, -64, 64, -64, -64, -64, -64, -64, 64, -64, 64, -64, 64, -64, -64, 64, -64, 64, 64, 64, -64, -64, -64, -64, -64, -64, -64, -64, -64, -64, -64, 64, -64, -64, -64, -64, -64, -64, -64, -64, 64, 64, -64, 64, -64, -64, 64, 64, 64, -64, -64, -64, -64, 64, 64, -64, 64, 64, -64, -64, -64, -64, -64, -64, -64, -64, -64, 64, 64, -64, 64, -64, -64, 64, -64, -64, -64, -64, -64, -64, -64, 64, -64, -64, -64, 64, -64, -64, -64, -64, -64, -64, -64, -64, -64, 64, 64, -64, -64, -64, -64, -64, -64, 64, 64, -64, -64, -64, -64, 64, 64, 64, -64, -64, -64, -64, -64, -64, -64, -64, -64, -64, -64, -64, -64, 64, -64, 64, 64, -64, -64, 64, 64, -64, -64, -64, -64, -64, -64, -64, -64, -64, 64, -64, -64, 64, -64, -64, -64, -64, -64, -64, -64, 64, 64, -64, -64, 64, 64, 64, -64, -64, 64, -64, -64, -64, -64, -64, 64, 64, -64, -64, -64, 64, 64, -64, 64, -64, 64, 64, -64, -64, -64, 64, 64, -64, -64, -64, 64, -64, -64, -64, 64, 64, -64, 64, 64, 64, -64, 64, -64, -64, 64, 64, -64, -64, 64, 64, 64, -64, 64, 64, 64, 64, -64, -64, -64, -64, -64, -64, -64, -64, 64, 64, -64, -64, -64, -64, 64, -64, -64, -64, -64, 64, 64, 64, -64, -64, -64, 64, 64, -64, 64, -64, 64, -64, 64, -64, -64, -64, -64, -64, -64, -64, -64, -64, -64, -64, -64, -64, -64, 64, 64, 64, 64, -64, -64, -64, -64, -64, 64, 64, -64, 64, -64, 64, 64, 64, -64, 64, -64, -64, 64, 64, -64, -64, -64, -64, 64, 64, 64, 64, -64, 64, -64, 64, -64, 64, 64, -64, 64, -64, 64, -64, -64, -64, -64, -64, 64, -64, -64, -64, -64, -64, -64, -64, 64, 64, 64, 64, -64, -64, -64, -64, 64, 64, 64, -64, 64, 64, -64, 64, -64, -64, -64, -64, -64, -64, -64, 64, 64, -64, 64, -64, 64, 64, 64, -64, -64, 64, -64, -64, 64, 64, -64, -64, 64, 64, -64, 64, 64, -64, -64, -64, -64, -64, -64, -64, -64, 64, -64, -64, -64, 64, 64, -64, 64, 64, -64, 64, -64, 64, -64, 64, -64, -64, 64, 64, -64, -64, -64, -64, -64, -64, -64, 64, -64, -64, 64, 64, 64, 64, -64, -64, 64, -64, 64, 64, -64, -64, 64, 64, -64, -64, 64, 64, 64, 64, -64, 64, -64, 64, -64, -64, -64, -64, -64, 64, -64, -64, -64, -64, -64, 64, -64, 64, -64, -64, -64, 64, 64, 64, 64, 64, 64, -64, 64, 64, -64, 64, -64, 64, -64, -64, -64, 64, 64, 64, 64, -64, -64, 64, 64, -64, -64, 64, -64, -64, 64, 64, -64, -64, 64, 64, 64, 64, -64, -64, -64, -64, -64, -64, -64, -64, -64, -64, 64, -64, 64, -64, -64, 64, 64, 64, -64, 64, -64, -64, 64, -64, 64, -64, 64, -64, -64, 64, 64, 64, -64, 64, -64, -64, -64, -64, -64, 64, -64, 64, -64, 64, -64, -64, -64, 64, -64, -64, -64, -64, -64, 64, 64, -64, 64, 64, -64, -64, -64, 64, -64, 64, 64, -64, -64, 64, -64, 64, 64, -64, 64, 64, -64, -64, -64, 64, 64, 64, 64, 64, 64, 64, -64, 64, 64, 64, 64, -64, -64, 64, 64, 64, 64, 64, -64, -64, -64, 64, -64, 64, -64, 64, -64, 64, 64, 64, -64, -64, 64, -64, -64, -64, 64, 64, -64, 64, -64, -64, 64, -64, 64, 64, -64, -64, -64, -64, -64, -64, -64, 64, -64, 64, 64, -64, 64, -64, -64, -64, 64, 64, -64, -64, 64, 64, -64, -64, 64, -64, -64, -64, -64, -64, 64, 64, -64, -64, 64, -64, 64, -64, -64, 64, -64, 64, 64, 64, -64, -64, -64, -64, -64, -64, 64, -64, -64, -64, 64, 64, 64, 64, 64, 64, -64, -64, 64, 64, -64, -64, 64, -64, -64, -64, -64, 64, 64, -64, 64, -64, 64, -64, 64, -64, -64, 64, -64, 64, 64, -64, 64, -64, -64, 64, 64, -64, -64, -64, -64, -64, -64, 64, 64, 64, -64, -64, -64, -64, 64, -64, -64, -64, -64, -64, -64, 64, 64, 64, 64, -64, -64, -64, -64, -64, 64, 64, -64, 64, -64, -64, 64, -64, -64, -64, -64, -64, -64, -64, -64, -64, 64, 64, 64, -64, 64, -64, -64, 64, -64, -64, -64, -64, 64, -64, -64, -64, 64, -64, 64, -64, 64, -64, -64, -64, 64, 64, -64, -64, -64, 64, 64, 64, 64, 64, 64, -64, -64, 64, 64, -64, -64, -64, -64, -64, -64, -64, -64, 64, 64, 64, -64, 64, -64, -64, 64, -64, 64, 64, 64, -64, -64, 64, -64, 64, 64, 64, -64, -64, -64, 64, -64, -64, -64, -64, 64, -64, -64, -64, -64, 64, -64, -64, 64, 64, -64, 64, -64, -64, -64, -64, 64, -64, 64, -64, -64, -64, 64, -64, -64, 64, 64, 64, -64, -64, 64, 64, -64, -64, -64, -64, -64, 64, 64, 64, -64, 64, -64, 64, -64, 64, -64, 64, 64, 64, -64, -64, -64, -64, -64, -64, -64, -64, 64, -64, 64, -64, -64, -64, 64, 64, -64, -64, -64, -64, -64, 64, -64, -64, -64, 64, -64, 64, 64, -64, 64, 64, 64, -64, -64, 64, 64, -64, 64, -64, 64, -64, -64, 64, -64, 64, 64, -64, 64, 64, -64, 64, 64, -64, 64, 64, 64, -64, -64, -64, -64, -64, 64, -64, -64, 64, -64, -64, 64, -64, -64, 64, -64, -64, 64, 64, -64, 64, 64, 64, 64, 64, -64, 64, -64, -64, -64, -64, -64, 64, 64, 64, 64, -64, -64, -64, -64, -64, -64, 64, -64, -64, 64, -64, 64, -64, -64, -64, -64, 64, 64, 64, -64, 64, 64, -64, -64, -64, -64, -64, -64, -64, -64, 64, 64, -64, -64, -64, -64, -64, -64, -64, -64, -64, -64, -64, -64, 64, -64, 64, 64, 64, -64, -64, 64, -64, -64, -64, -64, -64, -64, 64, -64, -64, -64, -64, -64, -64, 64, 64, -64, -64, -64, 64, 64, -64, 64, -64, -64, -64, 64, -64, 64, -64, 64, 64, -64, -64, -64, -64, -64, -64, -64, -64, 64, -64, -64, 64, -64, -64, -64, -64, -64, -64, -64, -64, 64, -64, -64, 64, 64, -64, -64, 64, 64, -64, 64, -64, -64, -64, 64, -64, -64, -64, 64, -64, -64, -64, -64, 64, 64, -64, -64, 64, 64, 64, -64, 64, -64, -64, -64, 64, -64, -64, -64, -64, 64, -64, -64, 64, 64, 64, -64, -64, -64, 64, -64, 64, 64, 64, 64, 64, 64, -64, -64, 64, 64, -64, -64, 64, 64, 64, -64, -64, 64, -64, 64, 64, -64, -64, -64, -64, 64, -64, 64, -64, -64, -64, 64, 64, -64, -64, 64, -64, -64, -64, -64, -64, 64, -64, -64, -64, -64, 64, -64, -64, 64, 64, 64, -64, -64, -64, -64, 64, 64, 64, -64, 64, -64, -64, -64, 64, 64, -64, -64, -64, -64, -64, -64, 64, 64, 64, -64, -64, -64, -64, 64, -64, -64, 64, 64, -64, -64, 64, 64, 64, -64, -64, 64, -64, -64, -64, -64, 64, -64, 64, 64, 64, 64, -64, -64, 64, 64, -64, -64, -64, 64, 64, -64, -64, 64, -64, 64, -64, 64, -64, -64, 64, 64, 64, 64, -64, -64, -64, -64, 64, 64, -64, 64, -64, -64, 64, -64, 64, 64, 64, -64, -64, 64, 64, 64, 64, 64, -64, 64, 64, -64, -64, 64, -64, -64, -64, 64, 64, -64, 64, 64, 64, -64, -64, -64, 64, 64, 64, -64, 64, -64, 64, -64, -64, 64, 64, 64, -64, -64, 64, 64, -64, -64, -64, 64, -64, 64, 64, -64, 64, -64, -64, -64, 64, 64, 64, -64, 64, -64, -64, -64, 64, -64, 64, -64, 64, 64, -64, 64, 64, 64, 64, 64, -64, 64, -64, -64, 64, -64, -64, 64, -64, -64, 64, 64, -64, 64, -64, -64, -64, -64, 64, 64, -64, 64, -64, 64, 64, -64, 64, 64, 64, -64, -64, 64, -64, 64, -64, -64, -64, 64, -64, -64, -64, -64, 64, -64, 64, -64, 64, 64, -64, -64, 64, -64, 64, 64, -64, -64, 64, -64, -64, 64, 64, 64, 64, -64, -64, -64, 64, -64, 64, 64, -64, 64, 64, 64, 64, 64, 64, 64, -64, 64, -64, 64, 64, 64, -64, 64, 64, 64, -64, 64, -64, 64, 64, 64, 64, -64, 64, 64, 64, 64, -64, -64, 64, -64, -64, 64, -64, -64, -64, -64, -64, -64, -64, -64, -64, -64, -64, -64, -64, -64, -64, 64, -64, 64, 64, 64, 64, 64, -64, 64, 64, 64, -64, -64, 64, -64, -64, -64, -64, 64, 64, -64, -64, -64, 64, -64, -64, -64, -64, 64, 64, -64, -64, -64, 64, 64, -64, 64, 64, 64, 64, 64, 64, -64, 64, -64, -64, -64, 64, -64, 64, -64, 64, 64, -64, -64, 64, -64, 64, 64, 64, -64, 64, 64, 64, -64, 64, 64, -64, 64, -64, -64, -64, -64, -64, -64, -64, 64, 64, -64, -64, -64, 64, 64, -64, -64, -64, -64, -64, -64, -64, -64, 64, -64, -64, -64, 64, -64, -64, 64, -64, 64, -64, -64, -64, -64, -64, 64, -64, -64, -64, -64, -64, -64, 64, -64, -64, -64, -64, -64, -64, 64, 64, -64, -64, -64, -64, -64, 64, -64, -64, 64, -64, 64, 64, -64, -64, -64, 64, -64, 64, 64, 64, -64, 64, -64, 64, 64, -64, -64, 64, 64, 64, -64, -64, 64, -64, -64, 64, -64, -64, -64, -64, -64, 64, 64, -64, -64, -64, -64, -64, 64, -64, -64, 64, 64, -64, -64, 64, -64, -64, -64, 64, -64, 64, -64, -64, 64, 64, -64, 64, -64, -64, -64, -64, 64, 64, -64, -64, 64, -64, -64, 64, -64, -64, -64, -64, 64, -64, 64, -64, -64, -64, -64, -64, -64, -64, -64, -64, 64, 64, -64, -64, 64, -64, -64, 64, -64, 64, -64, 64, -64, -64, -64, 64, -64, -64, -64, -64, -64, -64, 64, -64, 64, -64, -64, -64, -64, 64, 64, -64, -64, -64, -64, -64, 64, -64, 64, -64, -64, 64, 64, 64, -64, 64, 64, -64, -64, -64, 64, -64, -64, 64, 64, 64, 64, -64, -64, -64, -64, 64, -64, -64, -64, -64, 64, -64, -64, -64, -64, -64, 64, 64, 64, -64, -64, 64, -64, -64, 64, -64, 64, -64, 64, -64, -64, -64, -64, -64, 64, -64, 64, -64, -64, 64, 64, 64, 64, -64, -64, -64, -64, -64, 64, -64, -64, -64, -64, 64, -64, -64, 64, 64, 64, -64, -64, -64, 64, 64, 64, -64, 64, 64, -64, -64, -64, 64, -64, -64, 64, -64, -64, -64, -64, 64, 64, -64, -64, 64, -64, 64, -64, 64, -64, -64, 64, -64, 64, -64, 64, 64, -64, -64, -64, -64, -64, 64, 64, 64, -64, 64, -64, -64, -64, -64, -64, -64, -64, 64, -64, -64, 64, -64, 64, 64, -64, 64, -64, -64, 64, 64, -64, 64, 64, 64, -64, -64, 64, 64, -64, 64, -64, -64, 64, 64, -64, -64, -64, -64, -64, 64, 64, -64, 64, -64, -64, 64, -64, -64, 64, 64, -64, -64, 64, 64, -64, -64, -64, -64, -64, 64, 64, -64, -64, 64, -64, 64, 64, -64, -64, -64, 64, 64, -64, -64, -64, 64, 64, 64, 64, -64, -64, -64, -64, -64, 64, -64, -64, -64, -64, 64, 64, 64, -64, 64, -64, -64, 64, 64, 64, 64, 64, -64, -64, 64, -64, 64, 64, -64, -64, -64, -64, -64, 64, -64, 64, 64, -64, -64, -64, 64, 64, -64, 64, -64, -64, -64, -64, 64, -64, 64, 64, -64, 64, -64, 64, -64, -64, -64, 64, -64, -64, -64, 64, 64, -64, -64, -64, 64, -64, 64, 64, 64, 64, 64, 64, -64, -64, 64, 64, 64, -64, -64, 64, -64, -64, -64, 64, -64, -64, 64, 64, -64, -64, -64, -64, 64, -64, -64, 64, -64, 64, 64, -64, -64, 64, -64, -64, -64, -64, -64, 64, 64, -64, -64, -64, -64, -64, 64, 64, 64, -64, 64, -64, 64, 64, 64, 64, 64, 64, 64, 64, 64, 64, -64, 64, 64, 64, 64, 64, -64, 64, 64, -64, -64, -64, 64, 64, -64, 64, 64, 64, -64, 64, -64, 64, 64, 64, -64, 64, -64, -64, -64, 64, -64, 64, -64, -64, -64, -64, 64, 64, 64, 64, -64, 64, 64, -64, -64, -64, -64, 64, -64, 64, 64, 64, 64, 64, 64, -64, 64, -64, -64, -64, 64, 64, 64, 64, 64, 64, 64, -64, 64, 64, 64, -64, 64, -64, -64, -64, -64, -64, 64, 64, -64, 64, -64, 64, 64, 64, 64, 64, -64, 64, 64, -64, -64, -64, 64, -64, 64, -64, -64, 64, 64, -64, -64, 64, 64, 64, -64, 64, 64, 64, 64, 64, 64, -64, 64, 64, 64, -64, 64, 64, 64, 64, -64, -64, 64, -64, -64, -64, 64, 64, -64, 64, 64, -64, 64, -64, -64, -64, -64, -64, -64, 64, 64, 64, -64, 64, 64, 64, 64, 64, 64, 64, 64, -64, -64, -64, -64, 64, -64, -64, -64, -64, -64, -64, -64, -64, 64, -64, 64, -64, -64, 64, -64, 64, 64, 64, 64, 64, 64, 64, -64, -64, -64, -64, -64, -64, -64, -64, 64, -64, -64, -64, -64, 64, -64, -64, 64, -64, 64, 64, 64, -64, -64, 64, 64, 64, 64, -64, -64, 64, 64, 64, 64, -64, -64, 64, -64, 64, 64, -64, 64, 64, 64, 64, -64, 64, -64, 64, 64, -64, 64, -64, -64, 64, 64, 64, 64, -64, -64, 64, 64, -64, 64, -64, 64, 64, 64, 64, -64, -64, 64, -64, -64, -64, -64, 64, 64, -64, -64, -64, -64, 64, 64, 64, 64, -64, -64, -64, -64, -64, -64, -64, 64, 64, 64, 64, 64, 64, -64, -64, -64, -64, -64, -64, -64, -64, -64, 64, -64, 64, 64, 64, 64, -64, -64, -64, -64, 64, 64, -64, 64, 64, 64, 64, 64, -64, -64, -64, 64, -64, -64, -64, -64, 64, 64, -64, 64, 64, 64, 64, 64, -64, -64, -64, 64, -64, 64, 64, 64, 64, 64, 64, 64, -64, 64, -64, -64, -64, -64, -64, 64, -64, -64, -64, 64, 64, 64, -64, 64, -64, -64, -64, -64, 64, -64, 64, -64, -64, -64, -64, -64, -64, 64, 64, 64, -64, -64, -64, 64, -64, -64, 64, 64, 64, 64, -64, -64, -64, -64, -64, -64, -64, -64, -64, -64, 64, 64, 64, -64, -64, -64, 64, -64, -64, -64, -64, 64, 64, 64, 64, -64, 64, 64, 64, -64, -64, -64, -64, -64, 64, 64, 64, 64, -64, 64, 64, -64, 64, -64, -64, -64, -64, 64, -64, 64, 64, 64, 64, -64, 64, 64, -64, -64, -64, -64, -64, 64, 64, -64, 64, 64, 64, 64, 64, -64, -64, 64, 64, 64, -64, -64, -64, 64, 64, 64, 64, 64, 64, 64, -64, -64, -64, -64, 64, 64, 64, 64, 64, 64, 64, 64, 64, 64, -64, -64, -64, -64, -64, -64, -64, -64, 64, 64, 64, 64, 64, 64, 64, -64, -64, 64, 64, 64, 64, 64, 64, 64, 64, 64, -64, 64, 64, 64, 64, -64, -64, -64, -64, -64, 64, 64, 64, 64, 64, 64, 64, 64, 64, 64, 64, 64, 64, 64, 64, -64, 64, 64, -64, -64, 64, 64, -64, 64, -64, -64, -64, 64, 64, 64, 64, 64, 64, 64, -64, 64, 64, 64, 64, -64, 64, 64, 64, 64, 64, -64, 64, 64, -64, 64, 64, -64, -64, -64, -64, 64, 64, 64, -64, 64, 64, 64, 64, -64, 64, 64, -64, 64, -64, 64, -64, 64, 64, 64, 64, -64, -64, 64, -64, -64, -64, -64, -64, -64, -64, 64, 64, 64, 64, -64, 64, 64, 64, 64, 64, 64, 64, -64, 64, 64, 64, 64, 64, -64, -64, 64, 64, -64, -64, -64, -64, -64, -64, 64, 64, 64, -64, 64, 64, 64, -64, 64, 64, 64, 64, -64, -64, -64, 64, 64, 64, -64, 64, -64, 64, -64, -64, 64, -64, -64, -64, -64, 64, -64, 64, 64, 64, 64, 64, 64, 64, 64, -64, 64, -64, 64, 64, -64, 64, 64, -64, 64, -64, 64, -64, 64, -64, 64, -64, -64, 64, 64, 64, 64, -64, -64, 64, 64, 64, 64, 64, -64, -64, -64, 64, 64, 64, 64, 64, 64, -64, 64, 64, -64, 64, 64, 64, 64, 64, 64, 64, -64, 64, -64, 64, 64, 64, 64, 64, -64, -64, 64, -64, 64, -64, -64, -64, 64, -64, 64, -64, -64, -64, -64, -64, -64, -64, 64, 64, -64, 64, 64, 64, 64, 64, 64, -64, -64, -64, -64, -64, -64, -64, 64, 64, -64, 64, -64, -64, -64, -64, -64, -64, -64, 64, 64, -64, -64, -64, 64, 64, 64, 64, -64, -64, -64, -64, 64, 64, 64, 64, -64, 64, 64, 64, 64, 64, -64, 64, -64, -64, -64, -64, -64, -64, -64, -64, -64, -64, 64, 64, 64, -64, -64, -64, 64, -64, -64, -64, 64, 64, -64, 64, 64, -64, -64, 64, 64, 64, 64, 64, 64, -64, 64, -64, -64, -64, -64, 64, 64, -64, -64, 64, 64, -64, 64, 64, -64, -64, 64, 64, 64, 64, 64, -64, -64, 64, 64, -64, -64, 64, 64, -64, 64, -64, 64, -64, -64, 64, 64, 64, -64, 64, -64, 64, -64, -64, 64, -64, -64, -64, 64, -64, -64, 64, 64, 64, -64, 64, 64, 64, -64, -64, 64, 64, 64, 64, 64, 64, 64, -64, -64, 64, -64, 64, -64, 64, -64, -64, -64, 64, -64, -64, -64, -64, 64, 64, -64, -64, 64, 64, 64, 64, -64, -64, -64, -64, -64, -64, 64, -64, -64, -64, -64, -64, -64, -64, 64, 64, -64, -64, -64, -64, -64, -64, 64, 64, 64, 64, 64, 64, 64, 64, -64, -64, -64, 64, -64, -64, 64, -64, -64, -64, -64, 64, 64, -64, -64, -64, -64, -64, -64, 64, 64, 64, 64, 64, -64, 64, 64, 64, -64, -64, 64, -64, -64, 64, 64, 64, -64, -64, 64, 64, 64, 64, -64, 64, -64, 64, -64, -64, 64, 64, 64, 64, 64, 64, 64, -64, -64, 64, 64, 64, 64, -64, -64, -64, 64, 64, 64, 64, -64, -64, 64, 64, -64, 64, -64, 64, 64, 64, 64, 64, -64, -64, -64, -64, -64, 64, 64, 64, 64, 64, 64, -64, 64, 64, 64, -64, -64, 64, 64, -64, 64, 64, 64, 64, 64, 64, 64, 64, -64, -64, 64, 64, -64, 64, 64, 64, 64, 64, 64, 64, 64, -64, -64, -64, -64, 64, 64, 64, 64, 64, -64, 64, 64, 64, 64, 64, 64, -64, 64, -64, 64, 64, 64, 64, 64, 64, -64, -64, 64, 64, -64, 64, 64, 64, 64, 64, 64, 64, 64, 64, 64, 64, 64, 64, -64, -64, -64, -64, 64, -64, 64, 64, 64, 64, -64, 64, 64, -64, -64, -64, -64, 64, 64, 64, -64, 64, -64, -64, 64, 64, 64, 64, 64, -64, -64, 64, 64, 64, 64, 64, 64, 64, 64, -64, -64, 64, 64, -64, 64, 64, -64, 64, -64, -64, -64, -64, 64, 64, 64, -64, 64, 64, 64, 64, 64, 64, 64, -64, -64, 64, 64, 64, -64, 64, -64, -64, -64, 64, -64, -64, -64, -64, -64, -64, -64, -64, 64, 64, 64, -64, 64, 64, 64, 64, 64, 64, -64, -64, 64, 64, 64, 64, -64, -64, -64, -64, -64, -64, -64, -64, 64, -64, 64, -64, 64, 64, 64, -64, 64, 64, 64, 64, 64, -64, 64, -64, 64, 64, -64, 64, -64, -64, -64, -64, -64, -64, 64, 64, 64, -64, 64, 64, 64, 64, 64, 64, -64, 64, -64, -64, -64, -64, -64, 64, 64, 64, 64, -64, -64, -64, -64, -64, -64, -64, -64, -64, -64, 64, 64, 64, 64, 64, 64, -64, -64, -64, -64, 64, -64, -64, -64, 64, 64, 64, -64, -64, 64, -64, -64, -64, 64, -64, -64, 64, 64, -64, 64, 64, 64, 64, 64, -64, -64, -64, 64, -64, -64, -64, 64, 64, 64, 64, -64, 64, 64, 64, -64, -64, -64, 64, -64, 64, 64, 64, 64, -64, 64, 64, 64, 64, 64, -64, -64, -64, -64, -64, 64, 64, 64, -64, 64, -64, -64, 64, 64, 64, 64, 64, 64, 64, 64, 64, 64, 64, 64, -64, 64, 64, 64, 64, 64, -64, 64, 64, 64, 64, -64, 64, -64, -64, 64, 64, -64, 64, 64, 64, 64, 64, 64, 64, 64, 64, 64, 64, 64, -64, -64, -64, 64, 64, 64, 64, 64, 64, 64, -64, -64, -64, -64, 64, 64, -64, 64, 64, 64, 64, 64, 64, 64, 64, 64, 64, 64, 64, 64, -64, 64, 64, -64, -64, 64, 64, 64, -64, -64, 64, 64, -64, -64, -64, 64, 64, 64, 64, 64, 64, 64, 64, 64, 64, 64, -64, -64, -64, -64, 64, 64, 64, 64, 64, -64, 64, 64, 64, -64, -64, -64, -64, -64, 64, 64, -64, 64, 64, -64, 64, 64, 64, 64, -64, -64, -64, -64, 64, 64, 64, 64, 64, 64, 64, 64, -64, 64, 64, -64, 64, -64, 64, 64, 64, 64, 64, 64, 64, 64, 64, 64, 64, -64, -64, -64, 64, 64, 64, 64, 64, 64, 64, 64, 64, 64, 64, -64, 64, 64, -64, 64, 64, 64, 64, -64, 64, 64, 64, -64, 64, -64, -64, 64, 64, 64, 64, 64, 64, -64, -64, 64, -64, 64, 64, -64, -64, 64, 64, 64, 64, -64, -64, 64, -64, 64, 64, 64, 64, -64, -64, 64, 64, 64, -64, -64, -64, 64, -64, -64, -64, -64, 64, 64, -64, 64, -64, 64, 64, 64, 64, -64, 64, -64, 64, 64, 64, 64, -64, -64, -64, 64, 64, 64, -64, -64, 64, 64, -64, -64, -64, -64, 64, -64, -64, 64, 64, 64, -64, -64, -64, -64, -64, -64, -64, -64, 64, 64, -64, 64, -64, -64, 64, -64, 64, 64, -64, 64, -64, 64, 64, 64, 64, -64, 64, -64, 64, -64, 64, -64, -64, -64, -64, -64, -64, 64, 64, 64, -64, -64, -64, 64, -64, 64, -64, -64, -64, -64, 64, -64, -64, -64, -64, 64, 64, 64, 64, 64, -64, -64, -64, -64, -64, 64, 64, -64, 64, -64, 64, 64, 64, -64, -64, -64, 64, 64, -64, 64, 64, -64, 64, -64, 64, -64, 64, 64, 64, -64, -64, -64, -64, -64, -64, -64, -64, 64, -64, -64, 64, 64, 64, 64, 64, -64, 64, -64, -64, -64, -64, 64, 64, 64, 64, 64, 64, 64, 64, 64, 64, -64, 64, -64, -64, -64, 64, -64, 64, -64, -64, 64, 64, -64, -64, -64, -64, -64, -64, 64, 64, 64, 64, 64, 64, 64, 64, 64, 64, 64, 64, 64, -64, 64, 64, -64, -64, 64, 64, 64, 64, 64, -64, -64, -64, 64, -64, 64, 64, 64, 64, -64, 64, 64, 64, -64, 64, -64, 64, 64, 64, 64, 64, -64, 64, -64, 64, 64, 64, -64, -64, 64, 64, 64, 64, 64, 64, 64, 64, 64, -64, -64, -64, -64, 64, -64, -64, -64, 64, 64, -64, -64, -64, -64, -64, -64, -64, 64, 64, 64, 64, 64, 64, 64, 64, 64, 64, 64, 64, 64, 64, -64, -64, -64, -64, -64, 64, 64, -64, -64, 64, 64, 64, 64, 64, 64, -64, 64, 64, 64, 64, 64, 64, 64, 64, 64, 64, 64, 64, 64, 64, -64, 64, 64, 64, 64, -64, 64, -64, -64, -64, 64, 64, -64, 64, 64, 64, 64, -64, -64, 64, 64, 64, 64, 64, 64, 64, 64, 64, -64, 64, 64, 64, 64, 64, 64, 64, 64, 64, -64, 64, -64, -64, 64, 64, 64, -64, 64, 64, 64, 64, -64, -64, 64, 64, 64, 64, 64, -64, 64, 64, 64, 64, 64, 64, 64, 64, 64, -64, 64, -64, -64, 64, -64, -64, -64, 64, 64, -64, -64, -64, -64, 64, 64, -64, 64, 64, 64, 64, 64, 64, 64, 64, -64, -64, -64, 64, -64, -64, -64, -64, 64, -64, -64, 64, 64, -64, 64, 64, -64, -64, 64, 64, 64, 64, -64, -64, 64, 64, 64, 64, -64, 64, 64, -64, 64, -64, -64, 64, -64, 64, 64, 64, 64, 64, 64, 64, 64, 64, 64, 64, 64, -64, 64, 64, 64, 64, 64, 64, 64, 64, 64, 64, -64, -64, 64, -64, -64, 64, 64, 64, 64, 64, 64, -64, -64, 64, -64, -64, 64, 64, 64, 64, 64, 64, 64, 64, 64, 64, -64, 64, -64, -64, 64, 64, 64, -64, -64, -64, -64, 64, 64, -64, -64, -64, 64, 64, 64, 64, 64, 64, 64, 64, 64, -64, -64, -64, 64, -64, 64, 64, 64, 64, 64, 64, -64, -64, 64, 64, 64, -64, -64, 64, 64, 64, 64, 64, 64, -64, 64, 64, 64, 64, -64, 64, 64, 64, -64, 64, 64, 64, 64, 64, 64, -64, -64, -64, -64, -64, 64, 64, 64, 64, 64, -64, -64, 64, 64, 64, 64, 64, -64, 64, -64, 64, 64, 64, 64, 64, 64, -64, -64, -64, 64, 64, 64, -64, 64, 64, 64, -64, -64, -64, -64, -64, 64, 64, 64, 64, -64, -64, 64, 64, -64, 64, 64, 64, 64, -64, -64, -64, 64, 64, -64, 64, -64, 64, 64, 64, 64, -64, -64, -64, -64, 64, 64, 64, 64, 64, 64, -64, 64, 64, 64, 64, 64, -64, 64, 64, 64, 64, 64, 64, 64, 64, -64, -64, -64, -64, -64, 64, 64, -64, 64, 64, 64, 64, 64, 64, -64, 64, 64, 64, 64, 64, 64, -64, 64, 64, 64, -64, 64, 64, 64, -64, -64, -64, 64, 64, -64, 64, -64, -64, 64, 64, -64, 64, -64, -64, 64, 64, 64, -64, 64, 64, 64, 64, -64, 64, 64, 64, 64, 64, -64, 64, 64, -64, -64, 64, 64, -64, 64, 64, 64, -64, -64, 64, 64, 64, 64, 64, 64, 64, -64, 64, -64, 64, -64, 64, 64, 64, -64, -64, -64, 64, -64, -64, -64, 64, -64, 64, 64, 64, 64, 64, 64, 64, -64, -64, -64, -64, 64, 64, 64, 64, 64, -64, 64, 64, -64, 64, 64, 64, 64, -64, -64, 64, 64, 64, -64, 64, 64, 64, 64, 64, 64, -64, -64, -64, 64, -64, -64, 64, 64, 64, 64, 64, 64, -64, 64, -64, -64, 64, 64, -64, 64, 64, -64, 64, -64, -64, -64, -64, 64, -64, -64, -64, 64, -64, -64, 64, 64, 64, 64, 64, -64, 64, 64, 64, -64, 64, 64, 64, -64, 64, -64, 64, 64, 64, -64, -64, -64, 64, -64, 64, -64, 64, 64, -64, 64, 64, -64, 64, 64, 64, -64, -64, -64, -64, 64, -64, -64, -64, -64, -64, -64, -64, -64, 64, 64, -64, 64, 64, -64, -64, 64, -64, 64, -64, 64, -64, -64, 64, 64, -64, -64, 64, 64, 64, -64, 64, 64, -64, -64, -64, 64, -64, -64, -64, 64, 64, -64, 64, -64, -64, -64, -64, -64, 64, 64, -64, 64, 64, -64, 64, 64, 64, -64, -64, 64, -64, -64, -64, 64, -64, 64, -64, -64, -64, -64, 64, 64, 64, 64, 64, 64, 64, 64, -64, 64, -64, -64, 64, -64, 64, -64, -64, -64, -64, -64, 64, -64, -64, -64, -64, 64, -64, -64, 64, 64, 64, 64, 64, 64, -64, 64, 64, 64, 64, 64, 64, 64, 64, -64, 64, -64, -64, 64, -64, -64, 64, 64, 64, -64, -64, -64, 64, 64, 64, 64, 64, 64, -64, 64, 64, 64, -64, 64, -64, 64, -64, 64, -64, -64, 64, 64, 64, -64, 64, 64, 64, 64, 64, 64, -64, -64, 64, 64, 64, 64, 64, 64, 64, -64, -64, -64, -64, -64, -64, 64, 64, 64, -64, -64, -64, -64, 64, 64, 64, 64, 64, 64, 64, -64, -64, -64, -64, 64, 64, 64, 64, -64, -64, -64, 64, 64, -64, -64, 64, 64, -64, -64, 64, 64, 64, 64, 64, 64, 64, 64, 64, -64, -64, -64, -64, -64, -64, -64, -64, -64, -64, -64, 64, -64, -64, -64, -64, 64, -64, -64, 64, 64, 64, 64, 64, -64, 64, -64, -64, -64, -64, -64, 64, -64, -64, -64, -64, -64, -64, 64, -64, 64, -64, 64, -64, 64, -64, -64, -64, 64, 64, 64, 64, 64, -64, -64, -64, -64, -64, -64, -64, -64, -64, 64, -64, -64, -64, 64, -64, -64, -64, -64, -64, 64, -64, -64, 64, 64, 64, 64, 64, -64, -64, -64, -64, -64, -64, -64, 64, -64, 64, 64, -64, -64, 64, -64, -64, -64, -64, 64, -64, -64, -64, -64, 64, 64, 64, 64, -64, -64, 64, 64, 64, 64, 64, -64, 64, -64, 64, 64, 64, 64, -64, -64, 64, -64, -64, -64, 64, 64, -64, 64, 64, 64, 64, 64, 64, 64, 64, 64, 64, 64, 64, 64, 64, 64, 64, 64, -64, 64, 64, 64, -64, -64, -64, -64, 64, 64, 64, 64, 64, 64, 64, 64, -64, 64, -64, -64, -64, -64, 64, -64, -64, 64, 64, 64, 64, 64, 64, 64, 64, 64, 64, 64, -64, -64, -64, 64, 64, 64, 64, 64, -64, -64, -64, -64, -64, -64, -64, -64, -64, 64, 64, 64, 64, 64, 64, -64, 64, 64, 64, 64, 64, -64, -64, 64, -64, 64, 64, 64, -64, -64, -64, -64, -64, -64, -64, -64, -64, -64, 64, 64, 64, 64, 64, 64, 64, -64, 64, 64, -64, 64, 64, -64, -64, -64, -64, 64, -64, -64, -64, -64, -64, 64, -64, 64, -64, -64, 64, 64, 64, 64, 64, 64, 64, 64, 64, -64, 64, -64, 64, -64, -64, 64, 64, -64, 64, 64, 64, 64, 64, 64, 64, -64, -64, -64, -64, 64, 64, 64, 64, 64, 64, 64, 64, 64, -64, -64, -64, -64, 64, 64, 64, 64, 64, 64, 64, 64, 64, 64, 64, -64, -64, -64, -64, 64, 64, 64, 64, 64, 64, 64, -64, -64, 64, -64, -64, -64, -64, -64, -64, 64, 64, 64, 64, 64, 64, 64, 64, -64, 64, -64, 64, -64, 64, 64, 64, 64, -64, 64, -64, -64, -64, 64, -64, 64, -64, -64, 64, -64, 64, 64, 64, 64, 64, 64, 64, -64, 64, -64, 64, -64, 64, 64, 64, 64, -64, -64, -64, -64, 64, -64, 64, -64, -64, 64, 64, 64, 64, 64, -64, 64, 64, 64, 64, -64, -64, 64, 64, 64, 64, 64, 64, 64, -64, -64, 64, 64, -64, -64, -64, 64, -64, -64, 64, 64, -64, 64, -64, -64, -64, 64, -64, 64, 64, 64, 64, 64, 64, -64, 64, 64, -64, 64, 64, 64, -64, 64, 64, -64, -64, -64, -64, 64, 64, -64, -64, -64, -64, 64, 64, 64, 64, 64, 64, 64, 64, 64, 64, 64, -64, 64, -64, 64, 64, 64, -64, -64, -64, -64, -64, -64, -64, -64, -64, -64, -64, -64, 64, -64, 64, -64, 64, 64, -64, 64, 64, 64, 64, 64, 64, -64, 64, 64, -64, 64, -64, -64, 64, -64, -64, -64, -64, -64, -64, -64, -64, -64, -64, -64, -64, 64, 64, 64, 64, 64, 64, 64, 64, -64, 64, -64, -64, 64, 64, 64, -64, -64, -64, -64, -64, -64, -64, -64, -64, -64, -64, -64, -64, -64, -64, 64, 64, -64, -64, -64, -64, 64, -64, 64, 64, 64, 64, 64, 64, -64, -64, 64, -64, -64, -64, -64, 64, -64, 64, 64, -64, 64, -64, -64, 64, -64, -64, 64, 64, 64, -64, 64, 64, 64, 64, -64, 64, 64, -64, -64, -64, -64, 64, -64, 64, 64, 64, 64, -64, -64, 64, 64, 64, 64, 64, -64, 64, -64, 64, -64, -64, 64, -64, -64, 64, 64, -64, -64, -64, 64, 64, -64, -64, -64, -64, 64, 64, 64, -64, 64, 64, 64, 64, -64, 64, -64, 64, 64, 64, 64, -64, 64, -64, 64, -64, -64, -64, 64, 64, -64, 64, -64, -64, 64, -64, -64, 64, -64, 64, -64, 64, 64, -64, 64, 64, -64, 64, 64, 64, -64, 64, -64, 64, 64, 64, -64, -64, 64, -64, 64, 64, -64, -64, 64, 64, 64, 64, 64, 64, -64, -64, -64, 64, -64, 64, 64, -64, -64, -64, -64, -64, -64, 64, 64, 64, 64, 64, -64, 64, 64, 64, 64, -64, 64, 64, 64, 64, 64, 64, 64, -64, -64, 64, 64, -64, -64, -64, 64, -64, 64, -64, 64, 64, 64, -64, -64, 64, 64, 64, 64, 64, 64, 64, 64, 64, -64, -64, 64, -64, -64, 64, -64, 64, -64, -64, 64, 64, 64, 64, 64, -64, 64, 64, -64, -64, 64, 64, -64, -64, 64, 64, 64, 64, -64, 64, 64, -64, 64, -64, -64, 64, 64, 64, 64, 64, 64, 64, 64, -64, -64, 64, -64, -64, 64, 64, 64, -64, 64, 64, -64, -64, -64, -64, -64, 64, 64, 64, 64, 64, 64, 64, 64, 64, 64, 64, 64, -64, 64, 64, 64, 64, -64, 64, -64, -64, 64, -64, -64, 64, -64, -64, -64, 64, -64, 64, 64, -64, -64, 64, 64, 64, -64, 64, 64, 64, -64, 64, -64, -64, 64, 64, -64, -64, 64, 64, -64, -64, 64, 64, -64, -64, -64, 64, -64, -64, -64, -64, -64, 64, -64, 64, 64, 64, 64, 64, 64, -64, -64, 64, -64, -64, -64, -64, -64, -64, 64, -64, 64, -64, 64, 64, -64, -64, -64, -64, 64, -64, -64, 64, 64, 64, -64, 64, 64, 64, 64, 64, 64, -64, 64, 64, -64, -64, -64, -64, 64, 64, -64, 64, 64, 64, -64, 64, 64, -64, 64, 64, 64, 64, -64, -64, -64, 64, 64, 64, 64, 64, -64, -64, -64, -64, -64, -64, -64, -64, -64, -64, -64, 64, 64, 64, 64, 64, -64, 64, 64, -64, -64, -64, -64, 64, -64, -64, 64, -64, -64, 64, -64, -64, 64, 64, -64, 64, -64, 64, -64, -64, 64, 64, 64, 64, 64, 64, 64, -64, -64, -64, -64, 64, 64, 64, -64, 64, -64, 64, 64, 64, 64, -64, -64, 64, 64, 64, -64, 64, 64, 64, 64, 64, -64, 64, 64, 64, -64, 64, -64, 64, 64, -64, 64, 64, 64, 64, 64, 64, -64, -64, 64, 64, 64, 64, -64, -64, 64, 64, 64, -64, 64, -64, 64, 64, 64, 64, 64, 64, 64, 64, 64, 64, 64, 64, 64, 64, 64, 64, 64, -64, -64, 64, -64, -64, 64, 64, 64, 64, 64, 64, 64, -64, 64, 64, 64, 64, 64, 64, 64, 64, 64, 64, -64, 64, 64, 64, -64, -64, -64, 64, 64, -64, -64, 64, 64, 64, -64, -64, 64, 64, 64, 64, 64, 64, 64, 64, 64, 64, 64, 64, 64, 64, 64, 64, -64, -64, 64, -64, -64, 64, -64, 64, 64, 64, 64, 64, 64, 64, 64, 64, 64, 64, 64, 64, -64, -64, -64, 64, -64, 64, -64, 64, -64, 64, -64, 64, 64, 64, 64, 64, -64, 64, -64, 64, 64, 64, -64, 64, 64, 64, -64, 64, 64, -64, 64, 64, 64, 64, -64, -64, -64, -64, 64, -64, 64, 64, -64, -64, 64, 64, 64, 64, 64, 64, 64, 64, -64, -64, 64, -64, 64, -64, 64, 64, 64, 64, -64, 64, -64, 64, -64, -64, 64, 64, -64, -64, 64, 64, -64, 64, 64, -64, -64, 64, -64, -64, 64, 64, -64, 64, 64, 64, 64, 64, -64, 64, 64, 64, -64, -64, -64, -64, 64, 64, -64, 64, -64, 64, 64, -64, 64, 64, -64, -64, 64, 64, 64, 64, 64, 64, -64, -64, 64, 64, 64, 64, -64, 64, -64, -64, 64, -64, 64, 64, -64, 64, 64, 64, 64, 64, 64, -64, -64, 64, 64, -64, -64, -64, 64, -64, 64, -64, 64, 64, -64, 64, 64, -64, -64, 64, 64, -64, 64, -64, -64, -64, 64, 64, -64, -64, 64, 64, -64, -64, -64, -64, -64, -64, -64, 64, -64, 64, 64, 64, -64, 64, -64, -64, -64, 64, -64, -64, -64, -64, -64, -64, -64, -64, 64, -64, -64, -64, -64, -64, -64, 64, 64, 64, 64, 64, -64, -64, 64, -64, -64, 64, -64, -64, -64, 64, -64, -64, -64, 64, -64, 64, 64, 64, 64, 64, -64, -64, 64, -64, 64, -64, -64, -64, 64, 64, 64, 64, -64, -64, -64, -64, 64, 64, -64, 64, 64, 64, -64, 64, -64, 64, 64, -64, -64, 64, -64, 64, -64, -64, 64, 64, -64, 64, 64, 64, -64, 64, -64, -64, -64, 64, -64, -64, 64, 64, -64, -64, -64, -64, -64, 64, -64, 64, -64, 64, -64, -64, 64, 64, 64, 64, -64, -64, -64, -64, 64, -64, -64, 64, -64, -64, -64, -64, 64, -64, -64, -64, -64, -64, -64, -64, -64, -64, -64, -64, 64, -64, -64, -64, -64, -64, -64, -64, -64, -64, -64, 64, -64, -64, -64, -64, 64, -64, -64, 64, 64, 64, -64, -64, -64, -64, -64, -64, -64, 64, -64, 64, 64, -64, 64, -64, -64, -64, -64, -64, -64, -64, -64, -64, -64, -64, 64, -64, 64, 64, -64, -64, -64, -64, -64, -64, 64, 64, -64, 64, -64, 64, 64, 64, -64, -64, -64, -64, -64, -64, 64, -64, -64, -64, 64, 64, 64, -64, -64, -64, -64, -64, -64, 64, 64, 64, 64, 64, -64, 64, 64, 64, -64, 64, -64, -64, -64, 64, -64, -64, -64, 64, 64, 64, 64, 64, 64, 64, 64, -64, -64, -64, -64, -64, -64, -64, 64, -64, 64, 64, 64, -64, -64, 64, -64, -64, 64, -64, 64, -64, 64, 64, 64, 64, -64, -64, -64, 64, -64, -64, 64, -64, -64, 64, -64, 64, 64, -64, 64, -64, -64, 64, -64, 64, 64, -64, -64, 64, -64, 64, 64, 64, 64, 64, -64, 64, -64, -64, 64, -64, -64, 64, 64, 64, -64, 64, -64, -64, -64, -64, 64, 64, -64, -64, 64, -64, 64, 64, 64, 64, 64, -64, -64, -64, -64, -64, -64, 64, -64, 64, -64, 64, 64, -64, 64, -64, -64, 64, 64, 64, -64, -64, -64, 64, 64, 64, 64, 64, 64, 64, 64, -64, -64, -64, 64, 64, -64, -64, 64, -64, -64, -64, -64, -64, 64, 64, 64, -64, -64, 64, 64, 64, 64, 64, 64, 64, 64, 64, 64, -64, 64, -64, -64, 64, -64, 64, 64, 64, -64, -64, -64, -64, -64, 64, 64, -64, 64, 64, 64, 64, 64, 64, 64, 64, -64, -64, -64, -64, 64, -64, 64, -64, -64, -64, 64, 64, 64, -64, -64, 64, 64, 64, -64, -64, -64, 64, -64, -64, 64, 64, 64, -64, 64, 64, 64, -64, 64, 64, -64, 64, -64, -64, -64, 64, -64, -64, -64, -64, -64, -64, -64, -64, -64, 64, -64, 64, 64, 64, 64, 64, -64, -64, -64, -64, -64, -64, -64, 64, 64, 64, -64, 64, -64, -64, -64, 64, 64, -64, 64, -64, 64, 64, 64, 64, 64, 64, -64, -64, -64, -64, -64, -64, -64, 64, 64, -64, -64, 64, 64, -64, -64, -64, 64, -64, -64, -64, 64, 64, 64, 64, 64, 64, 64, 64, -64, -64, -64, -64, -64, -64, -64, 64, 64, 64, 64, 64, 64, -64, 64, -64, 64, -64, -64, 64, 64, 64, 64, 64, 64, 64, 64, -64, -64, -64, -64, -64, 64, -64, -64, 64, 64, 64, 64, 64, -64, -64, -64, -64, 64, -64, -64, 64, 64, 64, 64, 64, 64, 64, -64, -64, -64, -64, -64, -64, -64, -64, 64, 64, 64, 64, -64, -64, -64, -64, -64, -64, 64, -64, 64, -64, -64, -64, 64, 64, 64, 64, -64, -64, -64, -64, -64, -64, -64, -64, 64, -64, 64, -64, 64, -64, 64, -64, -64, -64, -64, -64, -64, 64, -64, 64, 64, 64, 64, -64, 64, -64, -64, -64, -64, -64, -64, -64, -64, -64, 64, 64, 64, -64, -64, 64, -64, -64, -64, -64, -64, 64, 64, 64, 64, -64, 64, 64, -64, -64, -64, -64, -64, 64, -64, -64, 64, -64, 64, 64, -64, -64, 64, -64, -64, -64, -64, -64, 64, 64, 64, 64, 64, 64, 64, 64, -64, -64, -64, -64, -64, -64, -64, 64, 64, 64, 64, -64, -64, -64, -64, -64, -64, -64, -64, 64, -64, 64, 64, 64, 64, 64, 64, 64, -64, -64, -64, -64, -64, 64, -64, -64, -64, -64, -64, -64, -64, -64, -64, -64, -64, -64, -64, 64, 64, -64, 64, 64, 64, -64, 64, -64, -64, -64, -64, -64, -64, -64, 64, -64, 64, 64, 64, 64, -64, -64, -64, -64, 64, -64, 64, 64, 64, 64, 64, 64, 64, 64, 64, 64, 64, -64, -64, -64, -64, -64, 64, -64, 64, 64, -64, -64, -64, -64, 64, -64, 64, 64, 64, 64, 64, 64, 64, 64, 64, 64, 64, 64, 64, -64, -64, -64, 64, -64, -64, -64, -64, 64, 64, 64, 64, 64, -64, 64, -64, -64, -64, 64, 64, -64, -64, 64, 64, -64, 64, 64, 64, 64, -64, -64, 64, 64, 64, 64, 64, 64, 64, -64, -64, 64, -64, -64, 64, 64, -64, 64, 64, 64, -64, 64, 64, 64, -64, 64, -64, 64, 64, -64, -64, 64, -64, 64, 64, -64, 64, 64, -64, -64, 64, 64, -64, -64, -64, -64, 64, 64, 64, 64, -64, 64, -64, 64, -64, 64, -64, -64, -64, 64, 64, -64, 64, 64, 64, 64, 64, -64, 64, 64, 64, -64, -64, 64, 64, 64, 64, 64, 64, 64, 64, 64, -64, -64, -64, -64, -64, 64, -64, -64, -64, -64, -64, -64, -64, -64, 64, -64, -64, 64, 64, 64, 64, -64, -64, 64, 64, 64, -64, -64, -64, 64, -64, 64, -64, -64, -64, 64, -64, 64, 64, -64, -64, -64, 64, -64, 64, -64, 64, 64, 64, -64, 64, 64, 64, 64, -64, -64, -64, -64, -64, -64, -64, -64, -64, -64, -64, -64, -64, -64, 64, 64, -64, 64, 64, -64, -64, 64, 64, 64, -64, 64, -64, -64, -64, -64, -64, -64, -64, -64, -64, -64, -64, -64, 64, -64, -64, 64, -64, 64, -64, 64, -64, -64, -64, 64, 64, -64, -64, -64, -64, -64, -64, -64, 64, -64, -64, -64, -64, -64, -64, -64, -64, -64, -64, 64, -64, 64, -64, 64, 64, 64, 64, 64, 64, -64, -64, -64, -64, -64, -64, -64, 64, -64, 64, 64, 64, 64, -64, 64, 64, 64, -64, -64, 64, -64, 64, 64, 64, 64, 64, -64, 64, 64, 64, 64, -64, -64, -64, -64, -64, 64, -64, 64, 64, 64, 64, -64, -64, -64, -64, -64, 64, 64, 64, 64, 64, 64, 64, 64, 64, 64, 64, 64, 64, 64, 64, 64, 64, 64, -64, -64, -64, 64, 64, -64, -64, -64, 64, -64, 64, -64, 64, 64, 64, 64, 64, 64, 64, 64, 64, 64, 64, 64, 64, -64, 64, -64, -64, -64, 64, 64, 64, -64, -64, -64, -64, 64, 64, 64, 64, 64, 64, -64, 64, -64, -64, 64, -64, -64, -64, -64, -64, -64, 64, 64, 64, 64, 64, 64, 64, 64, -64, -64, -64, -64, 64, 64, 64, -64, -64, -64, 64, 64, -64, -64, -64, -64, -64, -64, -64, -64, -64, 64, -64, 64, 64, 64, 64, 64, 64, -64, -64, 64, 64, -64, -64, -64, 64, -64, 64, -64, 64, -64, -64, -64, -64, -64, -64, 64, -64, -64, -64, -64, -64, 64, 64, 64, 64, -64, 64, -64, 64, 64, -64, -64, -64, -64, -64, -64, -64, -64, -64, -64, -64, -64, -64, -64, 64, -64, -64, -64, -64, -64, 64, 64, 64, -64, 64, 64, 64, -64, -64, -64, 64, 64, -64, -64, -64, -64, -64, -64, -64, 64, 64, -64, -64, -64, -64, -64, -64, 64, 64, 64, 64, 64, -64, -64, -64, 64, -64, -64, 64, -64, -64, -64, -64, -64, -64, 64, 64, 64, 64, -64, -64, -64, -64, -64, -64, 64, 64, 64, 64, 64, -64, -64, -64, -64, -64, -64, -64, -64, -64, -64, -64, -64, -64, 64, 64, 64, 64, 64, 64, -64, 64, -64, 64, 64, 64, 64, 64, 64, 64, 64, 64, 64, -64, -64, -64, -64, -64, -64, -64, -64, 64, 64, 64, 64, 64, 64, -64, 64, 64, 64, -64, 64, 64, 64, 64, -64, 64, 64, 64, -64, -64, -64, -64, -64, -64, -64, -64, 64, -64, 64, 64, 64, 64, 64, 64, 64, 64, 64, -64, 64, 64, 64, 64, 64, 64, -64, -64, -64, -64, -64, 64, -64, 64, -64, -64, -64, -64, 64, 64, 64, 64, -64, 64, 64, 64, -64, -64, 64, -64, 64, 64, -64, -64, 64, -64, 64, -64, -64, -64, 64, -64, -64, -64, -64, -64, -64, -64, -64, -64, -64, 64, 64, -64, -64, -64, -64, -64, -64, 64, 64, 64, -64, -64, -64, 64, 64, 64, -64, 64, -64, 64, -64, -64, -64, -64, -64, -64, -64, 64, -64, -64, -64, -64, -64, -64, -64, 64, 64, 64, 64, 64, -64, -64, 64, 64, 64, 64, 64, 64, 64, -64, -64, -64, -64, -64, 64, -64, 64, -64, -64, 64, -64, -64, -64, 64, -64, 64, -64, 64, 64, 64, -64, -64, 64, 64, 64, 64, 64, 64, 64, -64, -64, -64, 64, 64, 64, 64, 64, 64, -64, -64, -64, 64, 64, -64, -64, -64, -64, 64, 64, 64, 64, 64, 64, 64, 64, 64, 64, 64, -64, 64, 64, -64, -64, -64, 64, -64, -64, -64, -64, 64, 64, 64, 64, 64, 64, 64, -64, -64, 64, 64, 64, 64, 64, 64, 64, -64, -64, -64, -64, 64, -64, -64, 64, -64, -64, 64, -64, -64, -64, -64, -64, 64, -64, -64, 64, 64, -64, -64, -64, 64, 64, 64, 64, 64, 64, 64, 64, 64, -64, -64, 64, 64, -64, -64, 64, 64, -64, -64, 64, -64, 64, -64, -64, -64, 64, -64, -64, 64, 64, -64, 64, 64, 64, -64, 64, -64, 64, -64, -64, -64, 64, -64, 64, -64, 64, -64, -64, -64, 64, -64, -64, 64, -64, 64, 64, 64, 64, -64, -64, 64, -64, 64, -64, 64, -64, -64, 64, 64, -64, 64, -64, 64, -64, 64, -64, 64, 64, -64, 64, -64, 64, 64, -64, -64, -64, -64, 64, -64, 64, 64, -64, -64, -64, -64, -64, -64, -64, 64, -64, -64, -64, -64, -64, 64, 64, -64, 64, 64, -64, -64, -64, 64, -64, 64, -64, 64, -64, -64, 64, -64, -64, 64, 64, 64, 64, 64, 64, -64, 64, -64, 64, -64, -64, 64, -64, 64, -64, 64, 64, 64, 64, 64, 64, 64, 64, 64, 64, 64, 64, -64, 64, 64, 64, 64, -64, -64, 64, -64, 64, -64, 64, -64, -64, 64, 64, 64, 64, 64, 64, 64, 64, -64, 64, 64, 64, 64, 64, 64, 64, 64, -64, -64, 64, -64, 64, -64, -64, -64, 64, 64, 64, 64, -64, 64, -64, 64, 64, -64, -64, 64, 64, 64, 64, -64, 64, 64, 64, -64, 64, 64, 64, 64, -64, 64, -64, 64, 64, -64, -64, -64, 64, 64, -64, 64, 64, -64, -64, 64, -64, -64, 64, 64, -64, 64, 64, 64, 64, 64, -64, 64, -64, 64, 64, 64, -64, -64, -64, -64, 64, -64, -64, 64, 64, -64, -64, -64, 64, 64, 64, 64, 64, 64, -64, -64, -64, -64, -64, -64, -64, 64, 64, -64, 64, 64, -64, 64, -64, 64, 64, -64, 64, 64, -64, -64, 64, 64, -64, 64, -64, -64, 64, 64, -64, 64, 64, 64, 64, 64, -64, -64, 64, 64, -64, -64, -64, 64, 64, -64, 64, -64, 64, 64, 64, -64, 64, 64, 64, -64, 64, -64, -64, -64, 64, 64, -64, -64, -64, -64, -64, 64, -64, -64, -64, 64, 64, 64, -64, 64, -64, 64, -64, 64, 64, -64, -64, 64, -64, 64, -64, -64, -64, -64, -64, -64, 64, 64, -64, 64, -64, -64, -64, 64, 64, -64, -64, 64, 64, -64, -64, -64, -64, 64, 64, 64, 64, 64, 64, -64, -64, -64, 64, 64, -64, -64, -64, 64, -64, -64, -64, -64, 64, 64, 64, 64, 64, 64, 64, 64, 64, 64, 64, 64, 64, -64, -64, 64, -64, 64, 64, -64, 64, -64, -64, -64, 64, 64, 64, 64, 64, -64, 64, 64, 64, 64, 64, 64, 64, 64, -64, 64, 64, -64, 64, 64, 64, -64, -64, 64, 64, 64, -64, -64, -64, 64, 64, 64, 64, -64, 64, -64, -64, 64, 64, 64, 64, 64, -64, -64, 64, 64, 64, 64, 64, 64, -64, 64, -64, 64, -64, -64, 64, 64, 64, 64, 64, 64, -64, 64, 64, 64, 64, 64, 64, 64, 64, 64, 64, 64, 64, 64, 64, 64, -64, 64, 64, 64, 64, 64, 64, 64, 64, 64, 64, 64, -64, 64, -64, 64, 64, 64, 64, 64, 64, 64, 64, 64, 64, 64, 64, -64, 64, 64, -64, 64, 64, 64, 64, 64, -64, 64, -64, -64, 64, 64, 64, 64, 64, 64, 64, 64, 64, 64, 64, 64, 64, 64, 64, 64, -64, -64, -64, -64, -64, 64, 64, 64, 64, 64, 64, 64, 64, 64, 64, 64, 64, 64, -64, -64, 64, 64, 64, 64, 64, 64, 64, 64, 64, 64, -64, -64, 64, -64, -64, 64, 64, 64, 64, 64, -64, 64, 64, 64, 64, 64, -64, -64, -64, 64, 64, 64, 64, -64, -64, 64, 64, 64, 64, -64, -64, -64, -64, 64, 64, -64, -64, -64, -64, 64, 64, 64, -64, 64, 64, -64, 64, -64, -64, 64, -64, 64, -64, -64, 64, 64, -64, -64, 64, -64, 64, 64, 64, 64, -64, 64, 64, 64, 64, 64, -64, 64, -64, -64, 64, 64, 64, 64, 64, 64, -64, -64, -64, -64, 64, 64, -64, 64, -64, -64, -64, 64, 64, 64, 64, 64, -64, -64, 64, 64, -64, 64, 64, 64, -64, -64, 64, 64, -64, 64, 64, 64, 64, -64, 64, -64, 64, -64, 64, 64, -64, -64, -64, -64, -64, -64, 64, -64, 64, 64, 64, -64, 64, -64, 64, -64, 64, -64, 64, 64, -64, 64, -64, 64, 64, -64, 64, -64, -64, 64, 64, 64, 64, -64, -64, -64, 64, -64, -64, -64, -64, -64, 64, -64, 64, 64, -64, -64, -64, 64, -64, 64, 64, 64, 64, -64, -64, -64, 64, 64, 64, -64, -64, -64, -64, -64, -64, -64, -64, -64, -64, 64, -64, -64, 64, -64, 64, 64, 64, -64, -64, 64, 64, -64, -64, -64, -64, -64, -64, 64, -64, -64, 64, -64, 64, 64, 64, 64, -64, -64, -64, 64, -64, -64, -64, -64, 64, 64, 64, -64, 64, 64, -64, 64, -64, -64, -64, 64, -64, 64, -64, -64, -64, 64, -64, -64, 64, -64, 64, 64, -64, 64, 64, -64, 64, 64, -64, -64, 64, 64, -64, -64, 64, -64, -64, 64, -64, 64, -64, -64, -64, 64, 64, 64, 64, 64, 64, -64, 64, -64, -64, -64, -64, -64, -64, 64, 64, -64, 64, -64, 64, 64, 64, 64, 64, -64, -64, -64, -64, 64, -64, -64, -64, -64, -64, 64, -64, -64, -64, 64, 64, 64, -64, 64, 64, 64, 64, 64, 64, 64, 64, -64, -64, 64, 64, 64, -64, -64, -64, -64, -64, -64, 64, -64, 64, 64, -64, 64, -64, -64, -64, -64, -64, 64, 64, 64, 64, 64, 64, 64, -64, -64, 64, 64, -64, 64, -64, -64, -64, -64, 64, 64, -64, 64, 64, 64, -64, -64, 64, -64, -64, -64, -64, -64, -64, -64, 64, 64, 64, 64, -64, 64, 64, -64, -64, -64, -64, -64, -64, 64, 64, 64, -64, -64, -64, -64, -64, -64, -64, -64, -64, -64, -64, -64, 64, 64, 64, 64, 64, 64, -64, -64, -64, -64, -64, -64, -64, -64, -64, -64, 64, -64, 64, -64, -64, -64, -64, -64, -64, -64, -64, -64, 64, 64, -64, 64, -64, -64, -64, -64, 64, -64, -64, 64, -64, -64, 64, -64, -64, 64, 64, 64, -64, -64, -64, -64, -64, -64, -64, 64, 64, -64, 64, 64, 64, -64, -64, -64, -64, -64, 64, 64, 64, 64, 64, -64, 64, 64, 64, -64, -64, -64, -64, 64, 64, 64, 64, -64, -64, -64, -64, -64, 64, 64, -64, -64, -64, 64, 64, 64, 64, 64, 64, 64, 64, -64, 64, -64, -64, -64, 64, -64, -64, -64, 64, 64, -64, -64, 64, 64, -64, -64, -64, 64, 64, 64, 64, 64, -64, 64, 64, -64, 64, 64, -64, -64, 64, -64, -64, 64, 64, 64, 64, -64, -64, 64, -64, -64, -64, -64, -64, 64, 64, 64, 64, 64, 64, -64, -64, 64, 64, -64, 64, -64, -64, 64, -64, -64, -64, 64, -64, -64, 64, -64, -64, -64, -64, -64, 64, 64, -64, 64, 64, 64, 64, -64, -64, -64, -64, 64, -64, -64, 64, 64, -64, -64, -64, -64, 64, -64, -64, -64, -64, -64, 64, 64, -64, -64, -64, -64, -64, -64, -64, 64, 64, -64, 64, -64, -64, 64, 64, 64, -64, -64, -64, -64, -64, -64, -64, -64, -64, -64, -64, 64, -64, -64, -64, -64, -64, -64, -64, -64, -64, -64, -64, 64, 64, -64, -64, 64, -64, -64, -64, -64, -64, -64, -64, -64, -64, -64, -64, -64, -64, -64, -64, -64, -64, -64, -64, 64, 64, -64, 64, -64, 64, -64, 64, -64, -64, -64, -64, -64, -64, -64, 64, 64, -64, 64, 64, -64, -64, -64, -64, -64, -64, -64, -64, 64, 64, 64, -64, 64, 64, -64, 64, -64, -64, -64, 64, -64, -64, -64, 64, 64, 64, 64, -64, 64, -64, -64, -64, -64, -64, -64, -64, 64, -64, 64, -64, 64, -64, 64, 64, -64, -64, 64, -64, -64, 64, -64, 64, -64, 64, -64, -64, 64, -64, -64, -64, -64, -64, -64, 64, -64, -64, 64, 64, 64, 64, 64, 64, -64, -64, -64, -64, -64, 64, 64, 64, -64, -64, -64, 64, 64, 64, -64, -64, -64, -64, -64, -64, 64, 64, 64, -64, -64, 64, -64, -64, -64, -64, -64, 64, 64, 64, -64, -64, -64, -64, -64, 64, 64, -64, -64, -64, -64, -64, -64, -64, -64, 64, -64, -64, -64, 64, -64, -64, -64, -64, -64, 64, 64, 64, -64, -64, -64, -64, 64, -64, -64, -64, -64, -64, 64, -64, -64, -64, 64, 64, 64, 64, 64, -64, -64, -64, -64, -64, 64, 64, 64, 64, -64, -64, 64, 64, -64, -64, 64, -64, -64, 64, -64, -64, -64, -64, -64, -64, 64, -64, -64, -64, 64, 64, -64, 64, 64, 64, 64, 64, 64, 64, 64, -64, -64, 64, -64, -64, -64, -64, -64, -64, 64, 64, -64, 64, -64, -64, 64, 64, -64, 64, 64, 64, 64, -64, 64, 64, -64, -64, -64, -64, -64, -64, 64, 64, -64, 64, 64, -64, 64, -64, -64, -64, 64, 64, -64, -64, -64, -64, 64, 64, 64, -64, -64, -64, 64, -64, 64, -64, -64, 64, -64, 64, -64, 64, -64, -64, -64, 64, 64, 64, 64, 64, -64, 64, 64, 64, 64, 64, -64, 64, -64, -64, -64, 64, 64, 64, 64, 64, 64, 64, 64, 64, -64, -64, 64, -64, -64, -64, 64, 64, 64, 64, 64, -64, -64, -64, 64, -64, 64, 64, 64, -64, -64, -64, -64, -64, 64, 64, 64, 64, 64, 64, 64, -64, 64, 64, 64, 64, 64, 64, 64, 64, -64, 64, 64, -64, -64, -64, -64, 64, -64, -64, 64, 64, -64, 64, 64, 64, 64, 64, 64, -64, -64, 64, 64, -64, 64, -64, -64, -64, 64, -64, -64, 64, -64, 64, -64, -64, 64, 64, 64, -64, 64, 64, 64, 64, 64, 64, 64, -64, -64, -64, -64, 64, -64, -64, 64, 64, -64, 64, 64, 64, 64, 64, -64, -64, 64, 64, -64, 64, -64, 64, -64, 64, 64, -64, -64, 64, 64, 64, -64, 64, 64, -64, 64, -64, -64, 64, 64, 64, 64, -64, -64, 64, 64, 64, 64, 64, 64, 64, -64, 64, 64, -64, -64, 64, -64, 64, -64, -64, 64, 64, 64, 64, -64, 64, 64, 64, -64, -64, -64, 64, -64, 64, -64, 64, 64, -64, -64, -64, -64, 64, -64, -64, 64, 64, -64, -64, 64, -64, -64, 64, -64, 64, 64, -64, -64, -64, -64, 64, -64, -64, -64, 64, 64, -64, -64, -64, -64, -64, -64, 64, -64, 64, -64, -64, 64, 64, 64, -64, -64, 64, -64, -64, -64, -64, 64, 64, 64, 64, -64, 64, -64, 64, -64, -64, -64, -64, -64, -64, -64, 64, -64, 64, -64, 64, -64, 64, 64, -64, -64, -64, -64, -64, -64, -64, -64, -64, -64, -64, -64, -64, -64, 64, -64, -64, -64, -64, 64, 64, -64, -64, 64, -64, 64, -64, 64, -64, -64, -64, -64, -64, -64, -64, 64, 64, -64, -64, -64, -64, -64, -64, -64, -64, -64, -64, -64, -64, 64, 64, 64, -64, 64, -64, -64, -64, 64, 64, -64, 64, 64, 64, -64, -64, 64, -64, -64, 64, -64, -64, -64, -64, -64, -64, -64, 64, -64, 64, 64, -64, 64, -64, -64, -64, 64, 64, -64, 64, -64, -64, -64, -64, -64, -64, -64, -64, -64, -64, -64, -64, -64, -64, 64, 64, -64, 64, 64, 64, -64, 64, 64, 64, 64, -64, -64, -64, 64, -64, -64, -64, -64, -64, -64, -64, -64, -64, -64, -64, 64, -64, -64, 64, 64, -64, 64, 64, 64, 64, 64, -64, -64, 64, -64, 64, 64, -64, -64, -64, 64, 64, -64, 64, -64, 64, -64, -64, 64, 64, -64, -64, 64, 64, -64, 64, -64, -64, 64, -64, -64, 64, -64, 64, -64, -64, -64, -64, -64, 64, -64, -64, 64, -64, -64, 64, 64, 64, 64, 64, -64, 64, 64, -64, 64, -64, -64, 64, 64, -64, 64, -64, -64, -64, 64, 64, -64, 64, -64, 64, -64, 64, -64, -64, -64, 64, -64, -64, 64, -64, 64, 64, 64, 64, -64, 64, -64, 64, -64, -64, -64, -64, -64, 64, -64, -64, 64, -64, -64, 64, -64, 64, -64, 64, 64, -64, 64, 64, 64, -64, 64, 64, -64, 64, -64, -64, -64, -64, -64, 64, -64, -64, -64, 64, -64, -64, -64, -64, 64, 64, -64, 64, 64, -64, 64, 64, 64, -64, 64, -64, -64, -64, 64, -64, -64, -64, 64, -64, 64, -64, -64, 64, -64, -64, -64, -64, 64, 64, -64, 64, -64, 64, 64, 64, -64, 64, 64, -64, -64, -64, -64, 64, -64, -64, 64, 64, 64, 64, -64, -64, 64, -64, -64, -64, 64, -64, -64, -64, 64, -64, -64, -64, -64, -64, 64, -64, -64, -64, 64, -64, -64, -64, -64, 64, -64, 64, -64, -64, -64, -64, 64, 64, 64, -64, -64, -64, -64, 64, -64, 64, -64, -64, -64, -64, 64, -64, -64, -64, -64, -64, -64, 64, -64, -64, -64, -64, 64, -64, 64, 64, 64, -64, -64, -64, 64, -64, -64, -64, 64, 64, 64, -64, 64, -64, -64, -64, -64, 64, -64, -64, -64, -64, 64, -64, 64, 64, -64, -64, -64, -64, -64, -64, 64, 64, -64, -64, -64, -64, -64, -64, -64, 64, -64, -64, -64, -64, -64, -64, -64, 64, -64, 64, -64, 64, -64, -64, -64, -64, -64, 64, 64, -64, 64, -64, -64, -64, 64, 64, -64, -64, -64, -64, -64, -64, -64, -64, -64, -64, 64, -64, -64, -64, -64, 64, -64, -64, -64, 64, -64, -64, -64, -64, 64, 64, -64, -64, -64, -64, -64, 64, -64, -64, -64, 64, 64, 64, -64, 64, -64, -64, -64, 64, -64, -64, -64, -64, 64, -64, -64, 64, 64, 64, 64, -64, -64, -64, 64, -64, 64, -64, -64, -64, -64, -64, 64, -64, 64, 64, -64, 64, 64, -64, -64, 64, 64, -64, 64, 64, 64, 64, 64, -64, -64, 64, -64, -64, -64, 64, -64, 64, 64, 64, -64, 64, 64, 64, -64, 64, 64, 64, -64, 64, -64, -64, -64, 64, 64, 64, 64, -64, 64, 64, -64, -64, 64, 64, 64, 64, 64, -64, 64, 64, 64, -64, 64, 64, 64, -64, -64, -64, 64, -64, -64, -64, -64, -64, -64, 64, -64, 64, 64, 64, -64, -64, -64, 64, -64, 64, 64, -64, 64, -64, 64, 64, -64, 64, 64, -64, -64, -64, 64, 64, 64, 64, 64, -64, 64, -64, -64, 64, 64, -64, 64, 64, 64, 64, -64, -64, -64, 64, -64, -64, -64, -64, -64, 64, 64, 64, 64, -64, 64, 64, 64, -64, -64, -64, -64, 64, -64, -64, 64, -64, 64, -64, -64, 64, 64, 64, 64, 64, 64, -64, -64, 64, 64, 64, 64, -64, 64, -64, -64, -64, 64, -64, -64, -64, 64, 64, -64, -64, -64, -64, 64, 64, 64, -64, -64, -64, -64, 64, -64, 64, -64, 64, -64, 64, -64, -64, -64, -64, -64, 64, -64, 64, 64, -64, 64, -64, -64, 64, 64, -64, 64, 64, -64, 64, 64, -64, -64, -64, 64, 64, 64, 64, -64, -64, -64, -64, -64, 64, 64, -64, 64, 64, -64, -64, 64, -64, 64, -64, -64, 64, 64, -64, -64, -64, -64, 64, 64, -64, -64, 64, -64, 64, 64, 64, -64, -64, -64, 64, -64, -64, 64, 64, -64, 64, -64, -64, -64, -64, 64, 64, 64, -64, -64, -64, -64, -64, -64, -64, -64, -64, 64, -64, 64, 64, 64, -64, -64, -64, -64, -64, -64, -64, 64, 64, -64, -64, 64, -64, -64, -64, 64, -64, 64, -64, -64, -64, 64, -64, 64, 64, 64, -64, 64, -64, 64, 64, -64, -64, 64, 64, 64, -64, -64, -64, 64, -64, -64, -64, 64, 64, -64, -64, -64, 64, -64, -64, -64, 64, 64, 64, 64, -64, -64, -64, 64, -64, -64, 64, 64, -64, -64, 64, -64, -64, 64, -64, 64, 64, -64, 64, -64, 64, 64, 64, -64, -64, 64, -64, -64, 64, -64, -64, 64, -64, -64, -64, 64, -64, 64, -64, -64, -64, -64, -64, 64, -64, -64, 64, -64, -64, 64, 64, 64, 64, 64, -64, 64, 64, -64, -64, -64, -64, -64, -64, -64, 64, 64, -64, -64, -64, 64, -64, -64, -64, -64, -64, -64, 64, -64, 64, -64, 64, 64, 64, 64, -64, -64, -64, -64, 64, 64, -64, 64, -64, -64, -64, 64, -64, 64, -64, -64, -64, -64, -64, -64, -64, 64, 64, 64, -64, 64, 64, 64, 64, -64, -64, -64, 64, 64, -64, -64, -64, -64, -64, -64, 64, -64, 64, -64, -64, -64, -64, -64, 64, -64, 64, -64, -64, -64, 64, -64, -64, 64, -64, -64, -64, -64, -64, -64, -64, -64, 64, -64, -64, 64, -64, 64, -64, -64, -64, -64, 64, -64, -64, -64, -64, -64, -64, 64, -64, -64, -64, -64, -64, -64, 64, -64, -64, -64, -64, 64, -64, -64, -64, -64, 64, 64, -64, 64, 64, 64, 64, -64, -64, -64, 64, -64, 64, -64, 64, -64, -64, -64, 64, -64, 64, -64, -64, 64, -64, -64, -64, -64, 64, 64, 64, -64, 64, -64, -64, 64, 64, 64, 64, -64, -64, -64, -64, 64, 64, -64, -64, -64, 64, -64, -64, -64, -64, -64, -64, -64, 64, 64, -64, 64, -64, -64, 64, -64, -64, 64, -64, 64, -64, 64, -64, -64, -64, 64, -64, 64, -64, -64, -64, -64, 64, -64, -64, -64, -64, 64, -64, -64, -64, -64, 64, 64, -64, 64, -64, -64, -64, -64, -64, 64, 64, -64, -64, 64, -64, -64, -64, -64, -64, -64, -64, -64, -64, 64, 64, 64, -64, 64, 64, -64, -64, 64, -64, -64, -64, -64, -64, 64, -64, -64, -64, 64, -64, 64, -64, 64, -64, 64, 64, -64, -64, -64, 64, 64, 64, 64, -64, 64, -64, -64, 64, -64, -64, -64, -64, -64, -64, 64, 64, 64, -64, -64, -64, -64, -64, -64, -64, 64, -64, -64, 64, 64, -64, 64, 64, -64, 64, 64, -64, -64, -64, -64, -64, -64, -64, 64, 64, -64, -64, -64, -64, 64, -64, -64, 64, -64, -64, 64, -64, 64, 64, -64, 64, -64, 64, 64, -64, -64, -64, -64, -64, -64, -64, -64, 64, -64, 64, -64, -64, -64, -64, -64, -64, -64, -64, -64, 64, -64, 64, -64, -64, -64, 64, -64, -64, -64, 64, -64, 64, -64, -64, -64, -64, -64, -64, 64, -64, 64, -64, -64, -64, -64, -64, 64, -64, 64, 64, -64, 64, 64, -64, 64, -64, -64, -64, -64, -64, 64, 64, 64, 64, -64, -64, 64, -64, 64, 64, -64, -64, 64, 64, 64, -64, 64, 64, -64, 64, -64, 64, -64, 64, -64, -64, 64, 64, 64, -64, 64, 64, -64, 64, -64, -64, 64, -64, 64, -64, 64, 64, 64, -64, 64, -64, -64, 64, -64, -64, 64, -64, -64, -64, -64, 64, 64, 64, 64, -64, 64, -64, 64, -64, 64, -64, -64, 64, -64, 64, 64, -64, -64, -64, -64, 64, 64, -64, -64, 64, -64, -64, -64, 64, -64, 64, 64, 64, 64, 64, -64, -64, 64, -64, -64, -64, 64, -64, -64, 64, -64, 64, 64, 64, -64, -64, 64, -64, -64, -64, 64, -64, -64, 64, 64, 64, -64, 64, 64, -64, 64, 64, 64, 64, 64, -64, -64, -64, -64, -64, 64, 64, -64, -64, 64, 64, -64, -64, 64, 64, 64, -64, -64, 64, 64, -64, -64, 64, -64, 64, 64, 64, 64, -64, -64, -64, -64, -64, -64, -64, -64, 64, -64, -64, -64, -64, 64, -64, -64, -64, 64, 64, 64, 64, 64, -64, -64, 64, 64, 64, 64, -64, 64, -64, 64, 64, -64, -64, -64, -64, -64, -64, -64, -64, 64, -64, -64, 64, 64, -64, -64, 64, 64, 64, -64, 64, 64, -64, 64, -64, -64, 64, -64, 64, -64, 64, 64, -64, -64, -64, -64, -64, -64, 64, 64, -64, 64, 64, 64, 64, 64, 64, -64, -64, -64, -64, -64, 64, 64, -64, -64, -64, 64, 64, -64, 64, -64, -64, -64, -64, -64, -64, -64, -64, 64, 64, 64, 64, 64, 64, -64, -64, -64, -64, -64, 64, -64, 64, -64, 64, -64, 64, 64, 64, -64, -64, -64, 64, -64, -64, 64, -64, 64, 64, 64, 64, 64, 64, 64, -64, -64, -64, -64, -64, -64, -64, -64, 64, 64, -64, -64, 64, 64, -64, -64, -64, -64, -64, 64, 64, 64, 64, 64, 64, 64, 64, -64, -64, -64, -64, -64, -64, -64, 64, 64, -64, 64, 64, 64, 64, -64, -64, -64, -64, -64, -64, -64, -64, 64, 64, 64, 64, 64, -64, -64, -64, -64, -64, -64, -64, 64, -64, -64, -64, 64, 64, 64, 64, -64, -64, -64, -64, 64, -64, 64, 64, 64, 64, 64, 64, 64, -64, -64, -64, -64, -64, -64, 64, -64, 64, 64, 64, -64, 64, 64, 64, -64, -64, -64, 64, 64, 64, 64, 64, 64, 64, 64, -64, -64, 64, -64, -64, -64, -64, 64, 64, -64, 64, 64, 64, 64, 64, 64, -64, -64, -64, 64, 64, 64, 64, 64, 64, 64, -64, -64, -64, 64, -64, -64, 64, 64, -64, 64, 64, 64, 64, 64, -64, 64, 64, -64, -64, -64, -64, -64, -64, 64, 64, 64, -64, -64, -64, -64, -64, -64, 64, -64, 64, 64, 64, 64, 64, 64, -64, -64, 64, 64, 64, -64, -64, -64, -64, 64, -64, -64, 64, 64, -64, -64, -64, -64, -64, -64, -64, -64, 64, 64, 64, 64, 64, 64, -64, -64, -64, 64, -64, -64, -64, -64, -64, -64, -64, -64, -64, -64, -64, -64, -64, -64, -64, -64, 64, -64, 64, 64, 64, 64, 64, -64, -64, 64, 64, -64, -64, 64, -64, -64, -64, -64, -64, -64, 64, -64, -64, -64, 64, -64, -64, -64, 64, 64, 64, 64, 64, 64, 64, 64, -64, -64, -64, -64, -64, -64, 64, -64, 64, 64, 64, -64, 64, 64, 64, 64, 64, 64, 64, 64, -64, 64, 64, 64, 64, 64, 64, 64, 64, -64, 64, 64, -64, -64, -64, -64, -64, 64, 64, -64, 64, 64, 64, 64, 64, 64, -64, -64, -64, -64, 64, -64, 64, 64, -64, 64, -64, 64, 64, -64, 64, -64, -64, -64, -64, -64, -64, 64, 64, 64, 64, -64, 64, 64, -64, 64, 64, -64, 64, 64, 64, 64, 64, -64, 64, 64, -64, 64, -64, -64, -64, -64, -64, -64, -64, 64, 64, 64, 64, 64, 64, 64, -64, -64, 64, -64, -64, 64, 64, 64, 64, -64, -64, -64, -64, 64, 64, 64, -64, -64, -64, -64, -64, 64, 64, 64, -64, -64, -64, 64, -64, -64, 64, -64, 64, 64, -64, -64, 64, -64, -64, 64, 64, -64, -64, -64, -64, -64, -64, 64, 64, 64, 64, 64, 64, 64, 64, 64, 64, 64, -64, 64, -64, 64, -64, -64, 64, -64, 64, -64, 64, 64, 64, -64, -64, 64, 64, 64, 64, 64, -64, 64, 64, 64, -64, -64, 64, -64, -64, 64, -64, -64, -64, 64, 64, -64, 64, -64, 64, 64, 64, 64, 64, 64, 64, -64, 64, -64, -64, -64, -64, -64, -64, -64, -64, -64, -64, 64, -64, -64, -64, -64, 64, 64, 64, -64, 64, 64, -64, 64, 64, -64, -64, -64, -64, -64, -64, 64, 64, 64, -64, -64, -64, -64, -64, -64, -64, -64, -64, -64, 64, -64, -64, -64, -64, -64, 64, 64, 64, -64, 64, -64, -64, -64, -64, -64, 64, 64, -64, -64, 64, 64, -64, -64, 64, -64, -64, -64, -64, 64, 64, 64, -64, -64, -64, 64, -64, 64, -64, -64, -64, -64, 64, 64, -64, -64, -64, -64, 64, -64, -64, -64, 64, 64, -64, 64, -64, -64, -64, -64, -64, 64, -64, 64, 64, 64, 64, -64, -64, 64, 64, 64, -64, 64, -64, 64, 64, 64, -64, -64, -64, -64, 64, 64, -64, -64, -64, 64, -64, -64, 64, -64, 64, -64, -64, -64, 64, -64, 64, -64, 64, 64, 64, 64, 64, 64, -64, -64, -64, 64, -64, 64, 64, 64, -64, -64, -64, -64, 64, -64, -64, 64, 64, -64, 64, 64, -64, -64, 64, 64, -64, 64, 64, 64, -64, -64, -64, -64, -64, -64, -64, 64, 64, 64, -64, 64, -64, -64, 64, 64, -64, 64, -64, -64, 64, -64, 64, 64, 64, -64, 64, 64, -64, -64, 64, -64, -64, 64, 64, 64, 64, -64, 64, 64, 64, -64, -64, 64, 64, 64, 64, 64, 64, -64, 64, -64, 64, 64, 64, 64, 64, 64, 64, 64, 64, 64, 64, -64, 64, 64, -64, 64, 64, -64, 64, 64, 64, 64, 64, 64, -64, 64, 64, 64, 64, 64, 64, 64, 64, 64, 64, 64, 64, 64, 64, 64, 64, -64, -64, -64, -64, 64, 64, 64, 64, 64, -64, 64, -64, 64, 64, 64, 64, 64, 64, 64, 64, 64, 64, 64, 64, 64, -64, -64, 64, -64, -64, 64, 64, 64, 64, 64, 64, 64, 64, -64, 64, 64, 64, 64, 64, -64, 64, 64, 64, 64, -64, -64, -64, -64, 64, 64, -64, 64, 64, -64, -64, -64, 64, 64, 64, 64, 64, 64, 64, -64, 64, -64, -64, -64, 64, -64, 64, 64, -64, -64, -64, -64, -64, -64, -64, -64, -64, 64, 64, 64, 64, 64, 64, 64, 64, 64, 64, -64, -64, -64, -64, -64, -64, 64, 64, 64, 64, -64, -64, -64, -64, -64, -64, -64, 64, 64, 64, 64, 64, 64, 64, 64, 64, 64, -64, -64, -64, -64, 64, -64, -64, -64, -64, 64, 64, 64, 64, -64, -64, -64, -64, 64, -64, -64, 64, 64, 64, 64, 64, 64, -64, 64, -64, -64, -64, -64, 64, -64, -64, 64, 64, 64, 64, 64, 64, 64, 64, 64, -64, 64, 64, 64, 64, 64, 64, 64, 64, -64, -64, 64, -64, -64, -64, -64, -64, -64, -64, -64, 64, 64, 64, 64, 64, 64, 64, 64, -64, -64, -64, 64, -64, 64, 64, 64, 64, -64, -64, -64, -64, -64, -64, -64, 64, -64, -64, -64, 64, 64, 64, 64, 64, 64, 64, 64, -64, -64, -64, -64, -64, 64, -64, 64, 64, -64, 64, -64, -64, -64, 64, -64, -64, -64, -64, -64, -64, 64, 64, 64, 64, 64, 64, 64, -64, 64, 64, 64, 64, -64, 64, 64, 64, 64, 64, -64, -64, -64, -64, -64, -64, 64, 64, 64, -64, 64, 64, 64, -64, -64, 64, 64, 64, -64, 64, 64, -64, -64, 64, 64, 64, 64, -64, 64, -64, -64, -64, 64, -64, 64, -64, -64, 64, 64, -64, 64, 64, -64, -64, 64, -64, 64, -64, -64, 64, 64, 64, 64, 64, 64, 64, -64, 64, -64, 64, -64, 64, 64, 64, 64, -64, -64, 64, -64, -64, 64, 64, 64, 64, 64, -64, 64, -64, 64, 64, 64, 64, 64, 64, 64, 64, -64, -64, 64, -64, 64, 64, -64, 64, 64, 64, 64, 64, 64, 64, 64, -64, -64, -64, -64, 64, -64, 64, 64, 64, -64, 64, 64, 64, -64, -64, -64, 64, 64, -64, -64, 64, 64, 64, 64, 64, 64, 64, 64, 64, -64, 64, 64, -64, 64, 64, 64, -64, 64, 64, 64, 64, 64, -64, 64, -64, 64, -64, -64, 64, 64, 64, 64, 64, 64, 64, 64, -64, 64, 64, -64, -64, 64, 64, 64, 64, 64, 64, 64, 64, 64, 64, 64, 64, -64, 64, 64, 64, 64, 64, 64, 64, 64, 64, -64, -64, 64, -64, 64, 64, 64, 64, 64, 64, 64, 64, 64, 64, 64, 64, 64, -64, -64, 64, -64, -64, -64, -64, 64, 64, 64, 64, -64, 64, 64, -64, 64, 64, 64, 64, -64, 64, 64, 64, -64, -64, 64, 64, 64, 64, 64, 64, -64, -64, -64, 64, 64, 64, -64, -64, -64, -64, -64, 64, -64, -64, -64, -64, -64, -64, -64, -64, -64, -64, 64, 64, -64, 64, 64, 64, -64, -64, 64, -64, 64, 64, 64, -64, -64, 64, 64, -64, 64, 64, -64, -64, -64, -64, -64, -64, -64, -64, -64, -64, -64, -64, -64, 64, -64, -64, 64, 64, -64, -64, -64, 64, -64, -64, 64, 64, -64, 64, -64, 64, -64, -64, 64, 64, 64, -64, -64, -64, 64, 64, 64, -64, -64, 64, -64, 64, -64, 64, 64, -64, -64, 64, -64, 64, 64, -64, -64, 64, -64, 64, -64, -64, -64, -64, -64, -64, 64, -64, 64, 64, 64, -64, -64, 64, -64, 64, -64, 64, -64, -64, 64, 64, 64, 64, -64, 64, -64, -64, -64, -64, 64, 64, 64, 64, -64, 64, 64, -64, -64, 64, 64, 64, 64, -64, -64, 64, 64, 64, 64, 64, -64, 64, -64, -64, 64, 64, 64, -64, 64, -64, -64, -64, -64, 64, -64, 64, -64, 64, 64, 64, -64, -64, 64, -64, 64, 64, 64, 64, -64, -64, 64, 64, 64, 64, -64, -64, 64, -64, 64, -64, 64, -64, -64, -64, -64, -64, -64, -64, -64, 64, 64, -64, -64, 64, 64, 64, 64, -64, -64, -64, -64, 64, -64, 64, -64, -64, -64, -64, -64, -64, -64, -64, -64, -64, -64, -64, -64, -64, -64, -64, -64, -64, -64, 64, -64, 64, -64, -64, 64, 64, 64, -64, -64, -64, -64, -64, -64, -64, -64, -64, -64, -64, -64, -64, 64, 64, 64, 64, 64, 64, 64, -64, 64, -64, -64, -64, 64, 64, 64, -64, -64, -64, -64, -64, 64, -64, -64, -64, -64, -64, -64, -64, 64, 64, 64, 64, -64, 64, 64, -64, -64, 64, -64, -64, -64, -64, -64, -64, -64, -64, -64, -64, -64, -64, -64, -64, 64, 64, 64, 64, 64, 64, 64, 64, -64, -64, -64, 64, -64, 64, 64, 64, -64, 64, -64, -64, -64, 64, -64, 64, -64, -64, -64, -64, 64, 64, 64, 64, 64, 64, 64, 64, 64, 64, -64, -64, 64, 64, 64, -64, -64, -64, -64, 64, -64, 64, 64, 64, 64, -64, -64, -64, -64, 64, 64, 64, 64, 64, 64, 64, 64, 64, 64, -64, -64, 64, -64, -64, -64, -64, 64, -64, -64, 64, 64, 64, 64, 64, 64, 64, -64, 64, 64, 64, 64, 64, 64, 64, 64, 64, -64, -64, -64, 64, -64, -64, -64, -64, 64, 64, 64, 64, 64, 64, 64, -64, 64, -64, 64, 64, 64, 64, 64, 64, 64, 64, 64, -64, 64, -64, -64, -64, -64, -64, -64, -64, 64, 64, 64, 64, 64, -64, 64, 64, 64, -64, -64, -64, 64, 64, 64, 64, 64, 64, 64, 64, 64, 64, -64, -64, -64, -64, -64, 64, 64, 64, 64, 64, 64, 64, 64, 64, 64, -64, -64, -64, 64, 64, 64, 64, 64, -64, -64, 64, -64, 64, -64, 64, -64, 64, 64, 64, 64, 64, 64, 64, 64, -64, -64, 64, 64, -64, -64, -64, 64, 64, 64, -64, -64, -64, -64, -64, 64, -64, 64, -64, 64, -64, -64, 64, 64, 64, 64, 64, -64, 64, 64, 64, 64, 64, 64, 64, 64, 64, -64, 64, -64, -64, 64, -64, -64, 64, -64, -64, -64, -64, 64, -64, -64, -64, 64, -64, -64, 64, 64, 64, 64, -64, -64, -64, 64, 64, 64, -64, -64, -64, -64, 64, -64, -64, 64, 64, -64, 64, -64, -64, -64, -64, 64, 64, 64, -64, 64, 64, 64, -64, 64, 64, 64, 64, 64, -64, -64, -64, -64, 64, -64, 64, 64, -64, -64, -64, -64, -64, -64, 64, -64, -64, -64, 64, 64, 64, 64, 64, 64, 64, 64, -64, -64, -64, -64, -64, -64, 64, 64, 64, 64, 64, -64, -64, 64, -64, 64, -64, -64, 64, -64, 64, 64, 64, -64, -64, 64, 64, 64, -64, -64, 64, -64, -64, -64, 64, -64, 64, 64, -64, 64, -64, 64, 64, 64, -64, -64, -64, -64, 64, 64, 64, -64, -64, -64, 64, 64, -64, -64, -64, -64, 64, -64, -64, 64, -64, -64, 64, -64, -64, 64, 64, 64, -64, -64, -64, -64, 64, 64, -64, -64, -64, -64, -64, 64, -64, -64, -64, -64, -64, -64, 64, -64, -64, -64, 64, -64, -64, 64, 64, 64, 64, -64, -64, -64, 64, -64, -64, -64, -64, -64, -64, -64, -64, -64, -64, 64, -64, 64, 64, -64, 64, -64, -64, -64, 64, -64, 64, -64, 64, 64, 64, 64, -64, -64, -64, -64, -64, -64, -64, -64, -64, -64, 64, 64, -64, -64, 64, 64, 64, 64, 64, 64, 64, 64, -64, 64, 64, 64, 64, 64, 64, 64, -64, -64, -64, 64, -64, -64, 64, -64, 64, 64, 64, -64, 64, -64, 64, -64, 64, 64, 64, 64, 64, 64, 64, 64, 64, 64, 64, -64, 64, 64, 64, -64, -64, 64, 64, 64, 64, 64, 64, 64, 64, 64, 64, -64, -64, -64, -64, 64, 64, 64, 64, 64, 64, 64, 64, -64, 64, -64, -64, -64, -64, -64, 64, 64, 64, 64, -64, 64, 64, -64, 64, -64, -64, 64, -64, 64, -64, 64, -64, 64, -64, 64, 64, -64, 64, 64, 64, 64, 64, 64, 64, 64, 64, 64, 64, -64, 64, -64, -64, -64, -64, -64, -64, -64, -64, 64, -64, -64, -64, 64, -64, 64, 64, 64, 64, 64, 64, 64, -64, 64, 64, 64, 64, 64, 64, -64, 64, 64, 64, 64, 64, 64, 64, 64, 64, 64, -64, 64, 64, -64, 64, -64, 64, 64, 64, -64, 64, -64, 64, 64, -64, 64, -64, 64, -64, 64, -64, 64, 64, 64, 64, 64, 64, 64, 64, 64, -64, 64, 64, -64, -64, -64, -64, -64, -64, 64, 64, -64, 64, -64, 64, 64, 64, 64, -64, -64, -64, 64, 64, -64, 64, 64, -64, -64, -64, 64, -64, 64, -64, 64, 64, 64, -64, 64, -64, -64, -64, -64, 64, -64, -64, -64, 64, 64, -64, 64, -64, 64, 64, 64, 64, 64, 64, -64, 64, 64, -64, -64, -64, 64, -64, -64, 64, 64, -64, -64, -64, -64, 64, 64, 64, -64, -64, -64, -64, 64, 64, 64, 64, 64, 64, 64, 64, 64, 64, 64, 64, -64, -64, 64, 64, 64, 64, 64, 64, 64, 64, 64, -64, 64, -64, -64, -64, 64, 64, 64, 64, 64, 64, 64, -64, 64, 64, -64, 64, 64, -64, -64, -64, -64, -64, 64, 64, -64, 64, 64, 64, 64, -64, -64, 64, 64, 64, 64, 64, 64, 64, 64, -64, 64, 64, -64, -64, 64, 64, 64, 64, -64, 64, -64, 64, 64, 64, 64, -64, 64, 64, -64, -64, -64, 64, 64, 64, 64, 64, 64, 64, 64, 64, -64, 64, 64, 64, 64, 64, 64, -64, 64, 64, -64, -64, 64, -64, -64, 64, -64, -64, 64, 64, -64, 64, 64, 64, 64, 64, 64, 64, -64, 64, 64, 64, 64, 64, 64, 64, 64, 64, 64, -64, 64, 64, -64, 64, 64, -64, -64, 64, -64, 64, 64, 64, -64, 64, 64, 64, 64, -64, 64, -64, -64, 64, -64, 64, 64, 64, 64, -64, 64, -64, -64, -64, 64, -64, 64, -64, -64, 64, 64, 64, 64, -64, 64, 64, 64, -64, -64, -64, 64, 64, 64, 64, 64, 64, -64, 64, -64, -64, -64, -64, 64, -64, -64, -64, -64, -64, -64, -64, -64, 64, -64, 64, 64, -64, -64, 64, 64, 64, 64, 64, 64, -64, -64, -64, -64, 64, -64, -64, 64, -64, -64, -64, -64, -64, 64, 64, 64, 64, 64, 64, 64, -64, -64, 64, -64, 64, 64, 64, 64, 64, -64, 64, 64, -64, 64, 64, -64, -64, -64, -64, -64, -64, 64, 64, 64, -64, 64, -64, -64, 64, -64, -64, -64, 64, -64, 64, 64, 64, -64, -64, -64, -64, -64, 64, -64, -64, -64, -64, -64, -64, 64, 64, -64, -64, 64, -64, 64, -64, -64, 64, 64, 64, 64, 64, 64, 64, 64, -64, 64, -64, -64, -64, 64, 64, -64, 64, -64, -64, 64, 64, 64, 64, 64, -64, 64, 64, -64, -64, -64, -64, -64, 64, 64, 64, -64, 64, 64, -64, 64, -64, 64, -64, -64, 64, 64, 64, 64, 64, 64, 64, 64, 64, 64, 64, -64, -64, 64, -64, 64, 64, 64, 64, 64, -64, 64, 64, 64, 64, 64, 64, 64, -64, 64, 64, 64, 64, 64, -64, 64, -64, -64, -64, -64, 64, -64, -64, 64, -64, 64, 64, 64, -64, 64, -64, -64, 64, 64, 64, 64, 64, 64, 64, -64, -64, 64, 64, 64, -64, -64, -64, 64, 64, 64, 64, 64, 64, -64, 64, 64, -64, -64, 64, -64, 64, 64, 64, 64, 64, -64, -64, 64, 64, 64, 64, 64, -64, -64, -64, 64, 64, 64, -64, 64, 64, 64, 64, -64, -64, 64, -64, -64, 64, 64, 64, 64, 64, -64, 64, -64, 64, 64, 64, -64, 64, 64, -64, -64, 64, 64, 64, 64, -64, -64, -64, 64, -64, -64, 64, 64, 64, 64, 64, 64, 64, 64, 64, 64, 64, 64, 64, 64, -64, -64, 64, 64, -64, 64, -64, -64, 64, 64, 64, -64, -64, 64, 64, 64, -64, -64, -64, 64, 64, 64, -64, 64, 64, 64, -64, -64, 64, 64, 64, -64, 64, -64, -64, -64, 64, -64, -64, 64, -64, -64, -64, -64, -64, -64, -64, 64, 64, 64, 64, 64, 64, -64, 64, -64, -64, 64, -64, -64, 64, -64, -64, 64, 64, -64, -64, 64, 64, 64, 64, -64, -64, -64, -64, -64, -64, 64, -64, 64, 64, 64, -64, -64, 64, 64, -64, -64, -64, -64, -64, -64, 64, -64, -64, 64, 64, 64, 64, 64, -64, -64, -64, -64, 64, 64, 64, -64, 64, -64, 64, 64, 64, 64, -64, -64, -64, -64, -64, 64, -64, -64, -64, -64, -64, -64, 64, 64, -64, -64, 64, -64, 64, -64, -64, -64, -64, -64, -64, 64, 64, 64, 64, -64, 64, 64, 64, 64, -64, 64, 64, -64, 64, 64, -64, 64, 64, 64, 64, -64, -64, -64, 64, 64, 64, 64, -64, -64, -64, -64, -64, 64, 64, -64, 64, -64, 64, 64, -64, 64, 64, -64, 64, -64, -64, 64, -64, 64, -64, -64, -64, 64, 64, -64, -64, -64, -64, 64, 64, -64, -64, 64, 64, 64, -64, -64, -64, 64, -64, 64, -64, -64, 64, 64, -64, 64, -64, -64, -64, -64, -64, -64, -64, -64, -64, -64, -64, -64, 64, 64, 64, -64, -64, 64, -64, -64, 64, 64, 64, 64, 64, 64, -64, -64, -64, -64, -64, -64, -64, -64, -64, -64, 64, 64, 64, -64, -64, -64, 64, -64, 64, 64, 64, 64, 64, -64, -64, 64, -64, -64, 64, -64, -64, -64, -64, -64, -64, -64, -64, 64, 64, 64, 64, 64, -64, -64, 64, -64, -64, 64, 64, 64, 64, 64, -64, 64, -64, -64, -64, -64, -64, -64, -64, -64, 64, 64, 64, -64, -64, -64, -64, -64, -64, -64, 64, 64, -64, 64, -64, -64, 64, -64, 64, -64, -64, -64, -64, -64, -64, -64, -64, -64, -64, 64, 64, 64, -64, -64, 64, 64, 64, -64, 64, -64, -64, 64, 64, 64, 64, -64, 64, -64, -64, -64, -64, -64, -64, -64, -64, -64, -64, -64, 64, 64, -64, 64, -64, 64, 64, 64, -64, -64, -64, 64, -64, 64, -64, 64, -64, -64, -64, -64, -64, -64, -64, -64, -64, -64, -64, 64, 64, -64, -64, -64, -64, 64, 64, -64, 64, 64, -64, -64, 64, -64, 64, 64, 64, -64, -64, -64, 64, 64, -64, 64, -64, -64, -64, 64, -64, -64, -64, -64, -64, -64, 64, -64, -64, 64, -64, -64, -64, 64, -64, -64, 64, 64, -64, -64, -64, -64, -64, -64, -64, -64, -64, -64, -64, -64, 64, 64, -64, 64, -64, 64, 64, 64, -64, -64, 64, 64, -64, -64, -64, 64, -64, 64, -64, -64, 64, -64, -64, -64, -64, -64, 64, -64, -64, -64, 64, 64, -64, 64, -64, -64, -64, -64, -64, 64, -64, -64, 64, 64, 64, 64, -64, -64, 64, 64, -64, -64, -64, -64, -64, -64, -64, -64, -64, -64, 64, 64, 64, -64, -64, -64, -64, 64, -64, -64, -64, 64, 64, 64, -64, -64, -64, -64, -64, -64, -64, -64, -64, -64, -64, -64, -64, 64, 64, 64, -64, -64, -64, -64, -64, 64, 64, -64, 64, 64, 64, -64, -64, -64, -64, -64, -64, -64, -64, -64, -64, -64, -64, -64, 64, 64, 64, 64, -64, -64, 64, 64, -64, -64, -64, 64, 64, -64, 64, 64, 64, -64, 64, 64, -64, -64, -64, -64, -64, -64, -64, -64, -64, 64, 64, -64, -64, -64, -64, -64, 64, -64, -64, -64, 64, 64, -64, 64, 64, 64, -64, 64, -64, -64, -64, -64, -64, -64, -64, -64, -64, 64, -64, -64, -64, -64, -64, -64, -64, -64, -64, 64, -64, 64, -64, 64, 64, 64, 64, -64, -64, -64, -64, -64, 64, -64, 64, 64, 64, 64, -64, -64, -64, -64, -64, -64, -64, 64, 64, 64, 64, 64, 64, 64, -64, 64, -64, 64, -64, 64, 64, -64, 64, 64, 64, 64, 64, -64, -64, -64, -64, -64, -64, 64, -64, -64, 64, -64, -64, 64, 64, -64, -64, 64, -64, -64, -64, -64, -64, -64, 64, 64, 64, 64, -64, -64, -64, -64, -64, -64, -64, -64, -64, 64, 64, 64, 64, 64, 64, 64, -64, -64, -64, -64, -64, -64, -64, -64, 64, -64, 64, 64, 64, 64, -64, -64, -64, -64, -64, -64, -64, -64, 64, 64, 64, -64, 64, -64, -64, -64, -64, -64, -64, -64, 64, 64, -64, -64, -64, -64, -64, 64, -64, -64, -64, 64, -64, 64, -64, -64, 64, -64, 64, -64, 64, -64, -64, -64, -64, -64, -64, -64, 64, -64, -64, -64, -64, -64, 64, -64, 64, -64, 64, -64, 64, 64, -64, 64, 64, 64, 64, -64, 64, -64, -64, -64, -64, -64, 64, -64, -64, -64, -64, -64, -64, -64, -64, 64, 64, -64, -64, 64, -64, -64, -64, -64, -64, -64, -64, 64, -64, -64, -64, -64, -64, -64, -64, 64, -64, -64, -64, -64, -64, -64, -64, 64, 64, -64, 64, 64, 64, 64, -64, 64, 64, 64, 64, 64, 64, -64, 64, 64, -64, 64, -64, -64, 64, -64, 64, 64, -64, -64, 64, -64, -64, 64, 64, 64, 64, -64, 64, -64, -64, -64, -64, -64, 64, 64, -64, 64, 64, -64, 64, 64, -64, -64, -64, -64, 64, -64, 64, 64, 64, 64, 64, 64, 64, 64, -64, -64, 64, -64, -64, 64, -64, 64, 64, 64, 64, 64, 64, -64, 64, -64, 64, 64, 64, 64, 64, -64, 64, 64, 64, -64, -64, 64, 64, -64, -64, 64, -64, 64, -64, -64, -64, -64, 64, -64, 64, -64, -64, -64, -64, 64, -64, -64, 64, -64, -64, -64, -64, 64, -64, -64, -64, -64, -64, 64, 64, -64, -64, 64, -64, -64, 64, -64, -64, 64, -64, -64, -64, -64, -64, 64, -64, -64, 64, 64, -64, -64, -64, 64, -64, 64, -64, 64, 64, -64, -64, -64, 64, 64, 64, -64, -64, -64, -64, -64, 64, -64, 64, 64, -64, -64, 64, 64, -64, -64, -64, 64, 64, -64, 64, 64, -64, -64, 64, 64, 64, 64, -64, 64, -64, -64, -64, 64, -64, 64, 64, 64, 64, -64, -64, 64, 64, 64, -64, -64, 64, 64, -64, -64, 64, 64, 64, 64, -64, 64, -64, -64, 64, -64, -64, -64, -64, 64, 64, 64, 64, 64, 64, -64, 64, 64, 64, 64, -64, 64, -64, 64, 64, 64, 64, -64, -64, 64, 64, 64, 64, 64, -64, -64, -64, 64, 64, 64, 64, 64, 64, 64, -64, -64, -64, -64, -64, -64, -64, -64, -64, 64, -64, -64, 64, -64, -64, -64, -64, -64, -64, -64, 64, 64, -64, 64, 64, 64, 64, 64, -64, -64, -64, -64, -64, -64, -64, -64, 64, 64, 64, -64, -64, -64, -64, -64, -64, -64, -64, -64, -64, -64, -64, 64, 64, 64, 64, -64, -64, -64, 64, 64, 64, 64, -64, -64, -64, -64, 64, 64, -64, -64, -64, 64, -64, -64, -64, -64, -64, -64, -64, -64, -64, 64, 64, -64, 64, -64, 64, 64, -64, 64, -64, -64, 64, -64, 64, 64, -64, 64, -64, -64, 64, 64, -64, 64, -64, -64, -64, 64, -64, 64, 64, 64, -64, -64, -64, 64, -64, 64, 64, 64, -64, -64, -64, -64, -64, -64, -64, 64, 64, -64, -64, -64, 64, -64, -64, -64, -64, 64, 64, 64, -64, -64, -64, 64, -64, -64, 64, 64, -64, 64, -64, -64, -64, -64, -64, 64, 64, -64, 64, -64, -64, -64, -64, -64, -64, 64, 64, 64, -64, 64, -64, -64, 64, -64, -64, 64, 64, 64, -64, -64, -64, -64, 64, 64, -64, -64, -64, -64, -64, -64, -64, -64, -64, 64, 64, 64, -64, 64, 64, 64, -64, -64, -64, -64, 64, -64, -64, -64, -64, -64, -64, 64, -64, -64, -64, -64, -64, -64, -64, -64, -64, 64, 64, -64, -64, -64, 64, 64, 64, 64, 64, 64, 64, -64, -64, -64, -64, -64, -64, -64, -64, -64, -64, -64, -64, -64, -64, -64, -64, 64, 64, -64, 64, -64, -64, 64, 64, -64, -64, -64, 64, 64, -64, -64, -64, -64, 64, 64, 64, -64, -64, 64, 64, -64, -64, 64, 64, 64, -64, -64, 64, 64, 64, 64, 64, -64, 64, 64, -64, -64, 64, -64, 64, 64, 64, 64, -64, 64, 64, -64, -64, 64, 64, -64, -64, -64, -64, -64, 64, 64, 64, -64, 64, 64, 64, 64, 64, -64, 64, -64, 64, 64, 64, 64, 64, 64, 64, 64, -64, 64, 64, 64, 64, 64, 64, 64, -64, 64, 64, -64, 64, 64, 64, 64, -64, -64, -64, 64, 64, 64, 64, 64, 64, 64, 64, 64, 64, 64, 64, 64, 64, -64, 64, 64, 64, -64, 64, 64, 64, 64, 64, -64, -64, -64, 64, 64, 64, 64, 64, 64, 64, 64, 64, 64, 64, 64, 64, 64, 64, 64, -64, 64, 64, 64, 64, -64, -64, -64, -64, 64, 64, 64, 64, 64, 64, 64, 64, 64, 64, 64, 64, 64, 64, 64, -64, 64, 64, 64, -64, 64, -64, -64, 64, -64, -64, 64, 64, 64, -64, 64, 64, 64, 64, 64, -64, 64, -64, 64, 64, -64, -64, -64, -64, -64, -64, 64, -64, 64, -64, -64, 64, 64, -64, 64, 64, 64, 64, 64, 64, 64, 64, 64, 64, 64, 64, -64, -64, -64, -64, -64, -64, -64, -64, 64, 64, 64, 64, -64, 64, 64, 64, -64, -64, 64, -64, 64, 64, 64, -64, 64, 64, -64, 64, -64, -64, -64, -64, -64, -64, -64, -64, 64, 64, 64, -64, -64, 64, 64, -64, 64, 64, 64, -64, 64, -64, 64, -64, 64, 64, -64, -64, -64, -64, -64, -64, -64, -64, 64, 64, 64, -64, -64, -64, 64, 64, 64, 64, 64, -64, 64, -64, 64, -64, -64, -64, -64, -64, -64, -64, -64, -64, -64, -64, -64, -64, -64, 64, 64, -64, -64, -64, -64, -64, 64, -64, -64, -64, 64, 64, -64, -64, -64, -64, -64, -64, 64, -64, -64, -64, -64, -64, -64, 64, -64, 64, -64, 64, -64, -64, -64, -64, 64, -64, 64, -64, -64, -64, 64, -64, -64, -64, -64, 64, -64, -64, -64, -64, -64, -64, -64, -64, -64, -64, -64, -64, -64, -64, -64, 64, 64, -64, 64, 64, 64, 64, -64, -64, 64, 64, 64, -64, -64, -64, -64, 64, -64, -64, 64, -64, -64, 64, -64, -64, -64, -64, 64, -64, 64, -64, -64, 64, -64, 64, -64, 64, 64, 64, -64, -64, 64, 64, 64, 64, -64, 64, -64, -64, 64, -64, -64, 64, -64, -64, -64, -64, -64, -64, -64, 64, 64, -64, -64, 64, -64, 64, 64, 64, 64, 64, 64, -64, 64, -64, -64, -64, 64, 64, 64, 64, -64, -64, -64, -64, 64, 64, 64, 64, -64, 64, 64, -64, -64, -64, 64, 64, -64, 64, 64, -64, -64, -64, 64, -64, -64, 64, 64, -64, 64, -64, 64, -64, -64, 64, 64, 64, -64, 64, 64, -64, -64, -64, -64, 64, 64, -64, -64, 64, 64, -64, 64, -64, -64, 64, -64, -64, 64, -64, 64, -64, 64, 64, 64, 64, -64, 64, -64, 64, -64, 64, 64, -64, 64, 64, -64, 64, 64, -64, 64, 64, 64, -64, -64, -64, -64, 64, 64, -64, 64, -64, 64, 64, -64, 64, 64, 64, 64, 64, 64, -64, 64, 64, -64, 64, 64, -64, -64, 64, 64, 64, -64, 64, -64, -64, -64, -64, -64, -64, 64, 64, 64, 64, -64, -64, -64, -64, -64, -64, -64, 64, 64, 64, 64, 64, -64, -64, 64, 64, 64, 64, -64, 64, 64, 64, 64, -64, 64, -64, 64, 64, 64, 64, -64, -64, -64, 64, 64, 64, 64, -64, 64, -64, -64, -64, -64, 64, 64, 64, -64, 64, -64, -64, -64, 64, -64, 64, -64, -64, -64, 64, -64, -64, -64, 64, 64, 64, -64, 64, 64, -64, -64, 64, -64, 64, -64, -64, 64, -64, -64, -64, 64, -64, -64, -64, -64, -64, -64, -64, 64, 64, 64, -64, 64, 64, 64, 64, 64, 64, 64, 64, -64, 64, 64, -64, 64, -64, -64, 64, 64, 64, -64, -64, 64, 64, -64, -64, -64, 64, -64, -64, 64, 64, 64, 64, 64, 64, -64, -64, 64, 64, 64, 64, 64, -64, -64, 64, -64, 64, -64, 64, 64, 64, -64, -64, -64, -64, 64, 64, -64, 64, -64, 64, -64, 64, 64, -64, 64, 64, -64, 64, -64, -64, -64, 64, 64, -64, 64, -64, -64, -64, -64, -64, -64, 64, 64, -64, -64, 64, -64, 64, 64, 64, -64, 64, -64, 64, -64, -64, 64, -64, 64, 64, -64, -64, -64, -64, -64, 64, -64, 64, -64, 64, 64, -64, -64, 64, 64, -64, -64, 64, 64, 64, 64, 64, 64, -64, 64, 64, 64, 64, -64, -64, 64, 64, -64, 64, 64, -64, 64, 64, 64, 64, -64, -64, 64, 64, 64, 64, -64, 64, 64, 64, 64, 64, 64, -64, -64, 64, 64, -64, 64, 64, 64, 64, 64, -64, 64, 64, -64, 64, 64, 64, 64, -64, 64, -64, 64, -64, 64, 64, 64, -64, -64, 64, 64, 64, 64, 64, -64, 64, 64, -64, 64, 64, 64, 64, -64, 64, -64, 64, 64, 64, 64, -64, 64, 64, 64, 64, 64, 64, 64, -64, -64, 64, 64, 64, -64, 64, -64, -64, 64, 64, 64, 64, 64, -64, 64, 64, 64, 64, 64, 64, 64, -64, 64, 64, -64, 64, -64, 64, -64, -64, -64, 64, -64, 64, -64, -64, 64, 64, -64, -64, -64, 64, -64, 64, 64, 64, -64, -64, 64, 64, -64, 64, 64, 64, 64, -64, 64, 64, 64, -64, 64, 64, -64, 64, -64, 64, -64, -64, -64, -64, 64, -64, -64, 64, 64, 64, 64, 64, -64, -64, -64, 64, 64, 64, -64, 64, 64, -64, 64, -64, 64, 64, -64, 64, -64, 64, 64, 64, 64, 64, 64, -64, 64, -64, -64, 64, 64, 64, 64, 64, 64, 64, 64, 64, 64, -64, 64, -64, 64, 64, 64, 64, 64, 64, -64, 64, 64, -64, 64, -64, 64, 64, 64, 64, 64, 64, -64, 64, 64, -64, -64, 64, 64, -64, -64, -64, 64, -64, -64, 64, -64, -64, -64, -64, 64, 64, 64, 64, -64, 64, 64, 64, -64, 64, -64, 64, 64, -64, 64, 64, -64, 64, -64, 64, -64, 64, 64, -64, 64, 64, -64, -64, 64, 64, 64, 64, -64, -64, 64, 64, 64, 64, -64, 64, -64, 64, -64, -64, 64, 64, -64, -64, 64, 64, -64, -64, -64, 64, 64, 64, 64, 64, 64, 64, 64, 64, -64, 64, 64, -64, 64, -64, 64, 64, 64, 64, 64, -64, -64, 64, 64, 64, 64, -64, -64, -64, -64, 64, 64, -64, -64, 64, 64, -64, -64, -64, 64, 64, 64, 64, 64, 64, 64, 64, 64, -64, -64, 64, -64, -64, 64, -64, 64, -64, 64, -64, 64, -64, -64, 64, -64, 64, -64, 64, 64, 64, 64, -64, -64, -64, 64, 64, -64, -64, 64, 64, -64, 64, 64, 64, 64, 64, -64, -64, 64, 64, 64, -64, 64, 64, 64, -64, -64, -64, -64, 64, -64, 64, -64, -64, 64, 64, -64, 64, -64, 64, -64, -64, -64, -64, -64, 64, -64, -64, 64, -64, -64, -64, 64, -64, 64, -64, -64, -64, 64, 64, 64, 64, -64, -64, -64, -64, -64, -64, -64, 64, -64, 64, 64, -64, -64, 64, 64, -64, -64, 64, -64, -64, 64, -64, 64, 64, -64, 64, 64, -64, -64, 64, -64, 64, 64, 64, -64, -64, 64, 64, -64, -64, 64, 64, -64, -64, 64, 64, 64, 64, -64, 64, -64, -64, 64, -64, -64, 64, 64, 64, -64, -64, -64, 64, -64, 64, 64, 64, 64, 64, 64, 64, -64, -64, -64, 64, 64, 64, 64, 64, 64, -64, 64, -64, -64, -64, 64, -64, 64, 64, -64, 64, 64, -64, 64, -64, 64, 64, 64, 64, -64, -64, -64, 64, -64, 64, 64, 64, 64, -64, -64, 64, -64, 64, -64, 64, -64, 64, 64, -64, 64, 64, -64, -64, 64, -64, 64, -64, 64, -64, -64, 64, -64, 64, 64, 64, -64, 64, 64, 64, -64, 64, -64, -64, 64, -64, 64, 64, 64, 64, 64, -64, -64, 64, 64, 64, -64, -64, 64, 64, 64, -64, 64, -64, -64, 64, -64, 64, -64, 64, -64, 64, 64, 64, 64, 64, 64, 64, 64, 64, -64, -64, 64, -64, 64, -64, -64, -64, -64, 64, 64, -64, 64, -64, 64, 64, 64, 64, 64, -64, -64, -64, -64, -64, -64, 64, 64, -64, 64, 64, 64, 64, -64, 64, 64, 64, 64, 64, 64, -64, 64, 64, 64, 64, 64, -64, -64, 64, -64, -64, 64, -64, -64, -64, -64, 64, -64, 64, 64, 64, 64, -64, 64, 64, -64, -64, 64, 64, 64, 64, 64, 64, 64, -64, 64, 64, 64, -64, -64, -64, 64, 64, -64, 64, 64, -64, -64, 64, 64, -64, -64, -64, -64, 64, -64, 64, -64, 64, 64, -64, 64, -64, 64, -64, 64, -64, 64, -64, -64, 64, 64, -64, -64, -64, 64, -64, 64, 64, 64, 64, 64, -64, -64, 64, 64, 64, 64, 64, 64, -64, -64, -64, -64, -64, -64, 64, 64, -64, 64, 64, -64, -64, -64, 64, 64, 64, 64, 64, 64, -64, 64, 64, 64, 64, -64, -64, 64, 64, 64, -64, 64, -64, 64, 64, 64, -64, 64, 64, 64, 64, -64, 64, 64, 64, 64, 64, -64, -64, 64, 64, 64, 64, 64, 64, -64, -64, 64, -64, 64, -64, -64, -64, -64, -64, -64, 64, 64, 64, 64, 64, 64, -64, 64, 64, 64, 64, 64, 64, 64, 64, 64, 64, 64, 64, -64, 64, 64, 64, -64, -64, 64, -64, -64, 64, 64, 64, 64, 64, 64, 64, 64, 64, 64, 64, 64, 64, 64, -64, -64, -64, 64, 64, 64, -64, -64, -64, -64, -64, 64, 64, -64, -64, 64, 64, 64, 64, -64, 64, -64, 64, -64, 64, 64, 64, 64, 64, 64, -64, 64, -64, -64, 64, 64, -64, -64, 64, 64, -64, 64, -64, 64, 64, 64, 64, 64, -64, -64, -64, 64, 64, -64, 64, 64, 64, 64, 64, 64, -64, -64, -64, 64, 64, 64, 64, 64, 64, 64, -64, -64, 64, -64, 64, 64, -64, 64, -64, 64, 64, 64, 64, 64, -64, 64, 64, -64, 64, -64, -64, -64, -64, -64, 64, 64, 64, -64, -64, 64, -64, 64, -64, 64, 64, -64, -64, 64, 64, 64, 64, -64, 64, 64, -64, 64, -64, -64, -64, -64, -64, 64, -64, -64, 64, -64, 64, 64, 64, 64, -64, 64, -64, 64, 64, 64, 64, 64, -64, -64, -64, -64, -64, 64, 64, -64, 64, -64, -64, -64, 64, -64, 64, -64, -64, 64, 64, -64, 64, 64, 64, -64, 64, -64, -64, 64, -64, 64, 64, 64, 64, -64, 64, -64, 64, -64, 64, -64, 64, -64, -64, -64, 64, 64, 64, 64, 64, 64, 64, 64, 64, 64, 64, -64, 64, 64, -64, 64, -64, -64, 64, -64, -64, 64, -64, -64, 64, -64, 64, -64, -64, -64, 64, 64, 64, -64, 64, 64, 64, 64, 64, 64, 64, -64, 64, 64, -64, 64, -64, -64, -64, -64, 64, -64, -64, 64, 64, -64, 64, -64, -64, -64, 64, -64, -64, -64, 64, -64, 64, 64, 64, -64, 64, 64, 64, -64, 64, -64, -64, 64, 64, 64, 64, 64, 64, -64, -64, 64, 64, -64, 64, 64, 64, 64, 64, -64, 64, 64, 64, -64, 64, -64, 64, -64, 64, 64, 64, -64, 64, -64, -64, -64, 64, -64, -64, -64, -64, -64, 64, -64, 64, -64, 64, 64, -64, 64, -64, -64, 64, -64, -64, -64, -64, 64, -64, -64, 64, 64, -64, 64, 64, 64, -64, 64, 64, 64, 64, 64, 64, 64, -64, 64, -64, 64, 64, 64, -64, 64, 64, -64, -64, 64, 64, 64, -64, -64, 64, 64, 64, -64, 64, -64, 64, 64, -64, -64, -64, 64, 64, -64, 64, 64, -64, -64, -64, -64, 64, -64, 64, -64, -64, 64, -64, 64, -64, 64, -64, 64, 64, -64, -64, 64, -64, -64, 64, -64, -64, -64, -64, 64, 64, 64, -64, -64, -64, -64, -64, 64, -64, 64, -64, 64, -64, -64, -64, 64, -64, -64, -64, 64, -64, -64, -64, 64, -64, -64, -64, 64, 64, -64, 64, -64, 64, 64, 64, 64, -64, 64, 64, -64, 64, 64, 64, 64, -64, 64, 64, -64, -64, -64, 64, -64, -64, 64, 64, -64, 64, -64, -64, -64, 64, 64, -64, -64, 64, 64, -64, 64, 64, -64, -64, -64, -64, -64, -64, -64, -64, -64, -64, -64, -64, -64, -64, -64, -64, -64, -64, 64, -64, -64, -64, -64, -64, -64, 64, 64, 64, -64, 64, 64, 64, 64, -64, -64, -64, -64, -64, 64, -64, 64, -64, -64, -64, 64, -64, -64, 64, 64, 64, 64, -64, -64, -64, -64, -64, 64, 64, -64, -64, -64, -64, -64, -64, -64, -64, -64, 64, 64, -64, -64, -64, -64, -64, 64, 64, 64, -64, -64, 64, 64, -64, -64, -64, 64, -64, 64, 64, -64, -64, -64, 64, 64, -64, -64, -64, 64, -64, -64, -64, -64, 64, 64, 64, -64, -64, -64, -64, -64, -64, -64, 64, -64, -64, 64, 64, -64, -64, -64, -64, -64, -64, -64, -64, -64, -64, -64, -64, -64, -64, 64, 64, -64, -64, 64, -64, 64, 64, -64, -64, -64, 64, -64, -64, -64, 64, 64, 64, -64, 64, 64, -64, -64, -64, 64, 64, -64, -64, -64, -64, -64, 64, 64, 64, -64, 64, -64, 64, -64, 64, -64, -64, -64, -64, -64, 64, 64, -64, -64, -64, 64, 64, 64, -64, -64, 64, 64, 64, -64, -64, -64, -64, 64, 64, 64, -64, 64, -64, -64, 64, -64, -64, 64, 64, -64, -64, -64, -64, -64, 64, 64, -64, -64, -64, -64, -64, 64, -64, -64, -64, 64, -64, -64, -64, 64, 64, -64, -64, -64, -64, -64, -64, 64, -64, -64, 64, 64, -64, -64, 64, -64, 64, -64, 64, 64, 64, -64, -64, 64, 64, 64, 64, -64, 64, 64, 64, 64, -64, 64, -64, 64, -64, -64, -64, -64, 64, 64, -64, -64, 64, -64, 64, 64, -64, 64, -64, 64, -64, 64, -64, 64, 64, 64, -64, -64, -64, 64, -64, -64, -64, -64, -64, 64, 64, -64, -64, -64, -64, -64, 64, -64, -64, 64, -64, 64, 64, -64, 64, 64, -64, -64, 64, -64, -64, -64, 64, -64, -64, -64, 64, -64, -64, -64, 64, 64, -64, 64, -64, -64, -64, -64, -64, -64, 64, 64, -64, -64, 64, 64, -64, 64, -64, -64, -64, 64, -64, -64, -64, -64, 64, -64, -64, -64, -64, 64, -64, 64, -64, -64, -64, 64, 64, -64, 64, -64, 64, -64, -64, -64, -64, -64, -64, 64, -64, 64, -64, -64, 64, -64, -64, -64, -64, -64, 64, -64, -64, -64, 64, -64, 64, 64, -64, 64, 64, -64, -64, 64, -64, 64, -64, -64, -64, 64, -64, -64, 64, -64, 64, -64, -64, -64, -64, 64, -64, -64, 64, -64, -64, 64, -64, 64, 64, -64, -64, 64, 64, -64, -64, 64, -64, -64, -64, -64, 64, 64, -64, -64, -64, -64, -64, -64, -64, 64, 64, 64, -64, 64, -64, -64, 64, -64, -64, -64, 64, -64, 64, -64, -64, -64, -64, 64, -64, -64, 64, -64, -64, -64, 64, -64, -64, 64, 64, 64, -64, 64, -64, 64, 64, -64, -64, 64, -64, 64, -64, -64, -64, 64, -64, -64, 64, -64, -64, -64, -64, 64, 64, 64, -64, 64, 64, -64, -64, 64, -64, 64, -64, 64, -64, 64, -64, -64, -64, 64, -64, -64, 64, -64, -64, -64, -64, -64, -64, -64, -64, 64, 64, 64, 64, 64, 64, -64, -64, -64, -64, -64, 64, 64, 64, 64, 64, -64, -64, -64, 64, 64, -64, -64, -64, 64, -64, 64, 64, 64, 64, -64, -64, 64, 64, -64, -64, 64, -64, 64, 64, -64, 64, -64, 64, 64, 64, -64, -64, 64, -64, -64, -64, -64, -64, 64, 64, 64, -64, -64, -64, -64, 64, -64, -64, 64, 64, -64, -64, -64, -64, -64, 64, -64, -64, -64, -64, -64, -64, 64, -64, -64, -64, -64, 64, 64, 64, 64, 64, -64, 64, -64, 64, 64, 64, 64, -64, -64, -64, -64, -64, -64, 64, -64, 64, -64, -64, -64, 64, 64, 64, 64, -64, 64, 64, 64, -64, 64, -64, 64, 64, -64, 64, -64, -64, 64, -64, -64, -64, -64, -64, -64, 64, -64, 64, 64, -64, -64, 64, 64, 64, -64, -64, -64, 64, 64, 64, -64, -64, -64, 64, -64, 64, -64, 64, -64, -64, 64, -64, 64, -64, -64, 64, 64, 64, 64, 64, 64, -64, -64, 64, -64, 64, 64, 64, 64, -64, 64, 64, -64, -64, 64, -64, 64, 64, -64, -64, -64, -64, 64, -64, 64, 64, -64, -64, -64, 64, 64, 64, 64, 64, 64, -64, 64, 64, -64, 64, -64, -64, -64, -64, -64, 64, 64, 64, 64, 64, 64, -64, -64, -64, 64, 64, -64, -64, -64, -64, 64, 64, -64, 64, 64, 64, 64, -64, -64, 64, 64, -64, -64, 64, -64, 64, -64, -64, 64, 64, 64, 64, -64, -64, -64, 64, 64, 64, -64, -64, -64, -64, -64, -64, -64, -64, 64, -64, 64, -64, -64, 64, 64, 64, 64, -64, 64, -64, -64, 64, 64, -64, -64, 64, 64, -64, -64, 64, 64, -64, 64, -64, 64, 64, -64, -64, 64, -64, -64, 64, 64, -64, 64, 64, 64, 64, 64, 64, -64, 64, -64, -64, -64, 64, -64, -64, 64, 64, -64, 64, 64, -64, -64, -64, -64, -64, -64, 64, -64, -64, 64, -64, 64, 64, 64, 64, 64, -64, -64, -64, -64, 64, 64, 64, 64, 64, 64, -64, -64, 64, 64, -64, 64, -64, 64, 64, 64, 64, -64, -64, 64, 64, 64, -64, -64, -64, 64, -64, -64, -64, -64, -64, 64, 64, -64, -64, -64, -64, 64, 64, 64, 64, 64, 64, 64, 64, -64, 64, 64, 64, 64, 64, 64, -64, -64, -64, 64, -64, 64, -64, -64, -64, -64, -64, 64, 64, 64, 64, 64, 64, 64, 64, 64, -64, 64, 64, 64, 64, 64, 64, -64, -64, 64, -64, -64, -64, 64, -64, 64, 64, 64, 64, -64, 64, 64, 64, 64, 64, 64, 64, 64, -64, 64, 64, 64, 64, 64, 64, 64, -64, -64, -64, 64, -64, 64, 64, 64, 64, 64, -64, -64, -64, 64, 64, -64, 64, 64, 64, 64, -64, 64, 64, 64, 64, 64, 64, -64, -64, -64, -64, -64, -64, 64, -64, -64, -64, 64, 64, -64, -64, 64, 64, -64, 64, 64, 64, 64, 64, 64, -64, 64, 64, 64, 64, 64, -64, 64, 64, 64, -64, 64, 64, -64, 64, -64, -64, -64, 64, 64, -64, -64, 64, 64, 64, 64, -64, 64, 64, 64, 64, 64, 64, -64, -64, -64, 64, 64, -64, -64, -64, 64, 64, -64, 64, -64, 64, 64, 64, 64, 64, 64, 64, 64, 64, 64, 64, -64, 64, 64, 64, 64, -64, -64, 64, 64, -64, -64, 64, 64, 64, 64, 64, -64, 64, 64, -64, -64, 64, 64, 64, 64, 64, 64, -64, 64, 64, 64, 64, -64, -64, 64, -64, -64, -64, -64, -64, -64, -64, -64, -64, -64, 64, 64, 64, 64, 64, 64, 64, 64, 64, 64, -64, 64, 64, 64, 64, 64, -64, 64, 64, 64, 64, -64, -64, -64, 64, 64, -64, 64, -64, -64, 64, 64, 64, 64, 64, 64, 64, 64, 64, 64, 64, 64, 64, 64, -64, 64, -64, -64, -64, -64, -64, -64, -64, -64, 64, -64, 64, -64, -64, -64, 64, 64, 64, 64, 64, 64, 64, 64, 64, 64, -64, 64, 64, -64, 64, 64, 64, 64, 64, -64, 64, 64, 64, 64, 64, -64, 64, -64, 64, 64, 64, 64, 64, 64, 64, 64, 64, -64, 64, -64, 64, 64, 64, -64, -64, -64, 64, 64, 64, -64, -64, -64, -64, -64, -64, 64, -64, -64, -64, -64, 64, 64, 64, 64, 64, 64, 64, 64, 64, 64, 64, 64, -64, 64, 64, -64, -64, 64, -64, -64, -64, -64, -64, -64, -64, -64, -64, 64, -64, 64, 64, 64, 64, 64, 64, 64, -64, 64, 64, 64, 64, 64, 64, -64, 64, -64, 64, -64, 64, -64, -64, -64, 64, -64, -64, -64, -64, 64, 64, -64, 64, 64, 64, 64, -64, 64, 64, 64, 64, 64, -64, -64, 64, -64, 64, 64, 64, 64, 64, 64, -64, -64, -64, -64, 64, 64, -64, 64, 64, 64, 64, 64, 64, -64, 64, 64, -64, 64, -64, -64, 64, -64, 64, 64, 64, 64, -64, -64, -64, -64, -64, 64, 64, 64, 64, 64, 64, 64, -64, -64, -64, 64, 64, 64, 64, 64, -64, 64, 64, -64, 64, -64, -64, -64, -64, -64, 64, -64, 64, 64, 64, -64, -64, 64, 64, 64, 64, 64, 64, 64, 64, 64, -64, 64, -64, 64, 64, 64, 64, 64, 64, 64, 64, 64, 64, 64, 64, -64, 64, 64, -64, -64, -64, -64, 64, 64, 64, -64, 64, -64, 64, 64, -64, -64, 64, -64, -64, 64, 64, -64, -64, 64, -64, -64, -64, 64, 64, -64, 64, -64, 64, -64, -64, -64, 64, 64, -64, -64, 64, 64, -64, -64, -64, -64, -64, -64, 64, -64, -64, 64, 64, 64, -64, -64, 64, 64, -64, 64, 64, 64, 64, 64, -64, 64, 64, -64, -64, 64, -64, 64, 64, 64, 64, 64, 64, 64, 64, 64, -64, 64, 64, -64, -64, -64, 64, -64, 64, 64, -64, -64, -64, -64, -64, 64, -64, -64, 64, 64, -64, -64, -64, 64, 64, 64, -64, -64, 64, 64, -64, -64, -64, 64, -64, -64, -64, 64, 64, -64, -64, -64, -64, -64, -64, 64, 64, 64, -64, 64, 64, 64, -64, 64, -64, -64, -64, 64, 64, 64, 64, 64, 64, 64, 64, 64, 64, 64, -64, -64, 64, 64, -64, 64, 64, 64, 64, -64, -64, -64, 64, -64, 64, 64, 64, 64, 64, 64, 64, 64, -64, 64, -64, -64, -64, 64, 64, -64, -64, -64, -64, -64, -64, -64, 64, -64, 64, -64, -64, -64, -64, 64, 64, 64, 64, 64, 64, -64, -64, -64, -64, -64, -64, -64, -64, -64, -64, -64, -64, -64, -64, 64, -64, 64, 64, -64, 64, -64, -64, -64, -64, -64, -64, -64, -64, -64, -64, -64, 64, 64, -64, -64, -64, -64, -64, -64, -64, -64, 64, 64, -64, 64, 64, -64, -64, 64, 64, -64, -64, -64, -64, 64, 64, 64, -64, -64, -64, -64, -64, -64, -64, -64, -64, -64, -64, 64, 64, -64, 64, -64, -64, -64, 64, -64, 64, -64, -64, -64, -64, -64, -64, -64, -64, -64, -64, -64, 64, -64, 64, -64, -64, -64, -64, -64, 64, -64, 64, 64, -64, 64, -64, -64, 64, -64, -64, 64, 64, -64, 64, -64, -64, -64, -64, -64, -64, -64, 64, 64, -64, -64, -64, 64, -64, -64, -64, 64, 64, 64, -64, -64, -64, -64, -64, -64, 64, -64, -64, 64, -64, -64, -64, -64, -64, -64, 64, -64, 64, -64, -64, -64, -64, -64, -64, 64, 64, -64, -64, -64, -64, -64, -64, -64, -64, 64, 64, -64, 64, -64, -64, -64, 64, -64, -64, 64, 64, 64, 64, -64, 64, -64, -64, 64, 64, 64, -64, -64, -64, -64, 64, -64, -64, -64, 64, 64, 64, 64, 64, 64, -64, 64, 64, 64, -64, 64, -64, -64, 64, -64, -64, -64, -64, 64, 64, 64, -64, -64, 64, -64, -64, -64, 64, -64, 64, 64, -64, -64, 64, 64, 64, 64, -64, 64, 64, -64, 64, 64, 64, -64, 64, 64, 64, 64, 64, 64, 64, 64, 64, -64, -64, -64, -64, -64, -64, -64, -64, -64, 64, -64, 64, 64, 64, 64, 64, -64, -64, 64, 64, 64, 64, 64, -64, 64, 64, -64, -64, -64, -64, -64, -64, -64, -64, -64, 64, 64, 64, 64, 64, 64, 64, 64, 64, -64, 64, 64, 64, 64, -64, -64, -64, 64, -64, -64, -64, -64, -64, -64, -64, -64, -64, -64, -64, -64, 64, 64, 64, 64, 64, 64, 64, -64, -64, 64, -64, 64, 64, 64, -64, -64, -64, -64, -64, -64, -64, -64, -64, -64, -64, -64, 64, -64, 64, 64, 64, 64, -64, 64, -64, -64, 64, -64, 64, 64, 64, 64, -64, -64, -64, -64, -64, -64, -64, -64, -64, -64, -64, 64, 64, -64, -64, 64, 64, 64, -64, -64, -64, -64, -64, -64, 64, 64, 64, 64, 64, -64, -64, -64, -64, -64, -64, -64, -64, -64, -64, 64, 64, 64, 64, -64, 64, 64, -64, -64, 64, 64, -64, 64, 64, 64, 64, 64, 64, 64, -64, -64, -64, -64, -64, -64, -64, -64, 64, 64, 64, 64, -64, -64, -64, -64, -64, 64, -64, -64, 64, -64, -64, 64, 64, 64, 64, 64, 64, -64, 64, -64, -64, 64, -64, -64, -64, -64, -64, -64, -64, -64, -64, 64, 64, 64, 64, -64, 64, 64, 64, -64, 64, -64, 64, -64, -64, -64, 64, -64, -64, -64, -64, -64, -64, -64, -64, -64, -64, -64, 64, 64, -64, 64, -64, -64, -64, 64, -64, -64, 64, 64, -64, -64, -64, -64, -64, -64, -64, -64, 64, -64, -64, 64, -64, -64, -64, -64, -64, -64, -64, 64, -64, 64, -64, -64, -64, 64, -64, 64, -64, 64, -64, -64, 64, 64, -64, -64, 64, 64, -64, -64, -64, -64, -64, -64, 64, -64, -64, 64, -64, -64, 64, 64, 64, 64, 64, -64, 64, 64, 64, 64, 64, -64, -64, -64, -64, -64, -64, -64, -64, 64, -64, 64, -64, 64, -64, 64, 64, 64, 64, -64, 64, -64, 64, -64, -64, -64, 64, 64, 64, -64, 64, -64, 64, 64, -64, -64, 64, -64, -64, 64, -64, -64, 64, -64, 64, -64, -64, 64, 64, -64, -64, 64, -64, -64, -64, 64, -64, -64, -64, 64, 64, 64, 64, 64, -64, 64, -64, -64, -64, 64, -64, -64, -64, -64, -64, 64, -64, 64, -64, 64, 64, -64, -64, -64, -64, 64, 64, -64, -64, -64, 64, 64, -64, 64, 64, -64, 64, 64, 64, -64, 64, 64, 64, 64, -64, 64, 64, 64, 64, -64, 64, -64, 64, 64, 64, -64, -64, -64, 64, 64, 64, -64, -64, 64, 64, 64, 64, 64, 64, -64, 64, 64, 64, -64, -64, 64, 64, -64, 64, 64, 64, 64, 64, -64, 64, 64, 64, 64, -64, 64, -64, -64, -64, -64, -64, 64, -64, 64, -64, -64, 64, 64, 64, -64, 64, 64, 64, 64, 64, 64, 64, 64, 64, 64, 64, 64, -64, -64, -64, -64, -64, -64, -64, -64, -64, -64, 64, 64, 64, 64, 64, 64, -64, 64, -64, 64, 64, 64, 64, 64, 64, 64, 64, 64, -64, -64, -64, -64, -64, -64, -64, -64, 64, 64, -64, -64, 64, 64, -64, -64, -64, -64, -64, -64, -64, 64, 64, 64, 64, 64, 64, 64, -64, -64, -64, -64, -64, -64, -64, -64, 64, 64, -64, -64, 64, 64, 64, 64, -64, -64, -64, -64, -64, -64, -64, 64, 64, 64, 64, -64, -64, -64, 64, -64, 64, 64, -64, 64, 64, 64, -64, -64, 64, -64, 64, 64, 64, -64, 64, -64, -64, -64, 64, 64, 64, 64, 64, -64, -64, 64, 64, 64, 64, -64, 64, -64, 64, -64, -64, -64, 64, 64, 64, 64, 64, -64, 64, -64, -64, 64, 64, 64, 64, 64, 64, -64, 64, 64, 64, 64, 64, -64, -64, 64, 64, 64, 64, 64, -64, 64, 64, 64, 64, 64, 64, -64, 64, 64, -64, 64, 64, 64, -64, -64, 64, 64, 64, 64, 64, 64, 64, 64, 64, 64, 64, 64, 64, -64, 64, 64, 64, 64, 64, 64, 64, 64, -64, 64, 64, -64, -64, 64, 64, 64, 64, 64, -64, 64, 64, 64, 64, 64, -64, 64, -64, -64, -64, 64, 64, 64, 64, 64, 64, 64, -64, -64, 64, -64, -64, -64, 64, 64, 64, 64, 64, 64, 64, 64, 64, -64, 64, -64, 64, -64, -64, 64, 64, 64, 64, 64, -64, -64, -64, -64, 64, -64, -64, 64, 64, -64, -64, 64, 64, 64, 64, -64, 64, -64, -64, 64, -64, 64, 64, 64, 64, 64, 64, 64, -64, -64, -64, -64, 64, -64, -64, 64, -64, -64, -64, 64, 64, 64, 64, 64, 64, -64, 64, 64, -64, -64, 64, -64, 64, 64, 64, -64, -64, -64, -64, 64, -64, 64, 64, 64, 64, -64, 64, -64, 64, -64, -64, 64, 64, 64, 64, -64, -64, -64, 64, 64, 64, 64, 64, -64, -64, -64, 64, 64, -64, -64, -64, -64, -64, -64, -64, 64, 64, 64, 64, 64, 64, -64, -64, 64, 64, 64, 64, 64, 64, 64, 64, -64, 64, 64, 64, -64, 64, -64, -64, -64, 64, 64, 64, 64, 64, 64, 64, 64, 64, 64, 64, -64, -64, 64, 64, -64, 64, 64, 64, -64, 64, 64, 64, 64, -64, 64, -64, 64, -64, 64, 64, 64, 64, 64, 64, -64, 64, 64, 64, -64, 64, -64, 64, 64, 64, -64, 64, -64, 64, 64, -64, -64, 64, -64, 64, 64, 64, 64, 64, 64, 64, 64, 64, 64, 64, -64, 64, -64, -64, -64, 64, 64, 64, -64, 64, 64, 64, 64, -64, 64, -64, -64, 64, 64, 64, 64, 64, 64, 64, 64, 64, 64, 64, -64, -64, 64, 64, 64, -64, 64, 64, 64, 64, 64, 64, 64, -64, -64, 64, -64, -64, -64, 64, -64, 64, 64, 64, 64, 64, -64, -64, 64, 64, 64, 64, 64, -64, 64, 64, 64, 64, 64, 64, 64, -64, -64, 64, -64, 64, 64, 64, 64, 64, 64, 64, 64, 64, 64, 64, -64, 64, 64, 64, 64, 64, 64, 64, 64, 64, 64, 64, 64, -64, -64, 64, -64, -64, -64, 64, 64, 64, -64, 64, 64, 64, -64, -64, -64, -64, 64, -64, 64, 64, 64, 64, 64, 64, 64, 64, 64, -64, -64, -64, -64, -64, -64, -64, -64, 64, -64, -64, -64, -64, -64, 64, 64, -64, 64, -64, 64, 64, -64, 64, 64, 64, 64, 64, -64, -64, -64, -64, 64, -64, 64, 64, 64, 64, -64, -64, 64, 64, 64, -64, -64, -64, -64, -64, -64, 64, -64, 64, 64, 64, 64, 64, -64, -64, -64, 64, 64, 64, 64, 64, 64, 64, 64, -64, 64, -64, -64, 64, 64, 64, -64, -64, -64, -64, -64, 64, -64, 64, 64, 64, -64, 64, 64, 64, 64, 64, 64, 64, -64, 64, 64, 64, -64, 64, -64, -64, -64, 64, -64, -64, -64, -64, 64, -64, -64, 64, 64, 64, -64, -64, -64, 64, 64, -64, 64, 64, -64, -64, -64, -64, -64, -64, -64, 64, 64, -64, -64, -64, -64, 64, 64, -64, -64, -64, 64, -64, 64, -64, 64, 64, -64, -64, 64, -64, -64, 64, 64, -64, 64, 64, 64, -64, 64, 64, 64, -64, -64, -64, 64, -64, -64, -64, 64, -64, -64, -64, 64, -64, -64, 64, 64, 64, 64, 64, 64, -64, -64, 64, -64, -64, -64, 64, -64, -64, -64, 64, 64, -64, 64, -64, -64, -64, 64, 64, -64, 64, 64, -64, 64, -64, 64, 64, 64, 64, 64, -64, 64, 64, -64, -64, 64, 64, 64, -64, 64, 64, 64, -64, -64, 64, 64, 64, 64, 64, -64, 64, 64, 64, 64, 64, 64, 64, 64, -64, 64, -64, 64, -64, 64, -64, 64, 64, -64, -64, 64, 64, -64, -64, 64, -64, 64, 64, 64, 64, 64, 64, 64, 64, 64, 64, 64, 64, -64, 64, 64, 64, 64, 64, 64, 64, 64, -64, 64, 64, 64, 64, 64, -64, 64, 64, 64, 64, -64, 64, 64, 64, 64, 64, 64, 64, 64, 64, 64, 64, 64, 64, 64, 64, 64, 64, 64, 64, 64, 64, 64, 64, -64, -64, -64, -64, 64, -64, -64, 64, 64, 64, 64, 64, 64, -64, 64, -64, 64, -64, 64, 64, 64, 64, 64, 64, 64, 64, 64, -64, -64, -64, -64, -64, -64, -64, 64, 64, 64, 64, 64, 64, -64, 64, 64, -64, -64, 64, 64, 64, 64, 64, 64, 64, 64, -64, -64, -64, -64, -64, -64, -64, 64, -64, 64, 64, 64, 64, 64, 64, -64, 64, -64, 64, 64, 64, -64, 64, 64, 64, 64, 64, -64, -64, -64, 64, 64, -64, 64, 64, 64, 64, 64, 64, 64, 64, 64, -64, 64, -64, 64, -64, 64, 64, -64, -64, 64, 64, 64, -64, -64, 64, 64, -64, 64, 64, 64, 64, 64, 64, 64, 64, 64, 64, 64, 64, 64, 64, -64, -64, -64, 64, -64, 64, 64, 64, 64, -64, -64, -64, -64, 64, 64, -64, -64, 64, -64, -64, 64, -64, 64, 64, 64, 64, 64, 64, -64, 64, -64, -64, -64, -64, 64, 64, -64, -64, 64, 64, 64, 64, -64, -64, -64, -64, -64, 64, 64, 64, -64, 64, -64, 64, 64, 64, -64, -64, 64, -64, 64, 64, 64, 64, -64, -64, -64, 64, 64, -64, 64, -64, -64, -64, -64, 64, 64, 64, -64, 64, 64, 64, 64, 64, 64, -64, 64, 64, -64, 64, 64, 64, -64, -64, -64, 64, -64, -64, -64, 64, -64, -64, -64, 64, 64, 64, 64, 64, 64, 64, 64, 64, 64, 64, 64, 64, 64, -64, 64, 64, 64, -64, 64, -64, -64, -64, 64, 64, 64, 64, 64, 64, 64, -64, 64, 64, 64, 64, -64, -64, 64, -64, 64, 64, -64, -64, 64, 64, 64, 64, -64, -64, -64, -64, 64, 64, 64, 64, 64, 64, 64, 64, 64, 64, 64, 64, 64, -64, 64, -64, -64, -64, 64, -64, 64, 64, 64, 64, 64, 64, -64, -64, -64, 64, 64, -64, -64, 64, 64, 64, 64, 64, 64, -64, 64, 64, 64, -64, -64, 64, -64, -64, 64, 64, 64, 64, 64, 64, 64, 64, 64, 64, -64, -64, 64, 64, 64, 64, 64, 64, 64, 64, 64, 64, 64, 64, -64, -64, 64, 64, 64, 64, 64, 64, 64, 64, 64, 64, 64, -64, -64, 64, 64, 64, 64, 64, 64, 64, 64, -64, 64, -64, -64, -64, -64, -64, -64, 64, 64, 64, 64, 64, 64, 64, 64, 64, -64, 64, -64, 64, 64, 64, 64, 64, 64, 64, 64, -64, -64, -64, -64, 64, 64, -64, -64, 64, 64, 64, 64, 64, 64, 64, 64, 64, -64, 64, 64, 64, 64, 64, 64, 64, -64, 64, 64, 64, -64, 64, -64, -64, -64, 64, -64, -64, -64, 64, 64, 64, -64, -64, 64, 64, 64, 64, -64, 64, 64, 64, 64, 64, 64, 64, 64, 64, 64, -64, 64, 64, -64, -64, -64, -64, -64, -64, -64, -64, -64, -64, -64, 64, -64, -64, 64, 64, 64, 64, 64, -64, -64, 64, -64, -64, 64, 64, -64, -64, 64, 64, -64, -64, -64, -64, -64, -64, -64, -64, -64, -64, 64, 64, 64, 64, 64, 64, -64, 64, -64, -64, 64, -64, 64, 64, 64, -64, 64, 64, 64, -64, -64, -64, 64, 64, 64, -64, -64, -64, -64, -64, -64, -64, -64, -64, -64, -64, -64, -64, -64, -64, -64, -64, 64, 64, 64, 64, 64, -64, 64, 64, 64, 64, 64, 64, 64, -64, -64, -64, -64, -64, -64, 64, 64, -64, 64, -64, -64, 64, 64, 64, -64, 64, 64, -64, 64, -64, 64, 64, -64, -64, -64, -64, -64, 64, 64, -64, -64, 64, 64, 64, -64, -64, 64, -64, -64, 64, 64, -64, -64, -64, -64, 64, 64, -64, 64, 64, 64, 64, 64, 64, 64, -64, -64, 64, 64, -64, 64, -64, 64, -64, -64, -64, -64, 64, 64, 64, 64, -64, -64, -64, 64, 64, -64, -64, -64, -64, 64, 64, -64, 64, 64, 64, 64, -64, 64, -64, 64, -64, 64, 64, 64, 64, 64, -64, -64, -64, 64, 64, -64, 64, 64, -64, 64, 64, -64, 64, -64, 64, -64, -64, 64, 64, 64, 64, 64, -64, 64, -64, -64, -64, 64, -64, 64, 64, -64, 64, -64, -64, 64, 64, -64, 64, -64, 64, -64, 64, -64, 64, 64, -64, 64, -64, -64, -64, 64, 64, 64, -64, -64, -64, -64, -64, -64, -64, 64, 64, -64, -64, 64, 64, -64, -64, -64, 64, -64, -64, -64, 64, -64, 64, -64, 64, -64, 64, 64, 64, -64, -64, 64, 64, -64, -64, 64, 64, 64, 64, 64, -64, 64, 64, 64, 64, -64, -64, -64, -64, -64, -64, -64, 64, -64, 64, 64, -64, -64, -64, -64, -64, -64, -64, 64, -64, 64, 64, -64, 64, -64, 64, -64, 64, 64, 64, 64, -64, -64, -64, -64, -64, 64, 64, 64, -64, 64, -64, -64, -64, 64, 64, 64, 64, 64, -64, -64, -64, -64, 64, -64, -64, -64, -64, -64, -64, -64, -64, -64, -64, 64, -64, -64, -64, -64, 64, 64, -64, 64, -64, -64, -64, -64, -64, -64, -64, 64, -64, -64, 64, -64, -64, -64, -64, -64, -64, -64, -64, -64, -64, -64, 64, 64, -64, -64, -64, -64, -64, 64, -64, -64, -64, -64, 64, 64, -64, 64, -64, -64, -64, -64, -64, 64, 64, -64, -64, -64, -64, -64, -64, -64, -64, 64, 64, 64, -64, 64, -64, -64, -64, -64, -64, -64, -64, 64, 64, -64, -64, -64, 64, -64, 64, -64, -64, -64, -64, -64, -64, -64, -64, 64, 64, 64, -64, 64, -64, -64, -64, 64, 64, -64, -64, -64, -64, -64, -64, 64, 64, 64, 64, -64, -64, -64, -64, -64, -64, 64, 64, 64, 64, 64, -64, -64, -64, -64, -64, -64, 64, -64, -64, 64, -64, -64, -64, 64, 64, 64, 64, 64, -64, 64, -64, -64, -64, 64, -64, 64, -64, 64, -64, 64, -64, -64, -64, -64, -64, -64, -64, -64, -64, -64, -64, 64, 64, 64, -64, -64, -64, -64, -64, -64, -64, 64, 64, 64, -64, 64, -64, -64, 64, -64, -64, -64, -64, -64, 64, -64, -64, -64, 64, -64, -64, 64, 64, -64, -64, -64, 64, -64, 64, 64, 64, -64, 64, 64, 64, -64, 64, 64, -64, -64, -64, -64, -64, -64, -64, -64, -64, -64, 64, -64, -64, -64, -64, -64, -64, 64, 64, -64, -64, 64, 64, -64, -64, 64, -64, -64, -64, -64, 64, -64, -64, 64, -64, 64, 64, -64, -64, -64, -64, -64, 64, -64, -64, -64, 64, -64, 64, -64, -64, 64, 64, -64, 64, -64, -64, -64, -64, -64, -64, -64, 64, 64, -64, 64, -64, 64, -64, -64, -64, -64, 64, -64, 64, 64, 64, 64, -64, -64, -64, 64, -64, -64, 64, 64, -64, -64, 64, -64, 64, 64, -64, -64, -64, 64, -64, 64, -64, -64, -64, -64, 64, 64, 64, -64, -64, -64, -64, 64, -64, -64, -64, -64, -64, -64, -64, 64, 64, 64, -64, 64, -64, -64, 64, -64, -64, 64, 64, -64, -64, 64, 64, -64, 64, 64, 64, -64, -64, 64, -64, -64, -64, -64, -64, 64, 64, 64, -64, -64, -64, -64, 64, -64, -64, -64, -64, -64, 64, -64, -64, -64, 64, -64, -64, -64, -64, -64, -64, -64, 64, 64, -64, 64, 64, -64, -64, -64, -64, -64, 64, -64, -64, -64, -64, -64, -64, 64, 64, 64, 64, 64, -64, 64, 64, -64, -64, 64, 64, 64, 64, 64, 64, -64, -64, -64, -64, -64, -64, -64, -64, -64, -64, -64, -64, -64, -64, -64, -64, 64, 64, -64, 64, -64, 64, -64, 64, -64, -64, -64, -64, -64, -64, -64, -64, -64, 64, 64, -64, -64, -64, -64, 64, 64, 64, -64, 64, 64, 64, -64, -64, -64, 64, 64, 64, 64, 64, -64, -64, 64, 64, 64, 64, 64, 64, 64, 64, 64, 64, -64, -64, 64, -64, -64, 64, -64, -64, 64, 64, -64, -64, -64, -64, -64, 64, -64, -64, -64, 64, 64, 64, 64, -64, -64, 64, 64, -64, 64, -64, -64, -64, -64, -64, -64, -64, 64, 64, 64, 64, 64, 64, -64, 64, -64, 64, 64, -64, 64, 64, 64, 64, 64, 64, 64, -64, 64, -64, -64, 64, -64, 64, 64, 64, -64, 64, 64, -64, 64, 64, -64, 64, -64, -64, -64, 64, -64, -64, 64, 64, -64, -64, 64, -64, -64, -64, 64, -64, 64, 64, -64, 64, -64, 64, -64, 64, -64, 64, 64, 64, 64, 64, -64, 64, -64, -64, 64, 64, 64, 64, -64, -64, 64, -64, 64, 64, 64, -64, -64, 64, 64, 64, 64, 64, 64, 64, -64, 64, -64, 64, -64, -64, -64, -64, -64, 64, -64, 64, 64, 64, -64, -64, -64, -64, -64, -64, 64, 64, 64, 64, -64, 64, -64, 64, -64, 64, -64, -64, -64, -64, -64, 64, 64, 64, 64, 64, -64, 64, 64, -64, -64, 64, 64, -64, 64, -64, 64, 64, 64, 64, 64, -64, -64, -64, -64, -64, -64, -64, -64, -64, 64, -64, -64, 64, 64, -64, -64, 64, 64, -64, -64, 64, -64, 64, 64, 64, 64, -64, -64, -64, -64, -64, -64, 64, -64, -64, -64, -64, -64, 64, 64, 64, 64, 64, 64, 64, 64, 64, -64, -64, 64, 64, 64, -64, 64, -64, -64, 64, 64, 64, -64, -64, -64, -64, -64, -64, -64, 64, 64, 64, 64, 64, 64, 64, 64, -64, 64, -64, 64, 64, -64, -64, -64, -64, -64, -64, -64, -64, -64, -64, -64, -64, -64, -64, -64, 64, 64, 64, 64, 64, 64, 64, 64, 64, -64, -64, 64, -64, -64, -64, -64, -64, -64, -64, -64, -64, -64, -64, 64, -64, -64, 64, -64, -64, 64, 64, 64, 64, 64, 64, 64, -64, -64, 64, 64, -64, -64, -64, -64, -64, -64, -64, -64, -64, -64, 64, 64, 64, 64, 64, -64, -64, 64, 64, 64, -64, 64, 64, 64, 64, -64, 64, -64, 64, -64, -64, -64, -64, -64, -64, -64, 64, 64, 64, 64, 64, 64, -64, -64, -64, -64, -64, 64, -64, -64, 64, 64, 64, -64, -64, 64, 64, -64, -64, -64, -64, -64, -64, 64, 64, 64, 64, 64, 64, -64, -64, -64, -64, -64, -64, -64, -64, -64, 64, 64, -64, 64, -64, 64, 64, -64, -64, -64, -64, -64, -64, 64, 64, 64, 64, -64, -64, -64, -64, 64, -64, -64, -64, -64, 64, -64, 64, 64, 64, -64, 64, 64, -64, 64, -64, -64, -64, -64, -64, -64, -64, -64, 64, 64, -64, -64, -64, -64, 64, -64, 64, 64, -64, -64, 64, 64, 64, 64, 64, -64, -64, 64, -64, -64, -64, -64, -64, -64, -64, 64, -64, 64, -64, 64, -64, -64, -64, -64, -64, -64, -64, -64, 64, -64, 64, 64, -64, 64, -64, -64, -64, -64, -64, -64, -64, -64, -64, 64, 64, -64, 64, 64, 64, -64, -64, -64, -64, -64, -64, -64, 64, -64, -64, -64, 64, 64, -64, 64, -64, -64, -64, 64, 64, 64, 64, 64, 64, 64, 64, -64, -64, -64, -64, -64, -64, -64, -64, -64, 64, 64, 64, -64, 64, 64, -64, -64, -64, -64, 64, -64, -64, -64, -64, 64, 64, 64, 64, 64, -64, -64, -64, -64, -64, -64, -64, -64, -64, 64, -64, -64, -64, 64, 64, -64, 64, 64, 64, 64, 64, -64, 64, 64, 64, 64, 64, 64, -64, -64, -64, -64, -64, -64, -64, -64, 64, -64, 64, 64, -64, -64, 64, -64, 64, 64, 64, 64, -64, 64, 64, 64, 64, -64, 64, -64, -64, 64, -64, -64, -64, -64, 64, -64, 64, -64, -64, 64, -64, -64, 64, -64, -64, 64, 64, 64, -64, -64, -64, 64, 64, 64, 64, 64, -64, 64, -64, 64, 64, 64, 64, -64, 64, -64, 64, -64, 64, -64, -64, -64, 64, 64, 64, -64, -64, -64, -64, -64, -64, -64, -64, -64, 64, 64, -64, 64, 64, -64, 64, 64, 64, -64, 64, 64, 64, 64, 64, 64, 64, 64, 64, 64, -64, -64, -64, -64, -64, 64, 64, -64, -64, 64, 64, -64, -64, -64, 64, 64, 64, -64, 64, -64, -64, 64, 64, 64, 64, 64, 64, 64, 64, -64, -64, -64, 64, -64, -64, -64, -64, -64, -64, -64, -64, 64, 64, 64, 64, 64, -64, -64, 64, -64, -64, -64, -64, 64, 64, 64, 64, 64, -64, -64, 64, 64, -64, -64, -64, -64, -64, -64, -64, 64, 64, 64, -64, 64, 64, -64, -64, 64, -64, -64, -64, -64, 64, -64, -64, 64, -64, -64, -64, -64, 64, -64, -64, -64, 64, 64, -64, -64, 64, -64, -64, -64, 64, -64, -64, 64, -64, 64, 64, -64, 64, -64, -64, -64, -64, -64, -64, 64, 64, -64, -64, 64, -64, -64, -64, 64, -64, 64, -64, -64, -64, 64, -64, 64, -64, -64, -64, -64, 64, 64, -64, -64, -64, -64, -64, -64, -64, -64, -64, -64, -64, -64, 64, -64, 64, -64, -64, 64, 64, 64, -64, -64, -64, -64, 64, 64, 64, 64, -64, 64, 64, -64, -64, -64, -64, 64, -64, -64, 64, -64, 64, 64, -64, 64, 64, -64, 64, 64, 64, -64, -64, -64, 64, 64, -64, 64, -64, 64, -64, -64, -64, 64, 64, 64, -64, 64, -64, -64, 64, -64, 64, -64, 64, -64, -64, -64, 64, 64, -64, 64, -64, -64, -64, 64, 64, 64, 64, 64, 64, 64, -64, -64, 64, -64, -64, 64, 64, -64, 64, 64, -64, 64, 64, 64, 64, 64, -64, -64, 64, -64, 64, -64, 64, 64, 64, 64, 64, 64, 64, 64, -64, -64, 64, 64, 64, 64, 64, 64, 64, 64, -64, 64, 64, -64, 64, -64, -64, -64, -64, -64, -64, 64, 64, 64, -64, 64, 64, 64, 64, -64, 64, 64, 64, -64, -64, -64, 64, -64, 64, -64, -64, 64, -64, -64, 64, 64, -64, 64, 64, 64, 64, 64, -64, -64, -64, -64, -64, -64, -64, -64, -64, -64, 64, -64, 64, 64, -64, 64, 64, 64, -64, 64, 64, -64, 64, 64, -64, -64, -64, 64, -64, -64, -64, 64, -64, -64, 64, -64, -64, 64, -64, -64, -64, -64, -64, 64, 64, 64, 64, -64, 64, 64, 64, -64, 64, -64, -64, -64, 64, 64, 64, 64, -64, -64, -64, -64, -64, -64, -64, -64, -64, 64, -64, -64, -64, 64, -64, 64, 64, 64, 64, -64, 64, -64, -64, -64, 64, 64, 64, 64, 64, 64, -64, 64, 64, -64, -64, 64, -64, -64, 64, 64, 64, 64, 64, -64, -64, -64, 64, -64, -64, -64, -64, 64, 64, -64, 64, 64, 64, -64, -64, 64, -64, -64, 64, -64, -64, -64, -64, 64, 64, 64, 64, 64, -64, -64, -64, -64, 64, -64, 64, 64, 64, 64, -64, 64, -64, -64, -64, 64, -64, -64, -64, -64, -64, -64, -64, -64, -64, 64, -64, -64, -64, 64, 64, -64, -64, -64, -64, -64, 64, 64, 64, 64, -64, -64, -64, -64, -64, -64, -64, -64, -64, -64, -64, 64, 64, -64, 64, -64, -64, 64, -64, 64, -64, -64, -64, -64, 64, -64, 64, 64, 64, 64, -64, 64, 64, 64, -64, 64, 64, -64, -64, -64, 64, 64, -64, -64, 64, -64, 64, 64, -64, -64, -64, -64, -64, -64, 64, 64, -64, 64, 64, 64, 64, -64, 64, -64, 64, -64, 64, -64, -64, -64, -64, 64, 64, -64, 64, -64, -64, -64, -64, -64, -64, -64, 64, 64, -64, -64, -64, -64, 64, -64, -64, 64, -64, 64, 64, -64, -64, 64, -64, 64, -64, -64, -64, -64, 64, -64, -64, -64, -64, 64, -64, 64, -64, -64, -64, -64, 64, 64, 64, -64, 64, 64, -64, -64, -64, -64, 64, -64, -64, -64, -64, 64, -64, -64, 64, -64, -64, -64, -64, 64, -64, -64, 64, -64, -64, -64, -64, -64, 64, -64, -64, 64, -64, 64, -64, 64, 64, -64, -64, 64, -64, -64, -64, 64, 64, -64, 64, -64, -64, 64, -64, -64, -64, 64, 64, 64, -64, 64, 64, 64, -64, 64, 64, 64, -64, -64, 64, 64, 64, -64, 64, -64, -64, -64, -64, -64, -64, 64, -64, 64, -64, -64, -64, 64, 64, 64, 64, 64, 64, 64, 64, 64, 64, -64, 64, -64, -64, -64, -64, -64, -64, -64, 64, -64, -64, -64, -64, -64, -64, -64, 64, 64, -64, 64, 64, 64, 64, -64, 64, 64, 64, 64, -64, -64, -64, -64, -64, -64, -64, -64, 64, -64, -64, 64, -64, 64, -64, 64, 64, -64, 64, 64, -64, 64, 64, 64, 64, 64, 64, -64, -64, -64, -64, -64, -64, -64, 64, 64, 64, -64, -64, -64, -64, -64, 64, 64, 64, -64, -64, -64, 64, -64, 64, -64, 64, -64, -64, 64, 64, -64, -64, -64, 64, 64, -64, -64, -64, -64, -64, 64, 64, 64, 64, -64, -64, 64, 64, 64, 64, -64, -64, -64, 64, -64, 64, 64, 64, 64, 64, -64, 64, 64, -64, 64, 64, -64, 64, 64, -64, 64, -64, -64, -64, -64, 64, 64, -64, 64, -64, -64, 64, 64, 64, 64, -64, -64, -64, -64, 64, 64, -64, 64, 64, -64, -64, -64, -64, -64, 64, -64, 64, 64, 64, -64, 64, 64, -64, -64, -64, 64, 64, -64, -64, -64, -64, -64, 64, -64, -64, 64, -64, -64, -64, 64, 64, 64, 64, 64, -64, 64, 64, -64, 64, -64, 64, -64, -64, -64, -64, 64, 64, 64, 64, -64, -64, -64, -64, 64, 64, 64, -64, 64, -64, 64, -64, 64, -64, 64, 64, 64, 64, -64, -64, 64, 64, -64, -64, -64, -64, -64, -64, 64, 64, -64, 64, 64, 64, 64, 64, -64, 64, -64, -64, -64, 64, 64, -64, 64, -64, 64, -64, 64, 64, -64, -64, 64, 64, -64, 64, -64, -64, 64, 64, -64, 64, 64, -64, -64, 64, -64, -64, 64, 64, 64, -64, -64, -64, 64, -64, -64, 64, -64, 64, -64, -64, 64, 64, -64, -64, -64, 64, 64, 64, -64, 64, -64, 64, -64, -64, 64, 64, -64, 64, 64, 64, -64, 64, 64, 64, 64, 64, -64, 64, 64, -64, 64, 64, 64, 64, 64, 64, -64, -64, -64, -64, -64, -64, 64, 64, 64, 64, -64, -64, -64, 64, -64, -64, -64, -64, -64, 64, 64, 64, 64, 64, -64, 64, 64, -64, 64, 64, -64, 64, -64, 64, -64, -64, 64, 64, -64, 64, -64, 64, -64, -64, -64, -64, 64, 64, 64, 64, 64, 64, -64, -64, -64, 64, 64, 64, -64, -64, -64, -64, -64, 64, -64, 64, -64, -64, 64, -64, 64, 64, 64, -64, -64, -64, 64, -64, -64, 64, 64, 64, 64, -64, -64, 64, 64, 64, -64, -64, -64, -64, -64, -64, 64, 64, -64, 64, 64, 64, -64, 64, 64, 64, 64, 64, -64, -64, -64, -64, -64, 64, -64, -64, -64, 64, 64, -64, -64, -64, -64, -64, 64, -64, 64, 64, 64, 64, -64, -64, 64, -64, 64, -64, -64, -64, -64, -64, 64, -64, -64, -64, -64, -64, 64, -64, -64, 64, -64, 64, -64, -64, -64, 64, 64, 64, 64, -64, 64, -64, -64, -64, -64, -64, -64, 64, 64, -64, -64, -64, 64, -64, -64, 64, 64, -64, -64, 64, 64, 64, -64, 64, 64, -64, 64, 64, -64, 64, -64, -64, -64, 64, 64, -64, -64, 64, -64, -64, -64, -64, 64, -64, -64, 64, 64, 64, 64, -64, 64, -64, 64, 64, -64, 64, 64, 64, -64, -64, -64, -64, -64, -64, -64, -64, 64, 64, 64, 64, -64, -64, -64, -64, 64, 64, 64, -64, -64, 64, 64, -64, -64, 64, -64, 64, -64, -64, -64, -64, -64, -64, -64, -64, -64, -64, -64, -64, 64, 64, -64, 64, -64, 64, 64, -64, 64, -64, 64, -64, 64, -64, 64, -64, -64, -64, -64, 64, -64, -64, 64, -64, 64, -64, 64, -64, -64, 64, 64, -64, -64, -64, 64, 64, 64, 64, 64, -64, -64, 64, -64, 64, -64, 64, -64, -64, -64, -64, -64, -64, -64, -64, -64, -64, -64, -64, 64, -64, -64, -64, -64, 64, 64, 64, -64, -64, 64, -64, -64, -64, 64, -64, 64, -64, 64, -64, -64, -64, -64, 64, -64, 64, -64, -64, -64, -64, -64, 64, -64, 64, 64, -64, -64, -64, -64, 64, -64, 64, 64, -64, 64, 64, -64, -64, -64, -64, -64, -64, 64, -64, 64, -64, -64, -64, 64, 64, -64, -64, 64, -64, 64, -64, -64, -64, 64, 64, 64, -64, 64, -64, 64, -64, -64, -64, 64, 64, 64, 64, -64, -64, 64, 64, 64, 64, -64, -64, -64, 64, -64, -64, 64, -64, 64, -64, -64, -64, -64, -64, 64, -64, -64, -64, -64, -64, -64, 64, 64, 64, -64, 64, 64, 64, -64, 64, 64, 64, -64, 64, 64, -64, -64, 64, 64, 64, 64, 64, -64, -64, -64, -64, 64, 64, 64, -64, 64, -64, -64, 64, -64, 64, -64, 64, -64, -64, -64, 64, -64, -64, -64, -64, 64, -64, -64, -64, 64, 64, -64, -64, -64, -64, 64, 64, -64, -64, 64, 64, 64, -64, 64, 64, -64, -64, -64, 64, 64, -64, -64, -64, -64, -64, -64, 64, -64, 64, 64, 64, -64, 64, 64, 64, 64, -64, 64, 64, 64, -64, -64, -64, -64, -64, 64, 64, 64, -64, -64, 64, 64, -64, 64, -64, -64, -64, -64, 64, -64, -64, -64, 64, 64, -64, -64, -64, -64, -64, -64, 64, 64, -64, 64, 64, 64, -64, -64, -64, 64, -64, 64, 64, -64, -64, 64, 64, -64, -64, -64, -64, -64, 64, -64, -64, 64, 64, 64, 64, 64, -64, 64, -64, -64, 64, -64, -64, 64, 64, 64, 64, -64, 64, -64, -64, -64, -64, -64, -64, -64, -64, -64, 64, 64, 64, -64, 64, 64, -64, -64, -64, -64, 64, -64, -64, 64, -64, -64, -64, 64, -64, 64, 64, -64, -64, 64, -64, 64, 64, -64, -64, 64, 64, 64, -64, 64, 64, -64, -64, -64, 64, -64, -64, 64, -64, -64, -64, -64, -64, -64, 64, -64, -64, -64, 64, 64, -64, -64, 64, 64, -64, 64, 64, 64, -64, -64, -64, -64, -64, 64, -64, -64, 64, -64, -64, -64, -64, 64, -64, 64, -64, -64, -64, 64, 64, 64, -64, -64, -64, 64, -64, -64, -64, -64, 64, 64, -64, 64, -64, -64, -64, 64, 64, -64, -64, -64, -64, 64, -64, -64, -64, -64, -64, -64, 64, -64, 64, -64, -64, -64, 64, -64, 64, -64, -64, -64, -64, 64, -64, -64, 64, 64, 64, -64, -64, -64, -64, -64, -64, 64, 64, 64, -64, -64, -64, 64, -64, -64, 64, 64, 64, 64, 64, -64, 64, -64, 64, -64, -64, -64, -64, 64, -64, 64, -64, 64, 64, -64, -64, -64, 64, -64, -64, -64, 64, 64, 64, -64, 64, 64, 64, 64, 64, -64, -64, 64, -64, 64, -64, -64, -64, -64, -64, -64, 64, 64, -64, -64, 64, -64, -64, -64, 64, 64, 64, -64, 64, -64, -64, -64, 64, -64, -64, 64, -64, -64, -64, -64, 64, -64, -64, 64, 64, 64, 64, 64, 64, -64, -64, -64, -64, -64, -64, -64, 64, 64, -64, 64, 64, 64, 64, -64, -64, -64, -64, -64, -64, -64, -64, 64, 64, 64, 64, -64, -64, -64, -64, -64, -64, 64, -64, -64, -64, -64, 64, 64, 64, -64, -64, -64, -64, -64, -64, -64, -64, -64, 64, 64, 64, 64, 64, -64, -64, -64, -64, -64, 64, -64, 64, 64, 64, 64, -64, 64, -64, -64, -64, 64, -64, -64, -64, -64, -64, 64, 64, 64, 64, 64, 64, 64, 64, 64, 64, 64, -64, 64, 64, 64, 64, -64, 64, 64, -64, -64, -64, -64, -64, -64, -64, -64, 64, 64, 64, 64, -64, 64, 64, 64, 64, 64, -64, -64, -64, 64, -64, -64, 64, -64, -64, -64, -64, 64, -64, -64, -64, -64, -64, 64, 64, 64, 64, 64, 64, 64, -64, -64, -64, -64, -64, -64, 64, 64, 64, -64, -64, 64, -64, -64, -64, 64, -64, -64, -64, -64, -64, -64, 64, -64, -64, -64, -64, -64, -64, -64, -64, 64, -64, -64, -64, -64, 64, -64, 64, -64, 64, 64, -64, -64, -64, -64, -64, -64, -64, -64, -64, -64, -64, -64, -64, -64, -64, -64, 64, -64, -64, -64, -64, -64, -64, 64, -64, 64, 64, -64, -64, -64, 64, -64, -64, -64, 64, 64, 64, 64, -64, -64, -64, -64, -64, 64, 64, -64, -64, -64, -64, 64, -64, 64, -64, 64, 64, 64, -64, -64, -64, -64, -64, -64, -64, 64, 64, -64, -64, -64, -64, 64, -64, -64, -64, 64, 64, 64, -64, -64, 64, -64, 64, -64, 64, 64, -64, -64, -64, -64, -64, 64, 64, 64, 64, -64, -64, -64, -64, 64, -64, -64, 64, 64, -64, -64, -64, 64, -64, -64, 64, 64, 64, 64, 64, 64, -64, -64, -64, 64, 64, 64, -64, -64, -64, -64, -64, -64, -64, -64, -64, -64, -64, -64, -64, -64, 64, 64, 64, -64, 64, 64, 64, -64, -64, -64, 64, -64, 64, -64, -64, -64, -64, 64, -64, -64, -64, -64, -64, -64, -64, -64, 64, 64, -64, 64, 64, -64, -64, 64, 64, 64, -64, -64, 64, 64, 64, -64, -64, -64, -64, -64, 64, -64, -64, -64, -64, -64, -64, -64, -64, -64, -64, -64, -64, 64, -64, -64, 64, -64, -64, -64, 64, 64, -64, -64, -64, 64, -64, -64, 64, 64, -64, -64, -64, -64, -64, 64, -64, -64, -64, -64, -64, -64, -64, 64, -64, -64, -64, -64, 64, -64, -64, 64, -64, -64, -64, -64, 64, -64, -64, -64, 64, -64, 64, -64, 64, -64, -64, 64, 64, -64, -64, -64, 64, -64, 64, 64, 64, 64, 64, -64, -64, -64, -64, 64, -64, 64, -64, -64, -64, 64, 64, -64, 64, -64, 64, 64, 64, -64, -64, -64, -64, 64, -64, 64, 64, 64, 64, -64, -64, -64, -64, -64, 64, 64, -64, -64, -64, 64, 64, 64, -64, -64, 64, 64, -64, -64, -64, -64, -64, -64, -64, 64, 64, 64, 64, 64, -64, 64, -64, -64, 64, -64, -64, -64, -64, -64, 64, -64, 64, 64, -64, 64, -64, 64, -64, -64, -64, -64, -64, 64, -64, -64, -64, 64, 64, -64, -64, 64, 64, 64, -64, -64, -64, 64, 64, 64, -64, -64, -64, -64, -64, -64, -64, -64, -64, -64, -64, -64, -64, 64, 64, 64, 64, 64, -64, -64, -64, -64, -64, 64, 64, 64, 64, -64, -64, 64, 64, 64, 64, 64, -64, 64, 64, -64, 64, -64, -64, 64, 64, -64, -64, -64, -64, 64, -64, -64, -64, -64, 64, 64, 64, 64, -64, 64, 64, 64, -64, 64, -64, -64, -64, -64, -64, -64, -64, -64, -64, -64, -64, -64, -64, -64, 64, -64, 64, -64, 64, -64, 64, -64, -64, 64, -64, -64, 64, -64, -64, -64, 64, 64, -64, -64, 64, -64, 64, -64, -64, -64, -64, -64, 64, 64, -64, 64, 64, -64, -64, -64, 64, -64, 64, 64, 64, 64, 64, -64, 64, 64, 64, 64, -64, 64, -64, -64, -64, -64, 64, 64, 64, -64, 64, 64, -64, 64, 64, 64, -64, -64, -64, -64, -64, 64, 64, -64, 64, -64, -64, 64, -64, 64, 64, -64, -64, 64, -64, -64, -64, 64, -64, 64, 64, 64, 64, -64, -64, 64, 64, -64, -64, -64, 64, -64, 64, -64, 64, 64, -64, 64, 64, 64, -64, -64, 64, -64, -64, 64, 64, -64, -64, 64, 64, 64, 64, 64, 64, -64, 64, -64, 64, -64, 64, -64, -64, 64, -64, 64, 64, 64, -64, 64, 64, 64, -64, -64, 64, -64, -64, 64, -64, 64, -64, 64, -64, 64, -64, 64, -64, -64, -64, -64, 64, 64, 64, 64, 64, -64, -64, -64, 64, -64, 64, 64, 64, 64, -64, 64, 64, -64, -64, 64, 64, -64, -64, -64, -64, 64, 64, 64, 64, 64, 64, -64, -64, -64, -64, -64, -64, -64, 64, 64, 64, -64, -64, -64, 64, 64, 64, -64, 64, 64, 64, -64, 64, 64, 64, 64, 64, -64, -64, 64, 64, -64, -64, -64, -64, -64, -64, -64, -64, -64, -64, -64, -64, 64, 64, 64, 64, 64, 64, 64, 64, 64, 64, -64, 64, 64, -64, -64, -64, -64, -64, -64, -64, 64, -64, 64, 64, -64, -64, -64, -64, 64, 64, 64, -64, -64, -64, 64, 64, 64, 64, 64, -64, 64, -64, 64, -64, -64, -64, 64, 64, 64, 64, 64, 64, -64, -64, -64, -64, -64, 64, 64, -64, -64, -64, 64, -64, 64, 64, -64, -64, -64, 64, -64, -64, -64, -64, 64, 64, 64, 64, 64, 64, 64, 64, 64, 64, 64, 64, 64, 64, 64, -64, 64, 64, 64, -64, -64, -64, 64, -64, -64, -64, -64, 64, 64, 64, 64, 64, 64, -64, 64, 64, 64, 64, 64, 64, 64, 64, -64, 64, 64, 64, -64, -64, -64, -64, 64, -64, 64, -64, -64, 64, 64, 64, 64, 64, 64, 64, 64, 64, 64, 64, 64, 64, -64, 64, 64, -64, -64, -64, -64, -64, -64, 64, -64, 64, -64, -64, 64, 64, 64, 64, 64, 64, -64, 64, 64, 64, 64, 64, -64, 64, 64, 64, 64, -64, 64, -64, -64, -64, -64, 64, -64, -64, -64, -64, 64, 64, 64, 64, 64, 64, 64, 64, 64, 64, 64, 64, 64, 64, 64, -64, 64, 64, 64, 64, -64, -64, -64, 64, 64, 64, -64, -64, 64, 64, 64, 64, 64, -64, -64, -64, 64, 64, 64, 64, -64, -64, -64, 64, -64, 64, 64, -64, -64, -64, -64, 64, -64, -64, -64, 64, 64, 64, 64, 64, 64, -64, -64, -64, 64, 64, 64, 64, 64, -64, 64, -64, 64, -64, 64, 64, 64, 64, -64, 64, 64, 64, 64, 64, 64, 64, 64, 64, -64, -64, -64, -64, -64, -64, -64, -64, -64, 64, -64, 64, -64, -64, 64, -64, 64, -64, 64, -64, -64, 64, 64, 64, 64, -64, 64, -64, -64, -64, -64, -64, -64, -64, -64, -64, -64, -64, -64, 64, 64, -64, 64, -64, 64, 64, -64, -64, -64, 64, 64, 64, 64, -64, -64, -64, -64, -64, -64, 64, -64, 64, -64, 64, 64, -64, 64, 64, 64, 64, 64, 64, -64, 64, -64, -64, 64, -64, 64, 64, 64, -64, -64, -64, -64, -64, -64, 64, -64, -64, -64, -64, 64, 64, -64, 64, 64, -64, -64, 64, -64, 64, -64, 64, -64, -64, -64, 64, -64, -64, 64, 64, -64, -64, -64, 64, -64, -64, -64, -64, 64, 64, -64, -64, -64, -64, -64, 64, -64, 64, 64, -64, 64, -64, 64, 64, 64, -64, 64, 64, -64, -64, -64, -64, -64, -64, -64, -64, 64, 64, -64, -64, 64, 64, 64, 64, 64, 64, 64, 64, 64, 64, -64, 64, 64, 64, 64, -64, -64, -64, -64, -64, -64, -64, -64, -64, -64, -64, -64, -64, 64, 64, -64, 64, -64, -64, 64, 64, 64, 64, 64, 64, -64, -64, -64, -64, -64, -64, -64, -64, -64, -64, -64, -64, -64, -64, -64, 64, 64, -64, -64, 64, 64, -64, 64, 64, 64, -64, -64, 64, -64, -64, -64, -64, -64, -64, -64, 64, -64, -64, -64, -64, -64, -64, -64, -64, 64, 64, 64, 64, -64, 64, 64, 64, 64, -64, 64, 64, -64, -64, -64, -64, -64, -64, -64, -64, -64, 64, -64, -64, -64, 64, 64, -64, -64, -64, 64, 64, 64, 64, 64, 64, 64, 64, 64, 64, 64, 64, 64, 64, 64, 64, -64, -64, 64, -64, -64, -64, -64, -64, 64, 64, -64, -64, -64, 64, 64, -64, 64, 64, 64, 64, 64, 64, 64, 64, 64, 64, 64, -64, -64, -64, 64, 64, -64, -64, -64, 64, 64, -64, -64, -64, 64, 64, 64, -64, 64, 64, 64, 64, 64, 64, 64, 64, 64, 64, 64, -64, 64, 64, 64, 64, 64, -64, -64, 64, 64, -64, -64, -64, -64, 64, 64, 64, 64, 64, 64, 64, 64, -64, 64, 64, -64, 64, 64, 64, 64, 64, -64, -64, 64, 64, 64, -64, 64, -64, -64, -64, -64, -64, 64, 64, 64, -64, -64, -64, -64, 64, -64, 64, -64, -64, -64, -64, -64, 64, -64, 64, -64, -64, -64, -64, 64, 64, 64, 64, -64, -64, 64, -64, -64, 64, 64, -64, 64, -64, -64, -64, -64, -64, -64, 64, -64, -64, 64, -64, 64, 64, -64, 64, -64, 64, 64, 64, -64, -64, -64, 64, -64, -64, -64, -64, 64, -64, 64, 64, -64, -64, -64, -64, -64, -64, 64, -64, -64, -64, 64, -64, 64, 64, -64, -64, -64, 64, 64, 64, 64, 64, -64, -64, -64, -64, -64, -64, -64, -64, -64, -64, -64, -64, -64, -64, -64, -64, -64, -64, 64, -64, 64, -64, -64, 64, 64, 64, -64, 64, 64, 64, 64, -64, 64, -64, 64, 64, -64, -64, -64, -64, -64, -64, 64, 64, -64, -64, -64, 64, -64, 64, 64, -64, 64, 64, 64, 64, -64, 64, 64, -64, -64, 64, -64, -64, -64, -64, -64, -64, -64, -64, -64, -64, -64, -64, -64, 64, -64, 64, -64, 64, 64, 64, 64, 64, 64, 64, 64, -64, 64, 64, -64, -64, -64, -64, -64, -64, -64, -64, 64, 64, 64, 64, -64, 64, 64, 64, 64, 64, 64, 64, 64, 64, 64, 64, 64, -64, 64, 64, 64, -64, -64, 64, 64, 64, -64, -64, 64, 64, 64, 64, -64, -64, 64, 64, 64, 64, 64, 64, 64, 64, 64, 64, 64, 64, -64, -64, -64, -64, -64, 64, 64, 64, -64, 64, 64, 64, 64, 64, 64, 64, -64, -64, 64, 64, -64, 64, -64, 64, 64, 64, -64, 64, -64, -64, -64, -64, -64, 64, 64, 64, -64, 64, 64, 64, 64, 64, -64, 64, 64, 64, 64, 64, 64, 64, 64, 64, 64, 64, 64, 64, -64, -64, -64, -64, -64, 64, 64, 64, -64, 64, 64, -64, -64, 64, -64, -64, -64, 64, -64, -64, 64, 64, 64, 64, 64, 64, -64, 64, -64, -64, -64, -64, -64, 64, 64, 64, -64, 64, -64, -64, 64, -64, -64, 64, -64, 64, -64, 64, -64, -64, 64, 64, 64, -64, 64, 64, 64, -64, -64, -64, -64, 64, 64, 64, 64, -64, -64, -64, -64, 64, -64, -64, 64, -64, -64, -64, 64, 64, 64, 64, 64, -64, 64, 64, -64, -64, -64, -64, 64, 64, 64, -64, 64, 64, -64, -64, -64, -64, 64, -64, -64, 64, 64, 64, -64, -64, 64, 64, -64, -64, -64, -64, -64, -64, -64, -64, -64, 64, -64, 64, -64, 64, -64, -64, -64, -64, 64, 64, -64, 64, 64, -64, 64, -64, -64, -64, 64, -64, -64, -64, -64, -64, -64, -64, -64, -64, 64, 64, 64, -64, -64, -64, -64, -64, -64, -64, -64, -64, -64, 64, -64, -64, -64, 64, -64, -64, -64, -64, -64, -64, -64, -64, 64, 64, 64, 64, 64, 64, -64, -64, 64, 64, -64, -64, 64, 64, -64, -64, -64, -64, -64, -64, -64, -64, 64, -64, -64, -64, -64, -64, -64, 64, 64, 64, 64, -64, -64, 64, 64, 64, 64, -64, 64, 64, -64, -64, -64, -64, -64, -64, 64, 64, 64, -64, -64, -64, 64, 64, -64, 64, 64, 64, -64, -64, 64, 64, 64, 64, -64, -64, -64, -64, -64, -64, 64, -64, -64, 64, 64, 64, -64, -64, -64, -64, 64, -64, -64, 64, -64, 64, 64, -64, -64, -64, 64, 64, -64, -64, -64, -64, 64, 64, -64, 64, -64, 64, 64, 64, 64, -64, -64, -64, -64, 64, -64, -64, 64, -64, -64, -64, -64, 64, -64, -64, 64, -64, -64, 64, -64, -64, -64, -64, -64, -64, 64, -64, -64, -64, -64, -64, 64, 64, 64, 64, 64, 64, 64, 64, -64, 64, 64, 64, -64, -64, 64, 64, 64, 64, 64, -64, -64, 64, -64, 64, -64, 64, 64, -64, -64, 64, 64, 64, 64, 64, -64, -64, 64, 64, 64, 64, 64, -64, 64, 64, 64, 64, 64, 64, 64, -64, 64, 64, -64, -64, -64, -64, -64, 64, -64, -64, -64, 64, -64, -64, -64, -64, 64, -64, 64, -64, 64, -64, 64, -64, -64, 64, 64, 64, -64, -64, -64, -64, -64, -64, -64, 64, -64, 64, 64, 64, 64, 64, -64, 64, -64, 64, -64, 64, -64, 64, -64, 64, 64, 64, 64, 64, -64, 64, 64, -64, -64, -64, 64, 64, 64, 64, 64, 64, -64, -64, -64, 64, 64, 64, -64, -64, -64, 64, 64, 64, 64, 64, 64, 64, 64, 64, 64, -64, 64, 64, 64, 64, 64, 64, -64, 64, -64, -64, 64, -64, -64, 64, -64, -64, -64, -64, 64, -64, -64, -64, -64, 64, -64, 64, 64, -64, -64, 64, -64, 64, 64, -64, 64, -64, 64, -64, -64, -64, -64, 64, -64, -64, -64, 64, -64, 64, -64, 64, 64, -64, -64, 64, -64, 64, 64, -64, 64, 64, 64, -64, -64, 64, 64, -64, -64, 64, 64, 64, -64, -64, 64, -64, -64, -64, 64, 64, -64, 64, 64, -64, -64, 64, 64, 64, -64, 64, 64, -64, -64, 64, -64, -64, 64, -64, 64, 64, -64, 64, 64, -64, -64, 64, 64, 64, -64, -64, -64, 64, -64, -64, 64, 64, 64, 64, 64, -64, -64, -64, -64, -64, 64, -64, 64, -64, 64, -64, 64, 64, -64, -64, -64, 64, 64, -64, -64, -64, 64, 64, -64, 64, 64, 64, 64, -64, -64, -64, -64, -64, -64, -64, 64, -64, 64, 64, 64, -64, -64, 64, -64, 64, 64, -64, -64, -64, -64, -64, -64, -64, 64, -64, -64, -64, -64, 64, 64, -64, -64, -64, 64, 64, 64, 64, 64, 64, -64, 64, -64, -64, -64, -64, -64, -64, -64, -64, -64, -64, 64, 64, -64, 64, 64, 64, -64, 64, -64, 64, 64, -64, -64, -64, -64, 64, 64, -64, -64, -64, -64, -64, 64, -64, -64, -64, -64, 64, -64, 64, -64, -64, -64, -64, 64, 64, -64, 64, 64, -64, -64, -64, -64, 64, 64, 64, -64, -64, -64, -64, -64, -64, 64, -64, 64, -64, -64, 64, -64, 64, 64, -64, 64, -64, 64, 64, 64, -64, -64, 64, -64, 64, 64, -64, -64, -64, -64, -64, -64, -64, -64, -64, 64, 64, -64, -64, -64, -64, 64, -64, 64, -64, -64, 64, 64, -64, 64, 64, -64, -64, -64, 64, -64, -64, -64, -64, -64, -64, 64, -64, -64, 64, -64, -64, -64, -64, -64, 64, 64, -64, -64, 64, 64, -64, -64, 64, -64, 64, -64, -64, -64, -64, -64, -64, -64, 64, -64, -64, 64, 64, 64, 64, 64, -64, -64, -64, -64, 64, 64, 64, 64, -64, -64, 64, 64, -64, 64, -64, 64, -64, -64, 64, 64, 64, -64, -64, 64, 64, -64, 64, -64, -64, -64, -64, -64, -64, 64, -64, 64, 64, -64, 64, 64, 64, 64, -64, -64, -64, 64, 64, -64, -64, -64, -64, 64, 64, 64, 64, -64, -64, -64, -64, -64, -64, -64, -64, -64, -64, -64, 64, -64, 64, 64, -64, -64, -64, 64, -64, -64, -64, -64, 64, 64, -64, 64, -64, -64, -64, -64, -64, -64, -64, -64, -64, -64, -64, -64, -64, 64, -64, -64, -64, -64, -64, -64, -64, -64, -64, -64, 64, -64, 64, -64, -64, -64, -64, -64, -64, -64, -64, -64, -64, -64, 64, 64, -64, 64, -64, -64, -64, 64, -64, -64, -64, -64, -64, -64, 64, -64, -64, -64, -64, -64, -64, -64, -64, -64, -64, -64, -64, 64, -64, -64, 64, -64, -64, 64, 64, -64, 64, -64, -64, -64, -64, -64, 64, -64, -64, -64, -64, -64, -64, -64, 64, -64, -64, -64, -64, -64, 64, 64, 64, 64, -64, -64, -64, -64, -64, -64, -64, -64, -64, -64, -64, -64, -64, -64, -64, -64, -64, -64, -64, -64, -64, -64, -64, 64, -64, -64, -64, 64, 64, -64, -64, -64, -64, -64, 64, 64, -64, -64, -64, -64, 64, -64, -64, -64, -64, -64, 64, -64, -64, -64, -64, 64, -64, 64, 64, 64, 64, 64, -64, -64, -64, -64, 64, -64, -64, -64, -64, 64, 64, -64, -64, -64, -64, -64, -64, -64, -64, 64, -64, -64, -64, -64, -64, -64, 64, 64, -64, 64, 64, 64, 64, -64, -64, -64, -64, -64, -64, -64, 64, 64, -64, -64, 64, -64, -64, -64, 64, 64, 64, 64, -64, -64, 64, -64, -64, -64, 64, 64, -64, -64, -64, 64, 64, -64, -64, -64, -64, -64, 64, 64, 64, -64, -64, 64, -64, 64, -64, 64, 64, 64, 64, -64, -64, -64, 64, 64, 64, 64, 64, 64, -64, -64, -64, 64, 64, -64, 64, -64, -64, -64, -64, -64, -64, 64, 64, -64, 64, 64, 64, -64, -64, -64, -64, 64, 64, 64, 64, 64, -64, -64, 64, -64, -64, 64, 64, -64, 64, -64, -64, -64, -64, -64, -64, 64, -64, 64, -64, 64, -64, -64, 64, -64, 64, 64, 64, 64, -64, 64, 64, 64, 64, 64, 64, 64, -64, -64, 64, -64, -64, -64, -64, -64, -64, -64, 64, -64, -64, -64, -64, -64, -64, -64, -64, 64, 64, 64, -64, 64, 64, -64, 64, 64, 64, 64, 64, -64, -64, 64, 64, -64, 64, 64, 64, 64, 64, -64, -64, -64, 64, 64, 64, 64, -64, -64, -64, 64, -64, 64, 64, -64, -64, -64, 64, 64, -64, -64, -64, -64, -64, -64, 64, 64, -64, 64, 64, 64, 64, 64, 64, -64, 64, 64, 64, 64, -64, -64, -64, 64, -64, 64, 64, -64, -64, 64, 64, 64, 64, -64, -64, 64, 64, 64, 64, 64, 64, -64, 64, 64, -64, -64, -64, -64, 64, -64, 64, 64, 64, -64, 64, -64, -64, -64, -64, -64, -64, 64, 64, -64, 64, -64, 64, -64, 64, 64, -64, -64, -64, -64, 64, 64, 64, -64, 64, -64, -64, -64, -64, 64, -64, 64, -64, -64, 64, 64, -64, -64, 64, -64, -64, 64, 64, 64, 64, 64, 64, -64, -64, -64, 64, 64, -64, -64, 64, -64, 64, 64, -64, -64, -64, 64, 64, 64, 64, -64, 64, 64, -64, -64, 64, -64, -64, 64, 64, 64, 64, -64, -64, 64, 64, 64, -64, -64, 64, -64, -64, 64, -64, 64, 64, 64, 64, -64, 64, 64, 64, 64, 64, 64, 64, -64, 64, 64, 64, 64, 64, -64, 64, -64, 64, -64, 64, -64, -64, 64, -64, 64, -64, -64, -64, 64, -64, 64, 64, 64, 64, 64, 64, 64, 64, 64, -64, 64, 64, 64, -64, 64, 64, 64, 64, -64, 64, -64, 64, 64, -64, 64, -64, 64, 64, 64, 64, 64, 64, 64, 64, 64, 64, 64, 64, 64, 64, 64, 64, 64, 64, 64, 64, -64, 64, 64, -64, -64, 64, 64, -64, 64, 64, 64, 64, -64, 64, 64, 64, 64, 64, 64, 64, 64, 64, 64, 64, 64, 64, -64, -64, -64, 64, 64, 64, -64, -64, -64, -64, 64, 64, 64, 64, 64, 64, 64, 64, 64, 64, 64, -64, 64, 64, 64, 64, 64, 64, -64, 64, -64, -64, 64, 64, -64, 64, -64, 64, -64, 64, 64, 64, 64, 64, 64, -64, -64, -64, -64, -64, 64, -64, -64, -64, 64, -64, 64, 64, 64, -64, -64, -64, 64, 64, 64, 64, 64, -64, -64, -64, -64, 64, -64, -64, -64, -64, -64, -64, -64, -64, 64, 64, -64, 64, -64, -64, -64, -64, -64, 64, 64, -64, 64, 64, 64, 64, 64, -64, -64, -64, 64, -64, -64, -64, -64, -64, 64, 64, 64, 64, 64, 64, -64, -64, -64, -64, -64, 64, 64, -64, -64, 64, -64, -64, -64, -64, -64, -64, -64, -64, -64, -64, 64, 64, 64, 64, 64, 64, 64, 64, -64, -64, -64, -64, -64, 64, -64, 64, 64, 64, -64, -64, -64, -64, -64, -64, -64, 64, 64, 64, 64, 64, 64, -64, 64, 64, 64, -64, -64, -64, -64, -64, -64, 64, 64, -64, -64, -64, -64, 64, -64, -64, -64, -64, 64, -64, 64, 64, 64, -64, -64, 64, 64, 64, 64, -64, -64, -64, -64, 64, 64, 64, -64, 64, -64, 64, 64, 64, -64, -64, -64, 64, 64, 64, 64, 64, 64, 64, 64, -64, 64, 64, 64, 64, -64, -64, -64, 64, 64, 64, 64, -64, 64, 64, 64, 64, -64, -64, -64, -64, 64, 64, 64, 64, 64, -64, 64, 64, 64, 64, 64, -64, -64, -64, -64, 64, 64, 64, 64, -64, -64, 64, 64, 64, 64, 64, 64, -64, -64, -64, -64, 64, 64, 64, 64, 64, 64, 64, 64, 64, 64, -64, 64, 64, 64, -64, 64, 64, 64, -64, 64, 64, 64, 64, 64, 64, -64, 64, 64, 64, -64, 64, 64, 64, 64, 64, 64, 64, 64, 64, 64, 64, 64, -64, -64, -64, -64, -64, 64, 64, 64, 64, 64, 64, -64, 64, 64, 64, 64, 64, -64, 64, 64, 64, 64, 64, -64, -64, 64, 64, -64, -64, -64, 64, -64, -64, 64, 64, -64, 64, 64, 64, 64, 64, 64, -64, 64, -64, 64, 64, 64, -64, 64, 64, 64, 64, 64, 64, -64, 64, 64, 64, -64, 64, 64, 64, -64, 64, 64, 64, 64, 64, 64, 64, 64, -64, 64, 64, 64, 64, -64, 64, 64, 64, -64, -64, 64, -64, -64, -64, 64, -64, 64, 64, -64, 64, 64, 64, 64, 64, 64, -64, -64, 64, 64, 64, 64, -64, -64, 64, 64, 64, 64, -64, 64, 64, 64, 64, -64, 64, 64, 64, 64, 64, 64, 64, 64, -64, -64, -64, 64, 64, -64, -64, 64, -64, -64, -64, 64, 64, 64, 64, -64, 64, 64, 64, 64, -64, -64, -64, 64, 64, 64, 64, 64, -64, 64, -64, -64, 64, 64, -64, 64, 64, -64, -64, -64, 64, -64, -64, 64, -64, -64, -64, -64, -64, 64, 64, 64, 64, 64, 64, 64, -64, 64, 64, 64, 64, -64, -64, -64, 64, -64, 64, -64, -64, -64, -64, -64, -64, 64, 64, -64, 64, 64, 64, 64, 64, 64, 64, 64, -64, -64, 64, 64, 64, 64, -64, -64, 64, -64, 64, -64, 64, -64, 64, 64, 64, -64, -64, 64, 64, 64, 64, -64, 64, 64, 64, 64, -64, 64, -64, 64, -64, 64, -64, 64, -64, 64, 64, 64, -64, -64, 64, -64, -64, -64, -64, -64, 64, -64, 64, 64, 64, 64, 64, 64, -64, -64, 64, 64, -64, 64, -64, -64, 64, 64, 64, -64, -64, -64, -64, 64, 64, 64, 64, -64, -64, 64, 64, 64, 64, -64, 64, 64, 64, 64, 64, 64, 64, 64, -64, 64, 64, 64, 64, -64, -64, 64, -64, 64, 64, -64, 64, 64, 64, -64, -64, 64, -64, 64, -64, -64, -64, 64, 64, 64, 64, 64, -64, 64, 64, 64, 64, 64, -64, -64, -64, -64, -64, 64, -64, -64, -64, 64, 64, 64, 64, 64, 64, -64, 64, 64, 64, 64, -64, -64, -64, -64, -64, 64, -64, -64, 64, 64, 64, -64, 64, -64, 64, -64, -64, 64, 64, 64, 64, -64, 64, 64, 64, 64, 64, 64, 64, -64, -64, -64, -64, -64, -64, 64, 64, 64, 64, 64, -64, 64, -64, 64, 64, -64, 64, -64, -64, -64, -64, -64, 64, 64, 64, 64, 64, -64, -64, -64, -64, -64, -64, 64, 64, 64, 64, 64, 64, 64, -64, 64, -64, -64, 64, -64, -64, -64, -64, 64, 64, 64, 64, 64, 64, 64, 64, 64, -64, -64, 64, -64, 64, 64, -64, 64, 64, 64, 64, -64, -64, -64, -64, -64, -64, -64, 64, 64, 64, 64, 64, 64, 64, 64, 64, 64, -64, -64, -64, -64, 64, 64, -64, -64, -64, 64, -64, 64, -64, -64, -64, -64, 64, 64, 64, 64, 64, 64, 64, 64, 64, 64, 64, -64, -64, -64, -64, 64, -64, 64, -64, -64, 64, -64, 64, 64, 64, 64, 64, 64, 64, 64, -64, -64, 64, 64, 64, 64, 64, 64, -64, -64, -64, -64, -64, 64, 64, 64, 64, -64, 64, -64, -64, 64, 64, -64, 64, 64, 64, 64, 64, 64, 64, 64, 64, 64, 64, 64, -64, -64, -64, 64, 64, 64, 64, 64, 64, -64, -64, -64, 64, -64, -64, -64, 64, -64, -64, -64, 64, 64, 64, 64, 64, 64, -64, -64, -64, -64, 64, 64, 64, 64, 64, 64, 64, -64, -64, -64, 64, -64, 64, 64, 64, 64, -64, 64, 64, 64, 64, 64, -64, -64, 64, -64, -64, -64, -64, 64, 64, 64, 64, 64, -64, -64, -64, -64, -64, 64, -64, 64, 64, -64, -64, 64, 64, -64, -64, -64, -64, 64, 64, 64, -64, -64, -64, -64, 64, 64, 64, 64, 64, -64, 64, 64, 64, 64, -64, -64, -64, -64, 64, -64, -64, -64, -64, -64, -64, -64, 64, 64, -64, -64, 64, -64, -64, 64, 64, -64, 64, 64, -64, -64, 64, 64, 64, -64, -64, -64, -64, -64, -64, -64, -64, -64, -64, -64, -64, 64, -64, -64, 64, -64, -64, 64, -64, 64, -64, 64, -64, -64, 64, -64, -64, -64, 64, -64, -64, -64, -64, -64, 64, -64, -64, -64, 64, -64, 64, -64, -64, -64, -64, -64, -64, 64, 64, -64, -64, -64, 64, -64, 64, -64, -64, -64, -64, -64, -64, 64, -64, 64, -64, -64, -64, 64, -64, -64, -64, -64, -64, -64, 64, 64, 64, 64, -64, 64, 64, -64, -64, -64, -64, -64, -64, -64, -64, 64, -64, 64, -64, 64, -64, -64, 64, -64, -64, 64, -64, 64, -64, 64, -64, -64, 64, -64, 64, 64, 64, -64, -64, -64, -64, -64, -64, 64, -64, 64, 64, 64, -64, -64, 64, 64, 64, 64, -64, -64, -64, -64, -64, -64, 64, -64, 64, 64, -64, -64, -64, -64, -64, -64, -64, 64, 64, 64, 64, 64, 64, 64, 64, 64, -64, 64, -64, 64, -64, -64, -64, -64, -64, -64, -64, -64, -64, -64, -64, 64, 64, 64, 64, 64, 64, 64, 64, 64, 64, 64, 64, -64, 64, 64, -64, -64, -64, -64, -64, -64, -64, 64, -64, 64, -64, -64, 64, 64, 64, 64, 64, 64, 64, 64, 64, 64, 64, 64, 64, 64, 64, -64, 64, 64, 64, 64, 64, 64, 64, 64, -64, 64, -64, 64, 64, 64, 64, 64, 64, 64, 64, 64, 64, 64, 64, 64, 64, -64, -64, -64, -64, 64, 64, 64, 64, 64, 64, 64, 64, -64, 64, -64, 64, 64, 64, 64, 64, 64, 64, 64, 64, -64, 64, 64, -64, -64, -64, 64, -64, -64, 64, 64, 64, -64, 64, 64, -64, 64, 64, 64, -64, 64, 64, 64, 64, 64, 64, 64, 64, 64, 64, -64, 64, 64, 64, 64, -64, 64, 64, -64, -64, -64, -64, 64, 64, -64, -64, 64, 64, 64, 64, -64, 64, 64, 64, 64, 64, 64, 64, 64, 64, 64, 64, 64, 64, 64, 64, -64, -64, -64, -64, 64, 64, -64, 64, -64, 64, 64, 64, -64, -64, 64, 64, 64, 64, 64, 64, -64, -64, 64, -64, 64, 64, 64, 64, -64, 64, -64, 64, -64, 64, 64, 64, 64, -64, -64, -64, 64, -64, -64, 64, -64, 64, -64, 64, -64, -64, 64, -64, -64, -64, -64, -64, -64, 64, -64, -64, 64, -64, 64, -64, 64, 64, -64, -64, -64, -64, 64, 64, 64, 64, -64, 64, 64, 64, -64, 64, -64, -64, -64, -64, -64, -64, 64, -64, -64, 64, -64, -64, 64, 64, -64, 64, -64, 64, -64, 64, -64, -64, -64, -64, -64, -64, -64, -64, -64, -64, -64, 64, -64, 64, 64, -64, -64, 64, -64, 64, -64, -64, -64, -64, -64, -64, -64, -64, -64, -64, 64, 64, -64, 64, -64, -64, -64, -64, -64, 64, 64, 64, -64, 64, -64, -64, -64, -64, -64, -64, -64, 64, -64, -64, -64, -64, -64, -64, -64, -64, -64, -64, -64, -64, 64, 64, 64, -64, 64, -64, -64, -64, 64, 64, 64, 64, -64, -64, -64, -64, -64, -64, -64, -64, -64, -64, 64, 64, -64, 64, 64, 64, -64, 64, 64, -64, -64, 64, 64, -64, -64, -64, 64, 64, -64, -64, -64, -64, -64, -64, -64, -64, -64, -64, -64, -64, -64, 64, 64, 64, 64, 64, 64, 64, -64, -64, -64, 64, 64, 64, -64, -64, -64, -64, -64, -64, -64, -64, -64, -64, -64, 64, -64, -64, -64, 64, 64, 64, 64, 64, -64, -64, -64, -64, -64, -64, -64, 64, 64, -64, -64, -64, -64, -64, -64, -64, -64, -64, -64, -64, -64, -64, 64, 64, 64, 64, 64, 64, -64, -64, -64, -64, -64, -64, 64, -64, 64, -64, 64, -64, -64, -64, -64, -64, -64, -64, -64, -64, -64, -64, -64, -64, 64, 64, 64, -64, -64, -64, -64, -64, -64, -64, 64, 64, 64, 64, 64, -64, -64, -64, -64, 64, -64, -64, 64, -64, 64, -64, -64, -64, 64, 64, 64, -64, -64, -64, -64, 64, -64, -64, -64, -64, 64, 64, -64, -64, -64, -64, -64, -64, 64, -64, -64, -64, -64, -64, -64, -64, -64, -64, -64, -64, -64, -64, -64, -64, -64, 64, -64, -64, -64, -64, -64, -64, -64, 64, -64, 64, 64, -64, 64, -64, -64, -64, -64, -64, -64, -64, 64, -64, -64, -64, 64, 64, 64, 64, -64, -64, -64, 64, -64, -64, -64, -64, 64, 64, 64, 64, 64, 64, -64, -64, -64, -64, -64, 64, -64, -64, -64, -64, 64, 64, 64, 64, 64, 64, -64, 64, -64, -64, 64, 64, 64, 64, 64, 64, 64, 64, -64, -64, -64, -64, -64, -64, -64, -64, -64, 64, 64, 64, -64, 64, 64, 64, -64, -64, -64, 64, 64, 64, -64, 64, 64, 64, 64, -64, -64, -64, -64, -64, 64, 64, -64, 64, 64, 64, -64, 64, 64, 64, 64, 64, 64, -64, 64, 64, 64, 64, 64, 64, 64, 64, -64, -64, -64, -64, -64, 64, -64, -64, 64, -64, -64, -64, 64, 64, -64, 64, 64, 64, -64, -64, -64, 64, 64, 64, 64, 64, 64, 64, -64, -64, -64, -64, -64, 64, 64, 64, 64, 64, -64, 64, 64, 64, 64, 64, 64, -64, 64, -64, -64, 64, 64, 64, 64, 64, 64, 64, -64, -64, -64, -64, -64, 64, 64, -64, -64, 64, -64, 64, 64, 64, 64, 64, -64, -64, -64, -64, 64, 64, 64, 64, 64, 64, -64, 64, -64, -64, -64, 64, 64, 64, 64, 64, -64, -64, -64, -64, 64, 64, 64, 64, 64, 64, -64, -64, 64, 64, 64, 64, 64, -64, -64, -64, -64, -64, -64, -64, 64, 64, 64, -64, -64, 64, -64, 64, 64, -64, 64, 64, 64, -64, 64, 64, 64, 64, 64, 64, 64, -64, -64, -64, -64, 64, 64, -64, -64, 64, -64, -64, -64, -64, -64, 64, 64, 64, 64, 64, 64, -64, -64, -64, -64, 64, 64, 64, 64, 64, 64, 64, 64, -64, 64, -64, -64, 64, 64, -64, 64, 64, -64, -64, -64, -64, 64, 64, -64, 64, 64, -64, -64, 64, 64, 64, -64, -64, -64, -64, -64, -64, -64, -64, 64, -64, 64, -64, 64, -64, -64, -64, -64, -64, 64, -64, 64, 64, 64, -64, 64, 64, -64, -64, -64, -64, -64, 64, -64, -64, -64, -64, -64, 64, -64, -64, -64, -64, -64, -64, -64, -64, 64, -64, -64, -64, -64, -64, -64, -64, -64, -64, -64, -64, -64, -64, -64, -64, -64, -64, -64, -64, -64, -64, -64, -64, -64, -64, -64, -64, 64, -64, -64, -64, 64, 64, 64, 64, -64, 64, -64, -64, -64, 64, -64, -64, -64, -64, 64, -64, -64, -64, -64, -64, -64, 64, 64, -64, -64, -64, 64, -64, -64, 64, 64, 64, -64, -64, -64, -64, -64, -64, 64, 64, -64, 64, 64, 64, -64, -64, 64, -64, 64, 64, 64, 64, -64, 64, 64, 64, -64, 64, -64, 64, 64, 64, 64, 64, 64, 64, 64, 64, -64, 64, 64, -64, -64, -64, -64, -64, 64, 64, 64, 64, -64, 64, -64, 64, -64, -64, 64, -64, 64, -64, -64, 64, -64, 64, -64, -64, -64, -64, -64, 64, -64, -64, -64, -64, 64, 64, 64, -64, 64, -64, -64, -64, 64, 64, 64, 64, 64, -64, 64, -64, -64, -64, -64, -64, -64, 64, 64, -64, -64, -64, -64, -64, -64, -64, -64, -64, -64, 64, 64, -64, -64, 64, -64, -64, -64, 64, 64, 64, -64, -64, -64, -64, -64, -64, -64, -64, -64, -64, -64, 64, -64, -64, -64, -64, -64, 64, 64, 64, -64, 64, 64, 64, -64, 64, 64, 64, 64, 64, -64, -64, -64, -64, -64, -64, 64, -64, -64, 64, -64, -64, -64, -64, -64, -64, -64, 64, 64, 64, -64, -64, -64, 64, -64, 64, -64, -64, -64, -64, -64, -64, -64, -64, 64, -64, -64, -64, -64, -64, -64, -64, -64, -64, 64, 64, -64, 64, -64, -64, -64, -64, -64, 64, 64, -64, -64, -64, -64, -64, -64, -64, 64, -64, 64, 64, 64, -64, -64, 64, 64, 64, -64, 64, -64, -64, -64, -64, -64, -64, 64, -64, -64, -64, 64, 64, -64, 64, -64, 64, 64, -64, 64, -64, 64, 64, 64, 64, 64, -64, -64, 64, 64, -64, -64, -64, -64, -64, -64, -64, -64, 64, 64, 64, 64, -64, 64, -64, 64, 64, 64, 64, 64, 64, 64, 64, 64, -64, -64, 64, -64, -64, 64, -64, -64, -64, -64, -64, 64, 64, 64, 64, 64, 64, 64, 64, 64, 64, 64, 64, -64, -64, 64, 64, 64, -64, -64, -64, -64, -64, 64, -64, -64, -64, 64, 64, 64, 64, 64, 64, -64, -64, 64, 64, 64, 64, 64, 64, 64, 64, -64, 64, 64, 64, 64, 64, -64, 64, -64, -64, -64, 64, 64, 64, 64, -64, 64, -64, -64, -64, -64, 64, 64, 64, -64, -64, -64, 64, 64, 64, 64, 64, -64, 64, -64, 64, 64, -64, 64, 64, 64, 64, -64, -64, -64, -64, -64, 64, 64, 64, 64, -64, -64, -64, -64, -64, -64, 64, 64, -64, 64, 64, -64, 64, 64, -64, 64, 64, 64, 64, 64, -64, -64, -64, -64, -64, 64, 64, 64, -64, 64, -64, -64, -64, -64, 64, 64, -64, 64, 64, 64, 64, 64, 64, 64, 64, 64, 64, 64, 64, -64, -64, -64, -64, -64, 64, 64, -64, -64, -64, -64, -64, -64, 64, -64, -64, -64, -64, 64, -64, -64, 64, 64, 64, 64, 64, 64, 64, -64, -64, -64, 64, -64, -64, 64, 64, 64, -64, -64, -64, 64, -64, -64, 64, 64, 64, -64, -64, -64, -64, 64, 64, -64, 64, -64, -64, -64, 64, 64, 64, 64, -64, 64, -64, 64, -64, -64, -64, 64, -64, -64, 64, 64, 64, 64, 64, 64, -64, -64, 64, 64, 64, 64, 64, -64, 64, 64, 64, 64, 64, 64, 64, 64, 64, 64, -64, 64, -64, -64, 64, -64, -64, 64, -64, 64, -64, 64, 64, 64, 64, 64, 64, 64, 64, 64, 64, 64, 64, 64, 64, 64, 64, 64, 64, -64, 64, 64, -64, -64, -64, 64, -64, 64, -64, -64, -64, -64, -64, -64, -64, 64, -64, -64, -64, 64, 64, 64, 64, 64, -64, -64, -64, 64, 64, 64, 64, -64, 64, -64, 64, -64, 64, -64, -64, -64, -64, -64, -64, -64, -64, -64, 64, 64, 64, -64, 64, -64, -64, -64, -64, 64, 64, -64, -64, 64, -64, -64, 64, 64, -64, -64, -64, -64, -64, -64, -64, -64, -64, -64, -64, -64, -64, -64, -64, -64, -64, -64, -64, -64, -64, -64, -64, 64, 64, -64, -64, -64, -64, -64, -64, -64, -64, -64, -64, -64, -64, -64, -64, -64, -64, 64, -64, 64, 64, -64, -64, 64, 64, -64, 64, -64, 64, -64, -64, -64, 64, -64, 64, 64, 64, -64, -64, -64, -64, -64, -64, -64, -64, -64, 64, 64, 64, 64, 64, 64, 64, -64, -64, 64, 64, 64, -64, 64, -64, 64, 64, 64, -64, 64, 64, -64, 64, 64, -64, -64, -64, 64, 64, 64, 64, 64, 64, 64, 64, 64, 64, 64, 64, -64, 64, 64, 64, 64, 64, 64, 64, 64, 64, 64, 64, 64, 64, 64, -64, -64, 64, 64, 64, -64, -64, 64, -64, -64, -64, 64, -64, 64, -64, 64, -64, 64, -64, 64, 64, -64, 64, 64, -64, 64, 64, 64, -64, 64, 64, 64, 64, -64, 64, 64, -64, 64, 64, 64, 64, -64, 64, -64, 64, -64, -64, -64, 64, 64, 64, -64, -64, 64, 64, -64, -64, -64, -64, 64, 64, -64, 64, -64, -64, 64, -64, -64, -64, 64, 64, -64, 64, 64, 64, -64, 64, 64, 64, -64, 64, -64, -64, -64, 64, 64, -64, -64, -64, -64, -64, -64, 64, 64, -64, 64, 64, -64, -64, -64, 64, -64, -64, -64, -64, 64, -64, -64, -64, 64, -64, -64, 64, -64, 64, 64, -64, 64, -64, -64, 64, 64, 64, -64, 64, 64, -64, -64, 64, -64, 64, 64, 64, 64, -64, -64, 64, 64, -64, -64, 64, -64, -64, -64, 64, -64, 64, -64, 64, -64, 64, 64, 64, -64, 64, 64, 64, -64, -64, -64, 64, 64, 64, 64, -64, 64, 64, -64, -64, -64, -64, 64, -64, 64, 64, -64, -64, -64, -64, -64, -64, -64, 64, 64, -64, -64, -64, -64, 64, 64, 64, 64, 64, -64, -64, -64, 64, 64, -64, -64, -64, -64, 64, 64, -64, -64, -64, 64, -64, -64, 64, -64, -64, -64, -64, 64, -64, -64, 64, 64, 64, 64, -64, 64, -64, -64, -64, 64, 64, -64, 64, 64, 64, -64, -64, 64, -64, -64, 64, 64, -64, -64, -64, -64, 64, 64, 64, 64, 64, 64, 64, -64, -64, -64, -64, -64, -64, -64, 64, -64, -64, -64, 64, 64, 64, -64, 64, -64, 64, 64, -64, 64, 64, 64, -64, 64, 64, 64, -64, -64, -64, -64, -64, -64, -64, 64, 64, 64, 64, 64, 64, 64, 64, -64, -64, 64, 64, 64, 64, -64, 64, -64, -64, 64, 64, -64, 64, 64, -64, 64, 64, 64, -64, 64, 64, 64, -64, -64, -64, 64, 64, 64, 64, 64, -64, 64, -64, -64, 64, -64, 64, 64, 64, 64, 64, 64, 64, 64, 64, 64, 64, 64, 64, -64, -64, 64, -64, 64, -64, -64, 64, 64, 64, 64, -64, -64, -64, 64, 64, 64, 64, 64, 64, 64, 64, 64, 64, 64, 64, 64, 64, 64, 64, 64, -64, -64, -64, -64, -64, 64, 64, 64, -64, -64, -64, 64, 64, 64, 64, 64, 64, -64, 64, 64, 64, 64, 64, 64, -64, -64, 64, -64, -64, 64, 64, -64, -64, 64, 64, -64, -64, -64, 64, 64, 64, 64, 64, -64, 64, -64, -64, 64, 64, 64, 64, 64, -64, -64, -64, 64, 64, -64, -64, -64, -64, -64, 64, -64, -64, -64, -64, 64, 64, 64, 64, -64, 64, -64, 64, -64, 64, 64, 64, 64, 64, 64, 64, 64, 64, -64, -64, -64, 64, 64, 64, -64, 64, 64, 64, 64, -64, 64, -64, 64, 64, 64, 64, 64, 64, -64, -64, 64, 64, 64, 64, -64, -64, -64, -64, -64, 64, -64, 64, 64, 64, 64, 64, 64, -64, -64, -64, 64, -64, 64, 64, 64, 64, 64, -64, 64, 64, 64, 64, 64, 64, 64, 64, -64, 64, -64, 64, 64, 64, 64, 64, 64, 64, -64, 64, 64, 64, -64, 64, 64, 64, 64, 64, 64, 64, 64, 64, 64, 64, 64, -64, -64, -64, -64, -64, 64, 64, 64, 64, -64, 64, 64, 64, -64, -64, -64, 64, 64, 64, 64, 64, 64, 64, 64, 64, 64, 64, -64, -64, 64, -64, -64, -64, 64, 64, 64, 64, 64, 64, -64, 64, 64, 64, 64, 64, 64, 64, 64, 64, 64, -64, 64, -64, 64, 64, 64, 64, -64, 64, -64, 64, -64, -64, 64, 64, 64, 64, 64, 64, 64, 64, 64, 64, 64, -64, 64, 64, -64, -64, -64, -64, -64, 64, -64, -64, 64, 64, 64, 64, 64, 64, 64, 64, 64, -64, -64, 64, 64, 64, 64, -64, -64, -64, 64, -64, -64, -64, 64, -64, -64, -64, -64, -64, -64, 64, -64, 64, 64, 64, 64, 64, 64, 64, 64, 64, 64, -64, -64, -64, -64, -64, -64, -64, -64, -64, -64, 64, -64, 64, -64, 64, 64, -64, -64, 64, 64, 64, 64, 64, 64, 64, 64, 64, -64, -64, -64, -64, -64, -64, 64, -64, -64, 64, 64, 64, 64, -64, -64, -64, -64, 64, -64, 64, 64, 64, 64, 64, 64, 64, -64, -64, 64, -64, 64, -64, 64, 64, 64, -64, -64, 64, 64, 64, -64, -64, 64, 64, 64, 64, -64, 64, 64, 64, 64, 64, 64, -64, 64, 64, -64, -64, -64, -64, 64, 64, -64, 64, 64, 64, -64, -64, -64, 64, 64, 64, 64, 64, 64, -64, 64, 64, 64, 64, 64, -64, -64, -64, -64, -64, -64, -64, 64, -64, -64, 64, 64, 64, 64, 64, -64, 64, 64, 64, -64, 64, -64, 64, -64, 64, 64, 64, -64, 64, 64, 64, -64, 64, -64, -64, 64, 64, -64, 64, 64, 64, 64, 64, 64, 64, 64, -64, 64, 64, 64, 64, 64, 64, -64, -64, 64, 64, 64, 64, -64, 64, -64, -64, 64, 64, 64, 64, -64, -64, -64, 64, 64, 64, -64, 64, -64, -64, 64, 64, 64, -64, -64, -64, -64, 64, 64, 64, 64, -64, -64, -64, 64, 64, -64, 64, 64, 64, 64, 64, -64, -64, -64, -64, 64, 64, -64, -64, 64, -64, 64, -64, -64, -64, -64, -64, -64, -64, -64, -64, 64, -64, -64, -64, -64, 64, -64, 64, 64, -64, -64, -64, 64, 64, 64, -64, -64, 64, 64, -64, -64, 64, 64, -64, -64, -64, -64, -64, -64, -64, 64, -64, -64, -64, -64, 64, -64, 64, 64, 64, 64, 64, -64, -64, -64, -64, -64, -64, -64, -64, -64, -64, -64, -64, -64, -64, -64, -64, -64, -64, -64, -64, -64, -64, -64, 64, -64, -64, 64, -64, 64, -64, 64, 64, -64, -64, -64, -64, -64, -64, -64, -64, 64, 64, 64, 64, 64, 64, -64, -64, -64, -64, 64, 64, 64, -64, 64, -64, -64, -64, -64, 64, -64, -64, 64, -64, -64, -64, -64, -64, 64, 64, -64, -64, -64, 64, 64, 64, 64, 64, 64, 64, -64, -64, -64, 64, 64, -64, -64, -64, 64, -64, -64, -64, -64, -64, -64, -64, -64, -64, -64, 64, -64, -64, 64, 64, 64, 64, 64, 64, 64, 64, -64, 64, 64, 64, 64, -64, -64, -64, -64, -64, -64, -64, -64, -64, -64, -64, -64, 64, 64, 64, 64, 64, 64, 64, 64, -64, 64, 64, -64, 64, 64, -64, 64, -64, 64, -64, -64, -64, -64, 64, 64, -64, -64, -64, -64, 64, 64, -64, 64, 64, 64, 64, 64, 64, 64, -64, -64, -64, 64, 64, -64, -64, -64, -64, -64, 64, 64, 64, 64, -64, -64, -64, 64, 64, 64, 64, -64, 64, 64, 64, -64, 64, 64, 64, 64, 64, 64, 64, -64, -64, -64, 64, 64, 64, 64, -64, -64, -64, 64, -64, 64, 64, -64, -64, -64, 64, -64, 64, 64, 64, 64, 64, 64, -64, 64, 64, -64, -64, -64, -64, 64, 64, 64, -64, -64, -64, 64, 64, 64, -64, -64, -64, 64, -64, -64, -64, 64, 64, 64, -64, 64, 64, 64, 64, -64, -64, -64, 64, 64, 64, 64, 64, 64, 64, 64, 64, -64, -64, -64, -64, 64, -64, 64, -64, 64, 64, 64, 64, 64, -64, -64, 64, -64, -64, 64, -64, 64, 64, 64, 64, -64, 64, 64, 64, -64, -64, -64, -64, -64, -64, -64, -64, 64, -64, 64, 64, -64, 64, 64, -64, -64, -64, 64, -64, 64, -64, 64, 64, 64, 64, 64, 64, -64, -64, -64, -64, -64, -64, -64, 64, 64, 64, -64, 64, 64, 64, -64, -64, -64, -64, -64, -64, 64, -64, 64, 64, 64, 64, 64, 64, 64, -64, -64, -64, -64, -64, 64, 64, -64, -64, 64, -64, 64, 64, 64, -64, -64, -64, -64, -64, 64, -64, -64, -64, 64, 64, 64, 64, 64, -64, -64, -64, -64, 64, -64, -64, -64, -64, 64, -64, 64, 64, 64, -64, -64, -64, 64, 64, 64, 64, 64, 64, 64, 64, 64, 64, 64, -64, -64, -64, 64, -64, -64, 64, -64, 64, -64, -64, 64, -64, -64, -64, -64, -64, -64, 64, -64, -64, 64, 64, 64, 64, 64, -64, -64, -64, -64, -64, -64, -64, -64, -64, -64, 64, 64, -64, -64, -64, -64, -64, -64, -64, -64, -64, -64, -64, -64, -64, 64, 64, 64, -64, -64, -64, -64, -64, -64, -64, -64, -64, -64, -64, -64, -64, 64, -64, -64, -64, -64, -64, -64, -64, 64, -64, -64, -64, 64, 64, 64, -64, -64, 64, 64, -64, -64, 64, -64, 64, 64, -64, 64, -64, -64, 64, -64, -64, -64, -64, -64, -64, 64, -64, -64, -64, 64, 64, 64, -64, -64, -64, -64, -64, -64, -64, -64, -64, -64, -64, 64, -64, 64, 64, -64, -64, -64, -64, 64, 64, 64, 64, -64, -64, 64, 64, 64, -64, 64, -64, -64, -64, -64, -64, -64, 64, 64, -64, -64, 64, -64, -64, -64, 64, -64, -64, 64, 64, 64, -64, -64, 64, 64, 64, 64, 64, 64, -64, -64, -64, -64, -64, 64, -64, -64, 64, 64, 64, -64, -64, -64, -64, -64, -64, 64, 64, 64, -64, -64, 64, 64, 64, 64, 64, 64, 64, 64, -64, -64, 64, -64, 64, -64, -64, -64, 64, -64, 64, -64, -64, 64, 64, 64, -64, -64, -64, -64, -64, 64, 64, -64, -64, -64, -64, -64, -64, 64, -64, 64, -64, -64, 64, -64, 64, -64, 64, 64, 64, 64, 64, -64, -64, -64, -64, -64, -64, -64, -64, -64, -64, 64, 64, 64, -64, -64, 64, 64, 64, 64, -64, -64, 64, -64, -64, -64, 64, 64, 64, 64, -64, 64, 64, -64, -64, 64, -64, -64, 64, -64, -64, 64, 64, 64, -64, 64, 64, -64, -64, -64, 64, -64, -64, 64, 64, -64, -64, 64, -64, 64, -64, 64, -64, -64, 64, 64, 64, 64, 64, -64, 64, 64, -64, -64, -64, -64, -64, -64, -64, -64, -64, -64, -64, 64, -64, 64, -64, -64, 64, -64, 64, -64, 64, -64, -64, 64, 64, 64, 64, 64, 64, -64, -64, 64, 64, 64, 64, 64, 64, -64, 64, 64, 64, -64, 64, 64, 64, 64, 64, 64, 64, 64, -64, 64, 64, 64, -64, -64, -64, -64, -64, -64, 64, 64, 64, 64, 64, 64, -64, 64, -64, 64, 64, 64, 64, -64, -64, 64, 64, 64, 64, 64, 64, 64, 64, 64, 64, -64, 64, -64, 64, 64, 64, -64, -64, 64, -64, -64, 64, 64, 64, 64, 64, 64, 64, 64, 64, 64, 64, 64, 64, 64, 64, 64, 64, 64, 64, -64, 64, 64, -64, -64, -64, 64, 64, 64, -64, 64, 64, 64, 64, -64, 64, 64, 64, 64, 64, 64, 64, 64, 64, 64, 64, 64, 64, 64, 64, 64, -64, -64, -64, 64, 64, 64, -64, 64, 64, 64, 64, 64, 64, 64, 64, 64, 64, 64, 64, 64, 64, 64, 64, 64, 64, 64, 64, 64, 64, 64, 64, -64, 64, 64, -64, -64, 64, 64, 64, 64, 64, 64, 64, 64, 64, 64, 64, 64, 64, 64, 64, -64, -64, -64, -64, 64, 64, -64, 64, -64, -64, -64, -64, 64, 64, 64, 64, 64, 64, -64, 64, 64, 64, 64, -64, -64, -64, -64, -64, -64, -64, -64, 64, -64, -64, 64, -64, -64, -64, -64, 64, 64, 64, 64, -64, 64, 64, 64, -64, -64, -64, -64, -64, -64, -64, -64, -64, -64, -64, -64, 64, -64, 64, -64, -64, 64, -64, 64, 64, 64, 64, 64, -64, -64, -64, -64, -64, -64, -64, -64, -64, -64, -64, -64, -64, -64, -64, -64, 64, -64, -64, -64, -64, -64, -64, -64, 64, -64, -64, -64, -64, -64, -64, -64, -64, -64, 64, -64, -64, -64, -64, -64, 64, -64, -64, -64, 64, 64, -64, 64, -64, -64, -64, -64, 64, 64, 64, -64, -64, -64, -64, -64, -64, 64, 64, 64, -64, 64, -64, 64, 64, 64, -64, -64, -64, -64, 64, -64, -64, -64, -64, -64, 64, 64, 64, -64, -64, -64, -64, -64, 64, 64, 64, 64, 64, 64, 64, 64, -64, 64, 64, -64, -64, -64, 64, -64, -64, -64, -64, -64, 64, 64, -64, 64, -64, 64, 64, 64, 64, 64, 64, 64, -64, 64, 64, 64, 64, -64, 64, -64, -64, -64, -64, 64, 64, 64, 64, -64, -64, -64, -64, -64, 64, -64, -64, 64, -64, 64, 64, -64, -64, -64, 64, 64, 64, -64, 64, -64, -64, -64, -64, 64, 64, 64, 64, 64, -64, 64, 64, 64, 64, 64, 64, 64, 64, 64, -64, -64, 64, 64, -64, -64, 64, 64, 64, -64, -64, -64, 64, -64, -64, 64, -64, -64, 64, 64, 64, 64, 64, -64, 64, 64, 64, 64, 64, -64, -64, 64, 64, 64, 64, 64, 64, 64, 64, -64, -64, -64, -64, 64, -64, -64, -64, 64, 64, 64, -64, -64, 64, -64, 64, 64, 64, 64, -64, 64, 64, 64, 64, 64, 64, -64, 64, 64, -64, 64, -64, -64, -64, -64, -64, -64, 64, -64, 64, -64, 64, 64, 64, -64, 64, 64, -64, -64, 64, 64, 64, 64, -64, 64, 64, -64, 64, 64, 64, 64, 64, 64, -64, 64, -64, -64, -64, -64, 64, 64, 64, -64, 64, -64, -64, 64, 64, 64, 64, -64, -64, 64, -64, 64, 64, 64, 64, 64, 64, 64, 64, 64, 64, -64, 64, 64, 64, 64, 64, 64, 64, -64, -64, 64, 64, 64, 64, -64, -64, -64, -64, -64, 64, 64, 64, 64, 64, -64, -64, -64, 64, 64, 64, 64, 64, 64, 64, 64, 64, -64, -64, 64, 64, -64, 64, -64, -64, 64, -64, -64, -64, -64, -64, -64, -64, 64, 64, -64, -64, 64, 64, 64, 64, 64, 64, 64, 64, 64, -64, 64, 64, 64, -64, 64, 64, 64, 64, 64, 64, 64, -64, -64, -64, 64, -64, -64, -64, -64, 64, 64, 64, 64, 64, 64, 64, 64, -64, -64, 64, 64, -64, -64, -64, -64, 64, 64, 64, -64, 64, -64, -64, -64, -64, -64, 64, 64, 64, 64, 64, 64, 64, -64, -64, -64, 64, 64, 64, 64, -64, -64, 64, 64, 64, -64, -64, -64, 64, -64, -64, -64, -64, -64, -64, -64, 64, 64, 64, 64, 64, -64, -64, -64, -64, 64, 64, -64, -64, 64, -64, -64, 64, -64, -64, -64, -64, -64, 64, 64, 64, 64, 64, -64, 64, 64, -64, -64, -64, 64, -64, -64, -64, 64, 64, -64, -64, -64, 64, 64, 64, 64, -64, -64, 64, 64, -64, -64, -64, -64, 64, 64, -64, 64, 64, 64, -64, -64, -64, 64, 64, 64, -64, 64, 64, -64, -64, -64, -64, 64, -64, 64, 64, 64, 64, -64, 64, 64, -64, -64, -64, 64, -64, -64, -64, -64, 64, -64, -64, -64, 64, -64, -64, -64, 64, 64, -64, 64, -64, 64, -64, 64, 64, -64, 64, 64, -64, -64, -64, -64, -64, 64, 64, 64, -64, -64, -64, -64, -64, 64, -64, -64, -64, -64, -64, -64, -64, 64, 64, -64, -64, -64, -64, -64, 64, -64, -64, 64, -64, 64, 64, -64, -64, -64, -64, -64, -64, -64, -64, -64, -64, 64, 64, 64, 64, -64, -64, 64, -64, -64, 64, 64, -64, 64, 64, 64, 64, -64, 64, -64, -64, -64, -64, -64, -64, -64, -64, 64, 64, 64, 64, 64, -64, 64, -64, 64, -64, -64, -64, -64, -64, 64, 64, -64, 64, 64, 64, 64, 64, 64, -64, 64, 64, -64, -64, 64, 64, 64, 64, -64, 64, 64, -64, 64, -64, -64, -64, -64, -64, 64, -64, -64, -64, 64, 64, -64, -64, -64, -64, 64, -64, -64, 64, 64, 64, 64, -64, 64, -64, -64, 64, -64, -64, 64, -64, -64, -64, -64, 64, 64, 64, -64, -64, -64, -64, -64, -64, -64, -64, -64, 64, 64, 64, 64, -64, 64, -64, 64, -64, 64, -64, -64, 64, -64, 64, -64, -64, 64, -64, 64, -64, -64, -64, -64, 64, -64, -64, -64, 64, -64, -64, -64, -64, 64, 64, 64, -64, -64, -64, 64, 64, 64, -64, -64, -64, -64, -64, -64, -64, -64, -64, -64, 64, -64, 64, 64, 64, 64, 64, -64, 64, -64, 64, -64, -64, -64, 64, -64, 64, -64, -64, -64, 64, -64, 64, -64, -64, -64, -64, -64, -64, -64, -64, 64, -64, 64, -64, -64, -64, 64, 64, 64, -64, -64, 64, 64, -64, 64, -64, 64, 64, 64, -64, 64, 64, -64, -64, -64, -64, -64, 64, -64, 64, 64, 64, 64, 64, -64, 64, 64, 64, -64, -64, -64, 64, -64, -64, 64, -64, 64, -64, -64, -64, -64, -64, -64, -64, -64, -64, -64, 64, 64, 64, -64, -64, -64, 64, 64, -64, -64, -64, -64, -64, 64, 64, 64, -64, 64, 64, -64, -64, -64, -64, 64, 64, -64, 64, 64, 64, 64, -64, 64, -64, 64, -64, -64, -64, 64, -64, 64, -64, -64, 64, -64, 64, -64, -64, -64, -64, -64, 64, -64, -64, 64, -64, -64, 64, 64, -64, -64, -64, -64, 64, 64, 64, -64, -64, -64, 64, -64, 64, -64, -64, -64, 64, -64, -64, -64, -64, -64, 64, 64, -64, -64, -64, -64, -64, -64, 64, -64, -64, 64, 64, -64, -64, -64, -64, 64, -64, 64, 64, -64, 64, -64, -64, 64, -64, 64, -64, -64, 64, -64, -64, -64, -64, -64, 64, 64, -64, -64, 64, -64, -64, -64, -64, -64, -64, -64, 64, -64, -64, -64, -64, 64, -64, -64, 64, -64, 64, -64, 64, -64, -64, 64, -64, 64, 64, -64, -64, -64, -64, -64, 64, -64, -64, -64, 64, 64, -64, 64, -64, -64, 64, 64, -64, 64, 64, -64, -64, -64, -64, -64, 64, 64, -64, -64, -64, -64, -64, -64, 64, 64, 64, -64, -64, -64, 64, -64, -64, -64, -64, -64, 64, 64, 64, 64, -64, 64, 64, 64, 64, -64, 64, -64, -64, -64, -64, -64, 64, 64, -64, -64, -64, 64, 64, -64, -64, -64, 64, -64, 64, -64, 64, 64, 64, 64, 64, 64, -64, -64, 64, 64, -64, -64, -64, -64, -64, -64, -64, -64, 64, -64, 64, -64, -64, -64, -64, 64, -64, 64, 64, -64, -64, 64, 64, 64, -64, 64, 64, -64, 64, 64, 64, -64, -64, 64, -64, -64, -64, -64, 64, -64, -64, -64, -64, -64, 64, 64, 64, 64, -64, 64, -64, -64, -64, 64, 64, -64, 64, -64, -64, -64, -64, -64, -64, 64, -64, -64, -64, -64, 64, 64, -64, -64, -64, 64, 64, -64, -64, -64, 64, -64, 64, 64, 64, -64, -64, 64, 64, -64, -64, 64, -64, 64, -64, -64, -64, -64, -64, -64, -64, -64, -64, -64, -64, 64, -64, -64, -64, -64, 64, 64, 64, -64, -64, -64, 64, -64, 64, 64, 64, -64, 64, -64, -64, -64, 64, 64, -64, -64, -64, -64, -64, -64, 64, -64, -64, -64, -64, -64, 64, -64, -64, 64, 64, 64, 64, 64, -64, 64, -64, 64, -64, -64, -64, -64, 64, -64, 64, -64, 64, -64, -64, 64, -64, 64, 64, -64, -64, 64, 64, -64, -64, 64, 64, -64, -64, 64, -64, -64, 64, -64, -64, -64, 64, 64, 64, 64, 64, -64, 64, 64, 64, -64, 64, -64, -64, -64, -64, -64, 64, 64, -64, 64, -64, 64, -64, 64, 64, 64, 64, 64, 64, -64, 64, -64, -64, -64, -64, -64, 64, -64, -64, 64, -64, -64, -64, 64, -64, 64, 64, 64, 64, 64, 64, -64, 64, -64, -64, 64, 64, -64, -64, -64, -64, -64, 64, 64, 64, -64, -64, -64, 64, -64, 64, 64, 64, -64, 64, 64, -64, 64, 64, 64, 64, -64, 64, 64, -64, 64, 64, -64, -64, 64, -64, -64, 64, -64, -64, 64, 64, -64, -64, -64, 64, 64, 64, -64, 64, 64, -64, 64, 64, 64, -64, 64, -64, -64, -64, -64, 64, 64, -64, 64, 64, 64, 64, 64, 64, 64, -64, -64, -64, -64, -64, -64, -64, -64, 64, 64, -64, -64, -64, -64, 64, -64, -64, -64, 64, 64, 64, 64, -64, -64, -64, -64, 64, 64, 64, 64, 64, -64, -64, -64, -64, 64, 64, 64, -64, -64, -64, 64, -64, 64, 64, -64, -64, 64, -64, -64, -64, -64, -64, -64, -64, -64, -64, -64, -64, -64, -64, -64, -64, 64, 64, -64, 64, 64, -64, 64, -64, -64, 64, 64, -64, -64, -64, -64, -64, -64, -64, 64, 64, 64, 64, 64, -64, -64, -64, -64, 64, -64, -64, 64, -64, -64, -64, -64, 64, -64, 64, -64, -64, -64, -64, -64, -64, -64, -64, 64, -64, -64, 64, 64, -64, -64, -64, -64, 64, 64, 64, -64, -64, -64, 64, 64, -64, -64, -64, -64, -64, -64, -64, -64, -64, -64, -64, -64, -64, -64, -64, -64, -64, -64, -64, -64, -64, -64, 64, -64, -64, -64, 64, -64, 64, -64, -64, -64, -64, -64, -64, 64, 64, -64, -64, -64, -64, -64, 64, 64, -64, -64, -64, -64, -64, -64, -64, -64, -64, -64, -64, -64, -64, 64, -64, -64, -64, -64, -64, 64, -64, -64, -64, -64, -64, -64, -64, -64, -64, -64, -64, -64, -64, -64, -64, -64, -64, -64, -64, -64, -64, -64, -64, -64, -64, -64, -64, 64, -64, -64, -64, -64, 64, -64, -64, -64, 64, -64, -64, -64, -64, -64, -64, 64, -64, 64, -64, -64, -64, -64, -64, 64, -64, 64, -64, 64, 64, -64, -64, 64, 64, -64, -64, 64, 64, -64, 64, -64, -64, -64, -64, 64, -64, -64, -64, -64, -64, -64, -64, -64, 64, 64, 64, 64, -64, -64, 64, -64, -64, -64, 64, -64, 64, -64, 64, -64, -64, -64, -64, 64, -64, -64, -64, -64, -64, -64, -64, -64, -64, 64, -64, -64, -64, -64, 64, -64, 64, 64, -64, -64, 64, 64, -64, -64, -64, -64, -64, -64, -64, -64, -64, -64, -64, -64, -64, -64, -64, -64, -64, 64, 64, -64, 64, 64, -64, 64, -64, -64, 64, -64, -64, -64, -64, 64, 64, -64, -64, -64, -64, -64, -64, -64, -64, 64, -64, -64, -64, -64, 64, 64, 64, 64, 64, -64, -64, 64, -64, -64, -64, 64, -64, -64, 64, 64, -64, -64, -64, -64, -64, -64, -64, 64, 64, -64, -64, 64, 64, -64, -64, 64, 64, 64, -64, 64, -64, -64, 64, 64, 64, 64, 64, 64, -64, -64, -64, -64, -64, -64, 64, -64, 64, -64, -64, -64, -64, -64, 64, -64, 64, -64, -64, -64, -64, -64, -64, 64, -64, -64, -64, 64, 64, 64, -64, 64, -64, -64, -64, -64, -64, 64, -64, -64, -64, -64, -64, -64, -64, -64, 64, -64, 64, 64, 64, -64, 64, 64, 64, 64, 64, 64, 64, 64, 64, 64, -64, 64, 64, -64, -64, -64, -64, 64, -64, 64, -64, 64, 64, 64, 64, 64, -64, -64, -64, 64, 64, 64, 64, 64, 64, 64, 64, -64, -64, -64, -64, -64, -64, -64, -64, 64, 64, -64, -64, 64, 64, -64, 64, -64, -64, 64, -64, 64, 64, 64, 64, 64, 64, 64, -64, -64, -64, -64, -64, -64, -64, 64, 64, 64, 64, -64, -64, -64, -64, -64, -64, -64, -64, 64, -64, 64, -64, -64, 64, -64, 64, 64, 64, -64, 64, -64, -64, -64, -64, -64, -64, 64, -64, -64, -64, 64, -64, 64, -64, -64, -64, -64, -64, -64, 64, -64, -64, -64, -64, -64, -64, -64, -64, -64, -64, -64, -64, 64, 64, -64, -64, -64, 64, -64, 64, -64, -64, -64, -64, -64, -64, -64, -64, -64, -64, -64, -64, -64, 64, -64, 64, 64, -64, 64, -64, -64, -64, 64, -64, -64, -64, 64, 64, -64, -64, 64, -64, -64, -64, -64, -64, -64, 64, -64, -64, 64, 64, 64, -64, -64, 64, -64, -64, 64, -64, 64, 64, 64, -64, -64, -64, -64, -64, 64, -64, -64, 64, 64, 64, -64, 64, -64, -64, -64, -64, -64, 64, 64, -64, 64, 64, 64, -64, 64, 64, 64, 64, -64, 64, 64, -64, 64, -64, 64, 64, 64, -64, 64, 64, 64, -64, 64, -64, -64, -64, 64, 64, 64, -64, 64, 64, 64, -64, 64, -64, 64, 64, -64, 64, -64, -64, 64, 64, 64, -64, 64, 64, -64, -64, -64, 64, -64, 64, 64, -64, 64, 64, 64, -64, 64, -64, -64, 64, -64, -64, -64, -64, 64, -64, 64, -64, 64, 64, 64, 64, 64, -64, 64, 64, 64, -64, 64, 64, 64, 64, -64, 64, 64, 64, 64, -64, -64, -64, 64, -64, 64, -64, -64, 64, 64, 64, 64, -64, 64, 64, -64, 64, -64, -64, -64, 64, 64, 64, 64, 64, -64, -64, -64, 64, -64, 64, 64, -64, 64, 64, -64, 64, 64, -64, -64, -64, -64, -64, -64, 64, -64, 64, 64, 64, 64, 64, 64, 64, 64, -64, -64, 64, 64, -64, -64, 64, 64, 64, 64, 64, -64, -64, 64, 64, 64, -64, 64, 64, 64, 64, -64, 64, -64, -64, -64, -64, 64, 64, -64, 64, 64, 64, 64, 64, -64, 64, -64, -64, -64, -64, 64, 64, 64, 64, 64, 64, 64, 64, 64, 64, -64, 64, -64, 64, 64, 64, 64, -64, 64, 64, -64, 64, -64, 64, -64, -64, 64, 64, 64, 64, 64, 64, 64, 64, 64, 64, -64, -64, -64, 64, 64, 64, 64, -64, -64, 64, -64, 64, 64, 64, -64, -64, -64, 64, 64, 64, 64, -64, -64, 64, 64, 64, 64, -64, -64, 64, -64, -64, -64, -64, 64, -64, 64, 64, 64, -64, -64, -64, 64, -64, 64, -64, 64, 64, 64, -64, -64, 64, 64, 64, 64, -64, -64, -64, -64, -64, -64, -64, -64, 64, -64, -64, -64, -64, -64, -64, 64, -64, 64, -64, 64, 64, -64, -64, 64, 64, 64, 64, 64, -64, 64, -64, -64, -64, -64, -64, 64, 64, 64, -64, -64, 64, -64, 64, 64, 64, 64, -64, 64, 64, 64, 64, 64, 64, 64, -64, 64, -64, 64, -64, -64, -64, 64, -64, 64, 64, -64, -64, 64, 64, -64, 64, -64, 64, 64, 64, 64, 64, 64, 64, 64, 64, 64, 64, 64, 64, 64, 64, 64, -64, -64, -64, 64, -64, -64, 64, 64, -64, -64, -64, -64, -64, -64, -64, -64, 64, 64, 64, 64, 64, 64, 64, 64, 64, 64, 64, -64, -64, 64, -64, 64, 64, -64, -64, -64, -64, -64, -64, -64, -64, -64, -64, 64, 64, 64, 64, 64, 64, 64, 64, 64, 64, 64, 64, 64, -64, -64, -64, -64, 64, -64, 64, 64, 64, 64, 64, 64, -64, -64, -64, -64, -64, 64, 64, 64, 64, 64, 64, 64, 64, 64, 64, -64, 64, -64, -64, -64, 64, 64, -64, 64, 64, 64, -64, -64, -64, -64, -64, -64, -64, 64, 64, 64, 64, 64, 64, 64, 64, 64, 64, 64, -64, -64, 64, -64, -64, -64, -64, -64, -64, 64, -64, -64, -64, 64, 64, 64, -64, -64, 64, 64, 64, 64, 64, 64, 64, 64, 64, -64, -64, -64, -64, -64, -64, 64, 64, 64, -64, 64, -64, -64, -64, 64, 64, 64, -64, -64, -64, -64, -64, 64, 64, 64, 64, 64, 64, 64, -64, -64, 64, 64, -64, -64, -64, 64, -64, -64, -64, -64, 64, 64, -64, -64, -64, -64, 64, -64, 64, -64, 64, 64, -64, -64, 64, -64, -64, -64, -64, -64, -64, 64, 64, -64, -64, -64, 64, -64, -64, -64, 64, 64, 64, 64, 64, 64, 64, 64, 64, 64, -64, 64, 64, -64, 64, -64, -64, -64, -64, -64, 64, 64, -64, -64, 64, 64, 64, 64, 64, 64, -64, -64, -64, 64, -64, 64, 64, -64, -64, 64, 64, -64, 64, -64, 64, -64, 64, 64, 64, -64, -64, -64, -64, -64, 64, 64, 64, 64, -64, 64, 64, 64, -64, -64, -64, 64, 64, 64, -64, -64, 64, -64, 64, 64, -64, 64, 64, 64, 64, 64, 64, 64, 64, -64, -64, 64, -64, 64, 64, 64, -64, 64, 64, 64, 64, 64, -64, 64, -64, -64, 64, -64, -64, -64, 64, -64, -64, 64, 64, 64, 64, 64, 64, 64, 64, 64, 64, 64, 64, 64, 64, -64, 64, 64, 64, 64, -64, -64, -64, -64, 64, -64, -64, -64, 64, -64, -64, 64, 64, 64, -64, 64, -64, 64, 64, 64, 64, 64, -64, 64, -64, 64, 64, -64, 64, -64, -64, 64, 64, 64, -64, 64, -64, -64, -64, 64, -64, -64, 64, 64, 64, -64, 64, 64, 64, -64, 64, -64, 64, 64, 64, 64, 64, 64, -64, 64, -64, -64, -64, 64, 64, 64, -64, -64, 64, 64, -64, -64, 64, -64, 64, 64, 64, 64, -64, -64, -64, -64, -64, 64, -64, -64, -64, -64, -64, 64, 64, -64, -64, -64, -64, 64, -64, -64, -64, -64, -64, 64, 64, -64, 64, -64, 64, 64, -64, -64, -64, 64, -64, -64, -64, 64, 64, -64, 64, -64, -64, 64, 64, 64, -64, -64, -64, -64, 64, -64, -64, 64, 64, -64, -64, 64, 64, -64, -64, 64, -64, -64, -64, 64, -64, 64, -64, -64, -64, -64, -64, -64, -64, 64, 64, -64, 64, 64, -64, -64, 64, 64, 64, 64, -64, -64, -64, -64, 64, -64, -64, 64, 64, 64, -64, 64, -64, -64, 64, -64, -64, -64, 64, 64, -64, -64, -64, -64, 64, -64, 64, -64, 64, 64, 64, -64, 64, 64, -64, 64, 64, 64, -64, 64, -64, -64, -64, 64, 64, -64, -64, 64, 64, -64, -64, 64, 64, 64, 64, 64, -64, -64, -64, 64, -64, -64, 64, 64, 64, -64, 64, -64, 64, -64, 64, 64, -64, 64, 64, 64, -64, -64, 64, 64, 64, 64, 64, 64, 64, 64, 64, 64, -64, 64, -64, 64, -64, 64, 64, -64, -64, 64, 64, -64, -64, 64, 64, 64, 64, 64, 64, -64, -64, 64, 64, 64, 64, -64, 64, 64, -64, 64, 64, 64, 64, 64, 64, 64, 64, -64, 64, -64, -64, -64, 64, 64, -64, 64, 64, 64, 64, 64, 64, -64, -64, 64, 64, -64, 64, 64, 64, 64, -64, 64, -64, 64, -64, -64, 64, -64, -64, 64, -64, -64, -64, 64, 64, 64, 64, 64, 64, 64, -64, 64, 64, -64, -64, 64, 64, 64, 64, 64, 64, 64, 64, -64, -64, -64, -64, -64, -64, -64, 64, 64, 64, 64, 64, 64, 64, 64, 64, 64, 64, 64, -64, -64, 64, 64, -64, 64, -64, -64, 64, -64, -64, -64, -64, -64, 64, -64, -64, 64, 64, 64, 64, 64, -64, 64, -64, 64, 64, -64, -64, -64, 64, 64, -64, -64, 64, -64, 64, 64, 64, -64, -64, 64, -64, 64, 64, 64, 64, 64, -64, 64, 64, 64, 64, 64, 64, -64, -64, -64, -64, -64, -64, 64, -64, 64, -64, -64, -64, -64, -64, -64, 64, 64, 64, 64, 64, 64, 64, 64, 64, 64, -64, 64, -64, -64, -64, -64, -64, -64, -64, -64, 64, -64, 64, -64, -64, -64, 64, -64, 64, 64, 64, 64, 64, 64, 64, 64, 64, 64, 64, 64, 64, -64, 64, 64, -64, -64, -64, 64, -64, -64, -64, -64, -64, -64, -64, -64, 64, 64, 64, 64, 64, 64, 64, 64, 64, 64, -64, -64, -64, 64, 64, -64, -64, -64, -64, -64, 64, -64, -64, -64, 64, -64, 64, -64, 64, -64, -64, 64, -64, 64, 64, 64, 64, -64, -64, -64, 64, 64, -64, 64, -64, -64, -64, 64, -64, 64, 64, -64, 64, -64, -64, 64, 64, 64, 64, 64, 64, 64, 64, 64, 64, 64, -64, -64, 64, 64, 64, 64, -64, -64, -64, 64, 64, 64, 64, 64, -64, -64, -64, 64, 64, 64, 64, 64, 64, 64, -64, -64, 64, -64, 64, 64, -64, 64, 64, 64, 64, -64, -64, 64, -64, 64, -64, 64, -64, 64, -64, -64, 64, 64, 64, -64, -64, 64, -64, 64, 64, -64, -64, 64, -64, 64, -64, -64, -64, 64, 64, -64, 64, -64, 64, 64, 64, -64, 64, -64, 64, 64, -64, 64, -64, 64, 64, -64, 64, 64, 64, -64, -64, -64, -64, -64, 64, 64, -64, -64, 64, 64, 64, 64, -64, -64, -64, 64, 64, -64, 64, 64, 64, 64, 64, 64, -64, 64, -64, -64, -64, -64, 64, -64, -64, -64, 64, 64, -64, -64, -64, 64, -64, 64, 64, 64, 64, 64, -64, 64, 64, 64, -64, 64, -64, 64, 64, 64, -64, -64, -64, -64, -64, 64, 64, 64, 64, 64, 64, 64, 64, 64, 64, 64, 64, 64, 64, 64, -64, 64, 64, 64, 64, -64, -64, 64, -64, -64, -64, -64, 64, -64, 64, -64, -64, -64, -64, 64, 64, 64, 64, 64, 64, 64, 64, 64, 64, -64, -64, 64, -64, 64, 64, 64, 64, -64, -64, 64, -64, 64, -64, -64, -64, -64, -64, 64, 64, 64, 64, -64, 64, 64, 64, 64, -64, 64, -64, 64, 64, -64, 64, 64, 64, -64, -64, 64, 64, 64, 64, 64, -64, 64, 64, -64, 64, -64, -64, -64, 64, -64, 64, 64, 64, -64, -64, -64, 64, -64, 64, -64, -64, -64, 64, -64, -64, 64, 64, 64, 64, -64, -64, -64, -64, 64, 64, -64, 64, 64, 64, -64, -64, 64, -64, -64, -64, -64, -64, -64, -64, -64, -64, 64, -64, -64, -64, -64, 64, -64, -64, -64, 64, -64, 64, 64, 64, 64, -64, -64, 64, 64, -64, 64, -64, -64, 64, -64, -64, -64, -64, 64, 64, 64, 64, -64, -64, 64, -64, -64, 64, 64, -64, 64, -64, -64, -64, -64, -64, -64, 64, 64, 64, 64, 64, -64, 64, -64, 64, 64, 64, -64, 64, 64, 64, -64, 64, 64, 64, -64, 64, -64, -64, 64, 64, -64, 64, -64, -64, -64, -64, -64, 64, 64, -64, -64, -64, 64, 64, 64, -64, -64, -64, -64, 64, 64, 64, 64, -64, -64, 64, -64, -64, -64, -64, -64, -64, 64, -64, -64, -64, -64, -64, 64, -64, -64, 64, 64, -64, 64, -64, -64, 64, 64, 64, 64, 64, -64, 64, -64, -64, -64, -64, -64, -64, 64, -64, -64, 64, -64, -64, 64, -64, -64, 64, -64, 64, -64, 64, -64, -64, -64, 64, -64, -64, 64, 64, 64, 64, -64, 64, 64, 64, 64, 64, 64, 64, -64, 64, -64, -64, -64, -64, 64, -64, 64, 64, -64, 64, 64, -64, 64, 64, 64, 64, 64, 64, 64, -64, 64, -64, 64, -64, -64, 64, -64, -64, 64, -64, -64, -64, 64, 64, 64, 64, -64, 64, -64, -64, 64, 64, -64, 64, 64, -64, 64, -64, -64, -64, 64, -64, 64, 64, -64, -64, -64, -64, 64, 64, 64, 64, -64, -64, 64, 64, -64, 64, -64, -64, -64, -64, -64, 64, -64, 64, 64, 64, 64, 64, -64, 64, 64, 64, -64, 64, 64, 64, -64, -64, -64, 64, 64, -64, -64, -64, 64, -64, -64, -64, 64, -64, -64, -64, -64, 64, 64, -64, 64, -64, 64, 64, 64, 64, 64, 64, 64, 64, 64, 64, -64, 64, 64, 64, -64, 64, 64, 64, 64, 64, 64, -64, 64, 64, 64, -64, 64, -64, -64, 64, 64, 64, 64, 64, 64, -64, -64, 64, 64, 64, -64, 64, -64, -64, 64, 64, 64, 64, 64, 64, -64, 64, -64, -64, -64, -64, -64, 64, 64, 64, 64, 64, -64, -64, -64, 64, 64, 64, 64, -64, 64, 64, 64, 64, 64, -64, -64, 64, 64, 64, -64, 64, -64, -64, -64, -64, 64, 64, 64, -64, 64, -64, 64, -64, 64, -64, -64, -64, -64, 64, 64, 64, 64, -64, 64, -64, -64, -64, -64, -64, -64, -64, 64, 64, -64, -64, 64, 64, -64, 64, 64, -64, 64, -64, 64, 64, 64, 64, 64, 64, 64, 64, -64, -64, -64, -64, -64, -64, -64, 64, -64, 64, -64, 64, -64, -64, -64, 64, -64, -64, 64, 64, 64, 64, 64, 64, 64, -64, -64, -64, 64, -64, -64, -64, -64, -64, -64, -64, -64, -64, -64, 64, 64, 64, 64, 64, 64, -64, -64, -64, 64, -64, 64, 64, 64, -64, -64, -64, -64, -64, -64, -64, -64, -64, -64, -64, -64, -64, -64, -64, 64, -64, 64, 64, 64, 64, 64, -64, 64, 64, 64, 64, 64, -64, -64, -64, -64, -64, -64, -64, -64, -64, -64, 64, 64, -64, -64, 64, 64, 64, 64, -64, -64, 64, 64, 64, 64, 64, 64, -64, 64, 64, -64, -64, -64, -64, -64, -64, -64, -64, -64, -64, -64, -64, -64, 64, 64, 64, 64, -64, -64, 64, -64, -64, 64, 64, 64, -64, 64, 64, -64, -64, -64, -64, -64, -64, -64, -64, -64, -64, -64, 64, -64, 64, 64, 64, 64, 64, -64, -64, -64, 64, 64, 64, -64, 64, -64, 64, -64, -64, -64, -64, -64, -64, -64, -64, -64, 64, 64, 64, -64, 64, 64, 64, 64, -64, 64, -64, -64, -64, 64, 64, 64, -64, -64, -64, 64, -64, -64, -64, -64, -64, -64, -64, -64, 64, -64, 64, 64, 64, 64, -64, 64, -64, 64, 64, -64, -64, 64, 64, -64, 64, -64, -64, -64, 64, 64, -64, -64, 64, -64, -64, 64, -64, 64, 64, 64, 64, 64, 64, 64, -64, 64, 64, 64, -64, -64, 64, 64, -64, -64, -64, 64, 64, 64, 64, -64, -64, -64, 64, 64, 64, 64, 64, 64, 64, 64, -64, -64, -64, -64, 64, 64, -64, 64, 64, 64, -64, 64, -64, -64, 64, 64, 64, -64, -64, 64, -64, 64, 64, -64, 64, 64, 64, 64, -64, 64, 64, -64, -64, 64, -64, -64, -64, -64, -64, 64, 64, 64, 64, 64, 64, -64, -64, 64, -64, -64, 64, 64, -64, -64, -64, -64, -64, -64, 64, 64, -64, -64, -64, 64, -64, -64, -64, 64, 64, 64, 64, 64, -64, -64, 64, -64, 64, 64, 64, 64, 64, -64, -64, 64, 64, 64, -64, 64, 64, 64, 64, -64, -64, 64, 64, -64, -64, -64, -64, 64, -64, -64, 64, -64, 64, 64, -64, 64, 64, 64, -64, -64, 64, -64, -64, -64, 64, -64, 64, 64, -64, 64, -64, 64, -64, -64, -64, -64, -64, -64, -64, 64, 64, 64, 64, -64, -64, 64, 64, 64, 64, -64, -64, 64, 64, 64, 64, 64, -64, -64, -64, -64, -64, 64, -64, -64, 64, 64, -64, -64, 64, 64, 64, 64, -64, 64, -64, 64, 64, 64, -64, 64, -64, 64, -64, 64, 64, 64, 64, -64, -64, 64, -64, 64, 64, -64, 64, 64, 64, 64, 64, -64, -64, -64, -64, 64, 64, -64, 64, -64, 64, -64, -64, 64, 64, 64, -64, 64, 64, -64, -64, 64, -64, 64, 64, -64, 64, 64, -64, -64, -64, -64, -64, -64, 64, 64, 64, -64, -64, 64, -64, 64, 64, 64, -64, 64, -64, -64, 64, -64, -64, 64, 64, -64, -64, 64, -64, -64, 64, -64, -64, 64, -64, 64, 64, -64, -64, -64, -64, 64, 64, 64, 64, -64, 64, 64, -64, -64, -64, -64, -64, -64, 64, -64, -64, 64, 64, 64, -64, 64, 64, 64, -64, -64, -64, -64, -64, -64, 64, 64, 64, -64, 64, 64, -64, 64, -64, 64, -64, 64, -64, -64, -64, 64, 64, 64, 64, 64, 64, -64, 64, 64, -64, -64, 64, -64, 64, 64, -64, 64, 64, 64, 64, -64, -64, -64, -64, 64, 64, -64, -64, -64, 64, 64, -64, -64, 64, 64, -64, -64, 64, 64, -64, 64, -64, 64, -64, 64, 64, -64, -64, -64, -64, 64, 64, -64, -64, -64, -64, 64, -64, -64, 64, 64, -64, -64, 64, 64, -64, 64, 64, 64, -64, 64, -64, -64, -64, -64, -64, -64, 64, 64, -64, -64, 64, -64, 64, 64, 64, -64, -64, 64, -64, -64, 64, 64, -64, -64, -64, -64, -64, -64, 64, 64, -64, -64, -64, -64, -64, -64, -64, -64, -64, -64, -64, -64, 64, -64, 64, 64, 64, 64, 64, 64, -64, 64, -64, 64, -64, -64, -64, -64, -64, -64, -64, 64, 64, 64, -64, -64, 64, 64, -64, -64, -64, -64, -64, 64, -64, -64, -64, -64, -64, 64, -64, 64, -64, -64, -64, -64, 64, -64, -64, -64, 64, 64, -64, 64, 64, -64, -64, -64, -64, -64, -64, -64, -64, -64, -64, 64, -64, -64, 64, -64, -64, -64, -64, -64, -64, -64, -64, 64, 64, 64, 64, 64, -64, -64, 64, -64, -64, -64, -64, 64, -64, -64, 64, -64, -64, -64, 64, -64, -64, 64, 64, -64, -64, -64, -64, 64, -64, 64, -64, -64, -64, 64, -64, -64, -64, -64, 64, -64, 64, 64, -64, 64, 64, 64, 64, -64, 64, -64, -64, -64, -64, -64, 64, -64, 64, -64, -64, -64, -64, -64, -64, -64, -64, -64, 64, 64, 64, -64, 64, -64, 64, -64, -64, 64, 64, 64, -64, -64, 64, -64, 64, -64, 64, -64, -64, -64, -64, 64, -64, -64, -64, 64, 64, -64, 64, 64, 64, 64, 64, 64, -64, 64, 64, 64, -64, 64, -64, -64, 64, 64, -64, -64, -64, 64, -64, -64, 64, -64, -64, -64, -64, 64, 64, 64, -64, -64, 64, -64, -64, 64, 64, -64, 64, 64, -64, -64, -64, 64, -64, -64, -64, -64, 64, 64, 64, -64, -64, -64, -64, -64, -64, -64, 64, -64, -64, 64, 64, -64, -64, 64, 64, -64, 64, -64, -64, -64, -64, -64, -64, -64, -64, -64, 64, 64, 64, -64, 64, -64, 64, -64, 64, -64, 64, -64, -64, -64, -64, -64, -64, -64, 64, -64, 64, 64, 64, -64, -64, -64, -64, -64, -64, 64, 64, -64, -64, 64, -64, -64, -64, 64, 64, 64, 64, 64, -64, 64, -64, 64, -64, 64, 64, -64, -64, -64, -64, -64, 64, 64, -64, -64, 64, -64, -64, -64, 64, -64, -64, -64, 64, -64, 64, 64, -64, 64, -64, -64, 64, -64, -64, 64, -64, -64, -64, 64, 64, 64, 64, 64, 64, 64, -64, -64, 64, 64, -64, 64, -64, 64, -64, -64, -64, -64, -64, -64, -64, -64, -64, -64, -64, -64, 64, -64, 64, 64, -64, 64, 64, -64, -64, 64, 64, 64, 64, 64, -64, -64, 64, -64, -64, -64, -64, -64, 64, -64, 64, -64, -64, -64, -64, -64, 64, 64, 64, 64, 64, 64, 64, -64, 64, -64, 64, -64, -64, -64, 64, -64, 64, -64, -64, -64, -64, 64, 64, -64, 64, -64, 64, -64, 64, 64, 64, 64, 64, 64, 64, 64, 64, 64, -64, -64, -64, -64, 64, 64, 64, -64, -64, 64, -64, -64, -64, -64, -64, 64, -64, -64, -64, -64, 64, -64, 64, -64, 64, 64, -64, -64, -64, -64, 64, 64, 64, 64, 64, -64, -64, -64, -64, 64, -64, 64, 64, 64, -64, 64, 64, -64, 64, 64, -64, -64, -64, -64, 64, -64, -64, -64, -64, -64, -64, -64, -64, -64, 64, -64, 64, -64, -64, -64, -64, -64, -64, -64, -64, -64, -64, 64, -64, 64, 64, 64, -64, 64, -64, -64, 64, 64, -64, 64, 64, 64, -64, 64, -64, 64, 64, -64, 64, -64, 64, -64, 64, 64, -64, 64, 64, -64, 64, 64, -64, -64, -64, -64, -64, 64, 64, -64, 64, 64, 64, -64, 64, -64, 64, 64, 64, 64, 64, -64, -64, 64, 64, 64, 64, 64, -64, 64, 64, 64, -64, 64, 64, 64, -64, -64, -64, 64, -64, -64, -64, -64, 64, 64, -64, -64, 64, -64, 64, 64, 64, -64, 64, -64, 64, 64, 64, 64, 64, 64, -64, -64, 64, -64, 64, -64, -64, 64, -64, -64, -64, -64, 64, 64, 64, 64, 64, 64, 64, 64, -64, 64, -64, 64, -64, 64, -64, 64, -64, -64, -64, 64, 64, 64, -64, -64, -64, -64, -64, -64, -64, -64, 64, 64, 64, 64, 64, 64, 64, 64, -64, 64, 64, 64, -64, 64, 64, -64, 64, -64, -64, -64, -64, -64, -64, -64, -64, -64, -64, 64, 64, -64, 64, -64, 64, 64, 64, 64, -64, 64, 64, 64, 64, 64, -64, -64, -64, 64, -64, 64, 64, -64, -64, -64, -64, -64, 64, 64, 64, 64, 64, -64, 64, -64, -64, 64, 64, 64, 64, 64, 64, 64, 64, -64, -64, 64, 64, -64, 64, -64, -64, -64, -64, 64, 64, 64, 64, 64, 64, 64, 64, 64, -64, -64, 64, 64, 64, -64, -64, 64, 64, -64, -64, -64, -64, -64, -64, -64, -64, -64, -64, -64, 64, 64, -64, 64, 64, 64, 64, 64, 64, -64, -64, -64, -64, 64, 64, -64, 64, -64, -64, -64, 64, -64, -64, -64, -64, -64, -64, 64, -64, -64, 64, 64, 64, 64, -64, 64, 64, -64, 64, -64, 64, 64, 64, -64, -64, -64, -64, -64, -64, -64, -64, -64, -64, -64, -64, 64, 64, 64, 64, 64, 64, -64, 64, 64, 64, -64, -64, -64, 64, 64, 64, -64, 64, -64, 64, 64, 64, -64, -64, -64, -64, -64, -64, -64, 64, 64, 64, 64, 64, -64, 64, 64, 64, -64, -64, 64, 64, 64, 64, 64, 64, -64, 64, 64, -64, -64, -64, -64, -64, -64, -64, 64, 64, 64, 64, 64, 64, -64, -64, -64, -64, -64, -64, 64, 64, -64, -64, -64, 64, -64, -64, -64, -64, -64, -64, -64, -64, 64, 64, 64, 64, 64, -64, -64, -64, -64, -64, -64, -64, -64, -64, -64, -64, -64, -64, 64, 64, -64, -64, 64, -64, -64, -64, -64, -64, -64, 64, 64, 64, -64, 64, -64, -64, -64, -64, -64, -64, -64, -64, -64, -64, -64, -64, -64, -64, -64, 64, -64, -64, -64, -64, -64, -64, -64, 64, 64, 64, 64, 64, -64, -64, -64, -64, -64, -64, -64, -64, -64, -64, -64, -64, -64, 64, -64, 64, -64, 64, -64, -64, -64, -64, 64, 64, -64, 64, -64, 64, -64, -64, -64, 64, -64, -64, -64, -64, -64, -64, -64, -64, -64, -64, 64, -64, -64, -64, -64, -64, -64, -64, 64, 64, 64, 64, 64, 64, -64, 64, 64, 64, -64, -64, -64, -64, -64, -64, 64, -64, -64, -64, -64, 64, -64, -64, -64, -64, 64, 64, -64, -64, -64, -64, 64, -64, -64, 64, 64, -64, -64, -64, -64, -64, -64, -64, 64, 64, -64, -64, -64, 64, -64, -64, -64, -64, -64, -64, 64, 64, 64, -64, 64, 64, 64, 64, 64, 64, -64, -64, -64, -64, -64, -64, -64, -64, 64, 64, 64, 64, -64, -64, -64, -64, -64, -64, -64, -64, 64, 64, 64, -64, 64, 64, 64, 64, -64, -64, -64, 64, -64, -64, -64, -64, 64, -64, -64, 64, 64, 64, -64, -64, -64, -64, -64, -64, 64, 64, 64, 64, 64, 64, 64, 64, -64, -64, -64, -64, -64, 64, -64, -64, -64, -64, -64, 64, 64, 64, 64, 64, -64, -64, -64, -64, 64, 64, 64, 64, -64, 64, -64, -64, -64, -64, -64, -64, -64, -64, -64, -64, 64, 64, 64, 64, 64, 64, 64, 64, -64, -64, -64, -64, 64, 64, 64, 64, 64, -64, -64, -64, -64, -64, -64, -64, -64, 64, 64, -64, -64, 64, -64, 64, -64, -64, -64, -64, -64, -64, -64, -64, -64, 64, 64, 64, 64, 64, 64, -64, -64, -64, -64, -64, -64, 64, -64, -64, 64, -64, -64, -64, 64, -64, -64, -64, -64, 64, 64, 64, 64, 64, 64, 64, 64, 64, 64, 64, 64, 64, -64, 64, -64, -64, 64, -64, 64, 64, 64, 64, -64, 64, 64, 64, 64, 64, 64, 64, 64, 64, 64, -64, -64, 64, 64, 64, -64, 64, -64, 64, -64, -64, -64, 64, 64, -64, 64, 64, 64, 64, 64, 64, -64, 64, 64, -64, -64, -64, 64, 64, 64, -64, -64, 64, 64, -64, -64, 64, -64, 64, -64, 64, 64, -64, 64, -64, -64, 64, -64, -64, -64, 64, -64, -64, 64, -64, 64, -64, 64, -64, 64, -64, -64, 64, 64, -64, -64, 64, -64, 64, 64, 64, -64, 64, 64, -64, 64, 64, -64, -64, 64, -64, -64, 64, -64, -64, 64, 64, 64, 64, -64, -64, -64, -64, -64, -64, -64, -64, -64, -64, -64, 64, 64, 64, 64, 64, -64, 64, -64, -64, -64, 64, 64, 64, 64, 64, 64, 64, -64, -64, -64, -64, -64, 64, 64, -64, -64, -64, -64, 64, 64, -64, 64, -64, -64, -64, 64, 64, 64, -64, 64, 64, 64, 64, -64, -64, -64, -64, -64, -64, -64, -64, -64, 64, -64, -64, 64, -64, -64, 64, -64, 64, -64, -64, 64, 64, 64, 64, -64, 64, -64, -64, 64, -64, -64, -64, -64, -64, -64, -64, -64, -64, 64, -64, 64, 64, 64, -64, 64, -64, 64, -64, -64, 64, -64, 64, 64, 64, 64, 64, -64, -64, -64, -64, -64, -64, -64, -64, -64, 64, -64, 64, -64, -64, -64, -64, -64, 64, -64, -64, -64, -64, -64, 64, -64, 64, 64, -64, -64, -64, -64, -64, -64, 64, -64, 64, -64, -64, -64, -64, 64, 64, 64, -64, 64, -64, -64, -64, -64, -64, -64, -64, 64, 64, -64, -64, -64, -64, -64, -64, -64, -64, -64, -64, -64, 64, 64, 64, -64, 64, 64, -64, -64, -64, -64, -64, -64, -64, -64, 64, 64, -64, -64, -64, 64, -64, -64, -64, -64, -64, -64, 64, -64, -64, 64, 64, 64, 64, 64, -64, -64, -64, -64, -64, -64, -64, -64, 64, 64, 64, 64, -64, 64, -64, -64, -64, -64, 64, -64, 64, -64, 64, 64, -64, -64, 64, -64, -64, 64, -64, -64, -64, -64, -64, -64, -64, 64, 64, 64, 64, -64, -64, -64, 64, 64, -64, 64, 64, -64, -64, -64, -64, 64, 64, -64, -64, -64, -64, -64, -64, -64, -64, -64, 64, 64, 64, 64, 64, -64, -64, -64, -64, -64, 64, 64, 64, 64, 64, 64, -64, 64, 64, -64, 64, -64, -64, -64, -64, -64, -64, -64, -64, 64, 64, 64, 64, -64, -64, -64, -64, -64, -64, -64, -64, 64, -64, -64, -64, -64, -64, 64, -64, -64, -64, -64, -64, -64, -64, -64, 64, 64, -64, -64, -64, -64, -64, -64, -64, -64, -64, -64, -64, -64, 64, -64, 64, -64, 64, 64, -64, -64, 64, -64, -64, -64, 64, 64, 64, 64, 64, -64, 64, -64, -64, -64, -64, -64, -64, -64, -64, 64, 64, -64, -64, 64, 64, 64, -64, -64, -64, -64, -64, -64, 64, -64, -64, 64, 64, 64, -64, -64, -64, -64, -64, -64, -64, -64, -64, -64, 64, -64, 64, -64, -64, -64, 64, -64, 64, 64, 64, -64, -64, -64, -64, -64, -64, 64, 64, -64, -64, -64, -64, -64, -64, -64, -64, 64, -64, 64, 64, -64, 64, -64, -64, 64, 64, 64, 64, -64, -64, -64, -64, 64, 64, -64, -64, -64, -64, -64, -64, -64, -64, -64, -64, -64, -64, -64, 64, -64, 64, 64, -64, -64, 64, 64, 64, 64, -64, 64, -64, 64, 64, -64, 64, -64, 64, 64, 64, 64, 64, -64, -64, 64, -64, 64, -64, -64, 64, 64, -64, -64, -64, 64, 64, 64, -64, -64, 64, 64, 64, 64, 64, 64, -64, 64, -64, 64, -64, 64, 64, 64, 64, 64, 64, -64, 64, -64, -64, -64, -64, 64, -64, -64, 64, -64, -64, 64, -64, -64, -64, -64, -64, 64, -64, 64, 64, 64, 64, 64, 64, 64, 64, -64, -64, 64, -64, -64, -64, -64, -64, -64, -64, -64, -64, -64, 64, 64, -64, -64, 64, 64, 64, 64, 64, 64, 64, -64, -64, -64, 64, 64, 64, 64, -64, -64, 64, -64, -64, -64, -64, -64, -64, 64, -64, -64, -64, 64, -64, 64, 64, 64, 64, 64, 64, 64, 64, 64, 64, -64, -64, 64, 64, 64, -64, -64, -64, -64, -64, -64, -64, -64, -64, -64, -64, -64, 64, -64, -64, 64, 64, -64, 64, -64, -64, -64, 64, -64, -64, -64, 64, 64, -64, -64, -64, -64, -64, -64, -64, 64, -64, -64, -64, -64, 64, -64, 64, 64, 64, -64, -64, 64, 64, 64, -64, 64, 64, -64, -64, 64, -64, -64, -64, -64, -64, -64, -64, -64, -64, -64, -64, -64, -64, -64, -64, -64, 64, -64, -64, 64, -64, 64, 64, 64, -64, -64, 64, 64, -64, -64, -64, 64, -64, -64, -64, -64, -64, -64, -64, -64, -64, 64, -64, 64, -64, 64, 64, 64, 64, -64, -64, -64, 64, -64, -64, -64, -64, -64, -64, -64, -64, 64, 64, 64, 64, -64, 64, -64, 64, 64, 64, -64, -64, -64, -64, 64, -64, 64, 64, 64, 64, 64, 64, 64, 64, 64, 64, 64, -64, 64, -64, -64, -64, 64, 64, -64, 64, -64, -64, -64, -64, -64, -64, -64, -64, 64, 64, 64, -64, 64, -64, 64, 64, -64, 64, -64, -64, -64, -64, -64, -64, 64, -64, -64, 64, 64, -64, 64, -64, -64, 64, -64, -64, -64, -64, -64, 64, -64, -64, 64, 64, 64, 64, 64, 64, -64, 64, -64, -64, 64, -64, -64, 64, 64, 64, 64, 64, 64, -64, -64, -64, -64, 64, 64, -64, -64, -64, -64, -64, 64, -64, -64, -64, 64, 64, 64, 64, 64, 64, -64, 64, 64, -64, 64, 64, -64, -64, 64, 64, 64, 64, 64, 64, 64, 64, -64, -64, -64, -64, -64, 64, 64, -64, -64, -64, 64, 64, 64, 64, 64, 64, -64, 64, -64, -64, 64, -64, 64, -64, -64, 64, -64, 64, -64, -64, 64, 64, -64, -64, 64, -64, 64, 64, 64, -64, 64, 64, 64, -64, 64, -64, -64, -64, 64, 64, 64, -64, 64, 64, -64, 64, 64, -64, -64, 64, -64, 64, 64, 64, -64, -64, -64, -64, -64, 64, 64, 64, 64, 64, -64, 64, -64, 64, 64, -64, 64, -64, -64, 64, 64, 64, -64, 64, 64, -64, 64, 64, -64, 64, 64, 64, -64, 64, 64, -64, -64, 64, 64, -64, -64, 64, -64, -64, -64, -64, 64, 64, 64, -64, 64, 64, 64, 64, 64, 64, 64, 64, -64, -64, 64, 64, 64, 64, 64, -64, -64, 64, 64, -64, 64, 64, 64, -64, 64, 64, -64, -64, 64, 64, 64, 64, 64, -64, -64, 64, 64, 64, 64, 64, 64, -64, 64, -64, 64, 64, -64, 64, 64, -64, 64, 64, -64, 64, -64, -64, 64, 64, -64, -64, 64, 64, -64, -64, 64, -64, 64, -64, 64, 64, 64, 64, 64, -64, -64, -64, -64, -64, -64, -64, 64, 64, -64, 64, 64, -64, -64, 64, -64, 64, -64, 64, 64, 64, 64, 64, 64, 64, -64, -64, 64, -64, -64, 64, -64, 64, -64, 64, 64, 64, 64, -64, 64, 64, -64, -64, -64, -64, -64, -64, 64, -64, 64, 64, 64, 64, 64, -64, 64, -64, 64, -64, -64, 64, -64, 64, 64, 64, 64, 64, 64, 64, 64, 64, 64, 64, 64, 64, 64, 64, 64, 64, 64, 64, 64, -64, 64, -64, 64, 64, 64, -64, -64, 64, 64, 64, 64, 64, 64, 64, 64, 64, 64, 64, -64, 64, -64, 64, 64, 64, 64, 64, -64, -64, -64, 64, -64, -64, 64, 64, 64, 64, -64, -64, 64, 64, -64, 64, -64, 64, -64, 64, -64, 64, 64, 64, -64, -64, -64, -64, 64, -64, 64, 64, -64, 64, 64, 64, 64, 64, -64, -64, 64, -64, 64, 64, -64, 64, 64, 64, 64, 64, 64, 64, 64, 64, 64, 64, 64, 64, -64, 64, -64, -64, 64, -64, -64, -64, -64, -64, -64, 64, -64, 64, 64, -64, 64, -64, 64, 64, 64, 64, -64, 64, -64, 64, 64, -64, 64, 64, -64, 64, -64, -64, 64, -64, 64, -64, -64, -64, 64, -64, 64, -64, 64, 64, -64, 64, -64, 64, -64, 64, 64, -64, -64, 64, -64, -64, 64, -64, -64, -64, 64, 64, 64, 64, -64, 64, 64, 64, 64, 64, 64, 64, -64, 64, 64, 64, -64, 64, 64, -64, 64, -64, -64, 64, 64, 64, -64, -64, 64, 64, 64, -64, 64, 64, -64, 64, -64, 64, 64, -64, 64, 64, 64, 64, 64, 64, -64, -64, 64, -64, -64, -64, 64, -64, 64, 64, 64, -64, -64, 64, -64, -64, -64, 64, -64, -64, -64, 64, 64, 64, 64, 64, 64, -64, -64, -64, 64, -64, -64, -64, 64, -64, -64, 64, -64, 64, 64, 64, -64, 64, 64, -64, 64, -64, -64, -64, 64, 64, -64, 64, 64, -64, 64, -64, 64, 64, -64, 64, -64, -64, 64, -64, 64, 64, -64, 64, 64, 64, -64, -64, 64, 64, -64, 64, 64, -64, 64, 64, -64, -64, -64, 64, -64, -64, 64, -64, -64, -64, -64, 64, 64, 64, -64, -64, 64, 64, 64, 64, -64, -64, 64, 64, 64, -64, -64, 64, 64, 64, 64, 64, 64, -64, -64, -64, 64, 64, -64, 64, 64, 64, 64, -64, 64, -64, -64, -64, 64, 64, -64, 64, 64, 64, -64, -64, 64, -64, -64, -64, -64, -64, 64, -64, 64, -64, -64, -64, 64, -64, 64, -64, -64, 64, -64, 64, 64, -64, -64, 64, 64, -64, 64, -64, 64, 64, 64, 64, 64, -64, 64, -64, -64, 64, 64, 64, 64, 64, -64, 64, 64, 64, 64, 64, 64, 64, -64, -64, 64, 64, 64, 64, 64, -64, 64, -64, -64, 64, -64, -64, 64, -64, -64, -64, -64, -64, -64, -64, 64, 64, -64, -64, 64, -64, -64, -64, 64, -64, 64, -64, 64, 64, 64, 64, -64, -64, 64, 64, -64, 64, -64, 64, 64, -64, -64, -64, -64, -64, 64, -64, 64, 64, -64, -64, -64, -64, -64, 64, -64, 64, 64, -64, 64, 64, 64, 64, 64, 64, 64, -64, 64, 64, -64, -64, 64, 64, -64, -64, 64, -64, -64, 64, -64, 64, 64, 64, -64, -64, -64, -64, -64, -64, 64, 64, 64, -64, 64, 64, 64, -64, -64, -64, 64, 64, -64, 64, -64, -64, 64, -64, -64, 64, 64, 64, 64, 64, 64, 64, 64, -64, 64, 64, 64, 64, 64, -64, 64, 64, -64, -64, 64, -64, -64, -64, -64, -64, -64, -64, 64, 64, 64, 64, -64, -64, 64, 64, 64, 64, 64, 64, 64, 64, 64, 64, -64, -64, -64, -64, 64, -64, -64, -64, -64, -64, -64, -64, 64, -64, -64, -64, -64, -64, 64, 64, 64, -64, -64, -64, -64, 64, 64, 64, 64, -64, -64, -64, -64, -64, -64, 64, 64, -64, 64, 64, -64, -64, 64, -64, 64, -64, 64, 64, -64, -64, -64, -64, -64, 64, -64, 64, -64, 64, -64, -64, 64, 64, -64, 64, 64, 64, 64, 64, 64, 64, -64, 64, 64, 64, 64, 64, -64, -64, -64, 64, 64, 64, 64, -64, -64, 64, -64, -64, 64, -64, -64, -64, -64, -64, 64, 64, -64, 64, 64, -64, 64, 64, -64, 64, -64, 64, 64, 64, 64, 64, 64, -64, 64, -64, -64, -64, -64, -64, -64, -64, -64, 64, -64, 64, -64, 64, 64, 64, 64, 64, 64, 64, 64, 64, 64, 64, 64, 64, 64, -64, 64, 64, -64, -64, 64, -64, -64, -64, -64, -64, -64, -64, 64, 64, 64, -64, -64, 64, 64, 64, 64, 64, 64, 64, 64, 64, -64, 64, 64, -64, -64, 64, -64, 64, 64, -64, -64, -64, -64, 64, 64, 64, 64, 64, 64, 64, 64, 64, 64, -64, -64, 64, 64, 64, 64, 64, -64, 64, -64, -64, -64, 64, 64, -64, -64, -64, -64, 64, 64, 64, 64, 64, 64, 64, 64, 64, -64, 64, 64, 64, 64, 64, 64, 64, -64, -64, -64, -64, -64, 64, -64, -64, -64, -64, -64, -64, 64, 64, 64, 64, 64, 64, 64, -64, -64, -64, -64, 64, -64, 64, -64, 64, -64, 64, 64, -64, -64, 64, -64, -64, -64, -64, 64, -64, 64, 64, -64, 64, -64, 64, 64, 64, -64, -64, -64, -64, -64, 64, -64, -64, 64, 64, 64, 64, -64, -64, -64, -64, -64, -64, 64, 64, -64, -64, 64, 64, 64, 64, 64, 64, -64, -64, -64, -64, -64, 64, -64, 64, 64, -64, 64, 64, -64, -64, -64, -64, -64, -64, 64, -64, -64, -64, -64, 64, 64, 64, 64, -64, -64, -64, -64, -64, -64, -64, -64, -64, -64, 64, 64, -64, 64, -64, 64, -64, -64, -64, -64, -64, -64, 64, -64, 64, 64, -64, 64, -64, -64, -64, -64, -64, 64, -64, -64, -64, -64, 64, 64, 64, -64, 64, 64, -64, 64, -64, -64, -64, 64, 64, 64, 64, 64, 64, -64, -64, -64, -64, -64, 64, -64, 64, -64, -64, -64, -64, 64, -64, 64, 64, 64, 64, 64, 64, -64, 64, 64, 64, 64, 64, 64, 64, -64, -64, -64, -64, -64, 64, 64, -64, 64, 64, -64, 64, -64, 64, 64, 64, 64, 64, 64, 64, 64, -64, 64, 64, 64, 64, 64, -64, -64, -64, -64, -64, -64, -64, 64, 64, -64, 64, 64, 64, -64, -64, 64, 64, 64, -64, 64, 64, 64, 64, -64, -64, 64, 64, -64, -64, -64, -64, -64, -64, -64, -64, -64, -64, 64, -64, 64, 64, 64, 64, 64, 64, 64, 64, 64, 64, 64, 64, -64, -64, -64, -64, -64, -64, -64, -64, -64, -64, -64, 64, -64, -64, 64, 64, 64, -64, 64, 64, 64, 64, 64, -64, 64, 64, -64, -64, -64, -64, -64, -64, -64, -64, -64, -64, -64, -64, 64, 64, 64, 64, -64, 64, -64, 64, 64, 64, 64, 64, 64, 64, 64, 64, 64, 64, 64, -64, -64, -64, -64, -64, -64, -64, -64, -64, -64, 64, 64, -64, -64, -64, -64, 64, 64, 64, 64, 64, 64, 64, -64, 64, 64, 64, 64, 64, 64, 64, 64, 64, -64, -64, -64, 64, 64, 64, 64, 64, -64, 64, -64, -64, -64, -64, 64, 64, 64, 64, 64, 64, 64, 64, 64, 64, 64, 64, 64, 64, 64, 64, 64, 64, -64, 64, -64, 64, -64, -64, -64, -64, 64, -64, -64, 64, -64, -64, -64, 64, -64, 64, 64, 64, -64, -64, -64, 64, 64, 64, -64, -64, 64, 64, -64, 64, -64, -64, 64, -64, 64, -64, 64, 64, 64, -64, -64, 64, 64, 64, 64, -64, -64, 64, 64, 64, 64, 64, -64, -64, 64, 64, -64, -64, 64, 64, 64, -64, -64, 64, -64, -64, 64, -64, 64, -64, -64, 64, -64, 64, 64, -64, 64, 64, 64, 64, 64, -64, -64, 64, 64, 64, -64, -64, 64, 64, -64, -64, 64, 64, -64, 64, 64, -64, -64, 64, -64, 64, 64, -64, -64, -64, 64, -64, 64, -64, 64, 64, -64, 64, 64, -64, 64, -64, -64, -64, -64, 64, 64, 64, 64, 64, 64, 64, 64, 64, -64, -64, -64, -64, 64, -64, -64, -64, -64, 64, -64, 64, 64, -64, 64, -64, 64, 64, 64, 64, 64, 64, 64, -64, -64, 64, -64, -64, -64, 64, -64, -64, 64, -64, -64, 64, -64, -64, -64, -64, 64, 64, 64, -64, 64, -64, -64, -64, 64, 64, -64, -64, -64, 64, -64, 64, -64, -64, -64, 64, 64, 64, 64, -64, 64, 64, 64, 64, 64, -64, -64, -64, 64, 64, 64, 64, 64, 64, 64, -64, 64, -64, 64, 64, 64, -64, -64, 64, 64, -64, 64, 64, 64, -64, -64, 64, -64, -64, -64, -64, -64, 64, -64, 64, 64, 64, 64, 64, -64, -64, -64, -64, 64, 64, -64, -64, 64, 64, -64, -64, 64, -64, -64, 64, -64, 64, -64, 64, -64, 64, -64, -64, 64, 64, -64, 64, 64, -64, -64, -64, 64, 64, 64, 64, 64, 64, 64, -64, 64, 64, -64, -64, -64, 64, 64, 64, -64, -64, -64, -64, -64, 64, 64, 64, 64, 64, 64, 64, 64, 64, 64, 64, 64, 64, 64, 64, 64, 64, -64, 64, 64, -64, -64, -64, 64, -64, -64, 64, 64, 64, -64, 64, 64, -64, 64, 64, 64, 64, 64, 64, 64, 64, 64, 64, 64, 64, -64, 64, 64, 64, -64, -64, -64, -64, 64, -64, 64, 64, 64, -64, -64, -64, 64, -64, 64, -64, 64, 64, 64, 64, 64, 64, 64, 64, 64, 64, -64, -64, 64, -64, -64, -64, 64, 64, 64, 64, 64, 64, -64, 64, 64, 64, 64, -64, -64, -64, 64, 64, 64, 64, 64, 64, -64, -64, 64, 64, -64, 64, -64, -64, 64, -64, 64, -64, 64, -64, 64, -64, 64, -64, -64, -64, -64, -64, -64, 64, 64, 64, 64, 64, 64, 64, 64, 64, -64, 64, 64, -64, 64, -64, 64, -64, 64, 64, 64, -64, -64, -64, 64, -64, -64, -64, -64, -64, -64, 64, 64, 64, 64, -64, 64, 64, 64, -64, 64, 64, 64, 64, 64, 64, 64, 64, 64, 64, 64, 64, 64, 64, -64, 64, -64, -64, -64, -64, 64, 64, 64, -64, -64, 64, 64, -64, -64, 64, 64, 64, 64, 64, 64, 64, 64, 64, 64, 64, 64, 64, 64, -64, -64, -64, -64, -64, 64, 64, 64, 64, -64, -64, -64, 64, -64, 64, -64, 64, 64, 64, 64, 64, 64, 64, 64, 64, 64, 64, -64, 64, -64, -64, -64, -64, -64, 64, 64, -64, -64, -64, 64, 64, -64, -64, 64, 64, 64, 64, 64, 64, 64, 64, 64, 64, 64, 64, -64, 64, -64, -64, -64, -64, 64, 64, 64, 64, 64, 64, 64, -64, -64, -64, -64, 64, 64, 64, 64, 64, 64, 64, 64, 64, 64, 64, 64, -64, -64, -64, -64, -64, 64, 64, 64, -64, 64, 64, 64, -64, -64, -64, -64, 64, -64, -64, 64, 64, 64, 64, 64, -64, -64, 64, -64, 64, -64, -64, 64, -64, -64, 64, 64, 64, 64, -64, -64, 64, -64, -64, -64, -64, -64, -64, -64, -64, 64, -64, -64, 64, -64, -64, -64, -64, -64, -64, 64, 64, -64, -64, 64, 64, 64, -64, 64, 64, -64, -64, -64, -64, 64, -64, -64, -64, -64, 64, -64, -64, -64, -64, 64, 64, -64, -64, 64, 64, 64, -64, -64, -64, 64, 64, -64, -64, 64, -64, 64, -64, 64, 64, -64, 64, 64, -64, 64, -64, 64, 64, 64, -64, 64, 64, 64, 64, -64, -64, -64, -64, -64, 64, -64, -64, -64, -64, 64, -64, 64, -64, -64, 64, 64, 64, -64, -64, -64, -64, -64, 64, 64, 64, 64, 64, 64, 64, 64, -64, -64, -64, 64, -64, 64, -64, -64, -64, -64, -64, -64, -64, -64, -64, -64, 64, 64, 64, 64, 64, 64, 64, 64, 64, 64, -64, 64, -64, 64, 64, 64, -64, 64, -64, 64, -64, 64, -64, -64, 64, 64, 64, 64, 64, 64, -64, 64, 64, 64, 64, 64, 64, -64, 64, 64, -64, -64, -64, 64, -64, -64, 64, -64, 64, -64, 64, 64, -64, -64, -64, -64, 64, -64, 64, 64, 64, 64, 64, 64, -64, 64, 64, 64, -64, 64, 64, 64, -64, -64, -64, 64, -64, -64, -64, 64, 64, -64, 64, -64, 64, 64, 64, -64, -64, 64, 64, 64, 64, -64, -64, 64, 64, -64, 64, 64, 64, 64, -64, 64, 64, 64, -64, 64, -64, -64, -64, 64, 64, 64, -64, 64, 64, -64, -64, -64, -64, 64, -64, 64, -64, 64, 64, -64, 64, 64, 64, -64, -64, -64, -64, -64, -64, -64, -64, -64, -64, -64, -64, -64, 64, -64, -64, -64, -64, -64, 64, -64, 64, -64, 64, 64, 64, 64, 64, 64, 64, -64, 64, -64, -64, -64, -64, -64, -64, -64, -64, -64, 64, -64, 64, -64, -64, -64, 64, -64, 64, -64, 64, 64, -64, -64, 64, 64, 64, 64, 64, 64, -64, -64, -64, -64, -64, -64, -64, 64, 64, 64, 64, 64, 64, 64, 64, 64, 64, 64, -64, -64, -64, 64, 64, 64, -64, 64, 64, 64, 64, 64, -64, -64, 64, 64, 64, 64, 64, 64, 64, -64, -64, -64, -64, -64, -64, -64, -64, 64, 64, -64, 64, 64, 64, -64, 64, 64, -64, -64, -64, -64, 64, 64, 64, 64, 64, 64, 64, -64, -64, -64, -64, -64, 64, -64, 64, 64, 64, 64, 64, 64, 64, 64, 64, 64, -64, 64, -64, 64, 64, 64, 64, 64, 64, 64, -64, -64, -64, -64, -64, 64, -64, 64, 64, 64, -64, -64, 64, 64, -64, 64, 64, 64, -64, 64, 64, 64, 64, 64, 64, 64, 64, -64, -64, -64, 64, -64, 64, 64, 64, -64, -64, -64, 64, -64, -64, 64, -64, -64, 64, -64, 64, 64, 64, 64, 64, 64, 64, 64, 64, -64, 64, -64, -64, 64, 64, 64, 64, 64, -64, 64, 64, -64, 64, 64, 64, 64, 64, 64, 64, 64, 64, 64, 64, 64, 64, -64, 64, 64, 64, -64, 64, 64, 64, 64, -64, 64, 64, 64, -64, 64, 64, 64, 64, 64, 64, 64, -64, 64, 64, 64, 64, 64, 64, 64, 64, 64, 64, 64, 64, 64, 64, 64, 64, -64, 64, -64, -64, -64, 64, 64, 64, 64, -64, 64, 64, 64, 64, 64, 64, 64, -64, 64, 64, 64, 64, 64, 64, 64, 64, 64, 64, 64, 64, 64, -64, -64, -64, 64, 64, 64, -64, 64, 64, 64, 64, 64, 64, 64, 64, 64, 64, 64, 64, 64, 64, -64, 64, -64, 64, 64, -64, -64, 64, 64, 64, 64, 64, 64, 64, 64, -64, 64, 64, 64, 64, 64, 64, 64, 64, 64, -64, 64, 64, 64, 64, -64, -64, -64, 64, -64, -64, -64, 64, -64, 64, 64, 64, -64, 64, -64, 64, 64, -64, -64, -64, 64, -64, 64, -64, 64, 64, 64, -64, 64, 64, -64, -64, -64, -64, -64, 64, 64, -64, 64, -64, 64, 64, -64, -64, 64, -64, -64, -64, 64, 64, 64, -64, -64, 64, 64, -64, 64, -64, -64, 64, -64, -64, 64, 64, 64, -64, 64, -64, -64, 64, 64, 64, 64, 64, 64, 64, 64, 64, 64, 64, -64, 64, 64, 64, -64, -64, -64, 64, -64, -64, 64, 64, 64, -64, -64, -64, 64, -64, -64, -64, -64, -64, -64, 64, 64, 64, 64, -64, -64, 64, 64, -64, -64, -64, 64, 64, 64, 64, 64, 64, 64, 64, 64, -64, -64, -64, -64, -64, 64, 64, -64, 64, 64, 64, 64, 64, -64, 64, 64, -64, 64, 64, 64, 64, -64, 64, 64, 64, 64, 64, 64, -64, 64, -64, -64, -64, -64, -64, 64, -64, 64, 64, 64, 64, -64, -64, -64, 64, 64, 64, -64, 64, -64, 64, -64, 64, 64, -64, 64, 64, 64, -64, -64, 64, -64, 64, 64, 64, -64, -64, -64, -64, -64, -64, -64, -64, -64, -64, -64, 64, 64, 64, 64, -64, -64, 64, -64, -64, 64, -64, 64, 64, 64, -64, -64, 64, -64, -64, -64, -64, -64, -64, -64, -64, 64, -64, 64, 64, 64, 64, 64, -64, -64, -64, -64, 64, 64, 64, 64, 64, 64, 64, 64, 64, 64, 64, 64, -64, -64, -64, -64, 64, -64, 64, -64, 64, -64, 64, 64, -64, -64, -64, 64, -64, -64, 64, -64, 64, -64, 64, 64, 64, 64, 64, -64, -64, -64, 64, -64, -64, -64, 64, -64, 64, -64, -64, -64, 64, 64, 64, 64, 64, 64, 64, 64, 64, 64, 64, 64, 64, 64, 64, 64, -64, -64, -64, -64, -64, 64, -64, -64, 64, 64, 64, -64, 64, 64, -64, -64, -64, -64, -64, 64, 64, 64, 64, 64, 64, -64, 64, 64, 64, 64, 64, -64, -64, -64, -64, 64, -64, 64, -64, -64, -64, -64, 64, -64, 64, 64, -64, -64, -64, -64, 64, -64, 64, 64, -64, 64, -64, 64, 64, -64, -64, -64, -64, 64, 64, -64, 64, -64, -64, -64, 64, -64, -64, -64, -64, 64, 64, -64, 64, -64, -64, -64, -64, -64, 64, -64, 64, 64, 64, 64, 64, -64, -64, -64, 64, 64, 64, -64, 64, 64, 64, 64, 64, -64, -64, -64, -64, 64, 64, 64, 64, -64, 64, -64, 64, -64, -64, 64, 64, -64, -64, -64, -64, 64, -64, -64, 64, -64, 64, 64, 64, 64, 64, 64, 64, 64, 64, 64, 64, 64, 64, 64, -64, -64, 64, 64, 64, 64, -64, -64, 64, -64, 64, -64, -64, 64, 64, -64, 64, 64, 64, 64, 64, 64, 64, 64, 64, 64, 64, -64, 64, 64, 64, -64, 64, 64, -64, 64, 64, 64, 64, -64, 64, 64, -64, -64, -64, -64, -64, 64, 64, 64, 64, 64, 64, 64, -64, 64, -64, 64, -64, -64, 64, 64, -64, 64, 64, 64, -64, -64, -64, -64, -64, -64, -64, -64, -64, -64, -64, -64, -64, 64, -64, -64, -64, -64, -64, -64, -64, 64, 64, -64, 64, 64, 64, -64, -64, -64, -64, -64, -64, -64, -64, -64, 64, 64, 64, 64, -64, -64, -64, -64, -64, -64, 64, -64, -64, -64, 64, -64, -64, -64, 64, 64, -64, -64, -64, -64, -64, -64, -64, -64, 64, 64, 64, 64, -64, -64, -64, -64, 64, 64, 64, 64, -64, 64, -64, -64, 64, 64, -64, 64, 64, -64, -64, 64, -64, 64, -64, -64, 64, 64, 64, 64, 64, 64, -64, -64, 64, 64, 64, 64, -64, 64, -64, -64, 64, 64, -64, -64, -64, 64, 64, -64, -64, 64, -64, 64, 64, 64, 64, 64, 64, 64, 64, 64, 64, 64, 64, 64, -64, -64, 64, -64, -64, 64, 64, -64, -64, 64, -64, 64, 64, 64, 64, 64, 64, 64, 64, 64, 64, -64, -64, -64, 64, 64, -64, -64, -64, 64, 64, 64, -64, -64, 64, -64, 64, 64, 64, 64, -64, -64, -64, 64, 64, 64, 64, -64, -64, -64, -64, -64, 64, -64, -64, -64, -64, -64, 64, -64, -64, -64, 64, 64, -64, 64, 64, -64, -64, -64, -64, -64, -64, -64, -64, -64, -64, -64, -64, 64, 64, -64, -64, 64, 64, -64, 64, -64, -64, -64, 64, -64, -64, -64, -64, -64, -64, -64, -64, -64, -64, -64, -64, -64, 64, -64, -64, -64, -64, -64, -64, 64, 64, -64, 64, -64, 64, 64, 64, -64, -64, -64, -64, -64, -64, 64, -64, -64, -64, -64, -64, 64, -64, -64, -64, 64, -64, -64, 64, 64, 64, 64, 64, -64, 64, -64, -64, -64, -64, 64, -64, -64, -64, -64, -64, -64, -64, -64, -64, -64, -64, 64, -64, -64, 64, -64, -64, 64, 64, 64, 64, 64, -64, 64, -64, -64, -64, 64, 64, 64, -64, -64, -64, -64, -64, -64, -64, 64, -64, 64, 64, -64, 64, 64, 64, 64, 64, 64, 64, 64, -64, -64, -64, -64, 64, 64, 64, 64, 64, 64, -64, -64, -64, -64, -64, 64, 64, 64, 64, 64, 64, 64, 64, 64, 64, 64, 64, 64, 64, 64, 64, 64, 64, 64, 64, 64, 64, -64, -64, -64, -64, -64, 64, 64, -64, 64, 64, -64, -64, 64, 64, 64, 64, -64, -64, -64, 64, -64, -64, -64, 64, 64, 64, 64, 64, -64, -64, 64, -64, 64, 64, -64, -64, 64, 64, -64, 64, 64, 64, 64, 64, 64, 64, 64, -64, 64, -64, 64, 64, 64, 64, 64, 64, 64, 64, 64, 64, 64, 64, -64, -64, 64, -64, 64, 64, 64, -64, -64, 64, -64, 64, 64, 64, -64, 64, 64, 64, 64, 64, 64, 64, 64, 64, 64, 64, 64, -64, -64, -64, -64, -64, -64, 64, -64, 64, 64, -64, 64, -64, -64, 64, -64, 64, 64, 64, 64, 64, 64, -64, 64, -64, -64, 64, -64, -64, -64, -64, -64, -64, -64, 64, -64, -64, -64, -64, 64, 64, -64, -64, 64, -64, 64, 64, 64, 64, -64, -64, -64, -64, -64, -64, -64, -64, -64, -64, 64, -64, -64, 64, -64, -64, -64, 64, -64, -64, -64, -64, -64, 64, -64, 64, -64, -64, 64, -64, -64, -64, 64, -64, -64, -64, 64, 64, -64, 64, -64, 64, 64, 64, -64, 64, 64, -64, -64, 64, 64, 64, 64, -64, 64, -64, 64, -64, -64, -64, -64, -64, -64, 64, 64, 64, 64, 64, -64, 64, 64, 64, 64, -64, -64, 64, 64, -64, 64, -64, 64, 64, -64, 64, 64, 64, 64, -64, 64, -64, 64, 64, 64, 64, 64, 64, 64, 64, -64, 64, 64, -64, 64, 64, 64, -64, -64, -64, 64, -64, 64, 64, 64, 64, 64, 64, 64, -64, 64, -64, 64, 64, 64, 64, 64, -64, 64, 64, 64, -64, -64, 64, 64, -64, 64, 64, -64, -64, 64, 64, 64, 64, 64, -64, 64, -64, 64, -64, -64, -64, 64, 64, -64, 64, 64, 64, 64, -64, -64, 64, 64, -64, 64, -64, -64, -64, -64, 64, -64, 64, 64, 64, 64, 64, 64, -64, 64, -64, -64, 64, 64, -64, -64, 64, 64, 64, -64, -64, 64, -64, 64, 64, -64, 64, -64, -64, 64, 64, 64, 64, 64, 64, -64, -64, 64, -64, 64, -64, -64, 64, 64, -64, 64, -64, -64, 64, -64, -64, 64, -64, 64, 64, 64, -64, 64, -64, -64, 64, -64, -64, 64, -64, 64, 64, -64, 64, -64, 64, -64, -64, -64, 64, -64, -64, 64, 64, 64, -64, 64, 64, 64, 64, -64, 64, -64, -64, -64, 64, -64, -64, -64, 64, -64, -64, 64, -64, 64, -64, -64, 64, 64, -64, 64, -64, -64, 64, 64, 64, 64, -64, -64, 64, -64, 64, -64, -64, -64, -64, -64, 64, 64, -64, 64, -64, -64, -64, -64, 64, 64, -64, 64, -64, -64, 64, -64, -64, -64, 64, 64, 64, -64, -64, -64, -64, -64, -64, -64, 64, 64, -64, -64, -64, -64, -64, 64, -64, -64, -64, 64, 64, 64, 64, -64, 64, -64, 64, -64, 64, -64, 64, 64, -64, -64, -64, 64, -64, -64, -64, 64, -64, -64, -64, 64, 64, -64, -64, 64, 64, -64, -64, -64, 64, -64, 64, -64, 64, -64, -64, 64, -64, 64, -64, -64, -64, 64, -64, -64, -64, 64, 64, 64, -64, 64, 64, -64, -64, 64, -64, 64, 64, 64, -64, -64, -64, -64, -64, 64, -64, 64, -64, -64, 64, 64, -64, -64, 64, 64, 64, -64, -64, -64, -64, -64, -64, 64, -64, -64, 64, 64, -64, 64, 64, -64, 64, 64, -64, -64, -64, -64, -64, -64, 64, 64, 64, 64, 64, -64, 64, 64, -64, 64, -64, 64, -64, 64, -64, 64, -64, -64, -64, -64, -64, 64, -64, -64, -64, -64, -64, -64, -64, -64, 64, -64, 64, -64, 64, -64, -64, -64, -64, -64, -64, -64, -64, -64, 64, 64, 64, -64, -64, -64, 64, -64, -64, 64, 64, -64, -64, -64, 64, 64, 64, -64, 64, 64, 64, 64, -64, 64, -64, 64, -64, -64, -64, -64, -64, -64, 64, -64, -64, 64, -64, -64, 64, -64, 64, -64, 64, 64, -64, -64, 64, -64, 64, -64, -64, -64, 64, -64, -64, -64, 64, -64, 64, 64, -64, 64, -64, 64, -64, 64, 64, 64, -64, -64, -64, 64, -64, -64, 64, -64, 64, -64, 64, 64, 64, 64, -64, -64, -64, 64, -64, 64, -64, 64, -64, 64, -64, -64, -64, -64, 64, 64, -64, 64, 64, -64, -64, -64, 64, 64, 64, 64, -64, -64, -64, 64, -64, 64, -64, -64, 64, -64, -64, 64, -64, -64, 64, -64, 64, -64, -64, 64, -64, -64, 64, -64, -64, 64, 64, -64, -64, 64, 64, 64, -64, -64, -64, 64, 64, -64, -64, -64, -64, -64, -64, -64, 64, -64, 64, -64, -64, 64, -64, 64, -64, 64, 64, -64, -64, -64, -64, -64, 64, -64, 64, -64, 64, -64, -64, -64, -64, -64, -64, -64, -64, -64, -64, 64, 64, 64, 64, 64, 64, -64, 64, 64, -64, -64, 64, 64, 64, -64, 64, 64, 64, -64, -64, -64, 64, -64, -64, -64, -64, 64, 64, -64, 64, -64, -64, -64, -64, 64, -64, 64, 64, 64, 64, 64, -64, 64, -64, -64, -64, -64, -64, 64, -64, -64, -64, 64, -64, 64, -64, -64, 64, 64, -64, -64, 64, -64, -64, -64, 64, 64, 64, 64, 64, -64, 64, 64, -64, -64, -64, 64, -64, 64, -64, -64, -64, 64, 64, -64, -64, 64, 64, 64, -64, 64, -64, 64, -64, 64, -64, -64, -64, 64, -64, -64, -64, -64, -64, -64, -64, -64, -64, 64, -64, -64, 64, 64, -64, -64, 64, 64, 64, -64, -64, -64, 64, 64, -64, -64, -64, -64, -64, 64, 64, -64, -64, -64, -64, -64, -64, 64, 64, -64, 64, -64, 64, 64, -64, -64, 64, -64, -64, 64, -64, -64, -64, 64, -64, 64, 64, 64, -64, 64, 64, -64, -64, 64, -64, -64, -64, 64, 64, 64, 64, -64, -64, 64, -64, 64, 64, 64, -64, -64, -64, -64, -64, -64, -64, -64, 64, -64, -64, -64, 64, 64, 64, -64, -64, 64, 64, -64, 64, 64, 64, -64, 64, -64, 64, 64, 64, 64, 64, 64, -64, 64, 64, -64, 64, -64, 64, 64, 64, 64, -64, 64, 64, -64, 64, -64, 64, 64, 64, 64, 64, 64, 64, -64, 64, 64, 64, -64, 64, -64, -64, 64, -64, 64, -64, -64, -64, -64, 64, 64, 64, 64, 64, -64, -64, 64, -64, 64, -64, 64, -64, 64, -64, 64, -64, -64, -64, -64, -64, -64, 64, -64, 64, 64, -64, -64, 64, 64, 64, -64, 64, -64, 64, -64, -64, -64, 64, 64, 64, 64, 64, -64, -64, -64, 64, 64, -64, 64, 64, 64, -64, 64, 64, 64, 64, -64, -64, 64, 64, -64, -64, -64, 64, -64, 64, 64, -64, 64, -64, -64, 64, -64, -64, -64, -64, -64, 64, 64, 64, -64, -64, 64, -64, -64, 64, 64, -64, 64, -64, -64, -64, 64, 64, 64, 64, -64, 64, -64, 64, 64, 64, -64, -64, 64, -64, -64, 64, -64, -64, -64, 64, -64, -64, 64, 64, -64, 64, -64, -64, 64, -64, 64, 64, -64, -64, 64, 64, -64, -64, 64, -64, 64, -64, -64, -64, 64, 64, -64, 64, -64, 64, -64, 64, 64, -64, -64, -64, -64, 64, 64, -64, 64, 64, -64, 64, -64, 64, 64, 64, -64, -64, -64, 64, 64, 64, -64, 64, 64, -64, -64, 64, -64, -64, 64, -64, -64, 64, -64, -64, -64, 64, 64, -64, -64, 64, -64, -64, 64, -64, -64, -64, 64, -64, -64, -64, 64, -64, -64, -64, 64, -64, -64, -64, 64, -64, 64, -64, -64, -64, -64, -64, 64, 64, -64, -64, -64, -64, 64, 64, -64, -64, -64, -64, -64, -64, -64, -64, -64, -64, 64, 64, 64, 64, 64, 64, -64, 64, 64, -64, -64, -64, -64, -64, -64, -64, -64, 64, 64, 64, 64, -64, 64, -64, -64, 64, -64, -64, -64, -64, -64, -64, -64, 64, -64, 64, -64, -64, -64, 64, -64, -64, -64, 64, -64, -64, -64, 64, -64, -64, -64, 64, -64, 64, 64, 64, -64, 64, 64, -64, -64, -64, -64, 64, -64, 64, -64, 64, -64, -64, -64, -64, 64, 64, -64, -64, -64, -64, -64, -64, -64, -64, 64, 64, 64, 64, -64, 64, -64, 64, -64, 64, 64, 64, 64, -64, -64, 64, -64, 64, 64, 64, -64, -64, -64, -64, -64, -64, -64, 64, -64, -64, -64, 64, 64, -64, -64, -64, 64, 64, 64, -64, -64, -64, -64, -64, -64, 64, -64, -64, -64, 64, -64, -64, -64, -64, -64, 64, 64, 64, 64, -64, -64, 64, 64, -64, -64, 64, 64, 64, 64, -64, -64, 64, -64, -64, -64, 64, 64, 64, -64, -64, -64, -64, -64, -64, -64, 64, 64, 64, 64, 64, 64, -64, 64, -64, -64, 64, 64, -64, 64, -64, 64, -64, -64, 64, -64, 64, -64, -64, -64, -64, -64, -64, 64, 64, -64, 64, -64, 64, -64, -64, -64, -64, 64, -64, -64, -64, 64, 64, -64, -64, -64, -64, -64, -64, -64, -64, -64, 64, -64, 64, -64, -64, -64, -64, -64, -64, 64, 64, 64, -64, -64, 64, -64, 64, 64, 64, 64, 64, -64, -64, 64, -64, -64, -64, -64, -64, -64, 64, -64, 64, 64, -64, 64, 64, 64, 64, -64, 64, -64, -64, -64, -64, -64, 64, 64, 64, 64, -64, 64, -64, -64, -64, -64, 64, 64, -64, -64, -64, -64, -64, -64, 64, -64, 64, -64, -64, 64, 64, 64, -64, 64, -64, 64, -64, -64, -64, -64, 64, -64, -64, -64, -64, -64, 64, -64, 64, 64, -64, -64, 64, -64, -64, 64, -64, 64, -64, 64, 64, -64, -64, 64, 64, 64, -64, -64, -64, -64, -64, 64, 64, 64, -64, -64, -64, 64, -64, -64, 64, -64, 64, -64, 64, 64, -64, -64, -64, 64, -64, -64, -64, 64, 64, 64, 64, -64, -64, 64, -64, -64, 64, -64, 64, -64, 64, 64, 64, 64, 64, -64, -64, -64, -64, -64, 64, 64, 64, 64, 64, 64, -64, -64, 64, -64, -64, -64, -64, -64, 64, -64, -64, -64, -64, -64, 64, 64, -64, 64, 64, 64, -64, 64, 64, 64, -64, 64, -64, -64, 64, 64, -64, 64, 64, -64, -64, -64, -64, -64, -64, 64, -64, -64, -64, -64, 64, 64, 64, -64, 64, -64, -64, 64, 64, -64, -64, -64, -64, 64, -64, -64, -64, 64, 64, -64, 64, 64, -64, 64, 64, -64, 64, 64, 64, 64, 64, -64, 64, -64, 64, 64, -64, -64, -64, 64, 64, 64, 64, 64, 64, -64, 64, 64, 64, -64, -64, 64, -64, 64, 64, -64, 64, -64, -64, 64, -64, -64, 64, 64, -64, 64, -64, -64, -64, -64, -64, 64, -64, -64, -64, 64, -64, -64, 64, -64, -64, 64, -64, 64, 64, 64, -64, -64, 64, -64, -64, 64, 64, 64, -64, -64, -64, -64, -64, -64, 64, 64, 64, -64, -64, -64, 64, 64, -64, 64, -64, 64, -64, 64, 64, -64, 64, -64, -64, -64, 64, 64, -64, -64, -64, 64, -64, 64, -64, -64, -64, -64, 64, 64, -64, -64, -64, -64, 64, -64, -64, 64, -64, -64, -64, 64, 64, 64, 64, -64, -64, -64, 64, 64, -64, 64, 64, 64, 64, -64, -64, 64, 64, -64, 64, -64, -64, 64, -64, -64, 64, -64, -64, -64, 64, 64, 64, -64, 64, 64, 64, 64, -64, 64, 64, -64, -64, 64, -64, 64, -64, 64, 64, -64, -64, -64, 64, -64, 64, 64, -64, -64, -64, 64, 64, 64, -64, 64, 64, 64, -64, -64, 64, 64, 64, 64, -64, 64, 64, -64, -64, -64, 64, 64, -64, -64, -64, -64, -64, 64, -64, -64, 64, 64, 64, 64, 64, 64, 64, -64, 64, 64, -64, 64, -64, 64, 64, -64, 64, -64, -64, -64, -64, -64, -64, 64, 64, 64, 64, 64, 64, 64, 64, 64, 64, 64, 64, -64, 64, 64, 64, -64, 64, -64, 64, -64, -64, -64, -64, 64, -64, -64, 64, 64, 64, -64, 64, 64, 64, 64, 64, 64, -64, 64, 64, 64, 64, 64, 64, 64, 64, 64, -64, -64, -64, -64, -64, 64, 64, 64, 64, 64, -64, 64, 64, 64, -64, -64, -64, 64, 64, -64, 64, 64, -64, -64, 64, 64, 64, -64, -64, -64, -64, 64, -64, 64, -64, -64, -64, 64, 64, 64, -64, 64, -64, -64, -64, -64, 64, -64, 64, -64, 64, 64, 64, -64, 64, 64, -64, -64, -64, -64, -64, -64, -64, -64, -64, -64, 64, 64, -64, 64, -64, -64, -64, 64, -64, 64, 64, -64, 64, 64, 64, 64, 64, -64, -64, -64, -64, -64, -64, -64, -64, -64, -64, -64, -64, 64, -64, -64, 64, -64, -64, -64, 64, -64, 64, 64, 64, 64, 64, 64, -64, -64, -64, 64, -64, -64, -64, 64, -64, 64, -64, -64, -64, -64, -64, 64, -64, -64, -64, -64, -64, 64, 64, 64, 64, 64, 64, -64, 64, -64, -64, 64, -64, -64, 64, 64, 64, 64, -64, 64, -64, -64, 64, -64, -64, -64, -64, -64, -64, 64, -64, -64, -64, 64, 64, 64, -64, 64, -64, -64, -64, 64, 64, -64, 64, -64, 64, -64, -64, 64, -64, -64, -64, -64, -64, -64, 64, -64, 64, 64, 64, 64, 64, -64, -64, -64, 64, 64, 64, -64, 64, -64, 64, 64, -64, -64, -64, 64, 64, -64, 64, -64, -64, 64, -64, 64, 64, 64, 64, 64, 64, -64, -64, 64, -64, 64, -64, -64, -64, -64, 64, 64, -64, -64, -64, -64, 64, 64, -64, -64, -64, 64, 64, 64, 64, 64, 64, 64, 64, 64, -64, -64, -64, 64, 64, -64, -64, -64, -64, 64, 64, -64, 64, 64, 64, 64, -64, -64, -64, 64, 64, 64, 64, 64, 64, 64, 64, -64, -64, 64, 64, -64, 64, -64, -64, -64, -64, -64, 64, -64, -64, 64, 64, 64, 64, -64, -64, 64, 64, 64, 64, 64, 64, 64, 64, 64, -64, 64, -64, 64, 64, -64, 64, -64, 64, 64, 64, -64, -64, 64, -64, 64, -64, 64, 64, 64, -64, 64, 64, 64, 64, 64, 64, 64, -64, 64, 64, 64, 64, -64, 64, 64, 64, 64, -64, -64, -64, -64, 64, -64, 64, 64, 64, -64, -64, 64, -64, 64, 64, 64, 64, 64, -64, 64, -64, 64, 64, -64, 64, 64, 64, -64, 64, 64, -64, 64, 64, 64, 64, 64, 64, 64, 64, 64, 64, -64, 64, 64, 64, 64, 64, 64, 64, 64, 64, -64, 64, 64, 64, -64, 64, 64, 64, 64, 64, 64, 64, -64, 64, 64, 64, 64, 64, 64, 64, -64, -64, -64, -64, -64, 64, 64, -64, 64, 64, 64, 64, -64, 64, 64, 64, 64, 64, 64, 64, 64, 64, 64, -64, 64, -64, -64, -64, -64, -64, -64, 64, -64, 64, 64, 64, 64, 64, 64, -64, 64, 64, 64, 64, 64, 64, 64, 64, 64, 64, 64, -64, 64, -64, 64, -64, -64, -64, -64, 64, -64, 64, -64, 64, 64, -64, -64, -64, 64, 64, -64, 64, 64, 64, 64, 64, -64, 64, -64, 64, 64, -64, 64, 64, -64, -64, -64, -64, 64, -64, 64, -64, 64, -64, 64, 64, -64, -64, 64, 64, 64, 64, 64, -64, -64, -64, -64, -64, 64, -64, -64, -64, -64, -64, -64, -64, 64, -64, -64, -64, 64, -64, 64, -64, -64, 64, 64, -64, 64, -64, -64, 64, -64, -64, -64, -64, -64, -64, -64, -64, -64, -64, 64, 64, -64, -64, 64, 64, -64, -64, 64, -64, 64, 64, 64, 64, -64, -64, -64, -64, 64, -64, -64, -64, -64, -64, -64, 64, 64, 64, 64, 64, -64, -64, 64, 64, -64, 64, -64, -64, 64, -64, -64, -64, -64, -64, -64, -64, -64, 64, 64, 64, -64, 64, 64, -64, -64, 64, -64, 64, 64, -64, 64, 64, 64, 64, 64, -64, 64, 64, -64, -64, 64, 64, 64, 64, -64, 64, -64, 64, 64, 64, 64, 64, 64, 64, 64, -64, 64, -64, 64, 64, 64, -64, 64, 64, 64, -64, 64, 64, 64, 64, 64, -64, -64, -64, -64, 64, 64, -64, 64, 64, 64, 64, 64, 64, 64, 64, -64, 64, 64, 64, -64, -64, 64, -64, -64, 64, 64, 64, 64, 64, 64, 64, 64, 64, 64, -64, -64, 64, 64, 64, 64, 64, 64, -64, 64, -64, -64, 64, 64, -64, 64, -64, 64, -64, 64, 64, -64, 64, -64, 64, 64, 64, 64, 64, 64, 64, 64, -64, 64, 64, 64, 64, 64, -64, -64, 64, 64, 64, -64, 64, 64, -64, -64, 64, -64, 64, 64, 64, 64, 64, -64, 64, -64, -64, -64, 64, -64, -64, -64, 64, 64, 64, 64, 64, 64, 64, 64, -64, -64, -64, -64, 64, 64, 64, 64, 64, 64, -64, -64, -64, -64, -64, -64, -64, -64, 64, -64, 64, 64, -64, 64, -64, -64, 64, 64, -64, -64, -64, -64, -64, 64, 64, 64, 64, -64, -64, -64, -64, -64, 64, -64, -64, -64, -64, -64, 64, 64, 64, 64, 64, -64, 64, 64, -64, -64, -64, -64, -64, 64, 64, 64, 64, 64, 64, 64, 64, 64, 64, 64, -64, -64, -64, 64, -64, 64, 64, -64, 64, -64, 64, 64, -64, -64, -64, -64, -64, -64, 64, -64, -64, 64, -64, 64, 64, -64, -64, -64, -64, -64, -64, 64, -64, 64, 64, 64, 64, -64, -64, 64, -64, -64, 64, -64, -64, -64, -64, 64, 64, 64, 64, 64, 64, 64, 64, -64, -64, -64, -64, -64, -64, -64, 64, 64, -64, 64, 64, 64, -64, -64, -64, -64, -64, -64, 64, 64, -64, -64, -64, 64, 64, 64, 64, -64, -64, -64, -64, -64, -64, 64, 64, 64, 64, -64, -64, -64, -64, -64, -64, -64, -64, -64, -64, -64, 64, 64, 64, 64, 64, 64, 64, -64, -64, -64, -64, -64, -64, -64, 64, 64, -64, -64, -64, -64, -64, -64, -64, 64, -64, -64, -64, -64, 64, 64, 64, 64, 64, 64, 64, -64, -64, -64, -64, -64, -64, -64, -64, -64, -64, -64, 64, 64, -64, -64, -64, -64, 64, -64, 64, 64, 64, 64, 64, 64, 64, 64, -64, -64, -64, -64, -64, -64, 64, -64, -64, -64, 64, -64, 64, -64, 64, 64, -64, -64, 64, 64, 64, 64, 64, 64, -64, 64, 64, 64, -64, -64, -64, -64, -64, -64, -64, -64, -64, -64, 64, -64, 64, 64, 64, 64, 64, 64, -64, -64, -64, 64, 64, 64, 64, 64, 64, 64, -64, 64, -64, 64, -64, 64, 64, -64, -64, 64, -64, 64, 64, -64, 64, 64, -64, 64, -64, -64, -64, -64, 64, 64, 64, 64, 64, -64, -64, -64, 64, 64, 64, 64, 64, 64, 64, 64, 64, 64, 64, 64, -64, 64, 64, 64, -64, -64, -64, -64, -64, -64, -64, -64, -64, 64, 64, 64, -64, -64, 64, 64, 64, 64, -64, 64, 64, -64, 64, 64, 64, 64, 64, 64, -64, -64, -64, -64, -64, -64, -64, 64, 64, 64, 64, 64, 64, -64, 64, 64, 64, 64, 64, 64, 64, -64, 64, 64, -64, 64, 64, 64, 64, -64, -64, -64, -64, -64, -64, 64, 64, 64, 64, 64, 64, -64, 64, 64, 64, 64, -64, 64, 64, 64, 64, 64, 64, 64, 64, 64, 64, 64, 64, -64, -64, 64, 64, 64, 64, 64, 64, -64, -64, 64, 64, -64, -64, 64, -64, 64, 64, -64, 64, 64, 64, 64, 64, 64, -64, 64, 64, 64, -64, -64, 64, 64, -64, 64, 64, 64, -64, 64, -64, -64, -64, 64, 64, 64, 64, -64, -64, 64, 64, -64, -64, 64, 64, -64, -64, -64, -64, -64, -64, -64, -64, 64, 64, 64, 64, 64, 64, -64, -64, 64, -64, 64, 64, 64, -64, -64, -64, -64, -64, 64, -64, 64, 64, -64, -64, -64, -64, -64, -64, 64, -64, -64, 64, 64, 64, -64, 64, -64, 64, -64, 64, -64, 64, -64, -64, 64, 64, -64, -64, -64, 64, 64, -64, 64, -64, -64, -64, 64, 64, 64, 64, 64, 64, 64, 64, 64, -64, -64, 64, 64, 64, 64, -64, 64, -64, -64, -64, -64, -64, -64, 64, 64, 64, -64, -64, 64, 64, 64, 64, 64, -64, -64, 64, -64, -64, 64, -64, -64, 64, 64, 64, -64, -64, -64, -64, -64, -64, -64, -64, -64, -64, -64, 64, 64, -64, 64, 64, 64, -64, -64, 64, -64, -64, -64, -64, -64, 64, -64, -64, 64, 64, -64, 64, -64, -64, -64, 64, -64, 64, 64, -64, -64, 64, -64, -64, -64, 64, 64, 64, -64, -64, -64, 64, 64, 64, 64, -64, 64, -64, -64, -64, -64, 64, 64, 64, 64, -64, 64, -64, -64, 64, -64, 64, -64, -64, 64, -64, -64, 64, -64, 64, -64, -64, 64, 64, -64, -64, -64, -64, -64, 64, 64, 64, -64, -64, 64, 64, -64, 64, 64, 64, 64, -64, 64, -64, -64, 64, -64, 64, -64, -64, -64, 64, -64, -64, -64, -64, -64, -64, -64, 64, 64, 64, 64, 64, 64, -64, -64, -64, -64, 64, -64, -64, -64, -64, -64, -64, 64, 64, 64, -64, -64, 64, 64, 64, 64, 64, -64, -64, -64, 64, 64, -64, -64, -64, -64, -64, 64, 64, 64, -64, 64, -64, -64, 64, -64, -64, 64, -64, -64, -64, -64, -64, 64, 64, -64, -64, 64, 64, -64, -64, -64, -64, -64, -64, -64, -64, -64, -64, -64, -64, -64, 64, 64, 64, -64, -64, 64, 64, 64, 64, 64, 64, -64, -64, -64, -64, 64, -64, -64, 64, -64, 64, -64, -64, -64, -64, -64, -64, -64, 64, 64, 64, 64, -64, 64, 64, 64, -64, -64, -64, -64, -64, -64, -64, -64, 64, -64, 64, 64, 64, 64, 64, -64, 64, -64, -64, -64, -64, -64, 64, 64, 64, 64, 64, -64, 64, -64, -64, -64, -64, -64, -64, 64, -64, 64, 64, -64, 64, 64, 64, 64, 64, 64, 64, -64, -64, 64, -64, 64, 64, -64, 64, 64, 64, 64, -64, -64, -64, -64, -64, 64, 64, 64, 64, -64, 64, 64, 64, 64, 64, 64, -64, 64, 64, 64, 64, 64, 64, 64, 64, 64, 64, -64, -64, -64, -64, -64, 64, 64, 64, 64, 64, 64, 64, -64, 64, 64, 64, 64, -64, 64, 64, -64, 64, 64, 64, 64, 64, 64, 64, -64, -64, -64, -64, 64, 64, 64, 64, 64, 64, 64, 64, 64, 64, 64, 64, 64, -64, -64, 64, -64, 64, 64, 64, -64, 64, -64, -64, -64, -64, -64, -64, 64, 64, 64, 64, 64, -64, 64, 64, 64, -64, -64, -64, 64, -64, -64, 64, -64, -64, -64, 64, 64, -64, -64, -64, -64, -64, -64, 64, 64, 64, 64, 64, -64, -64, -64, 64, 64, -64, -64, -64, -64, 64, 64, -64, -64, 64, 64, 64, 64, -64, -64, -64, -64, -64, -64, 64, 64, 64, 64, 64, 64, -64, 64, 64, 64, -64, -64, -64, 64, 64, -64, -64, 64, -64, 64, -64, -64, -64, -64, -64, -64, -64, -64, 64, 64, 64, 64, 64, -64, 64, -64, 64, 64, -64, -64, -64, 64, 64, 64, -64, 64, 64, -64, -64, 64, 64, -64, -64, -64, -64, -64, 64, 64, 64, 64, 64, 64, 64, 64, 64, 64, -64, -64, -64, -64, 64, -64, -64, -64, 64, 64, -64, -64, -64, -64, -64, -64, -64, -64, 64, 64, 64, 64, 64, 64, 64, -64, 64, -64, 64, -64, -64, -64, 64, -64, -64, 64, -64, 64, 64, -64, -64, -64, -64, 64, -64, -64, -64, 64, 64, 64, 64, 64, 64, 64, -64, -64, -64, 64, -64, 64, -64, 64, 64, 64, 64, -64, 64, 64, -64, -64, -64, 64, -64, 64, 64, 64, 64, 64, 64, 64, -64, 64, 64, -64, -64, 64, 64, 64, -64, 64, 64, -64, 64, -64, 64, -64, -64, -64, -64, 64, 64, 64, -64, 64, 64, 64, 64, -64, -64, -64, -64, -64, -64, -64, 64, 64, -64, -64, 64, -64, 64, -64, -64, 64, 64, 64, 64, 64, 64, -64, 64, -64, 64, 64, 64, -64, -64, -64, -64, -64, 64, 64, -64, -64, -64, 64, 64, -64, -64, -64, -64, 64, 64, 64, -64, -64, -64, -64, -64, -64, 64, -64, 64, -64, -64, -64, -64, 64, -64, -64, -64, -64, 64, 64, -64, 64, -64, -64, 64, 64, 64, 64, 64, 64, -64, 64, 64, -64, -64, 64, -64, -64, -64, -64, 64, -64, -64, -64, -64, -64, 64, 64, 64, -64, -64, 64, 64, -64, 64, 64, 64, 64, 64, 64, 64, -64, -64, -64, 64, -64, 64, -64, -64, -64, -64, -64, -64, -64, -64, 64, -64, -64, -64, -64, -64, -64, 64, -64, 64, 64, 64, 64, 64, 64, 64, 64, 64, -64, 64, -64, -64, 64, -64, -64, -64, -64, -64, -64, 64, -64, -64, -64, -64, 64, 64, -64, 64, 64, 64, 64, 64, 64, 64, 64, 64, 64, -64, -64, -64, -64, -64, -64, -64, 64, -64, -64, 64, -64, -64, -64, 64, -64, -64, -64, -64, -64, -64, -64, -64, -64, 64, 64, -64, -64, -64, -64, -64, -64, -64, -64, -64, 64, 64, -64, 64, 64, -64, -64, -64, -64, -64, 64, 64, 64, 64, -64, -64, 64, 64, 64, -64, 64, 64, 64, -64, 64, 64, -64, -64, 64, -64, -64, -64, 64, -64, 64, -64, 64, 64, -64, 64, -64, 64, 64, 64, -64, -64, 64, -64, 64, -64, -64, -64, 64, 64, -64, 64, 64, -64, -64, 64, -64, 64, -64, 64, 64, -64, -64, 64, 64, 64, -64, -64, -64, 64, 64, 64, 64, -64, 64, 64, 64, 64, -64, -64, 64, 64, 64, -64, 64, -64, 64, -64, 64, -64, 64, 64, 64, 64, -64, -64, -64, -64, -64, -64, 64, 64, 64, 64, 64, 64, 64, 64, 64, -64, -64, 64, 64, -64, -64, -64, 64, -64, 64, -64, 64, 64, 64, 64, -64, -64, -64, -64, -64, -64, 64, 64, 64, 64, -64, 64, 64, -64, -64, 64, -64, -64, -64, -64, 64, 64, 64, -64, 64, 64, -64, -64, -64, -64, -64, 64, 64, 64, -64, -64, 64, 64, -64, 64, 64, 64, -64, -64, -64, 64, -64, -64, 64, 64, 64, 64, 64, 64, -64, 64, 64, -64, -64, -64, 64, 64, -64, -64, 64, 64, -64, -64, -64, -64, 64, 64, -64, 64, 64, -64, -64, -64, -64, -64, 64, 64, -64, -64, 64, 64, 64, 64, 64, -64, 64, -64, 64, 64, 64, 64, -64, -64, -64, 64, 64, 64, -64, -64, -64, -64, -64, 64, -64, -64, -64, -64, -64, 64, -64, -64, -64, -64, -64, -64, 64, 64, 64, -64, 64, 64, -64, 64, 64, 64, 64, -64, -64, -64, 64, 64, -64, 64, 64, -64, -64, -64, 64, 64, 64, -64, -64, -64, 64, 64, 64, 64, -64, -64, -64, -64, 64, 64, 64, 64, -64, -64, 64, -64, -64, 64, 64, -64, 64, 64, -64, 64, -64, -64, 64, 64, 64, 64, 64, -64, -64, -64, -64, 64, 64, -64, -64, -64, -64, -64, 64, -64, -64, 64, 64, -64, -64, 64, 64, -64, -64, -64, 64, -64, 64, 64, 64, 64, -64, -64, -64, -64, 64, 64, -64, 64, -64, -64, -64, -64, 64, 64, 64, 64, -64, -64, -64, -64, -64, -64, 64, -64, -64, 64, 64, 64, 64, -64, -64, -64, 64, 64, 64, 64, 64, -64, -64, 64, 64, 64, 64, -64, -64, -64, -64, -64, -64, -64, 64, 64, -64, 64, 64, 64, 64, -64, -64, -64, 64, 64, -64, -64, 64, 64, -64, 64, 64, 64, -64, -64, -64, -64, -64, -64, -64, -64, 64, 64, 64, 64, 64, 64, 64, 64, 64, -64, 64, -64, 64, 64, 64, 64, 64, 64, 64, 64, 64, -64, -64, -64, -64, -64, -64, -64, -64, 64, 64, 64, 64, 64, 64, 64, 64, -64, 64, -64, -64, -64, 64, 64, 64, 64, 64, 64, 64, 64, -64, -64, -64, -64, -64, -64, 64, 64, 64, 64, 64, 64, 64, 64, 64, -64, 64, -64, -64, -64, 64, -64, -64, 64, 64, 64, -64, -64, -64, -64, 64, -64, -64, 64, -64, 64, 64, 64, 64, -64, -64, -64, 64, 64, -64, -64, 64, 64, 64, -64, -64, -64, -64, 64, 64, 64, 64, 64, -64, 64, 64, 64, 64, 64, 64, 64, -64, -64, -64, 64, 64, 64, 64, 64, 64, -64, 64, -64, -64, 64, 64, 64, 64, 64, 64, 64, 64, -64, 64, 64, 64, 64, 64, -64, -64, 64, 64, -64, 64, 64, -64, -64, -64, -64, -64, -64, 64, 64, -64, 64, 64, 64, 64, 64, 64, 64, -64, -64, -64, 64, -64, -64, -64, -64, 64, 64, 64, -64, 64, -64, 64, -64, 64, 64, 64, 64, -64, -64, -64, 64, 64, 64, 64, -64, -64, -64, -64, -64, -64, -64, -64, 64, 64, 64, -64, -64, -64, 64, -64, -64, -64, 64, 64, 64, 64, -64, -64, -64, -64, -64, -64, 64, -64, -64, -64, -64, -64, -64, -64, -64, -64, -64, 64, 64, -64, 64, 64, 64, -64, 64, 64, 64, -64, 64, -64, -64, -64, 64, 64, -64, -64, -64, -64, -64, -64, -64, -64, -64, 64, -64, 64, -64, 64, 64, 64, 64, -64, 64, 64, 64, 64, 64, 64, -64, -64, -64, 64, -64, -64, -64, -64, -64, -64, -64, -64, -64, -64, -64, 64, 64, -64, -64, 64, -64, 64, -64, 64, 64, 64, 64, -64, 64, -64, 64, 64, 64, 64, -64, -64, -64, -64, -64, -64, -64, -64, -64, 64, -64, 64, 64, -64, 64, -64, 64, 64, 64, -64, 64, 64, -64, 64, 64, -64, 64, 64, -64, -64, -64, 64, 64, 64, 64, 64, -64, -64, 64, 64, -64, -64, 64, 64, 64, 64, 64, -64, -64, 64, 64, 64, 64, 64, 64, -64, -64, 64, 64, 64, 64, 64, -64, -64, -64, 64, -64, 64, -64, -64, -64, -64, -64, 64, -64, -64, -64, -64, -64, 64, 64, -64, -64, 64, -64, 64, 64, 64, 64, 64, -64, -64, -64, -64, -64, 64, 64, 64, 64, -64, 64, -64, -64, 64, -64, -64, -64, -64, -64, 64, -64, -64, -64, 64, 64, 64, -64, 64, -64, -64, -64, 64, -64, -64, 64, -64, -64, 64, -64, -64, -64, -64, 64, 64, -64, 64, -64, 64, 64, -64, -64, 64, -64, -64, 64, 64, -64, -64, -64, -64, 64, 64, -64, 64, -64, 64, -64, 64, -64, 64, -64, 64, 64, 64, -64, -64, 64, 64, -64, 64, 64, 64, 64, -64, 64, 64, -64, 64, -64, -64, -64, 64, 64, 64, -64, 64, 64, -64, 64, -64, -64, -64, -64, -64, 64, 64, -64, -64, 64, 64, 64, -64, 64, 64, 64, 64, -64, -64, -64, 64, 64, -64, -64, -64, -64, 64, 64, -64, -64, -64, 64, 64, -64, -64, -64, -64, 64, 64, 64, 64, -64, -64, 64, 64, 64, 64, -64, 64, 64, -64, -64, 64, 64, 64, -64, -64, -64, -64, 64, 64, -64, -64, 64, -64, -64, -64, 64, -64, 64, -64, 64, 64, 64, -64, 64, -64, -64, 64, 64, 64, 64, -64, -64, 64, 64, -64, -64, -64, -64, -64, -64, -64, -64, -64, 64, 64, -64, 64, 64, 64, -64, -64, 64, -64, 64, -64, -64, -64, -64, 64, -64, -64, -64, -64, -64, -64, 64, -64, -64, -64, -64, -64, 64, -64, -64, -64, 64, 64, 64, -64, 64, -64, -64, -64, -64, -64, -64, 64, -64, -64, 64, -64, -64, -64, -64, -64, 64, -64, -64, -64, -64, -64, -64, -64, 64, 64, 64, 64, 64, -64, 64, -64, -64, -64, -64, -64, -64, -64, -64, -64, -64, 64, 64, -64, -64, -64, -64, -64, -64, -64, -64, -64, 64, -64, 64, 64, 64, -64, 64, -64, 64, -64, -64, -64, -64, -64, 64, 64, 64, 64, 64, -64, -64, -64, -64, -64, 64, -64, -64, -64, 64, -64, 64, 64, 64, -64, -64, -64, 64, 64, -64, 64, 64, 64, 64, 64, 64, 64, -64, -64, -64, -64, -64, -64, -64, -64, -64, 64, 64, 64, 64, -64, 64, -64, 64, -64, 64, 64, 64, 64, 64, 64, 64, 64, 64, 64, -64, -64, -64, -64, -64, -64, -64, -64, 64, 64, -64, -64, -64, -64, -64, -64, 64, -64, 64, 64, -64, -64, 64, 64, -64, 64, 64, -64, -64, 64, 64, -64, -64, 64, -64, -64, 64, 64, -64, 64, -64, -64, 64, 64, 64, -64, -64, -64, -64, 64, 64, 64, 64, -64, -64, -64, -64, -64, -64, 64, -64, -64, 64, -64, 64, 64, -64, -64, -64, 64, -64, 64, 64, -64, -64, -64, -64, -64, -64, -64, -64, -64, -64, -64, -64, 64, 64, -64, -64, -64, -64, -64, -64, -64, -64, -64, -64, -64, -64, 64, -64, -64, 64, -64, -64, -64, -64, -64, -64, -64, -64, -64, -64, -64, -64, -64, -64, 64, -64, -64, -64, -64, -64, -64, -64, 64, -64, 64, -64, -64, -64, 64, -64, -64, -64, -64, -64, -64, -64, -64, -64, -64, 64, -64, -64, -64, 64, -64, -64, -64, -64, -64, -64, 64, 64, 64, -64, -64, -64, -64, -64, 64, 64, -64, -64, -64, -64, -64, -64, -64, -64, 64, -64, -64, 64, 64, 64, 64, 64, -64, -64, 64, 64, -64, -64, -64, -64, -64, -64, -64, 64, 64, -64, 64, 64, 64, -64, -64, -64, -64, -64, -64, 64, 64, 64, 64, 64, -64, -64, 64, -64, 64, -64, -64, 64, -64, -64, 64, -64, -64, -64, 64, -64, -64, 64, -64, -64, -64, -64, 64, -64, -64, -64, 64, -64, 64, -64, -64, -64, -64, -64, -64, -64, -64, -64, -64, -64, -64, -64, 64, -64, -64, -64, -64, -64, -64, -64, -64, -64, 64, -64, -64, -64, -64, -64, -64, 64, -64, 64, -64, -64, -64, -64, -64, -64, -64, -64, -64, 64, 64, -64, -64, -64, -64, -64, -64, -64, -64, -64, 64, 64, 64, -64, -64, -64, 64, -64, -64, -64, -64, -64, -64, -64, -64, 64, -64, -64, -64, 64, 64, -64, -64, 64, 64, 64, -64, -64, 64, 64, 64, -64, 64, -64, 64, 64, -64, -64, -64, -64, -64, -64, 64, -64, 64, -64, 64, -64, 64, -64, -64, -64, -64, 64, 64, -64, 64, 64, -64, -64, -64, -64, 64, -64, -64, 64, 64, 64, -64, -64, -64, -64, -64, -64, -64, -64, -64, -64, 64, 64, 64, -64, -64, 64, -64, 64, 64, 64, -64, 64, 64, 64, 64, 64, -64, 64, 64, -64, -64, -64, 64, 64, -64, 64, -64, 64, 64, 64, 64, -64, -64, -64, 64, 64, -64, 64, -64, 64, 64, 64, 64, -64, 64, 64, -64, 64, -64, -64, 64, -64, -64, -64, 64, 64, 64, 64, 64, -64, -64, 64, -64, 64, -64, 64, 64, -64, 64, 64, -64, -64, -64, 64, 64, -64, -64, 64, -64, -64, -64, 64, 64, -64, -64, -64, -64, 64, -64, 64, 64, -64, 64, -64, 64, -64, 64, -64, 64, 64, -64, 64, 64, 64, -64, -64, -64, -64, 64, -64, 64, 64, -64, 64, -64, 64, -64, 64, 64, 64, 64, -64, -64, 64, -64, 64, -64, -64, 64, 64, 64, -64, -64, -64, -64, -64, -64, -64, -64, 64, 64, 64, -64, -64, -64, -64, -64, -64, -64, 64, -64, -64, 64, -64, -64, -64, -64, -64, -64, -64, -64, -64, -64, -64, 64, -64, 64, 64, 64, 64, -64, -64, -64, -64, -64, -64, 64, -64, -64, 64, 64, 64, -64, 64, 64, 64, -64, -64, -64, 64, -64, 64, -64, 64, 64, 64, 64, -64, -64, 64, -64, -64, 64, 64, -64, 64, 64, 64, -64, 64, 64, 64, -64, -64, -64, -64, -64, -64, -64, 64, 64, 64, 64, 64, 64, -64, -64, -64, -64, 64, 64, 64, 64, -64, 64, -64, -64, -64, 64, 64, -64, -64, -64, -64, -64, -64, 64, 64, 64, 64, 64, 64, -64, -64, -64, -64, -64, -64, -64, 64, 64, -64, -64, 64, 64, 64, 64, 64, 64, 64, -64, -64, -64, -64, 64, 64, 64, 64, 64, 64, -64, -64, -64, -64, -64, -64, 64, 64, 64, 64, -64, 64, 64, -64, 64, -64, -64, -64, -64, -64, -64, -64, 64, 64, 64, 64, 64, -64, -64, -64, -64, 64, -64, 64, 64, 64, 64, 64, -64, 64, 64, -64, 64, 64, -64, -64, -64, -64, -64, -64, 64, 64, 64, 64, 64, 64, -64, -64, 64, -64, 64, 64, 64, 64, 64, 64, 64, -64, -64, 64, -64, 64, -64, 64, -64, -64, -64, -64, 64, 64, 64, 64, -64, -64, -64, -64, -64, 64, 64, -64, 64, -64, -64, -64, -64, -64, 64, -64, -64, 64, -64, -64, -64, -64, -64, 64, 64, 64, 64, 64, -64, -64, -64, -64, -64, 64, 64, -64, -64, -64, -64, -64, -64, 64, 64, 64, -64, -64, -64, -64, -64, -64, 64, 64, 64, 64, 64, 64, 64, -64, 64, -64, -64, -64, -64, -64, -64, -64, -64, -64, -64, -64, 64, 64, -64, -64, -64, -64, -64, 64, 64, 64, 64, 64, -64, -64, 64, -64, -64, -64, -64, -64, 64, 64, -64, -64, -64, 64, -64, 64, -64, -64, -64, -64, -64, -64, -64, -64, -64, -64, -64, 64, 64, -64, 64, 64, 64, -64, 64, 64, 64, -64, -64, -64, -64, -64, 64, -64, -64, 64, -64, -64, -64, 64, -64, 64, -64, 64, 64, -64, -64, 64, -64, 64, 64, 64, -64, 64, -64, 64, -64, -64, 64, 64, 64, -64, -64, -64, 64, 64, -64, -64, 64, 64, 64, 64, -64, 64, 64, -64, 64, 64, 64, -64, -64, -64, -64, -64, 64, 64, -64, 64, 64, -64, 64, 64, 64, -64, -64, -64, 64, 64, 64, -64, 64, 64, 64, 64, -64, 64, -64, -64, 64, -64, -64, 64, -64, 64, -64, 64, 64, 64, 64, 64, 64, 64, 64, 64, 64, 64, 64, -64, -64, -64, -64, 64, 64, 64, -64, 64, -64, 64, -64, -64, 64, -64, 64, -64, -64, -64, -64, -64, 64, -64, 64, 64, 64, 64, 64, 64, -64, 64, 64, -64, -64, 64, 64, -64, 64, -64, 64, -64, 64, 64, 64, 64, 64, 64, 64, 64, 64, -64, 64, -64, 64, 64, -64, -64, 64, 64, 64, -64, -64, -64, -64, -64, -64, 64, 64, -64, 64, 64, 64, -64, -64, 64, -64, -64, 64, -64, 64, -64, 64, 64, 64, 64, 64, 64, 64, 64, 64, 64, 64, 64, 64, -64, -64, 64, 64, 64, 64, 64, 64, -64, 64, 64, -64, 64, 64, 64, -64, 64, -64, 64, 64, 64, 64, 64, 64, 64, 64, 64, 64, -64, -64, 64, 64, 64, -64, -64, 64, -64, 64, -64, 64, -64, 64, 64, -64, -64, -64, -64, 64, 64, 64, -64, 64, -64, -64, 64, 64, -64, -64, -64, -64, -64, 64, -64, 64, -64, 64, -64, -64, -64, 64, -64, 64, 64, -64, -64, 64, -64, -64, -64, -64, -64, 64, -64, 64, -64, -64, -64, -64, -64, 64, 64, 64, 64, -64, -64, 64, -64, -64, -64, 64, 64, 64, -64, 64, -64, -64, 64, -64, 64, 64, 64, 64, 64, 64, -64, 64, 64, -64, -64, 64, -64, -64, 64, 64, -64, -64, -64, 64, -64, 64, -64, 64, 64, -64, 64, 64, 64, 64, 64, 64, 64, 64, 64, 64, 64, 64, -64, -64, -64, 64, -64, -64, -64, 64, 64, 64, -64, 64, 64, 64, 64, -64, 64, 64, -64, 64, -64, 64, 64, -64, 64, 64, -64, 64, 64, -64, 64, 64, 64, -64, -64, 64, -64, -64, -64, 64, 64, -64, 64, 64, 64, -64, 64, 64, -64, -64, 64, 64, 64, -64, -64, 64, 64, 64, 64, 64, 64, 64, -64, -64, 64, 64, 64, 64, 64, 64, -64, 64, -64, 64, 64, -64, 64, 64, 64, 64, 64, -64, 64, 64, -64, 64, 64, 64, -64, 64, 64, -64, -64, -64, 64, -64, -64, -64, -64, 64, -64, 64, -64, -64, -64, 64, 64, 64, 64, -64, -64, 64, 64, 64, -64, -64, -64, 64, 64, -64, 64, 64, -64, -64, -64, -64, -64, -64, 64, 64, 64, 64, 64, 64, 64, 64, 64, 64, 64, 64, -64, 64, -64, 64, 64, 64, -64, 64, 64, 64, -64, 64, 64, -64, -64, -64, -64, -64, 64, -64, -64, -64, -64, 64, 64, 64, 64, -64, -64, 64, -64, 64, 64, -64, 64, -64, -64, -64, 64, 64, 64, -64, -64, -64, -64, -64, -64, -64, -64, -64, 64, 64, 64, -64, -64, -64, 64, -64, -64, -64, 64, 64, -64, -64, -64, -64, -64, -64, -64, -64, -64, -64, -64, -64, -64, -64, -64, -64, -64, 64, -64, 64, -64, -64, 64, 64, 64, 64, -64, 64, 64, 64, -64, -64, -64, -64, -64, -64, -64, -64, 64, 64, -64, -64, -64, -64, -64, -64, -64, -64, -64, -64, -64, 64, 64, -64, -64, -64, -64, -64, -64, -64, -64, -64, -64, -64, -64, -64, 64, -64, 64, -64, 64, -64, -64, -64, -64, -64, -64, -64, 64, -64, -64, 64, -64, -64, -64, -64, -64, -64, 64, -64, -64, -64, -64, -64, -64, 64, -64, -64, -64, -64, -64, -64, -64, -64, -64, -64, 64, -64, 64, 64, 64, -64, -64, -64, -64, 64, 64, -64, -64, 64, -64, 64, 64, 64, -64, 64, -64, -64, -64, -64, -64, -64, -64, -64, -64, -64, 64, 64, 64, -64, -64, -64, -64, 64, 64, 64, 64, -64, 64, 64, -64, 64, 64, 64, -64, -64, -64, -64, -64, -64, -64, -64, -64, 64, 64, -64, 64, -64, -64, -64, -64, 64, 64, 64, 64, 64, -64, 64, 64, 64, -64, 64, 64, 64, 64, -64, -64, -64, -64, -64, -64, 64, -64, -64, -64, -64, -64, -64, 64, 64, 64, 64, 64, 64, 64, 64, 64, 64, 64, 64, 64, 64, -64, 64, 64, -64, -64, -64, -64, -64, -64, 64, -64, -64, -64, -64, 64, -64, -64, 64, 64, -64, 64, 64, 64, 64, 64, 64, 64, -64, -64, -64, 64, -64, -64, -64, 64, 64, -64, 64, -64, -64, -64, -64, -64, -64, 64, -64, 64, 64, 64, -64, 64, 64, 64, 64, -64, -64, -64, -64, -64, -64, -64, -64, -64, 64, 64, -64, 64, -64, -64, -64, -64, -64, -64, -64, 64, 64, -64, -64, 64, -64, 64, -64, -64, -64, -64, -64, -64, -64, -64, 64, -64, -64, 64, 64, 64, -64, -64, -64, -64, -64, -64, -64, -64, 64, 64, 64, 64, 64, -64, -64, -64, -64, -64, -64, -64, -64, -64, -64, -64, -64, -64, -64, -64, -64, -64, -64, -64, -64, -64, -64, -64, -64, -64, 64, 64, -64, -64, -64, -64, -64, -64, -64, -64, -64, -64, -64, -64, 64, 64, 64, -64, -64, -64, -64, -64, -64, -64, -64, -64, 64, 64, -64, -64, -64, -64, -64, -64, -64, -64, -64, -64, -64, 64, -64, -64, -64, 64, -64, 64, -64, -64, -64, -64, -64, -64, -64, -64, -64, -64, -64, -64, 64, 64, 64, 64, -64, -64, -64, -64, -64, -64, 64, -64, -64, 64, -64, 64, -64, -64, -64, -64, -64, -64, -64, -64, -64, -64, -64, 64, -64, 64, 64, 64, -64, -64, -64, -64, 64, -64, -64, -64, 64, 64, 64, -64, 64, -64, 64, -64, -64, -64, -64, -64, -64, -64, -64, -64, -64, 64, 64, 64, -64, -64, -64, -64, -64, -64, -64, 64, 64, -64, -64, -64, -64, -64, 64, 64, 64, 64, -64, -64, -64, -64, -64, -64, -64, 64, 64, 64, 64, 64, -64, -64, 64, 64, 64, 64, 64, 64, 64, -64, 64, 64, 64, 64, 64, 64, -64, 64, -64, -64, -64, -64, -64, -64, 64, 64, 64, 64, 64, -64, -64, -64, 64, -64, -64, 64, -64, -64, 64, 64, 64, -64, -64, 64, -64, -64, -64, 64, -64, -64, -64, 64, 64, 64, -64, 64, 64, 64, -64, -64, 64, -64, 64, 64, 64, 64, 64, 64, -64, 64, 64, 64, 64, -64, -64, 64, 64, 64, 64, 64, 64, 64, 64, -64, -64, -64, -64, -64, -64, 64, 64, -64, 64, -64, 64, -64, -64, 64, 64, 64, 64, -64, -64, 64, 64, 64, 64, 64, -64, -64, 64, -64, -64, -64, -64, -64, 64, -64, 64, 64, 64, 64, -64, -64, -64, -64, -64, -64, 64, 64, -64, 64, -64, -64, -64, -64, -64, -64, -64, 64, 64, 64, -64, 64, -64, -64, 64, 64, -64, -64, 64, 64, -64, -64, 64, -64, -64, 64, -64, -64, 64, -64, -64, -64, -64, 64, 64, -64, 64, 64, 64, 64, -64, -64, 64, 64, 64, -64, -64, 64, -64, -64, -64, 64, 64, 64, -64, 64, 64, 64, 64, 64, -64, 64, 64, -64, 64, 64, 64, -64, 64, 64, -64, -64, 64, 64, -64, 64, -64, -64, 64, -64, -64, -64, 64, 64, 64, -64, 64, 64, 64, 64, 64, -64, 64, 64, 64, 64, 64, -64, 64, 64, -64, -64, 64, -64, -64, -64, 64, -64, 64, 64, 64, 64, -64, 64, 64, 64, 64, 64, 64, 64, -64, 64, -64, 64, -64, -64, 64, 64, 64, -64, 64, -64, 64, 64, -64, 64, -64, 64, 64, -64, -64, 64, -64, -64, -64, 64, 64, 64, 64, 64, 64, 64, -64, 64, 64, 64, -64, 64, -64, 64, 64, -64, -64, -64, 64, -64, 64, -64, -64, -64, -64, -64, -64, -64, -64, -64, 64, 64, 64, -64, 64, 64, -64, -64, 64, -64, 64, 64, -64, 64, 64, 64, 64, -64, -64, -64, -64, -64, -64, -64, -64, -64, -64, 64, 64, 64, -64, -64, -64, -64, 64, 64, -64, -64, -64, 64, -64, -64, -64, -64, 64, -64, 64, -64, -64, -64, -64, -64, -64, -64, -64, -64, 64, 64, 64, -64, -64, -64, -64, -64, -64, 64, -64, 64, -64, 64, -64, -64, -64, 64, -64, -64, -64, -64, -64, -64, -64, -64, -64, 64, -64, 64, 64, 64, -64, -64, -64, 64, -64, 64, 64, 64, 64, 64, -64, 64, 64, 64, -64, -64, -64, -64, -64, -64, -64, -64, -64, 64, -64, 64, -64, 64, 64, 64, 64, 64, -64, -64, 64, 64, -64, -64, -64, -64, -64, 64, 64, -64, -64, -64, -64, -64, -64, -64, -64, 64, 64, -64, -64, -64, 64, 64, -64, 64, 64, 64, 64, 64, 64, -64, -64, 64, -64, 64, 64, 64, 64, -64, -64, -64, -64, -64, -64, -64, -64, 64, -64, 64, 64, 64, -64, -64, 64, -64, 64, 64, 64, -64, 64, 64, 64, 64, 64, -64, -64, -64, -64, 64, -64, -64, -64, -64, 64, 64, -64, -64, 64, -64, 64, 64, -64, 64, 64, 64, -64, -64, -64, -64, -64, 64, -64, -64, -64, -64, -64, -64, 64, -64, -64, 64, 64, -64, 64, -64, 64, 64, 64, -64, 64, 64, 64, 64, 64, -64, -64, -64, -64, -64, 64, -64, -64, 64, -64, -64, -64, -64, -64, 64, -64, 64, 64, 64, -64, 64, -64, 64, 64, -64, 64, 64, 64, -64, 64, 64, -64, -64, 64, 64, -64, -64, -64, -64, -64, 64, 64, 64, 64, 64, 64, -64, 64, -64, 64, -64, -64, 64, 64, 64, -64, 64, -64, -64, 64, -64, -64, -64, -64, -64, -64, -64, 64, -64, -64, -64, 64, 64, 64, 64, -64, -64, -64, 64, -64, -64, 64, 64, -64, -64, -64, -64, -64, 64, -64, -64, -64, -64, -64, -64, 64, 64, -64, -64, -64, 64, -64, 64, -64, -64, 64, 64, 64, 64, 64, -64, 64, -64, -64, -64, -64, -64, 64, -64, -64, -64, -64, 64, -64, 64, 64, 64, 64, 64, 64, -64, 64, 64, -64, -64, 64, 64, 64, -64, -64, -64, 64, -64, -64, -64, -64, -64, -64, -64, -64, 64, -64, 64, -64, 64, 64, -64, 64, 64, 64, 64, 64, -64, 64, 64, -64, -64, -64, 64, 64, 64, -64, 64, -64, -64, -64, -64, 64, 64, 64, -64, 64, 64, -64, 64, -64, 64, -64, -64, 64, 64, -64, -64, 64, 64, 64, -64, -64, -64, -64, -64, -64, -64, -64, 64, 64, 64, 64, -64, 64, 64, -64, -64, -64, -64, -64, 64, -64, 64, -64, 64, -64, 64, 64, -64, 64, -64, -64, -64, -64, -64, 64, -64, 64, 64, 64, 64, 64, 64, -64, -64, 64, -64, 64, -64, -64, -64, 64, 64, 64, 64, -64, 64, 64, -64, -64, -64, -64, 64, -64, 64, 64, 64, 64, 64, -64, -64, -64, -64, 64, 64, 64, 64, -64, 64, 64, -64, 64, -64, 64, -64, -64, -64, -64, 64, -64, -64, 64, 64, -64, 64, 64, -64, -64, -64, -64, -64, 64, 64, 64, 64, 64, -64, 64, 64, 64, 64, 64, -64, -64, 64, -64, 64, -64, -64, -64, 64, -64, -64, 64, 64, 64, -64, -64, -64, -64, 64, 64, -64, 64, -64, -64, 64, 64, -64, 64, -64, 64, -64, -64, 64, -64, 64, 64, -64, -64, -64, 64, -64, 64, -64, 64, 64, 64, 64, -64, -64, 64, -64, -64, 64, -64, -64, -64, 64, -64, -64, 64, 64, -64, 64, -64, 64, -64, 64, 64, -64, 64, -64, -64, 64, 64, -64, -64, 64, -64, 64, 64, 64, 64, 64, 64, -64, -64, -64, 64, -64, 64, 64, 64, -64, 64, -64, -64, 64, 64, 64, 64, -64, 64, 64, 64, 64, -64, 64, 64, 64, 64, 64, 64, -64, -64, -64, -64, -64, -64, -64, 64, -64, -64, 64, -64, 64, -64, -64, 64, 64, 64, -64, 64, 64, -64, 64, 64, 64, 64, 64, 64, 64, -64, -64, -64, -64, 64, 64, 64, -64, -64, -64, -64, 64, -64, 64, 64, -64, -64, 64, -64, 64, 64, 64, -64, -64, -64, -64, -64, -64, 64, -64, 64, -64, -64, -64, -64, -64, 64, -64, 64, 64, -64, -64, -64, 64, -64, 64, 64, 64, 64, -64, -64, -64, -64, -64, 64, 64, 64, -64, -64, -64, -64, -64, 64, -64, -64, -64, -64, 64, 64, -64, -64, -64, 64, -64, -64, -64, -64, -64, -64, -64, -64, -64, -64, 64, 64, -64, -64, 64, -64, -64, -64, -64, 64, -64, -64, -64, -64, 64, -64, -64, -64, -64, 64, 64, 64, -64, 64, -64, 64, -64, -64, 64, -64, -64, 64, 64, 64, 64, -64, 64, 64, -64, -64, -64, -64, -64, -64, -64, 64, 64, 64, -64, -64, -64, -64, 64, 64, 64, 64, -64, -64, 64, -64, 64, 64, -64, -64, -64, 64, -64, -64, -64, -64, 64, 64, 64, -64, -64, 64, 64, -64, -64, -64, 64, -64, -64, -64, -64, -64, -64, -64, -64, -64, -64, 64, -64, -64, -64, -64, -64, -64, -64, -64, -64, 64, -64, 64, -64, -64, -64, -64, -64, -64, -64, -64, 64, 64, -64, -64, 64, -64, -64, -64, -64, -64, -64, -64, 64, -64, 64, 64, 64, -64, 64, -64, 64, 64, -64, -64, 64, -64, -64, -64, 64, -64, -64, -64, 64, -64, -64, -64, -64, -64, 64, -64, 64, -64, 64, 64, -64, -64, 64, -64, -64, 64, -64, 64, -64, -64, -64, 64, -64, 64, -64, 64, -64, 64, -64, 64, 64, 64, -64, -64, -64, -64, -64, -64, -64, -64, 64, 64, -64, -64, 64, -64, 64, -64, -64, 64, 64, -64, -64, -64, -64, -64, 64, -64, -64, -64, 64, -64, 64, -64, 64, -64, -64, 64, 64, -64, -64, 64, -64, -64, 64, -64, -64, 64, 64, -64, -64, 64, -64, -64, -64, 64, 64, 64, 64, -64, -64, 64, -64, -64, -64, 64, -64, -64, 64, 64, -64, 64, 64, -64, -64, -64, 64, 64, -64, -64, 64, -64, -64, -64, 64, -64, 64, -64, -64, -64, -64, -64, -64, 64, 64, -64, -64, 64, -64, 64, 64, 64, 64, 64, -64, -64, 64, 64, 64, -64, -64, 64, -64, -64, -64, -64, 64, 64, -64, -64, 64, 64, 64, 64, -64, 64, -64, -64, 64, 64, -64, 64, -64, -64, -64, 64, 64, -64, -64, -64, -64, 64, -64, -64, 64, -64, -64, 64, 64, 64, 64, -64, 64, -64, 64, -64, 64, 64, -64, 64, 64, 64, -64, -64, 64, -64, 64, -64, -64, -64, -64, -64, -64, 64, -64, 64, 64, 64, 64, -64, -64, 64, 64, 64, 64, 64, -64, 64, 64, 64, -64, -64, 64, -64, 64, 64, 64, -64, -64, 64, 64, -64, -64, 64, -64, -64, -64, -64, -64, 64, 64, -64, 64, 64, -64, 64, -64, 64, -64, -64, -64, 64, 64, -64, 64, 64, 64, -64, 64, 64, -64, 64, 64, -64, -64, -64, -64, 64, 64, 64, -64, 64, 64, -64, -64, 64, -64, 64, -64, -64, -64, -64, 64, -64, -64, 64, 64, -64, -64, -64, 64, 64, 64, -64, 64, -64, -64, -64, -64, -64, -64, 64, -64, -64, -64, 64, 64, -64, -64, -64, -64, -64, 64, -64, -64, -64, -64, 64, -64, 64, -64, -64, 64, 64, 64, -64, -64, -64, 64, -64, 64, -64, 64, -64, -64, -64, 64, 64, 64, 64, 64, -64, -64, -64, -64, -64, 64, 64, -64, -64, -64, 64, 64, -64, -64, 64, -64, -64, -64, 64, 64, -64, -64, 64, -64, 64, 64, -64, -64, 64, -64, 64, -64, -64, 64, 64, -64, -64, -64, 64, 64, 64, 64, 64, 64, -64, -64, 64, -64, 64, -64, 64, -64, 64, -64, 64, 64, 64, -64, 64, -64, -64, -64, -64, 64, 64, -64, 64, 64, 64, -64, -64, -64, -64, 64, 64, 64, 64, -64, 64, 64, -64, -64, 64, 64, 64, -64, -64, -64, -64, 64, 64, 64, -64, 64, 64, 64, -64, -64, -64, -64, 64, -64, 64, -64, -64, 64, 64, 64, -64, -64, -64, 64, 64, 64, -64, 64, 64, -64, -64, 64, 64, 64, 64, 64, -64, -64, -64, -64, -64, -64, -64, -64, 64, -64, -64, 64, -64, -64, 64, -64, -64, -64, 64, -64, -64, -64, -64, -64, 64, 64, -64, -64, 64, -64, -64, -64, 64, 64, 64, 64, 64, 64, -64, 64, -64, -64, -64, 64, 64, 64, 64, 64, -64, 64, 64, -64, -64, 64, -64, -64, 64, -64, 64, -64, 64, 64, 64, -64, -64, -64, 64, 64, 64, 64, 64, 64, -64, 64, 64, -64, -64, -64, 64, 64, -64, -64, -64, 64, 64, 64, 64, -64, -64, -64, 64, 64, -64, 64, 64, -64, 64, 64, 64, 64, 64, 64, -64, -64, 64, 64, 64, 64, 64, -64, -64, 64, -64, 64, -64, 64, -64, 64, 64, -64, -64, -64, -64, 64, 64, 64, -64, 64, 64, 64, 64, 64, 64, 64, 64, 64, -64, 64, 64, 64, 64, 64, 64, -64, 64, 64, 64, 64, 64, 64, 64, 64, 64, 64, 64, 64, 64, 64, 64, 64, -64, -64, -64, -64, -64, 64, -64, -64, -64, -64, 64, -64, 64, 64, 64, 64, 64, 64, 64, -64, 64, -64, 64, 64, 64, 64, 64, 64, 64, -64, 64, -64, 64, -64, 64, 64, -64, -64, 64, -64, 64, 64, 64, 64, 64, 64, 64, 64, 64, 64, 64, 64, 64, 64, 64, 64, -64, -64, -64, -64, -64, 64, 64, 64, 64, 64, 64, 64, 64, 64, 64, 64, 64, 64, 64, -64, 64, 64, -64, 64, -64, 64, 64, 64, 64, -64, -64, -64, -64, -64, 64, 64, -64, 64, 64, 64, 64, 64, 64, 64, 64, 64, -64, 64, 64, 64, -64, 64, 64, 64, 64, 64, -64, -64, -64, -64, -64, -64, -64, 64, 64, -64, -64, 64, 64, -64, 64, 64, 64, -64, 64, 64, -64, 64, 64, -64, 64, -64, 64, -64, -64, -64, -64, -64, -64, -64, -64, 64, -64, -64, 64, -64, 64, -64, 64, 64, -64, -64, -64, -64, -64, 64, -64, -64, -64, 64, 64, -64, -64, -64, -64, -64, -64, -64, -64, 64, 64, -64, 64, 64, 64, -64, 64, 64, -64, -64, -64, -64, -64, 64, 64, 64, 64, 64, -64, -64, -64, -64, -64, -64, 64, 64, 64, 64, -64, -64, 64, -64, 64, 64, -64, -64, -64, -64, -64, -64, 64, 64, 64, 64, 64, 64, 64, -64, -64, -64, 64, 64, -64, 64, -64, -64, -64, 64, 64, 64, 64, 64, 64, 64, -64, -64, -64, -64, 64, 64, 64, 64, 64, -64, -64, -64, -64, 64, 64, 64, 64, 64, 64, -64, -64, 64, 64, 64, 64, 64, -64, -64, -64, -64, -64, -64, 64, -64, 64, -64, -64, 64, 64, 64, 64, 64, 64, 64, 64, 64, 64, -64, -64, -64, -64, 64, 64, -64, 64, 64, 64, 64, 64, -64, 64, -64, -64, 64, 64, 64, 64, 64, 64, 64, 64, 64, 64, 64, 64, -64, 64, -64, 64, 64, 64, -64, 64, -64, 64, -64, 64, -64, 64, -64, -64, 64, 64, 64, 64, 64, -64, -64, 64, -64, -64, 64, -64, -64, -64, -64, 64, 64, 64, 64, -64, -64, 64, 64, -64, -64, -64, 64, 64, 64, 64, 64, 64, 64, 64, -64, 64, 64, -64, -64, -64, 64, -64, -64, -64, 64, 64, 64, -64, 64, 64, -64, -64, -64, -64, 64, 64, 64, 64, 64, 64, 64, 64, 64, -64, -64, 64, -64, 64, -64, 64, -64, 64, 64, 64, 64, -64, -64, 64, -64, -64, 64, 64, 64, 64, -64, 64, 64, 64, 64, 64, 64, 64, -64, 64, 64, 64, 64, 64, 64, 64, 64, -64, -64, -64, -64, -64, -64, -64, 64, 64, 64, 64, 64, 64, 64, 64, 64, 64, 64, 64, 64, -64, 64, -64, 64, 64, 64, 64, 64, -64, -64, -64, -64, -64, 64, 64, 64, 64, 64, 64, 64, 64, 64, 64, -64, -64, 64, 64, 64, 64, -64, -64, 64, -64, 64, -64, -64, -64, -64, -64, -64, 64, -64, 64, 64, 64, 64, 64, -64, -64, 64, 64, -64, 64, -64, 64, -64, 64, 64, -64, -64, -64, -64, -64, -64, -64, -64, -64, -64, -64, 64, 64, -64, 64, 64, 64, 64, 64, -64, 64, -64, 64, 64, 64, -64, -64, -64, 64, -64, -64, -64, -64, -64, 64, -64, 64, -64, 64, 64, 64, 64, 64, -64, -64, -64, 64, 64, -64, -64, -64, -64, 64, 64, -64, -64, 64, 64, -64, -64, -64, 64, 64, -64, 64, -64, -64, 64, 64, -64, -64, -64, -64, 64, -64, 64, 64, 64, -64, 64, -64, 64, 64, 64, -64, 64, 64, -64, -64, 64, -64, -64, 64, -64, 64, -64, 64, 64, -64, 64, 64, 64, -64, -64, -64, -64, 64, 64, -64, -64, -64, 64, -64, 64, -64, 64, 64, -64, 64, 64, -64, -64, -64, 64, 64, -64, 64, -64, -64, -64, 64, -64, 64, 64, 64, -64, 64, -64, -64, 64, 64, 64, 64, -64, 64, 64, 64, -64, -64, -64, 64, 64, -64, -64, -64, -64, -64, -64, -64, 64, 64, 64, -64, 64, 64, -64, 64, -64, -64, 64, -64, -64, 64, -64, 64, 64, -64, -64, -64, 64, 64, -64, -64, 64, -64, -64, -64, -64, 64, 64, -64, -64, 64, -64, -64, 64, 64, -64, -64, 64, 64, -64, -64, -64, -64, 64, 64, -64, 64, -64, 64, -64, -64, -64, -64, 64, -64, 64, -64, 64, -64, -64, -64, 64, 64, -64, -64, -64, 64, -64, -64, -64, -64, 64, -64, -64, -64, -64, 64, -64, 64, 64, -64, 64, 64, -64, -64, 64, 64, -64, 64, -64, 64, 64, 64, 64, 64, -64, -64, 64, 64, -64, -64, -64, 64, 64, -64, 64, 64, 64, 64, 64, 64, 64, -64, -64, 64, 64, 64, -64, 64, -64, -64, 64, 64, -64, -64, -64, -64, 64, -64, -64, -64, -64, 64, -64, -64, -64, 64, 64, -64, 64, -64, 64, -64, 64, -64, -64, 64, 64, 64, 64, -64, -64, -64, -64, -64, -64, -64, -64, -64, 64, -64, -64, -64, -64, 64, 64, 64, 64, 64, 64, 64, -64, 64, -64, -64, -64, 64, -64, -64, -64, -64, -64, -64, -64, 64, 64, -64, 64, -64, -64, -64, -64, 64, 64, 64, 64, 64, 64, 64, 64, -64, 64, -64, -64, 64, -64, -64, -64, -64, -64, -64, -64, -64, 64, -64, 64, -64, -64, 64, -64, 64, -64, 64, 64, 64, 64, 64, 64, -64, -64, 64, -64, 64, 64, 64, 64, 64, -64, 64, 64, 64, 64, 64, 64, 64, -64, 64, 64, 64, 64, 64, 64, 64, 64, 64, -64, -64, 64, 64, -64, 64, 64, 64, -64, -64, 64, 64, 64, 64, 64, 64, -64, -64, 64, -64, 64, 64, 64, 64, 64, 64, 64, 64, -64, -64, 64, 64, -64, 64, -64, 64, -64, -64, 64, 64, 64, 64, 64, 64, -64, -64, -64, -64, 64, 64, -64, 64, 64, 64, 64, 64, 64, 64, -64, 64, -64, -64, -64, 64, -64, -64, -64, 64, 64, 64, 64, 64, -64, -64, -64, -64, 64, -64, -64, -64, -64, -64, 64, 64, 64, -64, -64, 64, -64, -64, -64, -64, -64, -64, 64, 64, 64, 64, 64, -64, -64, -64, -64, 64, 64, 64, 64, -64, 64, 64, -64, 64, 64, -64, -64, -64, -64, -64, 64, 64, -64, -64, 64, -64, 64, 64, 64, 64, 64, -64, 64, 64, 64, 64, 64, -64, 64, -64, -64, -64, -64, -64, -64, -64, -64, -64, -64, -64, -64, -64, 64, 64, 64, 64, 64, 64, 64, 64, 64, 64, 64, 64, 64, -64, 64, -64, -64, -64, -64, -64, -64, -64, 64, 64, -64, -64, 64, -64, -64, -64, 64, 64, 64, 64, 64, -64, 64, 64, 64, 64, 64, 64, 64, -64, -64, -64, -64, 64, -64, -64, 64, -64, -64, -64, -64, -64, -64, 64, -64, 64, 64, 64, 64, 64, -64, 64, -64, 64, -64, -64, -64, -64, -64, -64, -64, -64, -64, 64, -64, 64, -64, -64, -64, 64, -64, -64, -64, 64, -64, 64, 64, 64, 64, -64, -64, -64, 64, -64, 64, -64, -64, -64, -64, 64, -64, -64, -64, -64, -64, -64, -64, -64, -64, 64, -64, 64, 64, 64, 64, 64, 64, 64, 64, -64, -64, -64, -64, -64, -64, -64, -64, 64, -64, -64, -64, -64, 64, -64, 64, -64, -64, 64, 64, -64, -64, 64, -64, 64, -64, -64, -64, -64, -64, -64, -64, -64, -64, 64, 64, -64, 64, -64, 64, 64, 64, -64, 64, 64, 64, 64, -64, -64, -64, -64, -64, 64, -64, 64, 64, -64, -64, -64, -64, 64, -64, 64, 64, -64, 64, -64, 64, -64, -64, -64, -64, -64, -64, 64, 64, -64, -64, -64, -64, -64, -64, -64, 64, -64, -64, -64, -64, 64, 64, 64, 64, 64, 64, -64, 64, -64, 64, 64, 64, -64, 64, -64, -64, 64, -64, -64, 64, 64, -64, 64, -64, -64, -64, -64, 64, 64, 64, -64, 64, -64, -64, -64, 64, -64, 64, 64, -64, 64, 64, -64, -64, -64, -64, -64, -64, -64, -64, -64, -64, -64, -64, -64, -64, -64, -64, -64, 64, -64, -64, -64, -64, 64, -64, -64, 64, 64, -64, 64, 64, 64, 64, 64, 64, 64, -64, -64, 64, 64, 64, -64, 64, -64, -64, 64, 64, 64, -64, -64, -64, -64, -64, 64, -64, 64, 64, -64, 64, -64, 64, -64, 64, -64, 64, -64, -64, 64, -64, 64, 64, -64, 64, 64, 64, 64, -64, 64, 64, -64, -64, -64, -64, -64, -64, 64, 64, -64, 64, -64, -64, -64, -64, 64, -64, -64, 64, -64, -64, 64, 64, -64, 64, 64, 64, -64, 64, 64, 64, 64, 64, -64, -64, 64, 64, -64, 64, 64, 64, -64, 64, -64, -64, -64, 64, 64, 64, 64, -64, -64, -64, 64, -64, 64, -64, 64, -64, -64, 64, -64, -64, -64, 64, -64, -64, -64, -64, -64, -64, -64, -64, -64, -64, -64, -64, -64, -64, -64, -64, -64, 64, 64, -64, -64, -64, -64, -64, 64, 64, 64, 64, -64, 64, -64, -64, -64, -64, 64, -64, 64, -64, 64, 64, -64, -64, -64, -64, 64, 64, -64, 64, 64, 64, 64, 64, 64, 64, 64, 64, 64, 64, -64, 64, 64, 64, -64, -64, -64, -64, -64, -64, -64, 64, -64, 64, -64, -64, 64, -64, 64, -64, 64, 64, -64, -64, 64, 64, 64, 64, 64, -64, -64, 64, -64, -64, -64, -64, -64, -64, -64, -64, -64, -64, -64, 64, 64, 64, 64, 64, -64, 64, 64, 64, 64, 64, 64, 64, 64, -64, -64, -64, 64, -64, -64, -64, -64, -64, -64, -64, -64, -64, -64, -64, -64, -64, -64, 64, 64, 64, 64, 64, 64, 64, -64, -64, -64, -64, 64, 64, 64, -64, -64, -64, -64, -64, -64, -64, -64, -64, -64, -64, -64, -64, 64, 64, 64, 64, 64, -64, -64, 64, -64, -64, -64, -64, 64, 64, 64, -64, -64, -64, -64, -64, -64, -64, -64, -64, -64, 64, -64, -64, 64, -64, -64, -64, -64, -64, -64, -64, -64, -64, -64, 64, 64, 64, 64, 64, -64, -64, -64, -64, -64, -64, 64, -64, -64, 64, -64, 64, 64, 64, -64, -64, -64, -64, -64, -64, -64, -64, -64, 64, 64, 64, -64, 64, -64, -64, -64, -64, -64, 64, 64, -64, 64, -64, -64, 64, -64, -64, 64, -64, -64, -64, -64, -64, 64, -64, 64, 64, 64, -64, -64, -64, -64, -64, -64, -64, -64, -64, -64, -64, -64, 64, -64, -64, -64, -64, -64, -64, -64, -64, -64, -64, -64, 64, 64, 64, -64, -64, -64, -64, -64, -64, -64, -64, 64, 64, 64, -64, -64, 64, -64, -64, -64, -64, -64, -64, -64, -64, -64, -64, 64, 64, 64, 64, -64, 64, 64, -64, -64, -64, -64, -64, -64, 64, 64, -64, 64, 64, -64, -64, 64, 64, 64, -64, -64, -64, -64, -64, -64, -64, -64, -64, -64, 64, -64, 64, -64, -64, -64, -64, -64, -64, 64, -64, -64, -64, -64, 64, 64, -64, -64, 64, 64, -64, -64, -64, -64, -64, -64, -64, -64, -64, -64, 64, 64, 64, 64, -64, -64, 64, -64, -64, -64, -64, 64, 64, -64, -64, -64, 64, -64, -64, -64, -64, -64, -64, 64, -64, -64, -64, -64, -64, 64, 64, 64, 64, 64, 64, -64, -64, -64, -64, 64, -64, -64, 64, -64, 64, -64, -64, -64, -64, -64, -64, -64, -64, -64, -64, -64, -64, -64, -64, 64, 64, 64, 64, -64, -64, -64, -64, -64, -64, -64, 64, 64, 64, -64, -64, -64, 64, -64, -64, -64, 64, -64, -64, -64, -64, -64, -64, 64, 64, 64, -64, 64, -64, -64, -64, -64, 64, 64, 64, -64, -64, 64, -64, 64, 64, 64, -64, 64, -64, 64, -64, -64, -64, -64, 64, 64, 64, 64, 64, -64, -64, -64, 64, -64, 64, 64, -64, -64, -64, -64, -64, -64, -64, 64, 64, 64, -64, -64, -64, 64, 64, -64, -64, -64, 64, -64, 64, -64, 64, 64, 64, -64, 64, -64, -64, -64, -64, -64, -64, -64, -64, -64, 64, 64, 64, -64, -64, -64, 64, -64, 64, 64, -64, -64, 64, -64, -64, 64, -64, 64, 64, 64, -64, -64, -64, -64, -64, -64, -64, 64, -64, -64, 64, 64, 64, 64, 64, -64, 64, 64, 64, 64, -64, -64, -64, 64, 64, -64, -64, -64, 64, -64, 64, 64, -64, -64, -64, -64, 64, -64, -64, -64, 64, 64, -64, -64, 64, 64, 64, 64, -64, -64, 64, 64, 64, 64, 64, 64, 64, -64, -64, 64, 64, 64, -64, -64, 64, 64, -64, -64, 64, 64, -64, -64, -64, -64, -64, -64, -64, 64, -64, -64, 64, 64, -64, -64, -64, -64, 64, 64, 64, -64, -64, -64, -64, 64, -64, 64, 64, -64, -64, -64, 64, -64, -64, -64, -64, -64, -64, -64, -64, -64, 64, 64, -64, 64, -64, 64, 64, 64, -64, 64, 64, 64, 64, -64, 64, -64, 64, -64, 64, 64, 64, -64, -64, -64, 64, -64, -64, -64, 64, -64, 64, -64, -64, 64, -64, -64, 64, 64, -64, 64, -64, -64, -64, -64, -64, -64, 64, -64, -64, 64, 64, 64, -64, -64, 64, -64, -64, 64, 64, 64, -64, -64, -64, -64, -64, 64, -64, -64, -64, 64, 64, -64, -64, -64, 64, -64, 64, 64, -64, 64, 64, 64, -64, -64, -64, -64, 64, 64, -64, 64, -64, -64, 64, -64, -64, 64, 64, 64, 64, 64, 64, -64, -64, -64, 64, 64, -64, 64, -64, -64, -64, -64, -64, 64, -64, 64, 64, 64, 64, 64, 64, 64, 64, -64, -64, -64, -64, 64, -64, 64, 64, 64, 64, 64, 64, -64, 64, -64, -64, 64, 64, 64, 64, 64, 64, 64, -64, 64, -64, -64, -64, -64, -64, 64, -64, 64, -64, -64, -64, -64, -64, -64, 64, -64, -64, -64, -64, -64, 64, 64, 64, -64, -64, 64, -64, 64, -64, -64, -64, -64, -64, 64, -64, 64, 64, -64, -64, -64, -64, 64, -64, -64, -64, -64, -64, 64, 64, 64, -64, 64, 64, -64, -64, -64, -64, -64, -64, -64, -64, -64, -64, 64, 64, 64, 64, 64, -64, 64, 64, -64, 64, 64, -64, -64, -64, 64, 64, -64, -64, -64, -64, -64, -64, -64, -64, -64, -64, -64, 64, 64, -64, 64, 64, -64, 64, -64, -64, -64, -64, -64, 64, -64, 64, -64, -64, -64, 64, -64, -64, -64, -64, 64, -64, 64, 64, 64, 64, 64, 64, -64, 64, 64, 64, 64, -64, -64, 64, -64, -64, -64, 64, -64, 64, 64, 64, -64, -64, 64, 64, 64, 64, 64, 64, -64, -64, -64, -64, -64, 64, 64, 64, -64, -64, -64, -64, -64, -64, -64, 64, 64, 64, 64, 64, 64, -64, 64, -64, 64, -64, -64, -64, -64, -64, -64, 64, 64, 64, 64, 64, -64, -64, -64, -64, -64, -64, -64, -64, 64, 64, 64, 64, 64, -64, -64, -64, -64, -64, -64, -64, -64, -64, -64, 64, 64, 64, 64, 64, -64, -64, -64, -64, -64, 64, -64, -64, -64, 64, 64, 64, 64, -64, -64, -64, -64, -64, -64, -64, -64, -64, 64, 64, 64, 64, 64, -64, -64, -64, -64, -64, -64, -64, -64, 64, -64, 64, 64, 64, -64, -64, -64, -64, -64, -64, 64, 64, 64, -64, -64, 64, 64, 64, 64, 64, -64, -64, -64, -64, -64, -64, -64, 64, -64, 64, 64, -64, -64, -64, -64, -64, 64, 64, 64, 64, -64, 64, 64, 64, 64, 64, 64, -64, -64, -64, -64, -64, -64, -64, 64, 64, -64, 64, 64, -64, -64, -64, -64, -64, 64, 64, 64, 64, 64, -64, 64, 64, 64, -64, -64, -64, -64, -64, -64, -64, -64, -64, -64, -64, 64, 64, 64, -64, -64, -64, -64, -64, -64, 64, 64, 64, -64, 64, 64, 64, -64, -64, -64, -64, -64, -64, -64, -64, -64, -64, -64, 64, -64, 64, 64, 64, -64, -64, -64, -64, -64, -64, 64, -64, 64, -64, 64, 64, -64, -64, -64, -64, -64, -64, -64, -64, -64, -64, 64, -64, 64, -64, 64, 64, -64, -64, -64, -64, -64, 64, -64, -64, -64, 64, 64, 64, 64, -64, -64, -64, -64, -64, 64, -64, 64, -64, -64, -64, 64, 64, 64, 64, 64, -64, -64, -64, -64, -64, -64, -64, -64, -64, 64, 64, -64, 64, -64, -64, -64, -64, -64, -64, -64, 64, -64, -64, 64, -64, -64, -64, 64, 64, -64, -64, -64, 64, -64, 64, -64, 64, -64, -64, -64, -64, -64, -64, -64, 64, -64, -64, -64, -64, -64, -64, -64, -64, 64, -64, -64, 64, -64, -64, -64, -64, -64, 64, -64, 64, -64, 64, -64, -64, -64, -64, -64, -64, -64, -64, 64, -64, 64, 64, -64, -64, -64, -64, 64, 64, -64, 64, 64, 64, 64, 64, -64, 64, 64, 64, -64, -64, -64, -64, -64, -64, -64, -64, -64, 64, 64, -64, 64, -64, 64, 64, 64, 64, 64, 64, 64, 64, -64, 64, 64, 64, 64, -64, -64, -64, -64, -64, -64, -64, -64, -64, -64, 64, -64, -64, -64, 64, -64, -64, -64, 64, 64, 64, 64, 64, 64, 64, 64, -64, -64, -64, -64, -64, -64, -64, -64, -64, -64, -64, -64, -64, -64, -64, 64, -64, 64, -64, -64, -64, 64, 64, 64, 64, 64, 64, 64, -64, -64, -64, -64, -64, -64, 64, -64, -64, -64, -64, -64, -64, -64, 64, -64, -64, -64, 64, 64, 64, 64, 64, 64, 64, 64, 64, -64, 64, 64, -64, -64, -64, -64, 64, 64, 64, 64, 64, 64, -64, 64, -64, -64, -64, -64, 64, -64, 64, 64, -64, 64, 64, 64, 64, 64, 64, -64, -64, -64, -64, -64, -64, -64, 64, 64, 64, -64, 64, 64, 64, -64, -64, 64, 64, -64, -64, -64, 64, -64, 64, 64, -64, 64, -64, -64, 64, -64, -64, -64, 64, -64, -64, 64, -64, 64, 64, 64, 64, -64, 64, 64, 64, -64, -64, -64, 64, -64, -64, 64, 64, -64, -64, -64, 64, 64, 64, 64, 64, -64, 64, -64, 64, 64, 64, 64, -64, 64, 64, 64, 64, -64, 64, 64, -64, 64, -64, -64, 64, 64, 64, 64, -64, -64, 64, -64, 64, 64, 64, 64, 64, 64, -64, 64, 64, -64, -64, 64, 64, 64, 64, 64, -64, -64, 64, -64, 64, 64, 64, 64, 64, 64, 64, 64, -64, 64, -64, 64, -64, -64, 64, -64, -64, -64, -64, 64, 64, -64, -64, -64, -64, -64, -64, -64, -64, -64, -64, 64, 64, 64, 64, 64, -64, 64, 64, -64, 64, -64, -64, 64, 64, 64, -64, 64, -64, 64, 64, -64, -64, -64, -64, -64, -64, -64, -64, 64, 64, 64, 64, 64, 64, 64, 64, 64, 64, 64, 64, -64, 64, -64, 64, 64, 64, 64, -64, -64, -64, -64, -64, -64, -64, 64, 64, 64, 64, 64, 64, 64, 64, 64, 64, 64, 64, 64, -64, -64, 64, 64, 64, -64, -64, 64, -64, -64, -64, -64, -64, -64, 64, 64, -64, 64, 64, 64, 64, 64, 64, 64, 64, 64, 64, 64, 64, 64, -64, -64, 64, -64, -64, 64, -64, 64, 64, 64, -64, 64, 64, -64, -64, -64, -64, -64, 64, 64, 64, 64, 64, 64, 64, 64, -64, 64, -64, 64, -64, 64, -64, -64, -64, -64, 64, 64, -64, -64, -64, -64, -64, -64, -64, -64, 64, 64, 64, 64, 64, 64, 64, 64, -64, 64, 64, -64, -64, -64, -64, -64, -64, -64, 64, -64, -64, -64, 64, -64, -64, -64, -64, -64, 64, 64, 64, 64, 64, 64, 64, 64, 64, 64, 64, -64, 64, -64, -64, -64, -64, -64, -64, -64, 64, -64, 64, -64, -64, -64, 64, -64, -64, 64, 64, -64, 64, 64, 64, 64, 64, -64, -64, -64, -64, -64, -64, -64, 64, -64, 64, -64, 64, 64, -64, -64, -64, 64, -64, 64, -64, 64, -64, 64, 64, 64, 64, 64, 64, 64, -64, 64, 64, -64, -64, 64, 64, 64, 64, 64, 64, 64, 64, 64, 64, 64, -64, 64, -64, -64, -64, 64, 64, 64, 64, -64, -64, 64, 64, -64, 64, 64, -64, 64, 64, 64, 64, 64, 64, 64, 64, 64, 64, 64, 64, 64, -64, -64, -64, 64, 64, 64, 64, 64, -64, -64, 64, -64, 64, 64, -64, 64, 64, 64, 64, 64, 64, 64, 64, 64, 64, 64, 64, 64, -64, 64, 64, 64, 64, -64, -64, 64, -64, 64, -64, -64, 64, 64, -64, 64, 64, 64, 64, 64, 64, 64, 64, 64, 64, -64, -64, -64, 64, 64, 64, 64, -64, 64, -64, -64, -64, 64, -64, 64, 64, 64, 64, 64, 64, 64, 64, 64, 64, 64, -64, -64, -64, -64, -64, 64, 64, 64, 64, 64, 64, 64, -64, -64, -64, -64, -64, -64, -64, 64, 64, 64, -64, 64, 64, 64, -64, -64, -64, 64, -64, 64, -64, 64, 64, 64, 64, 64, 64, 64, -64, -64, -64, -64, 64, -64, 64, -64, 64, -64, 64, 64, 64, 64, 64, -64, 64, -64, 64, -64, 64, 64, 64, 64, 64, -64, -64, -64, -64, -64, -64, -64, 64, 64, -64, -64, -64, 64, 64, 64, 64, -64, 64, 64, -64, 64, -64, -64, 64, -64, 64, -64, -64, -64, 64, 64, -64, -64, -64, 64, -64, 64, 64, -64, 64, 64, 64, 64, 64, 64, -64, 64, -64, 64, 64, -64, -64, 64, -64, -64, -64, 64, 64, 64, -64, -64, 64, 64, -64, -64, 64, -64, -64, 64, 64, 64, 64, 64, 64, 64, 64, 64, 64, -64, -64, -64, -64, -64, 64, 64, 64, 64, 64, 64, -64, -64, 64, -64, -64, 64, -64, 64, 64, 64, 64, -64, 64, 64, 64, 64, -64, -64, -64, 64, -64, -64, -64, -64, -64, -64, 64, -64, -64, 64, 64, 64, -64, -64, -64, 64, 64, 64, 64, 64, 64, 64, 64, 64, -64, -64, -64, 64, 64, 64, -64, 64, -64, 64, 64, -64, 64, 64, -64, -64, -64, -64, -64, -64, -64, 64, 64, 64, 64, 64, 64, 64, 64, -64, 64, 64, 64, -64, -64, -64, 64, 64, -64, -64, -64, 64, 64, -64, -64, -64, -64, -64, -64, -64, -64, -64, -64, -64, -64, -64, -64, -64, -64, -64, -64, -64, -64, -64, -64, -64, -64, -64, 64, 64, -64, 64, -64, -64, 64, -64, 64, -64, 64, 64, -64, -64, -64, -64, -64, -64, -64, 64, -64, -64, -64, -64, -64, -64, -64, -64, 64, -64, 64, -64, 64, -64, -64, -64, 64, 64, 64, 64, -64, -64, -64, 64, -64, 64, 64, 64, 64, -64, -64, 64, 64, 64, 64, -64, -64, 64, -64, -64, -64, -64, -64, -64, -64, 64, -64, 64, 64, -64, 64, -64, 64, 64, 64, -64, -64, 64, -64, -64, -64, 64, -64, -64, -64, -64, 64, 64, 64, -64, -64, 64, 64, -64, 64, 64, 64, 64, 64, -64, 64, 64, 64, -64, -64, 64, -64, -64, 64, 64, 64, -64, 64, 64, 64, 64, -64, 64, -64, -64, 64, 64, 64, 64, 64, 64, -64, 64, 64, 64, -64, 64, 64, 64, 64, 64, -64, 64, -64, 64, 64, 64, -64, -64, 64, -64, -64, 64, 64, 64, -64, 64, 64, -64, 64, 64, 64, 64, 64, 64, 64, 64, 64, 64, -64, 64, 64, 64, 64, 64, -64, -64, 64, 64, -64, -64, 64, 64, 64, 64, -64, -64, -64, 64, -64, 64, 64, -64, 64, 64, 64, 64, 64, 64, 64, 64, -64, 64, 64, 64, 64, 64, -64, -64, 64, 64, 64, 64, 64, 64, 64, 64, 64, 64, 64, 64, -64, -64, 64, 64, 64, 64, 64, 64, 64, 64, 64, -64, 64, 64, -64, 64, 64, 64, 64, 64, 64, 64, 64, 64, 64, 64, -64, -64, -64, -64, -64, -64, 64, 64, 64, 64, 64, 64, 64, 64, -64, 64, 64, 64, 64, 64, 64, 64, 64, 64, 64, -64, -64, 64, 64, 64, 64, 64, 64, -64, -64, -64, -64, 64, -64, 64, 64, -64, 64, 64, -64, 64, 64, 64, 64, 64, -64, 64, -64, -64, -64, 64, -64, 64, 64, 64, -64, 64, -64, -64, 64, 64, 64, -64, 64, -64, 64, -64, 64, 64, 64, 64, 64, 64, -64, 64, -64, -64, 64, 64, 64, 64, 64, -64, -64, -64, -64, 64, -64, 64, 64, 64, -64, -64, 64, -64, 64, 64, 64, 64, 64, -64, 64, -64, -64, -64, 64, 64, 64, 64, 64, -64, -64, -64, 64, -64, 64, 64, 64, 64, -64, 64, 64, 64, 64, 64, 64, -64, 64, -64, -64, 64, 64, 64, 64, 64, 64, 64, 64, 64, 64, 64, 64, 64, 64, -64, 64, -64, -64, -64, 64, -64, 64, 64, -64, -64, 64, 64, 64, -64, -64, 64, 64, 64, 64, 64, 64, 64, -64, 64, 64, 64, 64, 64, 64, 64, -64, 64, -64, 64, 64, 64, 64, -64, -64, -64, -64, -64, 64, 64, 64, 64, -64, -64, -64, -64, -64, -64, -64, -64, -64, 64, 64, -64, -64, 64, 64, -64, -64, 64, -64, -64, -64, -64, -64, -64, 64, -64, -64, -64, 64, -64, -64, -64, -64, -64, 64, 64, 64, -64, -64, -64, 64, -64, 64, -64, -64, -64, -64, -64, -64, -64, -64, 64, -64, -64, -64, -64, -64, -64, -64, -64, -64, 64, 64, 64, -64, -64, -64, -64, -64, 64, 64, -64, -64, -64, -64, -64, -64, -64, 64, -64, -64, -64, -64, -64, -64, -64, -64, 64, -64, -64, 64, -64, 64, -64, -64, -64, -64, 64, 64, 64, 64, -64, -64, -64, -64, -64, 64, 64, 64, -64, -64, -64, -64, -64, -64, -64, 64, -64, -64, -64, -64, 64, -64, 64, -64, 64, 64, 64, -64, -64, -64, -64, -64, -64, 64, -64, -64, -64, -64, -64, -64, -64, -64, -64, 64, -64, -64, -64, -64, -64, -64, 64, -64, 64, 64, 64, -64, -64, -64, -64, 64, 64, -64, -64, -64, 64, 64, -64, 64, -64, 64, -64, 64, -64, 64, -64, 64, 64, 64, -64, 64, 64, 64, 64, -64, -64, 64, 64, 64, 64, 64, 64, 64, 64, 64, -64, 64, 64, 64, 64, 64, 64, 64, 64, -64, 64, 64, -64, -64, 64, 64, 64, -64, -64, 64, 64, 64, 64, 64, 64, 64, 64, 64, 64, 64, 64, 64, 64, 64, 64, 64, 64, 64, 64, -64, -64, -64, -64, -64, 64, 64, -64, 64, 64, 64, 64, 64, 64, 64, 64, 64, 64, 64, 64, 64, 64, 64, 64, 64, 64, -64, -64, -64, -64, -64, 64, 64, 64, -64, -64, 64, 64, 64, 64, 64, 64, 64, 64, 64, 64, 64, 64, 64, 64, -64, -64, -64, -64, 64, -64, -64, 64, 64, -64, 64, -64, -64, -64, -64, -64, -64, -64, 64, 64, 64, 64, 64, 64, 64, 64, 64, -64, 64, -64, -64, -64, -64, -64, 64, -64, -64, -64, 64, 64, -64, -64, -64, -64, 64, 64, 64, 64, -64, -64, -64, 64, 64, 64, 64, 64, -64, -64, -64, -64, -64, 64, 64, 64, -64, 64, -64, 64, -64, -64, -64, 64, -64, 64, 64, 64, -64, -64, -64, 64, 64, 64, 64, -64, -64, -64, 64, -64, -64, -64, 64, -64, 64, -64, -64, 64, -64, -64, -64, -64, 64, 64, -64, 64, -64, 64, 64, 64, 64, 64, 64, -64, -64, 64, -64, 64, -64, 64, -64, 64, 64, -64, -64, -64, 64, 64, -64, -64, -64, -64, -64, -64, -64, -64, -64, 64, 64, 64, 64, -64, 64, 64, -64, 64, -64, -64, 64, -64, 64, 64, 64, 64, -64, 64, 64, -64, -64, 64, 64, -64, 64, -64, -64, 64, 64, -64, -64, 64, -64, 64, 64, 64, 64, -64, -64, 64, -64, -64, 64, -64, 64, -64, 64, 64, 64, -64, 64, -64, -64, 64, 64, 64, -64, -64, 64, -64, -64, 64, -64, 64, -64, -64, -64, -64, 64, -64, 64, -64, 64, 64, -64, 64, -64, -64, 64, -64, -64, 64, 64, 64, 64, 64, 64, 64, -64, -64, -64, 64, 64, -64, -64, -64, 64, -64, 64, -64, 64, -64, 64, 64, 64, 64, -64, -64, 64, -64, 64, 64, 64, 64, 64, 64, 64, 64, -64, 64, 64, -64, -64, -64, 64, 64, -64, 64, -64, -64, -64, 64, 64, 64, -64, -64, -64, -64, -64, 64, 64, 64, 64, 64, -64, -64, -64, 64, 64, 64, -64, -64, 64, 64, -64, -64, -64, -64, -64, -64, -64, -64, -64, -64, -64, -64, 64, 64, 64, 64, 64, 64, 64, -64, -64, -64, 64, 64, 64, -64, -64, 64, -64, 64, -64, -64, -64, -64, -64, -64, -64, -64, -64, -64, 64, 64, 64, 64, 64, 64, 64, -64, -64, -64, -64, 64, -64, 64, -64, -64, -64, -64, 64, -64, -64, -64, -64, -64, -64, -64, -64, -64, -64, 64, 64, -64, -64, -64, 64, 64, -64, -64, -64, 64, 64, 64, 64, -64, -64, -64, 64, -64, 64, 64, 64, -64, -64, 64, 64, 64, -64, -64, 64, -64, 64, 64, 64, -64, -64, -64, 64, 64, 64, -64, 64, -64, -64, 64, -64, -64, 64, 64, 64, -64, 64, 64, 64, 64, 64, 64, 64, -64, -64, -64, 64, 64, -64, 64, 64, 64, 64, -64, -64, 64, -64, 64, 64, -64, 64, 64, 64, -64, -64, -64, 64, 64, 64, 64, -64, -64, -64, 64, -64, 64, -64, 64, 64, 64, 64, -64, -64, 64, -64, 64, 64, -64, -64, 64, 64, -64, -64, 64, 64, 64, 64, 64, 64, 64, -64, 64, -64, 64, -64, -64, -64, 64, -64, 64, -64, 64, -64, 64, -64, 64, -64, -64, 64, 64, 64, 64, 64, 64, 64, -64, -64, 64, 64, 64, 64, 64, -64, -64, -64, -64, 64, 64, -64, 64, -64, 64, 64, -64, -64, -64, 64, 64, 64, 64, 64, 64, 64, 64, 64, -64, -64, -64, 64, -64, 64, -64, 64, 64, -64, 64, 64, -64, 64, 64, -64, 64, 64, -64, 64, 64, 64, 64, 64, 64, 64, 64, 64, -64, -64, 64, 64, -64, -64, 64, 64, -64, 64, 64, -64, 64, -64, 64, 64, 64, -64, 64, 64, 64, 64, 64, 64, -64, 64, -64, 64, 64, 64, 64, 64, 64, 64, 64, 64, 64, 64, 64, -64, 64, 64, -64, 64, 64, -64, 64, 64, 64, 64, -64, 64, -64, -64, -64, 64, -64, -64, 64, 64, 64, 64, 64, 64, -64, 64, -64, -64, -64, -64, -64, 64, 64, 64, 64, 64, 64, 64, 64, -64, -64, -64, 64, -64, -64, 64, 64, 64, 64, 64, 64, 64, -64, 64, 64, -64, 64, 64, 64, 64, 64, 64, 64, 64, 64, -64, -64, -64, -64, 64, -64, 64, -64, -64, 64, 64, 64, 64, 64, 64, -64, 64, 64, -64, -64, -64, 64, 64, -64, 64, 64, 64, 64, -64, -64, -64, -64, -64, 64, -64, 64, 64, 64, 64, 64, 64, 64, 64, 64, -64, 64, -64, -64, 64, 64, 64, 64, 64, 64, 64, -64, -64, -64, -64, -64, -64, 64, 64, -64, 64, 64, -64, 64, -64, 64, 64, 64, 64, 64, 64, 64, -64, 64, 64, 64, 64, 64, -64, -64, -64, 64, -64, -64, -64, 64, -64, -64, 64, -64, 64, 64, -64, -64, 64, 64, -64, -64, -64, -64, 64, 64, 64, -64, -64, -64, 64, -64, 64, -64, -64, -64, -64, 64, 64, 64, -64, 64, 64, 64, -64, 64, 64, 64, 64, 64, -64, 64, 64, -64, -64, -64, -64, -64, -64, -64, -64, -64, -64, -64, -64, -64, -64, 64, 64, 64, 64, 64, 64, -64, -64, 64, 64, 64, -64, 64, 64, -64, 64, -64, -64, -64, -64, 64, -64, -64, -64, 64, -64, -64, 64, 64, -64, 64, 64, 64, -64, 64, 64, 64, -64, -64, 64, 64, -64, -64, 64, 64, 64, -64, -64, 64, 64, 64, 64, 64, -64, -64, -64, -64, -64, 64, 64, 64, -64, -64, -64, 64, 64, -64, 64, 64, 64, 64, 64, 64, -64, -64, -64, 64, -64, 64, -64, -64, -64, -64, 64, -64, -64, 64, 64, -64, -64, 64, 64, 64, -64, -64, 64, 64, -64, 64, -64, 64, 64, 64, -64, 64, 64, -64, 64, -64, -64, 64, -64, 64, -64, -64, 64, 64, 64, 64, -64, -64, -64, -64, -64, -64, 64, 64, 64, 64, -64, -64, -64, 64, -64, 64, 64, -64, 64, 64, -64, 64, 64, 64, -64, 64, -64, 64, 64, 64, -64, -64, -64, 64, 64, 64, 64, -64, 64, 64, 64, 64, 64, 64, -64, 64, -64, -64, 64, 64, -64, 64, -64, 64, -64, -64, 64, 64, -64, -64, -64, 64, -64, 64, 64, 64, 64, 64, 64, 64, 64, 64, 64, -64, -64, -64, -64, -64, -64, -64, 64, -64, 64, 64, -64, 64, -64, 64, 64, -64, -64, -64, 64, -64, 64, -64, -64, -64, -64, -64, -64, -64, -64, -64, -64, 64, 64, -64, -64, -64, 64, 64, 64, 64, 64, 64, 64, 64, -64, -64, 64, -64, 64, -64, -64, -64, -64, -64, -64, -64, -64, -64, -64, -64, -64, -64, -64, -64, -64, -64, -64, 64, 64, 64, 64, 64, -64, 64, 64, -64, -64, 64, 64, 64, 64, -64, -64, 64, -64, 64, -64, -64, -64, -64, -64, -64, -64, -64, -64, -64, 64, 64, -64, 64, 64, -64, -64, 64, 64, 64, 64, 64, -64, 64, -64, 64, 64, -64, 64, 64, 64, -64, -64, -64, -64, 64, 64, -64, -64, 64, 64, 64, -64, 64, 64, 64, 64, 64, 64, -64, -64, 64, 64, -64, 64, -64, 64, 64, 64, 64, 64, -64, 64, 64, 64, 64, 64, -64, 64, -64, 64, -64, 64, -64, 64, 64, 64, 64, -64, -64, 64, 64, 64, 64, 64, 64, 64, 64, 64, 64, 64, 64, 64, -64, 64, 64, -64, 64, -64, 64, 64, 64, 64, -64, -64, -64, -64, -64, -64, -64, -64, -64, 64, 64, 64, 64, 64, 64, 64, -64, 64, 64, 64, 64, -64, 64, 64, 64, 64, -64, 64, -64, -64, -64, -64, -64, -64, -64, -64, 64, -64, -64, 64, 64, 64, -64, -64, -64, -64, 64, -64, -64, 64, 64, -64, -64, 64, 64, 64, -64, 64, -64, -64, -64, -64, 64, -64, -64, -64, -64, -64, -64, -64, -64, -64, -64, -64, -64, 64, -64, 64, -64, -64, 64, -64, -64, 64, 64, 64, 64, 64, 64, 64, 64, -64, -64, -64, -64, -64, -64, -64, -64, -64, -64, 64, 64, 64, -64, -64, 64, 64, 64, 64, 64, -64, -64, 64, 64, 64, 64, 64, -64, 64, -64, -64, -64, -64, -64, -64, -64, -64, -64, 64, -64, 64, 64, 64, 64, -64, -64, -64, -64, 64, 64, 64, 64, 64, 64, 64, 64, 64, 64, 64, -64, -64, 64, -64, -64, -64, -64, 64, -64, 64, 64, 64, 64, 64, 64, -64, -64, -64, 64, 64, 64, 64, 64, 64, 64, 64, 64, -64, -64, -64, -64, 64, 64, -64, -64, -64, -64, -64, -64, 64, -64, -64, 64, -64, 64, -64, 64, -64, 64, 64, 64, 64, 64, 64, 64, -64, 64, -64, 64, -64, 64, 64, -64, -64, -64, -64, -64, -64, -64, -64, 64, -64, -64, -64, -64, -64, -64, -64, -64, 64, 64, -64, -64, -64, 64, 64, 64, -64, 64, 64, -64, -64, -64, -64, -64, 64, -64, 64, -64, -64, -64, -64, -64, -64, -64, -64, -64, -64, -64, -64, -64, 64, -64, 64, 64, 64, 64, 64, -64, -64, 64, 64, 64, -64, -64, 64, 64, 64, -64, -64, -64, -64, -64, -64, -64, -64, -64, -64, -64, -64, 64, 64, -64, 64, -64, -64, -64, -64, -64, -64, 64, -64, -64, 64, 64, 64, -64, -64, -64, -64, -64, -64, -64, -64, -64, -64, -64, -64, 64, 64, 64, -64, 64, -64, 64, -64, -64, -64, 64, -64, -64, 64, -64, 64, 64, 64, -64, -64, -64, 64, -64, -64, -64, -64, -64, 64, 64, -64, 64, 64, 64, 64, 64, 64, 64, 64, -64, 64, 64, -64, -64, -64, 64, 64, 64, 64, 64, 64, 64, 64, -64, -64, 64, 64, 64, 64, 64, 64, 64, -64, -64, -64, -64, -64, 64, -64, 64, -64, -64, 64, 64, 64, 64, 64, 64, 64, 64, 64, -64, -64, 64, -64, 64, 64, 64, -64, -64, -64, 64, -64, -64, 64, 64, 64, -64, 64, -64, -64, 64, 64, 64, 64, 64, 64, 64, 64, -64, -64, 64, 64, 64, 64, 64, 64, 64, -64, -64, -64, 64, 64, -64, 64, -64, -64, 64, 64, 64, -64, -64, -64, 64, -64, 64, -64, 64, -64, -64, -64, 64, -64, 64, 64, 64, 64, -64, 64, -64, 64, -64, -64, 64, -64, 64, 64, 64, 64, 64, -64, -64, 64, 64, 64, -64, -64, 64, -64, 64, 64, 64, -64, 64, -64, -64, 64, 64, 64, 64, -64, 64, 64, -64, -64, -64, -64, 64, -64, 64, -64, 64, 64, 64, 64, 64, -64, 64, -64, 64, 64, -64, -64, -64, 64, 64, -64, -64, 64, 64, -64, 64, 64, -64, 64, -64, 64, -64, -64, -64, -64, 64, 64, -64, 64, 64, 64, 64, 64, -64, -64, -64, 64, -64, -64, 64, -64, -64, -64, -64, 64, 64, -64, -64, -64, -64, -64, -64, -64, 64, -64, -64, 64, 64, 64, 64, -64, -64, -64, 64, 64, 64, -64, 64, 64, -64, -64, 64, 64, -64, 64, -64, -64, 64, 64, 64, -64, -64, -64, 64, 64, 64, 64, 64, -64, 64, 64, -64, 64, 64, -64, 64, -64, -64, 64, 64, 64, -64, -64, 64, 64, -64, 64, -64, -64, -64, -64, -64, 64, -64, -64, 64, 64, 64, 64, -64, -64, -64, -64, 64, -64, 64, 64, 64, 64, -64, -64, -64, -64, -64, -64, 64, -64, 64, 64, -64, -64, -64, 64, -64, -64, -64, -64, -64, 64, -64, 64, -64, -64, -64, 64, 64, -64, -64, -64, -64, -64, -64, -64, 64, 64, 64, 64, 64, 64, 64, 64, 64, -64, 64, 64, 64, -64, -64, -64, 64, 64, 64, 64, 64, -64, -64, -64, -64, -64, -64, 64, 64, 64, 64, 64, 64, 64, 64, 64, -64, 64, -64, 64, 64, -64, 64, -64, -64, 64, 64, -64, 64, -64, 64, -64, 64, 64, 64, 64, 64, 64, 64, 64, 64, 64, 64, 64, 64, 64, 64, 64, 64, 64, -64, 64, -64, 64, -64, -64, -64, -64, -64, 64, 64, 64, 64, 64, -64, -64, -64, 64, 64, 64, 64, 64, 64, -64, 64, 64, 64, 64, 64, -64, -64, 64, -64, -64, -64, 64, -64, -64, -64, 64, 64, 64, 64, 64, -64, 64, 64, 64, 64, 64, -64, -64, -64, -64, 64, 64, -64, 64, 64, -64, 64, -64, 64, 64, -64, 64, 64, 64, 64, 64, 64, 64, -64, 64, 64, -64, 64, 64, -64, 64, -64, 64, -64, -64, -64, 64, 64, -64, 64, 64, 64, 64, 64, -64, 64, 64, 64, 64, -64, -64, 64, -64, -64, 64, -64, -64, -64, 64, -64, -64, -64, -64, -64, -64, 64, 64, -64, -64, 64, 64, -64, -64, 64, 64, 64, 64, 64, 64, 64, 64, 64, 64, 64, 64, 64, -64, -64, -64, -64, -64, -64, -64, 64, -64, 64, -64, 64, 64, 64, -64, -64, -64, 64, 64, 64, 64, 64, 64, 64, 64, -64, 64, 64, -64, 64, -64, -64, -64, -64, 64, -64, 64, -64, 64, 64, -64, 64, 64, 64, -64, -64, 64, -64, 64, -64, -64, 64, 64, 64, 64, 64, 64, -64, 64, 64, -64, -64, -64, -64, 64, -64, 64, 64, 64, 64, -64, -64, 64, 64, 64, -64, -64, 64, -64, -64, 64, -64, 64, -64, -64, 64, 64, 64, -64, 64, -64, 64, 64, -64, 64, -64, 64, 64, 64, -64, 64, 64, 64, 64, -64, 64, -64, 64, 64, 64, 64, 64, 64, -64, 64, 64, -64, 64, -64, -64, -64, -64, -64, 64, 64, 64, -64, -64, 64, 64, 64, -64, 64, -64, -64, 64, -64, 64, 64, -64, -64, 64, 64, -64, -64, 64, 64, -64, 64, -64, -64, 64, 64, 64, -64, 64, 64, 64, 64, 64, 64, 64, -64, -64, 64, 64, -64, 64, 64, 64, 64, -64, -64, -64, -64, -64, -64, 64, 64, 64, 64, 64, 64, 64, -64, -64, 64, 64, 64, 64, 64, 64, -64, -64, -64, -64, 64, 64, 64, -64, -64, 64, 64, -64, 64, -64, 64, 64, 64, -64, 64, 64, -64, -64, -64, -64, 64, 64, 64, -64, 64, -64, 64, -64, 64, 64, -64, -64, -64, 64, -64, -64, -64, -64, 64, -64, -64, 64, 64, 64, 64, 64, 64, 64, 64, 64, -64, -64, 64, 64, 64, -64, 64, 64, 64, 64, -64, 64, 64, 64, 64, 64, -64, -64, 64, -64, -64, 64, 64, 64, -64, -64, 64, -64, -64, 64, 64, 64, 64, 64, 64, 64, -64, 64, 64, 64, 64, -64, 64, -64, -64, -64, -64, 64, 64, 64, 64, 64, 64, 64, 64, 64, -64, 64, 64, 64, 64, 64, 64, -64, -64, -64, -64, -64, 64, -64, 64, 64, 64, 64, 64, 64, 64, 64, 64, -64, 64, 64, 64, 64, 64, 64, 64, 64, 64, 64, 64, 64, 64, -64, -64, -64, 64, -64, -64, 64, -64, 64, -64, 64, 64, 64, 64, 64, 64, 64, 64, 64, 64, 64, 64, 64, 64, -64, 64, -64, 64, 64, 64, 64, 64, 64, -64, -64, 64, 64, -64, -64, 64, 64, 64, -64, -64, 64, 64, 64, -64, 64, 64, -64, -64, 64, -64, 64, 64, 64, 64, 64, -64, -64, -64, -64, 64, 64, -64, 64, -64, 64, -64, 64, -64, -64, -64, -64, 64, -64, -64, -64, 64, 64, -64, 64, -64, -64, -64, 64, -64, -64, 64, 64, 64, 64, 64, 64, 64, -64, 64, -64, 64, 64, -64, -64, -64, -64, 64, 64, 64, 64, 64, 64, -64, -64, -64, -64, 64, -64, 64, 64, -64, -64, 64, -64, 64, -64, -64, 64, -64, 64, 64, 64, 64, 64, 64, -64, -64, 64, -64, -64, -64, -64, -64, 64, 64, 64, 64, 64, 64, -64, 64, 64, -64, 64, 64, 64, 64, 64, -64, -64, 64, -64, 64, 64, 64, 64, -64, -64, -64, -64, 64, 64, -64, -64, 64, -64, -64, 64, 64, 64, 64, 64, -64, 64, 64, 64, 64, -64, 64, 64, -64, -64, 64, -64, -64, 64, 64, -64, 64, 64, -64, 64, 64, -64, -64, 64, 64, -64, 64, 64, 64, -64, 64, -64, 64, -64, -64, 64, 64, 64, 64, 64, 64, 64, -64, -64, 64, 64, 64, 64, -64, 64, -64, -64, 64, 64, 64, 64, -64, 64, 64, 64, -64, 64, -64, 64, -64, -64, 64, -64, 64, 64, 64, -64, -64, -64, 64, -64, -64, -64, -64, 64, 64, 64, -64, 64, 64, 64, 64, 64, 64, 64, 64, -64, 64, -64, 64, 64, 64, -64, -64, 64, -64, -64, 64, -64, 64, -64, -64, 64, 64, 64, 64, 64, 64, -64, 64, 64, 64, 64, 64, -64, -64, 64, -64, 64, -64, 64, 64, 64, 64, -64, 64, -64, 64, -64, -64, -64, -64, 64, 64, 64, -64, 64, 64, -64, 64, -64, 64, -64, 64, 64, -64, -64, 64, 64, -64, 64, -64, -64, -64, 64, -64, 64, -64, -64, 64, 64, 64, 64, 64, 64, 64, -64, 64, -64, 64, 64, 64, -64, 64, 64, 64, -64, -64, -64, -64, 64, 64, 64, -64, -64, -64, 64, 64, -64, 64, -64, 64, 64, -64, -64, 64, -64, -64, -64, 64, 64, -64, -64, -64, 64, -64, -64, 64, -64, 64, -64, 64, -64, -64, 64, 64, -64, -64, -64, 64, 64, -64, 64, 64, 64, 64, -64, 64, 64, 64, 64, 64, -64, -64, -64, 64, -64, -64, -64, 64, 64, -64, -64, 64, 64, -64, -64, -64, 64, -64, -64, 64, -64, 64, 64, 64, 64, 64, 64, 64, -64, 64, 64, -64, -64, 64, 64, -64, -64, -64, 64, -64, -64, -64, 64, 64, -64, 64, -64, 64, 64, 64, 64, 64, 64, -64, -64, 64, 64, -64, 64, 64, 64, 64, 64, 64, -64, 64, 64, 64, -64, 64, 64, -64, 64, -64, -64, -64, 64, 64, 64, 64, 64, 64, 64, 64, -64, 64, -64, 64, -64, -64, -64, 64, -64, -64, 64, 64, 64, 64, 64, 64, 64, 64, 64, 64, 64, 64, -64, 64, 64, 64, -64, -64, 64, -64, 64, 64, 64, -64, -64, -64, -64, 64, 64, -64, 64, 64, 64, -64, 64, -64, 64, 64, 64, 64, 64, 64, -64, 64, -64, -64, 64, -64, -64, 64, 64, -64, -64, 64, 64, -64, 64, -64, -64, 64, 64, 64, 64, -64, 64, 64, -64, 64, 64, -64, 64, -64, 64, 64, 64, -64, 64, 64, 64, -64, -64, 64, 64, 64, -64, 64, -64, -64, -64, -64, -64, 64, 64, 64, 64, -64, -64, -64, 64, -64, -64, -64, 64, -64, 64, 64, -64, -64, 64, -64, 64, 64, 64, 64, 64, 64, 64, 64, 64, 64, 64, 64, 64, -64, 64, 64, 64, 64, 64, 64, -64, 64, -64, 64, 64, -64, 64, -64, -64, -64, 64, 64, 64, -64, -64, 64, -64, -64, 64, 64, 64, 64, 64, 64, -64, 64, -64, -64, 64, 64, -64, 64, 64, 64, -64, 64, -64, -64, 64, -64, 64, 64, 64, -64, 64, 64, 64, 64, 64, -64, -64, 64, 64, 64, -64, 64, 64, -64, -64, -64, -64, -64, 64, 64, 64, 64, -64, 64, 64, 64, 64, 64, 64, 64, 64, -64, 64, -64, -64, -64, 64, 64, -64, -64, 64, 64, -64, -64, -64, -64, -64, 64, -64, 64, 64, 64, 64, -64, 64, -64, 64, 64, -64, 64, 64, 64, -64, -64, 64, 64, 64, 64, -64, -64, -64, 64, -64, -64, 64, 64, -64, -64, -64, -64, -64, 64, -64, 64, -64, -64, -64, 64, -64, -64, 64, -64, -64, -64, 64, -64, -64, -64, 64, 64, 64, -64, -64, 64, -64, -64, 64, 64, -64, -64, -64, -64, 64, 64, -64, 64, 64, 64, -64, -64, -64, -64, -64, 64, -64, 64, -64, 64, 64, 64, 64, 64, -64, -64, -64, 64, -64, 64, -64, 64, 64, 64, 64, 64, -64, 64, 64, -64, 64, -64, -64, -64, -64, 64, -64, 64, 64, -64, 64, 64, 64, 64, 64, 64, -64, -64, 64, -64, -64, -64, -64, 64, 64, -64, -64, 64, 64, -64, -64, 64, 64, 64, -64, -64, 64, -64, -64, 64, 64, 64, -64, 64, -64, 64, -64, 64, -64, 64, -64, -64, -64, -64, -64, -64, -64, -64, -64, -64, 64, 64, -64, -64, 64, -64, 64, 64, -64, -64, -64, 64, 64, -64, 64, 64, -64, 64, -64, -64, 64, -64, 64, 64, 64, -64, 64, 64, 64, 64, 64, -64, 64, 64, 64, -64, -64, 64, -64, -64, -64, 64, -64, 64, 64, 64, -64, 64, 64, 64, -64, 64, 64, -64, -64, 64, 64, 64, 64, 64, 64, -64, -64, 64, 64, -64, 64, 64, 64, -64, 64, -64, 64, -64, 64, 64, -64, 64, 64, -64, -64, -64, -64, 64, 64, 64, -64, -64, -64, -64, -64, 64, 64, 64, -64, 64, 64, 64, -64, -64, 64, 64, -64, -64, -64, 64, 64, -64, 64, -64, 64, -64, -64, 64, -64, -64, -64, -64, 64, -64, -64, -64, 64, 64, -64, -64, 64, 64, 64, 64, 64, -64, -64, -64, -64, -64, -64, -64, -64, -64, -64, -64, -64, -64, -64, -64, -64, 64, -64, -64, 64, 64, 64, 64, 64, -64, 64, -64, -64, 64, 64, 64, 64, -64, -64, 64, 64, -64, -64, -64, -64, -64, -64, -64, 64, 64, 64, -64, -64, 64, 64, 64, -64, -64, -64, -64, 64, -64, 64, 64, -64, -64, -64, -64, -64, -64, -64, -64, -64, -64, -64, -64, -64, 64, 64, 64, 64, 64, 64, -64, -64, -64, -64, -64, -64, -64, -64, -64, -64, 64, -64, -64, 64, 64, -64, -64, -64, -64, -64, -64, 64, 64, -64, -64, 64, 64, -64, -64, -64, -64, -64, -64, -64, -64, -64, 64, -64, -64, -64, 64, -64, -64, -64, -64, -64, -64, -64, -64, 64, -64, 64, 64, 64, 64, -64, -64, -64, -64, -64, -64, -64, -64, -64, 64, 64, 64, 64, -64, -64, 64, -64, -64, -64, -64, -64, -64, -64, -64, -64, -64, 64, 64, -64, -64, -64, -64, -64, -64, -64, 64, -64, 64, 64, 64, 64, -64, 64, 64, -64, 64, -64, -64, 64, -64, -64, -64, -64, 64, 64, 64, 64, -64, 64, -64, -64, -64, 64, 64, -64, 64, 64, 64, 64, -64, 64, 64, 64, -64, -64, -64, 64, -64, 64, 64, 64, -64, 64, 64, -64, -64, -64, -64, -64, -64, -64, 64, 64, -64, 64, -64, 64, 64, 64, -64, -64, -64, -64, -64, -64, -64, 64, -64, 64, -64, -64, 64, -64, 64, -64, -64, -64, -64, -64, 64, 64, 64, 64, 64, 64, 64, 64, 64, 64, 64, -64, -64, -64, 64, 64, -64, -64, -64, 64, 64, 64, -64, -64, -64, -64, -64, -64, -64, -64, 64, 64, 64, 64, 64, 64, 64, 64, 64, 64, -64, 64, 64, 64, -64, 64, -64, -64, 64, 64, 64, -64, -64, -64, -64, -64, -64, 64, -64, 64, -64, -64, 64, 64, 64, 64, 64, 64, -64, 64, 64, -64, 64, -64, -64, -64, 64, 64, -64, -64, -64, -64, -64, -64, 64, -64, -64, -64, -64, 64, 64, -64, -64, -64, -64, -64, -64, -64, -64, 64, -64, 64, 64, 64, 64, 64, -64, -64, -64, -64, -64, -64, -64, 64, 64, -64, -64, -64, -64, -64, 64, 64, -64, 64, 64, 64, -64, -64, 64, -64, 64, -64, 64, 64, -64, -64, -64, -64, -64, -64, -64, -64, -64, 64, -64, -64, 64, 64, 64, 64, 64, 64, 64, 64, 64, -64, 64, 64, 64, -64, 64, -64, 64, 64, -64, 64, 64, -64, -64, -64, -64, 64, 64, -64, 64, -64, 64, 64, -64, -64, 64, -64, -64, -64, -64, -64, -64, -64, 64, 64, -64, 64, -64, 64, 64, 64, -64, -64, -64, -64, -64, -64, -64, -64, 64, -64, -64, 64, -64, 64, -64, 64, 64, -64, -64, -64, -64, 64, 64, 64, 64, 64, 64, 64, 64, -64, -64, -64, -64, -64, -64, -64, 64, 64, 64, 64, -64, 64, -64, 64, -64, -64, -64, 64, -64, 64, 64, -64, -64, -64, 64, 64, 64, -64, -64, 64, -64, -64, -64, -64, -64, 64, 64, -64, -64, -64, -64, -64, -64, -64, -64, 64, 64, -64, -64, -64, -64, -64, -64, 64, 64, -64, -64, -64, -64, -64, -64, -64, -64, 64, 64, -64, -64, 64, -64, 64, -64, 64, -64, -64, 64, 64, 64, 64, -64, 64, -64, 64, -64, -64, -64, -64, -64, -64, -64, 64, 64, 64, 64, 64, -64, -64, -64, -64, 64, 64, 64, 64, -64, -64, 64, -64, -64, -64, 64, -64, -64, 64, 64, -64, 64, -64, -64, 64, 64, -64, 64, -64, -64, 64, 64, 64, -64, 64, 64, 64, -64, -64, 64, 64, 64, -64, -64, 64, 64, -64, -64, -64, 64, -64, -64, 64, -64, -64, -64, 64, 64, -64, -64, -64, -64, -64, 64, -64, -64, -64, 64, -64, 64, -64, 64, -64, 64, 64, 64, -64, 64, 64, 64, 64, 64, 64, 64, -64, -64, -64, 64, 64, -64, -64, 64, 64, -64, -64, -64, -64, -64, -64, -64, 64, 64, 64, 64, 64, 64, 64, -64, 64, 64, -64, -64, -64, -64, -64, -64, 64, 64, 64, -64, -64, -64, 64, -64, -64, -64, -64, 64, 64, 64, -64, 64, -64, -64, 64, 64, 64, -64, 64, -64, -64, -64, -64, 64, -64, 64, 64, -64, -64, 64, 64, -64, -64, 64, 64, 64, 64, -64, -64, 64, -64, -64, -64, 64, 64, 64, 64, 64, -64, -64, -64, -64, 64, 64, -64, 64, -64, -64, -64, -64, -64, 64, -64, -64, -64, -64, -64, -64, -64, -64, 64, 64, -64, 64, -64, -64, 64, -64, -64, 64, -64, 64, 64, -64, -64, -64, -64, -64, -64, -64, -64, 64, -64, -64, 64, -64, -64, 64, -64, 64, -64, 64, -64, -64, -64, -64, -64, -64, 64, 64, 64, 64, -64, -64, -64, -64, -64, -64, 64, -64, -64, -64, -64, -64, 64, 64, 64, -64, -64, -64, -64, -64, -64, -64, -64, 64, -64, -64, 64, -64, -64, -64, 64, -64, -64, -64, -64, -64, -64, -64, -64, 64, 64, 64, -64, -64, 64, 64, -64, -64, -64, -64, -64, -64, 64, 64, -64, 64, 64, 64, 64, -64, -64, 64, -64, -64, -64, -64, -64, 64, -64, -64, -64, -64, 64, -64, 64, 64, -64, 64, -64, 64, 64, -64, 64, 64, -64, -64, -64, 64, 64, 64, -64, -64, -64, -64, -64, -64, -64, -64, -64, -64, 64, -64, -64, 64, -64, 64, 64, 64, 64, 64, 64, -64, -64, -64, 64, 64, 64, 64, -64, -64, -64, -64, 64, -64, -64, -64, -64, -64, -64, -64, 64, 64, -64, 64, -64, 64, -64, -64, 64, 64, 64, 64, -64, 64, -64, 64, -64, -64, 64, 64, 64, -64, -64, -64, -64, -64, -64, -64, 64, -64, -64, 64, -64, -64, -64, 64, -64, 64, 64, -64, 64, 64, -64, -64, -64, -64, 64, 64, 64, 64, -64, -64, -64, -64, -64, -64, 64, 64, 64, -64, -64, -64, -64, -64, 64, -64, 64, 64, 64, 64, 64, -64, 64, -64, -64, 64, 64, -64, -64, -64, -64, -64, -64, 64, -64, 64, -64, -64, -64, 64, 64, -64, -64, 64, -64, 64, -64, -64, 64, -64, 64, -64, -64, -64, -64, 64, -64, -64, 64, 64, -64, 64, 64, -64, -64, 64, -64, 64, 64, 64, 64, 64, -64, 64, 64, 64, 64, -64, -64, -64, -64, -64, -64, -64, -64, 64, 64, 64, -64, -64, -64, 64, -64, 64, 64, 64, 64, -64, -64, 64, -64, 64, 64, 64, 64, -64, -64, -64, -64, -64, -64, -64, -64, 64, -64, 64, 64, -64, 64, 64, -64, -64, 64, 64, 64, 64, -64, -64, -64, 64, 64, 64, 64, -64, -64, -64, -64, -64, -64, -64, -64, 64, 64, 64, 64, 64, 64, 64, 64, -64, -64, 64, 64, 64, 64, 64, -64, 64, -64, 64, 64, -64, -64, -64, -64, -64, 64, -64, -64, 64, 64, -64, -64, -64, -64, 64, 64, 64, 64, 64, -64, 64, -64, -64, -64, -64, 64, -64, 64, 64, 64, 64, -64, 64, 64, -64, -64, -64, -64, -64, -64, -64, -64, -64, -64, -64, 64, 64, 64, -64, -64, 64, 64, -64, -64, -64, 64, -64, 64, 64, 64, 64, -64, -64, -64, -64, -64, -64, -64, -64, -64, -64, -64, 64, 64, 64, 64, -64, -64, 64, -64, 64, -64, -64, 64, 64, 64, 64, 64, -64, -64, -64, -64, -64, -64, -64, -64, -64, -64, -64, 64, 64, 64, -64, -64, -64, 64, 64, 64, 64, -64, -64, -64, -64, 64, 64, -64, 64, -64, -64, -64, -64, -64, -64, -64, -64, -64, 64, 64, 64, 64, 64, -64, 64, 64, 64, -64, -64, -64, -64, 64, -64, -64, -64, 64, -64, -64, -64, -64, -64, -64, -64, 64, -64, 64, 64, 64, -64, 64, 64, 64, 64, 64, -64, -64, -64, 64, 64, 64, 64, 64, -64, -64, -64, 64, 64, -64, -64, -64, 64, -64, 64, 64, 64, -64, 64, -64, -64, 64, -64, -64, 64, 64, -64, -64, -64, 64, 64, -64, -64, 64, 64, 64, 64, -64, -64, 64, -64, -64, -64, 64, 64, -64, 64, 64, -64, -64, 64, -64, 64, -64, 64, 64, -64, 64, -64, 64, 64, -64, -64, 64, -64, -64, -64, 64, -64, 64, 64, -64, 64, -64, -64, -64, -64, 64, 64, -64, -64, -64, -64, -64, 64, 64, -64, 64, 64, -64, 64, -64, -64, -64, -64, 64, 64, 64, -64, -64, -64, 64, -64, 64, -64, -64, -64, 64, 64, -64, -64, -64, 64, 64, 64, 64, 64, 64, -64, 64, -64, -64, -64, -64, -64, -64, -64, -64, 64, -64, -64, -64, 64, -64, 64, -64, -64, 64, 64, 64, 64, 64, -64, 64, 64, 64, 64, -64, -64, 64, -64, -64, 64, -64, 64, -64, 64, 64, 64, -64, -64, -64, 64, -64, -64, 64, 64, -64, 64, 64, -64, 64, -64, 64, -64, -64, -64, 64, 64, -64, -64, -64, -64, 64, -64, 64, 64, 64, 64, 64, 64, -64, 64, -64, 64, 64, -64, -64, -64, 64, 64, -64, -64, -64, -64, -64, -64, -64, -64, -64, -64, -64, -64, 64, 64, 64, -64, 64, 64, -64, 64, -64, 64, -64, -64, 64, 64, -64, 64, 64, 64, -64, -64, -64, -64, -64, -64, -64, -64, -64, -64, -64, 64, -64, 64, -64, -64, 64, 64, 64, -64, 64, 64, 64, -64, 64, -64, -64, -64, 64, -64, -64, -64, -64, -64, -64, -64, -64, -64, -64, 64, -64, 64, -64, -64, -64, -64, 64, -64, -64, -64, 64, 64, 64, 64, 64, -64, 64, 64, -64, -64, -64, 64, -64, -64, -64, -64, -64, 64, 64, 64, -64, -64, 64, 64, 64, -64, -64, -64, -64, -64, -64, -64, -64, -64, 64, 64, 64, -64, 64, -64, -64, -64, 64, 64, -64, 64, 64, 64, -64, -64, -64, -64, 64, -64, -64, -64, -64, -64, -64, -64, -64, 64, 64, 64, 64, 64, -64, -64, 64, -64, 64, 64, 64, -64, -64, -64, -64, -64, -64, 64, 64, -64, -64, -64, -64, -64, -64, -64, 64, 64, -64, -64, -64, -64, 64, -64, -64, -64, -64, 64, 64, 64, -64, -64, -64, 64, -64, -64, -64, -64, -64, -64, -64, -64, 64, -64, -64, -64, 64, 64, -64, -64, 64, -64, -64, -64, 64, 64, 64, -64, -64, -64, 64, -64, -64, -64, -64, -64, -64, -64, -64, -64, -64, 64, 64, 64, 64, 64, -64, -64, -64, -64, -64, -64, -64, 64, 64, 64, -64, -64, 64, 64, -64, -64, -64, -64, 64, -64, 64, -64, -64, -64, -64, 64, 64, -64, -64, -64, -64, -64, -64, -64, 64, 64, 64, 64, 64, 64, 64, 64, 64, 64, 64, 64, -64, 64, -64, -64, -64, -64, -64, 64, -64, -64, -64, -64, -64, -64, -64, -64, 64, -64, 64, -64, 64, 64, 64, -64, -64, -64, 64, -64, -64, -64, -64, -64, -64, -64, -64, -64, -64, -64, -64, 64, -64, -64, -64, -64, -64, 64, -64, 64, -64, 64, 64, -64, -64, -64, 64, -64, -64, -64, -64, -64, -64, -64, -64, -64, -64, -64, -64, -64, -64, -64, -64, 64, 64, 64, 64, -64, -64, 64, -64, 64, -64, -64, -64, -64, -64, -64, -64, -64, -64, -64, -64, -64, 64, -64, 64, -64, -64, -64, -64, 64, 64, 64, 64, -64, -64, -64, -64, -64, -64, -64, 64, -64, -64, 64, 64, -64, -64, -64, -64, -64, -64, -64, -64, -64, -64, -64, -64, -64, 64, 64, 64, -64, -64, 64, -64, -64, 64, -64, -64, 64, 64, 64, 64, -64, -64, -64, -64, -64, -64, -64, -64, -64, -64, -64, -64, -64, -64, -64, 64, -64, -64, -64, -64, -64, 64, 64, -64, 64, -64, -64, -64, -64, -64, -64, -64, -64, -64, -64, -64, -64, -64, 64, -64, 64, -64, 64, 64, -64, -64, -64, -64, -64, 64, -64, 64, 64, -64, 64, -64, -64, -64, -64, -64, -64, -64, -64, 64, -64, 64, -64, -64, 64, -64, 64, 64, -64, -64, 64, -64, 64, 64, -64, -64, -64, -64, -64, -64, 64, 64, 64, 64, -64, -64, -64, 64, -64, -64, -64, 64, -64, 64, -64, -64, -64, -64, 64, 64, -64, -64, -64, -64, 64, -64, -64, 64, -64, 64, 64, 64, 64, 64, 64, -64, -64, 64, 64, 64, 64, -64, -64, -64, 64, -64, 64, -64, -64, 64, 64, 64, -64, -64, 64, -64, -64, -64, 64, 64, 64, 64, 64, 64, 64, -64, 64, -64, -64, -64, -64, -64, 64, -64, -64, -64, -64, 64, -64, 64, 64, -64, 64, 64, -64, -64, 64, -64, -64, -64, -64, 64, -64, 64, 64, -64, -64, -64, -64, -64, -64, 64, -64, 64, 64, 64, 64, 64, -64, 64, -64, 64, 64, 64, 64, 64, 64, 64, 64, 64, -64, -64, -64, 64, 64, 64, 64, 64, 64, 64, 64, 64, -64, 64, -64, 64, -64, -64, -64, 64, -64, 64, 64, -64, -64, -64, -64, 64, 64, -64, -64, 64, 64, 64, 64, -64, 64, 64, 64, 64, 64, 64, -64, -64, 64, -64, 64, 64, 64, 64, 64, -64, 64, -64, 64, -64, -64, 64, 64, -64, 64, -64, 64, -64, -64, 64, 64, -64, -64, 64, -64, -64, 64, -64, 64, -64, -64, -64, -64, -64, -64, 64, -64, -64, -64, -64, 64, -64, 64, -64, -64, -64, 64, 64, -64, -64, -64, 64, 64, 64, -64, 64, -64, -64, -64, 64, 64, -64, 64, 64, -64, -64, -64, -64, -64, -64, -64, -64, -64, 64, -64, 64, -64, -64, -64, 64, -64, -64, -64, 64, -64, -64, -64, 64, 64, 64, 64, 64, -64, -64, -64, -64, -64, -64, -64, -64, -64, -64, -64, -64, 64, 64, -64, -64, 64, -64, -64, 64, -64, -64, -64, 64, 64, 64, 64, 64, -64, -64, 64, -64, -64, -64, -64, -64, -64, -64, 64, -64, -64, 64, 64, 64, -64, -64, -64, -64, -64, -64, -64, -64, 64, 64, 64, -64, 64, 64, 64, 64, 64, -64, 64, -64, -64, -64, -64, -64, -64, 64, -64, -64, 64, 64, -64, -64, -64, -64, 64, -64, 64, 64, -64, -64, -64, -64, -64, -64, 64, 64, -64, -64, -64, 64, -64, -64, 64, 64, -64, -64, -64, -64, -64, -64, -64, -64, -64, -64, -64, -64, -64, 64, -64, -64, -64, -64, 64, 64, -64, 64, -64, -64, -64, -64, -64, -64, 64, -64, -64, 64, 64, 64, -64, 64, -64, -64, 64, -64, -64, -64, -64, -64, -64, -64, 64, 64, 64, 64, -64, 64, 64, -64, 64, 64, -64, -64, -64, 64, 64, 64, 64, 64, 64, 64, -64, -64, -64, -64, -64, -64, 64, 64, 64, 64, 64, 64, 64, 64, 64, -64, 64, 64, 64, -64, 64, 64, 64, 64, -64, -64, -64, -64, -64, -64, -64, -64, -64, 64, 64, 64, 64, 64, 64, 64, 64, 64, 64, 64, 64, 64, 64, 64, -64, -64, 64, 64, 64, -64, 64, 64, -64, -64, -64, -64, 64, 64, 64, 64, 64, 64, 64, 64, 64, 64, 64, -64, 64, -64, 64, 64, -64, -64, -64, -64, 64, 64, -64, 64, 64, 64, -64, -64, -64, -64, -64, 64, 64, 64, 64, 64, 64, 64, 64, 64, -64, -64, -64, -64, 64, -64, -64, -64, 64, 64, 64, -64, -64, 64, 64, 64, 64, 64, 64, 64, -64, -64, 64, 64, 64, 64, 64, 64, 64, 64, 64, 64, -64, -64, -64, 64, 64, 64, 64, 64, -64, 64, 64, -64, 64, 64, -64, 64, 64, -64, -64, 64, 64, 64, 64, 64, 64, -64, -64, -64, 64, -64, -64, 64, 64, -64, 64, -64, 64, 64, 64, 64, -64, 64, 64, -64, 64, -64, -64, 64, 64, 64, 64, 64, 64, -64, -64, -64, 64, 64, 64, 64, 64, -64, 64, 64, -64, 64, -64, 64, 64, 64, 64, 64, -64, -64, -64, 64, -64, 64, 64, 64, 64, 64, 64, 64, 64, 64, 64, 64, 64, 64, 64, -64, 64, 64, 64, 64, 64, 64, 64, -64, -64, 64, 64, 64, -64, 64, 64, 64, 64, 64, -64, -64, 64, 64, 64, 64, -64, 64, 64, 64, 64, 64, 64, 64, 64, -64, -64, -64, -64, -64, 64, -64, -64, 64, 64, 64, 64, -64, 64, 64, 64, 64, 64, 64, 64, 64, 64, 64, 64, 64, 64, 64, -64, -64, -64, 64, -64, 64, 64, -64, 64, 64, -64, -64, 64, -64, -64, -64, -64, -64, -64, 64, 64, 64, -64, 64, 64, 64, 64, 64, -64, 64, 64, 64, 64, -64, -64, 64, -64, 64, -64, 64, -64, -64, -64, -64, 64, 64, -64, 64, 64, 64, -64, 64, 64, 64, -64, -64, -64, -64, -64, 64, 64, -64, -64, 64, -64, -64, -64, -64, 64, 64, 64, 64, 64, -64, -64, -64, 64, -64, -64, 64, 64, 64, 64, -64, -64, -64, -64, -64, -64, -64, 64, -64, -64, -64, 64, 64, -64, 64, -64, 64, 64, -64, -64, -64, 64, -64, 64, 64, 64, 64, -64, -64, -64, -64, -64, -64, -64, -64, -64, -64, -64, -64, 64, -64, -64, 64, -64, 64, -64, -64, -64, -64, -64, -64, 64, 64, 64, -64, -64, -64, -64, -64, -64, -64, -64, -64, -64, -64, -64, 64, 64, 64, 64, -64, 64, -64, 64, 64, -64, 64, 64, 64, 64, 64, 64, 64, 64, -64, -64, -64, -64, -64, -64, -64, -64, -64, 64, 64, 64, -64, -64, -64, 64, 64, 64, 64, 64, 64, -64, -64, -64, -64, -64, -64, -64, -64, -64, -64, -64, -64, -64, -64, -64, 64, -64, 64, 64, -64, 64, 64, 64, 64, -64, -64, 64, 64, 64, 64, -64, -64, -64, -64, -64, -64, -64, -64, 64, 64, -64, -64, -64, -64, -64, -64, 64, 64, -64, -64, -64, 64, 64, 64, -64, 64, -64, -64, -64, -64, -64, -64, -64, -64, -64, -64, 64, -64, -64, -64, -64, -64, -64, -64, 64, -64, 64, 64, 64, 64, -64, 64, -64, 64, 64, 64, -64, 64, -64, -64, -64, -64, -64, 64, 64, -64, 64, 64, -64, 64, -64, -64, -64, -64, -64, 64, 64, 64, -64, 64, -64, 64, -64, -64, 64, -64, 64, 64, 64, 64, -64, 64, 64, 64, 64, 64, 64, 64, 64, -64, -64, -64, 64, 64, 64, 64, -64, 64, -64, -64, 64, -64, -64, 64, 64, 64, 64, 64, 64, 64, 64, -64, 64, 64, 64, 64, 64, 64, -64, 64, 64, 64, 64, 64, -64, 64, -64, -64, -64, -64, -64, -64, -64, 64, 64, 64, 64, 64, 64, -64, 64, -64, 64, 64, 64, -64, -64, 64, -64, -64, 64, 64, 64, -64, -64, -64, -64, -64, -64, -64, -64, -64, -64, -64, -64, 64, 64, 64, -64, -64, 64, 64, 64, -64, 64, 64, -64, 64, -64, -64, 64, 64, 64, -64, -64, -64, -64, -64, -64, -64, -64, -64, -64, 64, -64, 64, 64, 64, 64, 64, 64, 64, 64, 64, -64, 64, -64, -64, -64, -64, 64, 64, -64, 64, 64, -64, -64, 64, 64, -64, -64, 64, 64, -64, 64, 64, 64, 64, 64, 64, -64, 64, 64, 64, 64, 64, 64, 64, 64, 64, -64, -64, 64, 64, 64, 64, 64, 64, 64, 64, 64, 64, -64, -64, 64, 64, 64, 64, 64, 64, 64, -64, -64, -64, 64, 64, -64, 64, 64, 64, -64, 64, 64, 64, 64, 64, -64, 64, -64, -64, -64, 64, 64, 64, 64, 64, 64, 64, 64, 64, -64, -64, 64, -64, -64, 64, -64, 64, 64, 64, 64, 64, 64, 64, 64, -64, -64, -64, -64, 64, 64, -64, -64, 64, 64, 64, 64, 64, 64, 64, 64, -64, -64, -64, -64, 64, 64, 64, 64, 64, 64, 64, -64, 64, 64, -64, 64, -64, 64, -64, 64, 64, 64, -64, -64, -64, 64, 64, 64, 64, -64, -64, 64, 64, 64, 64, 64, 64, -64, -64, 64, 64, 64, 64, 64, 64, 64, -64, 64, 64, 64, 64, 64, -64, -64, 64, -64, 64, -64, 64, -64, 64, 64, 64, 64, 64, 64, 64, 64, 64, 64, 64, 64, 64, -64, -64, -64, 64, 64, -64, -64, 64, -64, 64, 64, -64, 64, 64, 64, -64, -64, 64, 64, 64, 64, 64, 64, 64, 64, 64, 64, 64, -64, -64, -64, -64, 64, 64, 64, 64, 64, 64, 64, 64, -64, -64, 64, -64, 64, 64, 64, 64, 64, 64, 64, 64, -64, -64, 64, 64, 64, -64, -64, 64, 64, -64, 64, 64, -64, 64, 64, 64, 64, 64, 64, -64, 64, 64, 64, 64, 64, 64, 64, 64, 64, 64, -64, 64, 64, -64, -64, -64, -64, 64, -64, 64, 64, -64, -64, 64, 64, 64, 64, 64, 64, 64, 64, 64, 64, 64, 64, 64, 64, 64, 64, 64, 64, 64, -64, 64, 64, 64, 64, -64, -64, 64, 64, 64, 64, 64, 64, 64, 64, -64, 64, -64, 64, 64, 64, 64, 64, 64, 64, 64, -64, -64, -64, 64, 64, 64, 64, -64, -64, -64, 64, -64, 64, 64, 64, 64, 64, 64, 64, 64, 64, 64, 64, 64, 64, 64, -64, 64, -64, -64, -64, 64, 64, 64, -64, -64, 64, 64, -64, -64, 64, 64, 64, 64, -64, -64, -64, 64, 64, 64, 64, 64, 64, -64, 64, -64, -64, 64, 64, 64, 64, 64, -64, -64, 64, 64, -64, -64, -64, 64, 64, 64, 64, 64, 64, 64, 64, 64, 64, 64, -64, 64, 64, -64, -64, 64, 64, 64, 64, 64, -64, -64, -64, -64, 64, -64, -64, -64, -64, -64, -64, -64, 64, -64, -64, -64, -64, -64, -64, -64, -64, 64, 64, 64, 64, 64, 64, -64, 64, 64, 64, -64, -64, -64, 64, -64, -64, -64, -64, -64, -64, 64, -64, -64, -64, 64, 64, -64, -64, 64, 64, 64, 64, 64, 64, 64, -64, -64, 64, 64, -64, -64, -64, -64, -64, -64, -64, -64, -64, -64, -64, -64, 64, -64, -64, 64, 64, -64, -64, 64, -64, -64, 64, 64, 64, 64, 64, -64, -64, -64, -64, -64, -64, -64, 64, 64, 64, 64, 64, 64, 64, 64, 64, 64, 64, 64, -64, -64, 64, 64, -64, -64, -64, -64, 64, -64, 64, -64, 64, -64, -64, 64, 64, 64, 64, 64, 64, 64, -64, 64, 64, 64, 64, 64, 64, 64, -64, 64, -64, -64, -64, 64, -64, 64, -64, 64, 64, -64, 64, -64, -64, -64, -64, 64, -64, -64, 64, 64, 64, 64, 64, -64, 64, 64, 64, -64, 64, 64, 64, -64, -64, 64, -64, 64, 64, 64, 64, -64, 64, -64, -64, 64, 64, 64, -64, -64, -64, 64, 64, 64, -64, 64, -64, -64, 64, 64, -64, 64, 64, -64, -64, -64, 64, -64, -64, -64, 64, 64, -64, -64, -64, -64, -64, 64, 64, 64, -64, -64, -64, 64, 64, 64, 64, -64, -64, -64, -64, 64, -64, 64, 64, -64, -64, -64, 64, 64, -64, 64, 64, 64, -64, -64, -64, -64, 64, -64, -64, -64, 64, -64, -64, 64, -64, 64, -64, 64, 64, -64, 64, -64, -64, -64, -64, -64, -64, -64, -64, -64, 64, -64, -64, -64, -64, -64, -64, -64, -64, -64, -64, 64, -64, -64, -64, 64, 64, 64, 64, 64, -64, 64, 64, -64, -64, -64, -64, -64, 64, 64, 64, 64, -64, -64, -64, 64, 64, -64, -64, 64, 64, 64, 64, 64, 64, 64, 64, 64, -64, 64, 64, 64, -64, 64, 64, 64, 64, 64, -64, -64, -64, 64, -64, 64, -64, -64, -64, -64, 64, -64, 64, -64, 64, 64, -64, 64, -64, 64, 64, 64, 64, 64, 64, 64, 64, 64, -64, -64, 64, 64, -64, -64, -64, -64, -64, -64, 64, 64, 64, -64, -64, 64, 64, 64, 64, 64, 64, 64, 64, 64, 64, 64, 64, 64, -64, -64, 64, -64, 64, 64, 64, 64, 64, 64, 64, 64, -64, 64, -64, -64, 64, -64, 64, 64, 64, 64, 64, 64, 64, 64, 64, 64, 64, 64, 64, 64, 64, 64, 64, 64, 64, 64, 64, -64, -64, -64, 64, -64, 64, 64, -64, 64, 64, 64, 64, 64, 64, 64, 64, 64, 64, 64, 64, 64, 64, -64, 64, 64, -64, -64, 64, -64, -64, -64, 64, 64, 64, 64, 64, 64, 64, 64, 64, 64, 64, 64, 64, 64, 64, 64, 64, -64, 64, -64, 64, 64, 64, 64, 64, 64, 64, -64, 64, 64, 64, 64, 64, -64, -64, 64, -64, -64, 64, 64, 64, 64, 64, 64, 64, 64, 64, -64, 64, 64, -64, -64, -64, -64, 64, -64, 64, 64, 64, 64, -64, -64, 64, 64, -64, -64, -64, 64, 64, 64, 64, 64, 64, 64, 64, -64, 64, -64, -64, -64, -64, 64, 64, -64, -64, 64, 64, -64, -64, -64, -64, 64, -64, -64, -64, -64, 64, 64, -64, 64, -64, 64, 64, -64, 64, -64, 64, -64, -64, -64, 64, 64, 64, -64, -64, -64, -64, -64, -64, -64, -64, -64, -64, 64, -64, 64, -64, -64, 64, -64, -64, 64, 64, 64, 64, -64, 64, 64, -64, 64, 64, 64, 64, -64, -64, -64, 64, -64, -64, -64, -64, -64, -64, 64, -64, -64, 64, -64, 64, 64, 64, 64, -64, -64, -64, 64, -64, 64, 64, -64, -64, -64, -64, -64, 64, -64, -64, -64, -64, -64, -64, -64, -64, -64, 64, -64, -64, 64, -64, -64, -64, -64, -64, 64, 64, -64, -64, -64, -64, 64, -64, -64, 64, -64, -64, -64, -64, -64, -64, -64, -64, 64, 64, 64, -64, -64, -64, -64, -64, 64, 64, 64, 64, -64, 64, -64, -64, -64, -64, -64, -64, -64, 64, -64, -64, -64, -64, -64, -64, -64, -64, 64, -64, -64, 64, -64, 64, 64, 64, 64, -64, 64, -64, -64, -64, 64, 64, 64, 64, -64, -64, -64, -64, 64, -64, -64, 64, -64, -64, 64, 64, 64, -64, -64, -64, 64, 64, -64, 64, 64, -64, 64, -64, 64, -64, 64, 64, 64, -64, 64, -64, 64, 64, -64, -64, 64, -64, 64, 64, -64, 64, -64, 64, -64, 64, 64, 64, -64, -64, -64, -64, 64, 64, 64, 64, 64, 64, 64, 64, 64, 64, 64, 64, 64, -64, 64, -64, -64, -64, -64, -64, -64, -64, 64, 64, 64, 64, -64, -64, -64, 64, 64, 64, 64, 64, 64, 64, 64, 64, 64, -64, 64, -64, 64, 64, 64, -64, -64, -64, -64, 64, -64, -64, 64, -64, 64, 64, -64, 64, 64, 64, 64, 64, 64, 64, 64, 64, 64, 64, 64, -64, -64, -64, -64, -64, -64, -64, -64, -64, 64, -64, -64, -64, -64, 64, 64, 64, 64, -64, -64, 64, -64, 64, 64, 64, 64, -64, 64, 64, 64, -64, -64, -64, -64, -64, -64, 64, 64, 64, -64, -64, 64, 64, -64, 64, 64, 64, -64, -64, -64, 64, 64, -64, 64, 64, 64, 64, 64, -64, 64, 64, -64, 64, 64, 64, -64, -64, -64, -64, 64, -64, -64, 64, 64, -64, -64, -64, 64, -64, 64, 64, 64, 64, 64, 64, 64, -64, -64, 64, -64, -64, -64, 64, -64, -64, -64, 64, -64, 64, -64, 64, -64, 64, -64, 64, -64, -64, -64, 64, -64, 64, 64, 64, 64, -64, 64, 64, 64, 64, 64, 64, 64, 64, 64, -64, 64, 64, 64, -64, -64, 64, -64, 64, -64, -64, -64, -64, -64, 64, 64, 64, -64, 64, 64, -64, 64, 64, 64, -64, -64, -64, -64, 64, 64, -64, 64, 64, -64, 64, 64, 64, -64, -64, 64, -64, -64, 64, 64, -64, -64, 64, -64, 64, -64, 64, 64, 64, 64, -64, -64, 64, 64, -64, -64, 64, -64, 64, 64, 64, -64, -64, 64, -64, -64, 64, 64, -64, -64, 64, -64, -64, 64, 64, -64, -64, -64, -64, 64, -64, -64, 64, 64, 64, 64, 64, 64, 64, -64, -64, 64, 64, 64, -64, 64, 64, -64, 64, 64, 64, 64, -64, -64, -64, -64, -64, 64, -64, 64, 64, 64, 64, -64, 64, 64, -64, -64, 64, 64, 64, 64, -64, 64, 64, 64, 64, -64, 64, 64, 64, 64, 64, -64, 64, -64, 64, 64, -64, -64, 64, 64, 64, 64, 64, 64, 64, 64, 64, 64, 64, 64, 64, 64, 64, -64, 64, -64, 64, 64, 64, -64, 64, 64, -64, 64, 64, 64, 64, 64, 64, 64, 64, 64, 64, 64, -64, -64, 64, 64, 64, 64, -64, 64, 64, -64, -64, 64, 64, -64, 64, 64, -64, 64, 64, 64, -64, 64, 64, 64, -64, 64, -64, 64, 64, 64, 64, -64, -64, 64, -64, -64, -64, -64, -64, -64, 64, -64, -64, -64, 64, -64, 64, 64, 64, -64, -64, -64, 64, 64, -64, -64, 64, -64, -64, -64, 64, -64, -64, 64, 64, 64, -64, -64, -64, -64, 64, 64, 64, -64, 64, -64, 64, -64, -64, -64, 64, -64, -64, -64, -64, 64, 64, 64, 64, -64, 64, 64, -64, -64, 64, 64, -64, 64, 64, -64, 64, 64, -64, 64, 64, -64, -64, -64, -64, -64, -64, 64, -64, 64, 64, 64, 64, 64, 64, 64, -64, 64, -64, -64, 64, -64, -64, 64, -64, 64, 64, 64, -64, -64, -64, -64, -64, -64, -64, -64, -64, 64, 64, 64, 64, 64, 64, 64, -64, 64, 64, -64, -64, -64, 64, -64, -64, -64, 64, -64, -64, -64, -64, -64, 64, 64, 64, 64, 64, 64, 64, 64, 64, 64, 64, 64, -64, 64, 64, 64, -64, -64, -64, -64, 64, 64, -64, -64, -64, -64, 64, 64, 64, 64, 64, 64, -64, 64, -64, -64, -64, 64, -64, -64, 64, 64, -64, 64, 64, -64, -64, -64, 64, 64, 64, 64, -64, -64, 64, -64, -64, 64, 64, -64, -64, -64, 64, 64, 64, 64, 64, 64, 64, 64, -64, 64, 64, -64, -64, -64, 64, 64, 64, 64, -64, -64, -64, 64, 64, 64, 64, 64, 64, 64, 64, 64, 64, 64, 64, -64, -64, -64, -64, -64, -64, 64, -64, 64, 64, -64, -64, 64, -64, -64, 64, 64, 64, 64, 64, -64, 64, 64, 64, 64, 64, -64, 64, 64, -64, -64, 64, 64, 64, -64, 64, 64, -64, 64, 64, -64, -64, -64, -64, -64, 64, -64, 64, 64, 64, 64, 64, 64, 64, 64, 64, -64, -64, -64, -64, 64, 64, 64, 64, 64, -64, -64, -64, -64, -64, -64, -64, -64, 64, 64, 64, 64, 64, 64, 64, 64, 64, 64, -64, -64, 64, -64, -64, 64, 64, 64, -64, -64, -64, 64, 64, -64, -64, 64, 64, 64, 64, 64, 64, 64, 64, 64, 64, 64, 64, 64, -64, 64, -64, -64, -64, -64, -64, -64, -64, -64, 64, -64, 64, -64, 64, 64, 64, 64, 64, 64, 64, 64, 64, 64, 64, -64, -64, 64, 64, -64, 64, -64, -64, -64, 64, 64, 64, 64, 64, -64, 64, 64, 64, 64, 64, 64, 64, 64, 64, 64, -64, 64, 64, 64, 64, 64, -64, 64, -64, -64, -64, -64, 64, -64, -64, 64, -64, -64, -64, 64, 64, 64, 64, 64, 64, 64, 64, 64, 64, 64, 64, 64, 64, 64, -64, 64, -64, -64, -64, -64, -64, -64, 64, -64, 64, 64, 64, 64, 64, 64, 64, 64, -64, 64, 64, 64, -64, 64, -64, -64, -64, -64, 64, 64, -64, -64, -64, -64, -64, -64, -64, 64, -64, -64, -64, 64, -64, -64, 64, -64, 64, 64, 64, -64, -64, -64, 64, -64, -64, 64, 64, -64, -64, -64, -64, 64, 64, 64, -64, 64, 64, 64, 64, 64, -64, -64, -64, -64, 64, 64, -64, -64, 64, 64, -64, -64, -64, -64, -64, 64, 64, -64, -64, 64, 64, -64, -64, 64, -64, 64, 64, -64, -64, -64, -64, 64, -64, -64, 64, -64, -64, 64, 64, -64, 64, -64, -64, 64, -64, 64, -64, -64, -64, -64, 64, 64, -64, -64, 64, -64, 64, -64, -64, -64, 64, -64, 64, 64, -64, 64, -64, -64, 64, -64, 64, 64, -64, 64, -64, -64, -64, -64, -64, -64, -64, 64, 64, -64, -64, 64, -64, -64, 64, 64, -64, 64, 64, -64, -64, -64, 64, 64, -64, -64, -64, -64, -64, 64, -64, 64, -64, -64, -64, -64, -64, 64, -64, 64, -64, 64, -64, -64, -64, -64, -64, 64, -64, -64, 64, 64, 64, -64, -64, 64, 64, -64, 64, -64, -64, -64, -64, 64, -64, 64, 64, 64, 64, 64, -64, -64, -64, -64, -64, -64, 64, -64, 64, 64, -64, -64, -64, -64, -64, 64, -64, 64, -64, 64, 64, 64, 64, -64, -64, 64, 64, -64, 64, -64, -64, -64, -64, 64, 64, -64, 64, 64, 64, 64, -64, 64, -64, -64, 64, -64, 64, -64, -64, 64, 64, -64, -64, -64, -64, -64, -64, -64, -64, -64, -64, -64, -64, -64, 64, 64, -64, -64, -64, -64, 64, -64, -64, 64, 64, -64, -64, -64, 64, 64, -64, -64, 64, -64, -64, 64, -64, -64, -64, -64, -64, -64, -64, -64, -64, -64, -64, -64, 64, -64, -64, -64, -64, -64, 64, 64, 64, 64, 64, 64, -64, -64, -64, -64, 64, 64, -64, -64, 64, -64, 64, 64, 64, -64, -64, -64, -64, 64, 64, -64, 64, 64, -64, 64, -64, 64, 64, -64, -64, -64, -64, -64, 64, -64, -64, -64, -64, -64, 64, 64, 64, -64, -64, -64, -64, -64, -64, 64, 64, 64, 64, -64, -64, -64, -64, -64, -64, -64, -64, -64, -64, -64, -64, -64, 64, -64, 64, 64, 64, 64, 64, 64, -64, 64, 64, 64, -64, -64, 64, 64, -64, -64, -64, 64, -64, 64, -64, -64, 64, 64, -64, 64, -64, 64, 64, 64, 64, -64, 64, 64, -64, -64, 64, 64, -64, 64, 64, -64, 64, -64, -64, -64, 64, 64, 64, -64, -64, -64, 64, 64, 64, -64, 64, 64, 64, -64, 64, -64, -64, -64, 64, -64, 64, 64, -64, -64, -64, -64, 64, -64, 64, 64, 64, 64, -64, -64, -64, -64, 64, 64, 64, 64, 64, -64, 64, -64, -64, -64, -64, -64, 64, 64, -64, 64, -64, -64, -64, -64, -64, -64, 64, -64, -64, -64, -64, 64, 64, 64, 64, 64, 64, -64, -64, 64, -64, -64, 64, 64, -64, -64, -64, -64, 64, 64, -64, -64, -64, 64, -64, -64, -64, -64, -64, 64, 64, 64, 64, -64, -64, -64, -64, 64, -64, -64, 64, -64, 64, -64, -64, -64, -64, 64, -64, -64, 64, -64, -64, -64, -64, -64, 64, 64, -64, -64, 64, -64, 64, -64, 64, -64, -64, -64, -64, 64, -64, 64, -64, 64, 64, -64, -64, -64, -64, -64, -64, -64, 64, -64, 64, 64, -64, -64, -64, -64, -64, -64, 64, 64, -64, -64, 64, -64, 64, -64, -64, -64, -64, -64, -64, -64, -64, -64, -64, -64, -64, 64, 64, 64, -64, -64, -64, -64, -64, -64, 64, 64, -64, -64, -64, 64, 64, -64, -64, -64, 64, -64, -64, -64, -64, 64, -64, -64, 64, 64, 64, -64, -64, -64, -64, -64, -64, -64, 64, -64, -64, -64, -64, 64, 64, 64, 64, 64, -64, -64, -64, -64, -64, -64, -64, -64, -64, 64, -64, -64, -64, -64, -64, -64, -64, -64, -64, 64, -64, -64, 64, -64, 64, 64, -64, -64, -64, -64, 64, 64, -64, -64, 64, 64, -64, -64, -64, -64, -64, -64, -64, -64, -64, -64, 64, 64, -64, -64, 64, -64, -64, -64, -64, -64, -64, 64, -64, 64, 64, 64, 64, 64, -64, -64, -64, -64, -64, -64, -64, -64, -64, 64, -64, 64, -64, -64, -64, 64, -64, 64, -64, -64, 64, 64, 64, 64, -64, 64, 64, 64, -64, -64, -64, -64, -64, -64, -64, -64, -64, -64, 64, -64, -64, -64, 64, -64, -64, 64, -64, 64, 64, 64, 64, -64, 64, 64, 64, 64, -64, -64, -64, -64, -64, -64, -64, 64, 64, -64, -64, -64, 64, 64, 64, -64, -64, 64, 64, 64, 64, 64, 64, 64, 64, 64, -64, -64, -64, -64, -64, -64, -64, 64, -64, -64, 64, -64, -64, -64, 64, -64, 64, -64, 64, 64, -64, -64, 64, 64, 64, 64, 64, 64, 64, -64, -64, -64, -64, 64, -64, -64, -64, -64, 64, 64, 64, 64, -64, 64, 64, 64, 64, -64, 64, -64, 64, 64, 64, 64, 64, 64, 64, -64, -64, -64, 64, -64, -64, 64, -64, 64, -64, 64, 64, 64, 64, 64, -64, 64, 64, 64, 64, 64, 64, 64, 64, 64, 64, 64, 64, 64, 64, -64, 64, -64, 64, 64, 64, 64, 64, -64, -64, -64, 64, 64, 64, 64, 64, 64, -64, 64, -64, 64, 64, 64, 64, -64, 64, 64, -64, -64, 64, 64, 64, 64, -64, 64, -64, -64, -64, 64, 64, 64, 64, -64, -64, 64, 64, -64, -64, -64, 64, -64, -64, 64, 64, -64, 64, -64, 64, -64, 64, -64, -64, -64, -64, -64, 64, -64, -64, -64, 64, -64, -64, 64, -64, -64, -64, 64, -64, -64, -64, 64, 64, 64, -64, 64, 64, -64, 64, 64, 64, -64, -64, 64, 64, -64, -64, -64, 64, 64, 64, 64, 64, -64, -64, -64, -64, -64, 64, -64, 64, -64, -64, -64, 64, 64, 64, 64, -64, 64, -64, 64, -64, -64, 64, -64, 64, 64, -64, 64, 64, 64, -64, -64, -64, 64, 64, -64, 64, 64, 64, 64, 64, 64, -64, -64, 64, 64, 64, 64, 64, 64, -64, -64, 64, -64, -64, -64, 64, -64, -64, -64, -64, 64, 64, 64, 64, -64, 64, -64, -64, 64, -64, 64, 64, -64, -64, 64, 64, -64, -64, -64, -64, -64, -64, -64, 64, 64, -64, 64, -64, 64, 64, 64, 64, 64, 64, 64, 64, 64, 64, 64, -64, -64, 64, -64, 64, -64, 64, 64, 64, 64, 64, 64, 64, 64, -64, -64, -64, -64, 64, 64, 64, -64, -64, 64, -64, 64, 64, -64, 64, 64, 64, 64, -64, 64, -64, 64, -64, -64, -64, 64, 64, 64, -64, 64, -64, 64, 64, 64, 64, -64, -64, -64, 64, 64, 64, 64, 64, 64, -64, 64, -64, 64, 64, -64, -64, 64, 64, -64, -64, 64, -64, -64, 64, 64, -64, 64, 64, 64, 64, -64, 64, 64, 64, -64, -64, -64, 64, 64, 64, -64, -64, -64, 64, -64, 64, 64, 64, -64, 64, -64, -64, 64, -64, 64, -64, 64, 64, -64, 64, 64, 64, 64, 64, 64, 64, 64, -64, 64, 64, -64, 64, -64, -64, -64, 64, -64, -64, -64, 64, 64, 64, 64, 64, -64, -64, 64, 64, 64, 64, -64, -64, 64, 64, -64, -64, 64, -64, -64, 64, -64, 64, 64, -64, -64, -64, 64, 64, 64, -64, -64, 64, 64, 64, -64, 64, 64, 64, 64, 64, 64, 64, 64, 64, -64, -64, -64, 64, 64, 64, -64, 64, 64, -64, -64, 64, -64, 64, -64, 64, -64, 64, 64, 64, -64, -64, -64, 64, -64, 64, 64, -64, 64, -64, 64, -64, -64, -64, 64, 64, -64, 64, 64, -64, -64, 64, 64, 64, 64, 64, 64, 64, -64, 64, -64, -64, 64, 64, -64, 64, 64, 64, -64, -64, -64, 64, -64, 64, 64, -64, -64, 64, 64, 64, -64, 64, 64, 64, 64, 64, 64, 64, 64, 64, 64, 64, -64, 64, 64, -64, 64, 64, -64, -64, -64, 64, -64, 64, 64, 64, -64, 64, 64, 64, -64, 64, 64, 64, 64, -64, 64, 64, -64, 64, 64, -64, 64, 64, 64, 64, 64, -64, -64, 64, -64, 64, -64, -64, 64, 64, 64, 64, -64, 64, 64, 64, -64, 64, 64, 64, 64, 64, -64, -64, 64, 64, -64, 64, -64, -64, -64, 64, -64, -64, 64, 64, 64, 64, -64, 64, 64, 64, 64, 64, -64, 64, 64, 64, 64, -64, 64, 64, 64, -64, -64, 64, 64, 64, -64, -64, 64, -64, 64, 64, 64, 64, -64, 64, 64, 64, -64, 64, -64, 64, 64, 64, 64, -64, 64, 64, -64, 64, 64, 64, 64, 64, -64, 64, -64, 64, 64, 64, -64, 64, 64, 64, 64, 64, -64, 64, -64, 64, 64, 64, 64, 64, -64, 64, -64, 64, -64, -64, 64, -64, 64, -64, 64, 64, 64, 64, 64, 64, 64, 64, 64, 64, 64, 64, 64, -64, -64, 64, -64, -64, -64, 64, -64, 64, -64, -64, -64, 64, -64, -64, -64, 64, 64, 64, 64, 64, 64, -64, 64, 64, -64, 64, 64, 64, 64, 64, 64, -64, 64, 64, -64, 64, 64, 64, -64, -64, 64, 64, -64, -64, 64, 64, -64, 64, 64, -64, 64, 64, -64, 64, 64, -64, 64, -64, 64, 64, -64, -64, -64, -64, -64, -64, -64, 64, -64, 64, 64, 64, -64, 64, 64, -64, -64, 64, 64, 64, 64, 64, -64, 64, -64, 64, -64, 64, -64, -64, -64, 64, 64, 64, -64, 64, -64, -64, 64, 64, -64, 64, 64, 64, -64, 64, 64, 64, 64, 64, 64, -64, -64, 64, -64, 64, 64, 64, 64, 64, 64, -64, 64, -64, -64, -64, -64, 64, 64, -64, -64, 64, -64, 64, 64, 64, -64, 64, 64, -64, 64, 64, -64, 64, 64, 64, 64, 64, -64, 64, -64, 64, 64, 64, -64, 64, 64, 64, 64, 64, -64, 64, 64, -64, -64, -64, -64, -64, -64, -64, 64, 64, 64, 64, 64, -64, -64, 64, 64, 64, 64, 64, 64, -64, -64, -64, 64, -64, 64, 64, -64, -64, 64, 64, -64, 64, 64, 64, 64, -64, 64, -64, -64, -64, -64, -64, -64, 64, 64, 64, -64, 64, -64, 64, 64, -64, -64, -64, -64, 64, -64, -64, -64, 64, 64, -64, 64, -64, -64, -64, 64, -64, -64, -64, -64, -64, 64, 64, 64, 64, 64, -64, 64, 64, 64, -64, 64, -64, -64, -64, -64, 64, -64, -64, 64, -64, -64, 64, 64, 64, 64, 64, -64, -64, -64, -64, -64, -64, -64, -64, -64, -64, -64, 64, -64, -64, 64, -64, -64, -64, -64, -64, -64, -64, -64, -64, 64, -64, -64, 64, 64, -64, -64, 64, -64, 64, -64, -64, 64, 64, 64, 64, -64, 64, -64, -64, -64, -64, -64, -64, -64, -64, -64, -64, -64, 64, -64, -64, 64, -64, -64, 64, -64, 64, -64, -64, 64, -64, 64, 64, 64, 64, 64, 64, 64, -64, 64, 64, 64, -64, -64, -64, -64, -64, -64, -64, 64, -64, 64, -64, -64, 64, 64, 64, -64, 64, 64, 64, 64, 64, 64, 64, 64, 64, 64, 64, 64, -64, -64, -64, 64, -64, -64, -64, -64, -64, -64, 64, -64, 64, -64, -64, 64, 64, 64, -64, 64, -64, 64, -64, 64, 64, 64, 64, 64, -64, 64, -64, -64, -64, -64, -64, 64, -64, 64, -64, -64, 64, -64, -64, 64, 64, -64, 64, 64, 64, 64, -64, -64, 64, 64, 64, 64, -64, 64, 64, -64, -64, -64, -64, 64, 64, 64, 64, -64, 64, -64, -64, 64, -64, -64, -64, -64, -64, -64, -64, 64, 64, 64, 64, 64, 64, -64, -64, -64, -64, -64, -64, 64, -64, 64, 64, -64, -64, -64, 64, 64, 64, -64, -64, -64, 64, -64, -64, -64, 64, 64, 64, -64, -64, -64, -64, 64, -64, -64, -64, -64, -64, -64, -64, -64, 64, -64, 64, 64, -64, -64, -64, 64, -64, -64, -64, 64, 64, 64, 64, -64, -64, -64, -64, -64, 64, -64, 64, 64, -64, -64, -64, 64, 64, 64, -64, 64, -64, 64, 64, 64, 64, -64, -64, -64, -64, 64, -64, 64, -64, -64, -64, 64, 64, 64, 64, -64, 64, 64, -64, 64, 64, 64, -64, 64, -64, -64, 64, 64, 64, -64, -64, -64, 64, 64, -64, -64, -64, 64, -64, -64, 64, 64, -64, -64, -64, 64, -64, -64, -64, -64, -64, 64, -64, 64, 64, 64, 64, -64, -64, -64, -64, 64, -64, -64, -64, -64, -64, 64, 64, 64, -64, 64, 64, 64, -64, -64, -64, 64, 64, 64, -64, 64, 64, 64, 64, 64, -64, -64, 64, -64, -64, -64, 64, 64, 64, 64, 64, 64, 64, -64, -64, -64, -64, -64, -64, -64, -64, -64, 64, 64, 64, -64, 64, -64, -64, -64, -64, -64, 64, -64, 64, 64, 64, 64, 64, 64, 64, -64, -64, 64, 64, -64, -64, 64, 64, -64, 64, 64, 64, -64, -64, -64, 64, -64, 64, 64, 64, 64, 64, 64, 64, -64, 64, 64, 64, -64, 64, -64, 64, -64, -64, 64, -64, 64, 64, 64, 64, 64, 64, 64, -64, -64, -64, 64, -64, 64, 64, 64, 64, -64, 64, 64, 64, 64, -64, 64, -64, -64, -64, 64, -64, -64, -64, 64, 64, 64, -64, 64, 64, -64, -64, -64, -64, -64, 64, 64, 64, 64, 64, 64, 64, -64, -64, 64, -64, -64, -64, -64, -64, -64, -64, 64, 64, 64, -64, 64, 64, -64, 64, 64, -64, 64, 64, 64, 64, 64, 64, 64, 64, 64, -64, -64, -64, -64, -64, -64, 64, -64, -64, 64, 64, 64, -64, 64, -64, -64, 64, 64, 64, 64, 64, 64, 64, 64, 64, -64, -64, 64, 64, 64, 64, -64, -64, 64, -64, -64, 64, 64, 64, 64, 64, -64, 64, 64, 64, 64, 64, 64, -64, 64, 64, 64, 64, 64, 64, 64, -64, -64, -64, 64, -64, -64, 64, 64, 64, 64, 64, 64, 64, 64, 64, 64, 64, 64, 64, 64, 64, 64, 64, 64, 64, 64, 64, -64, -64, 64, 64, 64, -64, -64, -64, 64, 64, 64, 64, 64, 64, 64, -64, 64, -64, -64, 64, 64, -64, 64, 64, 64, 64, 64, -64, 64, -64, 64, -64, 64, -64, -64, -64, 64, 64, -64, -64, -64, -64, -64, -64, -64, -64, -64, -64, -64, -64, -64, -64, 64, 64, 64, 64, 64, -64, -64, 64, -64, 64, 64, -64, 64, -64, -64, -64, -64, -64, -64, -64, -64, -64, -64, 64, -64, -64, -64, 64, 64, 64, 64, -64, -64, -64, -64, -64, 64, -64, -64, -64, -64, -64, 64, 64, -64, -64, -64, -64, -64, -64, -64, -64, -64, -64, -64, -64, -64, -64, 64, 64, 64, -64, -64, 64, 64, -64, -64, -64, 64, 64, 64, -64, 64, 64, 64, 64, -64, 64, 64, 64, -64, -64, 64, -64, 64, -64, -64, 64, 64, 64, 64, 64, -64, -64, 64, -64, -64, -64, 64, 64, -64, -64, -64, -64, 64, -64, 64, 64, 64, -64, -64, -64, 64, 64, 64, 64, 64, -64, -64, 64, 64, -64, -64, 64, -64, -64, -64, -64, 64, 64, 64, -64, 64, -64, 64, -64, 64, -64, -64, -64, -64, 64, 64, -64, 64, 64, 64, -64, 64, 64, 64, 64, 64, -64, -64, 64, 64, -64, 64, -64, -64, -64, 64, -64, 64, 64, 64, 64, 64, 64, 64, -64, 64, -64, 64, -64, 64, 64, 64, 64, -64, -64, -64, -64, -64, 64, 64, 64, 64, 64, 64, 64, 64, 64, -64, 64, -64, -64, 64, -64, -64, -64, -64, 64, -64, 64, 64, -64, -64, 64, 64, -64, 64, -64, 64, 64, 64, 64, 64, 64, 64, 64, 64, -64, 64, -64, -64, -64, 64, -64, -64, -64, 64, 64, 64, -64, -64, -64, 64, 64, 64, 64, -64, 64, 64, 64, 64, 64, 64, 64, 64, -64, -64, -64, -64, -64, -64, -64, -64, 64, 64, 64, 64, 64, 64, 64, 64, 64, 64, -64, -64, -64, -64, 64, 64, 64, 64, -64, -64, -64, -64, -64, 64, -64, -64, -64, -64, -64, -64, -64, 64, 64, -64, 64, 64, 64, -64, -64, -64, -64, -64, -64, 64, -64, -64, -64, -64, -64, -64, -64, 64, 64, 64, 64, 64, -64, -64, -64, -64, -64, 64, 64, 64, -64, -64, -64, -64, -64, -64, -64, 64, -64, 64, 64, 64, -64, -64, -64, 64, 64, 64, -64, 64, -64, -64, 64, -64, -64, -64, -64, -64, -64, -64, -64, -64, -64, -64, -64, -64, -64, -64, 64, -64, -64, -64, -64, -64, 64, 64, 64, 64, -64, -64, -64, -64, -64, -64, -64, -64, -64, -64, -64, -64, -64, -64, -64, -64, -64, -64, -64, -64, -64, -64, -64, -64, 64, 64, 64, -64, -64, 64, -64, -64, -64, -64, -64, -64, -64, -64, -64, -64, -64, -64, -64, -64, -64, -64, -64, -64, -64, -64, -64, -64, 64, 64, -64, 64, -64, 64, -64, -64, -64, -64, -64, -64, -64, 64, 64, -64, -64, -64, -64, -64, -64, -64, -64, -64, -64, -64, -64, 64, 64, 64, -64, 64, 64, 64, 64, -64, -64, -64, -64, -64, -64, 64, 64, 64, 64, -64, -64, -64, 64, 64, 64, -64, -64, 64, -64, -64, -64, -64, 64, -64, 64, 64, -64, -64, -64, 64, -64, 64, 64, 64, 64, 64, -64, 64, -64, -64, -64, 64, 64, 64, 64, 64, -64, -64, 64, -64, -64, -64, 64, 64, 64, 64, -64, 64, 64, 64, -64, 64, -64, -64, -64, -64, -64, -64, 64, -64, 64, 64, -64, 64, 64, -64, 64, -64, -64, -64, 64, 64, 64, 64, -64, 64, -64, -64, -64, 64, -64, 64, -64, -64, -64, -64, -64, -64, 64, 64, 64, -64, -64, 64, 64, 64, -64, 64, 64, 64, 64, 64, -64, 64, 64, 64, -64, -64, -64, -64, -64, -64, -64, 64, -64, -64, -64, 64, 64, 64, 64, 64, 64, -64, 64, -64, 64, 64, 64, -64, -64, -64, 64, 64, 64, -64, -64, -64, -64, -64, 64, -64, -64, -64, -64, -64, -64, -64, 64, -64, -64, -64, 64, 64, 64, 64, 64, 64, -64, -64, -64, 64, -64, -64, -64, -64, -64, -64, 64, 64, 64, 64, -64, -64, -64, -64, -64, -64, 64, -64, 64, -64, -64, 64, 64, 64, -64, 64, -64, 64, -64, -64, -64, -64, 64, -64, 64, 64, 64, 64, 64, -64, -64, 64, -64, -64, -64, 64, 64, -64, 64, 64, -64, -64, 64, -64, 64, 64, -64, 64, -64, 64, -64, 64, -64, -64, 64, 64, 64, 64, 64, -64, 64, 64, -64, 64, -64, 64, -64, -64, -64, 64, 64, 64, 64, 64, -64, 64, 64, 64, 64, -64, 64, 64, 64, 64, 64, -64, -64, -64, 64, -64, -64, 64, 64, 64, 64, 64, 64, 64, 64, 64, 64, -64, -64, 64, 64, -64, -64, -64, -64, -64, 64, 64, 64, 64, 64, 64, -64, -64, 64, -64, -64, -64, -64, -64, -64, 64, -64, -64, -64, 64, -64, 64, -64, -64, -64, 64, 64, 64, -64, 64, -64, 64, 64, 64, 64, -64, 64, 64, -64, 64, 64, 64, -64, -64, -64, -64, -64, -64, -64, -64, -64, -64, -64, -64, -64, -64, 64, -64, -64, 64, -64, -64, -64, 64, 64, 64, -64, 64, 64, -64, -64, -64, -64, -64, -64, -64, 64, 64, -64, -64, -64, -64, -64, -64, -64, -64, 64, -64, 64, -64, -64, 64, -64, -64, -64, 64, -64, -64, -64, 64, 64, 64, 64, 64, 64, 64, -64, 64, -64, 64, 64, -64, -64, 64, -64, -64, -64, 64, -64, -64, 64, 64, 64, 64, 64, -64, 64, 64, -64, -64, 64, 64, -64, -64, 64, 64, -64, 64, 64, -64, -64, -64, -64, -64, -64, -64, -64, 64, 64, 64, -64, 64, -64, 64, 64, -64, -64, -64, 64, 64, -64, 64, -64, -64, -64, 64, -64, 64, -64, -64, 64, 64, -64, 64, -64, -64, 64, 64, 64, -64, -64, 64, 64, -64, -64, 64, -64, 64, 64, -64, 64, -64, -64, 64, -64, 64, -64, 64, 64, 64, -64, -64, 64, 64, -64, 64, 64, -64, 64, 64, -64, -64, 64, -64, -64, -64, -64, 64, -64, 64, 64, 64, 64, -64, -64, -64, -64, -64, 64, -64, 64, -64, 64, 64, 64, -64, 64, 64, 64, 64, -64, -64, 64, 64, 64, -64, 64, -64, -64, -64, -64, -64, -64, -64, 64, -64, -64, 64, 64, 64, 64, 64, -64, 64, -64, 64, -64, -64, -64, 64, -64, 64, -64, -64, -64, -64, -64, 64, -64, -64, -64, 64, -64, -64, 64, 64, 64, 64, 64, 64, 64, 64, 64, -64, -64, -64, -64, -64, -64, 64, -64, -64, -64, -64, -64, -64, -64, -64, 64, 64, 64, 64, 64, -64, 64, -64, 64, 64, -64, -64, 64, -64, -64, 64, 64, -64, -64, 64, 64, -64, 64, -64, 64, 64, 64, 64, 64, -64, -64, 64, 64, -64, -64, 64, 64, 64, -64, 64, -64, -64, -64, 64, -64, 64, 64, 64, 64, 64, -64, -64, -64, -64, -64, -64, -64, -64, -64, 64, -64, -64, -64, 64, -64, 64, 64, 64, -64, -64, 64, -64, -64, -64, -64, -64, 64, -64, -64, -64, -64, 64, -64, -64, 64, -64, -64, -64, 64, -64, 64, -64, 64, 64, 64, 64, -64, -64, -64, -64, -64, 64, 64, 64, -64, -64, -64, -64, -64, 64, -64, 64, -64, -64, -64, 64, 64, -64, -64, -64, -64, -64, 64, 64, -64, 64, 64, 64, 64, 64, 64, 64, -64, -64, -64, -64, -64, 64, -64, -64, -64, -64, -64, -64, 64, -64, -64, 64, 64, -64, 64, -64, -64, 64, -64, 64, 64, 64, 64, 64, -64, 64, -64, -64, -64, -64, -64, -64, -64, -64, -64, -64, -64, -64, 64, 64, 64, 64, 64, 64, -64, 64, 64, 64, 64, 64, 64, 64, 64, -64, -64, -64, -64, 64, -64, -64, 64, -64, -64, -64, -64, -64, -64, 64, -64, 64, -64, 64, 64, 64, 64, 64, -64, 64, 64, -64, 64, -64, -64, -64, -64, -64, -64, -64, -64, -64, -64, -64, -64, 64, -64, 64, 64, -64, -64, 64, 64, 64, 64, -64, -64, 64, -64, -64, 64, 64, -64, 64, -64, -64, -64, 64, -64, -64, -64, 64, -64, -64, -64, -64, -64, 64, 64, 64, -64, 64, 64, 64, -64, 64, -64, 64, -64, -64, -64, 64, -64, 64, -64, -64, -64, -64, -64, 64, -64, -64, -64, -64, -64, 64, 64, -64, -64, 64, -64, -64, 64, -64, 64, -64, -64, -64, 64, 64, -64, -64, 64, 64, -64, -64, -64, -64, -64, -64, -64, -64, -64, 64, 64, -64, 64, -64, -64, 64, 64, 64, 64, -64, -64, -64, -64, -64, -64, 64, -64, 64, -64, 64, -64, 64, -64, -64, -64, -64, -64, -64, -64, -64, 64, 64, -64, 64, -64, 64, 64, -64, -64, -64, -64, -64, 64, -64, 64, 64, 64, -64, -64, -64, 64, -64, -64, 64, 64, 64, -64, 64, 64, 64, -64, -64, -64, -64, -64, -64, -64, -64, -64, -64, -64, -64, 64, 64, -64, 64, -64, 64, 64, -64, 64, 64, -64, -64, -64, 64, -64, -64, -64, 64, -64, 64, 64, 64, -64, -64, -64, -64, -64, -64, 64, -64, -64, -64, -64, -64, -64, -64, -64, -64, -64, -64, -64, 64, -64, 64, -64, -64, -64, -64, -64, 64, -64, -64, -64, -64, -64, 64, 64, 64, -64, 64, 64, -64, 64, -64, 64, 64, -64, 64, 64, 64, 64, 64, -64, -64, -64, -64, -64, -64, -64, -64, -64, -64, -64, -64, 64, 64, 64, -64, 64, -64, -64, 64, -64, 64, -64, 64, 64, -64, 64, 64, -64, 64, -64, -64, -64, -64, -64, -64, -64, -64, -64, 64, 64, 64, 64, -64, -64, -64, 64, 64, 64, 64, -64, 64, 64, 64, 64, 64, 64, 64, 64, 64, -64, -64, -64, -64, -64, -64, -64, 64, 64, 64, 64, 64, 64, -64, 64, 64, 64, -64, -64, 64, -64, 64, -64, 64, 64, -64, 64, -64, -64, -64, 64, 64, -64, -64, -64, 64, 64, 64, 64, 64, 64, 64, -64, 64, 64, 64, -64, 64, 64, 64, -64, 64, 64, 64, -64, -64, 64, -64, 64, -64, 64, -64, -64, 64, -64, 64, 64, 64, -64, -64, -64, 64, -64, 64, 64, -64, 64, 64, -64, -64, 64, 64, -64, 64, -64, -64, 64, -64, -64, 64, -64, -64, 64, -64, 64, -64, -64, -64, 64, -64, -64, 64, 64, 64, -64, 64, -64, 64, -64, -64, -64, 64, -64, -64, -64, -64, -64, 64, 64, 64, -64, 64, 64, -64, 64, -64, -64, -64, 64, 64, -64, 64, -64, 64, 64, -64, -64, 64, -64, -64, -64, -64, -64, -64, -64, -64, -64, 64, -64, -64, 64, 64, -64, -64, -64, 64, -64, 64, -64, 64, -64, 64, -64, 64, -64, -64, 64, -64, -64, -64, -64, -64, -64, -64, -64, 64, 64, 64, -64, -64, 64, -64, -64, -64, -64, -64, -64, 64, 64, 64, 64, 64, -64, -64, -64, -64, -64, -64, -64, -64, -64, -64, 64, 64, 64, -64, 64, -64, -64, -64, 64, 64, 64, -64, -64, -64, 64, 64, -64, 64, -64, 64, -64, -64, -64, -64, -64, -64, -64, 64, 64, 64, 64, 64, 64, -64, 64, -64, 64, 64, -64, -64, -64, -64, -64, -64, 64, 64, 64, 64, 64, -64, -64, -64, 64, -64, 64, 64, 64, 64, 64, 64, 64, -64, -64, -64, -64, 64, 64, -64, -64, -64, -64, 64, -64, 64, 64, -64, 64, -64, -64, 64, 64, -64, -64, -64, 64, 64, 64, -64, 64, -64, -64, -64, -64, -64, -64, -64, -64, -64, -64, -64, -64, 64, 64, -64, -64, 64, 64, 64, -64, 64, -64, -64, 64, 64, -64, -64, -64, -64, -64, -64, -64, -64, -64, -64, 64, -64, -64, 64, -64, 64, -64, -64, -64, -64, -64, -64, 64, 64, -64, -64, -64, -64, -64, -64, -64, -64, -64, -64, -64, -64, -64, -64, -64, 64, -64, 64, 64, 64, 64, 64, -64, -64, -64, 64, -64, -64, -64, 64, 64, 64, -64, 64, -64, 64, -64, -64, 64, -64, -64, -64, -64, -64, -64, -64, -64, 64, 64, 64, -64, -64, 64, 64, 64, -64, -64, 64, -64, -64, 64, 64, 64, -64, -64, 64, 64, 64, 64, -64, -64, -64, -64, 64, 64, -64, 64, 64, -64, -64, 64, -64, -64, -64, -64, -64, -64, -64, -64, 64, 64, -64, 64, 64, 64, 64, 64, 64, -64, -64, 64, -64, -64, -64, 64, 64, -64, -64, -64, -64, -64, -64, -64, -64, -64, -64, 64, 64, -64, 64, -64, 64, 64, 64, 64, -64, 64, 64, 64, 64, -64, 64, 64, -64, 64, 64, 64, -64, -64, -64, -64, -64, -64, -64, -64, -64, 64, 64, 64, 64, 64, 64, -64, -64, 64, 64, 64, 64, 64, 64, 64, 64, 64, 64, -64, 64, -64, -64, -64, -64, 64, 64, -64, -64, -64, 64, 64, 64, 64, 64, 64, 64, 64, -64, 64, -64, -64, 64, -64, 64, 64, -64, -64, -64, -64, 64, -64, -64, -64, 64, 64, -64, -64, 64, 64, 64, 64, 64, -64, -64, 64, -64, -64, -64, -64, 64, 64, 64, 64, 64, 64, -64, 64, -64, -64, -64, -64, -64, 64, 64, -64, -64, 64, -64, 64, 64, 64, 64, 64, 64, -64, -64, -64, -64, 64, 64, -64, -64, -64, 64, 64, -64, -64, -64, -64, -64, -64, 64, 64, -64, -64, -64, 64, 64, -64, -64, 64, -64, -64, -64, 64, -64, -64, 64, -64, -64, 64, 64, -64, -64, -64, -64, -64, -64, -64, -64, -64, -64, -64, -64, -64, -64, -64, -64, 64, -64, -64, -64, -64, 64, -64, 64, 64, 64, -64, -64, -64, -64, -64, -64, -64, -64, -64, -64, -64, -64, -64, 64, -64, 64, 64, 64, -64, 64, 64, 64, 64, -64, -64, 64, 64, 64, 64, 64, 64, -64, 64, 64, -64, -64, -64, -64, -64, -64, -64, -64, -64, 64, -64, 64, -64, 64, 64, -64, -64, -64, 64, -64, -64, 64, 64, 64, -64, 64, 64, 64, -64, 64, -64, 64, -64, 64, 64, -64, -64, -64, -64, -64, 64, 64, -64, 64, 64, -64, 64, 64, -64, -64, -64, 64, -64, 64, -64, -64, -64, -64, -64, 64, 64, 64, 64, -64, -64, -64, -64, -64, 64, -64, -64, 64, 64, 64, -64, 64, -64, -64, -64, 64, -64, -64, 64, -64, -64, 64, 64, 64, 64, 64, -64, 64, -64, -64, -64, 64, 64, -64, 64, -64, 64, 64, 64, -64, -64, 64, -64, -64, -64, -64, -64, 64, -64, 64, 64, 64, -64, 64, 64, 64, 64, -64, -64, -64, 64, 64, 64, 64, 64, -64, -64, -64, -64, 64, -64, -64, -64, -64, -64, 64, 64, 64, 64, 64, 64, 64, -64, 64, -64, -64, 64, 64, -64, -64, 64, 64, 64, -64, -64, -64, 64, 64, -64, 64, -64, 64, -64, -64, -64, 64, -64, 64, -64, -64, -64, 64, -64, 64, 64, 64, -64, 64, 64, -64, 64, 64, -64, -64, 64, 64, -64, -64, 64, -64, 64, -64, 64, -64, 64, 64, 64, 64, 64, 64, 64, 64, -64, -64, 64, 64, -64, -64, -64, -64, 64, 64, -64, -64, -64, 64, 64, 64, -64, -64, 64, 64, 64, -64, 64, -64, 64, -64, 64, 64, -64, -64, -64, 64, 64, 64, 64, 64, 64, -64, -64, -64, 64, -64, -64, 64, 64, -64, -64, -64, -64, -64, -64, -64, -64, -64, -64, -64, -64, -64, -64, 64, -64, 64, -64, 64, 64, 64, 64, -64, 64, -64, 64, 64, 64, 64, 64, 64, 64, -64, 64, -64, -64, -64, -64, 64, 64, 64, -64, -64, -64, 64, 64, 64, 64, -64, 64, -64, 64, 64, 64, 64, 64, 64, 64, 64, 64, 64, 64, 64, -64, 64, 64, -64, -64, -64, -64, -64, -64, 64, -64, -64, 64, 64, -64, -64, 64, 64, 64, 64, 64, -64, 64, -64, -64, -64, 64, -64, -64, 64, 64, -64, -64, 64, -64, -64, -64, -64, 64, 64, 64, 64, -64, 64, 64, -64, -64, -64, -64, -64, -64, -64, 64, -64, -64, 64, 64, -64, 64, 64, 64, 64, -64, 64, 64, -64, 64, 64, -64, 64, -64, -64, -64, -64, -64, -64, -64, -64, -64, -64, -64, -64, -64, 64, 64, -64, -64, 64, 64, -64, -64, 64, -64, 64, 64, -64, -64, -64, -64, -64, -64, -64, -64, -64, -64, -64, -64, -64, -64, 64, -64, -64, -64, -64, -64, -64, -64, -64, 64, -64, -64, -64, -64, -64, 64, -64, -64, -64, -64, -64, -64, -64, -64, -64, 64, 64, -64, -64, 64, 64, -64, -64, -64, -64, -64, -64, 64, -64, -64, 64, -64, 64, -64, -64, -64, -64, -64, -64, -64, 64, 64, 64, 64, 64, 64, -64, 64, -64, -64, -64, -64, -64, -64, 64, -64, 64, -64, -64, -64, 64, -64, -64, -64, -64, -64, -64, 64, 64, 64, 64, 64, 64, -64, 64, -64, 64, -64, -64, -64, -64, -64, 64, -64, 64, 64, 64, 64, 64, 64, -64, 64, 64, -64, 64, 64, 64, 64, -64, 64, -64, -64, -64, -64, -64, -64, -64, 64, -64, -64, -64, -64, -64, -64, 64, -64, 64, 64, 64, 64, -64, -64, -64, -64, -64, -64, 64, -64, 64, -64, -64, -64, -64, -64, -64, -64, 64, -64, -64, 64, 64, 64, 64, -64, 64, 64, -64, 64, 64, -64, -64, 64, 64, -64, 64, -64, -64, -64, -64, -64, 64, 64, 64, -64, 64, -64, 64, 64, -64, -64, -64, 64, -64, 64, -64, -64, -64, -64, -64, -64, -64, -64, 64, -64, -64, -64, -64, -64, -64, -64, -64, 64, 64, -64, -64, -64, 64, -64, 64, 64, -64, -64, -64, -64, -64, -64, -64, -64, -64, -64, -64, -64, -64, 64, -64, -64, -64, -64, -64, -64, -64, 64, -64, -64, -64, -64, 64, 64, 64, 64, -64, -64, 64, -64, 64, 64, -64, -64, -64, -64, -64, -64, 64, 64, -64, 64, -64, -64, 64, -64, -64, -64, 64, -64, 64, -64, -64, 64, 64, 64, 64, 64, -64, -64, -64, -64, -64, -64, -64, -64, -64, -64, 64, -64, 64, -64, 64, 64, -64, -64, -64, 64, -64, -64, -64, 64, 64, 64, -64, 64, -64, 64, -64, -64, -64, -64, -64, -64, 64, 64, -64, 64, -64, -64, -64, -64, -64, -64, 64, 64, -64, -64, -64, -64, -64, -64, 64, -64, 64, -64, -64, -64, -64, -64, 64, 64, -64, -64, 64, -64, -64, -64, -64, -64, -64, -64, -64, -64, 64, -64, -64, -64, -64, 64, -64, -64, -64, -64, -64, -64, -64, 64, 64, 64, -64, -64, 64, -64, -64, -64, -64, -64, -64, 64, -64, -64, 64, -64, -64, -64, -64, -64, -64, -64, -64, -64, -64, 64, 64, 64, 64, -64, -64, -64, 64, 64, -64, -64, -64, -64, -64, 64, 64, -64, 64, 64, -64, 64, -64, -64, 64, -64, 64, -64, 64, 64, -64, -64, -64, 64, -64, -64, -64, -64, -64, -64, -64, -64, 64, 64, 64, 64, -64, -64, 64, 64, -64, 64, -64, -64, -64, -64, -64, -64, -64, 64, -64, -64, -64, -64, 64, -64, 64, -64, -64, -64, -64, -64, 64, -64, -64, -64, 64, 64, -64, 64, -64, -64, -64, -64, -64, 64, 64, -64, -64, -64, 64, -64, -64, -64, -64, -64, -64, -64, -64, 64, -64, 64, 64, 64, 64, -64, 64, -64, -64, -64, -64, 64, -64, 64, -64, -64, -64, 64, -64, -64, -64, -64, -64, -64, -64, -64, 64, 64, -64, 64, 64, 64, -64, -64, -64, -64, 64, 64, -64, -64, 64, 64, 64, -64, -64, 64, 64, 64, 64, -64, 64, -64, 64, 64, -64, 64, -64, -64, -64, -64, 64, -64, 64, -64, 64, -64, -64, 64, -64, 64, 64, 64, 64, -64, -64, 64, 64, 64, 64, 64, -64, 64, 64, 64, 64, -64, 64, -64, 64, 64, -64, -64, -64, 64, 64, -64, -64, -64, -64, 64, 64, 64, -64, 64, 64, 64, -64, 64, 64, -64, -64, 64, -64, 64, -64, 64, 64, 64, -64, -64, -64, -64, -64, -64, -64, -64, 64, -64, 64, -64, -64, -64, 64, -64, -64, -64, -64, -64, 64, -64, -64, -64, 64, 64, -64, -64, -64, -64, -64, -64, -64, -64, -64, -64, -64, -64, -64, -64, -64, -64, -64, 64, -64, -64, -64, -64, -64, -64, -64, -64, -64, -64, -64, 64, -64, -64, -64, -64, -64, -64, 64, -64, -64, -64, -64, -64, -64, -64, 64, -64, -64, 64, 64, -64, 64, -64, -64, -64, 64, 64, 64, -64, -64, -64, -64, -64, -64, -64, -64, -64, -64, -64, 64, -64, -64, 64, 64, -64, -64, 64, 64, 64, -64, 64, 64, 64, -64, -64, 64, -64, -64, -64, -64, -64, -64, 64, -64, -64, -64, -64, 64, 64, 64, -64, -64, -64, -64, 64, 64, 64, 64, 64, 64, -64, 64, -64, -64, -64, -64, -64, 64, 64, 64, 64, 64, -64, 64, 64, 64, 64, 64, 64, 64, 64, 64, 64, 64, 64, 64, 64, 64, 64, -64, 64, -64, -64, -64, -64, -64, 64, -64, -64, -64, 64, 64, 64, -64, 64, 64, 64, 64, 64, 64, 64, 64, 64, 64, 64, -64, -64, 64, 64, 64, -64, -64, -64, 64, -64, 64, -64, 64, 64, 64, -64, -64, -64, 64, 64, 64, 64, 64, 64, 64, 64, 64, 64, 64, 64, 64, 64, -64, -64, 64, -64, 64, 64, 64, 64, 64, 64, -64, -64, -64, 64, -64, -64, -64, -64, 64, 64, 64, 64, 64, 64, 64, -64, 64, -64, -64, -64, 64, -64, 64, 64, 64, 64, 64, -64, -64, -64, -64, 64, 64, -64, -64, 64, 64, 64, 64, 64, 64, -64, -64, 64, 64, 64, -64, 64, -64, -64, 64, 64, -64, 64, -64, -64, 64, 64, 64, 64, -64, -64, -64, -64, 64, 64, 64, 64, -64, 64, -64, 64, 64, 64, 64, 64, 64, -64, 64, -64, 64, -64, -64, -64, -64, 64, -64, 64, 64, -64, -64, -64, -64, -64, -64, -64, -64, -64, -64, 64, -64, 64, -64, 64, -64, -64, -64, -64, -64, -64, -64, -64, 64, -64, 64, 64, 64, 64, -64, -64, -64, -64, -64, -64, -64, 64, -64, -64, 64, 64, -64, -64, -64, 64, 64, -64, -64, -64, -64, -64, -64, 64, -64, 64, -64, -64, -64, -64, -64, -64, -64, -64, -64, -64, 64, -64, -64, 64, -64, -64, -64, 64, -64, -64, -64, 64, -64, 64, 64, 64, 64, 64, -64, -64, -64, -64, -64, -64, -64, -64, 64, 64, 64, 64, 64, -64, -64, -64, 64, -64, -64, 64, 64, -64, -64, -64, 64, -64, 64, -64, -64, -64, -64, -64, -64, -64, -64, -64, -64, 64, -64, 64, -64, -64, -64, -64, -64, -64, -64, -64, -64, -64, 64, -64, -64, -64, -64, -64, -64, 64, -64, -64, -64, -64, -64, -64, -64, 64, -64, -64, 64, 64, -64, 64, -64, -64, -64, -64, -64, -64, -64, -64, -64, -64, 64, 64, -64, 64, -64, -64, -64, -64, -64, -64, 64, -64, -64, -64, 64, 64, -64, -64, 64, -64, -64, -64, -64, -64, -64, -64, -64, -64, -64, 64, -64, 64, -64, -64, -64, -64, -64, -64, -64, 64, 64, -64, -64, 64, -64, -64, 64, -64, 64, 64, -64, -64, -64, 64, -64, -64, -64, -64, 64, -64, -64, -64, -64, 64, 64, 64, 64, 64, -64, -64, 64, -64, -64, -64, -64, -64, -64, 64, -64, -64, 64, -64, 64, 64, -64, -64, 64, -64, 64, 64, 64, 64, -64, 64, 64, -64, -64, 64, 64, -64, -64, -64, 64, 64, 64, 64, 64, 64, 64, 64, 64, 64, 64, 64, 64, 64, 64, 64, 64, 64, 64, 64, 64, 64, 64, -64, 64, 64, 64, -64, 64, 64, 64, 64, 64, 64, 64, 64, 64, 64, 64, 64, 64, 64, 64, 64, 64, 64, -64, 64, 64, 64, 64, -64, 64, -64, -64, 64, -64, 64, -64, 64, 64, 64, 64, 64, 64, 64, 64, 64, 64, 64, 64, 64, 64, 64, 64, -64, -64, -64, 64, 64, 64, 64, 64, -64, -64, 64, 64, -64, 64, -64, 64, -64, -64, 64, 64, 64, 64, 64, 64, 64, 64, 64, -64, -64, -64, -64, 64, 64, 64, 64, 64, -64, -64, 64, 64, 64, 64, -64, -64, 64, 64, 64, -64, -64, 64, 64, 64, 64, -64, -64, 64, 64, -64, -64, 64, -64, -64, 64, -64, 64, 64, 64, 64, -64, 64, 64, 64, 64, 64, 64, 64, -64, -64, -64, 64, 64, -64, -64, 64, -64, 64, -64, 64, -64, 64, -64, -64, 64, -64, -64, -64, 64, -64, 64, -64, -64, -64, -64, -64, -64, 64, 64, 64, -64, 64, 64, 64, -64, -64, -64, -64, 64, 64, 64, -64, -64, 64, 64, 64, 64, 64, 64, 64, 64, 64, 64, -64, 64, -64, -64, 64, 64, 64, 64, 64, -64, -64, 64, -64, -64, -64, 64, -64, -64, -64, -64, 64, 64, 64, 64, 64, 64, 64, 64, 64, 64, 64, 64, 64, 64, 64, 64, 64, -64, 64, 64, -64, 64, -64, 64, -64, 64, 64, -64, -64, 64, 64, 64, 64, 64, 64, 64, -64, 64, 64, 64, 64, 64, 64, 64, 64, -64, -64, -64, 64, -64, 64, 64, 64, -64, -64, -64, 64, 64, 64, -64, -64, -64, 64, 64, 64, 64, 64, 64, 64, 64, 64, -64, -64, -64, -64, -64, -64, 64, -64, 64, -64, -64, -64, -64, 64, 64, -64, 64, 64, 64, -64, 64, 64, 64, 64, 64, 64, 64, 64, -64, -64, -64, 64, 64, -64, -64, 64, -64, -64, -64, -64, -64, 64, 64, -64, -64, -64, 64, -64, -64, -64, -64, -64, -64, -64, -64, -64, -64, -64, -64, -64, -64, -64, 64, -64, 64, -64, -64, -64, -64, -64, -64, -64, 64, 64, -64, -64, -64, -64, -64, -64, -64, -64, -64, -64, -64, -64, -64, -64, -64, -64, 64, 64, 64, 64, -64, -64, -64, -64, 64, 64, 64, 64, -64, 64, -64, -64, -64, -64, -64, 64, -64, -64, -64, -64, -64, -64, 64, -64, 64, -64, 64, -64, -64, -64, -64, -64, 64, 64, 64, -64, -64, -64, -64, -64, -64, -64, -64, -64, -64, -64, -64, -64, -64, -64, -64, 64, 64, 64, 64, -64, -64, -64, -64, 64, -64, 64, -64, -64, -64, -64, -64, -64, -64, -64, -64, 64, -64, -64, -64, -64, -64, -64, -64, -64, -64, -64, 64, -64, -64, -64, -64, -64, 64, 64, -64, -64, -64, -64, -64, -64, -64, -64, 64, -64, -64, -64, -64, -64, -64, 64, -64, -64, -64, -64, -64, -64, -64, -64, -64, -64, 64, -64, -64, -64, -64, 64, -64, -64, -64, -64, -64, -64, -64, -64, 64, 64, -64, -64, -64, -64, -64, 64, 64, -64, -64, -64, -64, -64, -64, 64, -64, -64, -64, -64, -64, -64, -64, -64, -64, 64, 64, 64, 64, -64, -64, -64, 64, 64, 64, 64, 64, 64, 64, 64, -64, -64, 64, -64, -64, 64, -64, -64, -64, -64, 64, -64, -64, 64, 64, 64, -64, -64, -64, -64, 64, 64, 64, 64, -64, 64, 64, 64, -64, -64, -64, -64, -64, -64, -64, -64, -64, -64, -64, -64, -64, 64, 64, 64, -64, -64, -64, -64, -64, 64, 64, 64, 64, 64, 64, 64, 64, -64, -64, -64, 64, 64, -64, -64, 64, 64, 64, 64, 64, 64, -64, 64, 64, -64, -64, 64, 64, -64, -64, -64, 64, 64, 64, 64, 64, 64, 64, 64, 64, 64, 64, 64, 64, 64, 64, 64, 64, 64, -64, 64, 64, -64, -64, 64, 64, 64, 64, -64, -64, 64, 64, 64, 64, 64, 64, 64, 64, 64, 64, 64, -64, 64, 64, 64, 64, 64, 64, 64, 64, 64, 64, 64, 64, 64, -64, -64, 64, 64, -64, 64, 64, 64, 64, 64, 64, 64, 64, 64, -64, -64, 64, 64, 64, 64, 64, 64, 64, 64, 64, 64, 64, -64, 64, -64, 64, -64, -64, -64, -64, 64, 64, 64, -64, 64, 64, 64, 64, -64, -64, 64, 64, 64, 64, 64, -64, -64, 64, 64, -64, 64, -64, -64, 64, 64, -64, -64, -64, -64, -64, -64, 64, -64, 64, -64, -64, -64, -64, -64, -64, 64, 64, -64, -64, -64, 64, 64, -64, 64, 64, -64, 64, -64, 64, 64, -64, -64, -64, -64, -64, -64, -64, -64, -64, -64, -64, -64, -64, 64, 64, 64, 64, -64, 64, 64, 64, -64, 64, -64, -64, -64, 64, 64, 64, 64, -64, -64, -64, -64, -64, -64, -64, -64, -64, -64, -64, -64, 64, 64, 64, -64, 64, -64, 64, -64, -64, -64, -64, 64, 64, -64, -64, 64, 64, -64, -64, -64, -64, -64, -64, -64, 64, 64, -64, -64, -64, -64, 64, 64, -64, -64, 64, 64, -64, 64, 64, 64, 64, 64, -64, -64, 64, -64, 64, -64, -64, -64, 64, 64, -64, -64, 64, -64, -64, -64, 64, 64, -64, -64, -64, -64, 64, -64, 64, 64, 64, -64, 64, 64, -64, -64, -64, -64, 64, -64, -64, -64, -64, -64, -64, 64, -64, 64, -64, -64, 64, -64, -64, -64, 64, -64, 64, 64, -64, 64, -64, -64, -64, 64, -64, -64, 64, 64, -64, -64, -64, -64, -64, -64, 64, 64, 64, -64, -64, -64, -64, -64, -64, 64, -64, -64, 64, 64, -64, 64, -64, -64, -64, -64, -64, -64, -64, -64, -64, -64, -64, -64, 64, 64, -64, -64, 64, 64, 64, 64, -64, -64, -64, -64, 64, -64, -64, -64, -64, -64, -64, -64, 64, -64, -64, -64, -64, -64, -64, -64, -64, -64, 64, -64, -64, 64, 64, 64, -64, -64, -64, -64, 64, -64, 64, -64, -64, -64, -64, -64, -64, -64, -64, -64, -64, -64, 64, 64, 64, 64, 64, 64, 64, 64, 64, -64, -64, 64, 64, -64, 64, 64, 64, 64, 64, 64, 64, -64, -64, -64, -64, -64, -64, -64, 64, 64, 64, 64, 64, 64, 64, -64, -64, -64, -64, -64, -64, -64, 64, -64, 64, -64, 64, 64, -64, 64, 64, 64, 64, 64, 64, 64, 64, 64, 64, 64, 64, 64, 64, -64, 64, -64, -64, 64, 64, 64, 64, -64, 64, 64, 64, 64, 64, 64, 64, 64, 64, 64, 64, 64, 64, 64, 64, 64, 64, 64, 64, 64, 64, -64, 64, 64, -64, 64, 64, -64, 64, 64, 64, 64, 64, 64, 64, -64, -64, 64, -64, 64, 64, 64, 64, 64, 64, 64, 64, 64, 64, 64, 64, -64, 64, -64, -64, 64, 64, 64, 64, -64, 64, -64, -64, -64, -64, -64, 64, 64, 64, 64, 64, 64, 64, 64, 64, 64, 64, -64, 64, -64, 64, -64, -64, -64, -64, -64, -64, -64, -64, -64, -64, -64, 64, 64, 64, 64, 64, 64, 64, -64, -64, 64, 64, 64, -64, -64, 64, -64, -64, 64, 64, 64, -64, -64, -64, 64, 64, -64, 64, -64, 64, 64, 64, 64, 64, 64, 64, -64, -64, 64, 64, 64, -64, -64, -64, -64, 64, 64, 64, 64, 64, -64, -64, -64, -64, -64, 64, 64, -64, 64, 64, 64, -64, -64, -64, -64, -64, -64, -64, -64, -64, -64, -64, -64, -64, 64, 64, 64, 64, 64, -64, -64, 64, 64, 64, 64, 64, -64, 64, -64, -64, -64, -64, -64, -64, -64, -64, -64, 64, -64, -64, -64, -64, -64, 64, 64, -64, -64, -64, -64, 64, 64, 64, 64, 64, 64, -64, 64, 64, -64, 64, -64, -64, -64, -64, -64, 64, -64, -64, 64, -64, -64, 64, -64, -64, -64, -64, -64, 64, 64, 64, 64, 64, 64, 64, 64, -64, 64, -64, 64, -64, -64, -64, -64, -64, 64, -64, -64, 64, -64, -64, 64, -64, -64, -64, -64, 64, 64, 64, 64, -64, 64, 64, 64, 64, -64, -64, 64, -64, -64, -64, -64, -64, 64, -64, -64, 64, 64, 64, -64, -64, -64, -64, -64, -64, 64, 64, 64, 64, -64, 64, 64, 64, -64, -64, 64, 64, -64, -64, -64, -64, -64, 64, -64, 64, 64, 64, 64, -64, -64, -64, -64, -64, -64, 64, 64, 64, 64, 64, 64, 64, -64, -64, -64, -64, -64, -64, -64, 64, 64, -64, 64, 64, 64, 64, 64, 64, 64, 64, -64, -64, 64, 64, 64, 64, -64, 64, 64, 64, -64, -64, -64, 64, 64, 64, 64, 64, -64, -64, 64, 64, 64, 64, 64, 64, 64, 64, 64, 64, 64, 64, 64, -64, 64, 64, 64, -64, -64, 64, 64, 64, 64, -64, -64, -64, 64, -64, 64, -64, 64, -64, 64, 64, 64, 64, 64, 64, 64, 64, -64, -64, -64, -64, 64, -64, -64, 64, 64, 64, 64, 64, 64, 64, 64, -64, 64, -64, 64, 64, 64, 64, 64, 64, 64, 64, 64, 64, -64, -64, 64, -64, -64, -64, -64, 64, 64, 64, 64, 64, -64, -64, 64, 64, -64, 64, 64, 64, -64, 64, 64, 64, 64, 64, 64, 64, -64, -64, 64, 64, -64, 64, 64, 64, 64, 64, 64, -64, -64, 64, -64, 64, -64, 64, -64, 64, 64, -64, 64, 64, 64, 64, 64, 64, -64, 64, 64, 64, 64, -64, 64, 64, 64, 64, 64, -64, -64, -64, -64, -64, -64, -64, -64, -64, 64, 64, -64, 64, -64, 64, 64, 64, -64, -64, 64, 64, 64, -64, -64, 64, -64, 64, 64, -64, -64, -64, 64, -64, -64, -64, -64, -64, -64, 64, 64, -64, -64, -64, -64, -64, -64, -64, -64, -64, -64, -64, -64, -64, 64, 64, 64, -64, -64, 64, 64, 64, 64, 64, 64, -64, -64, 64, 64, 64, 64, -64, -64, -64, -64, -64, -64, 64, 64, -64, -64, -64, -64, 64, 64, -64, -64, -64, -64, 64, 64, 64, 64, 64, -64, 64, 64, -64, -64, 64, 64, -64, 64, 64, -64, 64, -64, -64, -64, -64, 64, -64, 64, -64, 64, -64, 64, 64, 64, -64, -64, 64, -64, -64, -64, -64, 64, 64, -64, -64, 64, 64, 64, 64, -64, -64, -64, 64, -64, 64, -64, -64, -64, 64, 64, 64, -64, -64, -64, -64, -64, 64, 64, -64, 64, 64, 64, 64, 64, -64, 64, -64, -64, 64, -64, 64, 64, -64, 64, -64, -64, -64, -64, 64, -64, -64, -64, -64, 64, 64, 64, 64, -64, 64, -64, -64, -64, -64, -64, -64, 64, 64, 64, 64, 64, 64, 64, 64, 64, -64, -64, -64, -64, 64, -64, 64, 64, -64, 64, -64, -64, 64, 64, -64, -64, -64, -64, -64, 64, 64, 64, -64, 64, 64, 64, -64, 64, 64, -64, 64, 64, -64, 64, 64, -64, 64, 64, -64, -64, 64, 64, -64, -64, -64, -64, -64, 64, -64, -64, 64, 64, -64, -64, -64, -64, 64, -64, 64, 64, 64, -64, -64, 64, 64, 64, 64, -64, -64, 64, 64, -64, 64, -64, -64, 64, 64, -64, -64, -64, -64, -64, -64, -64, -64, -64, -64, -64, 64, -64, -64, 64, 64, -64, -64, -64, 64, -64, -64, -64, -64, 64, -64, 64, -64, -64, -64, -64, 64, 64, -64, 64, 64, 64, 64, 64, 64, -64, -64, -64, 64, 64, -64, -64, 64, 64, 64, -64, -64, 64, -64, 64, 64, -64, -64, -64, -64, -64, -64, 64, -64, -64, 64, -64, 64, 64, 64, -64, -64, -64, -64, 64, 64, -64, -64, -64, -64, 64, 64, 64, -64, -64, -64, -64, -64, -64, -64, -64, -64, -64, 64, -64, 64, 64, -64, 64, -64, -64, -64, -64, -64, -64, -64, -64, -64, 64, 64, 64, -64, -64, -64, -64, -64, -64, -64, 64, -64, 64, -64, 64, -64, 64, -64, -64, -64, -64, -64, 64, -64, -64, -64, -64, 64, 64, -64, -64, -64, -64, -64, -64, -64, 64, 64, -64, 64, -64, -64, -64, 64, -64, -64, 64, 64, -64, -64, 64, 64, 64, 64, -64, 64, 64, -64, -64, -64, -64, -64, -64, -64, -64, -64, -64, 64, -64, -64, -64, -64, 64, -64, -64, -64, -64, -64, -64, 64, 64, 64, -64, 64, 64, 64, 64, -64, -64, -64, 64, 64, 64, -64, 64, 64, 64, 64, -64, 64, 64, -64, -64, -64, -64, -64, 64, -64, 64, -64, 64, 64, 64, 64, 64, -64, -64, -64, 64, -64, 64, -64, -64, -64, -64, -64, 64, -64, -64, 64, 64, -64, 64, -64, -64, 64, -64, -64, -64, -64, 64, 64, 64, 64, 64, -64, -64, -64, 64, 64, -64, -64, -64, -64, 64, -64, 64, 64, -64, -64, -64, -64, -64, -64, -64, -64, -64, 64, -64, 64, 64, -64, -64, -64, 64, 64, 64, -64, -64, 64, -64, 64, 64, 64, -64, -64, -64, -64, -64, -64, -64, -64, -64, 64, -64, -64, 64, 64, -64, -64, -64, 64, -64, -64, -64, -64, -64, -64, -64, 64, -64, -64, 64, -64, -64, -64, -64, -64, -64, -64, -64, 64, 64, 64, -64, -64, -64, -64, -64, -64, 64, -64, -64, 64, 64, 64, -64, 64, -64, -64, -64, 64, -64, -64, -64, -64, -64, -64, -64, 64, -64, 64, -64, 64, -64, -64, -64, -64, -64, 64, 64, 64, 64, 64, 64, 64, -64, 64, 64, -64, -64, -64, -64, -64, -64, -64, -64, 64, 64, 64, 64, -64, -64, -64, -64, -64, -64, -64, 64, 64, 64, -64, 64, 64, 64, -64, -64, -64, -64, -64, -64, -64, -64, -64, -64, 64, 64, 64, -64, -64, -64, -64, -64, -64, -64, -64, 64, -64, -64, -64, -64, 64, -64, -64, -64, -64, -64, -64, -64, -64, -64, -64, 64, 64, 64, -64, -64, -64, -64, -64, -64, -64, -64, 64, -64, -64, -64, -64, 64, -64, 64, -64, 64, -64, 64, -64, -64, -64, 64, 64, -64, -64, -64, 64, -64, 64, -64, -64, -64, -64, -64, 64, -64, 64, -64, 64, -64, -64, 64, -64, -64, -64, -64, -64, -64, -64, 64, 64, 64, 64, -64, 64, -64, -64, -64, -64, -64, -64, -64, -64, -64, 64, -64, -64, 64, -64, -64, 64, -64, -64, -64, -64, -64, -64, -64, 64, 64, -64, -64, 64, -64, -64, 64, -64, -64, -64, -64, -64, -64, 64, 64, -64, -64, -64, -64, 64, 64, -64, -64, 64, 64, -64, -64, 64, -64, -64, -64, -64, 64, 64, 64, -64, -64, -64, 64, -64, 64, -64, 64, -64, 64, -64, -64, -64, -64, 64, -64, -64, 64, 64, 64, -64, 64, -64, -64, 64, 64, 64, 64, 64, 64, 64, -64, -64, -64, -64, 64, 64, 64, -64, -64, 64, 64, 64, 64, -64, -64, -64, 64, 64, -64, -64, -64, -64, -64, 64, -64, 64, -64, 64, -64, 64, 64, 64, 64, -64, 64, -64, 64, 64, -64, -64, -64, -64, 64, -64, 64, 64, 64, 64, -64, 64, -64, -64, -64, 64, 64, 64, 64, 64, 64, 64, -64, 64, -64, -64, -64, -64, 64, 64, -64, -64, 64, 64, 64, -64, -64, -64, -64, -64, -64, 64, -64, -64, 64, 64, 64, -64, -64, -64, 64, -64, -64, -64, 64, 64, 64, 64, 64, -64, -64, -64, -64, -64, -64, 64, 64, 64, 64, 64, 64, -64, -64, 64, -64, -64, -64, -64, 64, 64, -64, -64, 64, 64, -64, 64, 64, -64, -64, 64, 64, -64, 64, 64, 64, 64, 64, 64, 64, -64, -64, 64, 64, -64, 64, -64, -64, 64, -64, 64, -64, -64, -64, -64, 64, 64, 64, 64, 64, 64, 64, -64, 64, 64, 64, 64, -64, -64, 64, 64, 64, -64, -64, -64, -64, -64, -64, -64, -64, 64, 64, 64, 64, 64, 64, 64, 64, -64, 64, 64, 64, 64, 64, 64, -64, -64, 64, -64, -64, -64, 64, 64, -64, 64, -64, 64, -64, 64, 64, -64, 64, 64, 64, 64, 64, -64, 64, 64, 64, 64, 64, 64, -64, 64, 64, -64, -64, 64, 64, 64, -64, -64, 64, -64, 64, -64, 64, 64, 64, 64, 64, 64, 64, 64, 64, 64, 64, -64, 64, 64, -64, 64, -64, -64, -64, -64, -64, 64, 64, 64, -64, -64, 64, 64, 64, 64, 64, 64, 64, -64, 64, 64, 64, 64, 64, 64, 64, 64, 64, 64, 64, -64, -64, -64, 64, -64, 64, -64, 64, 64, -64, 64, 64, 64, 64, 64, 64, -64, 64, 64, 64, 64, 64, 64, 64, 64, 64, -64, 64, -64, -64, 64, 64, 64, -64, -64, 64, 64, 64, 64, -64, 64, 64, -64, 64, -64, 64, 64, 64, 64, -64, 64, 64, -64, -64, 64, 64, 64, 64, 64, 64, -64, -64, 64, 64, -64, 64, 64, -64, -64, -64, 64, 64, 64, -64, 64, 64, -64, -64, -64, 64, -64, 64, 64, -64, -64, -64, -64, -64, 64, -64, -64, 64, -64, 64, -64, -64, -64, -64, -64, 64, -64, 64, 64, 64, -64, -64, -64, 64, 64, 64, 64, -64, -64, -64, 64, 64, 64, -64, 64, 64, -64, -64, -64, -64, 64, 64, 64, 64, 64, 64, 64, 64, -64, 64, 64, 64, 64, 64, 64, 64, 64, 64, 64, 64, 64, 64, 64, -64, -64, -64, -64, -64, 64, 64, 64, 64, -64, 64, 64, -64, -64, 64, 64, 64, -64, 64, 64, -64, 64, 64, 64, 64, 64, 64, 64, 64, 64, -64, 64, 64, 64, 64, 64, -64, -64, -64, -64, -64, -64, -64, 64, 64, 64, 64, -64, 64, 64, 64, 64, 64, -64, -64, 64, -64, 64, 64, 64, 64, 64, 64, -64, -64, 64, -64, -64, -64, -64, 64, 64, 64, 64, 64, 64, 64, 64, 64, 64, 64, -64, -64, -64, 64, -64, 64, 64, 64, 64, -64, 64, -64, -64, -64, -64, -64, 64, 64, 64, 64, 64, -64, 64, -64, 64, 64, 64, -64, -64, -64, -64, 64, 64, 64, 64, 64, 64, 64, 64, -64, -64, -64, -64, -64, 64, 64, 64, 64, 64, -64, 64, 64, 64, -64, 64, -64, 64, -64, 64, -64, 64, -64, 64, -64, -64, 64, -64, -64, -64, -64, -64, 64, 64, 64, 64, 64, 64, 64, 64, 64, 64, 64, 64, -64, 64, -64, -64, -64, 64, 64, 64, 64, -64, 64, -64, -64, -64, -64, -64, -64, 64, 64, 64, 64, -64, 64, 64, 64, -64, 64, 64, 64, -64, -64, -64, -64, -64, 64, 64, -64, -64, 64, 64, -64, -64, -64, -64, -64, 64, 64, 64, 64, 64, 64, 64, 64, -64, 64, 64, 64, -64, 64, -64, 64, -64, -64, -64, 64, 64, 64, 64, -64, -64, -64, -64, 64, 64, -64, -64, -64, 64, 64, 64, 64, 64, 64, -64, -64, -64, -64, 64, 64, -64, -64, 64, -64, 64, 64, -64, 64, -64, -64, 64, 64, -64, -64, 64, -64, 64, 64, 64, -64, -64, 64, 64, -64, -64, 64, -64, 64, 64, 64, -64, 64, -64, 64, -64, -64, -64, -64, 64, 64, 64, -64, -64, 64, 64, 64, -64, 64, -64, 64, -64, -64, -64, -64, -64, 64, -64, 64, -64, 64, -64, 64, -64, -64, 64, 64, 64, 64, 64, 64, 64, -64, 64, 64, 64, -64, -64, -64, -64, -64, -64, -64, 64, 64, 64, 64, 64, 64, 64, 64, -64, -64, -64, 64, 64, -64, 64, -64, 64, 64, -64, -64, -64, 64, 64, -64, -64, 64, 64, 64, -64, 64, -64, 64, 64, -64, 64, -64, 64, -64, -64, 64, -64, -64, 64, -64, -64, 64, 64, -64, 64, 64, -64, -64, -64, -64, -64, -64, -64, 64, 64, -64, -64, 64, 64, -64, -64, 64, 64, 64, -64, 64, -64, -64, -64, -64, 64, -64, -64, 64, 64, -64, -64, 64, 64, 64, 64, 64, -64, 64, 64, -64, -64, -64, 64, 64, -64, 64, -64, -64, -64, -64, 64, -64, -64, 64, -64, 64, -64, -64, -64, -64, 64, -64, -64, 64, -64, 64, 64, 64, -64, -64, 64, 64, -64, -64, -64, 64, 64, 64, 64, 64, 64, -64, -64, 64, -64, -64, -64, -64, -64, 64, -64, 64, -64, -64, -64, 64, 64, 64, -64, -64, 64, -64, -64, 64, 64, -64, -64, -64, 64, -64, 64, 64, -64, -64, 64, -64, 64, -64, 64, -64, 64, -64, 64, 64, -64, 64, -64, -64, 64, -64, -64, 64, -64, 64, -64, 64, 64, 64, 64, 64, -64, -64, -64, 64, -64, -64, 64, 64, 64, -64, 64, 64, 64, -64, -64, 64, 64, -64, 64, -64, 64, -64, 64, 64, 64, 64, -64, -64, 64, 64, 64, -64, 64, -64, 64, 64, -64, -64, 64, 64, 64, 64, 64, 64, 64, 64, 64, 64, 64, 64, 64, -64, 64, 64, 64, -64, 64, -64, 64, -64, -64, 64, -64, -64, -64, 64, 64, -64, 64, 64, 64, 64, 64, 64, 64, 64, 64, 64, 64, -64, -64, -64, 64, 64, 64, 64, 64, -64, -64, -64, 64, 64, 64, -64, 64, 64, -64, 64, 64, 64, 64, -64, 64, 64, 64, 64, -64, 64, 64, 64, 64, 64, 64, 64, -64, 64, -64, -64, 64, 64, 64, -64, -64, -64, -64, 64, 64, 64, 64, 64, 64, -64, 64, 64, 64, 64, -64, 64, 64, 64, 64, 64, 64, -64, -64, -64, -64, -64, -64, -64, 64, -64, 64, -64, 64, 64, 64, 64, 64, 64, 64, 64, -64, 64, -64, 64, -64, 64, 64, 64, 64, -64, -64, -64, -64, 64, -64, -64, -64, 64, -64, -64, -64, 64, 64, -64, 64, 64, 64, 64, 64, -64, 64, 64, -64, 64, -64, 64, -64, -64, 64, -64, 64, -64, 64, -64, 64, -64, 64, -64, 64, 64, 64, 64, -64, -64, 64, 64, -64, 64, -64, 64, -64, -64, 64, 64, -64, 64, 64, -64, -64, -64, 64, -64, -64, 64, 64, 64, 64, 64, 64, 64, 64, 64, -64, 64, -64, 64, 64, 64, 64, -64, 64, 64, 64, 64, -64, 64, -64, -64, 64, -64, 64, -64, -64, 64, 64, 64, -64, 64, 64, -64, 64, -64, -64, -64, 64, 64, 64, 64, 64, 64, 64, 64, 64, 64, -64, 64, -64, 64, -64, 64, 64, -64, 64, 64, 64, -64, -64, -64, -64, 64, -64, 64, 64, 64, 64, 64, 64, 64, -64, 64, 64, -64, 64, 64, -64, 64, 64, -64, 64, 64, -64, 64, 64, 64, 64, 64, 64, -64, -64, 64, -64, -64, 64, 64, 64, 64, -64, 64, 64, -64, 64, 64, -64, 64, 64, -64, 64, -64, -64, -64, -64, -64, -64, 64, -64, 64, -64, 64, 64, 64, 64, 64, -64, 64, -64, 64, -64, 64, 64, -64, 64, 64, -64, -64, 64, -64, -64, -64, -64, -64, 64, 64, -64, -64, 64, -64, 64, -64, 64, 64, -64, -64, -64, -64, 64, -64, 64, -64, -64, -64, 64, 64, 64, 64, 64, -64, 64, -64, 64, -64, 64, -64, 64, 64, -64, 64, 64, 64, -64, -64, -64, -64, -64, -64, 64, -64, 64, 64, -64, -64, 64, -64, -64, 64, 64, 64, -64, 64, 64, 64, 64, 64, 64, 64, 64, -64, -64, 64, 64, -64, -64, -64, -64, -64, 64, -64, 64, 64, -64, 64, 64, 64, 64, 64, -64, 64, 64, 64, 64, -64, 64, 64, 64, 64, -64, 64, -64, -64, 64, -64, -64, -64, 64, 64, -64, 64, 64, 64, 64, 64, -64, 64, -64, 64, 64, 64, 64, 64, 64, -64, 64, -64, -64, 64, 64, -64, -64, 64, 64, 64, -64, -64, 64, 64, 64, 64, 64, 64, 64, 64, 64, 64, -64, 64, 64, 64, -64, -64, 64, -64, -64, -64, 64, 64, -64, 64, 64, -64, 64, -64, 64, 64, 64, -64, -64, 64, 64, 64, 64, 64, 64, 64, 64, -64, -64, 64, 64, -64, -64, 64, -64, -64, 64, 64, -64, 64, -64, -64, -64, 64, 64, -64, -64, -64, 64, 64, 64, 64, 64, -64, -64, 64, -64, 64, 64, -64, -64, 64, -64, -64, -64, 64, 64, -64, 64, 64, 64, -64, 64, -64, -64, -64, -64, 64, 64, -64, -64, -64, -64, 64, 64, 64, 64, 64, -64, -64, -64, 64, 64, 64, 64, 64, 64, -64, 64, 64, -64, 64, -64, 64, -64, -64, 64, -64, 64, 64, -64, -64, 64, 64, 64, 64, 64, 64, 64, -64, 64, 64, -64, 64, 64, 64, 64, -64, 64, -64, -64, 64, -64, -64, -64, 64, -64, 64, 64, -64, 64, -64, 64, -64, 64, 64, -64, 64, 64, -64, -64, -64, 64, 64, -64, 64, -64, 64, 64, 64, -64, 64, -64, -64, 64, 64, -64, -64, -64, 64, -64, 64, -64, 64, 64, -64, 64, 64, 64, -64, 64, -64, -64, -64, -64, -64, 64, 64, -64, -64, -64, -64, 64, 64, 64, 64, 64, -64, 64, 64, -64, -64, 64, -64, -64, -64, 64, -64, -64, -64, 64, 64, 64, -64, 64, 64, 64, -64, -64, 64, 64, 64, -64, -64, 64, 64, -64, -64, -64, -64, -64, -64, 64, 64, 64, -64, 64, -64, 64, 64, 64, -64, 64, 64, 64, 64, 64, 64, 64, 64, 64, 64, -64, 64, -64, -64, -64, -64, -64, -64, 64, -64, 64, -64, -64, -64, -64, -64, -64, -64, 64, 64, -64, 64, 64, 64, 64, 64, 64, 64, 64, -64, -64, -64, -64, -64, 64, -64, 64, 64, -64, 64, 64, 64, -64, 64, 64, 64, 64, 64, -64, -64, -64, -64, 64, 64, 64, 64, 64, 64, -64, -64, -64, -64, 64, -64, 64, -64, -64, 64, -64, -64, 64, 64, 64, -64, -64, 64, -64, -64, -64, 64, 64, 64, 64, 64, 64, 64, -64, -64, -64, -64, 64, -64, 64, 64, -64, -64, 64, 64, -64, -64, -64, -64, 64, -64, -64, -64, -64, -64, 64, 64, 64, 64, -64, 64, 64, 64, -64, -64, -64, -64, -64, -64, -64, -64, 64, 64, -64, -64, -64, -64, -64, -64, -64, -64, 64, 64, 64, 64, 64, 64, 64, 64, 64, -64, -64, -64, -64, -64, -64, -64, -64, -64, -64, -64, -64, 64, -64, -64, -64, -64, -64, -64, 64, 64, 64, 64, 64, 64, 64, 64, -64, -64, -64, -64, -64, -64, -64, 64, -64, -64, 64, 64, 64, 64, -64, -64, -64, -64, 64, 64, -64, 64, 64, 64, 64, 64, -64, 64, 64, -64, -64, -64, -64, -64, -64, -64, -64, 64, -64, -64, 64, -64, -64, -64, -64, -64, 64, -64, 64, -64, 64, 64, 64, 64, 64, 64, 64, -64, -64, -64, -64, -64, -64, -64, 64, 64, 64, 64, -64, 64, -64, -64, -64, -64, 64, 64, 64, 64, 64, 64, 64, 64, 64, 64, 64, 64, -64, -64, -64, -64, -64, -64, 64, 64, -64, -64, -64, 64, -64, -64, -64, -64, -64, 64, 64, -64, 64, 64, 64, 64, 64, 64, -64, -64, -64, -64, -64, -64, -64, -64, 64, 64, -64, 64, -64, -64, -64, -64, -64, -64, -64, 64, -64, 64, 64, 64, 64, 64, 64, 64, 64, -64, -64, -64, -64, -64, -64, -64, -64, -64, -64, 64, 64, -64, -64, -64, -64, -64, 64, 64, 64, 64, 64, 64, 64, 64, 64, 64, -64, -64, -64, -64, 64, -64, -64, -64, 64, 64, 64, -64, 64, -64, -64, -64, -64, -64, 64, 64, 64, -64, 64, 64, 64, 64, 64, 64, -64, -64, -64, -64, 64, 64, -64, -64, 64, 64, 64, 64, 64, 64, -64, -64, -64, -64, 64, 64, 64, 64, 64, 64, 64, 64, 64, 64, -64, -64, -64, -64, 64, 64, -64, 64, -64, -64, 64, -64, -64, 64, 64, -64, -64, -64, 64, 64, -64, 64, 64, 64, 64, 64, 64, -64, -64, -64, -64, -64, 64, 64, 64, 64, 64, -64, -64, -64, -64, 64, 64, -64, -64, -64, -64, 64, 64, 64, 64, -64, 64, -64, 64, -64, -64, -64, -64, -64, 64, 64, 64, 64, -64, -64, 64, 64, -64, 64, -64, 64, -64, -64, -64, -64, -64, -64, -64, -64, -64, 64, 64, 64, 64, 64, -64, -64, -64, 64, 64, 64, 64, 64, -64, -64, 64, 64, 64, 64, 64, 64, 64, -64, 64, 64, 64, -64, 64, 64, 64, 64, -64, -64, -64, -64, 64, 64, 64, 64, 64, 64, 64, 64, 64, -64, 64, -64, 64, -64, 64, 64, -64, -64, 64, 64, 64, 64, 64, 64, -64, -64, -64, -64, 64, 64, 64, -64, 64, -64, 64, -64, 64, -64, 64, 64, -64, -64, -64, 64, 64, -64, 64, -64, 64, 64, 64, -64, -64, -64, -64, -64, 64, 64, 64, 64, -64, 64, 64, 64, -64, -64, 64, 64, -64, -64, -64, -64, 64, 64, 64, -64, -64, -64, 64, 64, 64, -64, -64, -64, -64, -64, -64, -64, -64, 64, 64, -64, 64, 64, 64, 64, 64, 64, 64, 64, 64, -64, 64, -64, 64, 64, 64, 64, 64, 64, 64, -64, 64, -64, -64, 64, -64, -64, -64, -64, 64, -64, -64, 64, 64, 64, 64, 64, -64, 64, 64, 64, -64, 64, 64, 64, 64, -64, 64, -64, 64, -64, 64, -64, 64, -64, 64, -64, 64, -64, 64, 64, -64, 64, -64, -64, 64, -64, 64, 64, 64, 64, 64, -64, -64, 64, 64, 64, -64, -64, 64, 64, -64, -64, 64, 64, -64, 64, 64, 64, 64, -64, -64, 64, 64, -64, 64, 64, -64, -64, -64, 64, 64, 64, -64, -64, -64, -64, 64, -64, 64, 64, 64, -64, 64, -64, -64, -64, 64, -64, -64, -64, 64, -64, 64, 64, -64, -64, 64, 64, 64, 64, 64, -64, 64, 64, 64, 64, 64, 64, -64, 64, 64, -64, -64, 64, -64, -64, 64, 64, 64, 64, -64, 64, 64, -64, 64, -64, 64, 64, -64, 64, 64, 64, 64, -64, 64, -64, -64, 64, 64, 64, -64, -64, -64, -64, 64, 64, 64, -64, 64, 64, 64, 64, 64, 64, -64, -64, 64, -64, -64, -64, 64, -64, -64, 64, -64, 64, -64, 64, -64, 64, -64, -64, 64, 64, -64, 64, 64, 64, -64, 64, -64, 64, -64, 64, -64, -64, -64, 64, 64, -64, 64, -64, 64, -64, 64, 64, -64, -64, 64, -64, 64, 64, 64, 64, 64, 64, 64, 64, 64, -64, 64, 64, -64, -64, 64, 64, 64, 64, -64, -64, 64, 64, 64, 64, 64, 64, -64, -64, -64, 64, -64, -64, 64, 64, 64, 64, 64, -64, 64, 64, 64, 64, 64, -64, 64, -64, 64, -64, -64, -64, 64, -64, 64, -64, 64, 64, -64, 64, 64, -64, 64, 64, -64, 64, 64, 64, -64, -64, -64, 64, 64, 64, 64, -64, 64, 64, 64, -64, 64, -64, 64, 64, 64, 64, -64, -64, 64, -64, 64, 64, 64, 64, 64, 64, -64, -64, 64, 64, 64, 64, -64, 64, -64, -64, -64, 64, 64, -64, 64, 64, 64, 64, -64, 64, -64, -64, 64, 64, 64, 64, -64, 64, -64, 64, -64, 64, -64, 64, 64, -64, -64, -64, 64, 64, -64, 64, -64, 64, 64, 64, 64, 64, 64, -64, 64, -64, -64, 64, 64, 64, 64, 64, 64, -64, 64, 64, -64, 64, 64, -64, 64, 64, 64, 64, 64, 64, 64, -64, 64, 64, -64, -64, 64, -64, 64, 64, -64, -64, 64, 64, -64, 64, -64, 64, -64, -64, -64, 64, -64, -64, 64, 64, 64, 64, -64, 64, 64, -64, -64, 64, 64, -64, 64, 64, 64, 64, -64, 64, 64, -64, 64, 64, -64, -64, -64, -64, 64, -64, -64, 64, -64, 64, 64, -64, -64, 64, 64, 64, -64, 64, 64, 64, 64, -64, 64, 64, 64, 64, -64, 64, -64, 64, 64, 64, 64, -64, 64, -64, 64, -64, 64, -64, 64, 64, 64, 64, 64, 64, -64, 64, 64, 64, -64, -64, 64, 64, 64, 64, -64, 64, -64, -64, -64, 64, -64, -64, 64, -64, 64, 64, -64, 64, -64, -64, -64, -64, 64, 64, 64, -64, -64, 64, 64, 64, 64, 64, 64, -64, 64, -64, 64, 64, -64, -64, 64, 64, -64, -64, 64, 64, -64, -64, 64, 64, 64, -64, 64, -64, 64, 64, 64, -64, -64, -64, 64, 64, -64, 64, -64, -64, 64, 64, -64, -64, 64, 64, 64, -64, 64, -64, -64, 64, 64, 64, -64, -64, 64, 64, 64, -64, 64, -64, 64, 64, 64, -64, 64, -64, -64, -64, 64, 64, 64, 64, 64, 64, 64, 64, 64, -64, 64, 64, 64, 64, 64, 64, 64, 64, 64, -64, -64, 64, 64, 64, -64, -64, 64, 64, -64, 64, 64, 64, 64, 64, 64, -64, 64, 64, 64, -64, 64, 64, 64, -64, -64, 64, -64, 64, 64, 64, -64, 64, -64, 64, 64, -64, 64, 64, 64, 64, 64, 64, -64, 64, 64, 64, 64, 64, -64, 64, 64, 64, 64, -64, 64, -64, 64, -64, -64, -64, 64, 64, 64, -64, -64, 64, 64, -64, 64, 64, 64, 64, 64, 64, 64, -64, 64, -64, -64, -64, -64, 64, -64, -64, -64, 64, -64, -64, 64, -64, -64, 64, 64, 64, 64, 64, 64, 64, -64, -64, 64, -64, -64, 64, 64, -64, -64, -64, 64, 64, 64, 64, -64, 64, -64, -64, 64, -64, -64, -64, 64, 64, 64, 64, 64, 64, 64, 64, 64, 64, -64, -64, -64, -64, -64, -64, 64, -64, 64, -64, -64, -64, -64, 64, -64, 64, -64, -64, -64, 64, -64, 64, 64, 64, -64, 64, 64, -64, 64, 64, 64, 64, -64, 64, 64, -64, 64, 64, 64, 64, 64, 64, -64, 64, -64, -64, -64, 64, 64, 64, -64, -64, 64, 64, 64, 64, 64, 64, 64, 64, 64, -64, 64, 64, 64, -64, 64, 64, -64, 64, -64, 64, 64, 64, 64, 64, -64, -64, -64, -64, 64, -64, -64, -64, 64, -64, 64, -64, -64, -64, 64, 64, 64, -64, -64, -64, -64, 64, -64, -64, -64, -64, 64, 64, -64, 64, 64, 64, 64, 64, -64, 64, 64, -64, 64, -64, -64, 64, 64, -64, -64, 64, -64, -64, 64, -64, 64, -64, -64, 64, -64, 64, 64, 64, 64, -64, 64, 64, 64, 64, 64, 64, 64, 64, 64, 64, -64, 64, 64, -64, -64, -64, 64, 64, -64, -64, 64, -64, -64, 64, 64, -64, -64, 64, 64, 64, 64, -64, -64, -64, 64, -64, 64, -64, 64, 64, -64, 64, 64, -64, 64, 64, 64, 64, 64, 64, 64, -64, -64, -64, 64, 64, -64, -64, -64, 64, 64, 64, 64, 64, 64, 64, 64, 64, 64, -64, -64, 64, 64, -64, -64, 64, -64, -64, 64, -64, -64, -64, -64, -64, 64, -64, -64, 64, 64, 64, 64, 64, 64, 64, 64, 64, 64, 64, 64, -64, 64, 64, -64, -64, 64, -64, -64, -64, -64, 64, -64, 64, 64, 64, 64, 64, 64, 64, 64, 64, 64, 64, 64, 64, 64, 64, 64, 64, 64, 64, -64, 64, 64, -64, -64, -64, 64, 64, -64, 64, 64, -64, -64, -64, -64, 64, 64, 64, 64, 64, 64, 64, 64, 64, -64, 64, -64, 64, -64, 64, -64, -64, -64, 64, 64, 64, -64, 64, -64, -64, -64, -64, -64, -64, 64, 64, 64, 64, 64, 64, 64, 64, 64, -64, -64, -64, -64, 64, 64, -64, -64, -64, 64, 64, 64, -64, -64, 64, -64, -64, -64, -64, 64, 64, 64, 64, -64, 64, 64, 64, 64, 64, 64, -64, -64, 64, 64, 64, -64, 64, 64, -64, 64, 64, -64, 64, -64, 64, -64, 64, 64, 64, 64, 64, 64, 64, 64, 64, 64, 64, 64, -64, -64, 64, -64, -64, 64, 64, -64, -64, -64, -64, -64, 64, 64, 64, -64, -64, -64, -64, 64, -64, 64, 64, 64, 64, 64, 64, -64, -64, -64, -64, 64, -64, -64, 64, -64, -64, -64, -64, 64, 64, 64, -64, 64, -64, -64, -64, -64, 64, -64, 64, 64, 64, -64, -64, -64, 64, 64, -64, -64, 64, -64, -64, -64, -64, -64, -64, 64, 64, 64, 64, 64, -64, 64, -64, -64, -64, 64, 64, 64, 64, 64, -64, 64, -64, -64, 64, -64, -64, -64, 64, -64, -64, -64, -64, -64, 64, 64, 64, 64, 64, 64, -64, -64, 64, 64, 64, 64, -64, -64, -64, -64, -64, 64, 64, 64, 64, 64, 64, -64, 64, 64, 64, 64, 64, 64, 64, 64, 64, -64, -64, -64, 64, 64, 64, 64, 64, 64, -64, -64, 64, -64, 64, 64, 64, 64, 64, 64, 64, -64, -64, 64, 64, 64, 64, 64, 64, 64, -64, -64, 64, 64, -64, 64, 64, 64, -64, -64, -64, -64, -64, 64, -64, 64, 64, -64, -64, 64, -64, 64, 64, -64, -64, 64, 64, 64, -64, -64, -64, -64, 64, 64, 64, 64, -64, 64, -64, 64, 64, -64, -64, 64, 64, 64, 64, 64, -64, 64, 64, -64, 64, 64, 64, 64, -64, -64, 64, 64, 64, 64, 64, 64, 64, -64, -64, 64, -64, -64, -64, 64, 64, 64, -64, -64, 64, 64, 64, 64, 64, 64, 64, 64, -64, -64, 64, 64, 64, 64, 64, 64, -64, -64, -64, -64, 64, -64, 64, 64, 64, 64, 64, 64, 64, 64, 64, 64, 64, 64, 64, 64, -64, 64, -64, -64, 64, 64, 64, -64, -64, -64, -64, 64, -64, 64, 64, 64, 64, 64, 64, 64, 64, -64, 64, 64, 64, -64, 64, -64, -64, -64, 64, -64, -64, 64, 64, -64, 64, 64, 64, 64, 64, 64, 64, -64, -64, 64, 64, 64, 64, 64, 64, 64, 64, 64, 64, -64, 64, 64, -64, -64, 64, 64, -64, -64, 64, 64, 64, -64, 64, 64, -64, 64, 64, 64, 64, 64, 64, 64, 64, 64, 64, -64, -64, -64, 64, 64, 64, -64, 64, 64, 64, 64, -64, 64, 64, 64, -64, -64, -64, 64, -64, 64, 64, 64, 64, 64, 64, -64, 64, -64, 64, 64, -64, 64, 64, -64, -64, 64, 64, 64, 64, -64, 64, 64, 64, 64, 64, -64, 64, 64, 64, 64, 64, 64, 64, 64, 64, -64, -64, -64, -64, 64, -64, -64, -64, -64, 64, -64, -64, -64, -64, 64, -64, 64, -64, -64, -64, -64, -64, -64, -64, 64, 64, 64, 64, -64, -64, -64, -64, -64, -64, -64, -64, 64, 64, 64, -64, -64, 64, 64, 64, -64, -64, -64, 64, -64, -64, 64, -64, 64, 64, 64, 64, 64, -64, -64, -64, -64, -64, -64, -64, -64, -64, -64, -64, 64, -64, 64, 64, 64, -64, -64, -64, 64, 64, -64, 64, 64, -64, 64, -64, 64, -64, -64, -64, -64, 64, -64, -64, -64, 64, -64, 64, -64, 64, 64, -64, -64, 64, -64, 64, 64, 64, -64, 64, 64, -64, 64, -64, -64, 64, -64, -64, -64, 64, 64, -64, 64, -64, -64, -64, 64, 64, -64, -64, 64, 64, -64, -64, 64, 64, -64, -64, 64, 64, -64, -64, 64, 64, 64, 64, -64, 64, -64, -64, 64, 64, -64, 64, 64, 64, 64, 64, 64, 64, -64, 64, -64, 64, -64, -64, 64, 64, -64, -64, -64, -64, -64, 64, 64, -64, -64, -64, -64, -64, -64, -64, 64, 64, 64, 64, -64, -64, -64, -64, 64, -64, 64, 64, 64, 64, -64, -64, -64, -64, 64, 64, 64, -64, 64, -64, -64, 64, -64, -64, -64, -64, -64, -64, 64, -64, -64, 64, -64, -64, -64, 64, -64, 64, -64, -64, -64, -64, -64, 64, 64, 64, -64, -64, -64, -64, 64, 64, -64, 64, -64, -64, -64, -64, 64, -64, -64, 64, -64, 64, 64, 64, 64, 64, 64, 64, -64, -64, 64, -64, 64, 64, -64, -64, 64, 64, -64, -64, 64, 64, 64, -64, -64, -64, 64, -64, -64, -64, -64, 64, 64, 64, 64, 64, 64, 64, 64, 64, -64, 64, -64, -64, 64, -64, 64, 64, 64, 64, -64, -64, 64, -64, -64, -64, 64, -64, -64, 64, 64, 64, 64, 64, 64, 64, 64, -64, -64, -64, -64, -64, -64, -64, -64, -64, 64, -64, -64, 64, 64, -64, -64, 64, 64, -64, -64, 64, 64, 64, 64, 64, 64, 64, 64, -64, -64, -64, -64, -64, -64, -64, 64, 64, -64, 64, -64, 64, 64, 64, 64, -64, -64, 64, -64, -64, -64, -64, -64, 64, 64, -64, 64, 64, -64, -64, -64, -64, -64, -64, 64, -64, -64, -64, -64, 64, 64, 64, -64, -64, -64, -64, -64, -64, -64, -64, 64, -64, -64, 64, -64, -64, -64, -64, -64, -64, -64, 64, 64, 64, 64, -64, 64, -64, 64, 64, -64, -64, -64, -64, -64, -64, -64, -64, -64, -64, 64, -64, -64, 64, -64, -64, -64, -64, -64, 64, 64, 64, 64, -64, -64, 64, 64, 64, 64, 64, -64, -64, -64, -64, -64, -64, 64, -64, -64, -64, 64, 64, 64, 64, -64, 64, 64, -64, 64, -64, -64, 64, -64, 64, 64, 64, -64, 64, -64, -64, -64, -64, -64, 64, 64, 64, -64, 64, -64, -64, 64, -64, 64, -64, -64, -64, -64, 64, -64, 64, 64, 64, -64, -64, 64, -64, -64, -64, -64, -64, -64, 64, 64, 64, 64, 64, 64, -64, -64, -64, -64, -64, -64, -64, 64, -64, 64, -64, 64, 64, -64, -64, -64, -64, -64, -64, -64, 64, 64, 64, 64, 64, -64, -64, -64, -64, -64, -64, -64, -64, -64, -64, 64, -64, -64, 64, -64, -64, 64, -64, -64, -64, -64, -64, 64, 64, 64, 64, 64, 64, -64, 64, -64, -64, -64, -64, 64, -64, -64, -64, 64, -64, -64, -64, -64, -64, -64, -64, -64, -64, -64, -64, -64, 64, 64, 64, 64, -64, -64, -64, -64, -64, 64, 64, 64, -64, -64, -64, 64, 64, 64, 64, -64, -64, -64, -64, -64, -64, -64, -64, -64, -64, -64, 64, -64, -64, -64, -64, -64, -64, 64, 64, 64, -64, -64, -64, 64, -64, -64, -64, 64, 64, 64, -64, -64, -64, -64, -64, -64, -64, 64, 64, 64, -64, -64, -64, -64, 64, 64, 64, 64, 64, -64, -64, 64, 64, -64, -64, -64, 64, 64, -64, -64, -64, -64, 64, 64, 64, 64, -64, -64, -64, -64, -64, 64, 64, 64, 64, 64, 64, 64, 64, 64, 64, -64, 64, 64, 64, 64, 64, 64, 64, -64, 64, -64, -64, 64, -64, 64, -64, 64, 64, 64, -64, 64, 64, -64, 64, 64, -64, -64, -64, -64, 64, 64, 64, 64, 64, 64, 64, 64, 64, -64, 64, 64, 64, -64, -64, 64, -64, 64, 64, -64, 64, -64, 64, 64, -64, 64, -64, -64, 64, 64, 64, 64, 64, 64, 64, -64, 64, -64, -64, 64, -64, 64, -64, 64, 64, 64, 64, 64, 64, 64, 64, 64, -64, 64, -64, 64, 64, 64, 64, 64, 64, 64, 64, 64, 64, 64, 64, 64, 64, 64, -64, -64, 64, 64, 64, 64, 64, -64, -64, 64, -64, 64, 64, -64, 64, -64, -64, -64, 64, 64, 64, 64, 64, 64, 64, 64, 64, -64, -64, 64, 64, 64, 64, 64, 64, 64, -64, 64, 64, 64, 64, -64, 64, -64, 64, -64, 64, 64, 64, 64, -64, -64, -64, 64, 64, 64, -64, -64, -64, 64, 64, 64, 64, -64, 64, -64, -64, 64, 64, -64, -64, -64, -64, -64, 64, -64, -64, -64, -64, -64, -64, -64, -64, -64, 64, -64, -64, -64, 64, -64, 64, 64, -64, 64, -64, 64, -64, -64, 64, 64, 64, -64, -64, 64, 64, -64, 64, -64, -64, 64, -64, -64, -64, -64, -64, 64, -64, 64, 64, 64, -64, 64, -64, 64, -64, 64, -64, -64, -64, -64, -64, 64, -64, -64, 64, 64, 64, -64, 64, 64, -64, -64, 64, -64, -64, 64, 64, 64, -64, 64, -64, 64, 64, -64, -64, 64, -64, 64, 64, -64, 64, -64, -64, -64, -64, -64, -64, -64, -64, -64, 64, -64, -64, -64, 64, -64, -64, -64, 64, 64, -64, -64, 64, 64, 64, 64, -64, 64, -64, -64, 64, -64, -64, -64, 64, -64, -64, -64, 64, 64, 64, -64, 64, -64, -64, -64, -64, 64, 64, -64, -64, -64, -64, 64, -64, 64, -64, -64, -64, 64, -64, -64, -64, 64, 64, 64, 64, 64, 64, -64, -64, -64, -64, -64, -64, 64, -64, -64, 64, -64, -64, -64, -64, 64, 64, -64, 64, -64, 64, -64, -64, 64, 64, 64, -64, -64, -64, -64, -64, 64, 64, -64, 64, 64, -64, 64, 64, -64, 64, -64, 64, 64, 64, 64, 64, 64, 64, 64, 64, 64, 64, 64, 64, 64, 64, 64, -64, 64, 64, -64, -64, -64, 64, 64, -64, -64, -64, -64, 64, -64, 64, 64, 64, 64, 64, 64, 64, 64, 64, 64, 64, 64, 64, 64, 64, 64, 64, 64, -64, -64, 64, 64, -64, 64, -64, -64, 64, 64, 64, 64, 64, 64, 64, 64, 64, 64, 64, 64, 64, 64, 64, 64, -64, 64, -64, 64, 64, -64, -64, 64, -64, 64, 64, -64, -64, 64, 64, 64, -64, -64, 64, 64, -64, 64, 64, 64, 64, 64, 64, -64, -64, -64, -64, -64, -64, -64, 64, -64, -64, 64, 64, -64, -64, -64, 64, 64, 64, 64, 64, -64, 64, 64, 64, 64, 64, 64, 64, 64, -64, -64, -64, -64, -64, -64, -64, -64, -64, 64, 64, -64, 64, -64, 64, 64, 64, 64, 64, -64, 64, 64, -64, 64, 64, 64, 64, 64, -64, -64, -64, -64, -64, -64, -64, -64, 64, 64, 64, 64, 64, -64, 64, 64, 64, 64, -64, 64, -64, 64, 64, -64, 64, 64, 64, 64, -64, 64, -64, -64, -64, -64, -64, -64, 64, 64, 64, 64, 64, 64, 64, 64, 64, 64, 64, -64, -64, -64, -64, -64, -64, 64, 64, 64, 64, -64, -64, -64, -64, 64, -64, 64, -64, -64, -64, 64, 64, 64, 64, 64, 64, 64, -64, 64, -64, -64, -64, -64, -64, 64, 64, 64, 64, 64, 64, 64, -64, -64, -64, -64, -64, -64, 64, 64, 64, -64, 64, 64, -64, -64, -64, -64, -64, -64, -64, -64, 64, 64, 64, 64, 64, 64, 64, -64, -64, -64, -64, 64, 64, -64, 64, 64, 64, 64, 64, 64, -64, -64, 64, -64, -64, -64, 64, -64, -64, 64, 64, 64, -64, 64, 64, -64, -64, -64, -64, -64, -64, -64, 64, 64, 64, -64, 64, 64, -64, -64, -64, -64, -64, -64, 64, 64, 64, 64, 64, -64, -64, 64, -64, -64, -64, -64, -64, -64, 64, -64, -64, 64, 64, -64, -64, -64, -64, -64, -64, -64, -64, 64, -64, -64, 64, 64, -64, 64, 64, -64, -64, -64, -64, 64, -64, -64, -64, -64, -64, 64, 64, -64, -64, -64, -64, -64, -64, -64, -64, 64, 64, 64, 64, -64, -64, -64, 64, -64, -64, -64, -64, -64, 64, -64, -64, 64, -64, 64, 64, 64, -64, -64, 64, 64, -64, -64, 64, 64, 64, 64, -64, 64, -64, 64, 64, 64, -64, 64, -64, -64, -64, 64, 64, 64, 64, 64, 64, 64, 64, 64, 64, 64, 64, 64, 64, 64, 64, 64, -64, -64, 64, 64, 64, -64, -64, -64, 64, -64, -64, 64, 64, 64, -64, 64, 64, 64, 64, 64, 64, 64, 64, 64, -64, 64, 64, 64, 64, -64, 64, 64, -64, 64, -64, 64, -64, -64, 64, -64, 64, 64, -64, 64, 64, -64, 64, 64, 64, 64, 64, 64, 64, 64, 64, 64, 64, 64, 64, 64, 64, -64, 64, -64, 64, 64, -64, -64, 64, -64, 64, 64, 64, 64, 64, 64, -64, 64, -64, 64, -64, 64, 64, 64, 64, 64, 64, 64, -64, 64, -64, -64, -64, -64, -64, -64, 64, -64, -64, 64, 64, 64, 64, 64, 64, 64, 64, 64, 64, 64, 64, 64, 64, 64, 64, 64, 64, 64, 64, -64, -64, -64, 64, -64, -64, -64, -64, -64, -64, 64, 64, 64, -64, -64, -64, 64, 64, 64, 64, 64, 64, 64, -64, 64, 64, 64, -64, 64, -64, -64, 64, 64, -64, -64, 64, 64, -64, 64, 64, -64, 64, -64, 64, -64, 64, 64, 64, -64, 64, 64, 64, -64, -64, 64, -64, -64, 64, 64, 64, -64, -64, 64, -64, -64, 64, 64, 64, 64, 64, -64, -64, -64, 64, -64, 64, 64, 64, -64, -64, 64, 64, -64, -64, -64, 64, 64, -64, 64, -64, -64, 64, 64, -64, 64, 64, -64, 64, 64, -64, 64, -64, 64, -64, 64, -64, -64, -64, 64, -64, 64, 64, -64, -64, -64, 64, -64, 64, -64, -64, 64, -64, 64, 64, 64, -64, -64, -64, -64, -64, -64, -64, 64, 64, 64, 64, 64, 64, 64, -64, -64, 64, -64, 64, -64, 64, 64, 64, -64, -64, 64, -64, -64, -64, -64, -64, -64, -64, -64, -64, -64, -64, -64, 64, 64, 64, 64, -64, 64, -64, 64, 64, 64, -64, 64, -64, 64, -64, -64, -64, -64, -64, -64, -64, -64, -64, -64, -64, -64, -64, -64, -64, -64, 64, -64, -64, -64, -64, 64, 64, -64, 64, 64, 64, -64, -64, -64, -64, -64, -64, -64, -64, -64, 64, 64, 64, -64, -64, 64, -64, 64, 64, 64, -64, -64, -64, -64, 64, -64, -64, -64, -64, 64, -64, -64, 64, 64, -64, -64, 64, 64, -64, -64, -64, -64, -64, -64, -64, -64, -64, -64, -64, -64, 64, 64, -64, 64, -64, 64, 64, 64, 64, -64, 64, -64, -64, 64, 64, 64, -64, -64, -64, -64, -64, -64, 64, -64, -64, -64, -64, 64, -64, 64, -64, -64, -64, -64, 64, 64, 64, 64, 64, 64, 64, -64, -64, 64, -64, -64, -64, -64, -64, -64, 64, 64, 64, 64, -64, 64, 64, 64, 64, -64, 64, 64, 64, 64, -64, -64, 64, 64, -64, -64, 64, -64, -64, -64, -64, -64, -64, -64, -64, 64, 64, 64, -64, -64, 64, 64, 64, -64, 64, 64, 64, 64, 64, -64, -64, 64, 64, -64, 64, -64, -64, -64, -64, -64, -64, -64, -64, 64, -64, -64, 64, 64, 64, -64, -64, 64, 64, 64, 64, -64, -64, -64, 64, 64, 64, 64, 64, -64, -64, 64, 64, 64, -64, 64, -64, -64, -64, -64, -64, -64, 64, 64, -64, 64, 64, 64, 64, -64, -64, -64, -64, 64, -64, 64, -64, -64, 64, 64, 64, 64, 64, 64, -64, -64, -64, -64, -64, -64, 64, 64, 64, 64, 64, 64, -64, -64, -64, -64, -64, 64, 64, 64, -64, -64, 64, 64, 64, 64, -64, 64, -64, -64, -64, 64, -64, -64, 64, 64, -64, -64, -64, -64, -64, 64, -64, -64, -64, -64, -64, -64, -64, 64, 64, 64, 64, -64, -64, -64, -64, -64, 64, 64, -64, 64, -64, -64, -64, 64, 64, 64, -64, 64, -64, -64, -64, 64, -64, -64, -64, -64, 64, -64, 64, -64, -64, -64, -64, -64, -64, -64, -64, 64, 64, 64, -64, -64, -64, 64, 64, 64, -64, -64, -64, -64, -64, -64, -64, -64, 64, 64, -64, -64, -64, -64, -64, -64, 64, 64, -64, 64, -64, -64, -64, 64, 64, -64, 64, -64, -64, -64, -64, 64, -64, -64, -64, -64, 64, 64, -64, 64, 64, -64, 64, 64, -64, -64, -64, -64, -64, -64, 64, -64, -64, -64, -64, -64, -64, -64, -64, 64, 64, -64, -64, 64, 64, -64, -64, 64, 64, -64, 64, -64, -64, -64, -64, -64, -64, -64, 64, -64, -64, -64, 64, -64, -64, 64, -64, -64, -64, -64, -64, -64, -64, -64, 64, -64, -64, 64, -64, -64, 64, -64, -64, -64, -64, 64, -64, 64, -64, 64, 64, -64, -64, 64, -64, -64, -64, -64, -64, -64, -64, 64, -64, -64, 64, 64, -64, -64, -64, 64, -64, -64, 64, 64, -64, 64, -64, -64, 64, 64, 64, -64, -64, -64, -64, -64, -64, -64, -64, -64, -64, -64, -64, 64, 64, 64, 64, 64, -64, -64, -64, -64, 64, -64, 64, 64, 64, 64, 64, 64, 64, -64, -64, -64, -64, -64, -64, -64, -64, 64, 64, -64, 64, 64, 64, 64, 64, -64, 64, -64, -64, -64, -64, 64, 64, 64, 64, 64, 64, -64, -64, -64, -64, -64, -64, 64, 64, -64, 64, 64, 64, 64, 64, 64, -64, 64, -64, -64, 64, -64, 64, 64, 64, -64, -64, 64, 64, 64, 64, -64, 64, -64, 64, -64, -64, -64, 64, 64, 64, 64, 64, -64, -64, 64, 64, 64, -64, 64, 64, 64, -64, 64, -64, -64, -64, 64, 64, -64, -64, 64, 64, -64, -64, -64, -64, 64, 64, 64, -64, -64, 64, -64, -64, 64, 64, -64, -64, 64, 64, 64, 64, -64, -64, -64, -64, 64, 64, 64, 64, 64, 64, 64, -64, -64, -64, 64, 64, 64, -64, 64, -64, 64, -64, 64, -64, -64, 64, -64, 64, 64, 64, 64, -64, 64, 64, 64, -64, 64, -64, 64, -64, -64, -64, 64, -64, -64, -64, -64, -64, 64, -64, -64, -64, -64, 64, -64, 64, -64, -64, 64, -64, -64, 64, -64, -64, -64, 64, 64, 64, -64, 64, 64, -64, -64, 64, -64, 64, -64, -64, 64, -64, 64, 64, 64, 64, -64, -64, -64, -64, 64, -64, -64, -64, -64, -64, -64, -64, 64, -64, 64, 64, 64, 64, 64, 64, -64, -64, -64, -64, -64, -64, -64, -64, -64, 64, -64, -64, -64, -64, 64, 64, -64, 64, 64, 64, -64, 64, -64, -64, -64, -64, 64, 64, -64, -64, 64, 64, -64, 64, 64, 64, 64, -64, 64, -64, 64, 64, 64, -64, -64, -64, -64, -64, -64, -64, 64, -64, -64, -64, -64, 64, 64, 64, -64, -64, 64, -64, 64, -64, -64, 64, 64, -64, 64, 64, -64, -64, 64, -64, -64, 64, 64, -64, -64, -64, -64, -64, -64, 64, -64, -64, -64, 64, 64, -64, 64, 64, 64, -64, 64, 64, 64, 64, 64, 64, -64, -64, -64, -64, -64, -64, 64, -64, -64, -64, -64, 64, 64, -64, -64, 64, 64, -64, 64, 64, 64, -64, 64, 64, 64, 64, -64, -64, -64, 64, -64, 64, 64, 64, -64, 64, -64, -64, 64, 64, 64, 64, 64, -64, -64, 64, -64, -64, 64, -64, 64, 64, 64, -64, 64, -64, -64, 64, 64, 64, 64, 64, 64, 64, -64, 64, -64, 64, 64, -64, -64, 64, -64, 64, 64, 64, 64, 64, 64, 64, 64, -64, 64, -64, -64, 64, -64, 64, 64, -64, 64, 64, 64, 64, 64, 64, -64, 64, -64, 64, 64, 64, -64, 64, 64, 64, 64, 64, 64, 64, -64, -64, -64, 64, -64, -64, -64, 64, -64, 64, 64, -64, 64, 64, 64, 64, 64, 64, 64, 64, -64, 64, 64, 64, 64, 64, -64, 64, 64, -64, -64, 64, 64, -64, -64, -64, 64, 64, -64, -64, -64, 64, -64, -64, 64, 64, 64, 64, 64, 64, 64, 64, 64, 64, -64, 64, 64, 64, 64, 64, 64, -64, -64, -64, 64, -64, -64, 64, 64, 64, 64, -64, -64, -64, 64, 64, -64, 64, 64, 64, 64, 64, 64, 64, 64, 64, 64, 64, -64, -64, -64, -64, -64, -64, -64, -64, -64, 64, 64, -64, -64, -64, -64, 64, 64, 64, 64, 64, 64, -64, 64, 64, 64, 64, 64, 64, 64, 64, -64, -64, -64, 64, 64, 64, -64, -64, -64, -64, 64, 64, 64, 64, -64, 64, 64, -64, -64, -64, -64, -64, 64, 64, 64, 64, -64, -64, 64, 64, -64, -64, -64, -64, -64, -64, 64, 64, 64, -64, -64, 64, 64, -64, -64, -64, -64, -64, -64, -64, -64, -64, -64, -64, -64, 64, 64, 64, -64, -64, 64, -64, 64, -64, -64, 64, 64, -64, -64, 64, 64, -64, -64, -64, -64, -64, -64, -64, -64, -64, -64, -64, 64, 64, -64, -64, -64, -64, 64, 64, 64, -64, -64, -64, 64, 64, -64, 64, 64, -64, 64, -64, -64, -64, -64, -64, -64, -64, -64, -64, -64, 64, -64, -64, 64, 64, -64, 64, 64, -64, -64, 64, 64, 64, 64, 64, 64, -64, 64, -64, -64, -64, -64, -64, -64, -64, -64, -64, 64, 64, -64, 64, 64, -64, 64, -64, -64, -64, -64, 64, -64, -64, 64, 64, 64, 64, -64, 64, 64, -64, -64, -64, -64, -64, -64, -64, 64, -64, 64, 64, 64, 64, 64, -64, -64, -64, -64, 64, 64, 64, 64, 64, 64, 64, 64, 64, -64, -64, -64, -64, -64, -64, -64, 64, 64, -64, 64, -64, -64, -64, -64, 64, 64, -64, -64, -64, 64, -64, 64, 64, 64, 64, -64, 64, 64, -64, -64, -64, -64, -64, -64, 64, 64, -64, 64, -64, -64, -64, 64, -64, -64, -64, -64, 64, -64, -64, 64, -64, -64, -64, -64, -64, -64, -64, -64, -64, -64, -64, -64, -64, 64, 64, 64, 64, -64, 64, 64, 64, 64, 64, -64, -64, 64, 64, -64, 64, -64, -64, -64, -64, -64, -64, -64, -64, -64, 64, -64, 64, 64, 64, -64, -64, -64, -64, -64, -64, 64, 64, 64, -64, -64, 64, 64, -64, 64, -64, -64, -64, -64, -64, -64, 64, -64, 64, 64, 64, 64, -64, -64, -64, -64, -64, -64, 64, -64, 64, -64, -64, -64, -64, 64, 64, 64, -64, 64, 64, 64, 64, 64, 64, 64, 64, 64, 64, 64, 64, 64, 64, -64, 64, 64, 64, -64, 64, 64, 64, 64, -64, 64, 64, 64, -64, 64, -64, 64, 64, 64, 64, -64, 64, 64, 64, 64, 64, 64, 64, 64, 64, 64, 64, -64, -64, -64, 64, 64, 64, -64, -64, 64, 64, 64, 64, 64, 64, 64, 64, -64, 64, 64, 64, -64, 64, -64, 64, 64, 64, -64, -64, -64, -64, 64, 64, -64, 64, -64, 64, 64, 64, 64, -64, -64, -64, -64, -64, 64, 64, 64, 64, 64, -64, -64, -64, -64, -64, 64, 64, 64, 64, -64, 64, -64, 64, -64, -64, 64, 64, -64, 64, 64, -64, -64, 64, 64, 64, -64, 64, 64, -64, 64, -64, 64, -64, 64, 64, 64, -64, 64, 64, 64, -64, 64, -64, 64, 64, 64, 64, 64, -64, -64, -64, 64, -64, 64, -64, 64, -64, -64, 64, 64, 64, -64, -64, 64, -64, -64, 64, -64, -64, -64, 64, 64, 64, -64, -64, -64, -64, -64, 64, 64, -64, -64, -64, -64, -64, -64, -64, 64, 64, -64, -64, 64, -64, -64, -64, -64, 64, 64, 64, -64, -64, -64, -64, -64, 64, 64, -64, -64, -64, -64, -64, -64, 64, 64, 64, -64, -64, -64, -64, 64, -64, 64, 64, 64, -64, -64, -64, -64, -64, -64, -64, -64, -64, -64, 64, 64, -64, -64, -64, 64, -64, -64, 64, -64, -64, -64, -64, -64, -64, -64, -64, 64, 64, -64, -64, 64, -64, -64, -64, -64, -64, 64, 64, 64, 64, 64, 64, 64, 64, -64, 64, 64, -64, -64, -64, -64, 64, 64, -64, -64, 64, -64, -64, -64, -64, -64, -64, -64, 64, 64, 64, -64, -64, 64, 64, -64, 64, -64, -64, 64, -64, -64, -64, 64, 64, -64, 64, -64, -64, -64, 64, -64, 64, -64, -64, 64, 64, 64, 64, -64, -64, -64, -64, -64, 64, 64, 64, 64, 64, 64, 64, 64, 64, -64, -64, 64, -64, -64, 64, -64, 64, 64, 64, 64, 64, 64, 64, 64, 64, 64, -64, 64, 64, 64, 64, 64, 64, 64, 64, 64, 64, 64, 64, -64, -64, -64, -64, -64, 64, 64, 64, 64, 64, 64, 64, 64, 64, -64, -64, -64, 64, -64, 64, 64, 64, 64, 64, 64, 64, 64, 64, 64, -64, 64, -64, -64, 64, 64, 64, 64, 64, 64, 64, 64, 64, -64, -64, -64, 64, 64, -64, -64, 64, 64, 64, 64, -64, 64, -64, 64, -64, 64, 64, -64, 64, 64, 64, 64, 64, 64, 64, 64, -64, -64, 64, -64, 64, -64, -64, -64, -64, 64, 64, -64, -64, 64, -64, -64, -64, 64, -64, 64, 64, 64, 64, 64, 64, 64, 64, 64, 64, -64, 64, 64, 64, -64, -64, -64, 64, 64, 64, -64, -64, 64, 64, -64, 64, 64, 64, 64, 64, 64, -64, 64, 64, 64, 64, 64, 64, -64, 64, -64, -64, -64, -64, 64, 64, 64, 64, 64, -64, -64, -64, 64, -64, 64, -64, 64, 64, 64, -64, -64, 64, 64, -64, -64, -64, 64, 64, -64, -64, -64, -64, -64, 64, 64, 64, -64, -64, -64, -64, 64, -64, -64, -64, 64, 64, 64, -64, 64, -64, -64, -64, 64, 64, -64, 64, -64, -64, 64, 64, 64, 64, 64, 64, -64, -64, -64, 64, -64, 64, -64, -64, 64, 64, 64, 64, 64, -64, -64, -64, 64, -64, -64, 64, -64, -64, -64, 64, 64, 64, -64, 64, -64, -64, -64, 64, 64, 64, -64, 64, -64, 64, 64, 64, 64, -64, 64, 64, -64, 64, 64, 64, 64, -64, -64, 64, 64, 64, -64, -64, 64, -64, 64, -64, 64, 64, -64, -64, -64, 64, 64, 64, 64, 64, 64, 64, 64, 64, 64, -64, -64, -64, 64, -64, 64, 64, 64, 64, -64, 64, -64, 64, -64, 64, -64, 64, -64, 64, 64, 64, 64, 64, 64, 64, 64, 64, 64, -64, -64, 64, 64, 64, -64, 64, -64, -64, -64, 64, -64, -64, -64, -64, -64, -64, -64, 64, 64, -64, -64, 64, 64, 64, 64, 64, 64, 64, 64, -64, 64, 64, 64, 64, -64, 64, 64, -64, 64, 64, -64, -64, 64, -64, -64, -64, -64, -64, 64, 64, 64, 64, 64, 64, 64, 64, 64, 64, 64, 64, 64, 64, -64, 64, 64, -64, 64, -64, -64, 64, -64, 64, -64, -64, 64, -64, 64, -64, -64, 64, 64, 64, 64, 64, 64, 64, 64, 64, 64, 64, 64, 64, 64, -64, 64, 64, -64, 64, 64, 64, -64, -64, 64, -64, -64, -64, -64, -64, 64, 64, 64, 64, 64, 64, 64, 64, 64, 64, 64, 64, -64, -64, -64, 64, 64, -64, 64, -64, -64, 64, -64, -64, -64, -64, -64, -64, -64, -64, -64, -64, -64, -64, -64, -64, 64, 64, 64, -64, 64, -64, 64, -64, 64, 64, 64, 64, 64, 64, -64, -64, -64, -64, -64, -64, -64, -64, 64, -64, 64, 64, -64, 64, 64, 64, -64, 64, -64, -64, -64, -64, -64, -64, 64, -64, 64, -64, 64, -64, -64, 64, 64, -64, -64, -64, 64, 64, -64, -64, -64, 64, 64, -64, 64, 64, 64, 64, 64, 64, 64, -64, 64, 64, -64, 64, -64, -64, 64, 64, -64, -64, -64, 64, -64, -64, 64, -64, -64, -64, -64, 64, 64, -64, 64, 64, 64, 64, -64, -64, 64, -64, 64, -64, -64, 64, 64, 64, -64, -64, -64, 64, 64, -64, 64, 64, -64, -64, -64, 64, 64, 64, -64, -64, -64, 64, -64, -64, -64, -64, -64, 64, 64, 64, 64, 64, -64, 64, 64, -64, 64, -64, -64, 64, 64, 64, -64, -64, 64, 64, -64, -64, -64, 64, -64, -64, -64, -64, 64, 64, 64, -64, -64, -64, -64, -64, -64, -64, -64, 64, 64, 64, 64, 64, -64, 64, 64, 64, 64, -64, 64, 64, 64, -64, 64, 64, -64, 64, -64, -64, -64, -64, -64, -64, -64, -64, -64, -64, -64, -64, 64, 64, 64, -64, -64, -64, 64, -64, -64, -64, -64, -64, -64, 64, -64, 64, -64, -64, -64, -64, -64, -64, -64, -64, -64, -64, -64, -64, -64, -64, 64, 64, 64, -64, 64, -64, -64, -64, 64, -64, -64, -64, 64, 64, -64, -64, 64, -64, -64, -64, -64, -64, -64, -64, 64, 64, 64, 64, 64, 64, 64, -64, -64, -64, -64, -64, -64, 64, -64, -64, -64, -64, -64, 64, 64, -64, 64, 64, 64, 64, -64, 64, 64, 64, 64, 64, 64, 64, -64, -64, -64, -64, -64, -64, -64, -64, 64, -64, -64, 64, 64, -64, 64, -64, 64, 64, 64, 64, -64, 64, 64, 64, -64, -64, -64, 64, 64, -64, -64, -64, 64, -64, 64, -64, 64, 64, -64, 64, 64, -64, 64, 64, -64, 64, 64, -64, -64, 64, -64, -64, -64, -64, -64, 64, 64, -64, -64, -64, -64, -64, 64, -64, -64, 64, -64, -64, -64, 64, 64, -64, -64, 64, 64, 64, -64, -64, -64, -64, -64, -64, -64, 64, 64, 64, -64, -64, -64, -64, -64, -64, -64, -64, 64, 64, -64, 64, 64, 64, -64, 64, 64, 64, -64, -64, -64, -64, -64, -64, 64, 64, 64, -64, -64, -64, -64, -64, 64, -64, 64, 64, 64, 64, -64, -64, 64, 64, 64, 64, 64, 64, -64, -64, -64, -64, -64, 64, 64, 64, 64, -64, -64, -64, 64, -64, 64, -64, 64, 64, 64, 64, 64, 64, 64, 64, 64, -64, -64, -64, -64, 64, 64, 64, 64, 64, 64, 64, 64, 64, 64, -64, -64, -64, 64, 64, 64, 64, 64, 64, 64, 64, 64, 64, 64, 64, 64, -64, 64, -64, -64, 64, 64, 64, 64, 64, 64, 64, -64, -64, -64, -64, -64, -64, -64, 64, 64, 64, 64, 64, 64, 64, 64, 64, 64, 64, 64, 64, 64, 64, 64, 64, 64, 64, 64, 64, -64, -64, -64, -64, -64, -64, -64, -64, 64, 64, -64, 64, 64, 64, 64, 64, 64, 64, -64, -64, 64, 64, -64, 64, 64, 64, -64, -64, -64, 64, -64, -64, 64, 64, -64, -64, 64, -64, 64, 64, 64, 64, 64, 64, 64, -64, 64, 64, 64, 64, 64, -64, -64, -64, -64, 64, -64, -64, -64, 64, -64, 64, -64, -64, 64, -64, -64, 64, 64, -64, 64, 64, 64, -64, -64, 64, 64, 64, 64, 64, 64, -64, 64, -64, -64, -64, -64, 64, 64, -64, 64, -64, -64, -64, -64, -64, -64, -64, -64, -64, -64, -64, 64, 64, 64, 64, 64, 64, 64, 64, -64, -64, -64, -64, -64, -64, -64, 64, 64, 64, -64, -64, -64, -64, -64, -64, -64, -64, -64, -64, 64, 64, 64, -64, -64, 64, 64, 64, -64, -64, -64, -64, -64, 64, -64, -64, 64, -64, -64, -64, -64, -64, -64, -64, -64, -64, -64, -64, -64, 64, -64, -64, 64, 64, 64, -64, -64, -64, -64, -64, 64, -64, 64, 64, 64, -64, 64, -64, -64, -64, -64, 64, -64, -64, -64, 64, 64, 64, 64, 64, 64, 64, 64, 64, -64, -64, -64, -64, 64, -64, -64, -64, -64, -64, 64, -64, -64, -64, -64, 64, -64, -64, 64, 64, 64, 64, 64, 64, 64, 64, 64, 64, 64, 64, 64, 64, -64, 64, 64, -64, -64, -64, 64, 64, -64, -64, -64, 64, 64, 64, 64, 64, 64, 64, 64, 64, 64, 64, 64, -64, 64, -64, 64, 64, 64, -64, -64, -64, -64, -64, -64, 64, -64, -64, 64, -64, -64, -64, -64, -64, 64, -64, 64, 64, 64, -64, -64, -64, -64, -64, 64, 64, 64, 64, 64, 64, -64, 64, 64, -64, -64, -64, -64, -64, 64, 64, -64, -64, -64, -64, 64, 64, 64, 64, 64, 64, -64, 64, -64, 64, -64, 64, -64, 64, -64, 64, -64, 64, 64, 64, 64, -64, -64, -64, -64, 64, 64, -64, 64, 64, 64, -64, 64, 64, -64, 64, -64, -64, 64, 64, -64, 64, 64, 64, 64, -64, 64, 64, -64, -64, 64, 64, -64, -64, -64, -64, 64, -64, 64, -64, 64, -64, -64, -64, -64, -64, 64, -64, -64, 64, 64, 64, 64, -64, -64, -64, 64, 64, -64, -64, 64, 64, 64, 64, -64, -64, -64, -64, 64, -64, 64, 64, -64, -64, 64, -64, 64, 64, 64, 64, 64, 64, 64, 64, 64, 64, 64, 64, 64, 64, 64, 64, 64, 64, 64, 64, 64, -64, 64, -64, 64, 64, 64, 64, 64, -64, 64, -64, 64, -64, -64, -64, 64, -64, 64, 64, 64, 64, 64, 64, -64, 64, -64, 64, 64, 64, 64, 64, 64, 64, 64, -64, 64, -64, 64, 64, 64, -64, -64, 64, 64, -64, 64, 64, 64, 64, 64, -64, 64, 64, -64, 64, -64, 64, 64, 64, 64, -64, 64, 64, 64, 64, -64, 64, -64, -64, -64, 64, 64, 64, 64, 64, -64, 64, 64, 64, 64, 64, 64, 64, 64, 64, 64, 64, 64, 64, -64, 64, 64, 64, -64, 64, 64, 64, 64, 64, 64, 64, 64, 64, 64, 64, 64, 64, 64, 64, 64, 64, 64, 64, -64, -64, 64, 64, -64, -64, -64, 64, -64, 64, 64, -64, 64, 64, 64, 64, 64, 64, 64, 64, 64, 64, 64, 64, 64, 64, -64, -64, -64, -64, 64, -64, 64, 64, -64, -64, -64, -64, -64, 64, -64, 64, -64, 64, 64, 64, 64, 64, 64, 64, 64, 64, 64, 64, -64, -64, -64, -64, -64, 64, -64, -64, 64, -64, -64, -64, -64, 64, 64, -64, -64, -64, -64, -64, -64, -64, -64, -64, -64, -64, -64, -64, 64, -64, -64, -64, -64, 64, -64, 64, 64, -64, 64, -64, 64, 64, 64, -64, -64, -64, -64, -64, -64, -64, -64, -64, -64, -64, 64, -64, 64, -64, -64, 64, -64, 64, -64, -64, 64, -64, 64, -64, -64, 64, -64, -64, -64, -64, -64, -64, -64, -64, -64, -64, 64, -64, 64, -64, -64, -64, -64, -64, 64, -64, -64, -64, 64, -64, 64, -64, -64, -64, 64, -64, -64, -64, -64, -64, -64, -64, -64, -64, 64, -64, -64, -64, -64, -64, -64, 64, 64, -64, -64, -64, -64, -64, -64, -64, 64, 64, -64, -64, -64, -64, -64, -64, -64, 64, 64, 64, 64, 64, -64, 64, -64, -64, -64, -64, -64, -64, -64, 64, 64, -64, 64, 64, 64, 64, -64, -64, -64, -64, -64, -64, 64, 64, 64, -64, -64, -64, 64, -64, -64, -64, 64, -64, -64, -64, 64, -64, -64, -64, 64, -64, 64, -64, -64, -64, 64, 64, 64, 64, 64, 64, -64, 64, -64, -64, 64, -64, -64, -64, -64, -64, 64, -64, -64, -64, -64, -64, 64, -64, 64, -64, -64, 64, 64, -64, 64, 64, 64, 64, 64, 64, -64, -64, -64, -64, -64, 64, -64, -64, 64, -64, -64, -64, -64, 64, 64, 64, -64, 64, -64, -64, -64, -64, 64, 64, 64, 64, 64, -64, -64, -64, -64, -64, -64, -64, -64, -64, -64, -64, -64, 64, -64, 64, -64, 64, -64, 64, 64, 64, 64, -64, 64, -64, 64, -64, 64, 64, 64, 64, -64, -64, -64, -64, 64, -64, -64, -64, -64, -64, -64, -64, -64, 64, 64, 64, 64, 64, 64, 64, 64, 64, 64, 64, 64, 64, 64, 64, -64, 64, 64, 64, 64, -64, -64, -64, 64, 64, -64, 64, 64, -64, 64, 64, 64, -64, -64, -64, 64, 64, -64, 64, 64, 64, 64, 64, -64, -64, 64, 64, 64, 64, 64, 64, -64, 64, 64, -64, 64, 64, 64, 64, 64, 64, 64, 64, 64, 64, 64, 64, 64, 64, 64, -64, 64, -64, 64, 64, 64, -64, 64, 64, -64, -64, -64, 64, 64, 64, 64, 64, 64, 64, 64, 64, -64, 64, 64, 64, 64, 64, 64, 64, -64, -64, -64, 64, 64, 64, 64, 64, 64, -64, -64, -64, -64, 64, -64, 64, 64, 64, 64, 64, 64, 64, 64, -64, -64, -64, 64, -64, -64, 64, -64, 64, 64, 64, -64, 64, -64, 64, 64, -64, -64, 64, 64, 64, 64, 64, 64, 64, -64, 64, -64, -64, 64, -64, 64, -64, -64, -64, -64, -64, -64, 64, 64, 64, 64, 64, 64, 64, 64, -64, -64, 64, 64, -64, 64, -64, -64, -64, -64, -64, -64, 64, 64, 64, -64, -64, 64, -64, -64, 64, -64, 64, 64, -64, 64, -64, 64, 64, 64, 64, 64, 64, -64, -64, -64, -64, -64, -64, -64, 64, -64, 64, -64, -64, -64, -64, -64, -64, 64, 64, 64, 64, -64, 64, -64, 64, 64, 64, -64, 64, 64, -64, -64, -64, -64, -64, -64, -64, -64, 64, -64, -64, 64, 64, 64, 64, 64, 64, 64, 64, 64, 64, 64, 64, 64, -64, 64, 64, -64, 64, 64, -64, 64, 64, 64, -64, -64, -64, 64, 64, -64, -64, -64, -64, -64, -64, 64, -64, 64, -64, -64, -64, -64, -64, 64, 64, 64, -64, 64, 64, -64, 64, 64, 64, 64, 64, -64, 64, 64, 64, -64, 64, 64, -64, -64, 64, -64, 64, 64, 64, -64, 64, -64, 64, 64, -64, 64, 64, 64, -64, -64, 64, -64, -64, -64, -64, -64, -64, 64, 64, 64, -64, -64, -64, 64, -64, -64, 64, -64, -64, 64, -64, 64, -64, 64, 64, -64, -64, -64, -64, 64, -64, 64, -64, 64, 64, -64, -64, -64, 64, -64, 64, 64, -64, -64, 64, 64, 64, 64, 64, -64, -64, 64, -64, 64, -64, -64, -64, 64, -64, -64, 64, -64, 64, -64, 64, 64, -64, -64, 64, -64, -64, -64, 64, 64, -64, -64, -64, -64, 64, -64, -64, 64, 64, -64, 64, -64, -64, 64, 64, -64, -64, 64, -64, -64, 64, 64, 64, -64, 64, -64, 64, -64, 64, 64, -64, 64, -64, -64, -64, 64, -64, -64, -64, -64, 64, -64, 64, -64, 64, -64, 64, 64, 64, 64, 64, 64, 64, -64, 64, 64, -64, -64, -64, 64, -64, -64, -64, 64, -64, -64, 64, 64, 64, -64, -64, -64, -64, -64, 64, 64, -64, 64, 64, -64, -64, -64, -64, -64, -64, -64, 64, -64, -64, 64, -64, -64, -64, -64, 64, 64, -64, -64, -64, -64, -64, 64, 64, -64, -64, 64, 64, -64, -64, -64, 64, -64, 64, -64, 64, 64, -64, -64, -64, -64, -64, -64, 64, -64, -64, -64, 64, -64, -64, -64, -64, -64, 64, -64, -64, -64, -64, -64, -64, -64, -64, -64, 64, 64, -64, 64, -64, -64, 64, -64, -64, 64, -64, -64, -64, -64, 64, -64, -64, 64, -64, -64, -64, 64, -64, -64, 64, 64, -64, 64, -64, 64, 64, -64, 64, 64, 64, -64, -64, -64, 64, -64, 64, -64, -64, -64, -64, -64, -64, 64, 64, 64, -64, 64, 64, -64, -64, -64, 64, 64, -64, -64, 64, -64, -64, -64, -64, 64, -64, -64, 64, 64, -64, -64, 64, -64, 64, 64, -64, 64, -64, -64, 64, -64, -64, -64, -64, -64, -64, 64, -64, -64, -64, -64, -64, -64, -64, -64, -64, 64, -64, -64, -64, 64, 64, 64, -64, 64, -64, -64, 64, -64, -64, 64, -64, 64, -64, 64, 64, -64, 64, -64, -64, -64, -64, -64, -64, 64, -64, -64, 64, 64, -64, 64, -64, -64, 64, 64, 64, 64, 64, 64, 64, -64, 64, 64, -64, 64, -64, -64, -64, 64, -64, 64, 64, 64, 64, -64, -64, -64, -64, 64, -64, -64, -64, 64, 64, 64, -64, 64, -64, -64, 64, -64, -64, -64, -64, -64, -64, -64, -64, -64, -64, -64, -64, 64, -64, -64, -64, 64, -64, 64, 64, 64, -64, -64, -64, 64, -64, -64, 64, -64, -64, 64, -64, -64, -64, -64, -64, -64, -64, -64, -64, -64, -64, -64, -64, 64, 64, 64, -64, -64, 64, -64, -64, -64, -64, -64, -64, -64, -64, -64, 64, 64, -64, -64, -64, -64, 64, 64, -64, 64, -64, -64, -64, 64, -64, 64, -64, 64, 64, 64, -64, -64, 64, -64, -64, 64, 64, 64, 64, -64, -64, 64, 64, -64, -64, 64, -64, -64, 64, -64, 64, -64, -64, -64, -64, 64, 64, -64, 64, 64, -64, 64, -64, -64, -64, -64, 64, -64, -64, 64, 64, 64, -64, -64, -64, 64, -64, -64, -64, 64, 64, 64, -64, 64, -64, 64, 64, 64, 64, -64, -64, -64, 64, -64, -64, 64, -64, -64, -64, 64, 64, -64, 64, 64, 64, -64, 64, 64, -64, -64, -64, 64, 64, 64, 64, 64, -64, -64, 64, 64, -64, -64, 64, -64, -64, -64, 64, 64, 64, 64, -64, -64, 64, 64, -64, 64, -64, 64, -64, -64, -64, 64, -64, -64, -64, 64, -64, 64, 64, -64, -64, 64, 64, -64, -64, 64, -64, 64, 64, 64, 64, -64, 64, 64, 64, 64, -64, -64, 64, 64, -64, 64, -64, 64, 64, 64, 64, -64, -64, -64, 64, 64, -64, -64, 64, 64, 64, 64, 64, -64, -64, -64, 64, -64, -64, 64, 64, -64, -64, 64, 64, 64, -64, 64, 64, 64, -64, -64, -64, 64, -64, 64, -64, -64, -64, 64, -64, -64, -64, 64, 64, -64, 64, 64, 64, -64, 64, 64, 64, -64, -64, 64, 64, -64, -64, -64, -64, 64, 64, -64, 64, 64, -64, 64, -64, -64, 64, -64, 64, -64, -64, -64, -64, -64, 64, 64, -64, 64, -64, -64, -64, 64, 64, -64, -64, -64, -64, -64, 64, -64, -64, -64, -64, -64, 64, 64, 64, -64, 64, 64, 64, -64, 64, 64, -64, -64, -64, -64, -64, 64, 64, 64, -64, 64, -64, -64, 64, 64, 64, 64, 64, -64, 64, 64, -64, 64, -64, 64, -64, 64, 64, -64, 64, 64, 64, 64, 64, 64, -64, 64, -64, 64, -64, -64, 64, -64, 64, -64, -64, -64, 64, -64, -64, 64, 64, 64, -64, -64, 64, -64, 64, -64, -64, 64, -64, -64, -64, -64, -64, -64, 64, -64, 64, -64, -64, -64, 64, -64, 64, -64, -64, 64, 64, 64, 64, -64, 64, -64, -64, -64, -64, 64, 64, 64, 64, -64, -64, -64, 64, -64, -64, -64, -64, -64, -64, -64, -64, 64, -64, -64, 64, -64, -64, 64, -64, -64, -64, -64, -64, 64, 64, 64, -64, -64, -64, -64, -64, -64, -64, -64, -64, -64, -64, -64, -64, -64, 64, 64, 64, -64, -64, -64, -64, -64, -64, -64, -64, -64, -64, -64, -64, -64, -64, -64, -64, -64, -64, -64, -64, 64, -64, -64, 64, 64, 64, -64, 64, -64, -64, 64, 64, 64, -64, -64, -64, -64, -64, -64, -64, -64, 64, 64, 64, 64, -64, -64, 64, 64, -64, -64, -64, -64, -64, 64, 64, -64, 64, 64, -64, -64, -64, -64, -64, -64, -64, -64, 64, 64, 64, 64, 64, 64, 64, 64, 64, -64, -64, 64, 64, 64, 64, 64, 64, -64, -64, 64, -64, -64, -64, -64, -64, 64, -64, 64, 64, 64, 64, 64, 64, 64, 64, 64, 64, 64, 64, 64, -64, -64, -64, -64, 64, -64, -64, -64, -64, -64, -64, -64, -64, 64, 64, 64, 64, 64, -64, -64, 64, 64, 64, 64, 64, 64, -64, 64, -64, 64, -64, 64, -64, 64, 64, -64, -64, -64, -64, -64, -64, 64, 64, 64, -64, 64, -64, -64, -64, 64, 64, 64, 64, 64, 64, 64, 64, -64, -64, -64, -64, 64, 64, 64, -64, -64, -64, -64, 64, 64, -64, -64, -64, -64, -64, -64, 64, -64, 64, 64, 64, 64, 64, 64, 64, 64, -64, 64, 64, -64, -64, 64, -64, -64, 64, -64, 64, 64, -64, -64, -64, 64, -64, -64, 64, 64, 64, -64, -64, 64, 64, -64, 64, 64, 64, 64, -64, 64, 64, 64, -64, -64, -64, 64, -64, -64, -64, -64, -64, -64, -64, -64, -64, 64, 64, -64, -64, 64, 64, -64, 64, 64, -64, -64, -64, 64, -64, -64, -64, -64, 64, 64, -64, -64, -64, -64, 64, 64, -64, -64, 64, 64, -64, 64, 64, 64, -64, -64, -64, -64, 64, 64, -64, 64, 64, 64, 64, 64, 64, 64, 64, 64, 64, -64, -64, -64, -64, -64, -64, 64, -64, -64, -64, 64, 64, 64, -64, 64, 64, 64, 64, -64, -64, 64, 64, 64, 64, 64, -64, 64, 64, 64, 64, -64, -64, -64, -64, -64, -64, -64, -64, 64, 64, 64, 64, -64, 64, 64, 64, 64, -64, 64, 64, 64, 64, 64, 64, 64, -64, 64, 64, -64, -64, -64, -64, -64, -64, -64, 64, 64, -64, -64, -64, -64, -64, 64, 64, 64, 64, 64, 64, 64, -64, -64, -64, -64, -64, -64, 64, -64, -64, 64, -64, -64, -64, -64, 64, 64, -64, -64, -64, -64, -64, -64, 64, 64, -64, 64, 64, 64, 64, -64, -64, -64, -64, -64, -64, -64, -64, 64, -64, -64, -64, 64, 64, 64, 64, -64, 64, 64, -64, -64, 64, -64, 64, 64, 64, 64, 64, -64, -64, -64, -64, -64, -64, -64, -64, 64, -64, -64, -64, -64, -64, -64, -64, -64, 64, 64, -64, 64, 64, 64, 64, -64, 64, 64, -64, -64, -64, 64, -64, 64, -64, -64, -64, -64, -64, -64, -64, -64, -64, -64, -64, -64, 64, 64, 64, 64, 64, -64, -64, 64, 64, 64, 64, 64, -64, 64, -64, 64, -64, 64, -64, -64, -64, -64, -64, -64, -64, -64, -64, 64, -64, -64, 64, -64, -64, 64, -64, -64, 64, 64, 64, 64, 64, 64, -64, 64, 64, 64, 64, -64, -64, -64, 64, -64, -64, -64, 64, 64, -64, 64, 64, -64, -64, 64, 64, 64, 64, 64, 64, 64, 64, 64, 64, 64, -64, -64, 64, -64, 64, -64, 64, 64, 64, -64, 64, -64, 64, -64, -64, -64, -64, -64, -64, -64, 64, 64, 64, -64, 64, 64, 64, -64, 64, 64, 64, 64, 64, -64, -64, 64, -64, 64, -64, -64, 64, 64, -64, 64, 64, 64, -64, 64, 64, -64, 64, 64, 64, 64, 64, -64, -64, -64, -64, 64, 64, 64, 64, -64, -64, -64, -64, -64, -64, -64, -64, 64, 64, 64, 64, -64, -64, -64, -64, 64, -64, -64, 64, 64, 64, 64, 64, -64, -64, 64, -64, 64, -64, 64, -64, 64, -64, 64, -64, 64, 64, -64, -64, 64, 64, 64, 64, 64, 64, -64, 64, 64, 64, 64, 64, -64, 64, -64, 64, -64, -64, -64, -64, -64, -64, 64, -64, -64, -64, 64, 64, -64, 64, -64, 64, 64, -64, 64, 64, 64, -64, 64, 64, 64, 64, 64, -64, -64, 64, 64, 64, 64, -64, -64, -64, 64, 64, -64, 64, -64, 64, 64, -64, -64, -64, -64, -64, -64, 64, -64, 64, 64, 64, -64, -64, -64, -64, -64, 64, 64, 64, -64, -64, 64, 64, -64, -64, -64, -64, -64, 64, -64, -64, -64, -64, -64, -64, -64, -64, -64, 64, 64, -64, -64, -64, -64, -64, -64, 64, 64, 64, 64, 64, -64, -64, -64, -64, 64, 64, -64, -64, -64, -64, 64, -64, 64, 64, 64, 64, -64, -64, -64, -64, -64, -64, -64, -64, -64, 64, -64, 64, 64, 64, -64, 64, -64, 64, -64, -64, 64, -64, 64, -64, -64, -64, 64, 64, -64, -64, -64, -64, 64, 64, 64, -64, 64, 64, 64, 64, -64, -64, 64, -64, -64, 64, 64, 64, -64, -64, -64, -64, -64, -64, -64, 64, 64, 64, -64, -64, 64, -64, 64, 64, 64, 64, 64, -64, -64, 64, 64, 64, 64, 64, -64, -64, -64, -64, -64, -64, -64, -64, -64, -64, 64, -64, -64, -64, 64, 64, 64, 64, 64, -64, 64, 64, 64, -64, -64, -64, 64, -64, -64, -64, -64, -64, -64, 64, -64, -64, 64, 64, 64, 64, 64, 64, 64, -64, 64, 64, 64, -64, 64, 64, -64, -64, -64, -64, -64, -64, -64, -64, -64, -64, 64, -64, -64, -64, 64, 64, -64, 64, -64, 64, 64, 64, 64, -64, 64, 64, 64, -64, -64, -64, -64, -64, -64, -64, -64, -64, -64, -64, 64, -64, -64, -64, 64, 64, -64, 64, 64, -64, 64, -64, 64, 64, 64, 64, -64, -64, 64, -64, -64, -64, -64, -64, 64, -64, -64, -64, -64, -64, 64, 64, -64, -64, -64, -64, -64, -64, -64, -64, 64, 64, 64, -64, -64, 64, -64, -64, -64, -64, -64, -64, 64, -64, -64, -64, 64, -64, 64, -64, 64, -64, -64, -64, -64, -64, -64, 64, -64, 64, 64, 64, -64, -64, -64, -64, -64, -64, -64, -64, -64, 64, -64, 64, 64, 64, 64, 64, -64, -64, -64, -64, -64, -64, -64, 64, 64, -64, 64, -64, -64, 64, 64, -64, -64, -64, -64, -64, -64, 64, -64, 64, 64, 64, -64, 64, -64, -64, -64, -64, -64, 64, 64, 64, 64, -64, -64, 64, 64, 64, 64, -64, -64, -64, -64, 64, 64, 64, 64, 64, 64, 64, -64, -64, -64, -64, -64, -64, -64, -64, -64, 64, 64, 64, 64, -64, -64, -64, -64, 64, -64, 64, 64, 64, 64, -64, 64, 64, 64, -64, -64, -64, -64, -64, -64, -64, -64, 64, 64, 64, 64, 64, -64, 64, -64, -64, 64, 64, -64, 64, 64, -64, 64, -64, 64, -64, 64, -64, -64, -64, -64, -64, 64, -64, -64, -64, -64, 64, 64, 64, 64, 64, -64, -64, -64, 64, 64, 64, 64, -64, 64, 64, 64, 64, 64, -64, -64, -64, 64, -64, -64, -64, -64, -64, 64, 64, -64, 64, -64, -64, -64, 64, 64, -64, -64, -64, 64, 64, 64, 64, -64, 64, -64, -64, -64, -64, -64, -64, -64, -64, -64, -64, -64, -64, -64, -64, -64, 64, -64, 64, 64, -64, -64, -64, 64, -64, 64, -64, -64, -64, -64, 64, -64, -64, -64, -64, -64, -64, -64, 64, -64, 64, 64, -64, -64, 64, -64, 64, -64, -64, -64, 64, -64, -64, -64, -64, -64, -64, -64, -64, -64, -64, -64, -64, -64, -64, 64, 64, 64, -64, 64, -64, -64, -64, -64, -64, 64, -64, 64, -64, -64, 64, -64, -64, -64, 64, 64, -64, -64, -64, -64, -64, 64, 64, 64, 64, 64, -64, 64, -64, -64, 64, -64, 64, -64, -64, -64, -64, -64, -64, -64, -64, 64, 64, 64, 64, -64, 64, 64, 64, -64, -64, 64, 64, 64, -64, -64, -64, -64, 64, 64, 64, -64, -64, -64, -64, -64, -64, -64, -64, -64, -64, 64, 64, -64, 64, 64, -64, 64, -64, -64, -64, -64, -64, -64, -64, -64, -64, 64, -64, 64, 64, -64, -64, -64, -64, -64, -64, 64, 64, 64, -64, -64, -64, -64, -64, -64, -64, -64, -64, -64, -64, -64, 64, -64, -64, -64, -64, 64, 64, -64, 64, -64, -64, -64, -64, -64, 64, -64, -64, 64, -64, 64, -64, -64, -64, 64, 64, -64, 64, -64, -64, 64, -64, -64, 64, -64, 64, -64, 64, -64, -64, 64, -64, 64, -64, -64, -64, -64, -64, -64, 64, -64, -64, 64, -64, -64, 64, 64, 64, -64, -64, 64, -64, 64, -64, 64, -64, 64, 64, 64, -64, 64, -64, 64, -64, -64, 64, -64, 64, -64, -64, 64, -64, -64, 64, 64, -64, -64, -64, -64, 64, 64, 64, -64, -64, -64, 64, 64, -64, -64, -64, -64, -64, 64, -64, 64, -64, -64, -64, 64, 64, 64, -64, -64, -64, -64, 64, 64, 64, 64, 64, 64, 64, -64, -64, -64, -64, 64, 64, -64, 64, -64, 64, -64, -64, 64, 64, 64, -64, -64, -64, 64, -64, -64, -64, 64, 64, -64, 64, 64, 64, 64, -64, 64, -64, 64, -64, 64, 64, -64, 64, 64, 64, 64, -64, 64, 64, 64, 64, 64, 64, 64, 64, 64, -64, 64, 64, -64, -64, -64, 64, 64, 64, 64, -64, 64, -64, -64, 64, 64, -64, 64, -64, 64, -64, -64, -64, -64, 64, 64, -64, 64, -64, -64, 64, 64, 64, 64, 64, 64, 64, 64, -64, -64, 64, 64, -64, -64, 64, 64, -64, 64, 64, -64, -64, -64, -64, 64, -64, -64, 64, 64, 64, 64, 64, 64, 64, 64, 64, 64, 64, 64, 64, 64, -64, 64, -64, 64, 64, -64, 64, -64, 64, 64, -64, 64, -64, 64, -64, -64, -64, 64, 64, 64, 64, 64, 64, 64, 64, 64, 64, -64, 64, 64, -64, -64, 64, -64, 64, 64, 64, 64, -64, 64, 64, 64, 64, 64, 64, 64, 64, -64, 64, 64, 64, 64, -64, 64, -64, -64, 64, -64, 64, 64, 64, 64, -64, -64, 64, 64, 64, 64, 64, 64, -64, -64, 64, -64, -64, -64, 64, -64, 64, 64, -64, 64, 64, -64, 64, 64, 64, 64, 64, -64, -64, 64, -64, -64, -64, -64, -64, -64, -64, -64, -64, -64, 64, 64, 64, 64, 64, 64, -64, -64, 64, 64, 64, 64, 64, -64, 64, 64, 64, 64, 64, -64, -64, -64, 64, 64, -64, -64, 64, 64, -64, 64, -64, 64, 64, 64, 64, -64, 64, -64, -64, -64, 64, 64, -64, -64, 64, -64, 64, -64, 64, -64, 64, -64, 64, 64, 64, 64, -64, -64, -64, -64, -64, 64, 64, 64, 64, 64, -64, -64, 64, 64, 64, 64, -64, 64, 64, 64, -64, -64, 64, -64, 64, 64, 64, -64, -64, 64, 64, -64, -64, -64, -64, 64, 64, 64, 64, 64, 64, 64, 64, 64, -64, -64, 64, 64, 64, -64, 64, 64, -64, 64, 64, -64, 64, -64, 64, 64, 64, 64, 64, 64, 64, -64, 64, -64, 64, 64, -64, 64, 64, 64, 64, -64, 64, 64, 64, -64, -64, 64, 64, 64, 64, -64, 64, 64, 64, -64, -64, 64, -64, -64, 64, 64, -64, 64, 64, 64, 64, 64, -64, 64, -64, 64, 64, -64, -64, -64, 64, -64, -64, 64, -64, 64, 64, 64, -64, -64, 64, 64, 64, 64, 64, -64, -64, 64, -64, -64, 64, -64, -64, -64, -64, -64, -64, 64, -64, 64, 64, 64, 64, 64, 64, 64, 64, 64, 64, 64, 64, -64, 64, -64, 64, -64, -64, 64, -64, 64, -64, -64, 64, -64, -64, 64, -64, 64, -64, 64, -64, 64, 64, -64, -64, 64, 64, 64, -64, -64, 64, 64, 64, -64, 64, 64, -64, 64, -64, -64, -64, 64, 64, 64, -64, 64, -64, 64, 64, -64, 64, 64, -64, -64, 64, 64, 64, -64, 64, -64, 64, 64, 64, 64, -64, 64, 64, 64, 64, 64, 64, 64, 64, -64, 64, 64, -64, 64, 64, 64, 64, 64, -64, 64, -64, 64, -64, 64, 64, 64, 64, 64, 64, -64, -64, -64, -64, 64, 64, -64, 64, -64, -64, 64, -64, -64, -64, 64, 64, 64, -64, 64, -64, 64, 64, -64, 64, -64, -64, 64, -64, 64, 64, -64, 64, -64, 64, 64, -64, -64, 64, 64, -64, 64, 64, -64, 64, 64, -64, 64, 64, 64, 64, -64, 64, -64, 64, 64, -64, -64, 64, 64, -64, 64, -64, -64, 64, 64, 64, 64, -64, 64, 64, -64, -64, -64, 64, 64, -64, 64, -64, 64, 64, 64, -64, 64, 64, -64, 64, -64, -64, -64, -64, -64, -64, 64, -64, 64, 64, 64, 64, 64, 64, 64, 64, 64, -64, 64, -64, -64, 64, 64, 64, 64, 64, 64, -64, 64, -64, 64, -64, 64, 64, 64, -64, 64, 64, 64, -64, -64, -64, 64, -64, 64, 64, 64, -64, 64, 64, 64, 64, -64, 64, -64, -64, 64, -64, 64, 64, 64, 64, 64, -64, 64, 64, 64, -64, -64, -64, 64, 64, 64, 64, -64, -64, -64, -64, -64, 64, 64, -64, 64, -64, -64, -64, 64, 64, 64, 64, 64, 64, 64, -64, 64, 64, 64, 64, -64, -64, 64, 64, -64, 64, 64, -64, 64, -64, -64, -64, -64, 64, 64, -64, -64, -64, -64, -64, 64, -64, -64, 64, 64, 64, 64, -64, 64, 64, -64, 64, 64, -64, 64, 64, -64, -64, 64, 64, 64, 64, 64, 64, 64, 64, 64, -64, 64, -64, -64, -64, 64, -64, 64, -64, -64, -64, 64, -64, 64, -64, -64, 64, -64, -64, 64, -64, -64, 64, -64, -64, -64, 64, 64, -64, -64, 64, 64, -64, -64, -64, -64, -64, -64, -64, 64, -64, -64, -64, -64, 64, -64, -64, -64, -64, -64, -64, 64, -64, -64, 64, 64, -64, -64, 64, 64, -64, -64, 64, -64, -64, -64, -64, -64, 64, 64, 64, -64, -64, 64, -64, 64, -64, 64, -64, 64, -64, 64, -64, 64, -64, -64, 64, -64, 64, -64, -64, -64, 64, 64, 64, -64, 64, -64, -64, 64, 64, -64, 64, -64, 64, 64, 64, 64, -64, 64, 64, -64, 64, 64, 64, 64, -64, -64, -64, 64, 64, 64, 64, -64, 64, 64, -64, 64, 64, -64, 64, 64, 64, 64, -64, 64, -64, 64, -64, 64, -64, 64, -64, -64, -64, 64, 64, 64, 64, 64, -64, -64, 64, 64, 64, 64, 64, 64, -64, 64, 64, 64, 64, 64, -64, -64, -64, 64, -64, -64, -64, 64, 64, 64, 64, -64, -64, 64, 64, 64, 64, 64, -64, 64, 64, 64, -64, -64, 64, 64, 64, 64, -64, -64, 64, 64, 64, 64, 64, 64, 64, 64, 64, -64, 64, -64, -64, 64, 64, -64, -64, 64, -64, 64, 64, -64, -64, 64, -64, 64, 64, 64, -64, 64, -64, -64, 64, 64, 64, 64, -64, 64, -64, 64, 64, 64, 64, 64, 64, 64, 64, -64, -64, 64, 64, -64, -64, -64, -64, 64, -64, 64, 64, 64, 64, 64, 64, -64, -64, 64, 64, -64, 64, 64, -64, 64, -64, 64, 64, 64, 64, 64, 64, 64, 64, -64, 64, 64, 64, 64, 64, -64, 64, 64, 64, 64, 64, -64, 64, 64, 64, -64, 64, 64, -64, -64, 64, -64, -64, 64, 64, 64, -64, 64, -64, -64, -64, 64, 64, -64, 64, 64, 64, 64, -64, 64, 64, 64, -64, 64, -64, 64, 64, 64, 64, 64, 64, 64, -64, 64, -64, -64, -64, -64, -64, 64, -64, 64, 64, 64, 64, 64, 64, 64, 64, -64, 64, 64, 64, -64, -64, 64, 64, -64, 64, 64, -64, 64, -64, -64, -64, -64, 64, 64, 64, -64, -64, 64, 64, 64, 64, -64, -64, 64, -64, -64, 64, -64, 64, 64, 64, -64, 64, 64, -64, 64, -64, -64, -64, -64, 64, -64, -64, -64, 64, -64, -64, 64, 64, 64, 64, 64, 64, 64, 64, 64, 64, 64, 64, -64, 64, -64, 64, -64, -64, 64, -64, -64, 64, -64, -64, 64, -64, 64, -64, 64, 64, 64, 64, 64, 64, 64, 64, 64, 64, 64, 64, 64, 64, -64, 64, -64, 64, 64, 64, -64, -64, 64, -64, -64, 64, 64, -64, 64, 64, -64, 64, 64, 64, -64, -64, 64, -64, -64, -64, -64, 64, 64, 64, 64, 64, 64, 64, 64, -64, 64, -64, -64, -64, -64, 64, -64, -64, 64, 64, -64, 64, 64, 64, -64, 64, 64, -64, 64, 64, 64, 64, -64, 64, -64, 64, -64, 64, -64, 64, -64, -64, 64, -64, -64, -64, 64, -64, 64, 64, -64, -64, 64, 64, -64, 64, 64, 64, -64, -64, 64, 64, -64, 64, 64, -64, -64, -64, -64, 64, 64, -64, 64, -64, -64, -64, 64, -64, 64, 64, -64, 64, 64, 64, 64, -64, 64, 64, 64, 64, 64, -64, 64, 64, 64, 64, 64, 64, 64, -64, 64, 64, -64, -64, 64, 64, 64, 64, 64, 64, 64, 64, 64, 64, 64, 64, 64, -64, 64, -64, -64, 64, 64, -64, 64, 64, 64, 64, 64, 64, -64, 64, 64, -64, 64, 64, -64, 64, 64, 64, 64, 64, -64, -64, 64, 64, 64, 64, 64, -64, -64, 64, -64, 64, 64, -64, 64, 64, -64, 64, -64, 64, -64, 64, -64, 64, -64, 64, 64, 64, 64, 64, -64, 64, 64, -64, 64, -64, -64, -64, 64, 64, -64, -64, 64, 64, 64, 64, 64, -64, -64, -64, 64, 64, 64, -64, 64, 64, -64, 64, 64, 64, -64, -64, -64, -64, 64, 64, 64, 64, -64, -64, 64, -64, 64, 64, 64, 64, 64, -64, -64, 64, -64, -64, 64, 64, -64, -64, 64, 64, 64, 64, -64, 64, -64, 64, 64, -64, 64, 64, 64, -64, 64, 64, 64, 64, -64, -64, -64, -64, 64, -64, 64, 64, -64, -64, -64, 64, -64, 64, -64, 64, -64, 64, -64, -64, 64, 64, -64, 64, 64, -64, -64, 64, -64, -64, 64, 64, 64, -64, -64, 64, 64, 64, 64, -64, -64, -64, 64, -64, 64, 64, -64, -64, 64, 64, 64, 64, 64, 64, 64, 64, -64, -64, 64, -64, 64, -64, -64, -64, -64, 64, 64, -64, 64, 64, 64, 64, 64, -64, -64, 64, -64, 64, -64, -64, 64, 64, 64, -64, -64, -64, -64, -64, -64, -64, 64, -64, -64, 64, -64, -64, 64, -64, -64, 64, -64, -64, -64, 64, 64, 64, 64, 64, -64, 64, -64, -64, 64, -64, 64, 64, -64, -64, 64, -64, -64, 64, -64, -64, 64, 64, -64, -64, -64, 64, -64, -64, -64, 64, -64, 64, 64, 64, -64, -64, -64, 64, 64, 64, 64, -64, -64, 64, 64, 64, 64, -64, -64, -64, -64, 64, -64, 64, 64, 64, -64, 64, 64, -64, 64, -64, 64, -64, -64, 64, -64, 64, -64, -64, 64, 64, 64, 64, 64, -64, -64, 64, 64, -64, -64, -64, 64, -64, -64, -64, 64, -64, 64, 64, -64, 64, 64, 64, 64, 64, 64, 64, 64, 64, 64, -64, -64, -64, 64, -64, -64, -64, 64, 64, -64, -64, -64, -64, 64, -64, -64, 64, -64, -64, 64, -64, -64, -64, 64, 64, -64, 64, 64, 64, 64, 64, -64, 64, 64, -64, -64, 64, -64, 64, -64, -64, 64, -64, 64, -64, -64, -64, 64, 64, -64, -64, -64, -64, -64, -64, 64, -64, -64, -64, 64, 64, 64, 64, 64, -64, -64, -64, -64, -64, -64, -64, 64, -64, -64, -64, -64, -64, -64, -64, -64, -64, 64, 64, 64, -64, -64, -64, 64, -64, -64, -64, -64, 64, -64, -64, -64, -64, -64, -64, -64, -64, -64, -64, -64, -64, -64, -64, -64, -64, -64, 64, 64, 64, -64, 64, -64, 64, -64, -64, 64, 64, 64, -64, -64, -64, -64, 64, -64, -64, -64, -64, 64, -64, -64, -64, -64, -64, -64, 64, 64, 64, 64, 64, 64, -64, 64, 64, -64, -64, -64, -64, -64, 64, -64, -64, -64, -64, -64, -64, -64, -64, -64, -64, -64, -64, -64, -64, -64, -64, 64, 64, 64, 64, -64, -64, 64, 64, -64, -64, -64, 64, 64, 64, -64, 64, -64, -64, 64, -64, -64, -64, -64, 64, -64, -64, 64, -64, 64, -64, -64, 64, -64, 64, 64, -64, -64, -64, -64, -64, 64, -64, -64, 64, -64, 64, -64, 64, -64, -64, -64, -64, -64, 64, -64, 64, -64, -64, 64, 64, -64, 64, -64, -64, -64, -64, -64, -64, 64, 64, -64, 64, 64, -64, -64, 64, -64, -64, 64, -64, 64, -64, 64, -64, -64, -64, -64, -64, -64, 64, -64, -64, -64, 64, -64, -64, 64, 64, -64, -64, -64, 64, 64, -64, -64, -64, 64, -64, -64, -64, -64, -64, -64, -64, -64, -64, -64, -64, -64, -64, -64, -64, -64, -64, -64, -64, -64, -64, -64, 64, -64, -64, -64, -64, -64, -64, -64, -64, -64, -64, -64, -64, -64, 64, -64, -64, -64, 64, -64, -64, -64, -64, -64, -64, -64, -64, -64, -64, -64, -64, -64, -64, 64, -64, -64, -64, -64, -64, 64, -64, 64, 64, -64, 64, 64, -64, 64, -64, -64, -64, -64, -64, 64, 64, -64, -64, -64, -64, 64, -64, -64, -64, -64, -64, -64, -64, -64, 64, 64, -64, -64, 64, -64, -64, 64, -64, -64, 64, -64, -64, -64, -64, 64, 64, 64, -64, -64, -64, -64, -64, -64, -64, -64, -64, -64, 64, -64, 64, 64, 64, -64, -64, -64, -64, -64, -64, -64, 64, -64, 64, -64, 64, -64, -64, 64, -64, -64, 64, -64, -64, -64, -64, -64, -64, 64, 64, -64, -64, -64, 64, 64, -64, -64, 64, -64, -64, 64, -64, -64, -64, -64, 64, 64, 64, 64, 64, 64, 64, 64, 64, -64, 64, -64, -64, 64, -64, -64, 64, -64, -64, -64, 64, 64, -64, -64, -64, -64, -64, 64, -64, -64, -64, -64, 64, -64, 64, 64, 64, 64, -64, 64, -64, -64, -64, 64, 64, 64, -64, 64, -64, 64, 64, -64, -64, -64, -64, -64, 64, -64, 64, 64, 64, 64, 64, -64, -64, -64, 64, -64, -64, -64, -64, -64, -64, 64, 64, 64, -64, -64, -64, -64, -64, 64, 64, 64, -64, 64, -64, 64, -64, 64, 64, 64, 64, -64, -64, 64, -64, 64, -64, -64, 64, 64, -64, -64, 64, 64, -64, 64, 64, 64, 64, -64, -64, -64, 64, -64, -64, -64, 64, -64, -64, -64, 64, 64, -64, 64, -64, 64, 64, -64, 64, 64, 64, -64, 64, 64, 64, 64, 64, 64, -64, 64, 64, -64, 64, -64, -64, -64, -64, -64, 64, -64, -64, 64, 64, -64, 64, -64, 64, -64, -64, 64, -64, 64, 64, -64, -64, -64, -64, 64, -64, 64, 64, 64, 64, -64, 64, -64, 64, 64, -64, -64, -64, -64, -64, 64, -64, 64, 64, -64, 64, 64, -64, 64, -64, -64, 64, 64, 64, -64, 64, 64, 64, -64, 64, -64, -64, -64, -64, 64, -64, -64, -64, 64, 64, -64, -64, -64, -64, -64, 64, -64, -64, -64, 64, -64, -64, -64, -64, -64, -64, -64, -64, -64, 64, -64, -64, 64, -64, -64, 64, -64, 64, -64, -64, -64, -64, -64, -64, -64, -64, -64, -64, -64, -64, -64, 64, 64, -64, -64, 64, 64, -64, 64, -64, -64, -64, -64, -64, -64, -64, 64, -64, 64, -64, -64, -64, -64, -64, -64, -64, -64, 64, 64, 64, 64, 64, 64, 64, 64, -64, 64, 64, 64, -64, 64, 64, -64, -64, -64, -64, -64, -64, -64, -64, 64, -64, -64, 64, -64, -64, 64, 64, -64, -64, 64, 64, 64, -64, -64, -64, -64, -64, 64, 64, -64, -64, -64, 64, 64, 64, 64, -64, -64, -64, -64, 64, -64, -64, 64, -64, -64, 64, 64, 64, 64, 64, -64, 64, 64, 64, 64, -64, -64, -64, -64, 64, -64, -64, -64, 64, -64, 64, 64, -64, 64, 64, 64, -64, 64, 64, -64, -64, -64, 64, -64, 64, -64, -64, 64, 64, 64, -64, -64, 64, -64, -64, -64, 64, 64, 64, -64, -64, 64, 64, 64, 64, 64, 64, 64, -64, -64, 64, -64, -64, 64, -64, 64, 64, -64, -64, -64, -64, 64, 64, 64, 64, 64, 64, 64, -64, 64, 64, 64, 64, 64, 64, 64, -64, 64, 64, 64, -64, 64, 64, 64, 64, 64, 64, -64, 64, 64, 64, 64, 64, 64, -64, -64, -64, 64, 64, 64, 64, -64, -64, 64, 64, -64, 64, -64, -64, 64, -64, 64, 64, 64, -64, 64, -64, 64, -64, -64, 64, -64, -64, -64, -64, 64, 64, 64, 64, 64, -64, -64, -64, -64, 64, -64, 64, -64, 64, -64, 64, 64, -64, -64, -64, 64, -64, -64, -64, -64, -64, -64, -64, -64, 64, 64, -64, -64, -64, -64, -64, -64, -64, 64, 64, 64, 64, 64, -64, -64, -64, -64, 64, 64, -64, 64, 64, -64, -64, -64, -64, -64, 64, -64, -64, -64, -64, -64, -64, -64, -64, -64, 64, -64, 64, 64, -64, -64, -64, -64, -64, -64, -64, 64, -64, -64, -64, -64, -64, 64, -64, 64, 64, -64, -64, -64, -64, -64, -64, 64, -64, 64, 64, -64, 64, 64, -64, 64, 64, -64, 64, -64, -64, 64, -64, -64, -64, 64, 64, 64, 64, 64, -64, -64, -64, 64, -64, 64, -64, -64, 64, -64, 64, -64, 64, 64, 64, 64, 64, -64, -64, -64, -64, -64, 64, 64, 64, 64, 64, 64, -64, -64, -64, -64, -64, 64, 64, 64, 64, -64, 64, -64, 64, 64, 64, 64, -64, 64, -64, 64, -64, -64, 64, 64, 64, 64, 64, 64, -64, -64, -64, -64, -64, 64, 64, 64, -64, 64, 64, 64, 64, 64, -64, 64, -64, -64, -64, -64, -64, 64, 64, 64, 64, 64, 64, -64, -64, -64, -64, -64, -64, 64, -64, -64, -64, 64, 64, 64, 64, 64, -64, 64, -64, -64, -64, -64, -64, 64, 64, 64, 64, -64, -64, -64, -64, -64, -64, -64, -64, 64, -64, 64, 64, 64, 64, 64, 64, 64, 64, 64, -64, -64, -64, -64, 64, 64, 64, -64, 64, 64, -64, -64, -64, -64, -64, -64, 64, -64, 64, -64, 64, -64, 64, 64, 64, 64, 64, 64, -64, -64, -64, -64, 64, 64, 64, 64, 64, 64, 64, -64, -64, -64, -64, -64, 64, 64, -64, -64, 64, 64, 64, 64, 64, 64, 64, -64, 64, -64, 64, 64, -64, 64, 64, 64, 64, 64, -64, -64, -64, -64, 64, -64, -64, 64, -64, 64, 64, 64, 64, -64, 64, 64, -64, 64, -64, 64, 64, -64, 64, 64, 64, 64, 64, 64, -64, -64, -64, 64, 64, -64, 64, 64, 64, -64, -64, -64, 64, 64, -64, 64, 64, -64, -64, 64, -64, -64, -64, -64, 64, 64, -64, 64, -64, 64, -64, 64, 64, 64, 64, -64, -64, 64, 64, 64, 64, -64, -64, -64, -64, -64, 64, 64, -64, 64, -64, 64, 64, 64, 64, -64, -64, 64, 64, 64, 64, 64, -64, 64, 64, 64, -64, 64, -64, 64, 64, -64, -64, -64, -64, 64, -64, -64, -64, -64, -64, -64, -64, -64, -64, -64, 64, 64, 64, 64, 64, -64, 64, -64, -64, -64, 64, 64, -64, -64, -64, -64, -64, -64, -64, -64, -64, -64, 64, -64, 64, -64, -64, -64, -64, -64, 64, -64, -64, -64, -64, 64, -64, -64, -64, 64, -64, 64, -64, -64, 64, 64, -64, 64, 64, -64, 64, 64, 64, 64, -64, -64, -64, 64, -64, -64, 64, 64, 64, -64, 64, 64, 64, 64, 64, -64, -64, -64, -64, 64, 64, 64, 64, -64, 64, 64, -64, -64, 64, 64, -64, -64, 64, -64, 64, -64, -64, 64, -64, -64, -64, -64, 64, -64, 64, 64, -64, 64, -64, 64, 64, -64, -64, -64, -64, 64, 64, 64, 64, -64, 64, 64, 64, -64, -64, -64, 64, -64, 64, -64, -64, -64, -64, 64, 64, 64, -64, 64, 64, -64, -64, -64, -64, -64, -64, -64, -64, 64, 64, 64, 64, 64, 64, 64, 64, -64, 64, -64, 64, 64, 64, 64, 64, -64, 64, 64, -64, -64, -64, -64, -64, -64, -64, 64, -64, -64, -64, 64, 64, -64, -64, -64, -64, 64, 64, -64, 64, -64, -64, -64, -64, -64, -64, -64, -64, -64, -64, -64, -64, -64, -64, -64, -64, -64, -64, -64, -64, 64, -64, -64, -64, -64, -64, -64, 64, -64, -64, -64, -64, 64, 64, -64, -64, -64, -64, -64, -64, 64, 64, -64, -64, -64, -64, -64, -64, 64, -64, -64, 64, 64, 64, -64, 64, 64, 64, -64, 64, 64, -64, -64, -64, -64, -64, -64, -64, 64, -64, -64, -64, -64, -64, -64, 64, -64, -64, -64, -64, 64, 64, 64, 64, 64, -64, -64, 64, -64, 64, -64, -64, -64, -64, 64, -64, 64, 64, -64, -64, -64, -64, -64, 64, 64, 64, -64, -64, 64, 64, 64, 64, 64, -64, -64, -64, -64, -64, -64, 64, 64, 64, -64, -64, -64, 64, 64, -64, -64, 64, -64, -64, -64, -64, -64, 64, -64, 64, 64, -64, -64, 64, -64, -64, -64, -64, 64, 64, 64, -64, -64, 64, 64, 64, 64, -64, 64, -64, -64, -64, -64, -64, 64, 64, 64, 64, -64, -64, -64, -64, -64, -64, -64, -64, -64, 64, 64, 64, -64, -64, 64, 64, 64, 64, 64, -64, -64, -64, -64, -64, -64, -64, -64, 64, 64, 64, 64, -64, -64, -64, -64, 64, 64, -64, -64, -64, -64, 64, 64, 64, 64, 64, -64, 64, -64, 64, 64, 64, 64, 64, 64, -64, 64, -64, -64, 64, -64, -64, -64, -64, 64, -64, -64, -64, -64, 64, -64, 64, 64, 64, -64, -64, 64, 64, -64, -64, -64, -64, 64, -64, -64, -64, -64, 64, -64, -64, -64, 64, 64, 64, -64, 64, 64, -64, -64, -64, -64, 64, 64, 64, 64, 64, 64, -64, 64, -64, -64, 64, -64, 64, 64, 64, -64, -64, 64, 64, 64, 64, -64, -64, 64, 64, 64, -64, 64, 64, 64, 64, 64, 64, -64, 64, -64, -64, 64, 64, 64, 64, 64, 64, 64, 64, 64, 64, 64, 64, 64, 64, -64, 64, -64, -64, -64, -64, 64, -64, -64, -64, -64, -64, -64, 64, -64, 64, 64, 64, 64, 64, 64, 64, 64, 64, -64, 64, -64, 64, 64, -64, 64, -64, 64, -64, 64, 64, -64, -64, 64, 64, -64, 64, 64, 64, -64, 64, -64, 64, 64, 64, 64, 64, 64, -64, 64, 64, 64, 64, -64, -64, 64, -64, -64, -64, -64, 64, -64, 64, 64, 64, -64, 64, 64, -64, -64, -64, -64, 64, 64, 64, 64, 64, -64, 64, 64, -64, -64, -64, -64, -64, -64, -64, -64, 64, -64, -64, -64, 64, -64, -64, 64, -64, -64, -64, -64, -64, -64, 64, 64, -64, -64, 64, 64, -64, -64, -64, -64, -64, -64, -64, -64, 64, -64, 64, -64, 64, -64, -64, 64, -64, -64, -64, -64, -64, -64, -64, -64, -64, -64, -64, 64, -64, -64, -64, 64, -64, 64, -64, -64, -64, -64, -64, -64, 64, -64, 64, -64, -64, -64, -64, -64, -64, -64, -64, -64, -64, -64, -64, -64, -64, -64, -64, -64, -64, -64, -64, 64, -64, -64, -64, 64, 64, 64, -64, -64, -64, -64, -64, 64, -64, -64, -64, -64, -64, -64, -64, -64, -64, -64, -64, -64, -64, -64, -64, -64, 64, -64, 64, 64, -64, 64, 64, -64, -64, -64, -64, -64, -64, -64, -64, -64, 64, -64, -64, 64, 64, -64, -64, -64, -64, -64, -64, -64, 64, 64, 64, -64, -64, 64, -64, -64, 64, 64, 64, -64, -64, -64, 64, 64, -64, -64, 64, 64, -64, -64, -64, -64, -64, 64, 64, -64, 64, 64, -64, -64, 64, -64, 64, 64, 64, 64, 64, 64, 64, 64, 64, 64, 64, -64, -64, -64, -64, -64, -64, -64, -64, -64, 64, -64, 64, 64, -64, 64, 64, 64, 64, 64, 64, -64, 64, 64, -64, 64, -64, -64, 64, 64, 64, 64, 64, -64, 64, -64, -64, -64, -64, -64, 64, -64, 64, 64, -64, 64, 64, 64, 64, -64, -64, -64, 64, 64, 64, 64, 64, 64, -64, -64, 64, -64, -64, -64, -64, 64, -64, 64, 64, 64, -64, -64, 64, 64, -64, 64, -64, -64, 64, 64, -64, -64, 64, -64, 64, 64, -64, -64, 64, -64, -64, 64, 64, 64, -64, 64, 64, -64, -64, 64, -64, 64, -64, -64, 64, -64, -64, 64, 64, -64, 64, 64, 64, 64, -64, 64, -64, 64, 64, -64, 64, -64, 64, -64, -64, -64, 64, -64, -64, 64, 64, -64, -64, -64, 64, -64, -64, 64, -64, 64, 64, 64, -64, -64, -64, 64, -64, 64, -64, -64, 64, -64, -64, -64, 64, 64, -64, -64, 64, 64, 64, -64, 64, 64, 64, -64, 64, -64, -64, 64, -64, -64, -64, 64, 64, 64, 64, 64, 64, -64, 64, 64, 64, -64, -64, -64, 64, 64, -64, 64, 64, 64, 64, -64, -64, -64, 64, 64, -64, -64, 64, 64, -64, -64, 64, 64, 64, -64, -64, -64, -64, 64, -64, 64, 64, -64, 64, 64, 64, 64, 64, 64, -64, -64, -64, -64, -64, -64, -64, 64, 64, -64, 64, -64, 64, 64, 64, 64, 64, -64, -64, -64, 64, -64, 64, 64, 64, -64, -64, -64, -64, -64, -64, -64, -64, -64, -64, -64, -64, -64, 64, -64, -64, 64, 64, 64, -64, -64, -64, 64, 64, 64, 64, -64, -64, -64, -64, -64, -64, -64, -64, -64, 64, -64, 64, -64, -64, -64, -64, -64, -64, 64, -64, 64, 64, 64, 64, 64, -64, -64, -64, -64, -64, -64, -64, -64, 64, 64, -64, -64, -64, 64, -64, -64, -64, -64, -64, -64, 64, 64, -64, -64, -64, 64, 64, 64, -64, -64, -64, -64, 64, -64, -64, -64, 64, -64, -64, -64, -64, -64, 64, -64, -64, 64, -64, -64, -64, -64, -64, 64, 64, 64, 64, -64, 64, -64, -64, 64, -64, -64, -64, -64, -64, -64, -64, 64, -64, 64, -64, -64, -64, -64, -64, -64, -64, -64, -64, -64, 64, 64, 64, 64, -64, 64, -64, -64, 64, -64, -64, -64, -64, -64, -64, 64, -64, 64, -64, -64, 64, -64, 64, -64, 64, 64, 64, -64, -64, 64, -64, 64, -64, -64, 64, -64, -64, -64, -64, -64, 64, -64, -64, -64, 64, 64, 64, -64, -64, -64, -64, -64, 64, -64, -64, -64, -64, -64, 64, -64, 64, -64, 64, -64, -64, -64, -64, -64, -64, -64, -64, 64, 64, 64, 64, -64, -64, -64, -64, -64, 64, 64, -64, 64, -64, -64, -64, -64, 64, 64, 64, 64, -64, 64, 64, 64, -64, -64, -64, -64, -64, 64, 64, 64, -64, -64, 64, -64, -64, -64, -64, -64, 64, 64, -64, -64, 64, 64, 64, 64, 64, -64, -64, 64, -64, -64, -64, 64, -64, 64, -64, 64, -64, 64, -64, -64, -64, -64, -64, -64, 64, 64, -64, 64, -64, 64, 64, -64, -64, -64, -64, -64, 64, 64, 64, 64, 64, -64, 64, 64, -64, -64, 64, -64, -64, 64, -64, -64, -64, -64, 64, 64, 64, 64, -64, -64, -64, -64, 64, -64, -64, -64, -64, 64, -64, 64, 64, -64, 64, 64, -64, -64, -64, -64, -64, -64, 64, 64, 64, -64, -64, 64, -64, -64, 64, 64, 64, 64, -64, -64, -64, -64, 64, 64, 64, -64, -64, 64, 64, 64, -64, -64, -64, -64, 64, 64, 64, 64, -64, -64, -64, -64, -64, -64, -64, -64, -64, -64, -64, 64, -64, -64, -64, -64, 64, -64, 64, -64, -64, -64, -64, -64, -64, -64, 64, 64, -64, -64, 64, -64, 64, 64, -64, -64, -64, -64, -64, 64, -64, -64, -64, -64, 64, -64, -64, -64, 64, -64, -64, -64, -64, 64, 64, 64, -64, -64, -64, -64, 64, 64, -64, -64, -64, 64, -64, 64, 64, 64, 64, 64, 64, 64, 64, -64, -64, -64, -64, -64, -64, -64, -64, 64, -64, 64, -64, -64, -64, -64, -64, -64, 64, -64, -64, -64, -64, -64, 64, 64, -64, -64, -64, 64, 64, -64, 64, 64, 64, 64, -64, 64, 64, 64, 64, 64, 64, -64, -64, -64, -64, -64, -64, -64, -64, -64, -64, -64, 64, 64, -64, 64, 64, 64, 64, 64, -64, 64, -64, -64, 64, 64, 64, 64, -64, 64, -64, -64, -64, -64, -64, -64, -64, -64, -64, 64, -64, -64, -64, 64, 64, 64, 64, -64, -64, 64, -64, -64, -64, -64, 64, 64, 64, 64, -64, 64, -64, -64, -64, -64, -64, -64, -64, -64, 64, -64, 64, 64, 64, 64, 64, -64, -64, -64, 64, 64, 64, -64, -64, 64, 64, 64, -64, 64, -64, -64, 64, 64, -64, 64, 64, 64, -64, 64, 64, 64, -64, -64, 64, -64, -64, -64, -64, -64, 64, 64, 64, -64, -64, 64, -64, -64, 64, 64, 64, -64, 64, 64, -64, -64, -64, 64, 64, -64, -64, -64, -64, -64, -64, 64, 64, 64, -64, -64, 64, -64, -64, 64, 64, -64, -64, 64, -64, 64, -64, 64, 64, 64, -64, -64, 64, 64, -64, 64, -64, -64, -64, 64, -64, -64, -64, -64, 64, 64, -64, -64, -64, 64, -64, -64, -64, 64, -64, -64, 64, 64, 64, -64, 64, 64, 64, 64, 64, 64, -64, 64, -64, 64, 64, -64, -64, -64, -64, 64, -64, 64, -64, 64, -64, 64, -64, 64, -64, 64, 64, -64, -64, -64, -64, -64, 64, -64, 64, 64, 64, -64, 64, 64, 64, -64, 64, -64, 64, 64, -64, 64, -64, 64, 64, 64, 64, 64, 64, 64, 64, -64, 64, 64, -64, 64, -64, 64, -64, 64, -64, -64, 64, -64, 64, 64, -64, 64, 64, 64, -64, -64, -64, -64, -64, -64, 64, 64, 64, 64, 64, 64, 64, 64, -64, -64, 64, 64, -64, -64, 64, 64, 64, 64, 64, 64, 64, 64, -64, -64, -64, 64, -64, -64, -64, 64, 64, 64, 64, 64, 64, 64, -64, -64, -64, 64, 64, 64, 64, 64, 64, 64, 64, 64, 64, 64, 64, -64, 64, -64, -64, -64, -64, -64, 64, 64, 64, 64, 64, -64, 64, 64, -64, 64, 64, 64, 64, 64, 64, 64, 64, 64, 64, 64, 64, 64, -64, -64, -64, -64, -64, -64, 64, 64, 64, 64, -64, 64, -64, -64, -64, 64, 64, 64, 64, 64, 64, -64, 64, 64, 64, 64, 64, -64, -64, -64, -64, -64, -64, -64, 64, 64, 64, -64, -64, -64, -64, -64, 64, 64, 64, 64, 64, -64, 64, 64, 64, 64, 64, -64, -64, -64, -64, 64, 64, -64, -64, -64, -64, 64, -64, -64, 64, -64, -64, 64, 64, 64, 64, 64, -64, -64, 64, 64, -64, -64, -64, 64, -64, 64, 64, 64, 64, -64, -64, -64, -64, -64, -64, 64, 64, -64, -64, -64, 64, 64, 64, 64, -64, -64, -64, 64, 64, -64, -64, -64, 64, 64, -64, 64, 64, 64, -64, -64, -64, -64, -64, -64, 64, -64, 64, -64, -64, 64, 64, 64, -64, -64, -64, 64, 64, 64, 64, 64, 64, -64, -64, 64, 64, 64, -64, -64, -64, -64, -64, -64, -64, 64, -64, -64, 64, -64, 64, 64, -64, -64, 64, -64, 64, 64, 64, 64, -64, -64, -64, 64, 64, 64, -64, -64, -64, -64, -64, -64, -64, -64, -64, -64, -64, 64, -64, 64, 64, 64, -64, -64, 64, -64, 64, 64, -64, -64, 64, 64, 64, 64, 64, 64, -64, -64, -64, -64, -64, -64, -64, -64, -64, 64, 64, 64, 64, -64, -64, -64, -64, -64, 64, -64, -64, -64, 64, 64, 64, 64, 64, 64, 64, 64, 64, -64, -64, -64, 64, -64, -64, 64, 64, 64, 64, 64, 64, -64, -64, -64, -64, -64, -64, 64, 64, 64, 64, 64, 64, 64, 64, 64, -64, 64, -64, 64, -64, 64, 64, -64, -64, 64, 64, 64, 64, -64, -64, -64, -64, -64, -64, 64, 64, 64, 64, 64, 64, 64, 64, 64, -64, -64, -64, -64, -64, 64, -64, 64, 64, -64, 64, -64, -64, -64, -64, -64, -64, -64, -64, -64, 64, -64, -64, 64, 64, 64, 64, 64, -64, -64, -64, 64, -64, 64, 64, -64, 64, -64, 64, -64, -64, -64, -64, -64, -64, -64, -64, 64, 64, 64, 64, 64, 64, -64, -64, -64, -64, -64, -64, -64, -64, 64, -64, -64, -64, 64, -64, 64, -64, 64, -64, -64, -64, 64, 64, 64, 64, 64, 64, 64, -64, -64, -64, -64, 64, -64, 64, -64, 64, 64, -64, 64, 64, 64, -64, -64, -64, -64, -64, -64, 64, 64, 64, 64, 64, 64, 64, 64, 64, -64, -64, -64, 64, 64, 64, 64, 64, -64, -64, 64, 64, 64, -64, -64, 64, 64, -64, -64, 64, 64, 64, 64, 64, 64, -64, 64, -64, -64, -64, -64, -64, 64, -64, 64, 64, 64, 64, 64, -64, 64, 64, 64, 64, -64, -64, -64, 64, 64, -64, 64, 64, 64, -64, -64, -64, -64, 64, -64, -64, -64, -64, 64, 64, -64, 64, -64, 64, 64, 64, 64, 64, 64, 64, 64, -64, 64, -64, 64, 64, -64, -64, 64, -64, -64, -64, -64, -64, -64, -64, -64, 64, 64, -64, 64, 64, 64, 64, 64, -64, -64, 64, -64, 64, 64, 64, 64, 64, -64, -64, -64, -64, -64, -64, -64, 64, -64, 64, -64, -64, -64, 64, 64, 64, -64, 64, -64, -64, 64, -64, -64, -64, 64, -64, -64, -64, -64, -64, -64, -64, -64, 64, 64, -64, -64, -64, -64, -64, 64, 64, 64, 64, -64, 64, -64, 64, -64, -64, -64, -64, 64, -64, -64, 64, 64, -64, 64, -64, 64, 64, -64, 64, -64, -64, 64, 64, -64, -64, 64, 64, 64, -64, 64, -64, 64, -64, -64, -64, 64, 64, -64, 64, 64, 64, -64, -64, -64, -64, -64, 64, 64, -64, -64, 64, -64, 64, -64, -64, 64, -64, 64, 64, -64, -64, -64, -64, 64, 64, -64, -64, -64, 64, 64, 64, -64, -64, -64, -64, 64, 64, 64, 64, -64, 64, 64, -64, 64, -64, -64, 64, -64, -64, -64, -64, -64, -64, -64, -64, -64, -64, 64, -64, -64, -64, -64, 64, 64, 64, -64, -64, 64, 64, 64, -64, 64, 64, 64, -64, -64, -64, -64, -64, -64, -64, -64, -64, -64, 64, 64, -64, 64, -64, -64, -64, -64, -64, 64, 64, 64, -64, 64, 64, -64, -64, 64, -64, -64, -64, -64, -64, -64, -64, -64, -64, -64, 64, -64, -64, -64, -64, 64, 64, 64, -64, 64, -64, -64, 64, 64, 64, -64, -64, 64, -64, -64, -64, 64, -64, -64, -64, -64, -64, -64, -64, -64, 64, -64, -64, -64, -64, -64, 64, -64, -64, -64, 64, -64, 64, 64, 64, 64, 64, 64, -64, 64, -64, 64, -64, -64, -64, 64, 64, -64, 64, 64, 64, 64, 64, 64, -64, 64, 64, 64, -64, -64, 64, 64, 64, -64, -64, -64, -64, -64, 64, -64, -64, -64, -64, 64, 64, 64, 64, -64, -64, -64, -64, -64, -64, 64, -64, 64, -64, -64, -64, -64, -64, 64, -64, -64, 64, 64, 64, 64, -64, 64, 64, 64, -64, -64, 64, 64, -64, -64, -64, 64, 64, 64, -64, -64, -64, -64, -64, 64, -64, 64, 64, 64, -64, 64, -64, -64, -64, -64, 64, 64, 64, -64, -64, 64, -64, 64, -64, 64, 64, 64, -64, -64, 64, -64, -64, -64, -64, 64, 64, 64, -64, 64, -64, -64, -64, -64, -64, -64, 64, -64, -64, -64, 64, 64, -64, 64, 64, 64, 64, -64, -64, 64, -64, -64, -64, -64, -64, 64, 64, -64, -64, -64, -64, -64, -64, 64, -64, 64, 64, 64, 64, 64, 64, 64, 64, 64, 64, -64, -64, -64, -64, 64, -64, -64, 64, 64, 64, -64, 64, 64, 64, 64, 64, 64, 64, -64, -64, -64, -64, -64, 64, 64, 64, -64, 64, 64, -64, 64, -64, 64, 64, -64, -64, 64, 64, 64, 64, 64, 64, 64, 64, 64, -64, -64, -64, 64, -64, 64, -64, -64, -64, -64, 64, -64, -64, 64, -64, -64, 64, -64, -64, 64, 64, 64, 64, 64, 64, 64, 64, 64, 64, -64, -64, -64, -64, -64, -64, -64, -64, -64, 64, -64, 64, 64, 64, -64, -64, -64, -64, 64, 64, 64, 64, 64, 64, 64, 64, 64, 64, -64, -64, -64, -64, -64, -64, 64, -64, -64, 64, -64, 64, 64, -64, -64, -64, -64, -64, 64, 64, 64, 64, 64, 64, 64, 64, 64, 64, -64, -64, -64, -64, -64, 64, 64, -64, -64, 64, -64, 64, 64, -64, -64, -64, -64, -64, -64, -64, -64, 64, -64, 64, -64, 64, -64, -64, -64, -64, -64, -64, -64, -64, -64, 64, -64, 64, -64, -64, 64, 64, -64, -64, -64, -64, -64, -64, -64, -64, -64, -64, -64, -64, -64, -64, 64, -64, 64, 64, -64, -64, -64, 64, -64, -64, 64, 64, 64, 64, -64, -64, -64, -64, -64, -64, -64, -64, -64, -64, -64, 64, -64, 64, -64, 64, 64, 64, -64, -64, -64, -64, -64, -64, -64, 64, -64, 64, 64, 64, -64, -64, -64, -64, -64, -64, -64, -64, -64, 64, -64, 64, 64, -64, 64, -64, -64, 64, -64, -64, 64, -64, 64, -64, -64, 64, 64, 64, 64, -64, -64, -64, 64, -64, -64, 64, 64, 64, 64, -64, -64, 64, -64, -64, -64, 64, 64, 64, 64, 64, 64, -64, 64, 64, 64, -64, -64, 64, 64, 64, 64, 64, 64, 64, -64, -64, -64, -64, 64, -64, 64, -64, -64, -64, -64, -64, 64, -64, 64, -64, 64, 64, 64, 64, 64, -64, 64, 64, 64, 64, 64, 64, 64, -64, -64, 64, -64, -64, 64, -64, -64, -64, -64, -64, -64, -64, 64, 64, 64, 64, 64, -64, 64, 64, 64, 64, 64, 64, -64, 64, -64, -64, -64, -64, 64, 64, 64, 64, 64, -64, -64, -64, -64, 64, -64, -64, 64, 64, 64, 64, 64, 64, 64, -64, 64, 64, 64, 64, 64, 64, -64, -64, 64, -64, -64, -64, -64, 64, 64, -64, 64, 64, -64, 64, 64, 64, -64, 64, 64, 64, 64, -64, 64, 64, 64, -64, -64, -64, -64, -64, 64, -64, -64, -64, 64, 64, -64, -64, -64, 64, -64, -64, 64, 64, -64, -64, 64, -64, -64, -64, -64, 64, -64, -64, -64, 64, -64, 64, -64, 64, -64, -64, -64, 64, 64, 64, -64, -64, -64, 64, -64, -64, 64, 64, 64, 64, -64, -64, -64, -64, -64, 64, -64, -64, -64, 64, 64, 64, 64, 64, 64, 64, -64, 64, 64, 64, -64, -64, -64, -64, 64, -64, -64, 64, 64, 64, 64, -64, 64, -64, -64, -64, -64, 64, -64, -64, -64, -64, 64, 64, -64, 64, -64, -64, -64, -64, 64, -64, -64, 64, -64, -64, 64, 64, -64, -64, -64, 64, -64, 64, -64, 64, 64, 64, -64, -64, -64, 64, 64, -64, 64, 64, 64, -64, 64, 64, -64, -64, -64, 64, -64, 64, -64, 64, -64, -64, -64, -64, -64, -64, 64, 64, 64, 64, 64, 64, 64, -64, -64, 64, 64, 64, 64, 64, 64, -64, -64, -64, -64, -64, -64, -64, 64, 64, 64, 64, 64, 64, -64, 64, 64, 64, 64, 64, 64, 64, 64, -64, 64, -64, 64, 64, -64, -64, -64, -64, -64, -64, -64, -64, -64, 64, 64, 64, 64, 64, 64, 64, 64, 64, 64, 64, -64, -64, 64, -64, 64, -64, 64, 64, -64, -64, -64, -64, -64, -64, -64, -64, 64, 64, 64, -64, 64, 64, 64, 64, 64, 64, 64, -64, 64, 64, 64, 64, 64, 64, 64, 64, 64, 64, 64, -64, -64, -64, -64, -64, 64, 64, -64, 64, 64, -64, 64, -64, -64, 64, 64, 64, 64, 64, 64, -64, -64, -64, 64, 64, 64, -64, 64, 64, 64, -64, 64, 64, 64, 64, 64, 64, 64, 64, 64, 64, 64, 64, 64, 64, 64, 64, -64, 64, -64, 64, 64, 64, 64, 64, 64, 64, 64, 64, 64, 64, 64, 64, 64, 64, 64, -64, -64, 64, -64, 64, 64, 64, 64, 64, -64, 64, 64, -64, 64, 64, 64, 64, 64, 64, 64, 64, 64, 64, 64, 64, 64, 64, -64, 64, 64, 64, 64, 64, 64, 64, 64, 64, 64, 64, -64, -64, 64, 64, 64, 64, 64, -64, 64, -64, -64, 64, -64, 64, 64, 64, 64, -64, 64, -64, -64, 64, 64, 64, 64, 64, 64, 64, 64, -64, 64, 64, 64, -64, 64, 64, -64, 64, 64, 64, -64, -64, 64, 64, 64, 64, -64, -64, 64, 64, -64, 64, -64, 64, 64, 64, -64, -64, -64, -64, 64, 64, 64, -64, 64, 64, 64, -64, 64, -64, 64, 64, 64, -64, 64, 64, 64, 64, -64, 64, -64, -64, -64, 64, -64, -64, -64, -64, 64, 64, 64, 64, 64, -64, -64, 64, -64, 64, 64, -64, 64, 64, 64, 64, 64, -64, 64, 64, -64, -64, -64, 64, 64, -64, 64, -64, 64, 64, 64, 64, 64, -64, -64, -64, -64, 64, -64, 64, 64, 64, 64, 64, -64, 64, -64, -64, -64, -64, 64, -64, -64, -64, -64, 64, 64, -64, 64, -64, -64, -64, -64, -64, -64, 64, -64, 64, -64, -64, 64, 64, -64, -64, -64, -64, -64, -64, -64, -64, 64, -64, 64, 64, 64, 64, 64, 64, -64, 64, -64, -64, -64, -64, 64, -64, 64, 64, 64, 64, -64, -64, 64, -64, 64, -64, -64, 64, 64, 64, 64, -64, -64, -64, -64, -64, 64, 64, -64, -64, 64, 64, -64, 64, 64, 64, -64, 64, 64, 64, 64, 64, 64, 64, -64, 64, 64, 64, 64, 64, -64, 64, 64, -64, 64, 64, -64, -64, -64, -64, 64, 64, 64, -64, 64, 64, 64, 64, -64, -64, 64, 64, 64, -64, -64, -64, -64, -64, -64, 64, 64, 64, 64, 64, 64, 64, 64, 64, 64, 64, 64, 64, -64, 64, 64, -64, 64, -64, -64, 64, 64, -64, 64, -64, -64, 64, 64, 64, -64, -64, 64, 64, 64, -64, 64, 64, 64, 64, 64, 64, 64, 64, 64, 64, -64, -64, 64, 64, 64, 64, -64, -64, 64, -64, -64, 64, -64, 64, 64, 64, 64, 64, 64, 64, 64, 64, 64, -64, 64, 64, -64, 64, -64, -64, 64, 64, -64, -64, -64, 64, 64, -64, -64, -64, -64, 64, -64, -64, 64, -64, 64, 64, 64, -64, 64, -64, 64, -64, -64, -64, -64, -64, -64, 64, -64, 64, -64, -64, 64, 64, -64, -64, 64, -64, -64, -64, 64, 64, -64, -64, 64, 64, -64, -64, 64, 64, 64, 64, -64, -64, -64, -64, -64, -64, -64, -64, -64, 64, -64, 64, -64, 64, 64, 64, -64, -64, 64, 64, 64, -64, 64, 64, 64, 64, 64, -64, -64, 64, -64, -64, 64, 64, 64, -64, -64, -64, -64, 64, 64, -64, 64, 64, -64, 64, 64, -64, 64, 64, 64, -64, 64, 64, -64, 64, 64, 64, 64, -64, 64, 64, -64, 64, 64, 64, -64, 64, 64, -64, 64, 64, 64, -64, 64, 64, -64, -64, -64, -64, -64, 64, -64, 64, -64, 64, -64, -64, 64, -64, -64, -64, -64, 64, -64, 64, 64, -64, 64, 64, -64, -64, 64, 64, 64, 64, -64, -64, 64, -64, 64, 64, 64, 64, -64, 64, 64, 64, -64, -64, -64, 64, -64, 64, 64, -64, -64, -64, 64, 64, 64, -64, -64, 64, -64, -64, -64, -64, 64, 64, -64, 64, -64, 64, -64, -64, 64, 64, 64, -64, 64, -64, 64, -64, -64, 64, -64, 64, -64, 64, 64, -64, -64, 64, 64, -64, -64, 64, -64, 64, -64, -64, 64, 64, -64, 64, 64, -64, -64, -64, 64, -64, 64, 64, 64, 64, 64, 64, 64, -64, 64, -64, -64, -64, -64, -64, 64, 64, -64, 64, -64, -64, -64, 64, -64, 64, 64, 64, 64, -64, 64, -64, 64, -64, -64, 64, 64, -64, -64, 64, 64, 64, 64, 64, 64, 64, 64, 64, -64, -64, -64, 64, -64, 64, -64, 64, 64, 64, 64, 64, 64, -64, -64, 64, -64, -64, 64, 64, 64, 64, 64, 64, 64, 64, 64, 64, 64, 64, -64, 64, 64, 64, 64, -64, -64, -64, 64, 64, 64, 64, -64, 64, 64, -64, 64, 64, 64, -64, -64, -64, 64, 64, -64, 64, 64, 64, -64, -64, -64, -64, -64, 64, -64, 64, 64, 64, 64, 64, 64, -64, 64, 64, -64, 64, -64, 64, -64, -64, 64, 64, -64, 64, 64, 64, 64, 64, -64, -64, -64, 64, 64, 64, 64, -64, 64, 64, -64, -64, 64, 64, 64, 64, 64, -64, -64, 64, -64, 64, -64, -64, 64, 64, -64, -64, -64, 64, 64, 64, -64, 64, 64, -64, -64, 64, -64, -64, 64, -64, 64, -64, 64, 64, 64, 64, 64, 64, 64, 64, 64, -64, -64, 64, -64, 64, -64, 64, -64, -64, 64, -64, 64, -64, 64, 64, -64, 64, 64, 64, 64, -64, -64, -64, 64, -64, 64, -64, -64, -64, 64, 64, -64, 64, 64, 64, 64, 64, 64, -64, -64, -64, 64, 64, 64, 64, -64, 64, 64, 64, 64, 64, -64, 64, 64, -64, 64, 64, -64, -64, -64, -64, -64, 64, -64, 64, 64, 64, 64, 64, -64, 64, -64, 64, -64, -64, 64, -64, 64, -64, 64, 64, 64, -64, 64, 64, 64, -64, -64, -64, 64, -64, 64, -64, 64, 64, 64, 64, 64, -64, -64, -64, 64, -64, -64, 64, 64, -64, 64, -64, -64, 64, -64, 64, -64, 64, -64, 64, 64, -64, -64, -64, 64, 64, 64, 64, -64, 64, 64, 64, 64, 64, 64, 64, 64, 64, 64, 64, 64, -64, -64, 64, -64, 64, 64, 64, 64, -64, -64, -64, 64, -64, -64, -64, 64, 64, 64, -64, -64, -64, 64, -64, -64, -64, 64, -64, -64, 64, 64, 64, 64, 64, 64, -64, -64, -64, -64, 64, 64, 64, -64, 64, 64, 64, 64, 64, 64, -64, -64, -64, 64, 64, 64, 64, 64, 64, 64, 64, -64, 64, -64, -64, 64, 64, 64, -64, 64, 64, 64, 64, 64, -64, 64, 64, 64, 64, 64, 64, 64, -64, 64, 64, -64, 64, 64, 64, -64, 64, 64, -64, 64, 64, -64, 64, 64, 64, 64, 64, -64, 64, -64, 64, 64, 64, -64, -64, 64, -64, 64, 64, 64, 64, 64, 64, 64, -64, -64, -64, 64, -64, 64, 64, 64, 64, -64, 64, 64, -64, -64, 64, -64, 64, 64, 64, -64, -64, 64, 64, -64, 64, 64, 64, 64, -64, -64, -64, -64, -64, 64, -64, 64, -64, -64, 64, 64, 64, 64, 64, 64, -64, 64, 64, 64, 64, 64, -64, -64, -64, 64, -64, 64, 64, -64, -64, 64, 64, 64, -64, 64, 64, 64, 64, -64, 64, 64, -64, 64, -64, 64, -64, 64, 64, -64, -64, 64, 64, -64, 64, -64, -64, -64, 64, 64, 64, 64, 64, -64, 64, -64, 64, -64, -64, 64, 64, 64, -64, 64, 64, -64, -64, -64, 64, -64, -64, 64, 64, -64, -64, 64, 64, 64, -64, -64, 64, -64, -64, -64, -64, 64, 64, 64, 64, 64, 64, 64, 64, -64, -64, 64, -64, -64, 64, 64, -64, -64, 64, -64, -64, 64, -64, 64, 64, 64, -64, -64, -64, -64, 64, 64, -64, 64, -64, -64, 64, -64, -64, 64, -64, -64, 64, 64, -64, 64, -64, -64, -64, 64, 64, 64, 64, 64, 64, 64, 64, 64, -64, -64, 64, -64, -64, -64, -64, 64, 64, 64, 64, 64, 64, 64, -64, 64, 64, -64, -64, -64, -64, -64, 64, -64, 64, 64, -64, 64, 64, -64, 64, -64, 64, -64, 64, -64, -64, -64, -64, -64, 64, 64, 64, 64, -64, 64, 64, 64, 64, -64, -64, -64, -64, -64, 64, 64, -64, 64, -64, 64, -64, -64, 64, 64, -64, 64, -64, -64, -64, 64, -64, 64, -64, -64, -64, 64, -64, -64, -64, 64, -64, -64, -64, -64, 64, -64, -64, 64, 64, 64, -64, 64, 64, -64, -64, -64, -64, 64, -64, 64, 64, -64, 64, 64, 64, 64, 64, -64, -64, -64, -64, -64, -64, 64, -64, 64, -64, -64, 64, 64, 64, -64, -64, 64, 64, 64, -64, -64, 64, 64, -64, 64, -64, -64, 64, -64, 64, 64, 64, 64, -64, -64, 64, 64, 64, -64, 64, 64, 64, -64, 64, -64, 64, -64, -64, -64, 64, 64, 64, 64, -64, 64, 64, 64, 64, 64, -64, 64, -64, 64, -64, 64, 64, 64, 64, 64, 64, 64, 64, 64, 64, 64, 64, 64, 64, -64, -64, -64, -64, -64, -64, 64, 64, 64, 64, 64, 64, 64, 64, -64, 64, 64, 64, 64, 64, 64, -64, 64, 64, -64, -64, -64, -64, 64, -64, 64, 64, 64, 64, 64, 64, 64, 64, 64, 64, -64, 64, 64, 64, 64, -64, -64, -64, 64, 64, -64, -64, 64, 64, -64, 64, 64, 64, 64, -64, 64, 64, 64, 64, 64, 64, -64, -64, 64, 64, 64, 64, 64, -64, -64, -64, 64, 64, -64, -64, -64, 64, -64, -64, -64, 64, 64, 64, -64, 64, 64, 64, 64, 64, -64, 64, -64, -64, -64, -64, 64, -64, 64, -64, 64, -64, -64, -64, 64, -64, 64, -64, 64, -64, 64, -64, -64, 64, -64, 64, -64, 64, -64, -64, 64, 64, -64, 64, -64, -64, 64, 64, -64, -64, -64, -64, -64, 64, -64, 64, 64, -64, -64, -64, 64, 64, 64, 64, 64, -64, -64, 64, 64, 64, -64, -64, 64, -64, 64, 64, -64, -64, 64, 64, -64, -64, -64, 64, 64, -64, -64, 64, 64, 64, -64, -64, -64, -64, -64, 64, 64, 64, 64, 64, 64, -64, 64, 64, 64, 64, -64, 64, -64, 64, -64, -64, -64, 64, 64, -64, 64, -64, -64, -64, 64, 64, -64, 64, 64, 64, 64, 64, 64, 64, 64, 64, 64, 64, 64, 64, 64, 64, 64, -64, 64, -64, 64, 64, 64, -64, 64, 64, -64, 64, -64, -64, -64, 64, 64, 64, 64, 64, 64, 64, 64, 64, 64, -64, 64, 64, -64, -64, 64, -64, 64, -64, 64, -64, 64, 64, -64, 64, -64, -64, -64, 64, 64, 64, 64, 64, -64, 64, 64, -64, 64, 64, -64, 64, -64, 64, -64, 64, -64, 64, -64, -64, 64, 64, -64, -64, -64, 64, -64, -64, -64, 64, 64, 64, 64, 64, -64, -64, -64, 64, 64, 64, -64, -64, 64, 64, 64, 64, 64, -64, -64, 64, 64, 64, -64, -64, 64, 64, -64, 64, 64, 64, 64, -64, -64, -64, 64, 64, -64, 64, 64, -64, -64, 64, 64, -64, -64, 64, 64, 64, 64, 64, 64, 64, 64, 64, 64, 64, 64, 64, 64, 64, -64, 64, -64, -64, -64, 64, 64, -64, 64, 64, 64, 64, -64, 64, 64, 64, 64, 64, 64, -64, 64, -64, 64, 64, -64, 64, 64, 64, 64, 64, 64, 64, 64, -64, -64, -64, 64, 64, -64, 64, 64, 64, -64, 64, 64, 64, 64, 64, 64, 64, 64, -64, -64, 64, 64, 64, 64, 64, 64, -64, -64, -64, -64, 64, 64, 64, -64, 64, -64, -64, -64, -64, -64, 64, 64, 64, -64, 64, 64, 64, -64, 64, 64, -64, 64, 64, 64, 64, -64, 64, -64, -64, 64, -64, 64, 64, 64, -64, -64, 64, 64, 64, 64, 64, 64, 64, -64, -64, -64, 64, 64, 64, -64, -64, 64, -64, 64, -64, -64, -64, -64, -64, 64, 64, 64, -64, 64, 64, 64, 64, 64, 64, -64, 64, -64, -64, -64, -64, -64, 64, 64, -64, -64, 64, -64, -64, -64, 64, -64, -64, -64, 64, -64, -64, -64, -64, -64, 64, 64, 64, 64, 64, -64, -64, 64, 64, 64, -64, -64, -64, 64, 64, -64, -64, 64, -64, 64, 64, -64, -64, -64, 64, -64, 64, -64, 64, 64, -64, -64, -64, -64, -64, -64, 64, 64, 64, 64, -64, -64, -64, 64, -64, 64, 64, -64, 64, 64, -64, -64, 64, -64, 64, 64, 64, 64, 64, 64, -64, -64, -64, -64, -64, -64, -64, 64, -64, 64, -64, 64, -64, 64, 64, -64, -64, 64, -64, 64, 64, -64, 64, 64, 64, 64, 64, -64, -64, -64, -64, -64, -64, -64, 64, -64, -64, -64, -64, -64, -64, -64, -64, -64, -64, 64, -64, 64, -64, 64, 64, 64, 64, -64, -64, -64, -64, -64, -64, 64, 64, -64, -64, 64, 64, -64, -64, 64, 64, -64, -64, 64, 64, 64, 64, -64, 64, -64, -64, -64, -64, -64, -64, -64, -64, 64, 64, 64, -64, -64, 64, 64, 64, 64, -64, -64, 64, -64, 64, 64, 64, -64, 64, -64, -64, -64, 64, -64, 64, 64, 64, 64, -64, -64, 64, 64, 64, 64, -64, 64, 64, 64, 64, -64, 64, 64, 64, 64, -64, 64, 64, 64, -64, -64, -64, -64, 64, 64, 64, 64, -64, 64, -64, 64, -64, -64, 64, 64, -64, 64, 64, -64, -64, -64, -64, 64, 64, 64, 64, -64, 64, 64, -64, 64, 64, 64, 64, -64, -64, -64, 64, 64, 64, -64, 64, -64, -64, 64, -64, -64, -64, -64, 64, -64, 64, -64, 64, -64, 64, 64, 64, -64, -64, -64, -64, -64, -64, -64, -64, 64, 64, 64, 64, -64, 64, -64, 64, 64, 64, 64, 64, -64, 64, 64, -64, -64, -64, -64, -64, -64, -64, -64, -64, 64, -64, 64, 64, 64, -64, -64, -64, -64, 64, -64, -64, 64, -64, 64, 64, -64, -64, -64, -64, -64, -64, -64, -64, 64, 64, 64, 64, -64, 64, 64, 64, 64, 64, 64, 64, 64, 64, 64, -64, 64, -64, 64, -64, -64, -64, -64, -64, -64, -64, -64, 64, 64, 64, 64, 64, 64, 64, 64, 64, 64, 64, -64, 64, 64, -64, 64, -64, -64, 64, 64, 64, -64, -64, -64, -64, 64, 64, -64, 64, 64, 64, -64, 64, -64, 64, 64, 64, 64, 64, 64, 64, 64, 64, -64, -64, -64, 64, 64, -64, 64, 64, 64, 64, 64, 64, 64, 64, 64, 64, -64, -64, 64, 64, 64, 64, 64, -64, 64, 64, 64, 64, 64, 64, 64, -64, 64, 64, -64, 64, -64, 64, 64, 64, 64, -64, 64, 64, -64, -64, -64, -64, 64, 64, 64, 64, 64, 64, 64, 64, 64, -64, 64, 64, -64, -64, -64, 64, 64, 64, 64, 64, 64, 64, -64, -64, 64, -64, -64, 64, 64, 64, 64, 64, 64, 64, 64, -64, -64, -64, -64, 64, 64, 64, 64, -64, 64, 64, 64, 64, 64, 64, -64, -64, 64, -64, -64, -64, 64, 64, 64, 64, 64, 64, 64, 64, 64, 64, 64, 64, -64, -64, 64, -64, 64, 64, 64, 64, 64, 64, 64, 64, -64, -64, -64, -64, 64, 64, 64, 64, 64, 64, 64, -64, -64, 64, 64, -64, -64, -64, 64, 64, 64, 64, 64, 64, 64, 64, -64, 64, 64, -64, 64, 64, -64, 64, 64, -64, 64, 64, 64, 64, 64, 64, 64, -64, 64, -64, 64, -64, -64, -64, 64, 64, 64, 64, 64, 64, 64, -64, 64, -64, 64, 64, 64, 64, 64, 64, 64, 64, -64, -64, 64, -64, 64, -64, -64, 64, 64, 64, 64, 64, 64, 64, 64, 64, 64, 64, 64, -64, -64, 64, -64, 64, 64, 64, 64, -64, 64, -64, -64, 64, -64, -64, -64, -64, -64, 64, 64, 64, 64, 64, 64, 64, 64, 64, -64, 64, 64, 64, 64, 64, -64, -64, 64, 64, 64, 64, 64, 64, 64, 64, 64, -64, 64, 64, 64, 64, 64, 64, 64, 64, 64, 64, 64, 64, 64, 64, 64, 64, 64, -64, 64, -64, -64, 64, 64, 64, 64, 64, 64, -64, 64, 64, 64, 64, 64, -64, 64, 64, -64, 64, 64, -64, 64, 64, 64, -64, -64, 64, -64, 64, 64, 64, 64, -64, -64, 64, 64, 64, 64, 64, 64, -64, 64, -64, -64, 64, 64, 64, -64, 64, 64, -64, 64, -64, -64, -64, -64, 64, 64, 64, -64, -64, 64, 64, 64, 64, 64, 64, -64, -64, -64, -64, -64, 64, 64, -64, 64, 64, 64, -64, 64, 64, 64, -64, -64, 64, 64, -64, 64, -64, -64, -64, 64, 64, 64, -64, 64, -64, 64, -64, 64, 64, 64, 64, 64, -64, -64, 64, 64, -64, 64, 64, -64, -64, 64, 64, -64, -64, -64, 64, -64, 64, 64, 64, 64, 64, 64, 64, 64, 64, 64, 64, -64, -64, -64, -64, 64, -64, -64, 64, -64, 64, 64, 64, -64, 64, 64, -64, -64, -64, -64, -64, 64, -64, 64, 64, 64, 64, 64, 64, 64, 64, 64, 64, 64, -64, -64, -64, 64, 64, 64, 64, 64, 64, 64, 64, 64, 64, 64, -64, 64, -64, 64, 64, -64, -64, -64, 64, 64, 64, -64, 64, 64, 64, 64, -64, -64, -64, -64, 64, 64, -64, -64, -64, -64, 64, -64, -64, 64, 64, -64, 64, 64, -64, -64, 64, 64, 64, -64, -64, 64, 64, -64, 64, -64, 64, 64, 64, -64, -64, -64, 64, 64, 64, 64, -64, -64, -64, -64, 64, 64, 64, -64, -64, -64, 64, -64, -64, 64, 64, 64, 64, -64, -64, 64, -64, 64, -64, 64, 64, -64, -64, -64, -64, 64, 64, -64, 64, -64, 64, -64, 64, -64, -64, -64, -64, 64, 64, -64, 64, -64, 64, 64, 64, -64, 64, 64, 64, -64, -64, -64, 64, -64, -64, 64, -64, 64, 64, 64, 64, -64, 64, -64, 64, -64, 64, 64, 64, 64, -64, -64, -64, -64, 64, 64, 64, 64, 64, 64, -64, 64, 64, -64, -64, 64, -64, 64, -64, 64, 64, -64, 64, 64, 64, -64, -64, -64, 64, -64, -64, 64, -64, 64, -64, 64, 64, 64, -64, -64, 64, -64, 64, 64, 64, 64, 64, 64, -64, -64, 64, 64, 64, 64, 64, -64, 64, -64, 64, 64, -64, -64, 64, -64, -64, -64, -64, -64, 64, 64, 64, 64, 64, 64, 64, 64, 64, -64, 64, -64, -64, -64, 64, -64, 64, 64, -64, -64, 64, 64, -64, -64, 64, 64, 64, -64, -64, 64, -64, 64, 64, 64, 64, -64, -64, -64, 64, -64, -64, -64, -64, -64, -64, -64, -64, 64, 64, 64, 64, -64, 64, 64, 64, -64, -64, -64, 64, 64, 64, 64, 64, 64, 64, 64, 64, 64, -64, -64, -64, 64, 64, -64, 64, 64, 64, -64, 64, -64, 64, 64, 64, 64, 64, 64, 64, 64, 64, 64, 64, 64, -64, 64, -64, -64, -64, -64, -64, 64, -64, -64, -64, 64, 64, 64, 64, -64, 64, 64, 64, 64, -64, 64, 64, 64, 64, -64, -64, -64, -64, -64, -64, -64, -64, -64, -64, 64, 64, -64, -64, 64, -64, -64, -64, 64, 64, 64, 64, 64, -64, -64, 64, 64, -64, -64, -64, -64, -64, -64, -64, -64, -64, -64, -64, 64, 64, 64, -64, 64, 64, -64, -64, -64, -64, 64, 64, 64, -64, 64, 64, 64, -64, -64, -64, -64, -64, -64, -64, -64, -64, -64, -64, 64, -64, -64, -64, -64, -64, 64, 64, 64, 64, 64, 64, -64, -64, 64, -64, -64, -64, -64, -64, -64, -64, -64, -64, 64, -64, -64, -64, 64, -64, 64, -64, 64, -64, -64, 64, 64, -64, 64, 64, -64, 64, -64, 64, -64, -64, -64, -64, -64, -64, 64, 64, 64, -64, -64, -64, 64, 64, 64, 64, 64, -64, 64, -64, -64, -64, 64, 64, 64, -64, -64, 64, -64, -64, -64, -64, -64, -64, -64, 64, -64, 64, -64, 64, 64, 64, 64, 64, 64, -64, -64, -64, 64, 64, -64, -64, 64, -64, -64, 64, -64, -64, -64, -64, -64, -64, -64, -64, 64, 64, 64, 64, 64, 64, 64, 64, 64, -64, 64, 64, -64, -64, -64, -64, -64, -64, -64, 64, -64, 64, 64, -64, 64, -64, -64, -64, -64, -64, -64, -64, -64, 64, -64, 64, 64, 64, -64, -64, 64, 64, -64, -64, -64, -64, 64, 64, -64, -64, -64, -64, 64, 64, 64, -64, -64, -64, -64, -64, 64, -64, 64, 64, 64, 64, 64, -64, -64, 64, -64, 64, 64, 64, 64, 64, -64, -64, 64, 64, -64, -64, 64, -64, 64, -64, -64, -64, 64, -64, -64, 64, 64, -64, 64, 64, -64, 64, -64, -64, 64, 64, 64, 64, -64, 64, -64, -64, 64, -64, -64, 64, -64, 64, 64, 64, 64, 64, -64, 64, -64, -64, -64, 64, -64, 64, 64, -64, -64, -64, 64, 64, 64, 64, -64, -64, -64, -64, -64, -64, 64, 64, 64, 64, 64, 64, 64, 64, -64, -64, 64, 64, 64, -64, 64, -64, -64, 64, 64, 64, 64, -64, 64, 64, -64, -64, -64, -64, -64, 64, 64, 64, 64, 64, 64, -64, 64, 64, -64, 64, -64, 64, 64, -64, -64, -64, -64, -64, -64, -64, 64, 64, 64, -64, -64, -64, 64, 64, 64, 64, 64, 64, 64, 64, -64, -64, 64, 64, -64, -64, 64, -64, -64, -64, -64, 64, -64, -64, 64, 64, -64, -64, -64, 64, 64, 64, 64, 64, 64, 64, -64, 64, -64, -64, 64, -64, -64, 64, 64, -64, -64, 64, -64, 64, 64, 64, 64, -64, -64, -64, -64, 64, -64, -64, -64, 64, 64, 64, -64, 64, -64, 64, -64, 64, -64, -64, -64, -64, -64, -64, -64, -64, 64, -64, -64, -64, -64, 64, -64, -64, -64, -64, 64, 64, -64, 64, 64, -64, -64, 64, 64, -64, 64, -64, -64, -64, -64, -64, -64, -64, -64, -64, -64, -64, 64, 64, -64, -64, 64, -64, 64, 64, 64, -64, -64, -64, 64, 64, -64, 64, 64, -64, -64, -64, -64, -64, -64, -64, -64, -64, -64, -64, -64, 64, 64, 64, 64, 64, 64, 64, 64, 64, 64, -64, 64, 64, -64, -64, -64, 64, 64, 64, -64, -64, -64, 64, -64, -64, -64, -64, -64, -64, -64, 64, -64, -64, 64, -64, -64, 64, 64, 64, 64, -64, 64, 64, 64, 64, -64, -64, -64, -64, -64, 64, 64, -64, -64, -64, -64, -64, -64, 64, 64, 64, 64, -64, 64, 64, 64, -64, 64, 64, -64, -64, 64, 64, -64, -64, -64, -64, -64, 64, 64, 64, 64, -64, -64, 64, -64, -64, 64, -64, -64, 64, -64, 64, -64, 64, 64, -64, -64, 64, 64, 64, 64, 64, 64, -64, -64, -64, -64, 64, 64, 64, -64, 64, 64, -64, -64, 64, -64, 64, 64, -64, -64, -64, -64, 64, 64, -64, 64, -64, 64, 64, -64, 64, -64, 64, 64, -64, 64, 64, 64, -64, -64, -64, -64, 64, -64, -64, 64, 64, -64, -64, 64, 64, 64, -64, 64, 64, 64, -64, -64, -64, 64, -64, 64, -64, 64, -64, -64, 64, -64, -64, -64, -64, 64, -64, 64, -64, -64, 64, -64, 64, 64, -64, -64, 64, 64, 64, 64, -64, -64, -64, 64, -64, -64, -64, 64, -64, -64, -64, -64, -64, -64, -64, -64, 64, -64, 64, -64, -64, 64, 64, 64, 64, 64, -64, -64, -64, -64, 64, -64, -64, -64, -64, -64, -64, 64, -64, -64, -64, -64, -64, -64, -64, -64, 64, -64, -64, 64, -64, -64, 64, 64, -64, 64, 64, 64, 64, -64, -64, -64, -64, -64, -64, -64, -64, -64, -64, -64, -64, -64, -64, -64, -64, -64, -64, -64, 64, 64, 64, -64, -64, -64, 64, 64, -64, -64, -64, 64, -64, -64, 64, 64, -64, -64, 64, 64, -64, -64, -64, 64, -64, 64, -64, 64, 64, 64, -64, -64, -64, 64, 64, 64, -64, -64, -64, 64, 64, 64, -64, 64, -64, -64, -64, 64, 64, 64, -64, -64, -64, 64, -64, 64, -64, 64, 64, 64, 64, 64, 64, 64, -64, 64, 64, 64, 64, 64, 64, 64, 64, -64, 64, 64, 64, -64, -64, 64, -64, -64, -64, -64, 64, 64, 64, 64, 64, 64, 64, 64, 64, 64, 64, 64, 64, 64, 64, 64, 64, 64, -64, 64, -64, -64, -64, -64, -64, -64, 64, -64, -64, 64, -64, 64, 64, 64, 64, 64, -64, 64, 64, 64, 64, 64, 64, 64, -64, -64, -64, 64, -64, -64, -64, -64, 64, 64, 64, -64, -64, 64, 64, 64, 64, 64, -64, -64, -64, 64, 64, -64, -64, -64, -64, -64, -64, -64, -64, -64, 64, -64, -64, -64, -64, -64, -64, 64, -64, -64, 64, 64, 64, -64, 64, 64, -64, 64, -64, -64, -64, -64, -64, 64, 64, 64, -64, -64, 64, -64, -64, 64, -64, -64, -64, -64, -64, -64, 64, 64, 64, -64, -64, 64, -64, -64, -64, -64, -64, -64, -64, -64, -64, -64, 64, 64, -64, 64, 64, -64, 64, -64, -64, 64, -64, 64, 64, 64, -64, -64, -64, -64, -64, -64, -64, -64, -64, -64, -64, 64, 64, -64, 64, 64, -64, -64, -64, -64, 64, 64, 64, 64, -64, -64, -64, -64, -64, -64, 64, -64, -64, -64, -64, -64, -64, -64, -64, 64, 64, 64, 64, 64, -64, -64, -64, -64, -64, -64, -64, -64, 64, 64, -64, -64, -64, -64, -64, -64, -64, -64, -64, -64, -64, 64, 64, 64, 64, -64, 64, -64, -64, -64, -64, -64, 64, -64, -64, -64, 64, -64, -64, -64, -64, -64, -64, -64, -64, -64, -64, 64, 64, 64, 64, 64, 64, -64, -64, -64, -64, -64, -64, -64, 64, -64, 64, -64, 64, -64, 64, 64, -64, -64, -64, -64, -64, -64, 64, -64, 64, 64, 64, 64, 64, -64, -64, -64, -64, 64, -64, -64, -64, -64, -64, -64, 64, 64, 64, -64, -64, -64, -64, -64, -64, -64, -64, -64, 64, -64, -64, 64, 64, -64, -64, -64, -64, -64, 64, 64, 64, 64, 64, 64, 64, -64, 64, 64, -64, 64, -64, -64, -64, -64, 64, 64, -64, -64, -64, 64, 64, 64, -64, -64, -64, 64, 64, 64, 64, -64, 64, -64, -64, -64, 64, 64, -64, -64, -64, -64, 64, -64, -64, -64, -64, -64, 64, -64, 64, 64, -64, -64, 64, 64, 64, 64, -64, -64, 64, 64, 64, 64, -64, 64, 64, -64, -64, -64, -64, -64, -64, -64, -64, 64, 64, 64, 64, 64, -64, -64, 64, 64, -64, 64, -64, -64, -64, -64, 64, -64, 64, -64, 64, -64, -64, -64, 64, 64, -64, -64, -64, -64, 64, 64, 64, 64, 64, -64, -64, 64, 64, 64, 64, -64, 64, -64, 64, -64, -64, 64, 64, 64, 64, 64, 64, 64, 64, -64, -64, 64, 64, 64, 64, 64, 64, -64, 64, -64, 64, 64, 64, 64, -64, 64, -64, 64, 64, -64, 64, -64, -64, 64, -64, 64, -64, -64, -64, 64, 64, 64, 64, 64, 64, 64, -64, 64, -64, 64, -64, 64, 64, 64, 64, -64, 64, 64, 64, -64, 64, -64, 64, 64, -64, -64, -64, -64, 64, -64, -64, 64, 64, 64, 64, -64, 64, 64, 64, 64, 64, 64, -64, -64, -64, 64, 64, -64, 64, 64, 64, 64, -64, 64, -64, -64, 64, -64, -64, -64, 64, -64, 64, -64, 64, 64, -64, 64, -64, 64, 64, 64, 64, -64, 64, -64, -64, 64, -64, 64, 64, -64, 64, 64, -64, 64, -64, -64, 64, -64, -64, -64, -64, 64, 64, 64, -64, 64, -64, -64, -64, -64, 64, -64, 64, 64, 64, 64, 64, -64, -64, -64, -64, 64, 64, 64, 64, -64, 64, 64, 64, -64, 64, -64, -64, -64, -64, -64, -64, -64, -64, -64, 64, 64, 64, -64, 64, -64, -64, -64, 64, 64, 64, 64, -64, -64, -64, -64, -64, 64, -64, 64, 64, -64, 64, 64, 64, 64, 64, -64, 64, -64, 64, -64, 64, -64, -64, -64, -64, 64, 64, 64, 64, -64, -64, -64, -64, 64, -64, -64, -64, 64, -64, 64, -64, -64, 64, 64, 64, -64, -64, 64, -64, -64, -64, -64, -64, 64, -64, -64, -64, 64, -64, -64, 64, -64, 64, 64, -64, 64, -64, -64, 64, 64, 64, 64, 64, -64, -64, 64, 64, 64, -64, -64, -64, -64, -64, -64, -64, 64, -64, -64, 64, -64, 64, 64, 64, 64, -64, 64, -64, -64, -64, -64, 64, -64, -64, 64, 64, -64, -64, -64, 64, -64, -64, -64, -64, 64, -64, -64, -64, -64, -64, -64, 64, -64, 64, 64, 64, 64, 64, -64, -64, -64, -64, -64, 64, -64, -64, -64, 64, -64, -64, -64, -64, -64, -64, -64, -64, -64, 64, 64, 64, 64, -64, 64, 64, 64, -64, 64, -64, -64, -64, -64, -64, 64, -64, 64, 64, -64, -64, -64, -64, -64, -64, -64, 64, 64, -64, -64, -64, 64, -64, 64, -64, -64, -64, 64, 64, -64, -64, -64, -64, -64, -64, 64, 64, -64, -64, -64, -64, -64, -64, 64, -64, 64, 64, -64, -64, -64, 64, -64, 64, -64, -64, -64, -64, -64, -64, -64, -64, 64, 64, 64, -64, -64, -64, -64, -64, -64, 64, 64, -64, -64, -64, -64, -64, -64, -64, 64, -64, -64, 64, -64, -64, -64, 64, -64, -64, -64, 64, 64, -64, -64, -64, -64, -64, -64, -64, -64, -64, -64, -64, -64, -64, -64, 64, -64, -64, -64, 64, -64, -64, -64, 64, -64, -64, 64, 64, -64, -64, -64, -64, -64, -64, -64, 64, -64, -64, 64, -64, 64, 64, 64, -64, 64, 64, 64, 64, -64, 64, -64, -64, -64, 64, 64, 64, -64, 64, -64, -64, -64, -64, -64, -64, -64, -64, 64, -64, 64, 64, 64, 64, -64, -64, 64, -64, -64, -64, -64, -64, -64, 64, 64, -64, 64, 64, -64, -64, -64, -64, -64, -64, -64, -64, -64, -64, 64, 64, -64, 64, -64, -64, -64, 64, -64, -64, -64, -64, -64, -64, 64, -64, -64, 64, -64, 64, -64, -64, -64, -64, -64, -64, -64, -64, 64, 64, 64, 64, -64, 64, -64, -64, -64, -64, -64, -64, -64, 64, -64, 64, 64, 64, 64, -64, -64, -64, -64, 64, -64, -64, -64, -64, 64, 64, 64, 64, -64, 64, -64, -64, -64, -64, -64, -64, -64, -64, 64, -64, -64, 64, -64, -64, -64, -64, -64, -64, 64, -64, -64, 64, -64, 64, -64, -64, -64, -64, 64, 64, -64, -64, -64, 64, -64, -64, 64, 64, -64, -64, 64, -64, -64, 64, -64, -64, 64, -64, 64, 64, 64, -64, -64, 64, 64, 64, -64, -64, -64, -64, -64, -64, 64, -64, 64, -64, -64, -64, -64, 64, -64, -64, 64, -64, -64, -64, -64, -64, 64, -64, 64, 64, 64, 64, -64, -64, -64, -64, -64, -64, -64, 64, -64, -64, -64, -64, -64, -64, 64, 64, -64, -64, -64, 64, -64, -64, 64, -64, 64, -64, -64, 64, -64, 64, -64, -64, -64, -64, 64, 64, 64, 64, -64, -64, -64, 64, -64, -64, -64, -64, -64, 64, -64, -64, -64, -64, 64, 64, -64, 64, 64, -64, 64, -64, -64, 64, -64, 64, -64, -64, -64, -64, 64, -64, -64, 64, 64, -64, -64, 64, 64, -64, -64, 64, 64, 64, 64, -64, -64, -64, 64, 64, -64, -64, -64, -64, -64, -64, -64, -64, -64, 64, -64, -64, -64, -64, 64, 64, -64, -64, 64, -64, 64, 64, -64, 64, -64, 64, -64, -64, -64, -64, 64, -64, -64, -64, -64, -64, 64, -64, -64, -64, 64, -64, -64, 64, -64, 64, 64, -64, 64, -64, -64, 64, 64, 64, -64, 64, 64, 64, -64, -64, 64, -64, -64, 64, -64, -64, 64, -64, -64, -64, 64, 64, 64, -64, 64, -64, 64, 64, 64, -64, -64, 64, 64, -64, -64, -64, -64, 64, 64, -64, 64, 64, -64, 64, -64, 64, 64, -64, 64, -64, -64, 64, -64, -64, 64, -64, 64, -64, -64, 64, -64, 64, 64, -64, -64, 64, 64, 64, -64, 64, -64, 64, -64, -64, -64, 64, 64, 64, 64, 64, -64, -64, 64, 64, 64, -64, 64, 64, -64, -64, 64, 64, 64, 64, 64, -64, 64, 64, 64, 64, 64, 64, -64, 64, 64, -64, -64, 64, -64, 64, 64, 64, -64, 64, -64, -64, -64, 64, -64, 64, 64, -64, -64, -64, 64, -64, -64, 64, 64, -64, 64, -64, -64, 64, -64, -64, -64, -64, -64, 64, -64, 64, -64, 64, -64, 64, 64, -64, 64, -64, 64, 64, 64, 64, -64, 64, 64, -64, 64, -64, 64, 64, 64, 64, 64, -64, -64, -64, -64, 64, -64, -64, 64, -64, 64, -64, 64, -64, 64, -64, -64, -64, -64, 64, -64, 64, -64, -64, 64, 64, -64, 64, 64, 64, 64, 64, -64, 64, 64, -64, -64, -64, 64, 64, 64, -64, -64, 64, -64, -64, -64, -64, -64, -64, -64, -64, -64, 64, -64, -64, -64, 64, 64, -64, -64, 64, -64, 64, -64, 64, -64, 64, 64, 64, -64, 64, -64, 64, -64, -64, -64, -64, 64, -64, 64, 64, 64, -64, -64, -64, 64, 64, 64, -64, 64, 64, 64, 64, 64, -64, 64, 64, -64, 64, -64, 64, -64, 64, -64, -64, -64, 64, -64, -64, 64, -64, 64, 64, 64, 64, 64, -64, 64, -64, -64, 64, 64, 64, -64, 64, -64, -64, 64, -64, -64, -64, 64, -64, -64, -64, -64, -64, 64, -64, -64, -64, 64, 64, -64, -64, -64, 64, -64, -64, -64, -64, -64, -64, -64, -64, -64, 64, -64, 64, -64, 64, -64, -64, 64, -64, -64, 64, 64, -64, 64, 64, -64, -64, -64, 64, -64, -64, -64, -64, -64, -64, -64, -64, -64, -64, 64, -64, -64, 64, -64, -64, -64, 64, -64, 64, -64, -64, -64, -64, 64, 64, -64, 64, -64, -64, 64, -64, 64, -64, -64, 64, -64, -64, -64, -64, -64, -64, -64, -64, 64, -64, -64, -64, -64, -64, -64, 64, -64, -64, 64, 64, -64, 64, -64, 64, -64, 64, 64, 64, 64, -64, 64, -64, -64, -64, 64, -64, -64, -64, -64, -64, 64, -64, -64, -64, 64, -64, -64, -64, -64, 64, -64, -64, 64, -64, -64, 64, 64, 64, -64, 64, 64, -64, 64, -64, -64, 64, -64, -64, -64, 64, -64, -64, -64, -64, -64, 64, -64, -64, -64, -64, -64, 64, -64, -64, 64, -64, -64, 64, -64, -64, -64, -64, -64, 64, -64, -64, 64, 64, -64, -64, 64, -64, 64, -64, -64, -64, -64, -64, 64, -64, -64, -64, 64, -64, -64, -64, -64, -64, -64, -64, -64, 64, 64, 64, 64, 64, -64, -64, 64, 64, -64, 64, -64, -64, 64, 64, -64, 64, 64, -64, -64, 64, -64, 64, -64, -64, -64, -64, 64, -64, -64, -64, -64, 64, 64, 64, -64, -64, 64, 64, 64, 64, -64, -64, -64, -64, 64, -64, -64, -64, -64, -64, -64, -64, 64, 64, -64, -64, 64, -64, 64, -64, 64, -64, 64, -64, -64, 64, -64, -64, 64, -64, 64, -64, -64, -64, 64, -64, -64, 64, 64, 64, -64, 64, -64, -64, -64, -64, -64, 64, -64, 64, -64, 64, 64, -64, -64, -64, -64, 64, -64, -64, 64, -64, -64, -64, -64, -64, -64, -64, -64, -64, -64, 64, 64, 64, -64, 64, -64, 64, -64, 64, 64, 64, 64, -64, -64, 64, -64, 64, -64, -64, -64, 64, -64, 64, -64, -64, -64, -64, 64, -64, -64, 64, -64, 64, -64, -64, -64, -64, -64, 64, 64, -64, -64, -64, -64, -64, -64, -64, -64, 64, -64, 64, -64, -64, -64, 64, 64, 64, -64, -64, 64, -64, -64, -64, -64, 64, -64, -64, -64, 64, 64, 64, -64, 64, -64, -64, 64, -64, -64, 64, -64, -64, -64, -64, 64, -64, -64, -64, 64, -64, -64, 64, -64, 64, -64, 64, -64, -64, -64, -64, -64, -64, -64, -64, -64, 64, 64, 64, 64, 64, 64, -64, 64, 64, -64, 64, 64, -64, 64, 64, -64, 64, 64, -64, 64, 64, 64, -64, -64, -64, -64, -64, 64, 64, 64, -64, 64, -64, -64, 64, 64, 64, 64, -64, 64, -64, -64, -64, 64, -64, -64, 64, -64, -64, 64, -64, 64, 64, -64, -64, -64, 64, -64, 64, -64, 64, -64, -64, -64, 64, 64, -64, 64, -64, -64, 64, -64, -64, -64, -64, -64, 64, -64, -64, -64, -64, 64, 64, -64, -64, -64, -64, 64, -64, -64, 64, 64, -64, -64, 64, -64, -64, -64, 64, -64, 64, 64, 64, 64, 64, -64, -64, 64, 64, -64, -64, -64, 64, -64, -64, 64, -64, 64, -64, 64, -64, 64, -64, -64, 64, -64, -64, 64, -64, -64, 64, -64, 64, 64, -64, 64, -64, -64, -64, -64, -64, -64, 64, -64, 64, -64, -64, -64, 64, -64, -64, 64, -64, 64, -64, 64, -64, -64, -64, -64, -64, -64, -64, 64, -64, -64, 64, 64, 64, 64, 64, 64, -64, 64, -64, -64, 64, -64, -64, -64, -64, -64, 64, 64, -64, 64, 64, 64, -64, 64, 64, 64, 64, -64, -64, -64, -64, 64, 64, 64, -64, 64, 64, 64, 64, 64, -64, 64, -64, -64, 64, 64, -64, -64, -64, -64, 64, 64, 64, -64, -64, -64, -64, -64, -64, -64, -64, 64, 64, -64, 64, 64, 64, 64, -64, 64, -64, -64, 64, 64, 64, 64, -64, 64, 64, 64, 64, -64, -64, 64, 64, -64, -64, -64, -64, -64, -64, 64, 64, 64, 64, 64, 64, -64, -64, -64, -64, -64, -64, -64, -64, 64, 64, -64, -64, 64, 64, 64, -64, -64, 64, -64, -64, -64, -64, -64, 64, 64, 64, 64, 64, -64, 64, 64, -64, 64, -64, -64, -64, -64, -64, -64, -64, -64, -64, 64, 64, 64, -64, -64, -64, -64, -64, -64, -64, 64, 64, 64, 64, 64, -64, -64, -64, 64, -64, -64, -64, -64, -64, -64, -64, -64, 64, -64, -64, 64, -64, -64, -64, -64, -64, -64, -64, 64, 64, 64, 64, 64, -64, -64, -64, 64, -64, 64, 64, 64, -64, -64, 64, 64, -64, 64, 64, -64, -64, -64, -64, -64, 64, 64, 64, 64, 64, 64, 64, 64, -64, -64, -64, 64, 64, 64, 64, 64, 64, 64, 64, 64, 64, 64, 64, 64, -64, -64, -64, -64, -64, -64, 64, 64, 64, 64, 64, 64, 64, 64, -64, -64, 64, -64, 64, 64, 64, 64, 64, 64, 64, 64, 64, 64, 64, -64, -64, -64, -64, -64, 64, 64, 64, 64, 64, 64, 64, 64, -64, 64, 64, 64, 64, 64, 64, 64, 64, 64, 64, 64, 64, 64, -64, -64, -64, -64, -64, -64, 64, 64, 64, 64, 64, 64, 64, -64, -64, -64, 64, 64, 64, 64, 64, 64, 64, 64, 64, 64, 64, 64, 64, 64, -64, -64, 64, -64, 64, -64, 64, 64, 64, 64, -64, 64, -64, 64, 64, 64, 64, 64, 64, 64, 64, 64, 64, 64, 64, 64, 64, 64, -64, 64, 64, -64, -64, 64, 64, 64, 64, 64, 64, -64, 64, -64, 64, 64, -64, -64, 64, -64, -64, 64, 64, -64, 64, 64, 64, 64, 64, 64, 64, -64, -64, -64, 64, 64, 64, 64, -64, 64, -64, 64, -64, -64, -64, -64, -64, -64, -64, 64, -64, 64, 64, 64, -64, -64, 64, 64, -64, -64, -64, -64, 64, 64, -64, -64, -64, 64, -64, -64, -64, 64, -64, -64, -64, -64, 64, -64, -64, -64, -64, 64, 64, 64, -64, -64, -64, -64, -64, 64, 64, -64, -64, 64, -64, 64, -64, -64, 64, -64, -64, -64, 64, -64, 64, -64, -64, 64, 64, 64, -64, -64, 64, -64, -64, 64, -64, 64, 64, 64, 64, -64, -64, -64, 64, 64, -64, -64, -64, -64, 64, -64, -64, 64, 64, 64, 64, -64, 64, 64, -64, -64, -64, -64, 64, 64, 64, -64, 64, -64, -64, -64, -64, -64, -64, -64, 64, -64, -64, 64, -64, -64, 64, 64, -64, 64, -64, 64, 64, -64, 64, 64, -64, 64, -64, -64, -64, 64, -64, -64, -64, 64, -64, -64, -64, -64, -64, 64, -64, 64, 64, 64, -64, -64, -64, 64, -64, 64, 64, -64, -64, -64, -64, -64, 64, -64, -64, -64, -64, 64, 64, -64, 64, -64, -64, 64, 64, -64, -64, -64, 64, -64, 64, 64, 64, 64, 64, 64, 64, 64, -64, -64, -64, -64, 64, 64, -64, -64, -64, -64, -64, 64, 64, -64, 64, 64, 64, 64, 64, 64, 64, 64, 64, 64, 64, 64, 64, 64, -64, -64, -64, 64, 64, -64, 64, -64, 64, -64, -64, -64, -64, -64, -64, 64, -64, -64, -64, 64, 64, 64, 64, 64, 64, 64, 64, 64, 64, -64, -64, 64, -64, -64, -64, 64, -64, -64, -64, -64, -64, 64, 64, 64, 64, -64, 64, 64, 64, 64, -64, 64, 64, 64, 64, 64, 64, 64, 64, -64, -64, -64, -64, -64, -64, -64, -64, -64, -64, 64, -64, -64, -64, -64, -64, 64, -64, 64, -64, 64, 64, 64, 64, -64, 64, 64, 64, -64, 64, -64, -64, -64, -64, -64, -64, -64, -64, -64, -64, -64, -64, 64, 64, -64, -64, 64, 64, 64, -64, 64, -64, 64, -64, -64, 64, 64, -64, -64, 64, -64, 64, -64, 64, -64, -64, -64, 64, -64, 64, 64, -64, 64, 64, 64, -64, 64, -64, 64, -64, -64, 64, 64, -64, -64, 64, 64, -64, 64, -64, -64, -64, 64, 64, 64, 64, -64, 64, 64, -64, 64, -64, -64, -64, 64, 64, -64, 64, 64, 64, 64, 64, 64, -64, -64, 64, -64, -64, 64, 64, -64, 64, 64, 64, -64, 64, -64, 64, 64, -64, 64, -64, -64, 64, 64, 64, 64, -64, 64, 64, -64, 64, -64, -64, -64, 64, -64, 64, -64, 64, -64, 64, 64, 64, 64, 64, -64, -64, -64, 64, -64, -64, -64, 64, 64, 64, 64, 64, -64, 64, 64, -64, -64, 64, -64, 64, 64, 64, 64, -64, -64, 64, 64, -64, -64, -64, -64, -64, -64, -64, -64, -64, 64, -64, 64, -64, -64, 64, -64, -64, -64, 64, 64, -64, 64, 64, 64, -64, 64, 64, 64, -64, -64, -64, -64, -64, -64, 64, 64, -64, 64, 64, 64, -64, -64, -64, -64, -64, -64, -64, 64, -64, 64, 64, 64, 64, -64, 64, 64, -64, 64, 64, -64, 64, -64, -64, -64, -64, 64, 64, 64, 64, 64, 64, 64, -64, -64, -64, 64, -64, 64, 64, 64, 64, 64, 64, -64, -64, 64, 64, -64, -64, -64, -64, -64, -64, -64, 64, 64, 64, 64, 64, 64, -64, -64, -64, 64, 64, -64, -64, -64, -64, 64, 64, -64, -64, -64, -64, -64, -64, -64, -64, -64, -64, 64, -64, -64, 64, 64, -64, 64, -64, 64, -64, 64, -64, -64, -64, -64, 64, 64, -64, -64, -64, -64, -64, -64, -64, -64, -64, -64, -64, -64, -64, 64, 64, 64, -64, 64, -64, 64, -64, 64, -64, -64, -64, 64, 64, -64, -64, -64, -64, -64, -64, -64, -64, -64, -64, -64, -64, -64, -64, -64, 64, 64, -64, 64, 64, -64, -64, 64, -64, -64, -64, -64, -64, -64, -64, -64, -64, -64, -64, -64, -64, -64, -64, -64, -64, -64, -64, -64, 64, 64, 64, 64, -64, -64, 64, 64, 64, -64, -64, -64, 64, 64, -64, -64, -64, -64, -64, -64, -64, -64, -64, -64, -64, 64, -64, -64, 64, 64, -64, -64, -64, -64, 64, 64, 64, -64, -64, 64, 64, -64, -64, 64, 64, 64, -64, -64, -64, -64, -64, 64, -64, -64, -64, -64, -64, -64, -64, 64, 64, 64, 64, 64, 64, -64, -64, 64, 64, -64, -64, 64, -64, 64, -64, -64, -64, 64, -64, 64, -64, -64, -64, -64, -64, 64, -64, 64, 64, 64, 64, -64, 64, 64, -64, 64, -64, -64, 64, 64, -64, 64, 64, -64, 64, 64, -64, -64, -64, -64, -64, -64, -64, 64, 64, 64, 64, -64, 64, -64, 64, -64, -64, -64, -64, 64, 64, 64, -64, -64, 64, -64, -64, -64, 64, 64, 64, -64, -64, -64, -64, 64, -64, -64, 64, -64, -64, 64, -64, -64, 64, -64, -64, -64, -64, -64, -64, -64, -64, -64, 64, -64, 64, 64, 64, -64, -64, -64, 64, -64, 64, -64, 64, 64, -64, 64, -64, -64, -64, -64, -64, -64, -64, 64, -64, -64, 64, 64, 64, 64, -64, -64, 64, -64, -64, -64, -64, 64, 64, 64, 64, -64, 64, 64, -64, -64, -64, -64, -64, -64, -64, 64, -64, -64, 64, 64, 64, 64, -64, -64, -64, -64, 64, -64, 64, 64, 64, 64, -64, -64, -64, 64, -64, 64, -64, -64, -64, -64, -64, -64, -64, -64, -64, 64, 64, 64, 64, 64, 64, 64, -64, -64, -64, 64, -64, -64, -64, -64, -64, -64, 64, 64, -64, 64, -64, -64, -64, -64, -64, -64, -64, 64, 64, -64, -64, -64, -64, 64, -64, 64, 64, 64, -64, 64, 64, -64, 64, -64, -64, -64, -64, 64, -64, -64, -64, -64, -64, -64, -64, 64, 64, 64, 64, -64, -64, 64, -64, 64, -64, 64, -64, -64, -64, 64, -64, -64, -64, -64, 64, -64, -64, -64, -64, -64, -64, -64, -64, 64, 64, 64, 64, 64, 64, 64, 64, 64, -64, -64, 64, -64, 64, 64, 64, -64, -64, -64, -64, -64, -64, 64, -64, -64, 64, -64, -64, -64, 64, 64, 64, 64, 64, 64, 64, 64, 64, -64, -64, -64, -64, -64, -64, -64, 64, -64, -64, -64, -64, -64, -64, -64, -64, -64, -64, -64, 64, 64, -64, 64, 64, -64, 64, -64, -64, -64, 64, -64, 64, 64, -64, -64, 64, 64, -64, -64, 64, -64, -64, -64, -64, 64, -64, 64, -64, 64, -64, -64, 64, -64, 64, -64, -64, 64, 64, 64, -64, 64, -64, 64, 64, -64, -64, -64, 64, -64, -64, -64, -64, 64, 64, 64, 64, 64, -64, 64, -64, 64, -64, 64, -64, -64, -64, -64, 64, -64, -64, -64, 64, -64, 64, 64, -64, 64, -64, 64, 64, 64, 64, 64, -64, 64, -64, -64, -64, 64, -64, 64, -64, 64, -64, 64, -64, -64, 64, -64, 64, -64, -64, 64, -64, 64, 64, -64, 64, 64, -64, -64, -64, 64, -64, -64, 64, -64, -64, -64, -64, 64, -64, 64, -64, 64, -64, 64, 64, 64, 64, 64, 64, 64, 64, 64, -64, 64, -64, -64, -64, 64, -64, -64, 64, -64, 64, -64, 64, -64, -64, -64, -64, 64, -64, 64, 64, 64, 64, -64, -64, -64, -64, -64, 64, 64, 64, -64, 64, 64, 64, 64, 64, 64, 64, -64, -64, -64, 64, 64, -64, -64, -64, 64, -64, -64, 64, 64, -64, -64, 64, -64, -64, 64, 64, 64, 64, 64, 64, 64, 64, 64, 64, 64, 64, 64, 64, -64, 64, 64, -64, 64, -64, -64, -64, -64, -64, -64, -64, -64, 64, -64, 64, 64, 64, 64, 64, 64, 64, 64, 64, -64, 64, 64, 64, -64, 64, -64, -64, -64, -64, -64, 64, -64, -64, -64, -64, -64, -64, -64, 64, 64, 64, 64, 64, 64, 64, 64, 64, 64, -64, 64, 64, -64, -64, 64, 64, -64, -64, -64, -64, -64, -64, -64, -64, -64, -64, -64, -64, 64, -64, 64, 64, 64, 64, 64, 64, 64, 64, 64, -64, 64, 64, 64, 64, -64, -64, -64, -64, -64, -64, -64, -64, 64, -64, 64, 64, 64, -64, 64, 64, 64, 64, 64, 64, 64, 64, 64, 64, -64, -64, -64, -64, -64, -64, -64, -64, -64, -64, -64, -64, 64, -64, -64, -64, 64, 64, 64, 64, 64, 64, -64, 64, 64, 64, 64, 64, -64, -64, -64, 64, -64, -64, -64, -64, 64, -64, 64, 64, 64, -64, 64, -64, 64, -64, -64, 64, 64, 64, 64, 64, 64, 64, 64, -64, -64, -64, 64, -64, -64, -64, -64, 64, 64, 64, 64, 64, -64, 64, 64, -64, -64, 64, 64, 64, 64, 64, 64, 64, 64, 64, 64, -64, 64, 64, 64, -64, -64, -64, -64, 64, 64, 64, 64, 64, 64, 64, 64, 64, 64, 64, 64, 64, 64, 64, 64, 64, 64, -64, -64, -64, -64, -64, -64, 64, -64, -64, -64, 64, -64, 64, 64, -64, 64, 64, 64, 64, 64, 64, -64, -64, -64, 64, -64, 64, 64, 64, 64, -64, -64, 64, 64, 64, -64, -64, -64, -64, 64, -64, 64, -64, 64, -64, 64, 64, 64, -64, 64, -64, -64, -64, -64, -64, 64, 64, 64, -64, 64, 64, 64, 64, -64, 64, -64, 64, 64, -64, -64, -64, -64, -64, 64, 64, 64, 64, -64, -64, 64, -64, -64, -64, 64, -64, -64, -64, 64, -64, -64, -64, -64, -64, -64, 64, 64, -64, 64, 64, -64, -64, -64, -64, 64, -64, 64, 64, -64, -64, -64, -64, -64, -64, -64, -64, -64, -64, 64, -64, -64, -64, -64, 64, 64, -64, -64, -64, -64, -64, -64, -64, 64, 64, 64, -64, -64, -64, -64, -64, -64, -64, -64, 64, -64, -64, -64, -64, -64, -64, -64, 64, -64, -64, 64, 64, 64, -64, 64, -64, 64, 64, -64, -64, -64, -64, -64, -64, -64, -64, 64, -64, -64, -64, -64, -64, -64, -64, -64, 64, 64, 64, 64, -64, 64, 64, 64, 64, 64, 64, 64, -64, -64, -64, -64, -64, -64, -64, 64, -64, 64, 64, 64, 64, -64, -64, -64, -64, 64, 64, 64, -64, 64, 64, 64, 64, 64, 64, 64, 64, -64, -64, -64, -64, -64, -64, -64, -64, -64, 64, -64, -64, -64, -64, -64, -64, 64, 64, -64, 64, 64, 64, 64, 64, 64, 64, 64, -64, -64, -64, -64, -64, -64, -64, -64, 64, 64, -64, 64, -64, -64, -64, -64, 64, 64, 64, 64, -64, 64, 64, 64, 64, 64, 64, 64, -64, -64, -64, -64, -64, -64, -64, 64, 64, 64, 64, 64, -64, 64, 64, 64, -64, 64, 64, 64, 64, 64, 64, -64, 64, 64, 64, -64, -64, -64, -64, -64, -64, -64, -64, 64, -64, 64, -64, 64, -64, -64, -64, -64, 64, 64, 64, 64, 64, -64, -64, 64, 64, 64, 64, -64, -64, -64, -64, -64, -64, -64, 64, 64, 64, -64, -64, -64, 64, -64, -64, 64, 64, 64, -64, -64, 64, 64, 64, 64, -64, 64, 64, -64, -64, -64, -64, 64, -64, -64, 64, -64, 64, -64, -64, 64, -64, 64, 64, -64, 64, -64, -64, 64, -64, -64, 64, 64, 64, -64, 64, 64, -64, -64, 64, 64, 64, -64, 64, 64, -64, 64, -64, 64, 64, -64, 64, -64, -64, -64, -64, -64, -64, -64, 64, -64, 64, -64, 64, -64, -64, -64, 64, 64, -64, -64, -64, -64, 64, -64, 64, 64, 64, 64, -64, -64, -64, 64, -64, 64, 64, -64, -64, -64, 64, 64, -64, -64, -64, 64, 64, -64, -64, -64, -64, -64, -64, -64, -64, 64, -64, -64, -64, -64, 64, -64, 64, 64, -64, 64, -64, 64, -64, -64, -64, -64, 64, 64, 64, -64, 64, -64, -64, 64, -64, 64, -64, 64, 64, -64, 64, 64, -64, -64, -64, 64, 64, -64, -64, 64, -64, 64, -64, -64, -64, -64, -64, 64, 64, -64, 64, -64, -64, 64, 64, 64, 64, -64, -64, 64, 64, 64, -64, -64, 64, 64, 64, 64, -64, 64, 64, 64, 64, 64, 64, 64, 64, -64, 64, -64, -64, -64, -64, -64, -64, 64, 64, -64, -64, 64, -64, -64, 64, -64, 64, 64, 64, 64, 64, 64, 64, -64, 64, -64, 64, 64, -64, -64, 64, -64, -64, -64, -64, -64, 64, 64, 64, 64, -64, 64, 64, 64, 64, -64, 64, 64, -64, 64, -64, -64, -64, 64, -64, 64, -64, 64, -64, -64, 64, -64, 64, -64, 64, 64, -64, -64, -64, -64, -64, -64, -64, -64, 64, 64, 64, -64, 64, 64, -64, 64, 64, -64, 64, 64, -64, 64, 64, -64, 64, 64, 64, -64, 64, 64, -64, -64, -64, -64, -64, -64, 64, -64, -64, -64, -64, 64, -64, 64, 64, 64, -64, 64, -64, -64, -64, -64, -64, -64, -64, 64, -64, -64, -64, -64, -64, -64, -64, -64, 64, -64, 64, -64, -64, -64, -64, -64, 64, -64, -64, 64, -64, -64, 64, -64, -64, 64, 64, 64, -64, -64, -64, -64, -64, -64, 64, -64, -64, -64, 64, -64, -64, -64, -64, -64, -64, -64, -64, -64, 64, -64, 64, -64, -64, 64, 64, -64, -64, -64, -64, -64, -64, -64, 64, 64, -64, -64, -64, -64, -64, -64, -64, -64, -64, -64, 64, 64, -64, -64, 64, 64, -64, -64, -64, -64, 64, -64, -64, -64, -64, 64, 64, 64, -64, 64, -64, -64, -64, -64, -64, -64, -64, -64, -64, 64, -64, 64, -64, 64, -64, -64, -64, -64, -64, -64, -64, -64, -64, -64, 64, 64, 64, 64, 64, -64, -64, -64, -64, -64, -64, -64, -64, 64, 64, 64, 64, -64, -64, 64, -64, -64, -64, -64, -64, 64, 64, 64, 64, -64, -64, -64, 64, -64, -64, -64, -64, -64, -64, -64, -64, 64, -64, -64, -64, 64, -64, -64, -64, -64, -64, -64, 64, -64, 64, 64, 64, 64, 64, -64, -64, -64, 64, -64, -64, 64, -64, -64, 64, 64, 64, 64, -64, 64, -64, -64, -64, -64, -64, 64, -64, -64, 64, -64, -64, 64, -64, -64, 64, -64, -64, 64, 64, -64, -64, -64, 64, 64, -64, 64, -64, 64, 64, 64, 64, 64, 64, -64, -64, -64, -64, 64, 64, 64, -64, -64, -64, -64, 64, -64, 64, 64, -64, 64, 64, -64, 64, -64, 64, -64, 64, 64, 64, -64, 64, -64, 64, -64, -64, 64, -64, -64, -64, -64, -64, 64, 64, 64, 64, -64, -64, 64, -64, 64, -64, 64, 64, 64, 64, 64, 64, 64, 64, 64, -64, -64, -64, -64, -64, -64, -64, -64, 64, 64, 64, -64, 64, 64, 64, -64, -64, 64, -64, 64, 64, -64, 64, 64, 64, 64, 64, 64, 64, 64, 64, 64, -64, -64, 64, -64, 64, 64, 64, -64, 64, 64, 64, -64, 64, -64, -64, -64, 64, 64, 64, 64, 64, 64, -64, -64, 64, 64, 64, 64, 64, 64, -64, 64, 64, -64, 64, -64, 64, 64, 64, 64, 64, 64, 64, -64, -64, 64, 64, -64, 64, 64, -64, 64, -64, 64, 64, 64, 64, 64, 64, -64, 64, 64, -64, 64, -64, -64, -64, 64, -64, 64, 64, 64, -64, 64, 64, -64, 64, 64, -64, -64, -64, -64, -64, 64, -64, 64, -64, -64, 64, -64, 64, 64, -64, -64, 64, 64, -64, -64, -64, -64, -64, -64, -64, -64, -64, -64, -64, -64, -64, -64, -64, -64, 64, -64, -64, -64, -64, -64, 64, -64, 64, -64, 64, 64, 64, 64, -64, -64, -64, -64, 64, -64, 64, -64, -64, -64, -64, -64, -64, 64, -64, -64, -64, -64, -64, 64, -64, -64, -64, -64, -64, -64, -64, 64, -64, -64, 64, 64, -64, -64, -64, 64, 64, 64, -64, 64, 64, 64, -64, -64, 64, -64, -64, -64, -64, -64, -64, -64, 64, -64, -64, 64, 64, 64, 64, -64, 64, 64, -64, -64, 64, -64, -64, -64, 64, -64, 64, 64, -64, 64, 64, 64, -64, -64, -64, 64, -64, -64, -64, -64, -64, 64, -64, -64, -64, 64, 64, -64, -64, -64, 64, 64, 64, -64, -64, -64, 64, -64, -64, -64, -64, -64, -64, 64, 64, -64, 64, 64, 64, -64, 64, -64, -64, 64, 64, 64, -64, 64, 64, -64, -64, 64, -64, 64, 64, 64, 64, 64, 64, 64, -64, 64, 64, 64, 64, 64, -64, -64, -64, -64, -64, 64, 64, 64, -64, 64, -64, -64, -64, -64, 64, 64, 64, -64, -64, -64, 64, 64, -64, 64, 64, -64, -64, -64, -64, 64, 64, -64, -64, -64, 64, 64, 64, -64, 64, -64, -64, 64, -64, 64, -64, 64, 64, 64, 64, -64, 64, -64, 64, -64, -64, 64, 64, 64, -64, 64, -64, 64, 64, 64, 64, -64, 64, 64, -64, -64, 64, 64, -64, -64, 64, -64, -64, -64, -64, -64, -64, 64, -64, 64, 64, -64, 64, -64, -64, 64, 64, -64, 64, 64, 64, 64, 64, 64, 64, 64, 64, -64, -64, 64, -64, 64, 64, 64, 64, 64, 64, 64, -64, 64, -64, -64, 64, 64, 64, -64, -64, 64, 64, -64, 64, 64, 64, 64, -64, 64, 64, 64, 64, 64, 64, 64, 64, 64, 64, -64, -64, 64, -64, -64, 64, 64, 64, 64, -64, -64, -64, -64, -64, -64, 64, -64, -64, 64, 64, 64, 64, 64, 64, 64, 64, -64, 64, 64, 64, -64, -64, -64, 64, -64, 64, 64, 64, 64, 64, -64, -64, 64, 64, -64, 64, 64, -64, 64, 64, -64, 64, 64, -64, 64, -64, 64, 64, 64, 64, -64, 64, 64, 64, 64, -64, -64, -64, 64, -64, 64, -64, -64, -64, 64, -64, -64, -64, -64, 64, -64, -64, -64, -64, 64, 64, 64, -64, -64, -64, -64, 64, -64, -64, -64, -64, -64, 64, -64, -64, -64, -64, -64, -64, -64, -64, -64, -64, -64, -64, -64, -64, -64, -64, 64, -64, -64, 64, 64, 64, 64, -64, -64, -64, -64, -64, -64, -64, 64, -64, -64, -64, -64, -64, -64, -64, -64, -64, -64, 64, -64, -64, 64, -64, -64, 64, 64, 64, 64, -64, -64, -64, 64, -64, -64, 64, 64, 64, 64, 64, -64, 64, -64, -64, -64, -64, 64, 64, 64, -64, -64, 64, -64, 64, 64, 64, -64, -64, -64, -64, -64, -64, -64, 64, 64, 64, 64, 64, 64, 64, -64, -64, -64, -64, 64, 64, -64, 64, 64, -64, -64, 64, 64, 64, 64, -64, -64, -64, -64, -64, 64, 64, 64, 64, -64, 64, 64, -64, -64, -64, -64, -64, -64, -64, -64, 64, 64, 64, -64, 64, 64, 64, -64, -64, -64, -64, -64, -64, -64, -64, 64, 64, 64, 64, -64, 64, 64, -64, -64, -64, -64, 64, -64, -64, -64, -64, 64, 64, 64, 64, -64, -64, -64, 64, 64, -64, -64, -64, 64, -64, -64, 64, -64, 64, 64, 64, 64, -64, -64, 64, 64, 64, 64, -64, 64, 64, -64, -64, -64, -64, -64, -64, -64, -64, -64, -64, 64, -64, -64, -64, -64, 64, 64, 64, -64, -64, -64, 64, -64, -64, -64, -64, -64, 64, -64, -64, -64, -64, -64, -64, -64, -64, -64, -64, -64, -64, -64, -64, 64, 64, 64, 64, 64, -64, 64, -64, 64, -64, -64, 64, 64, 64, -64, 64, 64, -64, 64, -64, -64, -64, -64, -64, 64, -64, -64, -64, 64, 64, 64, -64, 64, -64, 64, -64, 64, -64, 64, 64, 64, -64, 64, 64, -64, 64, -64, -64, -64, -64, -64, 64, -64, -64, -64, -64, 64, 64, 64, -64, -64, -64, -64, -64, -64, -64, 64, -64, -64, -64, 64, 64, 64, 64, -64, -64, -64, -64, -64, -64, -64, -64, -64, 64, 64, 64, -64, -64, -64, -64, -64, -64, -64, -64, -64, -64, -64, 64, 64, 64, 64, 64, 64, 64, -64, -64, 64, -64, -64, -64, 64, -64, 64, 64, 64, -64, -64, -64, -64, 64, 64, 64, 64, 64, 64, 64, 64, -64, 64, 64, 64, 64, 64, -64, -64, -64, 64, 64, 64, 64, -64, 64, -64, -64, -64, -64, -64, 64, 64, -64, -64, -64, 64, -64, -64, 64, 64, 64, 64, 64, 64, 64, 64, -64, -64, 64, 64, 64, -64, -64, -64, -64, -64, -64, 64, 64, -64, 64, 64, 64, -64, -64, -64, -64, -64, -64, 64, -64, 64, -64, -64, -64, -64, -64, -64, -64, -64, -64, -64, -64, -64, -64, -64, -64, 64, 64, -64, 64, -64, 64, 64, -64, -64, -64, -64, -64, -64, -64, -64, -64, -64, -64, -64, -64, -64, 64, -64, -64, -64, -64, 64, -64, 64, 64, -64, -64, -64, 64, 64, 64, -64, -64, 64, -64, -64, -64, 64, 64, -64, 64, 64, -64, 64, 64, 64, 64, -64, 64, -64, -64, 64, 64, -64, 64, 64, 64, 64, -64, -64, 64, 64, -64, 64, -64, 64, -64, -64, 64, 64, 64, 64, 64, -64, 64, 64, -64, -64, -64, 64, -64, -64, 64, 64, -64, -64, 64, 64, -64, 64, -64, -64, 64, 64, 64, 64, -64, 64, 64, 64, 64, -64, 64, 64, -64, 64, 64, 64, -64, 64, -64, 64, 64, -64, -64, 64, 64, 64, -64, -64, 64, 64, 64, 64, 64, 64, 64, 64, 64, 64, 64, -64, -64, -64, -64, 64, -64, 64, 64, 64, -64, 64, 64, 64, -64, -64, 64, -64, -64, 64, 64, 64, -64, -64, -64, -64, -64, 64, -64, 64, 64, -64, -64, 64, 64, 64, 64, 64, 64, -64, 64, -64, -64, -64, -64, 64, 64, 64, -64, -64, -64, -64, -64, 64, -64, 64, -64, -64, -64, 64, -64, 64, 64, 64, -64, 64, -64, 64, -64, -64, 64, 64, -64, -64, -64, 64, -64, -64, -64, -64, -64, -64, 64, 64, 64, -64, -64, 64, -64, 64, -64, -64, 64, 64, 64, -64, -64, -64, -64, -64, -64, -64, -64, -64, -64, -64, -64, -64, -64, -64, -64, -64, 64, 64, 64, -64, -64, -64, 64, -64, 64, -64, -64, -64, 64, 64, 64, -64, 64, 64, 64, 64, 64, 64, -64, -64, 64, 64, 64, -64, 64, 64, -64, 64, 64, 64, -64, -64, 64, 64, 64, 64, 64, 64, 64, 64, 64, 64, 64, 64, 64, -64, -64, -64, -64, 64, 64, 64, -64, -64, 64, 64, -64, -64, -64, 64, -64, -64, 64, -64, 64, 64, 64, 64, 64, 64, 64, 64, -64, -64, -64, -64, 64, 64, -64, 64, 64, -64, 64, 64, 64, 64, -64, -64, 64, 64, 64, -64, -64, -64, -64, 64, -64, 64, 64, 64, 64, -64, -64, -64, -64, 64, 64, 64, 64, 64, -64, 64, 64, 64, -64, 64, -64, -64, 64, -64, -64, 64, 64, 64, -64, -64, 64, -64, 64, -64, -64, -64, 64, 64, 64, 64, 64, -64, -64, -64, 64, -64, -64, -64, 64, -64, 64, 64, -64, -64, -64, 64, 64, -64, -64, 64, 64, -64, -64, -64, 64, -64, -64, -64, -64, 64, -64, -64, -64, -64, 64, 64, 64, 64, 64, 64, 64, 64, 64, 64, 64, 64, 64, 64, -64, -64, -64, -64, 64, -64, -64, -64, -64, -64, -64, -64, -64, 64, -64, -64, 64, -64, -64, 64, -64, 64, 64, 64, 64, 64, 64, 64, -64, -64, -64, -64, -64, 64, 64, 64, 64, -64, -64, -64, 64, -64, 64, -64, 64, 64, -64, -64, 64, 64, 64, 64, 64, 64, 64, -64, -64, -64, 64, -64, -64, 64, 64, -64, -64, 64, -64, -64, 64, -64, 64, 64, -64, 64, 64, -64, 64, 64, 64, 64, 64, 64, -64, 64, -64, -64, -64, 64, 64, 64, 64, -64, -64, 64, -64, -64, 64, -64, 64, 64, -64, -64, -64, 64, 64, 64, 64, 64, 64, 64, 64, 64, 64, 64, 64, 64, 64, 64, 64, -64, -64, 64, 64, 64, 64, 64, -64, 64, 64, -64, -64, -64, 64, 64, 64, 64, 64, 64, 64, 64, -64, -64, -64, 64, 64, 64, 64, 64, -64, 64, 64, 64, 64, -64, -64, -64, -64, 64, -64, -64, 64, 64, -64, 64, 64, 64, 64, 64, 64, 64, -64, 64, 64, 64, -64, 64, 64, 64, 64, 64, 64, 64, 64, -64, -64, -64, -64, -64, -64, -64, 64, 64, -64, 64, 64, 64, 64, 64, -64, -64, 64, 64, -64, -64, 64, 64, 64, 64, -64, 64, 64, 64, 64, -64, 64, -64, -64, -64, -64, -64, 64, -64, -64, -64, -64, -64, 64, 64, 64, -64, 64, -64, 64, 64, 64, -64, 64, -64, -64, 64, 64, -64, -64, 64, -64, -64, -64, -64, -64, 64, -64, -64, -64, -64, -64, -64, 64, 64, -64, 64, 64, 64, 64, -64, -64, 64, -64, 64, 64, -64, 64, 64, -64, -64, -64, -64, -64, -64, -64, -64, -64, 64, 64, 64, 64, 64, 64, 64, 64, 64, 64, 64, 64, -64, 64, -64, 64, -64, 64, 64, -64, -64, -64, -64, 64, -64, -64, -64, 64, 64, 64, 64, 64, 64, -64, 64, 64, 64, -64, 64, -64, 64, -64, 64, -64, 64, -64, 64, 64, 64, 64, 64, 64, 64, 64, 64, 64, 64, 64, 64, -64, 64, 64, 64, 64, -64, -64, -64, -64, 64, 64, 64, -64, -64, -64, 64, 64, 64, 64, 64, 64, -64, 64, -64, -64, 64, 64, 64, 64, 64, 64, -64, -64, 64, -64, -64, 64, -64, -64, -64, 64, 64, 64, 64, 64, -64, -64, 64, -64, -64, 64, -64, -64, 64, 64, 64, -64, 64, 64, -64, -64, -64, 64, -64, 64, 64, 64, -64, 64, 64, 64, -64, -64, -64, 64, 64, 64, -64, 64, -64, -64, -64, -64, -64, -64, 64, 64, 64, -64, -64, 64, -64, -64, 64, 64, -64, 64, 64, -64, 64, -64, -64, 64, 64, 64, -64, 64, -64, -64, -64, -64, 64, -64, -64, -64, -64, 64, -64, 64, -64, -64, 64, 64, -64, -64, 64, 64, 64, 64, -64, -64, -64, 64, -64, 64, 64, -64, 64, 64, -64, 64, 64, 64, -64, 64, -64, -64, 64, -64, 64, -64, -64, 64, 64, -64, 64, 64, -64, -64, -64, 64, -64, 64, 64, 64, 64, 64, 64, 64, 64, -64, -64, -64, -64, 64, -64, 64, -64, -64, 64, -64, 64, 64, 64, 64, 64, 64, 64, 64, -64, 64, 64, 64, 64, 64, -64, -64, 64, 64, 64, -64, 64, -64, -64, -64, -64, 64, -64, 64, -64, 64, -64, -64, -64, -64, 64, 64, 64, 64, 64, 64, 64, 64, -64, -64, -64, 64, -64, -64, 64, -64, 64, 64, 64, -64, 64, 64, 64, -64, 64, -64, 64, -64, 64, 64, -64, 64, 64, 64, 64, -64, -64, -64, -64, 64, 64, -64, -64, 64, -64, -64, -64, -64, 64, -64, -64, 64, 64, 64, 64, 64, 64, 64, -64, -64, -64, -64, -64, 64, 64, 64, 64, 64, -64, -64, -64, 64, 64, -64, -64, -64, -64, -64, 64, -64, 64, -64, 64, 64, 64, 64, 64, 64, 64, 64, 64, 64, -64, 64, -64, -64, -64, -64, -64, -64, -64, 64, 64, -64, 64, -64, -64, -64, 64, -64, 64, 64, 64, 64, 64, 64, 64, 64, -64, 64, -64, 64, -64, 64, 64, -64, -64, 64, -64, -64, -64, 64, 64, 64, 64, 64, -64, -64, -64, 64, 64, 64, 64, 64, 64, 64, 64, 64, -64, 64, -64, -64, -64, 64, -64, 64, 64, 64, 64, 64, 64, 64, -64, -64, 64, -64, 64, 64, 64, 64, 64, 64, 64, 64, 64, -64, -64, -64, -64, -64, -64, 64, 64, 64, 64, 64, 64, 64, 64, 64, -64, 64, -64, -64, 64, 64, -64, 64, 64, 64, 64, 64, -64, -64, -64, -64, -64, 64, 64, -64, 64, -64, 64, -64, -64, 64, 64, -64, -64, 64, -64, 64, 64, 64, 64, 64, 64, 64, -64, -64, -64, -64, -64, -64, -64, 64, 64, 64, 64, 64, -64, -64, -64, -64, 64, -64, 64, -64, 64, 64, 64, -64, 64, -64, -64, -64, -64, -64, -64, -64, -64, -64, -64, -64, 64, 64, 64, -64, 64, -64, 64, -64, 64, -64, 64, -64, -64, -64, 64, 64, -64, -64, -64, -64, -64, -64, -64, -64, -64, 64, -64, 64, -64, 64, 64, -64, 64, -64, 64, 64, -64, -64, -64, 64, -64, 64, 64, 64, -64, -64, -64, -64, -64, -64, -64, -64, -64, 64, -64, 64, 64, 64, 64, 64, -64, 64, 64, -64, -64, 64, 64, 64, 64, 64, 64, 64, -64, -64, -64, -64, 64, 64, 64, 64, -64, -64, -64, 64, 64, 64, 64, 64, 64, 64, 64, 64, -64, -64, -64, -64, 64, 64, 64, 64, 64, 64, 64, 64, 64, 64, 64, -64, -64, -64, -64, -64, 64, 64, 64, 64, 64, 64, -64, -64, 64, -64, -64, -64, -64, 64, 64, 64, 64, 64, 64, 64, 64, -64, 64, -64, -64, -64, -64, 64, 64, 64, 64, 64, 64, 64, 64, -64, 64, 64, 64, -64, -64, -64, 64, 64, 64, 64, 64, 64, 64, -64, 64, -64, -64, -64, 64, 64, 64, 64, 64, 64, 64, 64, 64, -64, -64, -64, 64, -64, -64, -64, 64, -64, 64, 64, 64, 64, -64, -64, -64, -64, -64, 64, -64, 64, 64, 64, 64, 64, 64, 64, -64, -64, -64, 64, 64, -64, -64, -64, -64, 64, 64, 64, -64, -64, -64, -64, -64, 64, 64, 64, 64, 64, 64, 64, 64, 64, 64, 64, 64, -64, 64, 64, 64, -64, -64, -64, 64, 64, 64, -64, 64, -64, 64, 64, 64, -64, 64, 64, 64, 64, 64, 64, 64, 64, 64, -64, -64, 64, -64, -64, -64, -64, -64, -64, 64, 64, 64, 64, -64, -64, -64, -64, -64, 64, 64, 64, 64, 64, 64, 64, 64, 64, 64, 64, 64, 64, 64, -64, -64, -64, -64, -64, -64, 64, -64, -64, -64, -64, -64, 64, 64, 64, 64, 64, 64, -64, 64, 64, 64, 64, -64, -64, -64, 64, -64, -64, -64, -64, -64, -64, -64, -64, 64, -64, 64, -64, -64, 64, 64, 64, 64, 64, -64, -64, -64, -64, 64, -64, 64, -64, 64, 64, -64, -64, -64, 64, 64, 64, 64, 64, -64, 64, -64, -64, -64, -64, 64, 64, 64, -64, 64, 64, 64, 64, 64, -64, -64, 64, -64, -64, -64, -64, 64, -64, 64, 64, 64, 64, 64, 64, -64, -64, -64, -64, -64, -64, 64, -64, -64, 64, 64, -64, 64, 64, 64, 64, -64, 64, -64, 64, -64, -64, -64, -64, -64, 64, 64, -64, 64, 64, -64, -64, 64, 64, 64, 64, 64, 64, 64, -64, -64, -64, -64, 64, -64, -64, -64, 64, -64, 64, 64, 64, -64, 64, -64, -64, -64, -64, -64, 64, -64, -64, 64, 64, 64, 64, 64, -64, -64, -64, 64, 64, 64, -64, 64, 64, -64, 64, 64, 64, -64, -64, -64, 64, -64, -64, 64, 64, -64, -64, 64, -64, 64, 64, -64, 64, -64, -64, -64, 64, 64, -64, 64, -64, 64, 64, 64, -64, -64, -64, -64, -64, -64, -64, 64, -64, 64, 64, -64, 64, 64, 64, -64, 64, -64, 64, -64, 64, -64, 64, -64, -64, 64, -64, -64, 64, 64, -64, -64, -64, -64, -64, -64, 64, 64, 64, 64, 64, 64, 64, 64, -64, 64, -64, 64, -64, -64, -64, -64, 64, -64, 64, -64, -64, 64, -64, -64, -64, -64, 64, -64, 64, 64, 64, 64, 64, 64, 64, 64, 64, 64, 64, 64, -64, -64, -64, -64, 64, -64, 64, 64, 64, 64, -64, 64, -64, -64, -64, -64, 64, 64, 64, 64, 64, 64, 64, 64, 64, 64, 64, 64, -64, 64, -64, -64, 64, -64, -64, -64, 64, 64, 64, -64, -64, 64, 64, -64, 64, -64, -64, 64, 64, 64, 64, 64, 64, 64, -64, 64, 64, 64, 64, -64, -64, -64, -64, 64, -64, -64, 64, 64, 64, -64, 64, 64, -64, -64, -64, 64, 64, -64, 64, 64, 64, 64, 64, 64, 64, -64, -64, 64, -64, 64, 64, -64, -64, -64, -64, 64, 64, -64, 64, 64, -64, -64, -64, 64, -64, 64, 64, 64, 64, -64, 64, 64, -64, -64, 64, 64, 64, 64, 64, -64, 64, -64, 64, -64, 64, 64, 64, -64, -64, -64, -64, -64, -64, -64, -64, 64, -64, 64, 64, 64, 64, -64, -64, -64, 64, -64, 64, 64, 64, 64, -64, 64, 64, 64, 64, 64, -64, 64, -64, -64, 64, -64, -64, 64, 64, 64, -64, 64, 64, 64, -64, 64, -64, -64, 64, 64, -64, 64, 64, 64, 64, -64, -64, 64, 64, 64, 64, 64, -64, -64, -64, 64, -64, -64, -64, -64, -64, 64, -64, 64, 64, -64, -64, -64, 64, -64, 64, 64, 64, -64, 64, -64, -64, -64, 64, 64, 64, -64, -64, -64, 64, 64, 64, 64, 64, 64, -64, -64, 64, 64, 64, -64, -64, 64, -64, -64, 64, 64, -64, 64, -64, 64, 64, 64, 64, -64, 64, 64, 64, 64, 64, 64, -64, -64, 64, -64, -64, 64, -64, 64, 64, 64, 64, 64, 64, 64, 64, -64, 64, 64, 64, -64, 64, -64, -64, 64, 64, -64, -64, -64, -64, 64, -64, 64, 64, 64, -64, -64, 64, 64, 64, -64, 64, 64, 64, 64, 64, -64, 64, -64, 64, 64, -64, 64, 64, 64, 64, -64, -64, 64, 64, -64, -64, -64, 64, 64, 64, 64, 64, 64, 64, 64, 64, 64, 64, 64, 64, 64, 64, 64, 64, -64, 64, 64, 64, -64, 64, -64, -64, -64, 64, 64, 64, -64, 64, 64, 64, -64, 64, 64, 64, 64, 64, 64, 64, -64, 64, -64, -64, 64, 64, 64, 64, 64, -64, 64, 64, 64, 64, -64, -64, -64, 64, -64, 64, 64, 64, 64, 64, 64, 64, 64, 64, -64, 64, -64, -64, 64, 64, 64, 64, -64, -64, -64, -64, -64, 64, 64, -64, 64, 64, 64, 64, 64, 64, 64, 64, 64, 64, 64, 64, 64, -64, -64, -64, -64, 64, 64, 64, 64, 64, 64, 64, -64, 64, 64, -64, -64, 64, -64, -64, 64, 64, -64, 64, 64, 64, 64, 64, 64, -64, -64, -64, 64, -64, 64, 64, 64, 64, 64, 64, -64, 64, 64, 64, 64, -64, 64, -64, 64, 64, 64, -64, 64, 64, 64, 64, -64, -64, -64, -64, 64, 64, 64, 64, 64, 64, 64, -64, 64, 64, 64, -64, -64, -64, -64, 64, 64, 64, 64, -64, -64, 64, -64, -64, -64, -64, 64, 64, 64, 64, 64, 64, 64, -64, 64, 64, -64, -64, -64, -64, 64, -64, 64, -64, 64, -64, -64, -64, -64, -64, -64, -64, 64, 64, 64, 64, -64, -64, 64, -64, -64, 64, 64, -64, 64, 64, -64, -64, -64, -64, 64, 64, -64, 64, -64, -64, -64, -64, -64, -64, 64, 64, 64, 64, 64, 64, -64, 64, 64, -64, -64, 64, 64, 64, -64, -64, 64, -64, 64, -64, -64, -64, -64, -64, -64, -64, 64, 64, 64, 64, 64, 64, 64, 64, -64, -64, -64, -64, 64, -64, 64, -64, 64, -64, 64, 64, 64, 64, 64, -64, 64, -64, 64, 64, 64, 64, 64, 64, 64, 64, 64, -64, 64, 64, 64, -64, -64, -64, -64, 64, -64, -64, 64, -64, 64, 64, -64, -64, -64, 64, -64, -64, 64, 64, 64, -64, 64, 64, 64, -64, 64, -64, 64, 64, 64, 64, -64, 64, -64, 64, -64, -64, -64, -64, 64, -64, 64, 64, 64, -64, 64, 64, 64, 64, -64, 64, -64, -64, 64, 64, 64, 64, -64, 64, 64, 64, -64, -64, 64, -64, 64, 64, -64, 64, -64, -64, 64, 64, -64, 64, 64, 64, -64, 64, 64, -64, -64, 64, 64, 64, 64, -64, 64, 64, -64, 64, -64, -64, -64, 64, 64, 64, 64, -64, 64, 64, -64, -64, 64, 64, 64, 64, -64, -64, -64, 64, -64, 64, -64, 64, -64, 64, 64, 64, -64, 64, 64, 64, 64, 64, 64, 64, 64, 64, 64, -64, -64, -64, 64, -64, 64, -64, 64, 64, -64, 64, -64, 64, -64, 64, 64, -64, 64, 64, -64, 64, 64, 64, 64, -64, 64, -64, -64, 64, 64, 64, -64, -64, 64, -64, 64, 64, 64, -64, -64, 64, 64, 64, -64, 64, 64, -64, 64, -64, -64, 64, -64, -64, -64, -64, 64, -64, -64, -64, -64, -64, -64, -64, -64, -64, 64, -64, 64, 64, -64, 64, -64, -64, -64, 64, -64, 64, -64, -64, -64, -64, -64, -64, -64, -64, -64, -64, 64, -64, -64, -64, 64, -64, -64, 64, -64, -64, -64, -64, 64, -64, -64, 64, -64, -64, -64, -64, -64, -64, -64, -64, -64, -64, -64, -64, 64, -64, 64, -64, 64, 64, -64, 64, -64, 64, -64, 64, 64, 64, -64, -64, -64, -64, -64, -64, -64, 64, -64, 64, -64, -64, -64, -64, 64, -64, 64, 64, 64, 64, 64, -64, -64, -64, 64, 64, -64, 64, -64, -64, 64, -64, -64, -64, 64, 64, 64, 64, -64, 64, -64, -64, -64, -64, -64, 64, -64, -64, 64, 64, -64, 64, 64, -64, 64, 64, -64, -64, -64, 64, -64, -64, -64, 64, 64, -64, 64, 64, 64, -64, -64, -64, 64, 64, 64, 64, -64, -64, -64, 64, -64, -64, 64, -64, 64, -64, -64, -64, -64, 64, -64, -64, -64, 64, 64, -64, -64, -64, -64, 64, -64, -64, -64, -64, -64, -64, -64, -64, 64, 64, 64, -64, -64, -64, -64, -64, 64, -64, -64, -64, -64, -64, -64, -64, -64, -64, -64, 64, -64, -64, 64, 64, 64, -64, 64, 64, -64, 64, 64, 64, 64, 64, -64, -64, 64, -64, -64, -64, -64, -64, -64, -64, -64, -64, -64, -64, -64, -64, 64, 64, 64, 64, 64, -64, -64, -64, -64, -64, 64, 64, -64, 64, -64, -64, -64, -64, -64, -64, -64, -64, -64, -64, -64, -64, -64, -64, -64, -64, -64, 64, 64, 64, -64, -64, 64, 64, 64, -64, -64, -64, -64, -64, 64, -64, -64, -64, -64, -64, -64, -64, -64, -64, -64, -64, -64, 64, 64, 64, 64, -64, -64, -64, -64, -64, 64, 64, -64, -64, -64, -64, -64, -64, 64, -64, -64, 64, -64, -64, -64, -64, -64, -64, -64, 64, 64, -64, -64, 64, -64, 64, -64, -64, 64, 64, -64, -64, 64, 64, 64, -64, -64, -64, -64, -64, -64, -64, -64, -64, -64, 64, 64, -64, 64, -64, -64, 64, -64, 64, -64, 64, 64, 64, 64, 64, -64, 64, 64, 64, -64, -64, -64, -64, 64, -64, 64, -64, 64, -64, -64, -64, -64, -64, -64, -64, 64, 64, 64, -64, 64, -64, -64, 64, -64, 64, -64, -64, 64, 64, 64, 64, 64, 64, 64, -64, 64, -64, -64, 64, -64, -64, 64, -64, -64, -64, 64, -64, 64, -64, 64, 64, 64, -64, 64, -64, -64, 64, 64, -64, -64, 64, 64, 64, 64, 64, -64, -64, -64, 64, 64, -64, 64, -64, 64, -64, 64, -64, 64, -64, 64, -64, -64, 64, 64, 64, -64, 64, -64, -64, 64, -64, -64, 64, -64, 64, 64, 64, -64, 64, -64, -64, 64, -64, -64, -64, -64, 64, -64, -64, -64, 64, -64, 64, -64, -64, -64, -64, -64, 64, 64, -64, -64, -64, 64, -64, 64, 64, 64, -64, 64, -64, -64, 64, -64, 64, -64, -64, 64, -64, 64, -64, 64, 64, -64, -64, -64, -64, 64, -64, -64, -64, -64, -64, -64, 64, 64, -64, 64, -64, 64, 64, -64, 64, 64, 64, -64, -64, 64, 64, -64, 64, -64, -64, 64, -64, 64, 64, -64, -64, -64, 64, -64, -64, -64, 64, 64, -64, -64, 64, -64, 64, -64, -64, -64, -64, 64, -64, -64, -64, -64, 64, -64, 64, -64, 64, -64, -64, -64, 64, -64, -64, 64, -64, 64, -64, 64, 64, -64, 64, 64, 64, 64, 64, 64, -64, 64, -64, -64, 64, 64, 64, -64, 64, 64, -64, 64, 64, 64, 64, -64, -64, 64, -64, 64, -64, 64, -64, -64, 64, -64, 64, 64, 64, 64, -64, -64, -64, -64, -64, 64, 64, -64, -64, -64, 64, -64, 64, -64, -64, -64, -64, 64, -64, 64, 64, 64, 64, -64, 64, 64, -64, -64, 64, -64, -64, 64, -64, 64, -64, 64, 64, -64, 64, 64, 64, -64, 64, -64, -64, -64, -64, 64, 64, 64, -64, -64, 64, 64, -64, 64, 64, 64, -64, 64, -64, -64, 64, -64, -64, 64, 64, 64, 64, 64, -64, -64, 64, -64, -64, -64, 64, 64, -64, -64, 64, -64, -64, -64, -64, 64, 64, 64, 64, 64, -64, 64, -64, -64, 64, 64, -64, 64, -64, 64, 64, -64, -64, 64, 64, 64, -64, -64, -64, 64, 64, 64, 64, 64, 64, 64, -64, -64, 64, 64, 64, 64, -64, -64, 64, 64, 64, 64, -64, 64, -64, 64, 64, -64, -64, -64, -64, -64, 64, 64, -64, -64, -64, -64, -64, -64, -64, -64, -64, -64, -64, 64, 64, -64, -64, -64, -64, 64, 64, 64, -64, -64, -64, -64, -64, -64, -64, 64, 64, -64, -64, -64, -64, -64, -64, -64, -64, -64, 64, -64, 64, -64, 64, 64, 64, 64, 64, 64, -64, -64, 64, -64, -64, -64, -64, -64, -64, -64, -64, -64, -64, -64, 64, -64, -64, -64, 64, 64, -64, 64, 64, 64, 64, 64, 64, 64, -64, 64, -64, -64, 64, 64, 64, 64, -64, 64, -64, 64, 64, 64, 64, 64, -64, 64, 64, 64, 64, 64, -64, -64, 64, 64, -64, 64, 64, -64, -64, -64, -64, -64, 64, 64, 64, 64, 64, 64, 64, 64, 64, 64, -64, -64, -64, 64, 64, 64, 64, 64, 64, 64, 64, 64, -64, -64, -64, -64, -64, 64, 64, 64, 64, 64, 64, 64, 64, 64, 64, 64, 64, 64, -64, -64, 64, 64, -64, -64, 64, -64, 64, -64, 64, -64, -64, -64, 64, 64, 64, 64, 64, 64, 64, 64, 64, 64, 64, 64, -64, -64, -64, -64, 64, 64, 64, -64, -64, 64, 64, 64, 64, -64, -64, -64, -64, -64, 64, 64, 64, -64, -64, 64, 64, 64, 64, 64, 64, -64, -64, 64, 64, 64, -64, 64, -64, -64, 64, 64, -64, -64, -64, 64, 64, 64, 64, -64, -64, -64, 64, 64, 64, 64, 64, 64, -64, 64, -64, -64, 64, -64, 64, -64, 64, 64, 64, 64, 64, 64, -64, 64, -64, -64, 64, 64, -64, 64, 64, 64, -64, 64, 64, -64, 64, -64, 64, 64, 64, -64, 64, 64, -64, 64, 64, 64, 64, 64, -64, -64, 64, -64, -64, 64, 64, 64, 64, -64, -64, -64, 64, -64, 64, -64, 64, 64, 64, 64, 64, -64, -64, 64, 64, 64, 64, 64, 64, 64, 64, 64, 64, -64, -64, 64, -64, 64, -64, 64, 64, 64, -64, -64, 64, 64, -64, 64, -64, 64, 64, 64, 64, 64, 64, 64, 64, 64, 64, 64, 64, 64, 64, 64, 64, 64, 64, 64, 64, 64, 64, 64, 64, -64, 64, -64, -64, 64, -64, -64, 64, 64, 64, 64, 64, 64, 64, 64, 64, 64, 64, 64, 64, 64, 64, -64, 64, 64, 64, 64, -64, 64, 64, 64, 64, 64, 64, -64, 64, 64, 64, 64, 64, 64, 64, 64, 64, 64, 64, 64, 64, 64, 64, 64, -64, 64, 64, -64, -64, -64, -64, 64, -64, 64, -64, 64, 64, 64, 64, 64, 64, 64, 64, 64, 64, 64, 64, 64, 64, 64, 64, 64, 64, 64, 64, 64, -64, 64, 64, 64, 64, 64, 64, 64, 64, -64, 64, 64, 64, -64, 64, -64, -64, 64, 64, 64, 64, 64, -64, 64, -64, -64, -64, -64, -64, -64, 64, 64, -64, -64, -64, 64, 64, -64, 64, -64, 64, -64, -64, -64, 64, -64, 64, 64, 64, 64, 64, 64, -64, -64, -64, -64, 64, -64, -64, -64, 64, -64, 64, 64, 64, 64, 64, -64, 64, -64, -64, -64, -64, -64, -64, -64, 64, -64, 64, 64, -64, -64, 64, 64, -64, 64, -64, 64, 64, 64, -64, -64, 64, 64, 64, 64, -64, -64, -64, -64, -64, -64, -64, -64, 64, 64, 64, 64, -64, 64, 64, 64, -64, 64, -64, 64, 64, 64, -64, 64, 64, 64, 64, -64, 64, -64, -64, 64, -64, -64, -64, -64, 64, 64, 64, 64, -64, 64, 64, 64, 64, 64, -64, -64, 64, -64, -64, 64, -64, -64, 64, 64, 64, 64, 64, 64, -64, -64, 64, -64, 64, 64, 64, 64, -64, -64, 64, 64, -64, -64, 64, 64, 64, -64, -64, 64, -64, -64, -64, -64, -64, -64, -64, -64, 64, -64, -64, -64, -64, 64, 64, 64, -64, -64, 64, -64, -64, 64, -64, -64, 64, 64, 64, -64, 64, -64, 64, 64, 64, 64, 64, 64, -64, 64, -64, -64, -64, 64, 64, 64, -64, -64, 64, -64, -64, -64, -64, 64, -64, -64, -64, 64, 64, -64, 64, -64, 64, 64, -64, 64, 64, 64, -64, -64, 64, 64, -64, 64, -64, 64, -64, -64, -64, 64, 64, 64, -64, 64, 64, 64, 64, 64, 64, 64, 64, -64, 64, 64, 64, -64, -64, -64, -64, 64, -64, -64, -64, -64, 64, 64, -64, -64, 64, -64, 64, 64, 64, 64, -64, 64, 64, 64, 64, 64, 64, 64, 64, -64, -64, -64, 64, -64, -64, -64, -64, -64, -64, 64, -64, 64, 64, -64, 64, 64, 64, -64, 64, -64, 64, -64, -64, 64, 64, -64, 64, -64, 64, 64, 64, -64, -64, -64, -64, 64, 64, 64, -64, -64, -64, -64, -64, 64, -64, -64, -64, 64, -64, 64, 64, 64, 64, 64, -64, 64, 64, 64, 64, 64, -64, 64, 64, 64, 64, 64, -64, -64, 64, 64, 64, -64, 64, 64, -64, -64, 64, 64, -64, 64, 64, -64, 64, -64, 64, -64, 64, 64, -64, -64, 64, 64, 64, 64, 64, 64, -64, -64, 64, -64, -64, 64, -64, 64, -64, 64, 64, -64, -64, -64, -64, -64, -64, -64, 64, 64, 64, -64, 64, 64, 64, -64, -64, 64, 64, 64, -64, 64, -64, 64, -64, 64, -64, -64, 64, -64, -64, -64, -64, -64, -64, -64, -64, 64, 64, 64, 64, 64, 64, 64, -64, 64, -64, -64, -64, 64, 64, -64, -64, -64, -64, -64, 64, -64, -64, -64, -64, -64, -64, -64, -64, 64, 64, 64, 64, 64, 64, 64, 64, 64, -64, 64, -64, 64, 64, -64, -64, -64, -64, -64, -64, 64, -64, -64, -64, -64, -64, -64, 64, 64, 64, 64, -64, -64, 64, -64, 64, -64, -64, -64, -64, 64, 64, -64, -64, -64, -64, -64, -64, 64, -64, -64, -64, -64, -64, -64, 64, 64, -64, 64, -64, 64, 64, -64, -64, -64, 64, -64, 64, -64, 64, -64, -64, -64, -64, -64, -64, -64, -64, -64, -64, -64, -64, -64, 64, 64, -64, 64, -64, -64, -64, -64, -64, -64, -64, -64, 64, -64, 64, -64, -64, -64, -64, 64, 64, -64, -64, -64, -64, -64, -64, 64, 64, 64, -64, 64, 64, 64, -64, 64, -64, 64, -64, 64, 64, -64, -64, -64, -64, -64, 64, 64, 64, -64, -64, -64, -64, -64, -64, -64, 64, 64, -64, -64, 64, 64, -64, 64, 64, 64, 64, 64, 64, 64, 64, 64, -64, -64, -64, 64, 64, 64, 64, -64, -64, -64, -64, -64, -64, 64, 64, 64, -64, 64, -64, 64, 64, 64, -64, -64, 64, 64, 64, 64, -64, 64, 64, 64, 64, 64, 64, -64, 64, -64, -64, 64, 64, -64, 64, 64, 64, 64, 64, -64, 64, -64, 64, 64, -64, -64, 64, 64, -64, -64, 64, 64, 64, 64, 64, 64, -64, -64, -64, -64, -64, 64, -64, 64, 64, -64, -64, -64, 64, 64, 64, 64, -64, 64, -64, 64, 64, -64, 64, 64, 64, 64, 64, -64, -64, -64, -64, -64, -64, 64, 64, 64, 64, -64, -64, -64, 64, -64, 64, 64, 64, 64, 64, -64, 64, -64, 64, 64, 64, 64, 64, -64, -64, -64, -64, -64, -64, 64, 64, -64, -64, -64, 64, -64, 64, -64, 64, 64, 64, -64, 64, 64, 64, 64, 64, 64, 64, 64, -64, -64, -64, -64, -64, -64, -64, -64, -64, -64, 64, 64, 64, 64, 64, 64, 64, -64, 64, -64, 64, 64, 64, 64, 64, 64, 64, 64, -64, -64, -64, -64, 64, 64, 64, -64, 64, 64, 64, 64, -64, 64, 64, -64, -64, -64, 64, 64, 64, 64, 64, 64, 64, 64, 64, -64, -64, 64, -64, -64, -64, 64, -64, 64, -64, -64, -64, -64, 64, -64, -64, 64, 64, 64, -64, 64, -64, 64, 64, 64, 64, 64, 64, 64, 64, -64, -64, 64, 64, -64, -64, -64, -64, -64, -64, -64, 64, -64, -64, 64, -64, -64, 64, 64, 64, -64, -64, 64, 64, 64, 64, 64, 64, 64, -64, -64, -64, -64, 64, 64, -64, -64, -64, 64, -64, 64, -64, -64, 64, -64, -64, 64, -64, -64, -64, -64, 64, 64, 64, 64, 64, -64, -64, -64, -64, 64, -64, -64, -64, -64, -64, -64, 64, -64, -64, 64, 64, 64, 64, 64, -64, 64, -64, -64, 64, -64, -64, -64, -64, -64, -64, -64, -64, -64, -64, -64, -64, -64, -64, -64, -64, 64, -64, 64, -64, 64, -64, -64, -64, -64, 64, 64, -64, 64, -64, 64, -64, -64, -64, -64, -64, -64, 64, -64, -64, -64, -64, -64, -64, 64, 64, -64, -64, -64, -64, -64, 64, 64, 64, 64, 64, 64, 64, -64, 64, -64, 64, 64, 64, -64, -64, 64, -64, -64, -64, 64, 64, 64, -64, 64, -64, 64, 64, 64, -64, 64, 64, 64, 64, -64, -64, -64, 64, 64, -64, 64, -64, -64, 64, -64, -64, -64, 64, -64, 64, 64, -64, 64, 64, 64, 64, -64, 64, -64, 64, -64, 64, -64, 64, -64, 64, 64, 64, -64, -64, -64, -64, -64, -64, -64, 64, -64, -64, -64, -64, 64, 64, -64, -64, -64, -64, -64, -64, 64, 64, -64, -64, -64, -64, -64, 64, 64, -64, -64, 64, -64, -64, -64, 64, 64, -64, -64, 64, 64, 64, 64, 64, -64, -64, -64, -64, 64, 64, 64, 64, 64, -64, -64, 64, 64, 64, -64, -64, -64, -64, 64, 64, -64, -64, 64, -64, 64, -64, -64, -64, 64, -64, -64, 64, 64, 64, 64, 64, 64, 64, -64, 64, 64, 64, 64, 64, 64, 64, 64, 64, 64, -64, 64, -64, 64, -64, 64, -64, 64, -64, -64, -64, 64, 64, -64, -64, 64, 64, 64, 64, 64, 64, 64, 64, 64, 64, 64, 64, 64, 64, 64, 64, 64, 64, -64, 64, -64, -64, -64, -64, 64, -64, 64, 64, 64, 64, 64, -64, -64, 64, 64, 64, -64, 64, 64, 64, 64, 64, 64, 64, -64, 64, -64, 64, -64, -64, -64, -64, -64, -64, -64, -64, 64, 64, 64, -64, 64, 64, -64, -64, -64, -64, -64, -64, -64, 64, -64, 64, -64, -64, -64, 64, 64, -64, -64, -64, -64, -64, 64, 64, 64, 64, 64, 64, -64, -64, -64, -64, -64, -64, -64, -64, -64, 64, -64, 64, -64, -64, 64, -64, -64, -64, -64, -64, -64, -64, 64, 64, 64, 64, 64, 64, -64, -64, -64, -64, -64, -64, -64, -64, -64, -64, 64, 64, -64, 64, -64, -64, 64, -64, -64, 64, 64, -64, -64, 64, 64, 64, 64, -64, -64, -64, 64, -64, -64, -64, -64, -64, -64, -64, -64, -64, -64, -64, -64, -64, 64, -64, -64, -64, -64, -64, -64, 64, 64, 64, 64, -64, 64, 64, -64, 64, -64, -64, -64, -64, -64, -64, -64, -64, 64, 64, 64, 64, -64, -64, -64, -64, -64, -64, -64, -64, 64, 64, 64, 64, 64, -64, 64, 64, -64, 64, 64, 64, -64, -64, -64, 64, 64, 64, 64, 64, 64, 64, -64, -64, -64, -64, -64, -64, 64, 64, -64, 64, 64, -64, 64, -64, -64, -64, 64, 64, -64, -64, -64, -64, -64, -64, -64, -64, 64, 64, -64, 64, -64, -64, -64, -64, -64, 64, -64, 64, -64, 64, -64, 64, -64, 64, 64, 64, -64, -64, 64, -64, 64, 64, -64, -64, 64, -64, -64, -64, -64, -64, -64, -64, -64, -64, -64, -64, -64, -64, -64, -64, 64, -64, 64, -64, 64, 64, 64, -64, 64, -64, -64, -64, 64, -64, -64, -64, -64, -64, -64, -64, -64, -64, -64, 64, -64, -64, -64, -64, -64, -64, 64, -64, 64, -64, 64, 64, 64, 64, 64, -64, -64, -64, -64, -64, -64, -64, -64, -64, -64, -64, -64, -64, -64, -64, 64, -64, -64, 64, 64, -64, 64, 64, 64, -64, -64, 64, -64, -64, -64, 64, -64, -64, 64, -64, 64, 64, -64, -64, -64, -64, -64, -64, -64, -64, -64, -64, 64, 64, 64, 64, 64, 64, -64, 64, -64, -64, 64, 64, -64, 64, 64, 64, 64, 64, -64, -64, -64, -64, -64, -64, -64, 64, 64, 64, -64, 64, 64, 64, 64, -64, -64, -64, -64, 64, 64, 64, 64, 64, 64, 64, 64, 64, 64, -64, -64, -64, -64, -64, -64, 64, 64, -64, -64, 64, 64, 64, 64, -64, -64, 64, 64, -64, 64, 64, 64, 64, 64, 64, 64, 64, 64, 64, -64, -64, 64, 64, 64, 64, 64, -64, 64, 64, 64, 64, 64, 64, -64, 64, -64, 64, 64, 64, -64, -64, 64, -64, 64, 64, 64, 64, 64, 64, -64, -64, -64, 64, 64, 64, 64, 64, 64, 64, 64, -64, -64, 64, -64, -64, -64, -64, -64, -64, -64, -64, 64, 64, 64, 64, 64, 64, -64, 64, 64, 64, -64, 64, 64, 64, 64, 64, 64, 64, -64, -64, 64, 64, 64, -64, -64, -64, -64, -64, -64, -64, -64, 64, 64, 64, 64, 64, 64, -64, -64, 64, -64, 64, 64, 64, 64, 64, 64, -64, 64, 64, -64, 64, -64, -64, -64, -64, -64, -64, -64, -64, 64, 64, 64, -64, -64, -64, 64, 64, 64, 64, 64, -64, -64, 64, 64, 64, 64, 64, 64, -64, 64, -64, -64, 64, -64, -64, -64, -64, 64, -64, 64, -64, -64, -64, -64, 64, 64, 64, -64, 64, 64, 64, 64, -64, -64, -64, -64, -64, 64, 64, 64, -64, -64, -64, 64, 64, 64, -64, 64, 64, -64, -64, 64, 64, -64, -64, -64, -64, -64, 64, -64, 64, 64, 64, -64, -64, 64, 64, 64, -64, 64, -64, -64, 64, 64, -64, -64, 64, 64, 64, 64, -64, 64, 64, -64, 64, 64, -64, 64, -64, -64, 64, 64, 64, 64, 64, 64, 64, 64, 64, -64, -64, -64, -64, 64, -64, 64, 64, -64, 64, 64, -64, -64, -64, -64, 64, -64, 64, 64, -64, -64, 64, 64, -64, -64, 64, -64, -64, 64, 64, 64, -64, -64, 64, 64, 64, 64, -64, -64, 64, -64, 64, -64, 64, 64, -64, -64, 64, -64, 64, 64, 64, -64, -64, -64, -64, -64, -64, -64, -64, 64, 64, 64, 64, 64, 64, 64, 64, 64, 64, -64, -64, 64, -64, -64, -64, 64, 64, 64, -64, -64, -64, -64, -64, -64, -64, 64, 64, -64, -64, 64, -64, -64, -64, -64, -64, 64, -64, -64, 64, 64, -64, 64, -64, -64, -64, 64, 64, -64, -64, -64, -64, -64, -64, -64, 64, 64, 64, 64, -64, 64, 64, 64, -64, 64, 64, -64, 64, 64, -64, 64, -64, 64, -64, 64, -64, -64, -64, -64, -64, -64, -64, 64, 64, 64, 64, 64, 64, -64, -64, -64, 64, 64, 64, -64, -64, -64, -64, 64, 64, 64, 64, 64, -64, -64, -64, -64, -64, -64, 64, 64, 64, 64, 64, 64, -64, 64, -64, -64, -64, 64, 64, -64, -64, -64, -64, 64, -64, 64, -64, -64, -64, -64, -64, -64, -64, 64, 64, -64, -64, -64, 64, 64, 64, 64, 64, -64, -64, -64, 64, -64, -64, -64, 64, -64, 64, 64, -64, -64, -64, -64, -64, -64, 64, 64, -64, 64, 64, 64, 64, 64, 64, 64, -64, -64, -64, 64, -64, -64, -64, -64, -64, 64, -64, -64, -64, 64, -64, -64, -64, 64, 64, 64, -64, -64, -64, 64, 64, 64, 64, 64, -64, -64, 64, -64, 64, -64, -64, 64, -64, -64, -64, 64, -64, -64, -64, -64, -64, -64, -64, -64, -64, -64, -64, 64, -64, 64, 64, -64, -64, -64, -64, 64, -64, 64, -64, -64, 64, 64, 64, -64, -64, -64, -64, -64, -64, -64, -64, -64, -64, 64, -64, 64, 64, 64, -64, -64, -64, -64, -64, -64, -64, -64, -64, 64, -64, -64, 64, -64, -64, -64, 64, -64, -64, 64, -64, -64, -64, 64, 64, 64, -64, -64, 64, -64, -64, -64, -64, 64, -64, -64, -64, -64, -64, 64, 64, -64, -64, -64, 64, 64, -64, -64, -64, -64, -64, 64, 64, 64, 64, -64, -64, -64, -64, -64, -64, -64, 64, 64, -64, -64, 64, 64, 64, 64, 64, 64, -64, 64, -64, 64, -64, -64, -64, -64, 64, 64, -64, 64, -64, -64, -64, -64, -64, -64, -64, -64, -64, -64, -64, -64, -64, -64, 64, -64, 64, 64, 64, -64, -64, -64, -64, 64, 64, 64, 64, 64, 64, -64, -64, -64, 64, -64, 64, -64, -64, -64, -64, 64, 64, 64, -64, -64, -64, -64, -64, -64, -64, -64, -64, -64, 64, 64, -64, -64, 64, -64, -64, -64, -64, -64, -64, -64, -64, -64, -64, -64, 64, -64, -64, 64, -64, 64, -64, -64, -64, -64, -64, -64, 64, 64, -64, 64, 64, -64, -64, -64, -64, -64, -64, -64, -64, 64, -64, 64, -64, 64, 64, 64, -64, -64, -64, -64, -64, -64, -64, -64, -64, 64, 64, 64, 64, 64, -64, -64, -64, -64, -64, -64, -64, 64, -64, 64, 64, -64, 64, 64, -64, 64, 64, -64, -64, -64, -64, -64, -64, 64, -64, 64, -64, -64, -64, -64, -64, -64, -64, -64, -64, -64, 64, 64, -64, 64, 64, 64, -64, 64, -64, -64, -64, -64, -64, -64, 64, 64, 64, 64, -64, -64, -64, -64, -64, -64, -64, -64, -64, 64, -64, 64, 64, 64, 64, 64, 64, 64, -64, 64, -64, -64, -64, 64, 64, 64, 64, 64, 64, -64, -64, -64, -64, -64, -64, -64, -64, 64, -64, -64, 64, 64, -64, -64, 64, 64, 64, 64, -64, -64, -64, 64, 64, 64, -64, -64, -64, -64, -64, -64, -64, -64, -64, -64, 64, -64, 64, 64, -64, 64, -64, -64, 64, 64, 64, 64, 64, 64, -64, 64, -64, -64, -64, -64, -64, -64, -64, -64, 64, 64, 64, 64, 64, 64, 64, 64, -64, 64, -64, -64, 64, 64, 64, 64, 64, 64, 64, -64, -64, -64, -64, -64, -64, -64, 64, 64, -64, -64, -64, 64, -64, 64, -64, -64, 64, -64, 64, 64, -64, 64, 64, -64, -64, -64, -64, 64, -64, 64, -64, 64, 64, -64, -64, 64, 64, 64, -64, -64, -64, -64, 64, 64, 64, 64, -64, 64, 64, -64, -64, -64, -64, -64, -64, -64, 64, -64, -64, -64, -64, 64, 64, 64, -64, -64, 64, 64, -64, 64, 64, 64, 64, 64, -64, -64, 64, -64, -64, -64, 64, 64, -64, -64, 64, -64, 64, -64, -64, -64, 64, 64, -64, 64, -64, -64, -64, -64, 64, 64, -64, -64, 64, 64, -64, 64, -64, -64, -64, -64, -64, -64, -64, -64, 64, 64, 64, -64, -64, 64, 64, -64, 64, -64, -64, 64, -64, 64, 64, -64, 64, 64, 64, 64, 64, -64, 64, 64, 64, 64, 64, 64, 64, 64, 64, -64, 64, 64, 64, 64, -64, 64, 64, 64, 64, 64, 64, 64, -64, 64, 64, 64, 64, -64, -64, 64, 64, 64, 64, 64, 64, -64, -64, 64, -64, -64, -64, -64, -64, -64, 64, 64, -64, -64, -64, -64, 64, 64, -64, -64, -64, 64, -64, 64, -64, -64, 64, 64, 64, -64, -64, 64, -64, -64, -64, -64, -64, -64, -64, -64, -64, -64, -64, 64, -64, -64, -64, -64, -64, -64, -64, 64, -64, -64, -64, -64, -64, 64, 64, 64, 64, -64, -64, -64, -64, -64, -64, 64, -64, -64, -64, -64, 64, -64, 64, 64, -64, 64, 64, -64, -64, 64, -64, -64, -64, 64, 64, 64, -64, -64, -64, -64, -64, -64, -64, -64, -64, -64, -64, 64, -64, 64, 64, -64, 64, 64, 64, 64, 64, -64, -64, -64, 64, -64, 64, 64, 64, -64, -64, -64, -64, -64, -64, -64, -64, 64, -64, 64, 64, 64, 64, 64, 64, -64, -64, -64, 64, -64, -64, -64, 64, 64, 64, 64, 64, -64, -64, 64, -64, -64, -64, -64, 64, -64, -64, -64, -64, 64, 64, 64, 64, -64, 64, -64, -64, -64, -64, -64, 64, 64, 64, 64, 64, -64, -64, 64, -64, -64, -64, 64, 64, 64, 64, -64, 64, 64, -64, -64, -64, 64, -64, -64, -64, -64, -64, 64, 64, 64, 64, 64, 64, 64, 64, 64, 64, -64, -64, -64, -64, -64, -64, 64, 64, 64, -64, 64, -64, -64, -64, -64, 64, -64, -64, 64, 64, 64, 64, 64, 64, 64, 64, 64, 64, -64, 64, -64, 64, 64, -64, -64, -64, 64, 64, -64, -64, 64, -64, -64, -64, 64, -64, 64, 64, 64, 64, 64, 64, -64, -64, 64, -64, 64, -64, -64, -64, -64, -64, -64, -64, -64, -64, -64, -64, -64, -64, -64, 64, 64, 64, 64, 64, 64, 64, 64, 64, 64, -64, -64, -64, 64, -64, -64, 64, 64, 64, -64, -64, -64, -64, -64, -64, -64, -64, 64, 64, -64, 64, 64, 64, 64, 64, 64, 64, -64, -64, -64, -64, 64, 64, 64, -64, 64, -64, -64, -64, -64, -64, -64, -64, -64, -64, 64, 64, 64, 64, 64, 64, 64, 64, 64, 64, -64, -64, -64, -64, -64, 64, -64, -64, 64, 64, -64, -64, -64, -64, -64, 64, 64, 64, 64, 64, 64, 64, 64, 64, 64, 64, 64, 64, 64, -64, -64, -64, -64, 64, 64, -64, 64, -64, -64, -64, -64, -64, -64, 64, 64, 64, 64, 64, 64, 64, -64, -64, -64, -64, -64, -64, 64, 64, -64, -64, -64, 64, 64, 64, 64, 64, 64, 64, -64, -64, -64, -64, 64, 64, 64, 64, 64, 64, 64, -64, -64, -64, -64, -64, -64, 64, 64, 64, 64, 64, 64, 64, 64, -64, 64, 64, -64, -64, 64, 64, -64, 64, 64, 64, 64, 64, -64, -64, -64, -64, -64, -64, 64, -64, -64, -64, -64, 64, 64, -64, 64, 64, -64, 64, 64, -64, -64, 64, 64, -64, -64, -64, -64, -64, -64, -64, -64, -64, 64, 64, -64, -64, -64, -64, 64, 64, 64, 64, -64, -64, -64, -64, -64, -64, -64, 64, 64, -64, -64, -64, -64, -64, -64, -64, -64, 64, -64, 64, -64, -64, -64, -64, 64, -64, 64, 64, -64, -64, -64, 64, -64, -64, 64, -64, -64, -64, 64, 64, 64, -64, 64, -64, -64, -64, 64, -64, 64, 64, 64, -64, -64, 64, 64, 64, -64, 64, 64, 64, 64, 64, 64, 64, 64, 64, 64, 64, 64, 64, 64, 64, -64, -64, 64, -64, 64, 64, 64, -64, -64, -64, -64, 64, -64, -64, 64, 64, 64, -64, -64, 64, 64, -64, 64, -64, 64, -64, -64, -64, -64, 64, -64, 64, 64, 64, -64, -64, -64, 64, -64, 64, 64, 64, 64, 64, 64, -64, 64, 64, 64, -64, 64, 64, 64, 64, 64, 64, -64, -64, -64, -64, -64, 64, -64, -64, -64, -64, 64, 64, -64, -64, 64, 64, 64, -64, -64, 64, -64, 64, -64, 64, -64, -64, 64, -64, 64, 64, 64, 64, -64, 64, 64, 64, -64, 64, -64, 64, -64, -64, 64, 64, 64, 64, -64, 64, 64, 64, -64, -64, 64, -64, -64, 64, -64, 64, -64, 64, 64, 64, -64, -64, -64, 64, -64, -64, -64, -64, 64, 64, 64, -64, -64, 64, -64, 64, 64, 64, -64, 64, -64, 64, 64, 64, -64, 64, 64, -64, 64, 64, -64, -64, 64, -64, -64, 64, -64, -64, -64, 64, 64, 64, 64, -64, 64, -64, 64, 64, -64, -64, 64, -64, -64, -64, -64, -64, -64, -64, -64, -64, 64, 64, -64, -64, 64, -64, -64, -64, 64, 64, 64, -64, -64, -64, -64, 64, -64, 64, 64, 64, 64, -64, 64, -64, 64, -64, 64, -64, 64, 64, 64, -64, -64, -64, -64, 64, -64, -64, 64, -64, -64, -64, -64, -64, -64, -64, 64, -64, -64, -64, 64, 64, 64, -64, 64, 64, -64, 64, -64, 64, 64, -64, 64, -64, -64, -64, 64, -64, -64, -64, -64, -64, -64, -64, -64, -64, -64, 64, 64, 64, 64, -64, -64, -64, 64, 64, -64, 64, 64, -64, -64, -64, -64, -64, -64, 64, -64, -64, 64, -64, 64, 64, 64, 64, 64, -64, 64, 64, 64, 64, -64, -64, 64, 64, -64, -64, 64, 64, -64, -64, -64, 64, 64, 64, 64, 64, 64, 64, 64, 64, -64, -64, 64, 64, 64, 64, 64, 64, 64, 64, -64, -64, 64, 64, 64, 64, -64, 64, -64, 64, 64, -64, 64, -64, 64, 64, 64, -64, -64, -64, 64, 64, 64, 64, 64, 64, 64, 64, 64, -64, -64, -64, 64, 64, 64, 64, -64, -64, -64, -64, -64, 64, 64, -64, -64, -64, -64, 64, 64, 64, 64, 64, 64, 64, -64, 64, -64, 64, 64, -64, 64, 64, -64, 64, -64, -64, -64, 64, -64, 64, -64, -64, -64, -64, 64, 64, 64, 64, 64, 64, 64, -64, -64, 64, -64, 64, -64, -64, 64, 64, -64, 64, -64, -64, -64, 64, -64, -64, -64, -64, -64, 64, 64, 64, 64, 64, 64, 64, -64, -64, -64, 64, -64, -64, 64, 64, -64, -64, 64, 64, -64, -64, -64, 64, 64, -64, -64, -64, -64, 64, -64, 64, 64, 64, 64, 64, -64, -64, -64, -64, -64, -64, -64, -64, -64, 64, 64, 64, -64, -64, 64, 64, 64, -64, -64, -64, -64, 64, -64, -64, 64, 64, -64, 64, -64, -64, -64, 64, 64, -64, -64, 64, 64, 64, 64, -64, -64, -64, 64, -64, -64, -64, -64, -64, -64, 64, 64, -64, 64, 64, 64, 64, -64, -64, -64, -64, 64, 64, -64, 64, 64, 64, 64, -64, -64, -64, -64, -64, -64, -64, 64, 64, 64, 64, 64, -64, 64, 64, -64, -64, -64, -64, -64, -64, 64, 64, 64, -64, -64, 64, 64, 64, -64, -64, 64, -64, 64, 64, 64, 64, 64, 64, 64, -64, -64, -64, -64, 64, -64, -64, -64, -64, 64, -64, 64, 64, 64, 64, 64, 64, 64, -64, -64, -64, -64, 64, 64, 64, 64, 64, 64, -64, -64, -64, -64, 64, 64, -64, -64, -64, 64, 64, -64, 64, -64, -64, 64, 64, -64, -64, -64, -64, -64, 64, 64, 64, 64, 64, 64, 64, 64, -64, -64, -64, -64, -64, -64, 64, -64, 64, 64, -64, 64, -64, 64, 64, 64, -64, 64, 64, 64, 64, 64, 64, 64, -64, 64, 64, 64, 64, -64, -64, 64, 64, 64, 64, 64, 64, -64, 64, -64, 64, 64, 64, 64, 64, 64, -64, 64, 64, 64, -64, 64, 64, 64, -64, 64, -64, -64, -64, -64, 64, -64, 64, 64, -64, 64, -64, -64, -64, 64, 64, 64, 64, 64, -64, 64, 64, 64, 64, 64, 64, -64, -64, -64, -64, 64, -64, 64, -64, -64, -64, -64, 64, -64, 64, -64, -64, -64, 64, 64, -64, 64, 64, 64, 64, -64, -64, -64, -64, 64, -64, -64, 64, 64, -64, 64, -64, -64, -64, -64, 64, 64, -64, 64, 64, -64, -64, -64, 64, 64, 64, 64, 64, -64, 64, -64, -64, -64, -64, -64, -64, 64, 64, 64, 64, -64, -64, -64, -64, 64, -64, 64, 64, 64, -64, 64, 64, 64, -64, -64, 64, -64, -64, 64, -64, -64, 64, -64, -64, -64, -64, 64, 64, 64, -64, -64, -64, -64, 64, -64, -64, -64, -64, 64, 64, 64, -64, -64, 64, -64, -64, 64, 64, -64, 64, -64, 64, -64, 64, -64, -64, 64, 64, 64, -64, 64, -64, -64, -64, 64, -64, 64, -64, -64, 64, -64, -64, -64, -64, -64, -64, -64, -64, -64, -64, -64, -64, -64, -64, 64, 64, 64, 64, -64, -64, -64, -64, -64, 64, 64, -64, 64, 64, 64, -64, -64, -64, -64, -64, -64, -64, 64, -64, -64, -64, -64, -64, -64, -64, -64, 64, 64, -64, -64, -64, -64, 64, -64, 64, 64, -64, -64, -64, -64, 64, 64, -64, -64, 64, 64, 64, -64, -64, -64, -64, 64, -64, 64, 64, 64, 64, 64, 64, 64, 64, -64, -64, -64, 64, -64, -64, 64, 64, -64, -64, 64, 64, 64, 64, -64, -64, 64, -64, -64, 64, 64, -64, 64, 64, -64, -64, -64, 64, -64, -64, 64, -64, 64, -64, -64, 64, -64, -64, 64, 64, -64, 64, -64, 64, -64, 64, 64, 64, 64, 64, -64, 64, 64, 64, -64, -64, 64, 64, -64, 64, 64, 64, -64, -64, -64, -64, 64, 64, -64, 64, -64, -64, -64, 64, 64, -64, -64, -64, 64, 64, 64, 64, -64, -64, 64, -64, 64, 64, 64, 64, -64, -64, 64, -64, -64, 64, -64, 64, -64, 64, -64, -64, -64, 64, -64, 64, -64, -64, -64, -64, 64, 64, 64, -64, 64, 64, 64, -64, 64, 64, 64, -64, -64, 64, -64, -64, -64, 64, 64, 64, 64, 64, -64, -64, 64, -64, -64, 64, -64, 64, 64, 64, 64, -64, -64, -64, 64, 64, 64, 64, -64, 64, -64, 64, 64, 64, 64, -64, -64, -64, -64, -64, 64, 64, 64, 64, 64, -64, 64, -64, 64, 64, 64, -64, -64, -64, 64, 64, 64, 64, 64, 64, 64, -64, 64, -64, 64, 64, -64, -64, 64, -64, 64, -64, 64, 64, -64, 64, -64, -64, 64, -64, -64, -64, 64, 64, 64, -64, 64, 64, -64, 64, 64, 64, -64, 64, 64, -64, -64, 64, 64, -64, 64, 64, -64, 64, -64, -64, 64, -64, 64, 64, 64, 64, 64, 64, -64, 64, 64, 64, -64, 64, 64, -64, -64, -64, -64, 64, -64, 64, 64, 64, 64, -64, 64, 64, 64, -64, -64, 64, -64, 64, 64, 64, 64, 64, 64, 64, 64, -64, -64, -64, 64, -64, 64, 64, 64, -64, 64, -64, -64, 64, 64, -64, -64, 64, 64, 64, -64, 64, 64, -64, 64, 64, 64, 64, 64, 64, -64, -64, 64, 64, 64, -64, 64, 64, 64, 64, 64, 64, 64, -64, 64, -64, -64, 64, 64, 64, 64, 64, 64, 64, 64, 64, 64, 64, 64, 64, 64, -64, -64, -64, -64, 64, 64, -64, -64, 64, 64, 64, 64, 64, -64, 64, 64, -64, 64, -64, 64, 64, 64, -64, -64, 64, 64, 64, 64, -64, -64, -64, -64, 64, 64, -64, -64, 64, 64, 64, -64, 64, 64, 64, 64, 64, 64, -64, -64, 64, 64, 64, -64, 64, -64, 64, -64, 64, -64, -64, 64, 64, 64, 64, 64, -64, -64, -64, 64, 64, 64, 64, 64, 64, 64, 64, 64, 64, -64, 64, 64, 64, -64, 64, -64, 64, -64, -64, 64, 64, -64, -64, 64, 64, -64, -64, 64, 64, 64, 64, -64, 64, 64, 64, 64, -64, -64, 64, 64, -64, 64, 64, -64, -64, -64, 64, 64, 64, 64, 64, -64, 64, 64, -64, -64, -64, -64, 64, 64, 64, 64, 64, 64, 64, 64, 64, 64, -64, -64, -64, -64, -64, -64, 64, -64, -64, 64, 64, -64, -64, 64, -64, -64, 64, 64, 64, -64, 64, 64, 64, -64, -64, -64, 64, 64, 64, 64, 64, -64, 64, 64, -64, -64, 64, 64, -64, -64, 64, -64, 64, 64, -64, 64, -64, 64, 64, -64, 64, 64, 64, 64, 64, -64, 64, -64, -64, 64, 64, -64, -64, -64, -64, 64, -64, -64, 64, 64, 64, 64, -64, -64, 64, 64, 64, -64, -64, 64, 64, -64, 64, 64, 64, 64, -64, 64, 64, 64, 64, -64, -64, -64, 64, 64, 64, -64, -64, 64, -64, 64, -64, -64, -64, 64, 64, 64, 64, 64, 64, 64, 64, -64, 64, -64, -64, -64, -64, 64, 64, -64, 64, 64, -64, 64, 64, -64, 64, -64, -64, 64, -64, -64, -64, -64, 64, -64, 64, 64, 64, 64, 64, 64, -64, -64, -64, 64, -64, -64, 64, 64, 64, 64, -64, 64, -64, -64, -64, -64, 64, 64, -64, -64, 64, 64, -64, 64, 64, 64, 64, 64, -64, 64, 64, 64, -64, 64, -64, -64, 64, -64, -64, 64, 64, 64, -64, 64, 64, -64, 64, 64, -64, 64, 64, 64, -64, 64, 64, 64, 64, -64, -64, -64, 64, 64, 64, -64, 64, -64, 64, -64, 64, -64, -64, -64, -64, -64, -64, -64, 64, 64, 64, 64, 64, 64, 64, 64, -64, 64, -64, -64, -64, -64, -64, 64, -64, 64, 64, 64, -64, -64, 64, -64, -64, -64, -64, 64, 64, 64, 64, 64, -64, 64, 64, -64, -64, 64, 64, 64, 64, 64, -64, -64, 64, 64, 64, 64, 64, 64, 64, 64, -64, 64, 64, 64, 64, 64, 64, -64, -64, 64, -64, 64, -64, 64, 64, 64, 64, -64, -64, 64, -64, -64, 64, 64, 64, -64, 64, -64, -64, 64, -64, 64, -64, 64, 64, 64, 64, -64, 64, -64, -64, -64, -64, -64, 64, 64, 64, 64, -64, 64, 64, 64, 64, 64, -64, -64, -64, -64, -64, -64, 64, 64, 64, -64, -64, 64, 64, 64, -64, -64, 64, -64, -64, -64, 64, 64, -64, 64, 64, -64, 64, 64, 64, -64, 64, -64, 64, 64, 64, 64, 64, 64, 64, 64, -64, -64, 64, 64, 64, 64, -64, 64, 64, 64, -64, -64, -64, 64, 64, -64, -64, 64, 64, -64, 64, 64, 64, 64, 64, 64, 64, -64, -64, 64, 64, 64, -64, -64, 64, -64, -64, 64, 64, -64, 64, -64, 64, -64, -64, -64, 64, 64, 64, -64, 64, 64, -64, -64, -64, 64, 64, -64, -64, 64, -64, 64, -64, 64, -64, -64, -64, 64, -64, 64, -64, 64, -64, 64, -64, 64, 64, 64, 64, -64, 64, -64, 64, 64, -64, -64, -64, -64, 64, 64, -64, -64, -64, 64, 64, -64, -64, -64, -64, -64, -64, -64, -64, -64, 64, -64, -64, -64, 64, -64, 64, -64, 64, -64, 64, 64, -64, 64, -64, 64, 64, -64, 64, 64, -64, -64, -64, -64, -64, -64, -64, 64, -64, 64, -64, 64, -64, 64, 64, 64, 64, 64, -64, 64, -64, -64, -64, -64, -64, 64, 64, -64, 64, -64, -64, -64, -64, 64, 64, 64, 64, 64, 64, -64, 64, 64, -64, 64, 64, 64, 64, 64, 64, -64, 64, 64, -64, 64, 64, 64, 64, -64, 64, 64, 64, 64, -64, 64, 64, 64, 64, 64, 64, 64, -64, 64, -64, -64, -64, 64, 64, -64, 64, -64, 64, 64, -64, -64, -64, -64, 64, 64, 64, -64, -64, 64, 64, 64, 64, 64, 64, 64, 64, -64, -64, -64, -64, -64, -64, 64, 64, 64, 64, 64, 64, 64, -64, 64, 64, 64, 64, -64, 64, 64, -64, 64, 64, 64, 64, 64, 64, -64, -64, -64, -64, -64, 64, 64, 64, 64, 64, 64, 64, 64, -64, 64, -64, 64, 64, 64, 64, -64, 64, -64, -64, -64, -64, -64, -64, -64, -64, -64, -64, -64, -64, 64, 64, -64, 64, 64, -64, 64, 64, -64, 64, 64, 64, 64, 64, -64, 64, 64, 64, 64, 64, 64, 64, 64, 64, 64, 64, -64, -64, 64, -64, 64, 64, -64, 64, 64, 64, 64, 64, -64, 64, 64, -64, 64, 64, 64, 64, 64, 64, -64, -64, 64, 64, 64, -64, -64, -64, 64, 64, -64, 64, 64, 64, 64, 64, 64, -64, 64, -64, -64, 64, 64, 64, -64, 64, -64, -64, 64, -64, 64, 64, 64, 64, -64, 64, -64, 64, -64, 64, 64, 64, 64, -64, -64, -64, -64, -64, 64, 64, 64, 64, 64, -64, -64, 64, -64, 64, -64, 64, 64, -64, -64, -64, 64, -64, -64, 64, 64, 64, 64, 64, 64, 64, 64, 64, 64, 64, 64, 64, 64, 64, -64, 64, -64, -64, -64, 64, -64, -64, 64, 64, 64, -64, 64, 64, 64, 64, 64, 64, 64, 64, 64, 64, 64, -64, 64, 64, 64, 64, -64, -64, 64, 64, 64, 64, 64, -64, 64, 64, 64, 64, 64, 64, 64, 64, 64, 64, 64, 64, 64, 64, 64, -64, -64, -64, 64, 64, 64, -64, 64, 64, 64, 64, 64, 64, -64, -64, -64, 64, 64, 64, 64, 64, 64, 64, 64, 64, 64, 64, -64, 64, -64, -64, 64, -64, 64, -64, 64, 64, -64, -64, -64, 64, 64, 64, 64, 64, 64, 64, 64, 64, 64, 64, 64, 64, 64, 64, -64, -64, -64, 64, -64, 64, 64, 64, -64, 64, 64, 64, 64, 64, -64, 64, -64, 64, 64, 64, -64, 64, 64, 64, 64, 64, 64, 64, -64, -64, -64, 64, 64, 64, 64, -64, -64, 64, 64, -64, -64, 64, 64, -64, -64, 64, -64, 64, 64, 64, 64, -64, -64, 64, -64, 64, -64, -64, -64, 64, 64, 64, 64, 64, -64, -64, 64, 64, -64, 64, 64, 64, -64, -64, -64, -64, -64, 64, 64, -64, 64, 64, -64, 64, -64, -64, 64, 64, 64, 64, 64, 64, 64, 64, 64, -64, 64, 64, 64, 64, -64, -64, 64, 64, 64, -64, -64, -64, -64, 64, -64, -64, -64, 64, -64, 64, 64, 64, 64, 64, -64, 64, -64, -64, 64, 64, 64, -64, 64, 64, -64, -64, 64, 64, 64, 64, 64, 64, -64, -64, 64, -64, -64, -64, 64, 64, -64, 64, -64, -64, 64, -64, 64, 64, -64, -64, 64, 64, 64, -64, -64, 64, -64, -64, -64, -64, 64, 64, 64, -64, 64, 64, 64, 64, -64, -64, 64, 64, -64, 64, -64, 64, -64, 64, 64, 64, 64, 64, -64, -64, 64, 64, -64, 64, 64, -64, -64, 64, -64, 64, -64, -64, 64, 64, -64, 64, 64, -64, -64, 64, -64, -64, -64, 64, 64, -64, -64, 64, 64, -64, 64, 64, -64, -64, -64, -64, -64, -64, -64, -64, -64, -64, -64, 64, 64, -64, 64, 64, -64, -64, 64, -64, -64, -64, -64, -64, -64, -64, -64, -64, -64, -64, 64, 64, -64, 64, -64, -64, 64, -64, -64, 64, -64, -64, -64, -64, -64, 64, 64, -64, -64, 64, 64, 64, -64, -64, -64, -64, -64, -64, -64, -64, -64, -64, -64, 64, -64, -64, 64, 64, 64, 64, -64, 64, 64, -64, -64, 64, -64, 64, 64, -64, -64, 64, -64, 64, 64, 64, 64, -64, -64, -64, -64, -64, -64, -64, -64, -64, 64, -64, 64, 64, -64, -64, 64, 64, 64, 64, 64, -64, 64, 64, 64, -64, 64, 64, 64, -64, -64, -64, -64, 64, -64, -64, -64, -64, -64, -64, 64, -64, -64, -64, 64, -64, -64, -64, -64, 64, 64, -64, 64, 64, 64, 64, 64, 64, 64, 64, -64, 64, -64, -64, -64, 64, -64, 64, 64, 64, -64, -64, -64, 64, -64, -64, 64, -64, 64, 64, 64, 64, 64, -64, 64, 64, 64, 64, 64, -64, -64, -64, 64, -64, -64, 64, 64, -64, -64, 64, 64, -64, 64, 64, 64, 64, -64, 64, 64, -64, 64, 64, 64, 64, 64, 64, 64, -64, -64, -64, -64, 64, -64, 64, 64, 64, -64, 64, -64, -64, -64, 64, -64, -64, 64, 64, 64, -64, 64, 64, 64, 64, 64, 64, 64, -64, -64, -64, -64, 64, 64, -64, 64, 64, 64, -64, -64, 64, 64, 64, 64, 64, 64, -64, 64, -64, 64, 64, 64, 64, 64, 64, 64, -64, -64, -64, -64, -64, -64, -64, -64, 64, 64, -64, -64, -64, -64, -64, 64, 64, 64, -64, -64, 64, 64, -64, 64, 64, 64, 64, -64, -64, -64, -64, -64, -64, -64, -64, -64, 64, 64, -64, -64, 64, 64, -64, 64, 64, -64, 64, 64, -64, 64, -64, -64, 64, 64, 64, -64, -64, -64, -64, -64, -64, -64, -64, -64, 64, 64, 64, 64, 64, 64, -64, -64, 64, 64, -64, -64, 64, -64, -64, -64, 64, 64, 64, -64, -64, -64, 64, -64, -64, 64, -64, 64, -64, -64, 64, -64, 64, 64, -64, -64, 64, 64, 64, -64, 64, 64, -64, 64, 64, 64, 64, -64, 64, -64, -64, 64, -64, -64, 64, 64, 64, -64, -64, 64, 64, -64, 64, -64, -64, 64, 64, 64, 64, 64, 64, 64, 64, 64, 64, -64, -64, 64, -64, 64, -64, 64, 64, 64, -64, -64, 64, -64, 64, 64, 64, 64, 64, 64, 64, 64, -64, -64, 64, 64, 64, 64, 64, 64, -64, -64, 64, 64, 64, 64, 64, 64, 64, 64, 64, 64, -64, -64, -64, 64, 64, 64, 64, 64, -64, 64, 64, 64, 64, 64, 64, -64, -64, -64, 64, -64, -64, 64, 64, 64, 64, 64, 64, -64, -64, 64, -64, -64, 64, 64, 64, 64, 64, 64, 64, 64, 64, 64, -64, 64, -64, 64, 64, 64, 64, 64, 64, 64, 64, -64, -64, -64, -64, 64, 64, 64, 64, 64, 64, -64, 64, 64, 64, 64, 64, 64, 64, -64, 64, 64, 64, 64, 64, 64, 64, 64, 64, -64, -64, -64, -64, 64, 64, 64, -64, -64, -64, 64, 64, 64, 64, 64, 64, 64, -64, 64, 64, 64, 64, -64, 64, -64, 64, -64, -64, -64, -64, -64, 64, 64, -64, -64, 64, -64, -64, 64, 64, 64, -64, -64, 64, 64, 64, -64, 64, 64, 64, 64, -64, -64, 64, -64, -64, -64, 64, -64, 64, -64, -64, -64, 64, 64, 64, 64, 64, -64, -64, 64, -64, 64, 64, 64, 64, 64, 64, 64, -64, 64, 64, 64, -64, -64, -64, -64, -64, -64, -64, 64, 64, -64, 64, 64, 64, -64, -64, 64, 64, 64, 64, 64, 64, 64, 64, -64, -64, 64, -64, 64, -64, 64, 64, 64, -64, -64, -64, 64, 64, 64, 64, -64, -64, -64, -64, 64, 64, 64, 64, 64, 64, 64, 64, -64, -64, -64, -64, -64, -64, -64, -64, -64, 64, -64, -64, -64, 64, -64, -64, -64, -64, -64, -64, 64, 64, -64, 64, 64, 64, 64, 64, -64, -64, -64, -64, 64, 64, -64, -64, 64, 64, 64, 64, -64, -64, -64, -64, -64, -64, -64, -64, 64, -64, -64, -64, -64, 64, -64, -64, -64, -64, -64, 64, -64, 64, 64, 64, 64, -64, -64, -64, -64, -64, -64, -64, -64, -64, -64, -64, -64, -64, -64, -64, -64, -64, -64, -64, -64, -64, 64, -64, 64, -64, -64, 64, 64, -64, 64, 64, 64, -64, 64, -64, -64, 64, -64, 64, 64, 64, -64, -64, 64, -64, 64, 64, 64, -64, -64, 64, 64, 64, 64, 64, 64, 64, -64, -64, -64, -64, 64, 64, 64, 64, 64, -64, 64, 64, -64, -64, -64, 64, 64, 64, -64, 64, 64, 64, -64, -64, 64, 64, 64, -64, 64, -64, 64, 64, -64, -64, -64, -64, -64, -64, -64, 64, 64, 64, -64, -64, -64, -64, -64, 64, -64, -64, -64, -64, -64, -64, 64, -64, -64, 64, -64, 64, -64, -64, 64, 64, -64, -64, -64, -64, 64, 64, -64, -64, 64, -64, -64, -64, -64, -64, 64, -64, -64, 64, 64, 64, 64, 64, -64, 64, 64, -64, 64, 64, -64, -64, -64, -64, 64, 64, -64, -64, -64, 64, -64, -64, -64, -64, 64, 64, 64, -64, -64, -64, 64, -64, -64, -64, -64, 64, 64, -64, -64, 64, 64, 64, -64, 64, -64, -64, 64, -64, -64, -64, -64, -64, -64, -64, -64, 64, 64, 64, -64, -64, 64, 64, 64, 64, -64, -64, 64, 64, 64, 64, 64, 64, 64, 64, 64, 64, 64, 64, -64, -64, 64, 64, -64, -64, 64, 64, 64, -64, -64, 64, 64, 64, 64, 64, 64, 64, -64, 64, 64, 64, -64, 64, -64, -64, 64, -64, 64, 64, -64, -64, -64, 64, -64, 64, -64, -64, 64, 64, 64, 64, -64, -64, -64, 64, -64, -64, -64, 64, -64, -64, -64, 64, 64, 64, 64, 64, 64, -64, 64, -64, 64, 64, -64, 64, -64, 64, 64, 64, 64, -64, -64, -64, 64, 64, 64, 64, 64, -64, -64, 64, 64, 64, 64, 64, 64, 64, -64, -64, 64, 64, -64, -64, -64, 64, 64, 64, -64, -64, -64, -64, 64, 64, 64, 64, -64, 64, 64, -64, 64, 64, 64, 64, 64, 64, -64, -64, 64, 64, 64, -64, 64, 64, 64, -64, -64, -64, -64, 64, 64, 64, 64, -64, 64, -64, 64, 64, -64, 64, 64, 64, 64, 64, -64, -64, 64, 64, 64, 64, -64, 64, 64, -64, -64, -64, 64, 64, 64, 64, 64, -64, -64, -64, -64, -64, -64, 64, 64, 64, 64, -64, 64, -64, 64, 64, 64, -64, -64, -64, -64, -64, -64, -64, 64, 64, 64, -64, -64, -64, -64, -64, -64, -64, -64, -64, -64, 64, 64, 64, 64, -64, -64, 64, -64, -64, -64, -64, -64, -64, -64, 64, 64, 64, 64, 64, 64, -64, -64, -64, -64, -64, -64, -64, 64, 64, 64, 64, 64, 64, -64, 64, -64, -64, -64, -64, -64, -64, -64, 64, 64, 64, -64, 64, -64, -64, -64, -64, -64, 64, -64, -64, -64, 64, 64, -64, 64, 64, -64, -64, -64, -64, -64, -64, -64, 64, -64, -64, -64, -64, -64, 64, -64, -64, -64, -64, -64, -64, -64, -64, -64, 64, 64, -64, -64, -64, 64, -64, 64, -64, -64, -64, -64, -64, -64, -64, -64, -64, 64, 64, -64, -64, -64, -64, -64, -64, -64, 64, 64, 64, 64, 64, 64, 64, 64, 64, 64, -64, 64, -64, -64, -64, -64, -64, -64, -64, -64, -64, -64, -64, -64, -64, -64, -64, -64, 64, 64, 64, -64, 64, 64, -64, 64, 64, 64, -64, 64, -64, 64, 64, 64, -64, -64, 64, -64, -64, -64, -64, 64, 64, 64, -64, 64, 64, 64, 64, 64, 64, 64, -64, 64, -64, 64, 64, -64, -64, 64, -64, 64, -64, 64, 64, -64, -64, -64, 64, 64, -64, -64, 64, 64, 64, 64, 64, -64, -64, 64, -64, -64, 64, 64, -64, -64, 64, 64, 64, 64, 64, 64, -64, -64, -64, 64, -64, -64, -64, 64, -64, 64, 64, 64, 64, -64, 64, -64, 64, -64, 64, -64, -64, -64, -64, 64, 64, 64, 64, -64, 64, -64, -64, -64, 64, 64, -64, -64, -64, 64, 64, 64, 64, -64, 64, -64, -64, -64, 64, -64, -64, 64, 64, 64, 64, 64, 64, -64, -64, -64, 64, 64, -64, -64, 64, 64, -64, 64, 64, -64, 64, -64, 64, -64, -64, 64, 64, 64, 64, 64, 64, 64, 64, 64, 64, 64, 64, 64, 64, -64, 64, -64, -64, 64, 64, 64, -64, 64, -64, 64, 64, -64, 64, 64, 64, -64, 64, 64, 64, 64, 64, 64, -64, 64, 64, -64, 64, -64, -64, -64, -64, -64, 64, 64, 64, 64, 64, -64, -64, -64, -64, -64, -64, 64, 64, 64, 64, 64, -64, -64, -64, -64, -64, -64, -64, -64, -64, -64, -64, 64, 64, 64, 64, -64, 64, 64, 64, 64, 64, 64, 64, -64, -64, 64, 64, 64, 64, -64, -64, -64, -64, -64, -64, -64, -64, -64, -64, 64, 64, -64, 64, 64, -64, 64, 64, 64, -64, -64, -64, 64, 64, 64, -64, 64, 64, 64, 64, -64, 64, 64, -64, -64, 64, 64, 64, -64, -64, -64, -64, -64, -64, -64, 64, 64, 64, 64, -64, 64, -64, 64, -64, 64, -64, -64, 64, -64, 64, -64, 64, 64, 64, 64, -64, -64, 64, 64, -64, -64, 64, 64, -64, 64, -64, 64, 64, 64, 64, -64, 64, 64, 64, 64, 64, -64, -64, 64, -64, -64, -64, -64, -64, -64, 64, -64, -64, -64, 64, 64, -64, -64, -64, -64, -64, 64, -64, 64, 64, 64, -64, -64, -64, -64, -64, 64, 64, -64, 64, 64, 64, 64, -64, -64, 64, 64, -64, -64, 64, 64, 64, 64, 64, -64, -64, -64, -64, 64, -64, -64, 64, 64, -64, -64, 64, -64, 64, -64, -64, -64, -64, -64, 64, 64, 64, -64, 64, 64, -64, 64, 64, -64, -64, -64, 64, -64, -64, 64, 64, 64, 64, 64, -64, 64, 64, -64, 64, -64, -64, 64, 64, -64, 64, 64, -64, 64, 64, -64, -64, -64, -64, 64, 64, 64, 64, 64, 64, 64, 64, 64, 64, 64, 64, 64, 64, 64, 64, 64, 64, 64, 64, 64, 64, 64, -64, -64, -64, -64, 64, 64, 64, 64, 64, 64, -64, -64, -64, 64, 64, -64, 64, 64, 64, 64, 64, -64, 64, -64, 64, -64, -64, 64, -64, 64, -64, -64, 64, 64, 64, 64, -64, 64, -64, 64, -64, -64, -64, 64, -64, 64, -64, 64, -64, -64, 64, 64, 64, -64, -64, -64, 64, 64, -64, -64, -64, 64, -64, 64, -64, 64, 64, 64, 64, 64, 64, -64, -64, 64, 64, 64, -64, 64, 64, -64, 64, 64, -64, 64, -64, -64, 64, 64, 64, -64, -64, -64, -64, 64, -64, -64, 64, 64, 64, 64, -64, 64, -64, -64, 64, -64, 64, 64, 64, 64, -64, 64, -64, 64, 64, -64, -64, -64, -64, -64, 64, -64, -64, -64, -64, -64, 64, 64, 64, 64, 64, 64, -64, 64, 64, 64, -64, 64, 64, 64, -64, -64, 64, -64, 64, -64, -64, 64, 64, 64, -64, -64, -64, -64, 64, 64, 64, 64, 64, 64, 64, 64, 64, 64, 64, 64, 64, -64, -64, 64, -64, 64, 64, 64, 64, 64, 64, -64, 64, -64, -64, -64, -64, -64, -64, 64, 64, 64, 64, 64, -64, -64, 64, 64, 64, 64, 64, -64, -64, -64, 64, 64, 64, 64, 64, 64, 64, 64, 64, 64, 64, -64, 64, 64, 64, 64, 64, -64, -64, -64, -64, -64, 64, 64, -64, -64, -64, 64, -64, -64, 64, 64, 64, 64, 64, 64, 64, 64, 64, 64, 64, 64, 64, 64, -64, 64, -64, -64, -64, 64, 64, 64, 64, 64, 64, -64, 64, 64, -64, 64, 64, 64, 64, 64, 64, 64, -64, -64, 64, 64, 64, 64, 64, 64, -64, -64, -64, -64, -64, -64, -64, -64, -64, -64, -64, 64, 64, 64, 64, 64, 64, 64, 64, 64, -64, -64, 64, 64, -64, 64, -64, -64, -64, -64, -64, 64, 64, -64, 64, 64, -64, 64, 64, 64, -64, 64, -64, 64, -64, 64, 64, -64, 64, -64, 64, 64, 64, 64, -64, -64, -64, -64, -64, 64, -64, -64, 64, -64, -64, 64, -64, 64, 64, 64, 64, -64, 64, 64, 64, 64, -64, 64, 64, 64, 64, 64, 64, -64, -64, -64, -64, 64, 64, 64, -64, 64, 64, 64, -64, 64, 64, 64, 64, 64, 64, 64, 64, -64, -64, 64, 64, 64, 64, 64, 64, -64, 64, 64, 64, -64, -64, -64, -64, -64, -64, 64, 64, 64, 64, 64, -64, -64, 64, 64, 64, 64, 64, 64, 64, 64, -64, -64, 64, 64, -64, 64, -64, -64, 64, 64, 64, -64, 64, 64, -64, -64, 64, 64, 64, 64, 64, 64, 64, 64, 64, 64, 64, 64, -64, 64, 64, 64, -64, 64, 64, 64, 64, -64, -64, 64, -64, 64, -64, 64, 64, -64, 64, -64, -64, 64, 64, 64, 64, 64, 64, 64, 64, 64, 64, -64, 64, -64, 64, -64, 64, -64, -64, 64, -64, -64, 64, 64, -64, -64, -64, 64, 64, 64, -64, 64, 64, 64, 64, 64, 64, 64, 64, 64, -64, 64, 64, -64, -64, -64, -64, -64, -64, -64, 64, 64, -64, -64, 64, 64, 64, 64, 64, -64, 64, -64, -64, 64, 64, 64, -64, -64, -64, 64, 64, -64, -64, -64, -64, -64, -64, 64, 64, -64, -64, -64, -64, 64, 64, -64, 64, 64, -64, -64, 64, 64, -64, 64, -64, -64, -64, 64, 64, 64, 64, -64, 64, -64, -64, -64, -64, -64, -64, 64, 64, -64, 64, -64, -64, -64, 64, 64, -64, 64, 64, 64, -64, -64, -64, 64, 64, -64, -64, -64, -64, -64, 64, 64, 64, 64, 64, -64, -64, 64, 64, -64, 64, 64, -64, -64, -64, 64, 64, -64, -64, -64, -64, 64, 64, 64, -64, -64, -64, 64, -64, 64, 64, 64, 64, -64, -64, -64, -64, -64, -64, -64, 64, -64, 64, -64, -64, 64, -64, -64, -64, 64, 64, 64, -64, -64, 64, -64, 64, 64, 64, 64, 64, 64, -64, -64, 64, 64, -64, 64, 64, 64, 64, 64, -64, 64, 64, 64, -64, -64, 64, 64, 64, 64, 64, -64, -64, -64, -64, -64, -64, 64, -64, 64, 64, -64, -64, 64, -64, -64, -64, 64, 64, 64, -64, -64, 64, -64, 64, -64, -64, -64, 64, 64, 64, -64, 64, -64, -64, 64, -64, -64, 64, -64, 64, 64, 64, -64, 64, -64, -64, 64, 64, -64, 64, 64, -64, -64, 64, 64, -64, 64, 64, 64, -64, -64, 64, 64, 64, -64, -64, -64, 64, 64, 64, -64, 64, 64, 64, 64, 64, -64, -64, 64, 64, 64, 64, -64, 64, 64, -64, -64, 64, 64, -64, -64, -64, -64, 64, -64, -64, -64, 64, 64, 64, 64, 64, 64, -64, -64, 64, -64, -64, -64, -64, -64, -64, 64, 64, 64, 64, -64, -64, -64, 64, 64, -64, -64, 64, -64, 64, -64, 64, 64, -64, 64, -64, 64, 64, -64, -64, 64, -64, -64, -64, -64, -64, -64, 64, -64, 64, 64, 64, 64, -64, 64, 64, -64, 64, 64, 64, -64, 64, 64, 64, 64, 64, -64, 64, 64, -64, -64, 64, 64, -64, 64, 64, 64, 64, 64, 64, 64, -64, 64, 64, 64, 64, 64, 64, 64, 64, 64, -64, -64, 64, -64, 64, 64, 64, -64, 64, 64, -64, 64, 64, 64, 64, 64, 64, -64, 64, 64, 64, 64, 64, 64, 64, 64, 64, 64, -64, 64, -64, -64, 64, 64, 64, -64, -64, -64, 64, 64, 64, -64, 64, -64, 64, -64, -64, 64, 64, 64, 64, 64, 64, 64, 64, 64, -64, -64, 64, -64, -64, 64, 64, 64, -64, 64, 64, 64, -64, 64, -64, -64, 64, 64, 64, 64, 64, -64, 64, 64, 64, -64, -64, -64, -64, 64, -64, -64, -64, 64, 64, -64, -64, -64, -64, 64, 64, -64, 64, -64, 64, 64, -64, 64, -64, 64, 64, 64, 64, -64, -64, 64, 64, 64, -64, -64, -64, -64, -64, 64, 64, -64, 64, 64, 64, 64, 64, 64, -64, 64, 64, 64, 64, 64, 64, -64, -64, -64, -64, 64, 64, 64, -64, -64, -64, -64, 64, -64, -64, -64, -64, 64, -64, -64, -64, -64, 64, -64, 64, -64, 64, 64, 64, 64, -64, 64, 64, 64, 64, -64, -64, -64, -64, -64, -64, 64, -64, -64, -64, -64, -64, -64, 64, 64, 64, 64, 64, 64, 64, -64, 64, 64, 64, 64, 64, -64, -64, -64, -64, -64, 64, -64, -64, 64, 64, -64, 64, 64, 64, 64, 64, 64, -64, -64, -64, 64, 64, -64, -64, 64, 64, 64, 64, 64, -64, 64, 64, 64, -64, 64, -64, 64, -64, -64, 64, -64, 64, -64, 64, 64, 64, -64, -64, 64, -64, 64, 64, 64, 64, 64, -64, -64, 64, 64, 64, 64, 64, -64, 64, 64, -64, 64, 64, -64, 64, -64, -64, 64, 64, -64, 64, -64, -64, 64, 64, -64, 64, 64, 64, -64, -64, 64, -64, -64, -64, -64, -64, 64, 64, 64, -64, -64, 64, 64, 64, 64, -64, -64, -64, -64, -64, -64, 64, 64, 64, -64, -64, 64, 64, 64, -64, 64, -64, 64, -64, -64, -64, 64, -64, 64, 64, 64, 64, 64, 64, 64, 64, 64, -64, -64, 64, 64, 64, 64, 64, 64, 64, 64, 64, 64, -64, -64, 64, -64, 64, 64, -64, -64, -64, 64, 64, 64, -64, 64, 64, -64, -64, -64, 64, 64, 64, 64, 64, 64, 64, 64, -64, -64, -64, -64, -64, -64, -64, -64, 64, -64, 64, 64, 64, 64, 64, 64, 64, 64, -64, -64, -64, 64, 64, 64, -64, 64, -64, -64, 64, -64, -64, 64, 64, 64, 64, -64, 64, -64, -64, 64, -64, 64, 64, -64, 64, 64, -64, 64, 64, 64, 64, -64, 64, -64, 64, 64, -64, 64, 64, 64, -64, -64, 64, 64, 64, -64, -64, 64, -64, -64, -64, 64, -64, 64, 64, -64, -64, -64, 64, -64, -64, 64, 64, 64, -64, 64, -64, -64, -64, -64, -64, 64, -64, -64, 64, 64, -64, 64, 64, -64, 64, -64, -64, 64, 64, 64, -64, 64, 64, 64, 64, 64, -64, -64, 64, 64, -64, -64, 64, -64, 64, 64, -64, -64, 64, -64, 64, -64, 64, -64, -64, -64, 64, -64, 64, -64, 64, -64, -64, 64, 64, 64, -64, 64, -64, -64, -64, 64, 64, 64, 64, 64, -64, -64, 64, 64, 64, -64, -64, -64, -64, -64, 64, 64, -64, 64, -64, -64, 64, 64, -64, -64, -64, 64, 64, 64, 64, -64, -64, -64, -64, -64, 64, -64, -64, 64, 64, 64, -64, 64, -64, -64, 64, -64, 64, 64, -64, -64, 64, 64, -64, 64, 64, 64, 64, 64, 64, 64, -64, 64, 64, -64, 64, 64, -64, -64, 64, -64, -64, 64, -64, -64, 64, -64, -64, -64, -64, -64, -64, -64, 64, 64, -64, -64, -64, -64, -64, 64, 64, 64, 64, 64, 64, -64, -64, -64, 64, 64, 64, -64, 64, -64, 64, 64, 64, -64, -64, 64, 64, -64, -64, 64, 64, -64, 64, -64, -64, 64, 64, -64, -64, -64, -64, -64, -64, -64, 64, 64, 64, 64, 64, 64, -64, -64, 64, -64, 64, -64, 64, 64, -64, 64, -64, 64, 64, 64, 64, 64, -64, -64, -64, -64, -64, -64, -64, 64, 64, 64, 64, -64, -64, 64, 64, 64, -64, -64, -64, 64, 64, 64, -64, -64, 64, 64, 64, 64, 64, -64, -64, -64, -64, -64, 64, 64, 64, 64, 64, 64, 64, 64, 64, -64, -64, 64, -64, -64, 64, -64, 64, -64, 64, 64, 64, -64, -64, 64, -64, -64, -64, 64, 64, -64, 64, 64, 64, 64, -64, 64, -64, 64, -64, -64, -64, 64, 64, -64, -64, 64, 64, -64, -64, -64, -64, -64, -64, 64, 64, 64, 64, 64, -64, 64, 64, 64, -64, 64, 64, -64, 64, 64, -64, 64, -64, 64, 64, -64, -64, -64, -64, -64, -64, -64, -64, -64, 64, 64, 64, 64, 64, -64, 64, 64, 64, -64, -64, 64, 64, 64, 64, 64, -64, -64, -64, -64, -64, -64, -64, -64, -64, -64, -64, 64, 64, 64, 64, 64, 64, -64, 64, 64, -64, 64, 64, -64, 64, 64, 64, 64, -64, -64, 64, 64, -64, -64, -64, -64, -64, -64, -64, 64, 64, 64, 64, 64, -64, 64, 64, 64, 64, -64, 64, 64, 64, 64, 64, -64, 64, -64, -64, -64, -64, -64, -64, -64, -64, -64, 64, 64, -64, -64, 64, -64, -64, 64, 64, 64, 64, 64, 64, 64, 64, 64, 64, 64, 64, -64, 64, -64, -64, -64, -64, -64, 64, 64, -64, -64, -64, -64, -64, -64, -64, 64, 64, 64, 64, 64, 64, -64, 64, 64, -64, 64, 64, 64, 64, -64, -64, -64, -64, 64, 64, 64, 64, -64, -64, -64, -64, -64, 64, 64, 64, 64, -64, -64, -64, 64, 64, 64, 64, 64, 64, 64, 64, 64, -64, -64, -64, -64, 64, 64, -64, -64, -64, -64, -64, -64, -64, 64, 64, 64, 64, 64, -64, 64, 64, -64, -64, -64, 64, 64, 64, -64, -64, -64, 64, 64, -64, 64, -64, -64, -64, -64, -64, -64, 64, 64, 64, -64, 64, 64, 64, -64, -64, 64, 64, 64, 64, 64, -64, -64, -64, -64, -64, 64, 64, -64, -64, -64, -64, -64, -64, -64, 64, -64, 64, 64, 64, 64, 64, -64, -64, -64, 64, -64, 64, 64, 64, -64, 64, 64, -64, -64, -64, 64, 64, 64, 64, -64, -64, 64, -64, 64, -64, 64, 64, 64, 64, -64, -64, 64, 64, 64, -64, 64, 64, 64, 64, 64, 64, 64, 64, -64, -64, -64, -64, -64, 64, -64, -64, 64, 64, -64, -64, -64, 64, 64, 64, -64, 64, -64, 64, 64, 64, 64, 64, 64, -64, -64, -64, -64, -64, -64, 64, 64, 64, -64, 64, 64, -64, -64, -64, 64, 64, 64, 64, -64, 64, 64, -64, -64, -64, 64, 64, 64, 64, 64, -64, -64, -64, 64, -64, -64, 64, -64, -64, -64, -64, -64, 64, -64, 64, 64, 64, -64, -64, -64, -64, 64, 64, 64, 64, 64, 64, -64, -64, -64, -64, 64, -64, 64, 64, -64, -64, -64, -64, -64, 64, -64, 64, -64, -64, -64, -64, -64, -64, 64, 64, 64, 64, -64, -64, -64, -64, -64, 64, 64, 64, -64, -64, -64, -64, -64, -64, -64, -64, 64, -64, -64, -64, -64, -64, 64, -64, -64, 64, 64, 64, -64, 64, -64, -64, -64, -64, -64, -64, -64, -64, -64, -64, -64, -64, -64, -64, 64, 64, -64, -64, 64, 64, 64, 64, -64, 64, 64, 64, -64, 64, -64, 64, -64, -64, -64, -64, -64, -64, -64, 64, 64, -64, 64, -64, 64, 64, 64, 64, 64, 64, 64, 64, 64, 64, 64, -64, -64, -64, -64, -64, -64, -64, -64, 64, 64, -64, -64, 64, -64, 64, 64, 64, 64, 64, -64, 64, -64, 64, -64, -64, -64, -64, 64, -64, -64, -64, 64, -64, 64, -64, -64, 64, 64, -64, -64, -64, 64, -64, -64, -64, -64, 64, 64, 64, -64, -64, -64, -64, -64, 64, 64, -64, -64, -64, 64, -64, -64, 64, 64, -64, 64, -64, -64, -64, 64, -64, 64, -64, -64, -64, 64, 64, 64, 64, -64, 64, 64, 64, -64, 64, 64, 64, -64, -64, -64, -64, -64, 64, -64, -64, 64, 64, -64, 64, 64, 64, 64, 64, 64, 64, 64, -64, -64, -64, 64, -64, -64, -64, -64, -64, -64, -64, -64, -64, 64, -64, -64, -64, 64, -64, -64, 64, 64, 64, 64, -64, 64, -64, -64, -64, -64, 64, -64, -64, 64, 64, -64, -64, -64, 64, -64, -64, 64, 64, 64, -64, -64, 64, 64, 64, 64, 64, -64, 64, 64, -64, 64, -64, -64, -64, -64, -64, -64, -64, -64, -64, -64, -64, 64, -64, 64, -64, 64, 64, 64, 64, 64, -64, -64, 64, -64, 64, 64, -64, 64, -64, 64, -64, -64, -64, -64, -64, -64, -64, -64, -64, -64, -64, -64, -64, -64, 64, -64, 64, -64, -64, 64, -64, 64, -64, 64, 64, -64, 64, -64, -64, -64, -64, -64, -64, -64, -64, -64, -64, -64, -64, -64, -64, -64, -64, -64, 64, 64, 64, -64, -64, 64, 64, 64, 64, -64, -64, 64, -64, -64, -64, -64, -64, -64, -64, -64, -64, -64, -64, -64, -64, -64, 64, -64, 64, 64, 64, -64, -64, 64, -64, 64, -64, -64, 64, -64, -64, -64, -64, -64, 64, -64, -64, -64, -64, -64, -64, 64, -64, 64, 64, 64, 64, -64, 64, 64, 64, 64, -64, -64, -64, -64, -64, 64, 64, -64, -64, -64, 64, -64, -64, 64, -64, -64, -64, 64, 64, -64, -64, -64, -64, -64, 64, -64, 64, 64, -64, -64, -64, 64, -64, 64, 64, -64, -64, -64, 64, -64, -64, 64, -64, -64, -64, -64, -64, -64, 64, -64, -64, -64, -64, -64, 64, -64, 64, -64, -64, 64, -64, 64, 64, -64, 64, 64, -64, -64, 64, 64, -64, 64, -64, -64, -64, -64, 64, 64, 64, -64, -64, -64, -64, -64, 64, -64, 64, 64, 64, 64, 64, 64, -64, -64, -64, -64, 64, 64, -64, 64, -64, 64, -64, -64, -64, -64, 64, -64, -64, -64, -64, -64, -64, -64, -64, -64, 64, 64, 64, 64, 64, -64, -64, 64, 64, 64, 64, -64, -64, -64, -64, 64, -64, 64, 64, 64, 64, 64, 64, 64, 64, -64, -64, 64, 64, 64, 64, -64, 64, -64, 64, 64, -64, -64, -64, -64, -64, 64, 64, 64, 64, -64, -64, -64, -64, -64, 64, 64, 64, -64, 64, -64, 64, 64, 64, 64, 64, 64, 64, 64, 64, -64, -64, -64, -64, -64, -64, -64, -64, -64, -64, -64, -64, -64, 64, 64, 64, -64, 64, 64, -64, -64, -64, -64, 64, 64, 64, 64, 64, 64, -64, -64, -64, -64, -64, 64, -64, -64, -64, -64, -64, -64, -64, -64, -64, 64, 64, -64, 64, -64, -64, 64, -64, -64, 64, 64, -64, -64, -64, -64, 64, 64, 64, 64, 64, -64, -64, -64, -64, 64, -64, -64, 64, 64, -64, 64, -64, -64, -64, -64, -64, -64, -64, -64, -64, -64, -64, -64, -64, -64, 64, 64, -64, 64, -64, -64, -64, 64, -64, -64, 64, -64, 64, 64, -64, 64, 64, -64, -64, -64, -64, -64, -64, -64, -64, -64, -64, -64, 64, -64, -64, -64, -64, -64, 64, -64, -64, 64, -64, -64, 64, 64, 64, 64, 64, 64, -64, -64, -64, -64, -64, -64, -64, 64, 64, 64, 64, 64, -64, -64, -64, -64, 64, -64, 64, -64, 64, 64, 64, 64, 64, 64, 64, 64, -64, -64, -64, -64, -64, -64, -64, -64, 64, 64, 64, -64, -64, -64, -64, -64, -64, -64, -64, 64, 64, -64, 64, -64, -64, 64, 64, 64, 64, -64, -64, -64, -64, -64, -64, -64, 64, -64, -64, -64, -64, -64, -64, 64, 64, -64, 64, 64, -64, -64, 64, -64, 64, -64, 64, 64, 64, 64, -64, -64, -64, -64, 64, -64, 64, -64, -64, -64, -64, -64, 64, 64, 64, -64, 64, 64, -64, -64, -64, -64, 64, 64, 64, 64, 64, 64, 64, 64, -64, 64, -64, -64, -64, -64, -64, -64, -64, 64, 64, 64, 64, -64, 64, 64, 64, 64, 64, 64, 64, -64, 64, 64, 64, 64, 64, 64, 64, -64, -64, -64, -64, -64, -64, -64, 64, -64, -64, 64, 64, -64, -64, 64, -64, 64, -64, -64, 64, 64, -64, 64, -64, -64, -64, -64, -64, -64, 64, 64, 64, -64, -64, -64, 64, 64, -64, 64, 64, -64, -64, 64, -64, -64, 64, 64, 64, -64, -64, -64, -64, -64, -64, -64, -64, -64, -64, -64, -64, -64, -64, -64, -64, 64, 64, 64, 64, 64, -64, 64, 64, 64, -64, 64, -64, 64, 64, -64, 64, 64, 64, -64, -64, 64, -64, -64, -64, 64, -64, -64, 64, 64, -64, -64, -64, -64, -64, 64, -64, -64, -64, 64, 64, 64, -64, 64, -64, -64, -64, -64, -64, -64, 64, -64, 64, 64, -64, 64, -64, -64, -64, -64, 64, 64, 64, -64, -64, -64, -64, -64, -64, 64, 64, -64, -64, -64, 64, 64, -64, -64, -64, 64, 64, 64, -64, -64, -64, 64, 64, 64, -64, 64, -64, -64, 64, 64, 64, -64, -64, 64, 64, -64, 64, 64, 64, -64, -64, -64, 64, -64, -64, -64, 64, -64, -64, -64, -64, 64, -64, -64, 64, 64, 64, 64, 64, -64, -64, 64, -64, -64, -64, -64, -64, -64, -64, -64, -64, -64, 64, -64, 64, 64, 64, -64, -64, -64, 64, -64, -64, 64, 64, 64, 64, -64, -64, -64, -64, -64, -64, -64, -64, -64, -64, 64, 64, -64, 64, 64, 64, 64, -64, -64, -64, -64, -64, -64, -64, 64, -64, 64, -64, -64, -64, -64, -64, -64, -64, -64, 64, -64, -64, -64, -64, -64, -64, -64, -64, -64, -64, 64, 64, 64, 64, 64, -64, -64, -64, 64, -64, -64, -64, -64, -64, -64, 64, -64, 64, 64, 64, 64, 64, -64, 64, -64, -64, -64, -64, -64, 64, 64, 64, 64, 64, -64, 64, -64, 64, 64, -64, -64, -64, -64, 64, 64, 64, 64, 64, 64, 64, 64, 64, 64, -64, -64, 64, -64, -64, 64, 64, 64, 64, -64, 64, -64, 64, -64, -64, -64, -64, 64, -64, 64, 64, 64, 64, 64, 64, 64, -64, -64, 64, -64, -64, -64, 64, 64, 64, 64, -64, -64, -64, 64, -64, 64, -64, 64, -64, 64, -64, 64, 64, 64, 64, 64, 64, 64, -64, -64, 64, -64, -64, -64, -64, 64, 64, 64, -64, 64, -64, 64, 64, -64, 64, -64, -64, -64, 64, 64, 64, 64, 64, 64, 64, -64, -64, -64, 64, -64, -64, -64, -64, 64, -64, -64, -64, -64, -64, 64, 64, 64, -64, -64, -64, 64, 64, 64, 64, 64, 64, 64, 64, -64, -64, 64, 64, 64, -64, 64, 64, -64, 64, 64, -64, -64, -64, -64, -64, -64, 64, -64, -64, 64, 64, 64, 64, 64, 64, 64, -64, 64, 64, 64, 64, -64, -64, 64, 64, 64, 64, 64, 64, -64, -64, 64, -64, 64, -64, -64, -64, -64, -64, -64, 64, 64, 64, -64, -64, -64, 64, 64, 64, 64, 64, 64, 64, -64, -64, -64, 64, 64, 64, -64, 64, -64, -64, 64, -64, 64, 64, 64, 64, 64, 64, -64, 64, 64, 64, 64, 64, 64, 64, 64, -64, -64, -64, -64, 64, -64, 64, 64, -64, -64, 64, -64, -64, 64, 64, 64, 64, 64, 64, 64, -64, 64, 64, 64, 64, -64, -64, -64, 64, -64, -64, 64, 64, -64, 64, -64, -64, -64, 64, 64, -64, 64, -64, 64, 64, 64, 64, 64, -64, 64, 64, -64, -64, -64, 64, -64, -64, -64, -64, -64, 64, 64, 64, -64, -64, -64, 64, 64, -64, -64, -64, -64, -64, -64, 64, 64, -64, 64, 64, 64, 64, -64, -64, -64, -64, -64, 64, -64, 64, 64, -64, 64, 64, -64, 64, 64, -64, -64, -64, -64, -64, -64, -64, -64, -64, -64, -64, 64, 64, -64, -64, -64, 64, 64, 64, 64, 64, 64, 64, 64, 64, -64, 64, -64, -64, 64, -64, -64, -64, -64, -64, -64, -64, -64, 64, 64, 64, -64, -64, -64, 64, 64, 64, -64, 64, 64, -64, -64, 64, -64, -64, 64, 64, -64, 64, -64, -64, -64, -64, -64, -64, -64, -64, 64, -64, 64, -64, 64, 64, 64, 64, -64, 64, 64, 64, 64, 64, 64, -64, -64, 64, 64, 64, -64, -64, -64, -64, -64, 64, -64, 64, 64, -64, -64, 64, 64, 64, -64, 64, 64, 64, 64, -64, -64, 64, 64, -64, -64, -64, 64, -64, 64, -64, -64, 64, 64, -64, -64, 64, -64, 64, 64, 64, 64, 64, 64, 64, 64, -64, 64, 64, -64, -64, -64, -64, -64, -64, -64, -64, 64, -64, 64, 64, 64, 64, 64, -64, 64, 64, -64, -64, 64, 64, -64, 64, 64, -64, 64, 64, -64, 64, 64, -64, -64, -64, 64, 64, 64, 64, 64, 64, 64, -64, 64, 64, 64, -64, -64, -64, 64, 64, -64, -64, -64, -64, -64, -64, 64, 64, 64, -64, 64, 64, 64, 64, 64, 64, 64, 64, 64, 64, 64, 64, 64, 64, -64, -64, 64, 64, -64, 64, -64, 64, -64, 64, -64, 64, -64, 64, 64, 64, 64, 64, 64, 64, 64, 64, 64, 64, 64, 64, 64, -64, 64, -64, -64, 64, 64, -64, -64, 64, 64, -64, -64, -64, 64, 64, 64, -64, -64, 64, -64, 64, -64, 64, 64, -64, -64, -64, 64, -64, -64, 64, 64, 64, -64, -64, 64, 64, 64, 64, 64, 64, 64, -64, 64, -64, 64, -64, -64, 64, 64, -64, 64, 64, 64, 64, 64, -64, -64, 64, 64, -64, 64, -64, -64, -64, -64, -64, 64, 64, -64, -64, 64, -64, -64, -64, 64, -64, -64, 64, 64, -64, 64, -64, -64, -64, 64, -64, 64, -64, -64, 64, -64, -64, -64, -64, -64, -64, -64, 64, 64, -64, -64, -64, -64, 64, 64, 64, 64, 64, 64, 64, 64, 64, 64, 64, 64, -64, 64, 64, -64, -64, -64, 64, 64, -64, -64, -64, -64, 64, -64, -64, -64, -64, 64, 64, 64, 64, 64, -64, 64, 64, 64, 64, 64, -64, -64, 64, -64, 64, -64, 64, 64, -64, -64, -64, 64, 64, -64, -64, -64, -64, 64, -64, -64, -64, -64, -64, -64, -64, 64, 64, 64, 64, -64, 64, 64, 64, -64, 64, -64, -64, 64, 64, -64, -64, -64, -64, -64, -64, -64, -64, -64, -64, -64, -64, -64, -64, -64, -64, -64, -64, -64, 64, -64, 64, -64, 64, -64, -64, 64, -64, -64, -64, -64, -64, -64, -64, -64, -64, -64, -64, -64, 64, -64, -64, -64, -64, -64, -64, -64, -64, -64, -64, -64, 64, -64, -64, -64, -64, 64, 64, -64, -64, -64, -64, -64, -64, -64, 64, 64, -64, -64, -64, -64, -64, -64, -64, -64, -64, -64, -64, -64, -64, 64, -64, -64, -64, -64, 64, -64, -64, -64, -64, -64, -64, 64, -64, -64, -64, -64, -64, -64, -64, -64, -64, -64, -64, -64, -64, -64, -64, 64, -64, -64, -64, 64, -64, -64, -64, 64, -64, -64, 64, -64, -64, -64, -64, -64, -64, -64, -64, -64, -64, -64, -64, -64, -64, -64, 64, 64, 64, -64, -64, -64, -64, 64, 64, 64, 64, 64, 64, -64, -64, -64, -64, -64, -64, 64, -64, 64, -64, 64, 64, -64, -64, -64, 64, -64, 64, 64, -64, 64, 64, 64, 64, 64, 64, -64, 64, 64, -64, -64, 64, 64, 64, -64, -64, -64, 64, 64, 64, -64, -64, -64, -64, -64, -64, -64, 64, 64, 64, 64, 64, 64, 64, 64, 64, 64, 64, 64, 64, 64, 64, 64, 64, 64, 64, 64, 64, 64, -64, -64, 64, -64, -64, 64, 64, 64, 64, 64, 64, 64, 64, 64, 64, 64, 64, 64, 64, 64, 64, 64, 64, 64, 64, 64, 64, 64, 64, 64, -64, 64, -64, -64, -64, 64, 64, 64, 64, 64, 64, 64, 64, 64, 64, 64, 64, 64, 64, 64, -64, 64, 64, 64, 64, 64, 64, -64, -64, -64, -64, -64, 64, 64, 64, 64, 64, 64, -64, 64, 64, 64, 64, 64, 64, 64, 64, -64, 64, 64, 64, 64, 64, 64, -64, 64, 64, 64, -64, -64, 64, 64, 64, 64, 64, 64, 64, -64, -64, 64, -64, 64, 64, 64, 64, -64, 64, 64, 64, -64, -64, -64, 64, -64, 64, -64, -64, -64, -64, 64, -64, 64, 64, 64, 64, -64, -64, -64, 64, -64, 64, -64, -64, 64, 64, -64, 64, -64, -64, -64, 64, -64, 64, -64, -64, -64, -64, -64, -64, 64, 64, 64, 64, 64, 64, -64, 64, 64, 64, 64, -64, 64, -64, -64, -64, -64, -64, -64, 64, -64, 64, 64, -64, 64, -64, -64, 64, -64, -64, -64, 64, -64, 64, -64, 64, 64, -64, -64, -64, 64, -64, -64, 64, -64, -64, -64, -64, 64, -64, 64, -64, 64, -64, -64, 64, -64, -64, -64, 64, -64, -64, -64, -64, -64, -64, -64, 64, 64, -64, 64, 64, 64, 64, -64, -64, -64, -64, 64, 64, -64, 64, -64, -64, -64, -64, -64, -64, -64, -64, -64, -64, -64, -64, -64, -64, -64, -64, 64, -64, -64, -64, 64, 64, 64, 64, 64, 64, 64, -64, -64, -64, -64, -64, -64, -64, -64, -64, -64, -64, -64, -64, -64, -64, -64, -64, -64, -64, 64, -64, 64, -64, 64, 64, -64, -64, -64, 64, -64, -64, -64, 64, -64, -64, -64, -64, -64, -64, -64, -64, -64, -64, -64, -64, 64, 64, -64, 64, 64, -64, -64, 64, 64, -64, -64, -64, 64, -64, -64, -64, -64, -64, 64, -64, -64, -64, -64, -64, -64, -64, -64, 64, 64, 64, 64, 64, 64, 64, -64, -64, -64, 64, 64, -64, 64, 64, 64, 64, 64, 64, 64, -64, -64, -64, 64, 64, 64, 64, 64, -64, 64, 64, 64, 64, -64, -64, 64, 64, 64, 64, -64, -64, 64, -64, 64, 64, 64, 64, -64, -64, 64, 64, 64, -64, 64, -64, -64, -64, 64, -64, -64, -64, 64, -64, 64, 64, 64, 64, 64, -64, -64, -64, -64, -64, 64, -64, -64, 64, -64, -64, -64, 64, 64, -64, -64, 64, 64, 64, -64, 64, 64, -64, 64, -64, -64, -64, -64, 64, -64, -64, -64, 64, -64, 64, -64, -64, -64, 64, -64, 64, -64, -64, -64, -64, 64, -64, 64, 64, 64, 64, -64, -64, -64, -64, 64, -64, -64, -64, -64, -64, 64, -64, 64, -64, -64, -64, -64, -64, -64, 64, -64, -64, -64, -64, -64, -64, 64, -64, 64, -64, -64, -64, -64, -64, -64, -64, 64, 64, 64, 64, -64, -64, -64, -64, -64, -64, -64, -64, -64, -64, -64, -64, -64, -64, -64, 64, 64, -64, 64, 64, -64, -64, -64, 64, 64, -64, 64, 64, -64, -64, 64, -64, -64, -64, -64, -64, -64, -64, -64, -64, 64, 64, -64, 64, -64, -64, -64, 64, 64, -64, 64, -64, -64, 64, 64, 64, 64, 64, 64, -64, -64, -64, -64, -64, -64, -64, -64, -64, 64, 64, -64, -64, -64, -64, 64, -64, 64, -64, 64, 64, 64, -64, -64, -64, -64, -64, -64, -64, -64, 64, -64, -64, -64, -64, -64, -64, -64, -64, -64, -64, -64, 64, -64, -64, 64, 64, 64, 64, 64, 64, 64, -64, -64, 64, -64, -64, 64, -64, -64, -64, 64, 64, -64, -64, -64, -64, -64, -64, -64, 64, 64, 64, 64, 64, 64, 64, -64, 64, 64, 64, 64, 64, 64, -64, -64, 64, 64, 64, -64, -64, 64, 64, 64, -64, -64, -64, -64, 64, 64, 64, 64, 64, 64, 64, -64, 64, 64, 64, 64, -64, -64, 64, -64, 64, -64, -64, 64, 64, -64, 64, -64, 64, -64, -64, 64, -64, -64, -64, 64, 64, -64, 64, 64, 64, 64, 64, -64, -64, -64, 64, 64, 64, 64, 64, 64, 64, -64, -64, -64, 64, -64, -64, -64, 64, -64, -64, 64, 64, 64, 64, 64, 64, 64, 64, -64, 64, -64, -64, -64, -64, -64, 64, 64, -64, -64, 64, -64, 64, -64, 64, 64, 64, 64, -64, -64, -64, -64, 64, 64, -64, 64, 64, -64, -64, -64, -64, -64, -64, -64, 64, 64, -64, 64, -64, 64, 64, 64, -64, -64, -64, 64, 64, -64, 64, 64, 64, 64, 64, 64, 64, -64, -64, -64, -64, -64, -64, -64, -64, 64, -64, 64, 64, 64, 64, 64, -64, 64, 64, 64, -64, -64, -64, 64, 64, 64, 64, 64, -64, -64, -64, -64, -64, -64, -64, 64, 64, -64, 64, 64, 64, 64, -64, 64, 64, 64, 64, -64, -64, -64, 64, 64, 64, 64, 64, 64, -64, -64, -64, -64, -64, -64, -64, -64, 64, -64, -64, 64, 64, 64, 64, -64, -64, -64, 64, -64, 64, -64, -64, 64, 64, 64, -64, -64, -64, -64, -64, -64, -64, -64, -64, 64, 64, -64, -64, 64, 64, 64, -64, -64, -64, 64, 64, 64, -64, -64, -64, 64, 64, 64, -64, 64, -64, 64, 64, 64, -64, -64, 64, 64, 64, -64, 64, 64, 64, 64, -64, -64, -64, 64, 64, -64, 64, 64, -64, -64, 64, 64, -64, 64, -64, 64, 64, 64, 64, 64, 64, 64, -64, -64, -64, 64, 64, 64, -64, -64, 64, -64, -64, 64, -64, -64, -64, -64, -64, -64, 64, -64, 64, 64, 64, 64, 64, 64, 64, -64, -64, -64, -64, 64, 64, 64, -64, -64, -64, -64, 64, 64, 64, 64, -64, -64, -64, -64, -64, -64, -64, -64, -64, 64, 64, 64, 64, -64, -64, -64, -64, -64, 64, 64, -64, -64, 64, 64, -64, -64, -64, -64, 64, -64, -64, 64, -64, -64, -64, 64, -64, 64, -64, -64, -64, -64, -64, -64, -64, -64, 64, 64, -64, -64, 64, 64, -64, 64, -64, 64, -64, -64, -64, -64, -64, -64, -64, -64, -64, -64, -64, -64, -64, -64, -64, -64, -64, 64, -64, -64, -64, -64, -64, -64, -64, -64, 64, -64, 64, -64, -64, -64, -64, 64, 64, -64, -64, -64, -64, -64, -64, -64, -64, -64, -64, -64, 64, 64, -64, -64, -64, 64, -64, 64, -64, -64, 64, -64, -64, 64, -64, 64, -64, 64, -64, -64, -64, -64, -64, -64, -64, -64, 64, 64, -64, 64, 64, 64, 64, -64, -64, -64, 64, 64, -64, -64, 64, 64, 64, 64, -64, 64, -64, -64, -64, -64, -64, -64, -64, 64, 64, 64, 64, -64, 64, 64, 64, 64, -64, 64, -64, 64, 64, 64, 64, 64, 64, 64, 64, 64, -64, -64, -64, 64, -64, -64, 64, 64, 64, -64, 64, 64, -64, -64, 64, 64, -64, 64, 64, 64, 64, -64, 64, 64, -64, -64, -64, -64, -64, 64, 64, 64, -64, -64, -64, -64, -64, -64, 64, -64, 64, 64, -64, 64, 64, 64, 64, 64, -64, 64, -64, -64, -64, -64, -64, 64, 64, -64, 64, -64, -64, 64, 64, -64, 64, 64, 64, -64, 64, -64, 64, -64, 64, 64, -64, -64, -64, 64, 64, 64, 64, -64, 64, -64, -64, 64, -64, -64, -64, 64, 64, 64, -64, 64, -64, -64, -64, 64, 64, 64, 64, 64, 64, 64, 64, -64, 64, -64, 64, -64, -64, -64, -64, 64, -64, -64, 64, -64, -64, 64, -64, 64, -64, -64, 64, -64, 64, 64, 64, 64, 64, -64, 64, -64, 64, -64, 64, 64, -64, -64, -64, -64, 64, 64, 64, 64, -64, -64, 64, 64, -64, -64, 64, 64, 64, 64, -64, -64, 64, 64, -64, 64, -64, -64, -64, -64, 64, 64, 64, -64, 64, -64, -64, -64, -64, -64, -64, -64, -64, 64, 64, 64, 64, 64, 64, 64, 64, -64, 64, 64, -64, -64, -64, -64, 64, 64, -64, 64, -64, -64, 64, 64, 64, -64, -64, -64, -64, 64, -64, -64, 64, -64, -64, -64, 64, -64, -64, -64, -64, -64, 64, 64, -64, 64, 64, 64, -64, 64, -64, -64, -64, -64, 64, 64, -64, -64, -64, -64, 64, 64, 64, 64, 64, -64, -64, -64, -64, -64, -64, -64, -64, 64, 64, -64, -64, 64, -64, -64, -64, -64, -64, -64, -64, -64, -64, -64, 64, 64, 64, -64, -64, -64, -64, -64, -64, -64, -64, -64, -64, 64, 64, -64, -64, -64, -64, -64, -64, -64, -64, -64, -64, -64, -64, -64, 64, 64, 64, 64, -64, -64, -64, -64, 64, 64, -64, -64, 64, 64, -64, -64, -64, -64, -64, -64, -64, -64, -64, 64, -64, -64, -64, -64, -64, -64, 64, 64, -64, -64, -64, 64, -64, -64, -64, -64, 64, 64, 64, 64, 64, 64, 64, -64, -64, -64, -64, -64, -64, -64, -64, -64, -64, 64, -64, 64, 64, 64, -64, 64, 64, 64, -64, -64, -64, 64, 64, 64, 64, 64, 64, 64, -64, -64, -64, -64, -64, -64, -64, -64, -64, -64, -64, -64, 64, 64, -64, -64, 64, 64, 64, 64, -64, -64, 64, 64, 64, 64, 64, -64, -64, -64, -64, -64, -64, -64, -64, -64, 64, 64, -64, -64, -64, -64, -64, -64, -64, -64, -64, 64, 64, -64, -64, 64, -64, 64, -64, -64, -64, -64, -64, -64, -64, -64, -64, 64, 64, 64, 64, -64, 64, 64, -64, -64, 64, -64, -64, 64, -64, -64, 64, -64, -64, 64, -64, -64, -64, -64, -64, -64, -64, -64, -64, 64, 64, 64, -64, 64, 64, 64, 64, 64, 64, 64, 64, -64, -64, -64, -64, -64, 64, 64, -64, -64, -64, -64, -64, -64, -64, 64, 64, 64, 64, 64, -64, 64, -64, -64, 64, 64, -64, -64, 64, 64, 64, -64, -64, -64, 64, 64, -64, -64, -64, -64, -64, -64, -64, -64, -64, 64, 64, 64, 64, -64, 64, -64, 64, -64, -64, -64, -64, -64, 64, 64, -64, -64, -64, 64, 64, -64, -64, -64, -64, -64, -64, 64, -64, 64, 64, 64, 64, 64, 64, 64, -64, 64, -64, -64, -64, -64, -64, -64, 64, 64, 64, 64, -64, -64, -64, -64, 64, 64, 64, 64, -64, 64, 64, 64, 64, 64, 64, 64, -64, -64, -64, -64, -64, 64, -64, -64, 64, -64, -64, 64, -64, -64, 64, -64, -64, 64, -64, -64, -64, 64, 64, 64, 64, -64, -64, 64, -64, -64, -64, -64, -64, -64, 64, -64, 64, -64, 64, 64, 64, -64, 64, 64, -64, -64, -64, -64, 64, 64, 64, 64, -64, 64, -64, 64, -64, 64, 64, -64, -64, -64, 64, 64, 64, 64, 64, -64, -64, -64, -64, 64, -64, -64, -64, 64, 64, 64, 64, 64, -64, 64, -64, -64, -64, -64, 64, -64, 64, -64, -64, -64, 64, -64, 64, -64, -64, -64, -64, -64, 64, -64, 64, 64, 64, 64, 64, 64, 64, -64, -64, -64, 64, -64, 64, -64, 64, -64, -64, -64, -64, -64, -64, -64, -64, -64, -64, -64, 64, 64, 64, -64, 64, 64, -64, 64, 64, -64, 64, -64, 64, 64, -64, 64, -64, -64, -64, -64, -64, -64, -64, -64, 64, 64, -64, 64, 64, 64, -64, 64, -64, -64, -64, 64, 64, -64, -64, -64, 64, 64, 64, -64, 64, -64, -64, -64, -64, -64, -64, -64, -64, -64, 64, 64, 64, -64, -64, -64, 64, -64, 64, -64, 64, -64, 64, -64, -64, 64, 64, 64, -64, -64, 64, -64, -64, -64, -64, -64, -64, -64, 64, -64, -64, -64, -64, -64, -64, -64, 64, 64, -64, -64, 64, 64, 64, 64, -64, -64, 64, 64, -64, -64, -64, -64, -64, -64, -64, -64, 64, -64, 64, 64, -64, 64, -64, 64, -64, -64, 64, 64, 64, 64, -64, 64, 64, -64, -64, 64, 64, 64, 64, 64, 64, -64, -64, 64, -64, -64, -64, -64, 64, 64, -64, 64, 64, 64, -64, -64, 64, 64, -64, 64, -64, 64, -64, -64, -64, -64, -64, -64, 64, 64, -64, -64, 64, -64, 64, 64, -64, 64, -64, -64, 64, 64, -64, -64, -64, 64, 64, -64, 64, 64, -64, 64, -64, -64, 64, 64, -64, -64, -64, -64, 64, 64, 64, -64, -64, -64, -64, 64, 64, 64, 64, 64, -64, 64, 64, -64, 64, 64, -64, -64, 64, -64, -64, -64, -64, -64, -64, -64, -64, -64, 64, -64, -64, 64, 64, -64, -64, -64, 64, 64, -64, -64, -64, 64, -64, -64, -64, 64, -64, -64, -64, -64, -64, -64, -64, 64, 64, 64, 64, 64, 64, 64, -64, 64, -64, 64, 64, 64, -64, 64, 64, -64, -64, 64, 64, -64, -64, -64, -64, -64, 64, 64, 64, -64, 64, 64, 64, 64, 64, 64, 64, 64, 64, 64, -64, 64, -64, -64, -64, 64, 64, 64, -64, 64, 64, 64, 64, 64, 64, 64, 64, -64, -64, 64, 64, 64, 64, -64, 64, -64, 64, 64, -64, 64, -64, 64, 64, 64, -64, 64, 64, -64, 64, 64, 64, 64, 64, -64, -64, 64, -64, -64, 64, 64, 64, 64, 64, 64, 64, -64, 64, -64, -64, -64, -64, -64, -64, -64, -64, -64, -64, 64, 64, 64, -64, -64, -64, -64, 64, 64, 64, 64, -64, 64, 64, 64, 64, 64, -64, 64, -64, 64, -64, -64, -64, -64, 64, -64, -64, 64, 64, -64, -64, -64, -64, -64, 64, 64, 64, 64, 64, 64, 64, 64, -64, -64, -64, 64, 64, -64, -64, -64, -64, -64, -64, -64, -64, 64, 64, -64, -64, 64, -64, -64, 64, 64, 64, 64, 64, 64, -64, 64, -64, 64, 64, -64, 64, -64, -64, -64, -64, -64, 64, -64, 64, 64, 64, 64, -64, -64, 64, 64, 64, 64, 64, 64, -64, 64, 64, -64, 64, -64, 64, -64, 64, -64, -64, -64, -64, 64, -64, 64, 64, 64, 64, 64, -64, -64, -64, -64, -64, 64, 64, 64, 64, 64, -64, 64, 64, -64, -64, 64, -64, -64, -64, 64, 64, 64, 64, 64, 64, 64, 64, 64, 64, -64, -64, -64, -64, 64, 64, 64, 64, 64, 64, -64, -64, -64, -64, -64, -64, 64, 64, -64, 64, 64, 64, -64, 64, 64, 64, 64, -64, -64, 64, -64, 64, 64, 64, 64, 64, 64, -64, 64, -64, -64, 64, 64, -64, -64, 64, 64, 64, 64, 64, 64, 64, 64, 64, 64, -64, -64, -64, -64, 64, 64, 64, 64, 64, 64, 64, 64, -64, -64, 64, 64, 64, -64, -64, 64, 64, 64, 64, 64, 64, 64, 64, -64, -64, -64, 64, -64, 64, 64, 64, 64, -64, -64, 64, 64, -64, -64, 64, -64, 64, 64, -64, 64, 64, 64, 64, 64, 64, 64, 64, -64, -64, 64, 64, 64, 64, 64, 64, 64, 64, -64, 64, 64, -64, -64, -64, 64, 64, -64, -64, 64, 64, 64, 64, 64, 64, 64, 64, 64, 64, -64, 64, 64, 64, 64, 64, 64, 64, -64, -64, 64, -64, 64, -64, -64, -64, 64, -64, -64, 64, 64, 64, 64, 64, 64, 64, 64, 64, 64, 64, 64, -64, 64, 64, 64, -64, 64, 64, 64, 64, -64, -64, 64, 64, -64, -64, -64, 64, -64, 64, 64, 64, 64, 64, 64, 64, 64, 64, 64, 64, -64, -64, 64, -64, 64, -64, -64, 64, -64, -64, -64, 64, -64, -64, 64, 64, 64, 64, 64, 64, 64, 64, 64, 64, -64, 64, -64, -64, -64, -64, -64, 64, -64, 64, 64, -64, -64, -64, -64, 64, 64, 64, 64, 64, 64, 64, 64, 64, 64, -64, 64, 64, 64, -64, 64, -64, -64, 64, 64, -64, -64, 64, -64, -64, 64, 64, 64, -64, 64, -64, -64, -64, 64, 64, 64, -64, -64, -64, -64, -64, 64, -64, 64, -64, 64, -64, 64, 64, 64, 64, -64, -64, -64, -64, 64, -64, 64, -64, -64, -64, -64, -64, -64, 64, -64, -64, -64, -64, -64, -64, -64, -64, -64, 64, 64, 64, 64, 64, 64, -64, -64, 64, 64, -64, 64, -64, -64, -64, -64, -64, -64, -64, 64, 64, -64, -64, -64, -64, -64, -64, -64, 64, 64, 64, -64, 64, 64, 64, -64, 64, -64, -64, -64, 64, -64, 64, -64, -64, 64, -64, -64, -64, -64, -64, -64, -64, -64, 64, -64, 64, -64, -64, 64, -64, -64, 64, -64, -64, -64, -64, 64, 64, -64, 64, -64, 64, 64, 64, -64, 64, 64, -64, -64, -64, -64, -64, -64, -64, -64, -64, 64, -64, 64, -64, 64, 64, 64, -64, 64, 64, -64, -64, 64, 64, 64, -64, -64, 64, 64, -64, 64, 64, 64, -64, 64, -64, 64, -64, 64, 64, -64, 64, 64, 64, -64, -64, -64, -64, 64, -64, -64, 64, 64, -64, 64, 64, -64, 64, 64, 64, 64, 64, 64, -64, 64, 64, -64, 64, 64, 64, 64, 64, -64, 64, 64, 64, -64, 64, -64, -64, -64, -64, 64, 64, -64, -64, -64, -64, 64, 64, 64, -64, 64, 64, 64, 64, -64, 64, -64, -64, -64, 64, 64, -64, 64, 64, 64, -64, 64, 64, -64, 64, 64, -64, 64, 64, 64, 64, 64, 64, 64, 64, -64, 64, -64, -64, -64, -64, 64, -64, -64, -64, 64, -64, -64, -64, 64, -64, -64, 64, 64, 64, 64, 64, 64, 64, 64, -64, 64, 64, -64, -64, -64, -64, 64, 64, -64, 64, 64, -64, 64, -64, -64, -64, -64, 64, 64, 64, 64, 64, 64, 64, 64, 64, 64, -64, -64, -64, 64, -64, -64, -64, 64, 64, -64, 64, 64, -64, -64, -64, -64, -64, -64, -64, 64, 64, 64, 64, 64, 64, 64, -64, -64, -64, -64, -64, -64, 64, 64, 64, 64, 64, 64, 64, 64, 64, 64, -64, -64, -64, -64, 64, 64, 64, 64, 64, 64, 64, 64, -64, -64, -64, 64, -64, -64, -64, 64, 64, 64, -64, 64, 64, -64, 64, -64, 64, -64, -64, -64, -64, 64, 64, 64, 64, 64, 64, 64, -64, -64, 64, -64, -64, 64, 64, 64, 64, 64, 64, 64, -64, 64, -64, -64, 64, 64, -64, -64, -64, -64, 64, 64, 64, 64, 64, -64, -64, -64, 64, 64, 64, 64, 64, 64, 64, 64, 64, -64, -64, 64, 64, 64, 64, -64, -64, -64, -64, -64, 64, 64, 64, 64, 64, -64, -64, 64, 64, 64, 64, 64, 64, 64, 64, -64, 64, 64, -64, 64, 64, 64, 64, 64, 64, -64, -64, -64, 64, 64, 64, 64, -64, -64, -64, -64, 64, 64, 64, 64, 64, 64, 64, 64, 64, 64, 64, 64, 64, 64, 64, 64, -64, 64, 64, 64, 64, 64, 64, -64, -64, -64, -64, 64, 64, 64, 64, 64, 64, 64, 64, -64, -64, 64, 64, 64, -64, 64, 64, 64, 64, -64, -64, 64, 64, 64, 64, -64, 64, 64, -64, 64, 64, 64, 64, 64, 64, -64, 64, 64, -64, -64, -64, -64, 64, 64, 64, 64, -64, 64, 64, 64, 64, 64, -64, 64, 64, 64, 64, 64, 64, 64, -64, -64, 64, -64, 64, 64, -64, 64, -64, -64, -64, 64, 64, 64, 64, 64, -64, 64, -64, 64, 64, -64, 64, 64, 64, 64, -64, -64, -64, -64, -64, -64, -64, 64, -64, -64, 64, 64, -64, 64, 64, 64, 64, -64, 64, 64, -64, 64, 64, -64, -64, 64, 64, 64, -64, -64, -64, -64, -64, -64, 64, 64, 64, 64, -64, -64, -64, 64, 64, 64, 64, -64, -64, -64, -64, -64, 64, -64, 64, 64, 64, -64, 64, -64, -64, -64, -64, -64, -64, -64, 64, 64, -64, -64, -64, -64, 64, 64, 64, 64, -64, 64, 64, -64, -64, -64, 64, 64, 64, 64, 64, 64, 64, 64, 64, -64, 64, 64, -64, -64, -64, 64, 64, 64, -64, -64, 64, 64, 64, -64, -64, 64, -64, 64, 64, 64, 64, 64, -64, 64, 64, 64, 64, 64, -64, 64, 64, -64, 64, -64, 64, 64, 64, 64, 64, 64, 64, 64, -64, -64, 64, 64, 64, 64, 64, 64, 64, -64, 64, 64, 64, -64, -64, -64, 64, 64, -64, -64, -64, -64, -64, 64, 64, 64, 64, -64, -64, 64, -64, 64, 64, 64, 64, 64, -64, 64, -64, -64, 64, 64, -64, -64, 64, 64, -64, -64, 64, 64, 64, 64, 64, 64, 64, -64, 64, 64, -64, 64, 64, 64, 64, 64, 64, -64, -64, -64, -64, 64, -64, -64, -64, -64, -64, 64, -64, 64, -64, -64, 64, 64, 64, -64, 64, 64, 64, 64, 64, 64, 64, 64, 64, -64, -64, 64, 64, -64, -64, -64, -64, 64, 64, 64, 64, 64, 64, 64, 64, 64, 64, -64, -64, -64, -64, -64, 64, 64, 64, 64, -64, 64, -64, 64, 64, -64, -64, 64, 64, -64, 64, 64, -64, 64, 64, 64, 64, 64, 64, 64, -64, -64, -64, -64, 64, 64, 64, 64, -64, 64, 64, 64, 64, 64, -64, 64, -64, -64, -64, -64, -64, 64, 64, -64, -64, -64, 64, 64, 64, -64, -64, 64, 64, 64, 64, 64, 64, 64, -64, -64, -64, 64, 64, -64, 64, 64, -64, -64, 64, -64, 64, -64, -64, 64, 64, -64, 64, 64, -64, 64, -64, -64, 64, 64, 64, 64, 64, 64, 64, -64, -64, -64, 64, -64, 64, -64, 64, -64, 64, -64, 64, -64, 64, -64, -64, -64, -64, -64, -64, -64, -64, 64, -64, 64, 64, 64, -64, -64, -64, -64, 64, -64, -64, 64, 64, 64, -64, -64, -64, 64, -64, -64, -64, -64, -64, -64, 64, 64, 64, -64, 64, 64, 64, 64, -64, -64, -64, -64, -64, 64, -64, -64, 64, -64, -64, -64, -64, -64, 64, 64, -64, 64, 64, -64, 64, -64, -64, -64, 64, 64, 64, -64, -64, -64, 64, 64, -64, 64, -64, 64, 64, -64, -64, 64, 64, 64, -64, 64, -64, 64, 64, 64, -64, -64, -64, -64, -64, 64, 64, -64, 64, -64, -64, -64, 64, -64, -64, -64, 64, -64, 64, -64, 64, 64, 64, -64, -64, -64, 64, -64, 64, 64, 64, 64, 64, 64, -64, 64, -64, 64, 64, -64, 64, 64, 64, 64, -64, -64, -64, -64, -64, -64, -64, -64, 64, 64, 64, 64, 64, 64, 64, 64, 64, 64, 64, 64, 64, 64, 64, -64, -64, 64, -64, -64, -64, -64, -64, -64, -64, -64, -64, -64, -64, -64, 64, 64, 64, 64, 64, 64, 64, 64, 64, 64, 64, -64, -64, 64, -64, -64, -64, 64, -64, -64, -64, 64, -64, -64, 64, 64, 64, 64, 64, 64, 64, 64, 64, 64, 64, 64, 64, 64, 64, 64, -64, 64, 64, 64, -64, -64, -64, -64, 64, 64, 64, 64, 64, 64, 64, 64, 64, 64, 64, 64, 64, 64, -64, -64, -64, 64, -64, 64, -64, -64, -64, 64, 64, -64, -64, -64, 64, -64, 64, 64, 64, 64, 64, 64, -64, 64, -64, -64, 64, 64, 64, 64, 64, 64, -64, 64, 64, 64, -64, -64, -64, -64, -64, -64, -64, 64, -64, 64, 64, -64, 64, 64, -64, -64, -64, -64, 64, 64, 64, -64, 64, 64, 64, 64, 64, 64, 64, 64, -64, -64, -64, -64, -64, -64, -64, 64, 64, -64, -64, 64, -64, -64, -64, 64, 64, 64, -64, -64, -64, 64, 64, 64, 64, 64, -64, 64, -64, -64, -64, 64, -64, -64, 64, -64, -64, -64, -64, -64, -64, -64, 64, 64, 64, -64, -64, 64, 64, -64, -64, 64, 64, 64, -64, 64, 64, -64, 64, -64, -64, -64, 64, -64, -64, -64, -64, -64, 64, 64, 64, -64, 64, -64, -64, 64, 64, 64, 64, 64, 64, -64, 64, 64, 64, 64, 64, 64, -64, -64, -64, 64, -64, 64, 64, 64, 64, 64, 64, 64, -64, -64, -64, -64, 64, 64, 64, 64, 64, -64, -64, -64, 64, -64, 64, 64, -64, -64, 64, 64, 64, 64, 64, 64, 64, 64, 64, 64, -64, -64, 64, -64, 64, 64, 64, 64, -64, -64, -64, 64, 64, -64, 64, -64, 64, -64, 64, 64, 64, 64, 64, 64, 64, 64, 64, -64, -64, 64, 64, 64, -64, 64, -64, -64, -64, -64, 64, -64, -64, -64, 64, 64, 64, -64, 64, 64, 64, 64, 64, 64, 64, 64, 64, -64, -64, 64, 64, 64, -64, -64, -64, 64, -64, 64, -64, 64, -64, 64, 64, -64, -64, -64, 64, 64, 64, 64, 64, 64, 64, 64, 64, 64, -64, -64, 64, 64, -64, -64, -64, 64, 64, -64, 64, -64, 64, 64, 64, -64, -64, 64, 64, 64, 64, 64, 64, 64, 64, 64, 64, -64, -64, -64, -64, 64, -64, 64, -64, 64, -64, -64, -64, 64, -64, -64, 64, -64, 64, 64, -64, 64, 64, 64, 64, 64, -64, 64, -64, -64, -64, 64, -64, -64, 64, -64, 64, 64, 64, -64, 64, 64, 64, -64, 64, 64, 64, 64, -64, 64, 64, 64, 64, 64, -64, -64, 64, 64, -64, 64, -64, -64, 64, -64, -64, 64, -64, -64, -64, -64, 64, -64, 64, 64, 64, 64, 64, 64, 64, -64, -64, 64, -64, -64, -64, -64, -64, -64, -64, 64, 64, 64, 64, 64, -64, -64, 64, -64, -64, -64, 64, 64, 64, 64, 64, 64, -64, 64, -64, 64, 64, 64, 64, -64, -64, 64, -64, 64, 64, 64, 64, -64, 64, 64, -64, -64, -64, -64, 64, 64, 64, 64, -64, -64, -64, -64, 64, -64, 64, 64, -64, -64, -64, -64, 64, 64, 64, 64, 64, -64, -64, -64, 64, -64, 64, -64, 64, -64, 64, -64, 64, -64, -64, 64, 64, 64, 64, -64, 64, 64, 64, -64, 64, -64, 64, 64, 64, 64, -64, -64, 64, -64, -64, -64, 64, -64, -64, -64, -64, -64, -64, -64, 64, -64, -64, 64, 64, -64, -64, 64, -64, -64, -64, -64, 64, 64, -64, 64, -64, 64, 64, -64, 64, -64, -64, -64, -64, -64, -64, 64, 64, -64, -64, -64, -64, -64, -64, -64, -64, -64, -64, -64, -64, -64, 64, -64, 64, 64, 64, 64, 64, 64, 64, -64, -64, -64, 64, 64, 64, 64, 64, 64, 64, -64, 64, -64, -64, -64, -64, -64, -64, 64, -64, 64, 64, 64, 64, 64, 64, 64, -64, -64, -64, 64, -64, -64, -64, 64, -64, -64, 64, 64, 64, -64, -64, -64, 64, -64, -64, -64, 64, -64, -64, 64, 64, -64, 64, 64, -64, -64, -64, 64, -64, 64, 64, 64, 64, 64, -64, 64, -64, -64, -64, -64, -64, 64, 64, 64, 64, 64, -64, -64, 64, 64, -64, -64, -64, 64, 64, 64, -64, 64, -64, 64, -64, 64, -64, -64, -64, -64, -64, -64, 64, 64, -64, -64, 64, 64, 64, 64, -64, 64, -64, -64, -64, -64, -64, -64, -64, -64, -64, -64, -64, -64, -64, -64, -64, 64, -64, -64, -64, 64, -64, -64, -64, 64, -64, 64, 64, -64, 64, -64, -64, -64, -64, 64, 64, -64, -64, -64, 64, -64, 64, 64, 64, -64, -64, -64, -64, -64, -64, -64, -64, 64, 64, 64, -64, 64, -64, -64, -64, -64, -64, -64, -64, -64, 64, 64, 64, 64, -64, -64, -64, -64, 64, -64, 64, 64, 64, 64, -64, -64, -64, -64, -64, 64, -64, -64, -64, -64, 64, 64, 64, 64, 64, 64, 64, 64, -64, 64, 64, 64, 64, 64, 64, 64, -64, 64, -64, 64, 64, 64, -64, -64, 64, -64, -64, 64, 64, 64, 64, 64, 64, 64, 64, 64, 64, 64, 64, 64, 64, 64, 64, -64, -64, -64, -64, -64, 64, 64, 64, 64, -64, -64, 64, -64, -64, -64, 64, 64, 64, 64, 64, 64, 64, 64, 64, 64, 64, -64, 64, -64, -64, 64, 64, -64, 64, -64, -64, 64, -64, 64, -64, 64, -64, -64, -64, 64, 64, 64, 64, -64, 64, 64, 64, 64, 64, -64, 64, -64, -64, 64, 64, 64, -64, -64, -64, -64, 64, -64, -64, 64, 64, 64, 64, 64, 64, -64, -64, 64, 64, 64, 64, 64, 64, 64, -64, -64, -64, -64, 64, 64, 64, -64, -64, 64, 64, -64, 64, 64, -64, -64, 64, 64, 64, -64, 64, 64, -64, -64, 64, 64, 64, -64, -64, -64, -64, -64, -64, 64, -64, 64, 64, 64, 64, -64, 64, 64, 64, -64, 64, 64, 64, -64, 64, -64, -64, -64, 64, 64, 64, -64, -64, -64, -64, -64, 64, 64, 64, -64, 64, 64, 64, 64, 64, -64, -64, -64, -64, 64, 64, -64, -64, -64, -64, -64, 64, 64, 64, 64, -64, -64, -64, -64, -64, -64, -64, -64, 64, 64, 64, 64, -64, 64, 64, -64, -64, -64, -64, 64, 64, -64, 64, 64, 64, 64, 64, 64, -64, -64, -64, 64, 64, -64, -64, 64, -64, 64, 64, 64, 64, -64, -64, -64, 64, -64, -64, -64, 64, 64, -64, 64, -64, 64, 64, -64, -64, -64, -64, 64, 64, 64, -64, 64, 64, 64, 64, 64, 64, -64, -64, -64, -64, -64, -64, -64, -64, -64, -64, 64, -64, -64, -64, -64, -64, -64, 64, 64, 64, 64, -64, -64, -64, -64, 64, 64, 64, 64, -64, -64, -64, -64, -64, -64, -64, 64, 64, 64, -64, -64, -64, -64, -64, -64, -64, 64, 64, -64, 64, -64, -64, -64, 64, 64, 64, 64, -64, -64, -64, -64, -64, -64, -64, 64, 64, 64, -64, -64, -64, -64, -64, 64, 64, 64, 64, 64, 64, 64, -64, -64, 64, 64, 64, 64, -64, -64, -64, -64, -64, -64, 64, 64, 64, 64, 64, -64, -64, -64, -64, 64, 64, 64, 64, -64, -64, 64, -64, -64, -64, 64, 64, 64, 64, 64, -64, -64, -64, -64, 64, 64, 64, 64, -64, -64, -64, -64, -64, 64, 64, 64, 64, -64, 64, -64, -64, -64, 64, -64, 64, 64, -64, 64, 64, -64, -64, -64, -64, -64, 64, 64, -64, 64, 64, -64, 64, 64, 64, 64, 64, 64, 64, -64, -64, 64, 64, 64, 64, 64, 64, 64, -64, 64, -64, -64, 64, 64, 64, 64, 64, -64, 64, 64, 64, -64, -64, 64, -64, -64, 64, -64, -64, -64, 64, 64, 64, -64, 64, 64, 64, -64, 64, 64, 64, 64, 64, 64, 64, 64, 64, -64, 64, -64, 64, -64, 64, -64, 64, 64, 64, -64, 64, 64, -64, 64, -64, -64, -64, 64, -64, 64, 64, 64, 64, -64, 64, 64, 64, 64, 64, 64, -64, -64, 64, -64, 64, -64, -64, -64, -64, 64, 64, -64, -64, 64, -64, 64, -64, 64, 64, 64, 64, 64, 64, 64, 64, 64, 64, -64, -64, 64, -64, 64, -64, -64, 64, -64, -64, -64, -64, 64, 64, 64, 64, 64, 64, 64, 64, -64, -64, 64, 64, 64, 64, 64, 64, -64, -64, -64, 64, 64, -64, -64, -64, 64, 64, -64, 64, -64, 64, 64, 64, 64, 64, 64, -64, 64, 64, 64, 64, 64, -64, 64, 64, -64, 64, -64, 64, 64, 64, -64, 64, -64, -64, -64, 64, -64, -64, 64, -64, 64, 64, 64, 64, -64, 64, -64, 64, -64, 64, 64, 64, 64, 64, 64, 64, 64, 64, 64, -64, -64, -64, -64, -64, -64, 64, -64, 64, 64, -64, 64, 64, -64, -64, -64, -64, 64, 64, -64, 64, 64, -64, 64, 64, -64, 64, 64, 64, -64, -64, 64, -64, 64, 64, 64, -64, -64, -64, -64, 64, 64, -64, -64, -64, -64, -64, -64, 64, -64, 64, -64, -64, -64, -64, 64, -64, 64, 64, -64, -64, 64, -64, -64, 64, 64, 64, -64, 64, -64, -64, -64, 64, -64, -64, -64, -64, -64, -64, -64, -64, -64, 64, 64, -64, -64, 64, -64, 64, -64, -64, -64, 64, -64, -64, -64, 64, -64, 64, -64, 64, 64, -64, -64, -64, -64, -64, -64, -64, 64, 64, 64, -64, 64, 64, -64, -64, 64, -64, -64, 64, -64, 64, -64, 64, -64, 64, -64, -64, 64, -64, -64, -64, -64, -64, -64, -64, -64, -64, -64, -64, -64, 64, 64, 64, 64, 64, -64, 64, 64, 64, 64, 64, 64, 64, 64, 64, 64, -64, 64, -64, -64, -64, -64, -64, 64, -64, -64, 64, -64, 64, -64, 64, 64, 64, 64, 64, 64, 64, 64, 64, 64, 64, 64, 64, 64, 64, 64, -64, 64, -64, 64, 64, 64, 64, 64, 64, -64, 64, -64, 64, 64, 64, 64, 64, 64, 64, 64, 64, 64, 64, 64, 64, 64, 64, 64, 64, 64, 64, 64, 64, 64, -64, 64, -64, -64, 64, 64, 64, 64, 64, 64, 64, -64, 64, 64, 64, 64, 64, 64, 64, 64, 64, 64, 64, 64, -64, -64, 64, -64, -64, -64, -64, 64, 64, 64, -64, -64, 64, -64, -64, -64, -64, -64, 64, -64, 64, -64, 64, 64, -64, 64, 64, -64, -64, -64, -64, -64, 64, 64, -64, 64, -64, -64, -64, -64, 64, 64, -64, -64, -64, -64, 64, -64, -64, -64, 64, 64, -64, 64, 64, 64, -64, -64, -64, -64, -64, -64, 64, -64, 64, 64, 64, 64, -64, 64, -64, -64, -64, -64, -64, -64, -64, -64, 64, 64, 64, 64, 64, -64, -64, -64, 64, 64, -64, -64, 64, 64, -64, 64, -64, -64, -64, -64, -64, -64, -64, -64, -64, -64, -64, -64, -64, 64, 64, 64, -64, -64, -64, -64, 64, -64, -64, 64, 64, -64, 64, -64, 64, 64, -64, -64, 64, -64, 64, -64, -64, -64, -64, -64, -64, -64, -64, 64, 64, 64, 64, 64, -64, -64, 64, -64, -64, 64, 64, 64, 64, 64, 64, -64, -64, 64, 64, -64, -64, -64, -64, -64, -64, 64, 64, 64, 64, -64, -64, -64, 64, 64, -64, 64, 64, 64, -64, -64, -64, -64, -64, 64, -64, 64, -64, -64, -64, -64, -64, -64, -64, 64, 64, 64, 64, -64, -64, -64, -64, 64, 64, -64, 64, -64, 64, 64, 64, -64, -64, -64, -64, 64, -64, -64, -64, -64, -64, -64, -64, -64, -64, -64, -64, 64, -64, -64, 64, 64, 64, 64, -64, 64, 64, 64, 64, -64, -64, -64, -64, -64, 64, -64, -64, -64, 64, -64, 64, 64, 64, 64, 64, -64, -64, 64, 64, 64, 64, 64, 64, 64, 64, -64, 64, 64, -64, -64, 64, 64, 64, -64, -64, -64, -64, 64, -64, 64, -64, 64, 64, -64, 64, 64, 64, 64, 64, -64, 64, 64, 64, 64, 64, 64, 64, 64, -64, 64, -64, -64, 64, 64, 64, 64, -64, -64, -64, 64, 64, 64, 64, -64, 64, -64, 64, 64, -64, -64, 64, 64, 64, -64, 64, 64, -64, -64, 64, -64, -64, 64, 64, -64, -64, -64, -64, 64, 64, 64, 64, 64, 64, 64, -64, -64, -64, 64, 64, 64, -64, 64, 64, 64, 64, -64, -64, 64, 64, 64, 64, -64, -64, 64, 64, 64, 64, 64, 64, 64, 64, -64, 64, -64, 64, 64, -64, 64, 64, 64, 64, 64, 64, 64, 64, 64, 64, 64, 64, -64, -64, 64, 64, 64, 64, 64, 64, 64, 64, 64, 64, -64, -64, 64, -64, 64, 64, 64, 64, 64, 64, 64, 64, 64, 64, 64, -64, -64, 64, 64, 64, -64, 64, 64, 64, 64, -64, -64, -64, 64, -64, 64, 64, 64, 64, 64, 64, 64, -64, -64, 64, 64, 64, 64, -64, -64, 64, 64, 64, 64, 64, 64, 64, -64, -64, 64, -64, 64, -64, 64, -64, 64, 64, 64, 64, 64, 64, 64, 64, 64, 64, 64, 64, 64, 64, 64, 64, 64, 64, 64, 64, -64, -64, 64, 64, -64, -64, 64, 64, 64, -64, 64, 64, -64, 64, 64, -64, -64, 64, 64, 64, -64, -64, -64, -64, 64, 64, 64, 64, -64, -64, -64, 64, -64, -64, 64, -64, -64, -64, -64, -64, -64, 64, -64, -64, 64, -64, -64, 64, -64, 64, 64, -64, 64, 64, 64, 64, -64, -64, 64, 64, 64, 64, 64, 64, 64, 64, 64, 64, -64, 64, 64, -64, 64, -64, 64, -64, 64, 64, 64, -64, -64, -64, -64, 64, 64, 64, -64, 64, -64, -64, 64, 64, -64, -64, -64, 64, 64, -64, 64, 64, -64, -64, -64, -64, 64, -64, 64, 64, 64, -64, 64, 64, 64, -64, -64, 64, -64, -64, -64, -64, 64, -64, 64, 64, -64, 64, -64, -64, -64, -64, -64, -64, -64, -64, 64, 64, 64, 64, 64, 64, -64, 64, -64, 64, -64, -64, -64, 64, 64, -64, -64, 64, -64, -64, -64, -64, -64, -64, -64, -64, -64, -64, -64, -64, -64, 64, 64, 64, -64, 64, 64, 64, -64, -64, 64, -64, 64, -64, -64, -64, -64, -64, -64, -64, -64, -64, -64, -64, -64, -64, -64, -64, 64, 64, 64, 64, 64, -64, 64, 64, 64, 64, -64, -64, -64, -64, -64, -64, -64, -64, -64, -64, -64, -64, -64, -64, -64, -64, -64, -64, 64, -64, 64, 64, 64, 64, -64, 64, -64, -64, -64, 64, -64, 64, -64, -64, -64, -64, -64, -64, -64, -64, 64, -64, 64, 64, 64, 64, -64, 64, 64, 64, 64, 64, -64, 64, 64, -64, 64, -64, -64, -64, -64, -64, -64, -64, -64, -64, -64, 64, -64, 64, 64, 64, 64, 64, 64, 64, 64, 64, 64, 64, -64, 64, -64, -64, -64, 64, 64, -64, -64, -64, -64, -64, -64, -64, 64, 64, 64, 64, 64, 64, 64, -64, -64, -64, 64, 64, 64, 64, 64, -64, 64, -64, -64, 64, 64, 64, 64, -64, 64, -64, 64, -64, 64, 64, 64, 64, -64, -64, -64, -64, -64, -64, -64, 64, 64, 64, 64, 64, 64, 64, -64, -64, 64, 64, 64, 64, 64, 64, 64, 64, -64, 64, -64, -64, -64, -64, -64, -64, -64, -64, -64, -64, 64, 64, -64, -64, -64, -64, -64, -64, 64, 64, 64, -64, -64, -64, -64, -64, -64, 64, -64, -64, -64, -64, -64, -64, -64, -64, -64, 64, 64, -64, -64, 64, 64, 64, -64, 64, 64, -64, 64, 64, 64, -64, -64, 64, 64, -64, -64, -64, -64, -64, -64, -64, -64, -64, -64, 64, 64, -64, 64, -64, 64, 64, 64, -64, -64, 64, 64, -64, 64, -64, 64, -64, -64, -64, 64, 64, -64, -64, -64, -64, -64, -64, -64, 64, 64, -64, -64, -64, 64, 64, -64, -64, -64, 64, 64, 64, 64, -64, -64, -64, -64, -64, 64, 64, -64, -64, -64, -64, -64, -64, -64, 64, -64, -64, -64, -64, -64, 64, -64, -64, -64, 64, 64, 64, -64, -64, -64, -64, -64, -64, 64, -64, -64, 64, -64, -64, -64, -64, -64, -64, -64, -64, 64, -64, 64, 64, -64, -64, -64, 64, 64, -64, 64, 64, 64, -64, 64, -64, -64, -64, -64, -64, 64, -64, -64, -64, -64, -64, 64, -64, -64, 64, -64, 64, -64, -64, -64, -64, 64, 64, 64, -64, -64, 64, -64, -64, -64, -64, -64, -64, 64, -64, -64, -64, -64, -64, -64, 64, -64, 64, 64, -64, 64, -64, -64, -64, -64, -64, -64, -64, 64, -64, -64, -64, -64, -64, 64, -64, -64, 64, -64, 64, 64, -64, -64, 64, -64, -64, -64, -64, -64, -64, -64, -64, -64, -64, -64, -64, 64, -64, -64, -64, -64, -64, -64, 64, -64, -64, -64, -64, -64, -64, -64, 64, -64, 64, -64, 64, -64, 64, -64, -64, -64, 64, 64, 64, 64, -64, -64, -64, 64, 64, -64, 64, 64, -64, -64, -64, -64, -64, 64, 64, 64, -64, -64, -64, -64, -64, -64, -64, -64, -64, 64, -64, 64, -64, -64, -64, 64, -64, 64, -64, -64, -64, -64, -64, -64, -64, -64, 64, 64, -64, -64, 64, 64, -64, -64, -64, -64, -64, -64, -64, -64, -64, -64, 64, -64, 64, -64, -64, -64, -64, -64, -64, -64, -64, 64, 64, -64, 64, -64, -64, 64, -64, -64, -64, -64, -64, -64, 64, 64, -64, -64, 64, 64, 64, 64, 64, -64, -64, -64, 64, -64, 64, -64, 64, 64, -64, -64, -64, 64, -64, 64, 64, 64, -64, 64, 64, -64, -64, -64, 64, 64, 64, 64, 64, -64, 64, 64, -64, -64, 64, -64, 64, 64, -64, 64, 64, -64, -64, -64, -64, 64, 64, 64, 64, -64, -64, 64, 64, 64, 64, 64, 64, 64, 64, -64, 64, 64, 64, -64, 64, 64, 64, 64, -64, -64, -64, 64, 64, -64, 64, 64, 64, 64, 64, -64, 64, -64, 64, 64, 64, 64, -64, -64, -64, -64, 64, -64, 64, 64, 64, 64, 64, -64, 64, 64, -64, 64, -64, 64, -64, 64, 64, -64, -64, 64, -64, 64, 64, -64, 64, 64, -64, 64, -64, -64, 64, 64, -64, 64, 64, 64, -64, 64, 64, 64, -64, 64, 64, -64, -64, -64, 64, -64, 64, 64, -64, -64, 64, 64, -64, 64, -64, 64, 64, 64, 64, -64, 64, -64, 64, 64, 64, -64, -64, 64, 64, 64, -64, 64, -64, 64, -64, -64, -64, -64, 64, -64, 64, 64, 64, 64, -64, -64, 64, -64, 64, -64, -64, 64, -64, -64, -64, -64, -64, -64, 64, -64, -64, -64, -64, -64, -64, -64, 64, 64, -64, -64, 64, 64, 64, 64, -64, -64, 64, 64, 64, 64, -64, -64, 64, 64, 64, -64, -64, -64, -64, -64, 64, -64, 64, -64, -64, -64, -64, -64, -64, -64, -64, -64, -64, 64, -64, -64, -64, 64, 64, 64, 64, 64, 64, -64, 64, -64, 64, -64, 64, -64, -64, -64, -64, -64, -64, 64, -64, -64, 64, -64, 64, 64, 64, -64, 64, 64, -64, -64, 64, 64, -64, -64, -64, -64, -64, -64, 64, -64, -64, 64, -64, -64, -64, -64, 64, 64, -64, -64, -64, -64, 64, 64, 64, -64, -64, -64, 64, -64, 64, -64, -64, -64, -64, 64, -64, 64, -64, 64, -64, -64, -64, -64, -64, 64, 64, -64, 64, -64, -64, 64, -64, 64, 64, -64, -64, -64, -64, -64, -64, 64, -64, 64, -64, -64, -64, -64, 64, 64, -64, -64, 64, -64, -64, -64, 64, 64, 64, -64, 64, 64, 64, 64, -64, 64, -64, -64, -64, -64, -64, -64, 64, 64, -64, -64, -64, -64, -64, -64, 64, 64, -64, -64, 64, -64, -64, -64, 64, 64, -64, -64, -64, -64, 64, -64, -64, -64, -64, 64, 64, -64, 64, -64, 64, -64, 64, 64, -64, 64, 64, -64, 64, 64, -64, 64, 64, -64, 64, -64, 64, 64, -64, 64, -64, -64, -64, -64, 64, 64, -64, -64, -64, -64, 64, -64, -64, -64, -64, 64, 64, -64, 64, -64, -64, 64, -64, -64, 64, -64, -64, -64, 64, -64, -64, 64, -64, -64, 64, -64, -64, -64, 64, -64, -64, 64, -64, 64, 64, -64, 64, 64, 64, -64, -64, -64, -64, 64, -64, -64, -64, 64, -64, -64, -64, 64, -64, -64, -64, 64, 64, 64, -64, -64, -64, 64, -64, 64, 64, -64, -64, -64, -64, -64, -64, -64, -64, 64, -64, -64, -64, -64, 64, 64, -64, -64, 64, -64, -64, -64, 64, -64, -64, -64, -64, 64, 64, 64, 64, -64, 64, 64, 64, 64, 64, -64, -64, -64, -64, -64, 64, -64, -64, 64, 64, -64, 64, -64, -64, 64, 64, -64, 64, -64, -64, 64, 64, -64, 64, -64, -64, 64, -64, -64, -64, -64, -64, -64, 64, -64, 64, 64, 64, -64, -64, -64, -64, -64, -64, -64, 64, -64, 64, -64, -64, -64, -64, 64, -64, 64, 64, -64, -64, -64, -64, -64, -64, 64, -64, -64, 64, -64, -64, -64, 64, 64, -64, 64, -64, -64, 64, -64, 64, -64, -64, 64, 64, -64, -64, -64, -64, -64, 64, -64, -64, -64, -64, 64, -64, -64, 64, -64, -64, 64, 64, -64, -64, 64, -64, -64, -64, 64, -64, 64, -64, -64, 64, 64, 64, -64, 64, -64, -64, -64, 64, -64, -64, -64, 64, -64, -64, 64, 64, -64, -64, -64, -64, -64, -64, -64, 64, 64, 64, 64, -64, -64, -64, -64, -64, 64, 64, 64, -64, 64, -64, -64, 64, -64, 64, 64, 64, 64, 64, 64, -64, -64, -64, -64, 64, -64, -64, -64, -64, 64, 64, 64, 64, 64, -64, -64, -64, 64, -64, 64, 64, -64, 64, -64, -64, -64, 64, -64, -64, -64, 64, -64, -64, -64, 64, -64, -64, -64, -64, -64, -64, 64, -64, -64, -64, -64, 64, -64, -64, -64, -64, 64, -64, -64, -64, 64, -64, -64, -64, -64, -64, -64, -64, 64, -64, 64, -64, -64, 64, -64, 64, 64, -64, 64, 64, -64, -64, 64, 64, 64, 64, -64, 64, -64, -64, -64, -64, 64, -64, 64, -64, -64, 64, -64, 64, -64, -64, -64, -64, -64, 64, 64, -64, -64, -64, 64, -64, 64, 64, -64, -64, -64, -64, -64, 64, 64, -64, -64, 64, -64, -64, -64, 64, 64, 64, -64, -64, 64, -64, 64, 64, -64, 64, -64, -64, 64, 64, -64, -64, 64, 64, -64, -64, 64, 64, 64, 64, -64, -64, -64, -64, 64, -64, 64, 64, -64, -64, -64, -64, -64, -64, -64, 64, 64, 64, -64, -64, -64, -64, -64, 64, 64, 64, -64, -64, 64, -64, -64, -64, 64, 64, 64, 64, -64, 64, -64, -64, -64, 64, -64, 64, 64, 64, 64, -64, 64, -64, -64, -64, 64, 64, 64, 64, -64, 64, 64, -64, 64, 64, 64, -64, -64, 64, 64, 64, -64, -64, -64, -64, -64, -64, 64, 64, -64, -64, 64, 64, -64, 64, 64, -64, -64, -64, -64, 64, 64, -64, -64, -64, -64, 64, -64, -64, 64, -64, -64, -64, 64, -64, -64, 64, -64, 64, -64, 64, -64, -64, -64, -64, -64, 64, -64, 64, 64, 64, 64, -64, 64, -64, -64, -64, -64, -64, 64, -64, -64, 64, 64, 64, 64, 64, 64, -64, -64, -64, -64, 64, -64, 64, 64, 64, -64, -64, 64, 64, 64, 64, -64, -64, 64, -64, 64, -64, -64, 64, 64, 64, 64, -64, -64, 64, -64, 64, 64, 64, -64, 64, -64, 64, 64, 64, 64, -64, 64, 64, 64, -64, -64, 64, 64, -64, -64, 64, -64, -64, -64, -64, 64, 64, 64, 64, 64, 64, 64, 64, 64, -64, 64, 64, 64, 64, 64, 64, 64, 64, 64, 64, 64, -64, 64, -64, 64, 64, -64, 64, 64, 64, -64, 64, 64, 64, 64, 64, 64, 64, 64, 64, 64, 64, 64, 64, 64, -64, -64, 64, -64, -64, -64, -64, -64, 64, 64, -64, -64, -64, 64, 64, 64, 64, 64, 64, -64, -64, -64, -64, -64, -64, -64, 64, 64, 64, -64, 64, -64, -64, -64, -64, -64, -64, 64, 64, -64, 64, -64, 64, 64, 64, 64, -64, -64, 64, -64, -64, -64, 64, 64, 64, 64, 64, -64, -64, -64, -64, -64, -64, -64, 64, -64, -64, -64, -64, 64, 64, 64, 64, 64, 64, -64, -64, 64, -64, -64, 64, 64, 64, 64, 64, 64, -64, -64, -64, -64, -64, -64, 64, 64, 64, 64, 64, 64, -64, 64, 64, 64, -64, -64, -64, 64, 64, 64, 64, 64, 64, 64, -64, -64, -64, -64, -64, -64, -64, -64, 64, 64, -64, -64, 64, 64, 64, 64, 64, -64, 64, 64, 64, -64, 64, 64, 64, 64, 64, 64, -64, -64, -64, -64, -64, -64, -64, -64, -64, -64, 64, 64, 64, 64, -64, 64, -64, 64, 64, 64, -64, -64, 64, 64, 64, 64, 64, 64, -64, -64, -64, -64, -64, 64, 64, 64, 64, 64, 64, 64, 64, 64, -64, 64, -64, -64, 64, 64, -64, 64, 64, 64, 64, 64, 64, 64, -64, -64, -64, -64, 64, 64, 64, 64, 64, 64, -64, -64, -64, -64, 64, 64, 64, 64, 64, 64, 64, 64, 64, 64, 64, 64, 64, -64, 64, -64, -64, 64, -64, 64, -64, 64, 64, -64, 64, 64, -64, 64, -64, 64, -64, 64, 64, -64, -64, 64, 64, -64, 64, -64, 64, 64, -64, -64, -64, -64, 64, 64, -64, -64, 64, -64, 64, -64, 64, 64, 64, -64, 64, 64, -64, -64, -64, -64, 64, -64, 64, 64, -64, -64, 64, -64, -64, 64, 64, 64, -64, -64, 64, 64, -64, -64, 64, -64, -64, -64, -64, -64, -64, -64, -64, -64, -64, -64, 64, 64, 64, 64, 64, 64, 64, 64, 64, -64, -64, 64, -64, -64, -64, 64, -64, 64, -64, 64, -64, -64, -64, -64, -64, -64, -64, 64, 64, 64, 64, 64, 64, 64, 64, 64, 64, 64, 64, 64, 64, -64, 64, 64, 64, 64, 64, -64, -64, -64, 64, -64, 64, 64, -64, -64, 64, 64, 64, 64, 64, 64, 64, 64, 64, 64, 64, -64, 64, 64, 64, 64, -64, -64, -64, -64, -64, -64, 64, -64, 64, 64, 64, 64, 64, 64, 64, 64, 64, 64, 64, -64, -64, 64, 64, 64, 64, 64, 64, -64, -64, -64, -64, -64, -64, -64, 64, 64, -64, -64, 64, 64, 64, 64, 64, 64, 64, 64, 64, -64, 64, 64, 64, 64, -64, 64, 64, 64, 64, 64, -64, -64, -64, 64, -64, 64, 64, 64, 64, 64, 64, 64, 64, 64, 64, 64, 64, 64, 64, -64, -64, -64, 64, 64, -64, -64, 64, -64, -64, -64, -64, -64, -64, -64, 64, 64, 64, 64, 64, 64, 64, 64, 64, 64, 64, 64, 64, 64, -64, 64, 64, -64, -64, 64, -64, 64, 64, 64, -64, -64, -64, -64, -64, 64, 64, 64, 64, 64, 64, 64, -64, 64, 64, -64, -64, 64, -64, 64, -64, -64, -64, 64, -64, 64, -64, -64, -64, -64, -64, -64, -64, -64, -64, -64, 64, 64, 64, 64, 64, 64, 64, 64, 64, 64, 64, -64, -64, 64, -64, 64, 64, 64, 64, 64, -64, -64, -64, 64, 64, 64, 64, -64, 64, 64, 64, -64, -64, 64, 64, -64, -64, 64, 64, 64, 64, 64, 64, -64, -64, 64, -64, 64, -64, 64, 64, -64, -64, 64, -64, 64, 64, 64, -64, -64, -64, -64, -64, -64, 64, 64, -64, -64, -64, -64, -64, -64, -64, 64, -64, -64, 64, -64, 64, -64, -64, -64, -64, -64, -64, -64, -64, -64, -64, 64, 64, -64, -64, 64, 64, 64, 64, -64, 64, 64, -64, 64, 64, -64, 64, -64, -64, -64, -64, -64, 64, 64, 64, -64, 64, 64, -64, 64, -64, 64, 64, -64, -64, -64, 64, 64, -64, -64, -64, 64, 64, -64, 64, 64, 64, 64, -64, -64, 64, -64, -64, -64, 64, -64, -64, -64, -64, -64, 64, -64, 64, 64, -64, -64, -64, 64, 64, 64, -64, -64, 64, 64, -64, 64, -64, -64, 64, 64, 64, -64, -64, 64, -64, -64, -64, -64, 64, -64, 64, 64, -64, 64, -64, -64, -64, 64, 64, 64, 64, -64, 64, 64, -64, 64, 64, 64, 64, 64, 64, 64, 64, -64, 64, -64, -64, -64, 64, 64, 64, 64, 64, 64, -64, 64, -64, -64, -64, 64, 64, 64, 64, -64, 64, 64, 64, -64, -64, 64, 64, -64, -64, -64, 64, 64, -64, -64, 64, -64, -64, 64, -64, -64, 64, -64, 64, 64, 64, 64, 64, 64, 64, 64, 64, 64, 64, 64, 64, -64, -64, 64, 64, -64, -64, 64, 64, -64, 64, -64, 64, 64, -64, 64, -64, 64, 64, -64, -64, -64, -64, 64, -64, -64, -64, 64, 64, 64, -64, -64, 64, -64, 64, -64, -64, -64, 64, 64, 64, 64, -64, 64, 64, -64, 64, -64, -64, 64, 64, 64, -64, 64, 64, -64, 64, -64, 64, 64, 64, 64, -64, 64, -64, 64, -64, 64, -64, 64, 64, 64, -64, -64, 64, 64, -64, -64, -64, -64, 64, 64, -64, 64, -64, -64, -64, 64, 64, 64, -64, 64, 64, -64, 64, 64, 64, -64, 64, 64, 64, -64, -64, 64, -64, 64, 64, 64, 64, -64, 64, -64, 64, -64, 64, -64, 64, -64, -64, 64, 64, 64, 64, 64, -64, 64, 64, 64, 64, -64, -64, 64, 64, -64, 64, -64, 64, -64, -64, -64, 64, 64, -64, 64, -64, 64, 64, -64, 64, 64, 64, 64, 64, 64, 64, 64, 64, -64, 64, 64, 64, 64, 64, 64, 64, 64, -64, 64, 64, 64, 64, 64, 64, 64, -64, 64, 64, 64, -64, -64, 64, -64, 64, 64, 64, 64, 64, 64, 64, 64, 64, 64, 64, 64, 64, 64, 64, -64, 64, 64, 64, -64, 64, 64, -64, 64, 64, -64, 64, 64, 64, -64, -64, 64, 64, 64, 64, -64, 64, 64, 64, -64, 64, 64, 64, -64, 64, -64, -64, -64, -64, 64, -64, 64, -64, 64, 64, -64, 64, 64, 64, 64, 64, 64, 64, -64, -64, 64, -64, 64, 64, 64, 64, 64, -64, 64, -64, -64, -64, 64, -64, 64, -64, -64, 64, 64, 64, -64, 64, 64, 64, 64, -64, 64, 64, 64, -64, -64, 64, 64, 64, 64, 64, 64, -64, -64, -64, 64, -64, -64, -64, -64, 64, -64, 64, -64, 64, 64, 64, 64, 64, 64, -64, -64, -64, 64, 64, 64, 64, 64, 64, -64, -64, -64, -64, -64, 64, 64, -64, -64, -64, 64, 64, -64, 64, 64, 64, 64, 64, 64, 64, 64, 64, 64, 64, 64, 64, -64, -64, -64, -64, -64, 64, 64, -64, -64, 64, -64, -64, -64, 64, -64, 64, 64, 64, -64, 64, 64, -64, 64, 64, -64, 64, 64, 64, 64, -64, 64, 64, 64, -64, 64, 64, -64, 64, 64, -64, 64, 64, 64, 64, 64, 64, 64, 64, -64, 64, 64, 64, 64, 64, -64, -64, -64, 64, -64, 64, -64, -64, -64, 64, -64, 64, -64, -64, 64, 64, -64, -64, -64, 64, 64, 64, 64, 64, 64, -64, 64, 64, -64, -64, -64, 64, 64, 64, -64, 64, -64, -64, -64, -64, -64, -64, -64, 64, 64, 64, 64, -64, 64, -64, -64, 64, 64, 64, 64, -64, -64, 64, -64, 64, 64, 64, -64, 64, -64, 64, -64, 64, 64, 64, 64, 64, -64, -64, 64, 64, -64, -64, 64, 64, -64, 64, 64, -64, 64, 64, 64, -64, -64, 64, 64, 64, -64, -64, 64, 64, 64, 64, 64, -64, -64, 64, -64, 64, 64, 64, 64, 64, 64, 64, 64, -64, -64, -64, 64, 64, -64, 64, 64, -64, 64, -64, -64, 64, -64, 64, 64, 64, 64, 64, -64, -64, 64, 64, -64, 64, -64, -64, -64, 64, -64, -64, 64, -64, 64, -64, -64, 64, 64, -64, 64, -64, 64, 64, 64, -64, -64, -64, 64, -64, -64, 64, 64, -64, 64, -64, -64, 64, 64, 64, 64, -64, 64, 64, 64, -64, 64, -64, -64, -64, 64, -64, -64, 64, 64, 64, 64, -64, -64, 64, 64, -64, 64, 64, -64, -64, -64, -64, -64, 64, 64, 64, 64, -64, -64, 64, -64, 64, 64, 64, -64, -64, -64, -64, -64, 64, -64, -64, 64, -64, -64, -64, -64, 64, -64, 64, -64, 64, 64, -64, 64, 64, -64, 64, -64, -64, -64, 64, -64, -64, 64, 64, -64, -64, -64, 64, -64, 64, 64, 64, 64, -64, -64, -64, -64, 64, -64, -64, -64, 64, -64, 64, 64, 64, -64, 64, 64, 64, -64, -64, -64, 64, -64, -64, 64, -64, 64, -64, -64, 64, 64, 64, 64, 64, -64, -64, -64, 64, -64, -64, 64, -64, -64, 64, -64, 64, 64, 64, -64, -64, -64, 64, -64, 64, -64, -64, 64, 64, -64, -64, -64, 64, 64, 64, 64, 64, -64, 64, 64, -64, -64, 64, 64, -64, -64, -64, -64, -64, -64, 64, -64, 64, 64, 64, -64, -64, 64, -64, -64, -64, -64, -64, 64, 64, 64, 64, -64, 64, -64, -64, -64, 64, 64, -64, 64, -64, 64, -64, 64, -64, 64, -64, 64, -64, 64, -64, -64, -64, 64, -64, -64, -64, -64, -64, 64, 64, 64, -64, 64, 64, 64, 64, 64, 64, -64, -64, -64, -64, -64, -64, -64, -64, -64, 64, -64, -64, -64, 64, 64, 64, -64, 64, 64, -64, 64, -64, -64, 64, 64, -64, -64, -64, 64, 64, -64, -64, -64, -64, -64, -64, -64, -64, -64, -64, -64, -64, 64, 64, 64, 64, -64, 64, 64, -64, 64, -64, -64, -64, -64, -64, -64, -64, -64, 64, 64, 64, -64, -64, -64, -64, -64, -64, -64, -64, 64, 64, 64, 64, 64, -64, -64, 64, 64, 64, -64, -64, -64, -64, 64, -64, -64, -64, 64, 64, 64, -64, -64, -64, -64, -64, -64, -64, -64, -64, 64, -64, -64, 64, -64, -64, 64, -64, -64, -64, -64, -64, 64, -64, -64, -64, 64, 64, -64, -64, -64, -64, -64, 64, -64, -64, -64, -64, 64, 64, 64, -64, 64, -64, -64, 64, 64, -64, 64, 64, 64, -64, -64, -64, 64, 64, 64, -64, 64, -64, -64, -64, -64, -64, -64, -64, 64, -64, 64, -64, 64, -64, 64, 64, 64, -64, -64, -64, -64, -64, -64, -64, 64, -64, -64, 64, -64, -64, -64, 64, 64, 64, 64, 64, 64, -64, -64, 64, 64, -64, 64, 64, -64, -64, -64, -64, -64, -64, -64, 64, 64, -64, 64, 64, -64, -64, -64, -64, -64, 64, 64, 64, 64, -64, 64, -64, -64, 64, 64, 64, 64, -64, 64, 64, -64, -64, 64, 64, 64, 64, 64, -64, -64, 64, 64, 64, 64, 64, 64, 64, 64, 64, 64, -64, -64, 64, 64, 64, 64, -64, 64, 64, 64, 64, 64, 64, 64, 64, -64, -64, -64, 64, 64, 64, 64, 64, 64, 64, -64, 64, 64, 64, 64, 64, -64, 64, -64, 64, 64, 64, 64, 64, -64, -64, -64, 64, -64, -64, -64, -64, -64, 64, 64, -64, -64, -64, -64, 64, 64, -64, 64, 64, -64, 64, -64, -64, 64, -64, 64, 64, 64, -64, 64, 64, -64, -64, -64, -64, 64, -64, -64, -64, -64, -64, -64, -64, -64, 64, 64, 64, 64, 64, 64, 64, -64, -64, 64, 64, -64, -64, -64, -64, -64, -64, 64, -64, -64, 64, -64, -64, 64, -64, 64, -64, -64, 64, -64, 64, -64, -64, 64, 64, 64, -64, -64, -64, -64, -64, -64, -64, -64, 64, -64, 64, 64, 64, -64, -64, -64, -64, 64, -64, 64, -64, 64, -64, 64, 64, -64, 64, 64, -64, -64, -64, -64, -64, -64, -64, -64, -64, 64, 64, -64, 64, -64, -64, 64, -64, -64, -64, 64, 64, 64, 64, -64, -64, -64, -64, -64, -64, -64, -64, -64, -64, -64, -64, -64, -64, 64, -64, -64, -64, 64, 64, 64, -64, -64, -64, -64, 64, 64, -64, 64, 64, -64, -64, -64, -64, -64, -64, -64, -64, -64, -64, -64, 64, -64, 64, -64, 64, -64, -64, -64, -64, -64, -64, -64, -64, -64, -64, -64, 64, 64, -64, -64, -64, -64, -64, -64, -64, -64, -64, -64, -64, -64, -64, 64, -64, -64, -64, -64, 64, 64, 64, 64, -64, 64, 64, 64, -64, -64, 64, -64, -64, -64, -64, -64, -64, -64, -64, -64, -64, -64, 64, 64, -64, -64, 64, -64, 64, -64, -64, 64, -64, -64, 64, -64, 64, 64, 64, -64, -64, -64, -64, 64, 64, -64, -64, 64, -64, 64, 64, 64, -64, 64, 64, 64, 64, -64, 64, -64, -64, -64, -64, -64, -64, -64, 64, -64, 64, -64, -64, 64, -64, -64, 64, 64, -64, -64, -64, 64, 64, 64, 64, 64, -64, -64, -64, 64, -64, -64, 64, -64, -64, -64, 64, -64, 64, -64, 64, 64, -64, 64, -64, 64, 64, 64, -64, -64, 64, -64, -64, 64, -64, -64, -64, 64, -64, -64, 64, -64, -64, 64, -64, -64, -64, -64, -64, -64, -64, -64, -64, -64, 64, -64, 64, 64, 64, -64, 64, 64, -64, -64, 64, -64, 64, -64, 64, 64, 64, 64, 64, -64, -64, -64, 64, 64, -64, -64, 64, -64, -64, -64, 64, 64, -64, 64, 64, -64, -64, 64, -64, 64, -64, -64, 64, -64, -64, 64, 64, -64, 64, 64, 64, -64, -64, -64, 64, 64, 64, 64, 64, -64, 64, -64, -64, 64, -64, -64, -64, 64, -64, 64, 64, -64, -64, 64, 64, 64, 64, 64, 64, 64, -64, 64, 64, 64, 64, 64, 64, 64, 64, 64, -64, 64, 64, -64, 64, -64, 64, 64, 64, 64, -64, -64, 64, -64, -64, -64, -64, -64, -64, -64, 64, -64, 64, 64, 64, 64, 64, -64, -64, -64, -64, -64, 64, -64, -64, 64, -64, -64, -64, 64, 64, -64, -64, -64, 64, 64, -64, -64, 64, -64, 64, -64, -64, 64, 64, 64, -64, -64, 64, -64, 64, 64, -64, -64, -64, 64, -64, 64, 64, -64, 64, -64, 64, -64, -64, -64, -64, -64, -64, -64, 64, -64, 64, -64, -64, -64, 64, 64, 64, -64, -64, -64, -64, 64, 64, 64, 64, 64, -64, -64, -64, -64, -64, -64, -64, -64, -64, -64, -64, -64, -64, 64, -64, -64, 64, -64, -64, -64, -64, -64, 64, 64, 64, -64, -64, -64, -64, -64, -64, -64, -64, -64, -64, -64, -64, -64, -64, 64, -64, -64, -64, 64, 64, -64, -64, -64, 64, -64, 64, 64, 64, -64, -64, -64, -64, -64, -64, -64, -64, -64, -64, -64, -64, -64, -64, 64, 64, -64, 64, -64, -64, 64, -64, 64, 64, -64, -64, -64, -64, -64, -64, 64, -64, -64, 64, 64, 64, -64, -64, 64, -64, -64, 64, -64, -64, -64, -64, -64, 64, 64, 64, -64, -64, 64, -64, -64, -64, -64, -64, 64, 64, 64, -64, 64, -64, 64, -64, 64, -64, -64, -64, -64, -64, -64, -64, -64, 64, -64, 64, -64, 64, 64, -64, -64, -64, 64, -64, 64, 64, 64, 64, 64, 64, 64, 64, -64, -64, -64, -64, -64, -64, -64, -64, -64, 64, 64, 64, 64, -64, -64, 64, -64, -64, -64, -64, -64, -64, -64, -64, -64, -64, -64, -64, -64, -64, -64, -64, 64, 64, 64, 64, 64, 64, 64, 64, 64, -64, -64, -64, -64, 64, -64, -64, -64, -64, -64, -64, -64, -64, -64, 64, 64, -64, -64, -64, 64, 64, -64, -64, -64, 64, -64, -64, -64, -64, 64, -64, -64, -64, -64, -64, 64, 64, 64, -64, 64, -64, 64, -64, -64, -64, -64, 64, 64, 64, 64, 64, -64, 64, -64, 64, -64, 64, 64, -64, -64, 64, -64, -64, -64, 64, -64, 64, 64, 64, 64, -64, -64, 64, 64, 64, 64, 64, 64, 64, 64, -64, 64, 64, 64, 64, -64, 64, 64, -64, -64, -64, -64, -64, 64, -64, 64, -64, -64, -64, -64, -64, -64, -64, -64, -64, -64, 64, 64, -64, 64, -64, -64, -64, 64, 64, 64, 64, -64, -64, 64, -64, -64, -64, 64, -64, 64, -64, -64, -64, -64, -64, 64, -64, 64, 64, -64, -64, -64, 64, 64, -64, 64, 64, 64, 64, -64, -64, -64, -64, -64, 64, -64, -64, -64, -64, -64, -64, -64, -64, -64, -64, 64, 64, -64, 64, 64, -64, 64, 64, 64, 64, -64, 64, -64, -64, -64, -64, 64, -64, -64, -64, 64, -64, -64, -64, -64, -64, 64, -64, 64, -64, 64, -64, -64, 64, -64, 64, 64, 64, -64, 64, 64, -64, -64, 64, -64, -64, -64, -64, -64, -64, -64, -64, 64, -64, 64, 64, -64, -64, 64, -64, -64, -64, -64, 64, 64, -64, 64, 64, -64, -64, 64, 64, -64, -64, 64, -64, 64, -64, -64, -64, -64, -64, -64, -64, -64, -64, 64, -64, -64, 64, -64, 64, 64, 64, -64, 64, -64, -64, -64, -64, 64, -64, -64, -64, 64, 64, 64, -64, -64, -64, -64, -64, -64, -64, -64, -64, 64, 64, 64, 64, -64, 64, 64, -64, -64, -64, -64, -64, -64, -64, -64, -64, 64, -64, -64, -64, -64, 64, 64, -64, -64, -64, 64, 64, -64, -64, 64, -64, -64, -64, -64, -64, -64, 64, -64, -64, 64, -64, 64, 64, 64, -64, -64, 64, -64, 64, -64, -64, -64, -64, -64, -64, -64, -64, 64, 64, 64, 64, -64, 64, 64, -64, 64, -64, 64, 64, -64, -64, -64, -64, -64, -64, -64, -64, 64, -64, 64, 64, -64, -64, 64, 64, -64, -64, 64, 64, 64, -64, -64, -64, 64, 64, -64, -64, -64, -64, 64, -64, 64, 64, 64, -64, -64, 64, -64, 64, -64, 64, 64, 64, -64, -64, -64, -64, 64, 64, -64, -64, -64, 64, 64, -64, -64, 64, 64, 64, 64, 64, 64, 64, -64, -64, -64, -64, 64, -64, 64, -64, 64, -64, -64, 64, -64, 64, 64, 64, 64, 64, 64, 64, 64, 64, 64, 64, 64, -64, 64, -64, 64, -64, 64, -64, 64, -64, 64, 64, -64, 64, 64, -64, 64, -64, -64, 64, 64, 64, -64, 64, 64, 64, 64, 64, -64, 64, 64, 64, 64, 64, -64, 64, -64, 64, 64, 64, 64, -64, -64, 64, 64, 64, 64, 64, 64, 64, -64, -64, 64, 64, 64, 64, -64, 64, 64, 64, 64, -64, 64, 64, -64, 64, -64, 64, -64, -64, 64, 64, 64, 64, -64, 64, -64, -64, -64, -64, -64, -64, 64, 64, 64, 64, 64, 64, 64, 64, 64, -64, 64, 64, -64, -64, 64, -64, 64, -64, 64, -64, -64, -64, 64, -64, -64, -64, -64, -64, -64, 64, 64, 64, 64, 64, 64, 64, 64, 64, 64, -64, 64, 64, 64, 64, 64, -64, -64, -64, 64, 64, -64, -64, -64, 64, 64, 64, 64, 64, -64, 64, 64, -64, 64, 64, 64, 64, 64, -64, -64, 64, 64, 64, -64, -64, -64, -64, -64, 64, -64, -64, 64, 64, 64, 64, 64, 64, -64, -64, -64, 64, 64, 64, 64, 64, 64, 64, 64, -64, 64, 64, -64, -64, -64, -64, -64, -64, -64, -64, 64, 64, 64, -64, 64, -64, -64, -64, -64, -64, 64, 64, 64, 64, 64, 64, 64, -64, 64, -64, -64, -64, -64, -64, -64, -64, -64, 64, -64, 64, 64, 64, -64, -64, -64, -64, -64, 64, 64, 64, 64, 64, 64, 64, 64, -64, 64, -64, -64, -64, 64, 64, 64, 64, -64, -64, 64, 64, -64, -64, -64, -64, -64, -64, -64, 64, 64, 64, 64, 64, 64, 64, 64, -64, -64, -64, -64, -64, 64, 64, 64, -64, -64, 64, 64, 64, -64, -64, -64, -64, -64, -64, 64, -64, -64, 64, 64, 64, 64, -64, 64, -64, -64, 64, 64, -64, 64, 64, 64, 64, -64, 64, -64, -64, -64, -64, 64, -64, -64, -64, -64, -64, -64, 64, 64, 64, 64, 64, -64, 64, -64, 64, -64, 64, 64, 64, 64, 64, 64, -64, -64, -64, -64, -64, -64, 64, -64, 64, -64, 64, -64, 64, -64, 64, 64, 64, -64, 64, -64, -64, 64, -64, 64, 64, -64, 64, 64, 64, 64, -64, -64, -64, 64, 64, 64, 64, 64, 64, 64, -64, -64, -64, 64, -64, -64, 64, -64, 64, 64, 64, 64, 64, -64, -64, 64, -64, 64, -64, 64, 64, 64, 64, 64, -64, 64, 64, 64, 64, -64, -64, -64, 64, -64, -64, -64, -64, -64, 64, 64, 64, 64, 64, -64, 64, -64, -64, 64, 64, 64, 64, 64, 64, -64, -64, -64, -64, -64, -64, 64, 64, -64, -64, 64, 64, -64, -64, -64, 64, 64, -64, 64, 64, 64, -64, -64, 64, 64, 64, 64, 64, 64, -64, 64, -64, -64, 64, 64, -64, 64, 64, -64, -64, -64, 64, 64, 64, 64, 64, -64, 64, 64, 64, 64, -64, 64, -64, -64, -64, -64, 64, -64, 64, -64, -64, -64, -64, 64, -64, 64, 64, -64, 64, -64, 64, 64, 64, 64, 64, 64, 64, 64, 64, 64, 64, -64, -64, 64, 64, 64, 64, -64, 64, 64, 64, 64, -64, 64, 64, 64, -64, -64, 64, 64, 64, 64, 64, 64, 64, 64, 64, -64, -64, 64, 64, 64, -64, -64, -64, -64, 64, 64, -64, -64, -64, -64, 64, -64, -64, -64, -64, 64, 64, 64, 64, 64, 64, 64, 64, 64, -64, 64, 64, 64, -64, 64, -64, -64, -64, 64, -64, 64, -64, -64, 64, 64, -64, -64, -64, 64, 64, 64, 64, 64, 64, 64, 64, -64, -64, 64, 64, -64, -64, -64, -64, 64, 64, -64, -64, 64, -64, -64, -64, 64, -64, 64, -64, 64, 64, 64, -64, 64, 64, 64, -64, -64, -64, -64, -64, -64, -64, -64, -64, 64, 64, -64, -64, 64, 64, 64, 64, 64, 64, -64, -64, 64, 64, 64, 64, 64, 64, -64, -64, -64, -64, -64, -64, -64, -64, -64, 64, 64, 64, 64, 64, 64, -64, -64, -64, -64, -64, 64, -64, 64, 64, 64, 64, 64, 64, -64, -64, -64, -64, -64, 64, 64, 64, -64, 64, 64, 64, 64, 64, -64, 64, -64, -64, 64, -64, -64, 64, 64, -64, -64, 64, 64, 64, -64, -64, -64, -64, -64, 64, 64, -64, -64, 64, 64, 64, -64, 64, -64, 64, 64, 64, 64, 64, 64, -64, -64, 64, -64, 64, 64, -64, -64, 64, -64, 64, -64, 64, -64, -64, -64, -64, -64, 64, 64, -64, -64, 64, -64, -64, 64, -64, 64, 64, 64, -64, -64, -64, -64, 64, 64, 64, -64, -64, 64, 64, 64, 64, 64, -64, -64, 64, 64, -64, -64, -64, -64, 64, 64, 64, -64, -64, -64, 64, -64, 64, 64, -64, -64, 64, -64, -64, -64, -64, 64, -64, -64, -64, -64, -64, 64, -64, -64, 64, 64, 64, 64, -64, 64, -64, -64, 64, -64, 64, 64, 64, 64, -64, -64, 64, -64, -64, -64, 64, -64, 64, -64, 64, 64, -64, -64, 64, -64, 64, -64, 64, 64, -64, 64, -64, 64, 64, 64, -64, -64, 64, 64, 64, 64, -64, 64, 64, 64, 64, -64, 64, -64, 64, -64, -64, -64, -64, -64, 64, -64, -64, 64, -64, 64, -64, -64, 64, 64, -64, -64, 64, 64, -64, 64, -64, 64, -64, 64, 64, 64, 64, 64, -64, 64, 64, -64, 64, -64, 64, -64, -64, -64, -64, -64, -64, -64, -64, 64, 64, 64, 64, 64, 64, 64, 64, -64, 64, 64, -64, 64, 64, -64, -64, -64, 64, -64, -64, 64, -64, -64, -64, -64, -64, -64, -64, -64, -64, -64, -64, 64, 64, 64, -64, -64, -64, -64, 64, 64, -64, -64, -64, -64, -64, -64, -64, -64, -64, -64, -64, -64, -64, -64, -64, -64, 64, -64, -64, 64, 64, 64, 64, -64, 64, 64, 64, -64, 64, -64, 64, -64, -64, 64, 64, -64, -64, -64, 64, -64, 64, -64, -64, 64, -64, -64, 64, -64, -64, 64, 64, 64, -64, 64, 64, -64, 64, 64, 64, -64, -64, 64, -64, -64, 64, 64, 64, 64, 64, -64, 64, 64, 64, -64, -64, -64, 64, -64, 64, 64, 64, 64, -64, -64, -64, 64, -64, -64, -64, -64, -64, -64, -64, -64, 64, 64, 64, -64, -64, -64, 64, 64, 64, -64, -64, -64, -64, -64, -64, 64, 64, -64, -64, -64, 64, -64, -64, -64, 64, -64, -64, -64, -64, 64, -64, -64, -64, 64, -64, -64, 64, -64, -64, -64, -64, -64, -64, 64, 64, -64, 64, -64, 64, 64, -64, -64, -64, -64, -64, -64, -64, 64, 64, 64, 64, 64, -64, -64, -64, -64, -64, -64, -64, -64, -64, -64, -64, -64, 64, 64, 64, 64, -64, -64, -64, -64, -64, -64, 64, 64, 64, 64, -64, -64, -64, 64, -64, -64, -64, -64, -64, -64, 64, -64, 64, 64, 64, 64, -64, 64, -64, -64, -64, -64, -64, -64, 64, 64, 64, 64, -64, 64, 64, -64, -64, -64, -64, -64, -64, -64, 64, 64, -64, 64, -64, -64, 64, -64, 64, -64, -64, -64, 64, 64, 64, 64, -64, -64, -64, 64, -64, -64, -64, -64, -64, -64, -64, -64, 64, 64, 64, -64, -64, -64, 64, -64, -64, 64, -64, -64, 64, 64, 64, 64, 64, 64, 64, -64, -64, -64, -64, -64, -64, -64, -64, -64, 64, 64, 64, 64, 64, 64, -64, 64, -64, -64, -64, -64, 64, -64, -64, 64, 64, -64, 64, 64, -64, -64, -64, -64, -64, -64, -64, -64, 64, 64, 64, -64, 64, 64, -64, 64, -64, -64, -64, -64, -64, 64, 64, 64, 64, -64, -64, -64, -64, 64, -64, -64, -64, -64, -64, -64, 64, 64, 64, -64, 64, 64, 64, -64, 64, -64, -64, -64, -64, -64, 64, -64, 64, -64, -64, -64, -64, 64, 64, -64, -64, -64, -64, 64, -64, 64, -64, 64, 64, 64, 64, -64, 64, -64, -64, 64, -64, 64, 64, -64, -64, -64, -64, 64, 64, 64, -64, 64, -64, 64, 64, 64, -64, -64, -64, -64, -64, -64, -64, 64, 64, 64, 64, -64, -64, -64, -64, 64, 64, -64, 64, 64, 64, 64, -64, -64, -64, 64, 64, -64, 64, -64, 64, -64, 64, -64, -64, 64, 64, -64, 64, -64, -64, 64, 64, -64, 64, 64, 64, 64, 64, -64, 64, -64, -64, -64, 64, 64, -64, 64, -64, 64, 64, -64, -64, -64, 64, -64, -64, -64, -64, -64, -64, 64, 64, 64, 64, 64, 64, 64, -64, -64, -64, 64, 64, -64, 64, -64, 64, -64, 64, -64, 64, 64, -64, -64, -64, -64, 64, 64, -64, 64, 64, 64, 64, 64, 64, 64, 64, -64, -64, -64, -64, -64, -64, 64, -64, 64, 64, -64, -64, 64, 64, 64, 64, -64, -64, -64, -64, -64, -64, 64, 64, 64, 64, 64, 64, 64, 64, 64, -64, -64, -64, 64, 64, -64, -64, 64, 64, 64, -64, 64, -64, -64, -64, -64, -64, -64, -64, -64, 64, -64, -64, -64, -64, -64, 64, -64, -64, -64, -64, -64, -64, 64, -64, -64, 64, -64, 64, 64, 64, -64, -64, -64, -64, 64, -64, 64, -64, 64, 64, 64, -64, 64, -64, 64, -64, -64, 64, 64, 64, -64, -64, -64, 64, 64, 64, -64, 64, 64, 64, -64, 64, 64, 64, 64, -64, 64, -64, 64, 64, 64, 64, -64, 64, 64, -64, -64, -64, 64, -64, 64, 64, -64, 64, -64, -64, -64, -64, -64, -64, -64, -64, -64, -64, -64, -64, 64, -64, -64, -64, 64, 64, 64, 64, -64, 64, 64, -64, 64, 64, 64, 64, -64, -64, -64, -64, 64, -64, -64, -64, 64, -64, -64, -64, -64, 64, -64, -64, -64, -64, -64, -64, -64, -64, -64, -64, 64, -64, 64, 64, -64, -64, -64, -64, -64, -64, -64, -64, -64, -64, -64, -64, -64, 64, 64, 64, 64, 64, -64, -64, 64, -64, -64, -64, 64, -64, -64, 64, 64, -64, 64, 64, -64, 64, -64, -64, -64, -64, -64, -64, -64, -64, -64, -64, 64, 64, 64, 64, 64, -64, -64, -64, 64, -64, 64, 64, 64, 64, 64, -64, -64, -64, 64, 64, 64, -64, -64, 64, 64, -64, 64, 64, 64, -64, -64, 64, 64, 64, 64, -64, -64, 64, -64, -64, 64, -64, -64, 64, 64, 64, 64, -64, 64, -64, 64, 64, 64, 64, 64, 64, 64, -64, 64, 64, 64, 64, 64, -64, 64, 64, -64, -64, 64, -64, -64, -64, 64, -64, -64, 64, 64, 64, 64, 64, 64, 64, 64, 64, 64, 64, -64, -64, 64, -64, 64, 64, -64, 64, -64, -64, 64, -64, -64, -64, -64, 64, 64, 64, 64, 64, 64, 64, 64, 64, 64, 64, 64, -64, -64, -64, 64, 64, 64, 64, 64, 64, -64, 64, -64, -64, -64, -64, 64, -64, 64, 64, 64, 64, 64, 64, 64, 64, 64, 64, 64, 64, -64, 64, 64, 64, -64, -64, 64, 64, -64, -64, -64, 64, -64, 64, 64, -64, 64, 64, 64, 64, 64, 64, 64, 64, -64, 64, -64, -64, 64, 64, 64, 64, 64, -64, 64, -64, 64, 64, -64, -64, -64, -64, 64, 64, 64, 64, 64, 64, 64, -64, -64, -64, -64, -64, -64, -64, 64, -64, 64, -64, 64, 64, -64, -64, -64, -64, -64, -64, -64, 64, 64, 64, -64, -64, 64, 64, -64, -64, -64, 64, -64, -64, 64, 64, 64, 64, -64, -64, 64, -64, -64, 64, -64, -64, -64, 64, 64, -64, 64, 64, 64, -64, -64, -64, 64, -64, -64, -64, -64, -64, 64, -64, -64, 64, -64, -64, -64, 64, -64, -64, -64, 64, 64, -64, 64, 64, 64, 64, 64, 64, 64, 64, -64, 64, -64, 64, -64, -64, 64, -64, -64, 64, 64, -64, -64, -64, 64, 64, -64, -64, -64, 64, -64, 64, 64, 64, 64, 64, -64, 64, -64, -64, -64, -64, -64, -64, -64, -64, -64, -64, 64, -64, 64, 64, 64, 64, -64, -64, -64, -64, 64, 64, 64, 64, 64, 64, 64, 64, -64, -64, -64, -64, -64, 64, -64, -64, -64, 64, 64, 64, -64, 64, 64, 64, -64, -64, -64, -64, -64, 64, 64, 64, 64, 64, -64, 64, -64, -64, -64, -64, -64, 64, 64, -64, -64, -64, 64, -64, 64, 64, -64, -64, -64, 64, -64, -64, -64, 64, 64, 64, 64, -64, -64, 64, 64, 64, 64, -64, 64, 64, -64, 64, -64, -64, -64, -64, 64, 64, 64, -64, 64, 64, -64, -64, -64, -64, -64, -64, -64, -64, -64, 64, 64, 64, -64, -64, 64, 64, 64, 64, -64, -64, -64, -64, 64, 64, -64, -64, -64, -64, -64, -64, -64, 64, -64, -64, -64, -64, -64, -64, 64, -64, -64, 64, 64, 64, 64, 64, 64, 64, 64, 64, 64, -64, 64, -64, -64, -64, -64, -64, -64, -64, 64, -64, -64, -64, 64, 64, -64, 64, 64, 64, 64, 64, 64, 64, 64, 64, 64, 64, 64, 64, -64, -64, 64, -64, -64, -64, -64, 64, -64, 64, 64, 64, 64, 64, 64, -64, 64, 64, 64, 64, 64, 64, 64, -64, 64, 64, 64, 64, 64, 64, -64, 64, -64, -64, -64, 64, 64, 64, 64, 64, 64, 64, 64, 64, 64, 64, 64, 64, 64, 64, 64, -64, 64, -64, 64, 64, -64, 64, -64, 64, 64, -64, -64, -64, -64, -64, 64, 64, 64, 64, 64, -64, -64, 64, 64, 64, 64, 64, 64, 64, -64, 64, 64, 64, 64, 64, -64, 64, -64, -64, 64, -64, -64, -64, 64, -64, 64, 64, 64, 64, 64, 64, 64, 64, 64, -64, -64, 64, -64, -64, 64, 64, 64, 64, -64, -64, 64, 64, 64, -64, -64, -64, -64, -64, -64, 64, 64, 64, 64, -64, 64, -64, -64, -64, 64, 64, 64, 64, -64, -64, -64, -64, -64, 64, 64, 64, -64, 64, 64, -64, 64, 64, -64, -64, 64, -64, 64, -64, 64, -64, -64, -64, 64, -64, -64, -64, -64, 64, 64, 64, -64, 64, 64, -64, -64, -64, 64, 64, 64, -64, -64, 64, -64, 64, -64, 64, -64, 64, 64, -64, -64, 64, 64, -64, -64, -64, -64, -64, 64, -64, 64, -64, 64, 64, -64, 64, 64, -64, -64, -64, 64, 64, 64, -64, 64, -64, -64, 64, -64, -64, -64, 64, 64, -64, 64, -64, 64, -64, -64, -64, 64, 64, -64, 64, -64, 64, -64, -64, -64, -64, -64, -64, -64, -64, -64, -64, -64, -64, 64, -64, -64, -64, -64, -64, -64, -64, 64, -64, -64, -64, 64, 64, -64, -64, 64, 64, -64, -64, -64, -64, -64, -64, -64, -64, -64, -64, -64, 64, 64, 64, -64, -64, 64, -64, 64, -64, 64, -64, -64, -64, -64, -64, 64, 64, 64, 64, 64, 64, 64, 64, -64, 64, -64, -64, -64, -64, 64, 64, -64, -64, -64, -64, 64, 64, 64, -64, -64, -64, -64, -64, 64, 64, 64, 64, -64, 64, 64, -64, 64, -64, -64, -64, 64, -64, -64, -64, -64, 64, -64, 64, 64, -64, 64, 64, 64, -64, 64, 64, -64, -64, -64, 64, -64, 64, 64, 64, 64, -64, -64, -64, -64, -64, 64, -64, -64, -64, -64, 64, 64, 64, -64, -64, -64, 64, 64, -64, -64, -64, -64, -64, -64, 64, 64, 64, 64, 64, -64, -64, -64, -64, -64, 64, -64, 64, 64, 64, 64, 64, -64, -64, -64, 64, -64, -64, -64, -64, 64, 64, -64, -64, 64, 64, 64, 64, 64, -64, -64, -64, -64, -64, -64, 64, 64, 64, 64, -64, -64, -64, -64, -64, -64, -64, -64, -64, -64, 64, 64, 64, -64, -64, 64, -64, -64, -64, -64, -64, -64, -64, 64, 64, -64, 64, 64, 64, -64, -64, -64, -64, -64, -64, -64, -64, 64, 64, 64, 64, 64, -64, -64, -64, -64, -64, -64, 64, -64, -64, 64, 64, 64, 64, -64, -64, -64, -64, -64, -64, -64, -64, -64, -64, 64, 64, 64, 64, 64, 64, -64, -64, -64, -64, -64, 64, -64, 64, 64, 64, -64, 64, 64, -64, -64, -64, -64, -64, -64, -64, 64, 64, 64, 64, 64, 64, 64, -64, -64, -64, -64, -64, 64, 64, 64, -64, 64, -64, 64, 64, 64, 64, -64, -64, -64, -64, -64, -64, -64, 64, 64, 64, 64, 64, 64, -64, -64, -64, -64, -64, -64, -64, 64, 64, -64, -64, 64, 64, 64, -64, -64, -64, -64, -64, -64, -64, 64, 64, 64, 64, 64, 64, 64, -64, 64, 64, -64, -64, -64, -64, 64, 64, -64, 64, 64, 64, 64, -64, -64, -64, -64, -64, -64, -64, -64, 64, 64, 64, 64, 64, -64, -64, -64, -64, 64, -64, 64, 64, -64, 64, 64, -64, -64, 64, -64, -64, -64, -64, -64, -64, -64, -64, -64, 64, 64, 64, -64, -64, -64, -64, 64, -64, -64, -64, -64, 64, -64, -64, 64, -64, -64, -64, -64, -64, -64, -64, -64, 64, -64, -64, -64, -64, 64, 64, -64, -64, -64, -64, -64, -64, -64, -64, 64, 64, 64, 64, 64, 64, 64, 64, -64, 64, -64, 64, -64, -64, -64, -64, -64, 64, -64, -64, -64, -64, -64, -64, -64, -64, -64, -64, -64, 64, 64, 64, 64, 64, 64, 64, -64, -64, 64, 64, 64, -64, -64, -64, 64, -64, -64, -64, -64, -64, 64, -64, -64, -64, -64, -64, -64, 64, 64, -64, -64, 64, -64, 64, -64, -64, 64, 64, -64, -64, -64, 64, -64, -64, -64, -64, -64, -64, -64, -64, -64, 64, 64, 64, -64, 64, 64, 64, -64, -64, 64, 64, -64, -64, 64, 64, 64, -64, 64, 64, 64, 64, -64, -64, -64, -64, 64, -64, 64, 64, -64, -64, -64, -64, -64, -64, -64, 64, 64, -64, -64, 64, -64, 64, 64, 64, 64, 64, 64, -64, 64, -64, 64, -64, -64, -64, 64, 64, -64, -64, -64, -64, -64, -64, 64, -64, -64, 64, -64, 64, 64, -64, -64, 64, 64, 64, 64, -64, 64, 64, -64, 64, -64, -64, -64, -64, -64, -64, -64, 64, -64, -64, 64, -64, -64, -64, -64, 64, 64, 64, 64, 64, 64, 64, -64, -64, -64, -64, -64, -64, -64, -64, -64, -64, -64, 64, 64, 64, 64, 64, -64, 64, -64, -64, -64, 64, 64, 64, 64, 64, 64, -64, -64, -64, -64, -64, -64, -64, -64, -64, -64, 64, 64, -64, -64, -64, 64, 64, -64, 64, -64, 64, 64, 64, 64, 64, 64, -64, -64, -64, 64, -64, 64, 64, 64, 64, 64, 64, 64, -64, 64, 64, -64, -64, 64, 64, 64, 64, 64, 64, 64, 64, -64, 64, -64, 64, 64, 64, -64, 64, -64, -64, 64, 64, 64, -64, 64, 64, -64, -64, 64, 64, -64, -64, 64, -64, 64, 64, -64, 64, 64, -64, 64, -64, -64, 64, -64, -64, -64, -64, 64, 64, -64, 64, -64, 64, -64, 64, -64, 64, 64, -64, -64, -64, -64, -64, -64, 64, 64, 64, 64, -64, -64, 64, 64, 64, 64, 64, -64, -64, -64, 64, -64, -64, 64, -64, -64, 64, 64, -64, 64, -64, 64, -64, -64, 64, 64, 64, 64, 64, 64, 64, -64, 64, 64, -64, -64, -64, 64, 64, -64, -64, 64, -64, -64, -64, 64, -64, -64, -64, -64, 64, 64, -64, 64, 64, 64, -64, -64, 64, -64, 64, 64, 64, 64, -64, 64, 64, -64, -64, -64, -64, -64, 64, 64, 64, -64, 64, 64, -64, -64, 64, 64, -64, -64, 64, 64, 64, 64, 64, 64, 64, 64, -64, 64, -64, 64, -64, -64, 64, 64, 64, 64, 64, -64, -64, 64, -64, 64, 64, 64, 64, 64, -64, 64, 64, 64, 64, 64, 64, 64, 64, 64, 64, 64, 64, 64, -64, 64, 64, -64, 64, -64, -64, -64, 64, 64, 64, 64, 64, 64, 64, 64, 64, 64, 64, 64, 64, 64, 64, 64, 64, 64, 64, -64, -64, 64, 64, -64, 64, -64, -64, 64, 64, 64, 64, 64, -64, 64, 64, 64, 64, 64, 64, 64, 64, 64, 64, 64, 64, 64, -64, 64, -64, -64, 64, 64, 64, 64, 64, 64, -64, 64, 64, -64, -64, -64, 64, 64, 64, 64, -64, -64, -64, 64, 64, 64, 64, 64, 64, 64, -64, 64, -64, 64, -64, -64, 64, 64, 64, 64, 64, 64, 64, 64, -64, -64, -64, 64, -64, -64, -64, 64, 64, 64, -64, -64, 64, 64, -64, -64, -64, -64, -64, -64, 64, 64, 64, 64, 64, 64, 64, -64, 64, -64, 64, -64, -64, -64, 64, -64, -64, -64, -64, -64, -64, -64, -64, -64, -64, -64, -64, 64, 64, 64, -64, -64, 64, -64, 64, -64, -64, -64, 64, 64, -64, 64, -64, 64, 64, -64, -64, -64, 64, -64, -64, -64, 64, -64, 64, 64, -64, 64, -64, 64, 64, 64, -64, -64, -64, 64, 64, 64, -64, 64, 64, 64, 64, 64, 64, 64, -64, -64, -64, 64, -64, -64, 64, 64, -64, 64, -64, 64, 64, -64, -64, -64, 64, 64, -64, -64, -64, 64, 64, 64, 64, 64, -64, 64, 64, -64, -64, -64, 64, 64, 64, -64, -64, 64, 64, -64, -64, -64, -64, -64, 64, -64, -64, -64, -64, 64, 64, -64, -64, 64, 64, 64, 64, 64, -64, -64, 64, 64, -64, 64, 64, 64, -64, -64, -64, -64, -64, -64, 64, 64, 64, -64, -64, 64, 64, -64, -64, 64, 64, 64, 64, 64, 64, 64, -64, -64, -64, 64, -64, 64, -64, -64, 64, 64, -64, -64, -64, -64, -64, 64, -64, 64, 64, -64, -64, 64, 64, 64, 64, 64, 64, 64, 64, 64, -64, -64, -64, 64, 64, -64, -64, 64, 64, -64, -64, -64, 64, 64, 64, 64, -64, -64, 64, 64, 64, 64, 64, 64, -64, -64, 64, 64, 64, -64, -64, -64, 64, 64, 64, -64, 64, -64, -64, -64, -64, -64, -64, -64, -64, -64, -64, 64, 64, 64, 64, 64, 64, 64, 64, 64, 64, 64, -64, -64, 64, 64, 64, 64, 64, -64, -64, -64, -64, 64, -64, 64, 64, 64, 64, 64, 64, 64, 64, 64, 64, -64, 64, 64, -64, 64, -64, -64, 64, 64, 64, 64, 64, -64, 64, -64, -64, -64, 64, 64, 64, -64, 64, 64, 64, 64, -64, 64, 64, 64, 64, 64, -64, 64, -64, 64, 64, 64, 64, 64, 64, 64, 64, 64, -64, 64, 64, 64, 64, 64, -64, 64, 64, -64, -64, -64, -64, -64, 64, 64, -64, -64, -64, 64, 64, 64, 64, 64, 64, 64, 64, 64, 64, 64, -64, 64, 64, 64, 64, 64, 64, -64, -64, -64, 64, -64, 64, 64, 64, 64, 64, 64, -64, 64, 64, 64, 64, 64, 64, 64, 64, 64, 64, 64, 64, 64, 64, -64, -64, -64, -64, 64, 64, 64, -64, 64, 64, -64, -64, -64, 64, -64, 64, 64, 64, 64, 64, 64, 64, 64, 64, 64, 64, 64, -64, -64, 64, -64, -64, 64, 64, -64, 64, -64, -64, -64, 64, -64, -64, -64, -64, 64, -64, 64, 64, 64, 64, -64, 64, -64, 64, 64, 64, -64, -64, -64, -64, -64, -64, 64, -64, -64, -64, 64, -64, -64, 64, 64, 64, -64, 64, 64, 64, -64, -64, -64, 64, -64, -64, -64, 64, -64, -64, -64, -64, 64, -64, -64, 64, -64, -64, -64, 64, 64, 64, 64, 64, 64, -64, -64, 64, 64, 64, -64, -64, 64, 64, -64, -64, 64, 64, 64, -64, -64, -64, -64, 64, -64, -64, 64, 64, -64, -64, -64, 64, 64, -64, 64, 64, -64, -64, 64, -64, 64, 64, -64, 64, -64, 64, 64, 64, -64, 64, -64, 64, -64, 64, 64, 64, 64, -64, 64, -64, 64, 64, 64, -64, -64, 64, -64, 64, 64, -64, 64, -64, -64, 64, 64, -64, -64, -64, 64, 64, -64, 64, -64, 64, -64, 64, 64, 64, 64, -64, 64, -64, -64, -64, -64, 64, -64, 64, 64, 64, 64, 64, 64, 64, 64, 64, -64, -64, -64, -64, 64, 64, 64, 64, 64, 64, 64, -64, -64, 64, -64, -64, -64, -64, -64, -64, -64, 64, -64, 64, -64, -64, -64, -64, -64, 64, 64, 64, 64, -64, 64, -64, -64, -64, -64, 64, -64, -64, -64, 64, -64, 64, 64, 64, 64, 64, -64, 64, -64, 64, -64, 64, 64, 64, 64, -64, 64, 64, -64, 64, 64, 64, 64, -64, -64, 64, -64, 64, 64, -64, -64, 64, -64, 64, 64, 64, -64, -64, 64, 64, 64, 64, 64, 64, -64, 64, -64, 64, 64, -64, 64, 64, -64, 64, -64, 64, 64, 64, 64, -64, -64, -64, -64, 64, 64, 64, 64, 64, 64, 64, -64, -64, 64, -64, -64, -64, 64, -64, -64, -64, 64, -64, 64, -64, -64, 64, -64, -64, -64, -64, 64, -64, 64, 64, 64, 64, 64, 64, 64, -64, 64, 64, -64, -64, 64, -64, -64, -64, 64, 64, -64, 64, 64, 64, -64, -64, -64, -64, -64, 64, 64, 64, 64, 64, 64, 64, 64, -64, 64, -64, -64, -64, -64, 64, 64, 64, 64, 64, 64, 64, -64, 64, -64, -64, -64, 64, 64, 64, 64, 64, 64, 64, 64, 64, -64, -64, 64, -64, -64, -64, -64, -64, -64, 64, 64, 64, -64, -64, 64, 64, 64, -64, -64, 64, 64, 64, 64, -64, 64, 64, 64, 64, 64, -64, 64, -64, -64, -64, -64, -64, -64, 64, 64, 64, 64, 64, 64, 64, 64, -64, 64, -64, 64, 64, -64, 64, -64, 64, 64, 64, 64, 64, 64, -64, -64, -64, -64, -64, -64, -64, 64, 64, 64, 64, 64, 64, 64, -64, 64, 64, -64, -64, 64, -64, -64, -64, 64, 64, 64, -64, -64, -64, -64, -64, -64, -64, -64, 64, 64, 64, 64, 64, 64, 64, -64, 64, 64, 64, 64, -64, -64, -64, 64, -64, -64, 64, -64, -64, 64, -64, -64, 64, 64, -64, 64, 64, 64, 64, 64, 64, 64, 64, 64, 64, 64, 64, 64, 64, 64, 64, 64, 64, -64, 64, -64, -64, -64, 64, -64, 64, -64, -64, 64, 64, 64, 64, -64, -64, 64, 64, 64, 64, -64, -64, -64, 64, 64, 64, 64, 64, -64, -64, -64, -64, -64, -64, 64, 64, -64, -64, -64, -64, 64, 64, -64, 64, 64, 64, 64, 64, 64, 64, 64, 64, 64, 64, 64, -64, -64, -64, -64, 64, -64, -64, 64, -64, -64, -64, -64, -64, 64, -64, -64, -64, 64, 64, 64, 64, 64, 64, 64, 64, -64, 64, -64, -64, -64, -64, -64, 64, 64, 64, -64, 64, -64, -64, 64, 64, 64, -64, -64, -64, -64, 64, -64, -64, 64, 64, 64, 64, -64, -64, -64, -64, -64, -64, -64, 64, -64, -64, -64, -64, 64, -64, 64, -64, -64, -64, -64, -64, -64, 64, 64, -64, 64, 64, 64, -64, -64, -64, -64, -64, -64, -64, -64, -64, 64, 64, 64, 64, -64, 64, 64, 64, 64, -64, 64, 64, 64, -64, 64, 64, 64, -64, 64, 64, 64, -64, -64, -64, -64, -64, -64, 64, -64, -64, -64, 64, -64, -64, 64, 64, 64, -64, -64, 64, 64, 64, 64, 64, -64, -64, -64, 64, 64, -64, -64, 64, -64, -64, -64, -64, 64, -64, 64, 64, 64, -64, 64, -64, 64, 64, 64, 64, 64, 64, 64, 64, 64, 64, -64, -64, -64, 64, -64, -64, -64, -64, 64, -64, -64, 64, 64, 64, 64, 64, -64, 64, -64, 64, 64, 64, 64, 64, 64, 64, 64, 64, 64, -64, -64, -64, -64, -64, -64, 64, -64, 64, 64, -64, 64, 64, -64, -64, -64, -64, -64, -64, 64, -64, 64, 64, 64, -64, -64, 64, 64, 64, 64, 64, -64, -64, -64, -64, -64, 64, -64, 64, 64, 64, -64, -64, -64, -64, -64, 64, 64, 64, -64, -64, -64, 64, -64, 64, -64, 64, -64, 64, -64, -64, -64, 64, -64, -64, -64, -64, -64, -64, 64, -64, -64, -64, -64, -64, -64, -64, -64, -64, -64, -64, -64, -64, -64, 64, -64, -64, 64, 64, 64, -64, -64, -64, 64, -64, 64, -64, 64, 64, 64, 64, -64, 64, 64, 64, -64, -64, -64, -64, 64, 64, 64, 64, 64, -64, -64, -64, -64, -64, 64, 64, -64, -64, 64, -64, 64, -64, 64, -64, 64, 64, 64, -64, -64, 64, 64, -64, 64, -64, 64, 64, -64, -64, -64, -64, 64, 64, 64, 64, 64, -64, -64, 64, 64, 64, -64, -64, 64, -64, -64, 64, -64, 64, 64, -64, -64, -64, -64, -64, 64, -64, -64, 64, -64, 64, 64, 64, -64, -64, 64, 64, 64, 64, -64, -64, 64, -64, 64, -64, 64, -64, -64, -64, -64, 64, 64, -64, 64, -64, 64, 64, -64, 64, 64, -64, 64, -64, -64, -64, -64, -64, -64, 64, -64, -64, -64, -64, -64, 64, -64, -64, -64, -64, -64, -64, -64, -64, -64, -64, -64, 64, 64, -64, 64, -64, 64, -64, -64, -64, -64, -64, -64, -64, -64, -64, -64, 64, -64, -64, -64, 64, -64, -64, -64, -64, 64, 64, -64, -64, -64, -64, 64, 64, 64, -64, -64, 64, -64, -64, -64, 64, -64, -64, -64, -64, -64, 64, -64, -64, 64, -64, -64, -64, -64, -64, 64, -64, 64, 64, -64, -64, -64, -64, 64, -64, -64, 64, 64, -64, -64, -64, 64, 64, 64, 64, -64, 64, -64, -64, -64, -64, -64, 64, -64, -64, -64, -64, 64, 64, -64, -64, -64, 64, -64, -64, -64, -64, -64, -64, 64, 64, 64, -64, -64, 64, -64, -64, 64, -64, 64, 64, 64, 64, 64, 64, 64, -64, 64, 64, -64, 64, -64, -64, -64, -64, -64, 64, 64, 64, 64, -64, -64, 64, -64, -64, -64, 64, 64, -64, 64, 64, 64, -64, 64, 64, 64, -64, 64, -64, -64, -64, -64, 64, 64, -64, 64, 64, 64, -64, -64, -64, -64, -64, -64, 64, -64, -64, 64, 64, 64, 64, -64, 64, 64, -64, -64, -64, -64, -64, -64, -64, 64, 64, 64, 64, 64, -64, -64, -64, -64, -64, -64, -64, 64, 64, -64, 64, -64, 64, -64, -64, -64, -64, 64, -64, -64, -64, -64, -64, 64, 64, 64, -64, 64, -64, -64, -64, -64, -64, -64, -64, -64, -64, -64, 64, 64, -64, 64, 64, -64, 64, -64, 64, -64, -64, -64, -64, -64, -64, 64, 64, 64, 64, 64, -64, -64, -64, -64, -64, -64, -64, -64, -64, -64, -64, 64, -64, 64, -64, 64, -64, -64, -64, -64, 64, -64, -64, -64, 64, 64, 64, -64, -64, -64, -64, -64, -64, -64, -64, -64, -64, -64, 64, 64, 64, -64, -64, 64, 64, 64, -64, -64, 64, -64, -64, -64, 64, 64, -64, -64, -64, -64, -64, -64, -64, 64, -64, 64, -64, -64, 64, -64, 64, -64, 64, -64, 64, -64, 64, -64, 64, -64, -64, -64, 64, -64, -64, -64, -64, -64, -64, 64, 64, 64, -64, -64, 64, -64, -64, 64, 64, 64, 64, -64, -64, -64, 64, -64, 64, -64, -64, -64, 64, 64, -64, -64, -64, -64, 64, -64, -64, 64, 64, -64, 64, -64, -64, -64, -64, -64, -64, 64, 64, 64, 64, -64, -64, -64, -64, 64, 64, 64, -64, -64, -64, -64, -64, 64, 64, 64, -64, 64, -64, -64, -64, 64, 64, -64, 64, 64, 64, -64, -64, 64, -64, -64, -64, 64, 64, 64, -64, -64, -64, -64, -64, 64, -64, -64, -64, -64, -64, 64, -64, 64, 64, -64, 64, -64, 64, -64, -64, -64, -64, -64, -64, 64, 64, 64, -64, -64, -64, -64, -64, 64, -64, -64, -64, -64, -64, -64, -64, 64, 64, -64, 64, 64, 64, -64, -64, -64, -64, -64, -64, 64, 64, -64, 64, -64, -64, -64, 64, -64, -64, -64, 64, -64, -64, -64, 64, -64, -64, 64, -64, -64, 64, -64, -64, -64, 64, -64, 64, 64, 64, 64, -64, -64, 64, -64, 64, -64, -64, -64, 64, 64, -64, -64, -64, -64, 64, -64, 64, -64, -64, -64, -64, -64, -64, -64, 64, 64, 64, -64, 64, -64, 64, 64, -64, -64, -64, 64, -64, 64, -64, -64, -64, 64, -64, 64, -64, -64, 64, -64, -64, -64, -64, -64, -64, -64, 64, 64, -64, 64, -64, -64, -64, -64, -64, 64, -64, 64, -64, -64, -64, 64, -64, 64, 64, 64, -64, 64, -64, -64, -64, -64, 64, 64, 64, 64, -64, -64, 64, 64, -64, -64, -64, -64, -64, -64, -64, -64, -64, -64, 64, -64, -64, 64, 64, -64, -64, -64, 64, 64, 64, 64, -64, 64, -64, -64, -64, -64, -64, -64, -64, -64, -64, 64, -64, 64, 64, 64, -64, 64, -64, -64, -64, -64, 64, 64, -64, 64, -64, 64, -64, -64, 64, -64, -64, 64, -64, -64, -64, -64, 64, -64, 64, 64, -64, 64, 64, 64, 64, 64, 64, -64, 64, -64, 64, 64, -64, -64, -64, -64, -64, -64, -64, -64, -64, -64, -64, 64, -64, -64, 64, 64, 64, -64, -64, -64, 64, 64, 64, -64, -64, -64, 64, 64, -64, -64, -64, -64, -64, 64, 64, -64, -64, -64, 64, -64, -64, -64, 64, 64, 64, -64, 64, -64, 64, -64, 64, 64, -64, -64, -64, 64, 64, 64, -64, 64, 64, 64, -64, 64, -64, -64, 64, 64, -64, 64, -64, 64, 64, 64, -64, -64, 64, 64, -64, -64, 64, 64, 64, 64, 64, -64, -64, -64, -64, 64, -64, -64, -64, -64, -64, -64, 64, 64, 64, -64, 64, 64, -64, 64, 64, -64, 64, 64, -64, 64, 64, 64, 64, -64, -64, -64, -64, 64, 64, -64, -64, 64, 64, -64, 64, 64, 64, -64, 64, 64, -64, -64, -64, 64, 64, 64, -64, -64, 64, 64, 64, 64, -64, -64, 64, 64, 64, -64, -64, -64, 64, -64, -64, -64, -64, -64, -64, -64, 64, 64, 64, 64, 64, 64, -64, -64, 64, 64, 64, -64, 64, -64, -64, 64, -64, -64, 64, 64, 64, 64, 64, -64, 64, -64, 64, 64, -64, -64, 64, -64, 64, -64, -64, -64, 64, -64, 64, -64, -64, 64, -64, 64, 64, -64, 64, 64, -64, -64, -64, -64, 64, 64, 64, -64, -64, 64, 64, -64, 64, 64, -64, 64, 64, 64, -64, -64, -64, 64, -64, -64, -64, -64, -64, 64, 64, 64, 64, -64, -64, 64, -64, -64, -64, 64, 64, -64, 64, 64, 64, -64, -64, 64, -64, 64, -64, -64, 64, 64, 64, -64, -64, 64, 64, 64, 64, -64, -64, 64, -64, -64, -64, 64, 64, 64, 64, 64, 64, 64, 64, 64, -64, 64, -64, -64, 64, 64, 64, 64, 64, 64, 64, -64, -64, -64, -64, -64, -64, 64, 64, -64, 64, 64, 64, 64, 64, -64, -64, 64, 64, -64, -64, -64, 64, 64, 64, -64, 64, 64, -64, 64, -64, -64, -64, 64, 64, -64, -64, 64, 64, 64, 64, 64, 64, -64, 64, 64, -64, -64, -64, -64, -64, 64, 64, -64, -64, 64, 64, 64, -64, -64, -64, 64, -64, -64, -64, -64, 64, 64, 64, 64, 64, 64, 64, -64, -64, -64, -64, -64, -64, -64, -64, -64, -64, 64, 64, 64, 64, 64, 64, -64, -64, 64, -64, -64, -64, -64, 64, 64, 64, -64, 64, -64, -64, -64, -64, -64, -64, 64, 64, 64, 64, 64, 64, 64, 64, 64, 64, 64, 64, 64, 64, 64, -64, -64, -64, 64, 64, 64, -64, -64, -64, -64, -64, -64, -64, -64, 64, 64, 64, -64, -64, 64, 64, 64, 64, 64, 64, 64, 64, 64, -64, -64, 64, 64, 64, 64, -64, -64, -64, 64, -64, 64, 64, 64, 64, 64, -64, -64, -64, -64, 64, 64, 64, 64, -64, 64, -64, 64, 64, 64, -64, 64, 64, -64, 64, 64, 64, -64, 64, 64, 64, 64, -64, -64, 64, 64, 64, -64, 64, 64, 64, 64, -64, 64, -64, -64, 64, 64, 64, 64, 64, -64, 64, 64, 64, 64, 64, 64, -64, -64, -64, 64, 64, 64, 64, 64, 64, 64, 64, 64, 64, -64, -64, -64, 64, 64, 64, -64, -64, -64, -64, 64, 64, 64, 64, 64, 64, -64, -64, -64, -64, 64, 64, -64, -64, -64, 64, 64, 64, 64, -64, -64, -64, 64, -64, -64, 64, 64, 64, 64, 64, 64, 64, 64, -64, -64, -64, -64, -64, 64, 64, -64, 64, 64, -64, 64, -64, -64, -64, -64, -64, -64, -64, -64, 64, 64, 64, 64, 64, 64, 64, -64, -64, -64, -64, 64, -64, 64, 64, 64, 64, 64, -64, 64, -64, 64, -64, -64, -64, -64, -64, -64, 64, 64, 64, 64, 64, 64, 64, -64, -64, -64, -64, -64, -64, -64, 64, 64, 64, 64, 64, 64, -64, 64, 64, -64, -64, 64, 64, 64, 64, 64, 64, 64, 64, 64, -64, -64, -64, -64, -64, -64, -64, 64, 64, 64, 64, 64, -64, 64, 64, -64, -64, 64, -64, 64, 64, 64, 64, 64, 64, 64, 64, -64, -64, -64, -64, -64, -64, -64, -64, -64, 64, 64, 64, -64, -64, 64, -64, -64, 64, 64, -64, 64, 64, 64, 64, 64, 64, 64, 64, 64, -64, -64, -64, -64, -64, -64, 64, 64, 64, 64, -64, 64, -64, 64, 64, 64, -64, 64, -64, 64, 64, 64, -64, -64, -64, 64, 64, -64, -64, -64, -64, -64, 64, -64, -64, -64, 64, -64, -64, 64, 64, -64, -64, -64, -64, -64, 64, -64, 64, -64, 64, 64, 64, 64, 64, 64, 64, -64, 64, -64, -64, -64, -64, 64, -64, -64, 64, 64, 64, -64, -64, -64, -64, 64, -64, -64, 64, 64, 64, 64, 64, 64, 64, -64, 64, 64, -64, 64, 64, -64, -64, 64, 64, 64, -64, 64, 64, 64, -64, 64, 64, -64, -64, -64, -64, 64, 64, 64, -64, -64, 64, -64, 64, -64, -64, 64, -64, 64, 64, -64, 64, 64, -64, 64, -64, 64, -64, 64, 64, -64, 64, 64, 64, 64, -64, 64, -64, -64, 64, 64, 64, -64, -64, -64, 64, 64, -64, 64, -64, -64, 64, 64, 64, 64, 64, 64, -64, -64, 64, 64, 64, 64, 64, -64, 64, -64, 64, 64, 64, 64, 64, 64, -64, -64, -64, -64, -64, 64, 64, 64, -64, -64, 64, 64, 64, 64, 64, 64, -64, 64, -64, 64, 64, 64, -64, 64, 64, -64, -64, -64, 64, -64, -64, -64, -64, -64, -64, 64, 64, -64, -64, 64, 64, 64, 64, 64, 64, -64, -64, 64, 64, 64, -64, 64, 64, 64, -64, -64, -64, 64, -64, -64, -64, -64, -64, -64, -64, -64, -64, -64, 64, 64, 64, -64, -64, 64, 64, 64, 64, 64, -64, 64, -64, -64, -64, -64, -64, -64, -64, 64, -64, 64, -64, -64, -64, -64, -64, 64, 64, -64, -64, -64, 64, 64, -64, -64, -64, -64, -64, -64, -64, -64, -64, -64, -64, 64, -64, -64, -64, -64, -64, 64, -64, -64, 64, -64, -64, -64, -64, 64, -64, -64, -64, -64, -64, -64, -64, -64, 64, -64, 64, 64, 64, -64, -64, 64, 64, -64, -64, 64, 64, 64, 64, -64, 64, -64, -64, -64, 64, -64, -64, 64, -64, -64, -64, 64, -64, -64, -64, -64, -64, -64, -64, -64, -64, -64, 64, 64, -64, 64, 64, 64, 64, -64, 64, 64, -64, 64, -64, -64, 64, 64, -64, -64, -64, -64, 64, 64, -64, -64, -64, -64, -64, 64, -64, -64, -64, -64, 64, -64, -64, -64, -64, 64, 64, -64, 64, 64, -64, -64, -64, -64, -64, -64, -64, -64, -64, -64, 64, -64, -64, -64, -64, -64, 64, -64, 64, 64, 64, 64, -64, -64, -64, -64, -64, 64, 64, 64, 64, 64, -64, 64, -64, -64, -64, -64, -64, 64, 64, -64, -64, -64, -64, -64, 64, -64, 64, -64, 64, -64, -64, 64, 64, 64, -64, -64, 64, 64, -64, 64, 64, -64, 64, 64, 64, 64, -64, -64, -64, 64, 64, 64, -64, 64, 64, 64, 64, -64, -64, 64, -64, -64, -64, -64, -64, -64, -64, 64, -64, -64, 64, 64, 64, -64, -64, 64, 64, 64, 64, 64, -64, -64, 64, -64, 64, -64, 64, -64, -64, -64, -64, -64, 64, 64, 64, -64, 64, 64, 64, 64, 64, -64, 64, -64, -64, 64, -64, -64, -64, 64, -64, -64, -64, -64, -64, -64, -64, 64, -64, 64, 64, 64, -64, -64, -64, -64, -64, -64, -64, -64, -64, 64, -64, 64, -64, 64, -64, -64, 64, -64, -64, -64, -64, -64, -64, 64, 64, 64, -64, -64, 64, 64, 64, -64, -64, -64, 64, -64, -64, -64, 64, 64, -64, -64, -64, 64, 64, 64, -64, 64, -64, -64, -64, -64, -64, -64, 64, -64, 64, 64, -64, -64, -64, -64, -64, -64, -64, -64, -64, -64, -64, -64, 64, -64, -64, 64, -64, -64, -64, -64, -64, -64, -64, 64, 64, -64, 64, 64, -64, -64, -64, -64, -64, 64, -64, -64, -64, -64, -64, -64, 64, 64, 64, 64, -64, 64, -64, -64, -64, -64, 64, -64, -64, -64, 64, -64, -64, 64, 64, -64, -64, -64, -64, 64, -64, -64, 64, 64, 64, -64, -64, -64, 64, -64, 64, -64, -64, -64, -64, -64, 64, -64, 64, -64, -64, 64, -64, -64, -64, -64, -64, -64, -64, 64, 64, 64, 64, 64, 64, -64, -64, 64, -64, -64, -64, -64, -64, -64, -64, -64, -64, -64, -64, -64, 64, -64, -64, 64, 64, 64, 64, 64, 64, -64, -64, -64, 64, 64, 64, 64, -64, 64, -64, 64, -64, -64, -64, -64, -64, -64, -64, -64, -64, -64, 64, -64, -64, -64, 64, -64, -64, 64, 64, 64, 64, -64, -64, -64, -64, -64, -64, -64, -64, -64, 64, -64, 64, -64, -64, 64, -64, -64, -64, 64, -64, 64, -64, 64, 64, 64, -64, -64, 64, -64, -64, 64, 64, 64, 64, 64, -64, -64, 64, 64, -64, -64, -64, 64, 64, -64, -64, -64, -64, 64, -64, -64, 64, -64, -64, -64, 64, -64, 64, -64, 64, 64, -64, 64, -64, 64, -64, -64, -64, 64, -64, 64, -64, -64, -64, 64, 64, 64, 64, -64, 64, 64, -64, 64, -64, 64, 64, -64, 64, -64, -64, -64, -64, -64, 64, 64, -64, 64, 64, -64, -64, 64, 64, 64, 64, -64, -64, 64, 64, -64, 64, 64, -64, 64, -64, -64, -64, 64, -64, 64, -64, 64, 64, 64, 64, 64, 64, 64, -64, 64, 64, 64, 64, 64, 64, 64, 64, -64, -64, 64, 64, -64, 64, -64, 64, 64, 64, 64, -64, 64, 64, 64, -64, 64, -64, -64, 64, 64, -64, 64, 64, -64, -64, 64, 64, -64, -64, -64, -64, -64, -64, -64, -64, 64, 64, 64, 64, -64, -64, 64, -64, 64, -64, 64, -64, -64, -64, -64, -64, -64, -64, -64, -64, -64, -64, -64, -64, -64, -64, 64, 64, 64, -64, -64, -64, -64, -64, 64, -64, 64, -64, -64, 64, 64, 64, 64, 64, 64, 64, 64, -64, 64, 64, 64, -64, 64, 64, 64, -64, 64, -64, 64, -64, 64, 64, -64, 64, 64, -64, 64, 64, -64, -64, 64, 64, 64, 64, 64, 64, -64, -64, 64, -64, -64, -64, 64, -64, -64, -64, -64, 64, 64, -64, 64, 64, 64, 64, -64, 64, -64, -64, 64, 64, 64, 64, 64, -64, 64, 64, 64, -64, -64, -64, 64, -64, -64, -64, -64, 64, -64, 64, 64, 64, 64, 64, 64, 64, 64, 64, 64, -64, -64, -64, -64, 64, -64, -64, 64, -64, 64, -64, -64, 64, -64, 64, 64, 64, -64, 64, 64, 64, 64, 64, 64, 64, 64, -64, 64, -64, -64, 64, -64, 64, 64, -64, 64, -64, -64, -64, 64, 64, 64, 64, 64, 64, 64, 64, 64, 64, 64, 64, 64, 64, 64, -64, -64, -64, 64, 64, 64, 64, 64, -64, -64, 64, -64, -64, 64, 64, 64, 64, -64, 64, 64, 64, 64, 64, 64, 64, -64, -64, 64, -64, -64, -64, -64, -64, -64, -64, -64, -64, -64, 64, 64, -64, 64, 64, -64, 64, 64, 64, 64, 64, 64, -64, -64, -64, -64, -64, -64, -64, -64, -64, -64, -64, -64, -64, 64, -64, -64, 64, 64, -64, -64, -64, -64, 64, 64, 64, 64, -64, -64, -64, -64, -64, -64, -64, -64, -64, 64, -64, -64, -64, -64, -64, -64, 64, -64, -64, -64, -64, -64, 64, 64, -64, 64, -64, -64, -64, -64, -64, -64, -64, 64, -64, -64, -64, -64, -64, -64, -64, -64, -64, -64, -64, 64, 64, -64, -64, 64, -64, -64, -64, -64, -64, -64, -64, -64, 64, -64, 64, 64, 64, -64, 64, -64, 64, -64, 64, -64, -64, -64, -64, 64, -64, -64, -64, 64, 64, -64, -64, -64, -64, -64, 64, -64, 64, 64, 64, 64, 64, 64, 64, -64, 64, 64, 64, 64, 64, -64, 64, 64, 64, -64, 64, 64, -64, -64, -64, -64, -64, -64, -64, -64, 64, 64, 64, 64, 64, 64, 64, 64, 64, 64, 64, -64, -64, -64, 64, -64, 64, -64, 64, -64, -64, 64, 64, -64, 64, 64, 64, 64, 64, 64, 64, 64, 64, 64, 64, 64, 64, 64, -64, 64, -64, 64, -64, 64, -64, 64, 64, -64, -64, -64, -64, 64, 64, 64, 64, 64, 64, 64, 64, 64, 64, 64, 64, 64, 64, 64, -64, 64, 64, 64, 64, 64, 64, 64, 64, 64, -64, 64, 64, 64, 64, 64, 64, 64, 64, -64, -64, -64, 64, 64, -64, 64, 64, 64, -64, -64, 64, 64, 64, -64, 64, 64, -64, 64, 64, 64, 64, 64, 64, 64, 64, -64, 64, -64, -64, -64, -64, 64, 64, 64, 64, -64, 64, 64, -64, -64, -64, -64, -64, -64, 64, -64, -64, -64, -64, 64, 64, -64, 64, 64, -64, -64, 64, -64, 64, 64, 64, 64, 64, -64, -64, -64, -64, 64, 64, -64, 64, -64, -64, -64, -64, -64, -64, -64, -64, 64, 64, 64, -64, -64, 64, -64, 64, -64, 64, 64, -64, -64, 64, -64, -64, 64, -64, 64, -64, 64, -64, -64, -64, -64, -64, 64, -64, -64, -64, -64, 64, 64, 64, 64, 64, -64, -64, -64, -64, -64, 64, 64, 64, 64, 64, -64, 64, -64, -64, -64, -64, -64, -64, 64, -64, 64, 64, 64, 64, 64, 64, 64, 64, -64, 64, 64, 64, 64, 64, -64, -64, -64, -64, -64, 64, -64, -64, 64, 64, 64, 64, 64, -64, 64, 64, -64, 64, -64, 64, 64, -64, -64, -64, -64, -64, 64, 64, 64, -64, -64, 64, -64, 64, 64, -64, -64, 64, 64, 64, 64, 64, -64, -64, 64, 64, 64, 64, 64, -64, 64, 64, 64, -64, 64, 64, 64, 64, 64, 64, -64, -64, -64, -64, 64, 64, 64, 64, 64, 64, 64, -64, -64, -64, 64, -64, -64, 64, -64, -64, -64, 64, 64, 64, 64, 64, -64, -64, -64, 64, -64, -64, 64, 64, 64, -64, -64, -64, -64, -64, 64, 64, 64, 64, 64, 64, 64, -64, -64, -64, 64, 64, 64, -64, -64, 64, 64, -64, 64, -64, -64, -64, 64, 64, 64, 64, -64, -64, 64, 64, -64, -64, 64, 64, -64, 64, 64, 64, -64, 64, -64, 64, 64, 64, 64, -64, 64, -64, -64, 64, -64, -64, -64, 64, -64, -64, -64, -64, 64, 64, -64, 64, -64, -64, 64, 64, -64, -64, 64, 64, 64, -64, 64, 64, -64, -64, -64, 64, 64, 64, -64, -64, 64, -64, 64, 64, -64, -64, 64, -64, 64, 64, -64, 64, -64, 64, 64, 64, 64, 64, 64, 64, 64, -64, 64, -64, 64, -64, -64, -64, -64, -64, -64, -64, -64, 64, 64, 64, 64, 64, -64, -64, 64, -64, 64, -64, 64, 64, 64, -64, -64, 64, -64, 64, -64, 64, -64, -64, -64, -64, -64, 64, -64, -64, -64, -64, -64, -64, 64, -64, -64, 64, 64, 64, 64, -64, -64, -64, 64, 64, 64, -64, -64, -64, 64, 64, 64, 64, 64, -64, 64, 64, 64, 64, -64, -64, -64, 64, 64, 64, 64, 64, 64, -64, 64, -64, 64, 64, -64, 64, -64, -64, 64, 64, 64, 64, 64, -64, -64, 64, -64, 64, -64, 64, -64, 64, 64, 64, 64, 64, 64, -64, -64, -64, 64, -64, -64, -64, -64, -64, 64, -64, -64, -64, -64, -64, 64, -64, -64, -64, -64, -64, -64, 64, 64, 64, 64, -64, -64, 64, -64, -64, 64, -64, -64, 64, 64, 64, 64, 64, -64, -64, -64, -64, 64, -64, -64, -64, -64, -64, -64, -64, 64, 64, 64, 64, -64, 64, -64, -64, -64, -64, 64, 64, 64, -64, -64, 64, -64, -64, 64, 64, -64, 64, -64, 64, -64, -64, -64, -64, 64, 64, 64, 64, 64, -64, 64, 64, 64, -64, 64, 64, 64, 64, -64, -64, 64, 64, 64, 64, 64, 64, 64, -64, -64, -64, -64, -64, -64, -64, 64, 64, 64, -64, -64, -64, 64, 64, 64, -64, 64, 64, 64, 64, 64, 64, 64, 64, 64, 64, 64, -64, -64, -64, -64, -64, -64, -64, 64, -64, -64, 64, 64, -64, 64, 64, 64, 64, 64, 64, 64, 64, 64, 64, 64, 64, 64, 64, -64, -64, -64, -64, -64, -64, -64, -64, 64, -64, -64, 64, -64, -64, 64, -64, -64, -64, -64, 64, 64, 64, 64, 64, 64, 64, -64, 64, 64, -64, -64, -64, 64, -64, -64, -64, 64, -64, -64, -64, -64, -64, 64, 64, -64, 64, 64, 64, -64, 64, 64, 64, 64, 64, 64, -64, -64, -64, -64, 64, 64, -64, -64, -64, 64, -64, 64, -64, -64, 64, -64, 64, -64, 64, 64, -64, 64, -64, -64, 64, 64, -64, -64, 64, 64, -64, 64, 64, 64, 64, -64, 64, -64, -64, -64, 64, 64, 64, 64, -64, -64, 64, 64, 64, 64, 64, 64, 64, 64, -64, -64, -64, -64, 64, -64, 64, 64, -64, -64, -64, 64, 64, -64, 64, 64, 64, -64, -64, 64, 64, -64, 64, 64, 64, 64, 64, -64, -64, -64, 64, 64, 64, -64, 64, 64, 64, 64, 64, 64, 64, -64, -64, 64, -64, -64, -64, -64, 64, 64, 64, 64, 64, -64, -64, -64, -64, 64, 64, 64, 64, -64, 64, 64, 64, 64, -64, -64, -64, 64, -64, -64, 64, -64, -64, 64, -64, -64, 64, 64, 64, -64, -64, -64, 64, 64, 64, 64, 64, 64, 64, 64, 64, 64, -64, -64, -64, -64, -64, 64, -64, -64, -64, -64, -64, -64, 64, -64, -64, -64, -64, -64, 64, 64, 64, 64, 64, 64, -64, 64, 64, 64, 64, -64, -64, 64, -64, 64, 64, -64, -64, -64, -64, -64, 64, 64, -64, -64, -64, 64, 64, 64, 64, 64, 64, 64, 64, -64, -64, 64, 64, -64, -64, -64, -64, 64, 64, -64, -64, -64, -64, -64, -64, -64, -64, -64, 64, 64, 64, -64, 64, 64, 64, -64, 64, -64, -64, -64, -64, -64, -64, 64, 64, 64, 64, 64, -64, -64, -64, -64, -64, -64, -64, -64, -64, 64, 64, 64, 64, 64, -64, -64, 64, 64, 64, 64, -64, -64, 64, 64, 64, -64, -64, 64, -64, 64, 64, -64, -64, 64, -64, 64, 64, 64, 64, 64, 64, 64, -64, 64, -64, 64, 64, -64, -64, -64, -64, 64, -64, 64, 64, -64, -64, -64, 64, -64, 64, -64, -64, -64, -64, 64, 64, 64, 64, 64, 64, 64, 64, 64, 64, -64, -64, -64, 64, 64, -64, 64, -64, -64, -64, -64, -64, -64, 64, -64, -64, -64, -64, 64, 64, -64, -64, 64, -64, 64, 64, 64, 64, -64, -64, -64, -64, 64, 64, 64, -64, 64, -64, -64, -64, -64, 64, 64, 64, 64, 64, 64, -64, -64, -64, -64, 64, 64, 64, 64, -64, -64, 64, 64, 64, -64, 64, -64, 64, 64, 64, 64, 64, -64, 64, -64, 64, -64, -64, 64, 64, -64, 64, 64, -64, 64, 64, 64, -64, -64, -64, 64, 64, 64, 64, -64, 64, 64, -64, 64, -64, 64, 64, 64, 64, -64, 64, 64, 64, 64, 64, -64, 64, 64, -64, -64, -64, 64, 64, -64, 64, 64, -64, 64, -64, 64, -64, 64, -64, -64, 64, 64, -64, -64, 64, -64, -64, 64, 64, -64, 64, -64, -64, -64, -64, 64, 64, 64, 64, 64, 64, -64, 64, 64, 64, 64, -64, -64, 64, -64, -64, -64, -64, -64, -64, -64, 64, -64, -64, -64, -64, 64, 64, -64, 64, 64, -64, 64, 64, -64, 64, 64, 64, 64, -64, -64, 64, -64, -64, -64, 64, -64, -64, 64, 64, 64, 64, -64, 64, 64, -64, -64, -64, 64, 64, 64, -64, -64, 64, -64, -64, -64, -64, 64, 64, -64, 64, -64, 64, -64, -64, -64, 64, -64, 64, -64, -64, 64, -64, 64, 64, 64, 64, 64, -64, -64, -64, -64, 64, 64, -64, 64, -64, 64, -64, 64, -64, -64, -64, -64, 64, 64, 64, -64, -64, 64, 64, 64, 64, 64, 64, 64, 64, -64, 64, 64, 64, 64, 64, 64, 64, 64, 64, 64, 64, 64, -64, 64, -64, 64, 64, -64, 64, 64, 64, 64, 64, 64, -64, 64, 64, 64, -64, 64, -64, 64, 64, 64, 64, 64, -64, 64, 64, 64, 64, -64, 64, -64, -64, -64, -64, 64, 64, 64, 64, 64, 64, 64, 64, 64, -64, -64, -64, 64, 64, 64, 64, 64, 64, -64, -64, -64, -64, -64, 64, 64, -64, 64, 64, 64, 64, 64, 64, 64, 64, 64, -64, 64, -64, 64, 64, 64, -64, 64, 64, 64, 64, -64, 64, 64, -64, -64, -64, 64, -64, -64, 64, 64, 64, 64, 64, 64, 64, -64, 64, -64, -64, -64, 64, 64, 64, 64, -64, -64, -64, 64, 64, 64, -64, -64, -64, -64, 64, -64, 64, 64, 64, 64, 64, 64, -64, -64, 64, -64, -64, 64, 64, 64, 64, -64, -64, -64, 64, 64, 64, 64, 64, -64, -64, 64, 64, 64, 64, 64, 64, 64, 64, 64, -64, -64, -64, 64, 64, -64, 64, -64, -64, -64, 64, 64, 64, 64, 64, 64, -64, 64, -64, 64, 64, 64, 64, 64, 64, 64, 64, -64, -64, -64, -64, 64, -64, 64, 64, 64, 64, 64, 64, 64, 64, 64, 64, 64, -64, -64, 64, 64, 64, 64, 64, 64, 64, 64, -64, -64, -64, -64, -64, 64, -64, 64, -64, 64, 64, 64, 64, 64, 64, 64, -64, 64, -64, -64, -64, -64, 64, 64, 64, 64, -64, -64, -64, -64, -64, -64, -64, 64, -64, 64, -64, -64, -64, 64, 64, 64, 64, -64, -64, -64, -64, -64, 64, 64, 64, 64, 64, -64, -64, -64, 64, -64, -64, -64, 64, 64, -64, 64, -64, 64, 64, -64, 64, -64, -64, -64, -64, 64, 64, -64, 64, 64, 64, 64, 64, -64, -64, -64, -64, -64, -64, -64, -64, -64, 64, 64, 64, 64, 64, 64, -64, -64, -64, 64, 64, -64, -64, -64, -64, 64, 64, 64, 64, 64, -64, -64, -64, -64, -64, 64, 64, 64, -64, -64, -64, -64, 64, -64, 64, -64, -64, -64, -64, -64, -64, 64, 64, 64, 64, 64, 64, 64, -64, -64, 64, -64, -64, -64, -64, 64, 64, 64, -64, 64, 64, 64, 64, 64, 64, 64, -64, -64, -64, 64, 64, 64, 64, 64, 64, 64, 64, 64, -64, -64, 64, -64, -64, -64, -64, 64, -64, 64, 64, 64, 64, 64, 64, 64, -64, -64, 64, -64, 64, 64, 64, 64, -64, 64, 64, 64, -64, -64, -64, -64, -64, 64, 64, 64, -64, -64, 64, 64, 64, 64, 64, -64, -64, -64, 64, 64, -64, 64, -64, -64, -64, -64, 64, -64, -64, -64, -64, -64, 64, -64, -64, 64, 64, 64, 64, 64, 64, 64, 64, -64, -64, 64, 64, 64, -64, 64, -64, 64, 64, -64, -64, -64, -64, -64, -64, -64, 64, 64, 64, 64, -64, -64, 64, -64, 64, 64, 64, 64, -64, -64, 64, 64, 64, 64, -64, 64, 64, 64, -64, -64, 64, -64, 64, 64, 64, 64, -64, -64, 64, -64, 64, 64, 64, -64, -64, 64, 64, 64, 64, 64, 64, 64, -64, -64, 64, -64, 64, -64, 64, 64, -64, -64, -64, 64, -64, 64, -64, -64, -64, 64, -64, -64, -64, 64, -64, -64, 64, 64, 64, 64, -64, 64, 64, 64, 64, 64, -64, -64, 64, 64, -64, -64, 64, 64, -64, -64, 64, 64, -64, -64, -64, 64, 64, -64, -64, -64, -64, 64, -64, 64, 64, 64, 64, 64, 64, -64, -64, -64, 64, -64, 64, 64, -64, -64, -64, -64, 64, 64, 64, -64, -64, 64, 64, 64, 64, 64, -64, 64, 64, -64, 64, -64, -64, -64, -64, 64, 64, 64, -64, -64, -64, 64, 64, 64, -64, -64, -64, 64, -64, -64, -64, 64, 64, -64, 64, -64, -64, 64, 64, -64, 64, -64, -64, -64, 64, 64, 64, 64, -64, 64, -64, 64, -64, 64, -64, 64, 64, -64, -64, -64, -64, 64, 64, 64, -64, -64, 64, 64, 64, 64, 64, -64, -64, -64, -64, 64, -64, 64, 64, 64, 64, -64, -64, 64, 64, 64, 64, 64, 64, 64, 64, 64, 64, 64, 64, -64, -64, -64, -64, 64, 64, -64, -64, -64, 64, -64, 64, 64, 64, 64, 64, -64, 64, 64, 64, 64, 64, 64, 64, 64, -64, 64, 64, 64, -64, 64, 64, 64, -64, -64, -64, -64, -64, -64, -64, -64, -64, -64, -64, 64, 64, 64, -64, -64, -64, -64, -64, 64, 64, 64, 64, 64, 64, 64, 64, 64, 64, 64, 64, -64, 64, 64, -64, 64, -64, 64, -64, -64, -64, 64, 64, -64, -64, -64, 64, 64, 64, -64, -64, 64, 64, 64, 64, 64, 64, 64, -64, 64, -64, -64, -64, -64, 64, 64, -64, -64, -64, -64, 64, -64, -64, 64, -64, 64, -64, 64, -64, 64, -64, 64, 64, -64, 64, 64, -64, -64, -64, -64, -64, -64, -64, -64, -64, -64, -64, -64, -64, 64, 64, 64, 64, 64, -64, -64, 64, -64, -64, 64, 64, 64, -64, 64, 64, 64, 64, -64, 64, -64, 64, -64, -64, -64, -64, -64, -64, 64, -64, -64, 64, -64, -64, 64, -64, -64, 64, 64, 64, 64, 64, -64, 64, 64, 64, 64, 64, -64, -64, 64, -64, -64, 64, 64, 64, 64, -64, -64, -64, -64, 64, -64, -64, 64, 64, 64, 64, 64, -64, -64, 64, -64, 64, 64, -64, -64, -64, 64, 64, 64, 64, 64, -64, 64, 64, 64, 64, -64, -64, 64, -64, 64, 64, 64, 64, 64, -64, 64, 64, 64, -64, -64, 64, -64, 64, 64, 64, 64, 64, -64, 64, 64, 64, -64, 64, -64, -64, 64, 64, 64, 64, 64, 64, 64, 64, -64, 64, 64, 64, -64, -64, 64, 64, 64, 64, 64, 64, 64, 64, 64, 64, 64, -64, -64, -64, -64, 64, 64, 64, 64, 64, -64, 64, -64, 64, 64, 64, 64, -64, -64, 64, -64, 64, 64, 64, 64, 64, 64, 64, -64, 64, 64, -64, 64, 64, 64, 64, -64, 64, -64, -64, 64, 64, 64, 64, 64, -64, -64, 64, 64, 64, 64, 64, 64, 64, 64, -64, 64, -64, -64, -64, 64, 64, 64, -64, -64, -64, 64, 64, 64, -64, -64, 64, -64, 64, 64, 64, 64, 64, 64, 64, -64, 64, 64, 64, -64, 64, 64, 64, 64, 64, 64, 64, 64, 64, -64, 64, 64, 64, 64, -64, -64, 64, 64, 64, -64, 64, 64, 64, -64, -64, -64, 64, 64, 64, -64, -64, 64, 64, 64, 64, 64, -64, -64, 64, -64, 64, 64, 64, -64, -64, -64, -64, -64, 64, -64, -64, -64, -64, 64, 64, 64, 64, 64, 64, -64, 64, 64, 64, -64, -64, -64, 64, 64, -64, -64, 64, 64, 64, 64, 64, -64, -64, -64, -64, -64, -64, 64, 64, 64, 64, 64, 64, 64, 64, 64, 64, 64, 64, 64, -64, -64, 64, 64, 64, 64, 64, 64, 64, 64, -64, -64, 64, 64, -64, 64, 64, 64, 64, 64, 64, 64, 64, 64, 64, -64, 64, -64, -64, 64, 64, -64, 64, 64, -64, -64, 64, 64, 64, 64, -64, 64, 64, 64, 64, 64, 64, 64, 64, 64, -64, -64, -64, -64, -64, -64, 64, 64, 64, -64, 64, -64, -64, -64, -64, 64, 64, 64, 64, -64, 64, 64, 64, 64, -64, 64, -64, -64, -64, -64, -64, -64, 64, -64, -64, 64, 64, -64, -64, -64, -64, 64, 64, 64, 64, -64, -64, 64, 64, -64, -64, -64, -64, -64, -64, -64, -64, -64, -64, -64, -64, -64, -64, -64, -64, 64, -64, 64, 64, 64, -64, 64, -64, 64, -64, -64, -64, -64, -64, -64, -64, -64, -64, -64, -64, -64, -64, 64, -64, 64, 64, -64, 64, 64, 64, 64, 64, 64, 64, 64, 64, 64, 64, 64, -64, 64, -64, -64, -64, -64, -64, -64, -64, -64, -64, 64, 64, 64, 64, -64, -64, -64, -64, 64, -64, 64, -64, 64, 64, 64, 64, 64, 64, -64, -64, -64, -64, 64, -64, 64, -64, -64, 64, -64, -64, -64, -64, 64, -64, -64, 64, -64, 64, -64, -64, -64, 64, -64, 64, 64, 64, 64, 64, -64, 64, 64, 64, 64, 64, -64, -64, -64, 64, 64, 64, -64, 64, 64, 64, -64, -64, 64, -64, 64, -64, -64, 64, -64, 64, -64, -64, -64, 64, 64, 64, 64, 64, 64, 64, -64, 64, 64, 64, -64, 64, -64, 64, 64, -64, -64, 64, -64, 64, -64, -64, 64, 64, -64, -64, 64, -64, -64, -64, 64, -64, 64, -64, -64, -64, -64, -64, 64, 64, -64, -64, 64, -64, 64, 64, -64, 64, 64, 64, 64, 64, 64, -64, 64, -64, -64, 64, -64, 64, -64, 64, 64, -64, 64, 64, 64, -64, -64, -64, 64, 64, -64, 64, -64, 64, -64, 64, 64, -64, 64, 64, 64, -64, -64, 64, -64, 64, 64, -64, -64, 64, 64, 64, -64, 64, 64, -64, -64, -64, 64, -64, -64, -64, -64, -64, 64, -64, -64, 64, -64, 64, -64, -64, -64, -64, 64, -64, -64, 64, 64, 64, -64, -64, 64, 64, -64, -64, -64, -64, -64, -64, 64, 64, -64, 64, -64, -64, -64, 64, -64, -64, -64, 64, -64, 64, 64, 64, 64, 64, -64, 64, -64, 64, 64, 64, 64, -64, 64, -64, -64, 64, -64, -64, 64, 64, 64, -64, 64, 64, 64, 64, 64, -64, 64, -64, -64, -64, 64, -64, 64, 64, -64, 64, 64, -64, 64, 64, 64, -64, -64, 64, 64, 64, 64, 64, 64, 64, 64, -64, 64, 64, 64, 64, -64, -64, -64, -64, -64, 64, 64, -64, 64, 64, 64, -64, -64, 64, 64, -64, 64, 64, 64, 64, 64, 64, -64, 64, 64, 64, 64, 64, 64, -64, 64, -64, 64, -64, 64, 64, -64, -64, 64, 64, 64, 64, 64, -64, -64, 64, -64, 64, 64, 64, 64, -64, -64, 64, -64, 64, -64, 64, -64, 64, 64, 64, -64, 64, -64, 64, 64, 64, 64, 64, 64, 64, 64, -64, 64, 64, 64, -64, -64, 64, 64, -64, -64, -64, -64, -64, -64, -64, 64, 64, 64, -64, -64, 64, 64, 64, 64, -64, 64, 64, 64, 64, 64, -64, 64, 64, -64, -64, 64, -64, -64, 64, 64, 64, 64, 64, 64, -64, 64, 64, -64, 64, -64, 64, 64, 64, 64, 64, 64, 64, 64, -64, 64, -64, 64, -64, -64, 64, 64, 64, -64, -64, -64, 64, -64, -64, 64, 64, -64, -64, 64, 64, -64, 64, -64, 64, 64, 64, 64, 64, 64, -64, -64, -64, 64, -64, 64, -64, 64, -64, 64, -64, 64, 64, -64, 64, 64, -64, 64, 64, -64, -64, 64, -64, 64, 64, -64, 64, 64, -64, -64, 64, 64, 64, -64, 64, 64, -64, 64, -64, 64, 64, 64, 64, -64, 64, 64, 64, 64, 64, 64, 64, -64, 64, -64, 64, 64, -64, 64, 64, 64, -64, 64, 64, 64, -64, -64, -64, 64, -64, -64, -64, -64, -64, -64, 64, -64, 64, 64, -64, 64, 64, 64, -64, -64, 64, 64, 64, 64, 64, 64, 64, -64, 64, 64, 64, -64, -64, -64, -64, -64, -64, 64, 64, -64, 64, 64, 64, 64, 64, 64, 64, -64, 64, 64, -64, 64, 64, -64, -64, 64, -64, 64, 64, -64, -64, -64, -64, 64, -64, -64, 64, 64, 64, 64, 64, -64, 64, 64, 64, 64, 64, -64, -64, 64, 64, -64, -64, -64, 64, -64, -64, -64, 64, 64, 64, 64, 64, 64, -64, 64, 64, 64, 64, 64, 64, 64, 64, 64, -64, -64, 64, -64, 64, -64, 64, -64, -64, 64, 64, 64, -64, 64, 64, 64, 64, 64, 64, 64, 64, -64, 64, 64, 64, 64, 64, 64, 64, 64, 64, -64, 64, -64, -64, -64, 64, -64, -64, 64, 64, -64, 64, 64, 64, 64, 64, -64, 64, 64, 64, 64, 64, 64, 64, 64, 64, 64, -64, 64, -64, 64, 64, 64, -64, 64, 64, -64, 64, -64, -64, 64, -64, -64, 64, 64, 64, -64, -64, 64, 64, 64, 64, -64, 64, 64, -64, 64, 64, 64, -64, -64, -64, -64, 64, -64, -64, 64, -64, 64, 64, 64, -64, 64, 64, 64, -64, 64, 64, -64, 64, -64, 64, 64, -64, 64, 64, 64, 64, 64, 64, 64, 64, 64, 64, 64, 64, 64, 64, 64, -64, -64, 64, 64, -64, 64, 64, 64, 64, 64, -64, 64, -64, -64, 64, 64, 64, -64, 64, -64, 64, 64, -64, -64, 64, -64, 64, 64, 64, 64, 64, 64, 64, -64, 64, 64, 64, 64, 64, 64, 64, -64, -64, -64, -64, 64, -64, 64, 64, 64, -64, 64, -64, -64, 64, 64, -64, -64, 64, 64, 64, -64, 64, -64, 64, -64, 64, 64, 64, -64, 64, -64, 64, 64, -64, 64, 64, 64, 64, -64, 64, -64, 64, -64, 64, 64, 64, -64, 64, 64, 64, 64, -64, -64, -64, -64, -64, -64, -64, -64, 64, -64, -64, 64, 64, -64, 64, -64, -64, 64, -64, 64, 64, 64, -64, -64, 64, -64, 64, -64, -64, -64, 64, 64, 64, -64, -64, -64, 64, -64, 64, -64, -64, 64, 64, 64, 64, -64, -64, 64, 64, -64, -64, -64, 64, 64, -64, -64, 64, 64, -64, 64, 64, -64, -64, 64, 64, -64, -64, -64, 64, 64, -64, 64, -64, -64, 64, -64, -64, 64, 64, -64, 64, 64, -64, 64, -64, 64, -64, 64, 64, 64, 64, -64, -64, 64, -64, -64, 64, 64, 64, -64, -64, 64, 64, -64, -64, -64, 64, 64, -64, 64, 64, -64, 64, -64, 64, -64, 64, 64, -64, 64, -64, -64, -64, 64, 64, 64, 64, -64, 64, -64, 64, -64, -64, -64, -64, -64, -64, -64, 64, 64, 64, 64, 64, 64, -64, 64, 64, -64, -64, -64, 64, -64, 64, 64, -64, 64, -64, -64, -64, -64, -64, -64, -64, -64, -64, -64, -64, 64, 64, -64, 64, 64, 64, 64, 64, -64, 64, -64, 64, 64, 64, 64, -64, 64, -64, -64, -64, -64, -64, -64, -64, -64, -64, -64, -64, -64, -64, -64, -64, 64, 64, 64, 64, 64, -64, 64, 64, 64, -64, 64, 64, 64, -64, -64, -64, -64, -64, 64, 64, -64, -64, -64, 64, 64, -64, 64, -64, 64, 64, 64, 64, -64, -64, 64, -64, -64, 64, -64, 64, -64, -64, -64, -64, -64, -64, 64, 64, 64, 64, 64, 64, 64, 64, 64, 64, 64, -64, 64, -64, -64, -64, -64, -64, 64, 64, -64, 64, -64, -64, -64, -64, 64, 64, 64, 64, 64, 64, 64, 64, 64, -64, -64, 64, 64, 64, 64, -64, -64, -64, -64, 64, -64, 64, 64, -64, -64, -64, -64, 64, 64, 64, 64, 64, -64, 64, 64, 64, 64, -64, -64, -64, -64, -64, -64, 64, -64, -64, -64, -64, -64, -64, 64, -64, -64, 64, -64, 64, 64, 64, 64, -64, -64, -64, -64, 64, -64, -64, 64, -64, -64, 64, 64, -64, -64, 64, 64, -64, 64, 64, -64, 64, 64, 64, 64, 64, 64, 64, 64, 64, -64, -64, -64, -64, -64, -64, 64, 64, 64, 64, 64, 64, 64, -64, -64, 64, -64, -64, 64, -64, -64, 64, 64, 64, 64, 64, -64, 64, -64, -64, -64, -64, -64, -64, 64, 64, 64, 64, 64, 64, 64, -64, 64, -64, -64, -64, -64, -64, 64, 64, 64, 64, 64, 64, 64, 64, -64, -64, -64, -64, -64, 64, 64, 64, 64, -64, 64, 64, 64, 64, 64, 64, 64, -64, -64, -64, 64, 64, 64, 64, 64, 64, 64, 64, 64, 64, -64, 64, 64, 64, 64, 64, 64, 64, 64, 64, 64, -64, 64, 64, -64, -64, -64, 64, 64, 64, 64, 64, 64, 64, 64, 64, 64, -64, -64, 64, -64, 64, 64, 64, -64, 64, 64, -64, -64, -64, -64, -64, 64, -64, -64, -64, -64, 64, 64, 64, 64, 64, 64, 64, 64, 64, 64, 64, -64, 64, 64, 64, 64, -64, 64, -64, -64, -64, 64, -64, -64, 64, -64, -64, -64, -64, 64, 64, 64, 64, 64, 64, 64, -64, 64, -64, -64, -64, 64, 64, 64, -64, -64, -64, 64, 64, -64, 64, 64, 64, -64, -64, -64, -64, -64, 64, 64, 64, 64, 64, 64, 64, 64, -64, -64, -64, -64, 64, 64, -64, -64, 64, 64, 64, 64, -64, 64, 64, -64, 64, -64, -64, -64, -64, -64, 64, -64, 64, 64, -64, -64, -64, -64, -64, -64, -64, -64, -64, -64, -64, -64, 64, -64, -64, -64, 64, -64, -64, -64, -64, -64, -64, -64, -64, -64, -64, -64, 64, 64, -64, -64, -64, -64, -64, -64, -64, -64, 64, 64, -64, 64, -64, 64, -64, 64, -64, -64, 64, -64, -64, -64, 64, -64, -64, -64, -64, -64, -64, -64, -64, -64, -64, -64, -64, 64, -64, 64, -64, 64, -64, 64, -64, 64, 64, 64, 64, -64, -64, 64, -64, -64, -64, -64, -64, -64, -64, -64, 64, -64, -64, -64, 64, -64, -64, -64, -64, 64, -64, 64, 64, -64, -64, 64, 64, 64, -64, 64, 64, -64, -64, -64, -64, -64, 64, 64, 64, 64, -64, 64, 64, 64, -64, -64, -64, 64, 64, -64, -64, -64, 64, 64, 64, 64, -64, -64, -64, 64, 64, 64, 64, 64, 64, 64, 64, 64, 64, 64, 64, 64, -64, -64, 64, -64, 64, -64, -64, -64, 64, -64, 64, 64, -64, -64, 64, 64, 64, 64, 64, 64, 64, 64, 64, 64, -64, -64, 64, 64, -64, 64, -64, -64, 64, -64, -64, -64, 64, 64, -64, -64, -64, 64, 64, 64, 64, -64, 64, 64, 64, 64, 64, 64, 64, 64, -64, -64, -64, 64, -64, 64, 64, 64, -64, 64, 64, -64, 64, 64, -64, -64, -64, -64, 64, 64, -64, 64, 64, -64, -64, -64, 64, 64, 64, -64, -64, -64, 64, -64, -64, -64, -64, 64, -64, 64, 64, 64, -64, 64, 64, 64, -64, 64, -64, -64, 64, -64, 64, -64, -64, -64, -64, -64, -64, -64, 64, -64, 64, 64, -64, 64, -64, 64, 64, -64, -64, -64, 64, 64, 64, 64, 64, 64, 64, 64, -64, 64, 64, -64, -64, 64, 64, -64, -64, -64, 64, -64, -64, -64, -64, 64, 64, 64, -64, 64, 64, 64, 64, 64, -64, 64, 64, -64, -64, 64, 64, -64, -64, 64, 64, 64, -64, 64, -64, -64, -64, -64, -64, 64, 64, 64, -64, -64, 64, 64, 64, 64, 64, 64, 64, 64, -64, 64, 64, 64, 64, 64, -64, 64, 64, -64, 64, 64, 64, -64, 64, 64, -64, -64, 64, 64, 64, 64, 64, 64, -64, 64, 64, 64, -64, 64, 64, 64, 64, 64, 64, -64, -64, -64, 64, 64, 64, -64, 64, 64, 64, -64, -64, 64, 64, 64, -64, -64, 64, -64, 64, -64, -64, -64, 64, 64, 64, -64, -64, -64, -64, -64, 64, 64, -64, -64, 64, 64, -64, -64, -64, -64, 64, 64, 64, 64, -64, -64, -64, -64, -64, -64, 64, 64, -64, 64, -64, -64, -64, 64, -64, 64, -64, 64, 64, 64, -64, -64, -64, -64, -64, 64, 64, 64, 64, 64, -64, -64, -64, -64, 64, 64, 64, -64, -64, 64, -64, -64, 64, 64, -64, -64, 64, 64, 64, 64, -64, -64, 64, 64, 64, 64, 64, 64, -64, -64, -64, 64, 64, 64, -64, 64, 64, 64, -64, -64, -64, 64, -64, -64, 64, 64, 64, -64, -64, -64, 64, 64, 64, 64, 64, -64, -64, 64, -64, 64, 64, 64, 64, 64, 64, 64, 64, -64, -64, 64, 64, 64, 64, 64, -64, -64, -64, -64, -64, 64, 64, 64, 64, -64, -64, -64, -64, 64, -64, 64, 64, -64, 64, -64, -64, -64, -64, -64, -64, 64, -64, -64, -64, -64, -64, 64, -64, 64, 64, 64, 64, -64, -64, -64, 64, 64, 64, -64, -64, 64, 64, -64, -64, 64, -64, 64, 64, 64, -64, -64, -64, -64, -64, -64, 64, 64, 64, -64, -64, -64, -64, -64, -64, -64, 64, -64, -64, 64, -64, -64, -64, 64, 64, 64, 64, 64, -64, -64, 64, 64, -64, -64, -64, 64, -64, -64, -64, -64, -64, -64, -64, -64, -64, -64, -64, 64, -64, 64, -64, -64, 64, -64, 64, 64, -64, -64, 64, 64, 64, -64, 64, 64, -64, -64, -64, -64, -64, -64, -64, -64, -64, -64, 64, 64, 64, 64, 64, -64, -64, 64, -64, 64, -64, -64, 64, 64, 64, 64, 64, 64, -64, -64, -64, -64, -64, -64, 64, 64, 64, 64, 64, -64, 64, 64, 64, -64, 64, 64, -64, 64, 64, -64, 64, 64, 64, 64, 64, 64, -64, -64, -64, 64, -64, -64, -64, 64, 64, -64, 64, 64, 64, 64, 64, -64, 64, -64, -64, 64, 64, -64, 64, 64, 64, 64, 64, 64, -64, -64, -64, -64, -64, -64, 64, 64, 64, 64, 64, -64, 64, 64, 64, -64, 64, -64, 64, 64, -64, 64, 64, 64, 64, 64, 64, -64, -64, -64, -64, 64, -64, 64, 64, 64, 64, 64, 64, 64, 64, 64, 64, 64, 64, 64, -64, -64, 64, 64, 64, 64, 64, -64, -64, 64, 64, 64, 64, 64, 64, 64, 64, 64, 64, 64, -64, -64, 64, 64, 64, -64, 64, 64, 64, -64, 64, -64, 64, 64, 64, 64, -64, 64, 64, 64, 64, 64, 64, 64, -64, 64, -64, 64, -64, -64, -64, -64, -64, -64, -64, -64, 64, -64, -64, 64, 64, 64, -64, -64, -64, -64, -64, -64, 64, 64, 64, -64, -64, 64, -64, -64, -64, -64, -64, 64, 64, 64, -64, 64, -64, 64, 64, 64, 64, -64, -64, -64, -64, -64, -64, 64, -64, -64, -64, -64, -64, -64, -64, -64, -64, -64, 64, 64, 64, -64, 64, -64, -64, -64, -64, 64, 64, -64, -64, -64, -64, -64, -64, -64, 64, 64, 64, 64, -64, -64, -64, -64, -64, 64, -64, 64, -64, -64, 64, -64, 64, -64, 64, 64, 64, -64, -64, -64, -64, -64, 64, 64, 64, 64, -64, -64, -64, -64, -64, -64, -64, -64, 64, 64, -64, -64, 64, -64, 64, 64, 64, -64, -64, -64, -64, -64, -64, 64, 64, -64, 64, -64, -64, 64, 64, -64, -64, -64, 64, 64, 64, -64, 64, 64, -64, 64, -64, 64, 64, 64, -64, -64, -64, -64, -64, -64, 64, 64, 64, -64, -64, 64, 64, -64, -64, -64, 64, 64, 64, 64, -64, 64, 64, -64, -64, -64, -64, 64, -64, -64, -64, -64, 64, 64, 64, 64, 64, 64, 64, -64, 64, -64, 64, 64, -64, 64, 64, -64, -64, 64, 64, 64, -64, 64, -64, 64, 64, -64, 64, 64, -64, 64, 64, 64, -64, 64, -64, -64, 64, -64, -64, 64, -64, -64, -64, -64, 64, -64, 64, -64, 64, -64, 64, 64, -64, -64, -64, 64, 64, -64, 64, -64, -64, -64, 64, 64, -64, -64, 64, 64, -64, -64, 64, 64, 64, 64, -64, 64, -64, 64, -64, 64, -64, -64, 64, -64, 64, -64, 64, 64, 64, -64, -64, -64, -64, -64, -64, 64, -64, -64, 64, 64, -64, 64, 64, 64, -64, 64, 64, 64, -64, 64, 64, -64, -64, 64, 64, 64, 64, -64, 64, -64, -64, -64, 64, -64, 64, 64, -64, 64, 64, -64, -64, -64, 64, -64, -64, 64, -64, 64, -64, 64, 64, 64, -64, 64, -64, -64, 64, 64, 64, 64, -64, 64, 64, 64, 64, 64, -64, 64, 64, 64, 64, 64, -64, 64, -64, -64, 64, 64, -64, -64, -64, 64, 64, -64, -64, -64, 64, -64, 64, 64, -64, -64, 64, -64, -64, 64, -64, -64, 64, -64, 64, -64, -64, 64, -64, -64, -64, -64, -64, 64, -64, 64, 64, 64, 64, 64, 64, 64, -64, -64, 64, 64, 64, -64, 64, 64, -64, -64, 64, 64, -64, -64, -64, -64, 64, -64, 64, 64, -64, 64, -64, 64, 64, 64, 64, 64, 64, -64, 64, -64, 64, 64, 64, 64, -64, 64, 64, 64, -64, -64, -64, -64, -64, -64, 64, 64, -64, -64, 64, 64, -64, 64, -64, 64, 64, 64, -64, -64, 64, 64, 64, -64, 64, 64, 64, 64, -64, -64, -64, -64, -64, 64, 64, -64, 64, 64, 64, -64, 64, -64, -64, 64, 64, -64, -64, 64, 64, -64, 64, -64, -64, -64, 64, 64, 64, -64, -64, 64, 64, 64, 64, 64, 64, 64, 64, 64, -64, -64, 64, 64, 64, 64, 64, 64, 64, 64, 64, 64, 64, -64, 64, 64, 64, -64, -64, 64, 64, 64, 64, 64, 64, 64, 64, 64, 64, -64, -64, 64, -64, 64, 64, 64, 64, 64, 64, 64, -64, -64, -64, -64, 64, 64, 64, 64, 64, 64, 64, 64, 64, 64, 64, 64, 64, 64, 64, 64, 64, 64, -64, -64, -64, 64, -64, -64, -64, -64, -64, 64, -64, 64, 64, 64, 64, 64, 64, 64, 64, 64, 64, 64, 64, -64, -64, 64, -64, -64, -64, -64, 64, 64, -64, 64, 64, -64, 64, -64, -64, 64, -64, 64, 64, 64, 64, 64, 64, 64, 64, 64, 64, 64, 64, 64, -64, -64, -64, -64, -64, -64, -64, 64, 64, 64, -64, 64, 64, 64, 64, 64, 64, 64, 64, 64, 64, 64, 64, 64, 64, 64, 64, 64, 64, -64, -64, -64, -64, -64, -64, -64, 64, -64, 64, 64, 64, 64, -64, 64, 64, 64, -64, 64, 64, 64, 64, 64, 64, 64, 64, 64, 64, -64, -64, -64, -64, -64, -64, 64, 64, 64, -64, 64, -64, 64, -64, 64, 64, 64, -64, -64, 64, 64, 64, 64, 64, 64, 64, 64, 64, -64, 64, -64, -64, -64, -64, -64, -64, 64, 64, -64, 64, -64, -64, 64, 64, -64, -64, 64, -64, 64, 64, 64, 64, 64, 64, 64, 64, 64, 64, 64, -64, -64, 64, -64, -64, -64, -64, 64, 64, 64, -64, -64, 64, -64, -64, -64, -64, -64, 64, 64, -64, 64, 64, 64, 64, -64, -64, -64, -64, -64, -64, -64, -64, -64, 64, 64, 64, 64, 64, 64, 64, -64, -64, -64, -64, -64, -64, -64, 64, 64, 64, -64, -64, -64, 64, -64, -64, -64, 64, 64, -64, 64, 64, 64, 64, 64, 64, 64, -64, -64, -64, -64, -64, -64, -64, -64, -64, 64, 64, -64, -64, -64, 64, -64, 64, -64, -64, 64, 64, -64, 64, 64, 64, 64, 64, 64, -64, -64, -64, -64, -64, -64, -64, -64, -64, -64, 64, -64, -64, -64, -64, 64, -64, -64, 64, -64, -64, 64, -64, 64, 64, 64, 64, 64, -64, -64, -64, -64, -64, -64, -64, -64, -64, -64, 64, -64, -64, -64, -64, -64, 64, 64, -64, 64, -64, -64, 64, 64, 64, 64, 64, 64, 64, 64, 64, 64, 64, -64, -64, -64, -64, -64, -64, 64, -64, -64, -64, -64, -64, 64, 64, -64, 64, 64, -64, -64, 64, -64, 64, 64, 64, -64, -64, 64, 64, 64, -64, -64, -64, -64, 64, 64, 64, -64, 64, -64, -64, -64, 64, 64, 64, -64, -64, -64, -64, -64, -64, -64, 64, 64, -64, 64, 64, -64, 64, 64, 64, -64, -64, 64, 64, -64, -64, -64, -64, -64, 64, 64, -64, 64, 64, 64, -64, 64, 64, -64, 64, -64, -64, -64, 64, 64, -64, -64, 64, 64, 64, 64, -64, 64, -64, 64, 64, -64, -64, 64, -64, -64, -64, -64, 64, 64, -64, 64, 64, -64, -64, 64, 64, 64, -64, 64, 64, -64, -64, -64, 64, 64, 64, 64, 64, -64, 64, 64, 64, -64, 64, 64, -64, -64, -64, -64, -64, 64, -64, 64, 64, -64, -64, 64, 64, 64, 64, 64, 64, 64, -64, -64, -64, 64, -64, -64, 64, -64, -64, -64, 64, -64, 64, 64, 64, 64, 64, 64, 64, 64, -64, 64, 64, 64, 64, -64, 64, 64, -64, -64, 64, 64, 64, 64, -64, -64, 64, 64, -64, -64, 64, -64, 64, 64, 64, 64, -64, -64, 64, -64, 64, 64, 64, -64, 64, 64, 64, 64, 64, 64, -64, 64, 64, 64, -64, -64, 64, 64, -64, -64, -64, -64, 64, 64, 64, 64, -64, 64, -64, 64, 64, 64, 64, 64, 64, -64, 64, -64, 64, -64, -64, -64, -64, 64, 64, -64, 64, -64, -64, -64, 64, 64, -64, 64, 64, 64, 64, 64, -64, 64, 64, -64, 64, -64, 64, 64, 64, 64, 64, -64, 64, -64, 64, 64, 64, -64, -64, 64, -64, -64, -64, 64, 64, 64, -64, 64, -64, -64, -64, -64, 64, 64, 64, 64, -64, 64, -64, -64, -64, -64, 64, 64, 64, 64, 64, 64, 64, 64, -64, 64, 64, 64, 64, 64, 64, 64, 64, 64, 64, 64, 64, 64, 64, -64, 64, -64, 64, -64, 64, -64, 64, 64, 64, 64, 64, 64, 64, 64, 64, 64, 64, -64, 64, 64, 64, 64, 64, 64, 64, 64, -64, -64, -64, -64, 64, 64, 64, 64, -64, 64, 64, 64, 64, 64, 64, 64, 64, 64, 64, 64, 64, 64, 64, 64, 64, 64, 64, 64, 64, 64, -64, 64, 64, -64, 64, 64, 64, -64, -64, 64, 64, -64, 64, 64, 64, 64, 64, -64, 64, -64, 64, -64, 64, 64, -64, 64, 64, 64, 64, -64, -64, -64, 64, -64, -64, 64, 64, 64, 64, -64, 64, 64, 64, 64, 64, -64, -64, -64, -64, -64, 64, 64, 64, -64, 64, 64, -64, -64, -64, -64, -64, -64, 64, -64, -64, 64, -64, 64, 64, 64, -64, 64, 64, -64, -64, -64, 64, -64, 64, 64, 64, -64, 64, 64, -64, 64, -64, 64, -64, -64, 64, -64, 64, 64, -64, 64, 64, 64, 64, -64, -64, -64, -64, -64, -64, -64, 64, -64, 64, 64, -64, -64, -64, -64, -64, 64, -64, -64, 64, 64, -64, 64, 64, 64, 64, 64, 64, -64, -64, -64, 64, -64, -64, -64, -64, -64, 64, 64, -64, -64, 64, -64, -64, 64, -64, 64, -64, 64, 64, 64, 64, 64, 64, -64, -64, -64, -64, -64, -64, -64, 64, 64, 64, 64, -64, -64, 64, 64, 64, 64, -64, 64, -64, -64, 64, 64, 64, 64, 64, 64, 64, -64, -64, -64, -64, 64, -64, -64, -64, 64, 64, 64, 64, 64, -64, 64, -64, 64, -64, 64, 64, 64, 64, 64, 64, 64, 64, 64, 64, 64, 64, -64, -64, 64, -64, -64, 64, 64, -64, -64, 64, 64, 64, -64, 64, -64, -64, 64, 64, 64, 64, 64, 64, 64, 64, -64, -64, 64, 64, 64, 64, 64, -64, 64, 64, 64, 64, 64, 64, -64, 64, -64, 64, 64, 64, -64, 64, -64, 64, 64, 64, 64, 64, 64, 64, 64, 64, 64, 64, -64, 64, 64, 64, 64, 64, 64, 64, 64, 64, -64, 64, 64, -64, -64, -64, 64, 64, -64, 64, 64, -64, -64, 64, 64, 64, 64, 64, 64, 64, 64, 64, 64, 64, 64, 64, -64, -64, 64, 64, -64, -64, -64, 64, 64, 64, 64, 64, 64, -64, 64, 64, 64, 64, 64, 64, 64, 64, 64, 64, 64, 64, 64, 64, 64, 64, 64, -64, -64, 64, -64, -64, -64, 64, 64, 64, -64, -64, 64, 64, 64, 64, 64, 64, 64, -64, 64, 64, 64, 64, 64, 64, 64, 64, 64, 64, -64, -64, 64, 64, 64, 64, 64, 64, 64, -64, 64, -64, -64, -64, 64, -64, -64, -64, 64, 64, 64, 64, 64, 64, -64, 64, -64, 64, -64, 64, -64, -64, -64, -64, -64, -64, -64, 64, 64, -64, -64, 64, -64, -64, -64, 64, -64, 64, 64, -64, 64, -64, -64, -64, -64, 64, -64, -64, -64, -64, -64, -64, -64, -64, -64, -64, 64, 64, 64, -64, -64, 64, 64, -64, -64, 64, 64, 64, 64, 64, 64, -64, -64, -64, 64, -64, -64, -64, 64, -64, -64, 64, -64, -64, 64, 64, 64, 64, -64, 64, 64, 64, -64, -64, -64, 64, -64, 64, -64, 64, -64, -64, 64, -64, 64, -64, -64, -64, 64, -64, 64, 64, -64, -64, 64, -64, -64, -64, -64, 64, 64, 64, -64, 64, -64, 64, -64, 64, -64, -64, 64, 64, -64, -64, 64, -64, -64, 64, -64, 64, 64, 64, -64, 64, 64, 64, 64, 64, -64, 64, 64, 64, -64, 64, 64, 64, -64, -64, -64, 64, 64, -64, 64, 64, -64, 64, 64, 64, -64, 64, 64, 64, 64, 64, -64, -64, 64, 64, 64, -64, -64, -64, -64, 64, -64, -64, 64, -64, 64, -64, -64, -64, -64, -64, 64, 64, -64, 64, -64, -64, 64, 64, 64, -64, 64, -64, 64, -64, 64, 64, 64, 64, -64, 64, -64, -64, -64, -64, -64, -64, -64, -64, -64, -64, 64, -64, 64, 64, 64, 64, -64, 64, 64, -64, -64, 64, 64, 64, 64, 64, 64, 64, 64, 64, 64, 64, 64, 64, 64, -64, -64, 64, 64, 64, 64, -64, 64, 64, -64, 64, -64, -64, 64, 64, 64, 64, -64, -64, 64, -64, -64, -64, -64, 64, 64, 64, -64, -64, -64, 64, -64, 64, 64, 64, 64, -64, -64, 64, 64, 64, -64, 64, 64, -64, -64, 64, -64, 64, 64, 64, -64, -64, 64, 64, -64, -64, 64, 64, -64, -64, -64, 64, 64, 64, 64, 64, 64, 64, 64, 64, -64, -64, 64, -64, 64, 64, 64, -64, -64, 64, 64, 64, 64, 64, 64, 64, -64, 64, 64, 64, 64, 64, 64, 64, 64, 64, 64, 64, 64, 64, -64, 64, -64, 64, -64, 64, 64, 64, 64, 64, 64, -64, 64, -64, 64, 64, 64, 64, 64, 64, 64, 64, 64, 64, 64, 64, 64, -64, -64, 64, -64, -64, -64, 64, -64, -64, 64, 64, 64, -64, 64, -64, 64, 64, 64, 64, -64, -64, 64, -64, 64, 64, 64, 64, 64, -64, -64, -64, -64, -64, 64, 64, -64, -64, -64, -64, -64, -64, -64, -64, -64, -64, 64, 64, -64, -64, -64, -64, 64, 64, -64, 64, -64, -64, 64, 64, 64, -64, 64, -64, -64, -64, -64, -64, -64, -64, 64, -64, -64, -64, -64, -64, -64, -64, -64, -64, -64, -64, -64, 64, -64, -64, -64, 64, 64, -64, 64, -64, -64, -64, 64, -64, -64, -64, -64, -64, -64, -64, -64, -64, -64, -64, -64, -64, -64, -64, -64, -64, 64, 64, -64, 64, 64, 64, -64, -64, -64, -64, -64, -64, -64, 64, -64, -64, -64, -64, -64, -64, -64, -64, -64, -64, -64, -64, -64, -64, -64, 64, -64, 64, 64, -64, 64, -64, -64, -64, -64, -64, -64, -64, -64, -64, -64, -64, 64, 64, -64, -64, -64, -64, -64, 64, -64, -64, -64, -64, 64, -64, -64, 64, -64, -64, -64, -64, -64, -64, -64, -64, -64, -64, -64, -64, -64, -64, -64, -64, -64, -64, -64, -64, 64, -64, 64, -64, 64, 64, -64, 64, 64, -64, 64, -64, -64, -64, 64, 64, 64, -64, -64, -64, -64, -64, -64, -64, -64, -64, -64, -64, 64, 64, 64, 64, -64, -64, -64, -64, 64, -64, 64, -64, -64, 64, -64, -64, -64, -64, -64, -64, -64, -64, -64, -64, -64, 64, -64, -64, -64, 64, -64, -64, 64, -64, 64, -64, 64, -64, -64, -64, 64, -64, -64, -64, -64, -64, -64, -64, -64, -64, -64, -64, 64, 64, 64, -64, -64, -64, 64, -64, 64, 64, 64, 64, 64, -64, 64, 64, 64, -64, -64, -64, 64, 64, 64, -64, -64, -64, -64, 64, 64, 64, 64, -64, -64, -64, -64, -64, 64, -64, -64, 64, 64, 64, 64, -64, -64, 64, -64, 64, -64, 64, -64, 64, -64, -64, -64, -64, 64, 64, -64, -64, 64, -64, -64, -64, -64, 64, -64, -64, 64, 64, 64, -64, 64, 64, 64, 64, 64, 64, -64, 64, 64, -64, -64, 64, 64, 64, -64, -64, 64, -64, -64, -64, 64, 64, 64, 64, -64, -64, 64, -64, 64, 64, 64, 64, 64, 64, 64, 64, 64, -64, 64, 64, -64, 64, -64, -64, -64, -64, 64, -64, -64, 64, 64, 64, 64, 64, 64, 64, 64, 64, 64, -64, -64, -64, 64, 64, 64, 64, 64, 64, 64, 64, -64, -64, -64, 64, 64, 64, -64, -64, -64, -64, 64, 64, 64, 64, 64, 64, 64, -64, 64, 64, 64, 64, 64, 64, 64, 64, -64, 64, 64, -64, -64, 64, 64, -64, 64, -64, -64, 64, -64, 64, 64, 64, -64, -64, -64, 64, -64, 64, 64, 64, 64, 64, 64, 64, 64, -64, 64, 64, 64, 64, 64, 64, -64, 64, -64, 64, -64, 64, 64, -64, 64, 64, 64, 64, 64, -64, -64, -64, -64, 64, 64, 64, 64, 64, -64, -64, 64, 64, -64, 64, 64, -64, -64, 64, -64, 64, -64, 64, -64, 64, -64, -64, 64, -64, -64, -64, -64, -64, 64, 64, -64, 64, 64, -64, 64, -64, -64, -64, 64, 64, 64, 64, 64, 64, -64, 64, 64, 64, -64, 64, 64, -64, 64, 64, -64, -64, -64, -64, -64, -64, 64, 64, 64, 64, -64, -64, 64, 64, 64, -64, -64, 64, 64, -64, -64, 64, 64, 64, 64, -64, 64, 64, -64, 64, -64, -64, 64, 64, 64, 64, 64, 64, -64, 64, -64, 64, -64, -64, 64, -64, 64, -64, -64, -64, 64, -64, -64, 64, 64, -64, -64, 64, -64, -64, -64, -64, -64, 64, -64, -64, -64, -64, 64, -64, -64, -64, -64, -64, 64, -64, -64, 64, -64, 64, -64, -64, 64, 64, 64, 64, 64, 64, -64, -64, 64, -64, -64, -64, 64, -64, -64, -64, -64, 64, 64, 64, 64, 64, -64, 64, -64, -64, -64, -64, 64, 64, 64, 64, -64, -64, -64, -64, 64, -64, 64, -64, 64, -64, 64, -64, 64, 64, -64, 64, 64, 64, -64, -64, 64, -64, -64, -64, 64, 64, 64, -64, 64, -64, 64, -64, 64, 64, 64, -64, -64, -64, -64, -64, -64, -64, -64, -64, -64, -64, 64, 64, -64, -64, 64, 64, -64, 64, -64, -64, 64, -64, 64, -64, 64, 64, -64, 64, 64, -64, -64, 64, -64, -64, -64, -64, -64, -64, -64, -64, -64, 64, -64, -64, 64, -64, -64, -64, -64, -64, 64, -64, -64, 64, -64, -64, -64, -64, 64, -64, 64, -64, -64, -64, 64, -64, 64, 64, -64, -64, -64, -64, -64, 64, 64, -64, -64, -64, -64, 64, 64, -64, 64, 64, 64, 64, 64, 64, 64, 64, -64, -64, 64, 64, -64, -64, -64, -64, 64, 64, -64, 64, 64, 64, -64, 64, -64, -64, 64, 64, -64, -64, 64, -64, -64, -64, -64, -64, -64, 64, 64, -64, -64, -64, -64, -64, 64, -64, -64, -64, -64, -64, 64, -64, 64, 64, 64, 64, 64, -64, 64, 64, 64, -64, 64, -64, -64, 64, -64, 64, 64, -64, -64, 64, 64, 64, 64, -64, 64, -64, -64, -64, -64, -64, 64, -64, -64, -64, 64, -64, -64, -64, 64, -64, -64, 64, -64, 64, -64, 64, -64, 64, -64, 64, -64, 64, 64, 64, -64, 64, -64, 64, -64, -64, -64, -64, -64, 64, -64, 64, -64, 64, 64, 64, 64, -64, 64, 64, -64, -64, 64, -64, -64, 64, -64, 64, -64, -64, -64, 64, -64, -64, 64, -64, 64, -64, 64, 64, 64, 64, -64, 64, -64, 64, 64, -64, 64, 64, 64, -64, -64, -64, 64, 64, -64, -64, -64, -64, -64, -64, -64, 64, -64, 64, 64, -64, 64, -64, 64, -64, -64, 64, 64, 64, -64, -64, 64, -64, -64, -64, -64, 64, -64, -64, -64, 64, -64, -64, -64, 64, 64, 64, 64, 64, -64, 64, -64, 64, 64, -64, -64, -64, -64, -64, -64, -64, -64, -64, -64, -64, -64, -64, 64, -64, -64, 64, -64, 64, 64, 64, 64, 64, -64, 64, -64, 64, -64, -64, 64, -64, -64, 64, 64, -64, -64, -64, -64, 64, 64, -64, -64, -64, -64, -64, 64, -64, 64, 64, -64, 64, -64, -64, -64, -64, 64, -64, 64, -64, -64, -64, -64, -64, -64, -64, -64, -64, -64, 64, -64, -64, 64, -64, -64, -64, 64, -64, 64, -64, 64, 64, -64, -64, 64, -64, -64, -64, -64, -64, -64, 64, 64, -64, 64, 64, -64, 64, -64, 64, 64, -64, -64, 64, -64, -64, 64, 64, -64, 64, -64, 64, 64, -64, -64, -64, -64, -64, -64, 64, -64, -64, -64, -64, 64, 64, -64, -64, -64, -64, 64, -64, -64, 64, 64, -64, 64, 64, 64, -64, 64, -64, 64, -64, -64, -64, -64, 64, -64, 64, -64, -64, -64, -64, -64, 64, -64, -64, -64, -64, 64, 64, -64, -64, 64, -64, -64, -64, 64, -64, 64, -64, -64, -64, -64, -64, -64, -64, 64, 64, 64, -64, 64, 64, 64, 64, -64, 64, 64, 64, 64, -64, -64, 64, -64, 64, 64, -64, 64, -64, 64, -64, -64, 64, -64, -64, 64, -64, -64, -64, -64, 64, -64, 64, 64, 64, -64, -64, 64, -64, -64, -64, -64, -64, 64, -64, -64, 64, 64, -64, -64, 64, 64, -64, 64, -64, -64, 64, 64, -64, -64, -64, 64, 64, 64, 64, 64, -64, 64, 64, -64, -64, -64, -64, -64, -64, 64, -64, -64, -64, 64, -64, -64, 64, 64, 64, 64, 64, 64, -64, 64, -64, -64, 64, -64, -64, -64, -64, 64, -64, -64, -64, -64, 64, 64, 64, -64, 64, 64, -64, 64, -64, 64, 64, 64, -64, -64, -64, -64, -64, 64, 64, -64, -64, 64, 64, 64, 64, -64, -64, 64, 64, 64, 64, 64, 64, -64, -64, 64, -64, -64, -64, -64, -64, -64, -64, -64, 64, 64, 64, -64, -64, 64, -64, 64, 64, -64, -64, 64, -64, -64, 64, 64, 64, 64, 64, 64, 64, -64, -64, 64, 64, 64, -64, -64, 64, -64, -64, -64, 64, -64, -64, 64, -64, 64, -64, 64, 64, -64, -64, -64, 64, -64, -64, -64, 64, 64, 64, 64, -64, 64, 64, 64, 64, 64, 64, -64, 64, 64, -64, -64, 64, 64, 64, 64, -64, -64, -64, 64, -64, 64, 64, 64, 64, -64, -64, 64, 64, 64, -64, -64, 64, -64, 64, 64, 64, -64, 64, -64, -64, -64, 64, -64, 64, 64, -64, -64, 64, 64, 64, 64, -64, -64, -64, -64, -64, -64, -64, 64, 64, 64, 64, 64, 64, -64, -64, 64, -64, -64, -64, 64, 64, -64, 64, -64, 64, 64, 64, 64, -64, 64, -64, -64, 64, -64, -64, 64, 64, 64, -64, 64, -64, -64, 64, -64, 64, 64, 64, 64, 64, -64, -64, 64, 64, 64, 64, -64, -64, -64, -64, 64, -64, -64, -64, 64, 64, -64, -64, -64, -64, 64, -64, -64, 64, 64, 64, -64, -64, -64, 64, -64, 64, -64, 64, -64, -64, -64, -64, 64, -64, -64, -64, -64, -64, -64, 64, -64, -64, 64, -64, 64, -64, 64, -64, -64, -64, -64, 64, -64, -64, -64, 64, -64, 64, 64, -64, 64, -64, -64, -64, -64, -64, -64, -64, 64, -64, -64, 64, 64, -64, -64, 64, 64, 64, 64, -64, -64, 64, -64, 64, 64, -64, -64, -64, -64, -64, 64, -64, -64, -64, -64, -64, 64, 64, 64, -64, 64, 64, 64, -64, 64, 64, -64, -64, 64, 64, -64, -64, 64, 64, -64, -64, 64, 64, -64, 64, -64, -64, -64, 64, -64, -64, 64, 64, 64, 64, -64, 64, -64, -64, -64, -64, -64, 64, -64, -64, 64, -64, 64, -64, -64, 64, 64, -64, -64, -64, -64, -64, -64, -64, -64, -64, 64, 64, 64, 64, 64, -64, -64, -64, -64, 64, 64, -64, 64, -64, -64, -64, 64, 64, -64, -64, 64, -64, 64, 64, 64, 64, -64, 64, 64, -64, 64, -64, -64, -64, -64, -64, -64, -64, -64, -64, -64, 64, -64, -64, -64, 64, 64, 64, -64, -64, -64, -64, -64, 64, 64, 64, 64, 64, 64, 64, -64, 64, 64, 64, -64, -64, -64, -64, -64, 64, -64, 64, -64, 64, 64, -64, -64, 64, 64, -64, -64, -64, 64, -64, -64, 64, 64, -64, -64, 64, -64, 64, -64, 64, -64, -64, 64, 64, 64, -64, -64, -64, 64, 64, 64, -64, 64, 64, 64, 64, -64, -64, 64, -64, -64, -64, -64, -64, -64, -64, -64, -64, 64, -64, -64, -64, -64, 64, -64, -64, -64, -64, -64, -64, -64, -64, 64, -64, 64, -64, 64, 64, 64, -64, -64, 64, 64, 64, -64, 64, -64, -64, 64, 64, 64, -64, -64, -64, -64, 64, -64, -64, -64, -64, 64, -64, 64, 64, -64, 64, 64, 64, -64, 64, -64, -64, -64, 64, -64, -64, 64, -64, 64, -64, 64, -64, -64, -64, 64, -64, -64, -64, 64, 64, -64, 64, 64, 64, 64, -64, -64, -64, 64, -64, -64, 64, -64, -64, -64, -64, 64, 64, 64, -64, -64, 64, 64, 64, -64, -64, -64, 64, -64, 64, 64, 64, 64, 64, -64, -64, -64, -64, -64, 64, -64, -64, -64, -64, 64, -64, -64, 64, 64, -64, 64, 64, 64, 64, 64, -64, 64, -64, -64, 64, 64, 64, -64, 64, -64, -64, -64, -64, 64, -64, -64, -64, -64, -64, 64, 64, 64, -64, -64, 64, 64, 64, -64, 64, 64, 64, 64, 64, -64, 64, 64, 64, -64, -64, -64, 64, -64, -64, 64, -64, -64, -64, 64, 64, -64, -64, -64, 64, 64, 64, -64, -64, -64, 64, 64, -64, 64, 64, -64, -64, -64, -64, -64, -64, -64, 64, -64, -64, -64, -64, -64, 64, 64, -64, -64, -64, 64, -64, -64, -64, 64, 64, 64, 64, 64, 64, -64, 64, 64, -64, -64, -64, -64, -64, -64, -64, 64, 64, 64, -64, -64, -64, 64, 64, 64, -64, 64, -64, 64, 64, 64, 64, -64, 64, -64, -64, 64, -64, -64, 64, -64, 64, -64, -64, -64, -64, -64, -64, 64, -64, 64, -64, -64, 64, -64, 64, 64, 64, -64, 64, -64, -64, 64, -64, 64, 64, 64, -64, 64, 64, 64, 64, 64, -64, -64, 64, -64, -64, -64, 64, -64, 64, 64, -64, 64, -64, -64, -64, -64, -64, 64, -64, -64, 64, -64, -64, 64, 64, 64, -64, -64, -64, -64, 64, -64, 64, -64, 64, -64, 64, 64, 64, -64, 64, 64, -64, -64, -64, -64, 64, 64, 64, -64, -64, -64, -64, 64, -64, -64, -64, 64, 64, 64, -64, -64, 64, 64, -64, -64, -64, 64, -64, 64, -64, -64, -64, -64, 64, 64, 64, -64, 64, -64, -64, 64, 64, -64, 64, 64, 64, -64, 64, -64, -64, 64, -64, 64, -64, -64, 64, -64, -64, -64, -64, 64, 64, -64, 64, -64, -64, 64, 64, 64, -64, 64, 64, 64, -64, -64, 64, 64, -64, 64, -64, -64, -64, -64, -64, -64, -64, -64, 64, -64, 64, 64, -64, 64, -64, 64, 64, 64, 64, -64, 64, -64, 64, -64, -64, 64, -64, -64, 64, 64, -64, -64, 64, 64, -64, 64, 64, -64, 64, -64, 64, -64, 64, 64, 64, 64, 64, 64, -64, 64, 64, 64, 64, 64, -64, 64, -64, -64, -64, -64, 64, 64, -64, 64, 64, -64, -64, 64, -64, 64, 64, -64, -64, -64, -64, 64, -64, 64, 64, -64, 64, -64, -64, 64, -64, 64, -64, 64, -64, 64, 64, 64, -64, -64, 64, 64, 64, 64, 64, 64, 64, 64, 64, 64, 64, -64, 64, 64, 64, -64, 64, 64, -64, -64, -64, -64, 64, 64, 64, -64, -64, -64, -64, 64, -64, -64, -64, -64, 64, 64, -64, 64, 64, 64, 64, -64, 64, 64, -64, 64, 64, 64, 64, -64, 64, 64, 64, -64, -64, -64, 64, -64, -64, -64, -64, -64, 64, -64, 64, 64, 64, 64, -64, 64, 64, -64, -64, -64, 64, -64, 64, 64, -64, 64, -64, 64, -64, -64, -64, 64, 64, -64, 64, 64, -64, 64, 64, -64, 64, 64, 64, 64, -64, -64, 64, -64, 64, -64, 64, 64, 64, -64, -64, -64, 64, 64, -64, 64, -64, -64, 64, -64, 64, -64, 64, -64, 64, 64, 64, 64, 64, -64, -64, -64, -64, 64, -64, 64, -64, 64, 64, 64, 64, 64, 64, 64, 64, 64, 64, 64, 64, 64, 64, -64, -64, -64, -64, 64, 64, 64, 64, 64, 64, -64, 64, -64, -64, -64, -64, 64, 64, 64, -64, 64, 64, -64, 64, 64, 64, 64, 64, -64, 64, 64, 64, 64, 64, 64, 64, -64, -64, -64, -64, 64, -64, 64, 64, 64, 64, 64, 64, 64, 64, -64, 64, -64, 64, 64, 64, -64, 64, 64, -64, -64, -64, 64, -64, 64, -64, 64, -64, 64, -64, 64, 64, -64, -64, 64, 64, 64, -64, 64, 64, -64, -64, -64, 64, 64, -64, 64, 64, 64, -64, 64, -64, -64, -64, -64, -64, 64, -64, 64, -64, -64, 64, 64, 64, 64, 64, 64, 64, 64, -64, 64, -64, -64, 64, 64, -64, 64, -64, 64, 64, -64, 64, -64, -64, 64, -64, 64, 64, 64, 64, 64, -64, 64, 64, 64, 64, 64, 64, 64, -64, 64, 64, -64, -64, 64, 64, 64, -64, -64, -64, 64, -64, 64, -64, 64, 64, -64, -64, 64, -64, 64, 64, -64, 64, 64, 64, 64, 64, 64, 64, 64, -64, -64, 64, 64, 64, 64, 64, 64, -64, 64, -64, 64, -64, 64, -64, -64, 64, 64, 64, 64, 64, 64, -64, -64, -64, 64, 64, 64, 64, 64, 64, 64, 64, 64, -64, 64, 64, 64, 64, -64, 64, 64, 64, -64, 64, -64, 64, 64, 64, 64, 64, 64, 64, 64, 64, 64, 64, -64, -64, 64, 64, -64, -64, 64, -64, -64, -64, 64, 64, 64, 64, 64, 64, 64, 64, 64, -64, 64, -64, -64, 64, 64, 64, 64, 64, -64, -64, -64, 64, -64, -64, -64, -64, -64, 64, 64, -64, 64, -64, 64, 64, 64, 64, 64, -64, -64, -64, -64, 64, 64, 64, 64, -64, 64, -64, 64, -64, -64, -64, 64, -64, -64, 64, 64, 64, -64, -64, 64, 64, -64, 64, 64, 64, 64, -64, -64, -64, 64, 64, 64, 64, 64, -64, 64, -64, -64, -64, 64, -64, 64, 64, 64, -64, -64, -64, 64, 64, -64, 64, 64, 64, -64, -64, 64, -64, 64, 64, 64, 64, 64, 64, 64, 64, -64, -64, -64, -64, 64, 64, 64, -64, -64, -64, 64, -64, 64, -64, -64, 64, 64, 64, -64, -64, -64, 64, 64, 64, -64, 64, 64, 64, -64, -64, -64, 64, -64, -64, -64, 64, 64, -64, -64, -64, 64, 64, 64, 64, 64, -64, 64, -64, -64, -64, 64, 64, 64, 64, 64, 64, 64, 64, 64, -64, -64, 64, 64, -64, 64, 64, -64, 64, 64, -64, 64, 64, 64, 64, -64, -64, 64, 64, 64, -64, -64, 64, -64, -64, 64, 64, -64, -64, -64, -64, 64, 64, 64, 64, -64, -64, 64, 64, -64, 64, 64, 64, 64, -64, 64, -64, 64, 64, -64, 64, -64, -64, -64, -64, -64, 64, 64, -64, 64, 64, -64, 64, -64, -64, 64, -64, -64, 64, -64, 64, 64, 64, -64, 64, 64, 64, -64, -64, -64, 64, -64, 64, -64, 64, 64, 64, -64, -64, 64, -64, -64, 64, 64, 64, -64, 64, 64, 64, 64, 64, -64, 64, 64, -64, -64, 64, 64, -64, -64, -64, -64, -64, -64, -64, -64, 64, 64, -64, 64, 64, -64, 64, -64, -64, -64, -64, -64, -64, 64, 64, -64, -64, 64, -64, -64, -64, 64, -64, -64, 64, -64, 64, 64, -64, -64, -64, 64, 64, 64, 64, 64, 64, 64, -64, 64, 64, 64, -64, -64, 64, -64, -64, 64, 64, -64, 64, -64, -64, -64, -64, -64, 64, 64, 64, 64, 64, 64, 64, -64, 64, -64, 64, -64, -64, -64, -64, 64, -64, -64, -64, -64, -64, 64, -64, 64, -64, -64, 64, -64, 64, 64, 64, -64, -64, 64, 64, 64, 64, 64, 64, -64, -64, 64, 64, -64, -64, -64, 64, -64, -64, -64, -64, 64, 64, -64, 64, 64, -64, 64, -64, -64, 64, 64, 64, 64, 64, 64, 64, 64, -64, -64, 64, 64, 64, 64, 64, -64, -64, -64, -64, -64, -64, -64, -64, 64, 64, 64, 64, 64, 64, 64, 64, 64, -64, -64, -64, 64, 64, -64, 64, -64, 64, 64, 64, 64, -64, -64, -64, -64, 64, -64, 64, 64, -64, 64, 64, -64, -64, -64, 64, -64, -64, -64, 64, 64, 64, 64, 64, 64, 64, 64, 64, -64, -64, -64, -64, -64, 64, -64, 64, 64, -64, -64, 64, 64, -64, 64, 64, -64, -64, 64, 64, -64, 64, 64, -64, -64, 64, -64, -64, -64, -64, -64, -64, -64, -64, 64, -64, -64, -64, 64, 64, 64, 64, 64, -64, -64, 64, 64, 64, 64, 64, 64, -64, -64, -64, -64, -64, -64, -64, -64, -64, -64, 64, 64, -64, -64, 64, 64, 64, 64, 64, 64, 64, 64, 64, 64, 64, 64, -64, -64, -64, -64, -64, -64, -64, -64, -64, -64, -64, -64, -64, -64, -64, 64, -64, 64, 64, 64, 64, -64, -64, -64, 64, 64, 64, -64, -64, -64, 64, -64, -64, -64, -64, -64, -64, -64, -64, 64, -64, -64, -64, -64, 64, 64, 64, -64, -64, -64, -64, -64, -64, -64, 64, -64, 64, 64, 64, 64, 64, 64, 64, 64, 64, 64, 64, 64, 64, -64, 64, 64, 64, -64, 64, 64, -64, -64, -64, -64, -64, -64, 64, -64, 64, 64, 64, 64, 64, 64, 64, 64, 64, -64, 64, -64, -64, -64, -64, -64, 64, -64, 64, 64, -64, -64, -64, -64, -64, -64, -64, 64, 64, 64, 64, 64, 64, 64, 64, 64, 64, 64, 64, -64, 64, -64, 64, 64, 64, 64, -64, -64, 64, -64, -64, -64, -64, -64, -64, 64, 64, 64, 64, 64, 64, 64, 64, 64, 64, 64, 64, 64, -64, 64, 64, 64, 64, -64, -64, -64, 64, -64, -64, -64, -64, -64, -64, -64, -64, -64, 64, 64, 64, 64, 64, -64, 64, 64, 64, 64, -64, 64, -64, -64, -64, -64, -64, 64, -64, 64, -64, -64, -64, -64, -64, -64, -64, -64, 64, 64, 64, 64, 64, 64, -64, 64, -64, 64, 64, 64, -64, 64, 64, 64, -64, -64, -64, -64, -64, -64, -64, -64, -64, -64, -64, 64, 64, 64, 64, 64, 64, 64, 64, 64, 64, 64, 64, 64, 64, 64, -64, 64, 64, 64, 64, -64, -64, -64, -64, -64, -64, 64, -64, -64, -64, 64, 64, 64, 64, 64, 64, 64, -64, 64, -64, -64, 64, -64, 64, 64, 64, 64, 64, 64, -64, -64, -64, 64, 64, 64, -64, -64, -64, -64, 64, 64, 64, 64, -64, -64, 64, 64, 64, -64, -64, 64, 64, 64, -64, 64, -64, -64, -64, -64, 64, 64, 64, 64, 64, -64, -64, 64, 64, 64, -64, -64, -64, -64, -64, 64, -64, -64, -64, 64, 64, -64, 64, 64, 64, 64, 64, 64, 64, 64, 64, 64, 64, 64, -64, 64, -64, 64, 64, 64, -64, -64, -64, -64, -64, 64, 64, 64, 64, 64, 64, 64, 64, -64, 64, -64, 64, 64, 64, -64, -64, -64, 64, 64, -64, -64, 64, 64, -64, 64, -64, -64, 64, -64, -64, -64, 64, 64, 64, 64, 64, -64, -64, 64, 64, -64, -64, -64, -64, 64, 64, -64, -64, -64, 64, -64, 64, -64, -64, 64, 64, -64, 64, 64, -64, -64, -64, -64, 64, -64, 64, 64, -64, -64, 64, -64, -64, 64, -64, -64, -64, -64, -64, -64, -64, -64, -64, -64, 64, 64, 64, -64, -64, 64, -64, -64, 64, -64, 64, 64, -64, 64, 64, 64, 64, 64, -64, 64, 64, 64, -64, 64, -64, -64, 64, -64, 64, 64, -64, -64, 64, 64, -64, 64, -64, 64, 64, 64, -64, 64, -64, 64, -64, -64, -64, 64, -64, 64, -64, -64, -64, 64, 64, -64, -64, -64, 64, 64, -64, 64, 64, -64, 64, -64, 64, -64, -64, 64, -64, 64, -64, 64, -64, 64, -64, -64, 64, 64, -64, 64, 64, -64, -64, -64, 64, -64, -64, -64, -64, 64, 64, -64, -64, -64, -64, 64, -64, 64, 64, -64, -64, 64, -64, -64, -64, 64, -64, -64, 64, 64, 64, -64, -64, -64, 64, -64, -64, 64, 64, -64, -64, -64, -64, -64, 64, -64, -64, 64, 64, 64, 64, -64, -64, -64, -64, -64, -64, -64, 64, 64, 64, 64, 64, 64, -64, -64, -64, -64, 64, -64, 64, 64, 64, 64, 64, 64, 64, -64, 64, 64, 64, 64, 64, 64, 64, -64, -64, 64, 64, 64, -64, 64, -64, 64, -64, -64, -64, -64, 64, 64, 64, -64, 64, -64, 64, -64, -64, -64, 64, 64, 64, 64, 64, 64, -64, -64, -64, -64, 64, 64, -64, -64, 64, 64, 64, 64, 64, 64, -64, 64, -64, -64, -64, -64, 64, 64, 64, 64, 64, 64, 64, -64, -64, 64, 64, 64, 64, 64, 64, 64, 64, 64, 64, 64, 64, 64, -64, -64, -64, 64, -64, 64, -64, -64, -64, -64, 64, 64, 64, -64, -64, -64, -64, -64, -64, -64, 64, 64, -64, 64, 64, 64, 64, -64, -64, -64, -64, -64, 64, 64, 64, -64, -64, 64, 64, 64, 64, 64, -64, 64, 64, -64, -64, 64, 64, 64, 64, 64, 64, -64, 64, -64, -64, -64, -64, -64, 64, 64, 64, -64, 64, 64, 64, 64, 64, -64, -64, -64, 64, 64, 64, 64, 64, 64, 64, 64, 64, 64, -64, -64, -64, -64, -64, 64, 64, 64, -64, 64, 64, -64, 64, -64, -64, -64, 64, -64, -64, 64, 64, 64, 64, 64, 64, -64, 64, 64, 64, -64, -64, -64, -64, 64, 64, -64, 64, 64, -64, -64, -64, -64, -64, -64, 64, -64, 64, 64, 64, 64, 64, 64, 64, 64, 64, -64, -64, -64, -64, -64, -64, 64, -64, -64, -64, -64, -64, -64, -64, 64, -64, -64, -64, 64, -64, 64, -64, 64, 64, -64, 64, 64, -64, 64, -64, -64, -64, -64, -64, -64, -64, -64, -64, -64, -64, 64, 64, 64, 64, -64, 64, 64, -64, 64, -64, 64, 64, 64, 64, 64, -64, -64, -64, -64, -64, -64, -64, 64, 64, -64, -64, -64, -64, -64, 64, 64, -64, -64, -64, 64, 64, 64, -64, 64, 64, 64, 64, 64, -64, -64, -64, -64, -64, -64, -64, 64, 64, -64, 64, 64, 64, 64, 64, 64, -64, -64, 64, -64, -64, -64, -64, 64, 64, 64, 64, -64, -64, -64, -64, 64, 64, -64, 64, -64, 64, 64, 64, -64, -64, 64, 64, 64, -64, -64, 64, -64, 64, 64, -64, -64, 64, 64, 64, 64, -64, -64, -64, -64, -64, -64, 64, 64, 64, -64, 64, -64, -64, 64, 64, 64, 64, -64, 64, 64, 64, 64, 64, 64, 64, 64, 64, 64, 64, -64, -64, -64, -64, -64, 64, -64, 64, 64, 64, -64, 64, 64, 64, 64, 64, 64, 64, -64, -64, 64, -64, 64, -64, -64, -64, -64, 64, -64, -64, -64, -64, 64, 64, 64, 64, 64, 64, -64, 64, 64, 64, 64, 64, 64, -64, -64, -64, -64, -64, -64, -64, -64, -64, -64, 64, -64, 64, 64, 64, 64, -64, 64, 64, -64, -64, -64, -64, -64, 64, 64, 64, 64, 64, 64, 64, 64, -64, -64, -64, -64, -64, -64, -64, -64, -64, 64, 64, 64, 64, 64, 64, 64, -64, -64, -64, -64, 64, 64, -64, 64, -64, -64, -64, -64, -64, -64, -64, -64, -64, -64, 64, 64, 64, -64, 64, 64, 64, 64, -64, -64, -64, -64, -64, -64, 64, 64, 64, -64, -64, -64, -64, -64, -64, -64, -64, -64, -64, -64, -64, -64, -64, -64, -64, -64, -64, 64, -64, -64, -64, 64, -64, -64, 64, 64, 64, -64, -64, 64, -64, -64, -64, 64, 64, 64, 64, 64, 64, -64, -64, -64, -64, -64, -64, -64, 64, 64, 64, -64, -64, -64, -64, -64, -64, -64, -64, 64, -64, 64, 64, 64, 64, 64, -64, -64, -64, -64, 64, 64, 64, 64, 64, -64, -64, 64, -64, -64, 64, -64, -64, 64, -64, 64, 64, 64, -64, 64, -64, -64, 64, 64, 64, -64, -64, -64, 64, -64, -64, -64, 64, -64, 64, 64, -64, -64, 64, 64, -64, 64, -64, 64, 64, 64, 64, -64, 64, -64, 64, -64, 64, 64, -64, -64, 64, -64, -64, 64, 64, -64, -64, 64, 64, 64, -64, -64, -64, 64, 64, 64, 64, 64, -64, -64, 64, 64, 64, 64, 64, -64, -64, 64, 64, -64, 64, 64, -64, 64, 64, 64, 64, 64, 64, -64, -64, 64, 64, 64, -64, -64, -64, -64, 64, 64, -64, -64, 64, 64, -64, 64, -64, 64, 64, 64, -64, -64, 64, -64, 64, 64, -64, -64, 64, -64, -64, 64, 64, 64, -64, 64, 64, 64, 64, 64, 64, 64, -64, 64, -64, 64, 64, 64, -64, -64, -64, -64, 64, -64, 64, 64, -64, 64, -64, 64, 64, 64, -64, -64, -64, -64, -64, -64, 64, -64, 64, 64, -64, 64, 64, 64, 64, -64, 64, 64, 64, 64, 64, 64, -64, 64, 64, -64, 64, -64, 64, -64, -64, -64, 64, -64, 64, -64, 64, 64, -64, 64, 64, 64, 64, 64, -64, 64, -64, 64, 64, 64, 64, 64, 64, 64, -64, -64, 64, 64, 64, 64, 64, 64, 64, 64, 64, 64, 64, 64, 64, 64, 64, -64, -64, -64, 64, 64, -64, 64, -64, -64, 64, -64, 64, 64, -64, 64, -64, 64, 64, 64, 64, 64, 64, 64, -64, 64, 64, 64, 64, 64, 64, 64, 64, -64, -64, -64, -64, 64, -64, 64, 64, -64, -64, -64, 64, 64, 64, -64, -64, 64, 64, 64, 64, 64, 64, 64, -64, 64, -64, 64, -64, -64, -64, 64, -64, -64, -64, -64, 64, -64, -64, 64, -64, 64, 64, 64, 64, 64, 64, 64, -64, 64, -64, -64, 64, 64, 64, 64, 64, -64, -64, -64, -64, -64, 64, -64, 64, -64, -64, -64, 64, 64, 64, 64, 64, 64, -64, -64, -64, -64, -64, -64, -64, -64, 64, 64, 64, -64, 64, 64, 64, -64, -64, 64, 64, -64, 64, -64, 64, 64, 64, 64, -64, -64, -64, -64, -64, -64, -64, -64, 64, 64, 64, 64, -64, -64, 64, 64, -64, -64, 64, -64, 64, 64, 64, -64, 64, 64, 64, -64, 64, 64, -64, -64, -64, -64, -64, -64, -64, 64, 64, 64, 64, 64, 64, 64, -64, -64, 64, 64, 64, 64, 64, -64, 64, 64, 64, -64, -64, -64, -64, -64, -64, -64, -64, 64, 64, -64, 64, 64, 64, 64, -64, -64, -64, -64, -64, -64, -64, -64, -64, 64, 64, 64, 64, -64, -64, -64, -64, -64, 64, 64, 64, 64, 64, 64, 64, 64, 64, 64, -64, -64, -64, -64, -64, 64, 64, -64, -64, 64, -64, 64, -64, -64, -64, -64, -64, -64, 64, 64, -64, 64, -64, 64, 64, 64, 64, 64, -64, -64, -64, -64, -64, 64, 64, -64, -64, -64, -64, 64, 64, -64, -64, -64, -64, -64, -64, 64, -64, -64, -64, 64, 64, 64, 64, 64, 64, 64, -64, -64, -64, -64, -64, -64, 64, -64, 64, 64, 64, -64, -64, -64, -64, -64, 64, -64, -64, -64, -64, -64, -64, 64, 64, 64, -64, -64, -64, 64, 64, -64, 64, 64, 64, 64, 64, 64, 64, -64, -64, 64, -64, 64, -64, -64, -64, -64, -64, -64, -64, 64, 64, 64, 64, 64, 64, 64, -64, -64, -64, -64, -64, 64, 64, 64, 64, 64, 64, 64, -64, 64, -64, 64, -64, -64, -64, -64, -64, -64, 64, 64, 64, 64, 64, -64, -64, -64, 64, 64, -64, 64, 64, 64, 64, 64, 64, 64, 64, 64, 64, -64, -64, -64, -64, 64, 64, 64, 64, 64, 64, -64, 64, 64, -64, -64, -64, 64, 64, 64, 64, 64, 64, 64, 64, 64, 64, 64, 64, 64, 64, 64, -64, -64, 64, 64, 64, 64, 64, 64, 64, -64, 64, 64, -64, 64, -64, 64, 64, 64, 64, 64, 64, 64, 64, 64, 64, 64, -64, 64, 64, 64, -64, 64, 64, 64, 64, 64, -64, -64, 64, 64, -64, -64, 64, -64, 64, 64, 64, 64, 64, 64, 64, 64, 64, 64, 64, 64, 64, 64, 64, 64, -64, -64, 64, -64, -64, -64, 64, 64, -64, 64, 64, 64, -64, 64, 64, 64, -64, 64, 64, 64, -64, -64, 64, 64, -64, 64, -64, -64, -64, -64, -64, -64, -64, -64, -64, 64, 64, -64, -64, 64, 64, 64, 64, 64, -64, -64, -64, -64, 64, 64, 64, 64, -64, -64, -64, -64, -64, 64, -64, -64, -64, -64, 64, 64, 64, -64, -64, -64, 64, 64, 64, 64, 64, -64, -64, -64, 64, -64, -64, -64, 64, -64, 64, -64, -64, -64, 64, 64, 64, 64, -64, 64, 64, -64, 64, 64, -64, -64, -64, -64, -64, -64, -64, -64, 64, 64, -64, -64, -64, -64, -64, -64, -64, 64, -64, -64, 64, 64, 64, 64, 64, -64, 64, 64, 64, 64, -64, -64, -64, -64, -64, 64, 64, 64, -64, 64, 64, 64, -64, -64, -64, -64, 64, -64, -64, -64, -64, -64, 64, -64, -64, 64, 64, 64, -64, -64, -64, 64, -64, 64, -64, -64, 64, 64, -64, -64, 64, -64, 64, 64, 64, 64, -64, 64, 64, -64, -64, 64, -64, 64, -64, -64, 64, 64, 64, -64, 64, 64, 64, -64, -64, 64, 64, -64, 64, -64, 64, -64, -64, 64, -64, 64, -64, -64, 64, -64, 64, -64, -64, 64, 64, -64, -64, -64, -64, 64, 64, -64, 64, -64, 64, -64, 64, -64, 64, -64, -64, -64, -64, -64, 64, -64, 64, -64, -64, 64, 64, -64, 64, 64, 64, 64, -64, -64, 64, -64, -64, -64, -64, -64, -64, 64, 64, 64, -64, -64, -64, -64, -64, -64, 64, -64, 64, -64, -64, 64, -64, 64, -64, -64, -64, -64, -64, -64, -64, -64, 64, -64, -64, -64, 64, 64, 64, 64, 64, 64, -64, 64, -64, 64, 64, 64, -64, -64, -64, 64, -64, -64, -64, -64, -64, -64, -64, 64, 64, 64, -64, 64, 64, -64, 64, -64, -64, 64, 64, 64, -64, 64, 64, 64, 64, -64, -64, -64, -64, -64, -64, -64, -64, 64, 64, 64, 64, 64, -64, 64, -64, 64, -64, 64, -64, -64, 64, 64, 64, -64, -64, 64, -64, -64, -64, -64, -64, -64, -64, -64, -64, 64, -64, 64, 64, -64, -64, -64, -64, -64, -64, 64, -64, 64, 64, 64, 64, 64, -64, 64, -64, -64, -64, -64, -64, -64, -64, -64, 64, 64, 64, 64, 64, 64, 64, -64, -64, -64, -64, 64, 64, 64, 64, 64, 64, 64, -64, 64, -64, -64, -64, -64, -64, 64, -64, 64, 64, 64, 64, -64, -64, 64, -64, 64, 64, 64, 64, 64, 64, 64, 64, 64, 64, -64, -64, 64, -64, -64, -64, -64, -64, -64, 64, 64, 64, 64, 64, -64, -64, -64, 64, 64, -64, 64, -64, -64, 64, 64, 64, 64, -64, -64, -64, -64, -64, -64, -64, -64, 64, -64, 64, 64, 64, 64, 64, -64, -64, -64, -64, 64, 64, 64, 64, 64, 64, 64, 64, 64, 64, -64, 64, 64, -64, -64, -64, -64, 64, -64, -64, 64, 64, 64, 64, -64, -64, -64, -64, -64, -64, -64, -64, 64, 64, 64, 64, 64, -64, 64, 64, -64, 64, -64, 64, -64, -64, -64, -64, 64, 64, 64, 64, 64, -64, -64, 64, -64, -64, -64, -64, 64, 64, 64, -64, 64, -64, -64, -64, -64, -64, -64, -64, -64, -64, -64, -64, 64, 64, 64, 64, 64, 64, -64, -64, -64, 64, -64, -64, -64, -64, -64, -64, -64, 64, 64, -64, 64, -64, 64, -64, -64, -64, -64, -64, 64, 64, -64, -64, 64, 64, -64, -64, 64, 64, 64, -64, -64, 64, 64, -64, -64, -64, 64, 64, 64, -64, -64, 64, -64, -64, -64, 64, -64, 64, -64, -64, 64, -64, -64, -64, -64, 64, 64, -64, -64, -64, 64, 64, -64, -64, -64, -64, 64, -64, -64, -64, 64, -64, -64, -64, -64, -64, -64, 64, -64, -64, -64, -64, -64, -64, -64, -64, -64, -64, 64, -64, -64, -64, -64, 64, 64, -64, -64, 64, -64, -64, -64, 64, -64, -64, -64, -64, 64, 64, -64, -64, -64, -64, -64, -64, -64, -64, -64, -64, -64, -64, 64, 64, -64, -64, -64, -64, 64, -64, 64, 64, 64, 64, -64, 64, -64, -64, -64, -64, -64, -64, -64, -64, -64, -64, -64, -64, 64, 64, 64, -64, 64, -64, -64, 64, 64, 64, -64, 64, -64, -64, -64, -64, -64, -64, -64, 64, -64, -64, -64, -64, -64, 64, -64, 64, -64, -64, 64, 64, -64, -64, -64, -64, 64, -64, 64, -64, 64, 64, -64, 64, -64, -64, -64, -64, 64, 64, -64, -64, -64, -64, 64, 64, 64, 64, 64, -64, -64, -64, -64, -64, -64, -64, -64, 64, 64, 64, 64, -64, -64, 64, -64, -64, 64, -64, -64, -64, -64, -64, 64, 64, 64, -64, 64, 64, 64, -64, -64, -64, -64, -64, -64, 64, 64, 64, 64, 64, 64, -64, -64, -64, -64, -64, -64, -64, -64, -64, 64, 64, -64, 64, -64, -64, -64, -64, -64, 64, -64, -64, -64, 64, 64, 64, 64, 64, 64, 64, 64, 64, -64, -64, -64, -64, -64, -64, 64, 64, -64, 64, -64, 64, -64, 64, -64, -64, -64, -64, -64, -64, 64, -64, 64, 64, 64, 64, 64, -64, -64, 64, 64, -64, -64, 64, 64, -64, -64, -64, 64, 64, 64, -64, -64, -64, -64, -64, -64, -64, 64, -64, 64, 64, 64, -64, -64, -64, 64, 64, 64, 64, 64, 64, -64, -64, -64, -64, -64, 64, -64, 64, -64, -64, -64, -64, -64, -64, -64, -64, 64, -64, -64, -64, -64, 64, 64, 64, 64, 64, -64, -64, 64, 64, 64, 64, -64, -64, 64, -64, -64, -64, -64, 64, -64, -64, -64, -64, -64, -64, -64, 64, -64, -64, 64, 64, -64, 64, 64, 64, 64, 64, -64, -64, -64, -64, -64, -64, -64, 64, 64, 64, -64, 64, -64, -64, -64, 64, -64, 64, -64, 64, 64, -64, -64, 64, -64, 64, -64, -64, 64, 64, 64, 64, -64, 64, -64, 64, -64, 64, -64, 64, 64, 64, 64, 64, -64, -64, 64, 64, -64, -64, 64, 64, 64, -64, 64, 64, -64, 64, 64, -64, -64, 64, 64, -64, 64, -64, -64, -64, 64, 64, -64, -64, 64, 64, 64, 64, 64, 64, 64, -64, 64, -64, -64, -64, 64, -64, -64, -64, 64, -64, -64, -64, -64, -64, 64, -64, -64, 64, -64, -64, -64, 64, -64, 64, 64, 64, 64, 64, 64, 64, 64, -64, -64, -64, -64, -64, -64, 64, 64, 64, 64, -64, 64, -64, -64, 64, -64, -64, -64, -64, -64, 64, 64, 64, 64, 64, 64, 64, -64, 64, -64, -64, -64, -64, 64, 64, 64, 64, 64, 64, -64, -64, -64, 64, 64, 64, -64, 64, 64, 64, 64, 64, 64, 64, 64, 64, -64, -64, -64, -64, 64, -64, 64, 64, -64, 64, 64, 64, -64, 64, -64, 64, 64, -64, -64, 64, 64, 64, 64, 64, -64, -64, -64, -64, 64, -64, -64, 64, -64, -64, 64, 64, -64, 64, 64, -64, 64, 64, 64, 64, -64, -64, 64, 64, 64, 64, -64, -64, 64, -64, -64, -64, -64, -64, -64, 64, 64, -64, -64, 64, 64, -64, -64, -64, 64, -64, -64, -64, -64, -64, 64, 64, 64, -64, -64, 64, -64, -64, 64, -64, -64, -64, -64, 64, 64, 64, 64, 64, 64, 64, -64, 64, 64, -64, -64, 64, 64, -64, 64, 64, -64, -64, -64, -64, -64, -64, -64, -64, -64, -64, 64, -64, -64, -64, -64, 64, 64, 64, 64, 64, -64, -64, -64, 64, 64, 64, 64, 64, -64, 64, -64, -64, -64, 64, -64, -64, -64, 64, 64, -64, 64, -64, 64, 64, 64, 64, -64, 64, 64, 64, -64, 64, 64, 64, 64, 64, 64, -64, -64, -64, 64, 64, 64, -64, 64, -64, -64, -64, -64, 64, 64, 64, 64, 64, -64, 64, -64, 64, 64, 64, 64, 64, 64, 64, 64, 64, -64, 64, 64, 64, 64, 64, 64, 64, -64, -64, -64, 64, 64, 64, 64, 64, 64, 64, 64, 64, 64, 64, -64, -64, 64, 64, 64, 64, -64, 64, 64, 64, -64, 64, 64, -64, 64, 64, -64, 64, 64, -64, -64, 64, 64, -64, -64, 64, 64, 64, 64, 64, 64, 64, 64, 64, 64, 64, 64, 64, -64, 64, -64, -64, -64, -64, -64, 64, 64, 64, -64, 64, -64, 64, 64, 64, 64, 64, 64, 64, -64, -64, 64, 64, 64, 64, 64, 64, 64, -64, 64, -64, -64, -64, 64, -64, -64, 64, 64, 64, 64, 64, 64, 64, -64, 64, -64, -64, -64, -64, -64, -64, -64, 64, 64, -64, 64, -64, -64, -64, -64, 64, -64, 64, 64, -64, -64, -64, 64, 64, 64, 64, 64, 64, -64, -64, -64, -64, 64, 64, 64, 64, 64, 64, 64, -64, -64, -64, -64, 64, -64, 64, -64, -64, 64, 64, 64, 64, 64, 64, 64, 64, -64, 64, -64, 64, 64, 64, 64, 64, 64, 64, 64, 64, -64, -64, -64, -64, -64, -64, 64, 64, -64, 64, 64, 64, 64, 64, 64, 64, -64, 64, -64, 64, 64, 64, 64, 64, 64, -64, 64, -64, 64, -64, -64, 64, 64, -64, 64, -64, -64, -64, 64, 64, 64, 64, 64, 64, -64, 64, 64, 64, 64, -64, 64, 64, 64, -64, -64, -64, 64, 64, -64, 64, 64, -64, -64, -64, -64, -64, 64, 64, 64, 64, -64, -64, -64, 64, 64, 64, -64, 64, 64, 64, 64, -64, 64, -64, -64, -64, -64, -64, 64, 64, -64, -64, -64, -64, -64, 64, 64, 64, -64, 64, 64, 64, 64, 64, -64, 64, 64, -64, 64, 64, 64, 64, 64, -64, -64, 64, -64, -64, 64, -64, -64, 64, 64, 64, -64, -64, -64, -64, 64, 64, 64, 64, -64, -64, 64, 64, 64, 64, 64, 64, 64, -64, 64, 64, 64, -64, -64, -64, 64, 64, -64, 64, -64, -64, -64, 64, -64, 64, -64, -64, 64, -64, -64, -64, 64, -64, -64, 64, -64, 64, 64, 64, 64, 64, 64, -64, 64, 64, 64, 64, -64, -64, 64, 64, 64, 64, 64, -64, -64, -64, 64, -64, 64, 64, 64, 64, 64, 64, 64, 64, -64, 64, -64, 64, -64, 64, 64, 64, 64, 64, 64, 64, -64, -64, 64, 64, 64, 64, 64, 64, 64, 64, -64, -64, 64, 64, 64, -64, -64, -64, 64, -64, 64, 64, 64, -64, -64, 64, -64, 64, 64, 64, 64, -64, 64, 64, 64, -64, 64, -64, -64, 64, 64, -64, -64, -64, -64, 64, 64, 64, -64, 64, 64, 64, 64, 64, -64, -64, 64, -64, 64, 64, 64, -64, 64, -64, -64, -64, 64, 64, 64, 64, 64, 64, -64, 64, -64, -64, 64, -64, 64, 64, -64, -64, -64, 64, -64, 64, -64, 64, 64, 64, -64, -64, 64, 64, -64, 64, -64, -64, -64, -64, 64, 64, -64, 64, -64, -64, 64, 64, -64, -64, 64, 64, -64, -64, -64, -64, -64, -64, -64, 64, -64, 64, 64, 64, -64, -64, 64, -64, -64, -64, -64, -64, 64, 64, 64, -64, 64, -64, 64, 64, -64, 64, -64, -64, -64, -64, -64, -64, -64, 64, 64, -64, 64, -64, -64, -64, 64, 64, -64, -64, -64, 64, -64, -64, 64, -64, 64, -64, -64, -64, -64, -64, 64, -64, -64, 64, 64, 64, 64, 64, 64, 64, 64, -64, -64, -64, -64, -64, -64, -64, -64, -64, -64, -64, -64, -64, -64, -64, -64, -64, -64, -64, -64, 64, 64, 64, 64, 64, 64, 64, 64, 64, 64, -64, 64, -64, 64, 64, -64, 64, -64, -64, -64, -64, -64, -64, -64, -64, -64, 64, -64, -64, 64, 64, 64, 64, 64, 64, 64, 64, -64, -64, -64, -64, -64, 64, -64, -64, -64, -64, -64, -64, -64, -64, -64, -64, 64, 64, 64, -64, -64, 64, 64, -64, -64, 64, 64, -64, 64, 64, 64, 64, -64, 64, 64, -64, -64, -64, -64, -64, -64, -64, -64, -64, 64, 64, -64, 64, -64, 64, -64, -64, 64, 64, -64, -64, -64, -64, 64, 64, -64, 64, -64, 64, -64, -64, -64, -64, -64, -64, -64, 64, 64, -64, 64, -64, -64, 64, -64, 64, -64, 64, 64, 64, 64, -64, -64, -64, 64, -64, 64, -64, -64, 64, -64, -64, -64, -64, 64, 64, 64, -64, -64, -64, -64, 64, -64, 64, 64, -64, -64, -64, -64, 64, -64, -64, 64, -64, -64, -64, -64, -64, -64, -64, -64, 64, 64, 64, 64, 64, -64, -64, -64, -64, -64, 64, 64, 64, 64, 64, 64, -64, -64, -64, -64, 64, 64, -64, -64, -64, 64, 64, 64, 64, 64, -64, -64, 64, -64, -64, -64, -64, -64, 64, 64, 64, -64, -64, -64, -64, -64, 64, -64, 64, 64, -64, -64, -64, -64, 64, 64, 64, -64, -64, -64, -64, -64, -64, -64, -64, 64, 64, 64, -64, -64, -64, 64, -64, 64, -64, -64, -64, 64, -64, 64, 64, -64, -64, 64, 64, -64, -64, -64, -64, -64, -64, -64, -64, -64, -64, 64, -64, 64, 64, 64, 64, -64, -64, -64, 64, -64, -64, 64, 64, -64, 64, -64, -64, -64, -64, -64, -64, -64, 64, -64, -64, -64, -64, -64, 64, 64, -64, 64, -64, 64, -64, 64, 64, -64, 64, -64, -64, -64, 64, 64, -64, 64, 64, -64, -64, -64, -64, -64, -64, -64, -64, -64, 64, 64, 64, -64, -64, -64, -64, -64, 64, 64, 64, -64, -64, -64, 64, 64, -64, -64, -64, -64, -64, -64, -64, -64, -64, -64, -64, -64, 64, 64, -64, 64, 64, -64, -64, -64, 64, -64, -64, -64, -64, 64, 64, 64, -64, -64, -64, -64, -64, -64, -64, 64, 64, -64, -64, 64, -64, -64, 64, -64, 64, -64, -64, -64, 64, 64, -64, -64, -64, 64, 64, 64, -64, -64, -64, -64, -64, -64, -64, -64, -64, -64, -64, -64, -64, -64, -64, 64, -64, 64, -64, -64, -64, -64, -64, -64, -64, 64, 64, -64, -64, -64, -64, -64, -64, -64, -64, 64, 64, -64, -64, -64, -64, -64, -64, 64, 64, -64, 64, 64, -64, 64, -64, -64, -64, -64, 64, -64, 64, -64, -64, -64, -64, -64, -64, -64, 64, 64, 64, -64, -64, -64, 64, 64, -64, 64, -64, 64, 64, -64, -64, -64, -64, 64, 64, -64, -64, -64, 64, -64, -64, -64, 64, -64, -64, -64, 64, -64, -64, -64, -64, -64, 64, -64, -64, 64, 64, -64, -64, 64, 64, 64, -64, -64, -64, 64, -64, -64, 64, 64, -64, -64, 64, 64, 64, -64, 64, -64, 64, 64, -64, -64, -64, 64, 64, -64, 64, -64, 64, -64, -64, 64, -64, 64, -64, 64, -64, -64, -64, -64, 64, 64, 64, 64, -64, -64, -64, -64, 64, 64, 64, -64, -64, 64, -64, -64, 64, -64, 64, -64, -64, 64, -64, -64, 64, 64, -64, 64, -64, 64, -64, -64, 64, -64, -64, 64, 64, 64, -64, -64, -64, -64, 64, -64, -64, -64, -64, -64, -64, -64, 64, -64, -64, -64, -64, -64, 64, 64, 64, -64, 64, 64, 64, -64, 64, -64, -64, -64, -64, 64, 64, -64, 64, 64, -64, -64, 64, 64, -64, -64, -64, -64, 64, -64, -64, -64, 64, 64, -64, 64, 64, 64, -64, -64, 64, 64, -64, 64, 64, 64, -64, 64, 64, 64, -64, 64, 64, -64, 64, -64, -64, -64, 64, 64, 64, 64, 64, 64, -64, 64, 64, -64, -64, 64, -64, -64, -64, -64, -64, 64, 64, -64, 64, -64, -64, -64, -64, 64, 64, -64, 64, -64, 64, -64, -64, -64, -64, 64, 64, 64, 64, -64, 64, 64, 64, -64, -64, 64, 64, -64, 64, -64, 64, 64, 64, 64, 64, 64, 64, -64, -64, 64, -64, -64, 64, 64, -64, 64, 64, -64, 64, -64, -64, 64, 64, 64, 64, 64, 64, -64, 64, 64, 64, 64, 64, 64, -64, 64, 64, 64, -64, 64, 64, -64, -64, 64, 64, -64, 64, 64, -64, 64, -64, -64, 64, -64, 64, -64, 64, -64, -64, 64, 64, -64, -64, -64, 64, 64, 64, -64, 64, -64, -64, -64, 64, 64, 64, 64, 64, -64, 64, -64, -64, -64, 64, -64, -64, -64, 64, -64, -64, -64, -64, -64, -64, 64, -64, -64, 64, -64, -64, -64, -64, -64, -64, 64, 64, 64, 64, -64, -64, -64, -64, -64, -64, -64, 64, 64, -64, -64, -64, -64, 64, 64, -64, -64, 64, -64, 64, -64, 64, -64, -64, 64, -64, -64, -64, 64, -64, -64, -64, -64, -64, -64, -64, -64, -64, -64, -64, -64, -64, -64, -64, 64, 64, 64, -64, 64, 64, -64, -64, 64, -64, -64, 64, -64, -64, -64, -64, -64, 64, -64, 64, -64, -64, -64, -64, -64, 64, -64, -64, 64, -64, 64, 64, -64, -64, 64, -64, -64, -64, -64, -64, -64, -64, -64, -64, -64, -64, -64, -64, 64, 64, 64, -64, -64, 64, -64, -64, 64, -64, 64, 64, -64, 64, -64, -64, -64, -64, -64, 64, -64, -64, -64, -64, 64, 64, -64, 64, -64, -64, -64, -64, 64, 64, 64, 64, 64, 64, 64, 64, 64, 64, -64, 64, -64, 64, -64, -64, -64, -64, -64, 64, -64, -64, 64, 64, -64, -64, -64, -64, 64, -64, 64, -64, 64, -64, 64, -64, 64, 64, 64, 64, -64, -64, -64, -64, -64, -64, -64, -64, -64, -64, -64, -64, 64, -64, -64, -64, -64, 64, 64, -64, -64, 64, 64, -64, -64, 64, -64, -64, 64, -64, -64, -64, -64, -64, -64, -64, 64, 64, -64, -64, -64, -64, 64, 64, 64, 64, -64, -64, -64, -64, 64, -64, -64, -64, -64, -64, -64, -64, 64, -64, -64, -64, -64, -64, 64, -64, -64, -64, -64, -64, -64, -64, 64, -64, -64, -64, -64, 64, -64, -64, 64, -64, 64, 64, -64, 64, -64, 64, -64, -64, -64, 64, 64, -64, -64, -64, -64, -64, -64, -64, -64, 64, 64, 64, 64, 64, 64, 64, -64, 64, 64, -64, -64, -64, -64, 64, -64, -64, 64, 64, 64, -64, -64, -64, -64, -64, -64, -64, 64, -64, -64, -64, -64, 64, 64, -64, 64, 64, -64, -64, -64, 64, 64, 64, 64, 64, 64, 64, 64, -64, -64, -64, -64, -64, -64, -64, -64, -64, 64, 64, 64, -64, 64, 64, -64, -64, 64, -64, -64, 64, 64, -64, -64, 64, 64, 64, -64, -64, 64, -64, -64, 64, -64, -64, -64, -64, 64, 64, -64, 64, 64, 64, 64, -64, -64, -64, -64, -64, 64, -64, -64, 64, -64, -64, -64, -64, -64, -64, 64, -64, -64, 64, -64, 64, -64, -64, 64, 64, -64, 64, -64, 64, 64, -64, -64, -64, -64, -64, 64, 64, -64, 64, -64, -64, 64, -64, 64, 64, 64, -64, 64, 64, 64, 64, -64, 64, -64, -64, -64, -64, 64, -64, -64, -64, -64, -64, 64, -64, -64, -64, 64, 64, -64, 64, -64, 64, -64, 64, -64, 64, 64, 64, 64, 64, -64, 64, -64, 64, 64, 64, -64, -64, -64, -64, -64, -64, -64, -64, -64, -64, -64, -64, 64, 64, 64, 64, -64, 64, -64, -64, -64, -64, -64, 64, -64, -64, 64, 64, 64, 64, -64, -64, -64, -64, -64, -64, -64, -64, 64, -64, -64, -64, 64, -64, -64, 64, 64, -64, -64, -64, 64, -64, 64, -64, 64, -64, 64, 64, -64, -64, -64, -64, -64, -64, -64, -64, -64, -64, 64, -64, 64, 64, 64, 64, -64, 64, -64, 64, 64, 64, 64, 64, -64, -64, -64, -64, -64, -64, 64, -64, -64, 64, 64, 64, 64, -64, 64, 64, -64, -64, -64, 64, 64, 64, -64, 64, -64, 64, 64, 64, 64, 64, -64, -64, 64, 64, -64, 64, 64, -64, 64, 64, -64, -64, 64, 64, 64, -64, -64, -64, -64, -64, 64, 64, 64, -64, -64, 64, 64, 64, -64, 64, -64, -64, -64, -64, -64, -64, -64, 64, -64, -64, 64, -64, -64, -64, 64, 64, -64, -64, 64, -64, -64, 64, 64, -64, 64, 64, 64, 64, 64, 64, 64, -64, -64, -64, -64, 64, 64, 64, 64, -64, -64, 64, -64, 64, -64, -64, -64, -64, 64, -64, 64, 64, -64, 64, -64, 64, -64, -64, -64, -64, 64, 64, 64, -64, 64, -64, -64, -64, -64, 64, 64, 64, 64, 64, -64, -64, -64, -64, -64, 64, 64, -64, -64, -64, 64, 64, 64, -64, 64, 64, 64, -64, -64, 64, 64, -64, -64, 64, 64, 64, 64, -64, 64, -64, -64, 64, -64, 64, 64, -64, -64, -64, 64, 64, -64, -64, -64, 64, 64, 64, 64, 64, 64, -64, 64, 64, 64, -64, 64, -64, 64, -64, 64, -64, -64, -64, 64, 64, -64, 64, 64, 64, 64, -64, -64, 64, 64, 64, 64, 64, -64, -64, -64, 64, -64, -64, 64, 64, 64, -64, 64, 64, 64, 64, -64, -64, 64, 64, -64, -64, -64, -64, 64, 64, 64, -64, 64, -64, 64, -64, 64, 64, 64, 64, 64, 64, 64, -64, -64, 64, -64, 64, -64, -64, -64, 64, -64, 64, 64, 64, -64, 64, 64, -64, -64, 64, 64, 64, 64, 64, 64, 64, 64, -64, -64, 64, -64, 64, 64, 64, -64, 64, 64, 64, 64, 64, -64, 64, -64, 64, 64, 64, -64, -64, -64, -64, 64, -64, -64, -64, 64, 64, -64, -64, 64, -64, 64, 64, 64, 64, 64, 64, -64, 64, 64, 64, 64, -64, -64, -64, 64, 64, 64, 64, -64, 64, 64, 64, -64, -64, -64, 64, 64, -64, 64, 64, 64, 64, 64, -64, 64, -64, 64, 64, -64, 64, -64, 64, 64, 64, -64, 64, 64, 64, 64, 64, -64, 64, 64, -64, -64, 64, 64, 64, 64, -64, -64, 64, 64, 64, -64, 64, 64, 64, 64, -64, -64, 64, -64, -64, -64, 64, -64, 64, -64, -64, -64, 64, -64, -64, 64, -64, -64, -64, 64, -64, -64, 64, 64, 64, 64, 64, -64, -64, 64, -64, 64, -64, -64, 64, 64, 64, 64, -64, -64, 64, 64, -64, 64, 64, 64, 64, 64, 64, 64, 64, 64, 64, 64, 64, -64, -64, -64, 64, 64, -64, -64, 64, 64, 64, 64, -64, 64, 64, 64, 64, 64, 64, -64, -64, -64, -64, -64, -64, 64, 64, 64, 64, 64, 64, 64, 64, 64, 64, 64, 64, 64, 64, -64, 64, -64, -64, 64, -64, 64, 64, 64, -64, -64, 64, -64, -64, 64, 64, -64, 64, 64, 64, 64, 64, -64, -64, 64, 64, 64, -64, -64, -64, -64, 64, -64, 64, 64, 64, 64, 64, -64, -64, 64, 64, 64, 64, 64, 64, -64, -64, -64, 64, 64, -64, 64, 64, 64, 64, -64, -64, -64, 64, -64, -64, 64, 64, -64, -64, -64, -64, 64, 64, 64, -64, 64, -64, -64, -64, -64, 64, 64, -64, 64, 64, 64, 64, -64, 64, -64, -64, 64, 64, -64, 64, 64, 64, -64, -64, 64, -64, 64, -64, -64, -64, 64, 64, 64, -64, 64, 64, 64, 64, -64, 64, -64, -64, -64, -64, 64, -64, 64, 64, 64, 64, 64, 64, 64, 64, 64, 64, 64, 64, -64, -64, 64, 64, 64, 64, 64, 64, 64, 64, -64, 64, 64, -64, -64, 64, -64, 64, 64, 64, 64, -64, 64, -64, -64, 64, 64, 64, 64, -64, -64, 64, 64, 64, 64, 64, 64, 64, 64, -64, -64, 64, 64, -64, 64, 64, 64, 64, -64, 64, 64, -64, -64, 64, 64, 64, 64, -64, 64, 64, 64, 64, 64, 64, 64, -64, -64, 64, 64, -64, -64, -64, 64, 64, 64, 64, -64, -64, 64, 64, 64, 64, 64, 64, 64, 64, 64, 64, 64, 64, 64, 64, 64, -64, -64, 64, 64, 64, -64, 64, 64, -64, -64, 64, 64, -64, -64, 64, 64, 64, 64, 64, 64, 64, 64, 64, -64, 64, -64, 64, 64, -64, -64, -64, 64, 64, -64, 64, -64, 64, -64, -64, 64, -64, -64, -64, 64, 64, -64, 64, 64, 64, 64, 64, 64, 64, 64, -64, -64, -64, -64, 64, -64, 64, 64, 64, 64, -64, 64, 64, 64, -64, 64, -64, 64, -64, 64, -64, 64, 64, 64, 64, -64, -64, -64, -64, 64, -64, 64, -64, 64, 64, 64, -64, 64, 64, -64, -64, -64, 64, -64, 64, 64, 64, 64, 64, 64, -64, -64, -64, 64, -64, -64, -64, -64, 64, -64, 64, 64, -64, -64, -64, 64, -64, -64, -64, -64, 64, -64, -64, -64, 64, 64, -64, -64, -64, -64, -64, 64, 64, -64, 64, -64, -64, 64, -64, -64, -64, -64, 64, -64, 64, 64, -64, 64, -64, -64, 64, -64, -64, -64, 64, 64, -64, -64, 64, 64, -64, -64, 64, -64, 64, -64, 64, 64, 64, -64, -64, 64, 64, 64, 64, 64, 64, 64, -64, -64, 64, 64, -64, -64, -64, 64, -64, 64, 64, -64, 64, 64, 64, -64, 64, -64, 64, 64, 64, 64, -64, -64, -64, -64, 64, -64, -64, 64, 64, -64, -64, 64, -64, -64, 64, 64, -64, -64, -64, -64, 64, -64, -64, 64, -64, 64, -64, 64, -64, 64, 64, -64, -64, -64, -64, 64, -64, 64, 64, 64, 64, -64, 64, -64, 64, -64, -64, -64, 64, -64, 64, 64, 64, -64, -64, 64, -64, 64, -64, 64, 64, -64, 64, 64, -64, -64, -64, -64, -64, 64, -64, -64, 64, -64, 64, -64, 64, -64, 64, -64, -64, -64, -64, -64, -64, -64, -64, 64, 64, -64, -64, -64, 64, 64, 64, -64, -64, -64, -64, 64, 64, 64, -64, 64, -64, 64, 64, -64, -64, -64, -64, -64, 64, 64, -64, -64, -64, 64, 64, -64, 64, 64, -64, -64, 64, -64, -64, 64, -64, 64, 64, 64, 64, 64, -64, 64, 64, 64, -64, -64, 64, 64, 64, -64, 64, 64, -64, 64, 64, 64, -64, 64, 64, 64, -64, 64, 64, 64, 64, 64, 64, -64, 64, 64, 64, 64, -64, 64, 64, 64, -64, -64, 64, 64, 64, 64, 64, -64, -64, 64, 64, 64, 64, 64, 64, 64, -64, 64, 64, 64, 64, -64, -64, 64, -64, 64, 64, -64, 64, 64, -64, 64, 64, 64, 64, 64, -64, 64, 64, 64, 64, 64, 64, 64, 64, -64, -64, -64, -64, -64, 64, -64, -64, -64, -64, -64, -64, 64, 64, 64, 64, 64, 64, -64, 64, 64, -64, -64, -64, -64, -64, -64, 64, -64, -64, -64, 64, 64, -64, -64, -64, 64, -64, 64, 64, -64, 64, 64, 64, 64, 64, 64, 64, 64, 64, 64, -64, -64, 64, 64, -64, -64, -64, -64, 64, 64, 64, 64, -64, -64, -64, 64, 64, 64, 64, -64, 64, 64, -64, -64, -64, 64, -64, 64, 64, 64, 64, 64, 64, -64, 64, 64, -64, -64, 64, 64, 64, 64, 64, -64, 64, 64, 64, 64, 64, 64, 64, 64, 64, 64, 64, 64, 64, 64, 64, 64, -64, 64, 64, 64, 64, 64, -64, -64, 64, 64, -64, -64, -64, 64, -64, -64, 64, 64, -64, 64, 64, 64, 64, 64, -64, -64, 64, 64, 64, 64, 64, 64, -64, 64, 64, -64, 64, 64, 64, 64, 64, 64, 64, 64, 64, -64, -64, 64, 64, -64, -64, 64, 64, 64, 64, 64, -64, 64, -64, -64, 64, 64, 64, 64, 64, -64, 64, -64, 64, -64, 64, -64, -64, -64, -64, -64, -64, 64, -64, 64, 64, 64, 64, -64, 64, 64, 64, 64, -64, -64, 64, 64, -64, -64, 64, 64, 64, 64, -64, -64, 64, 64, 64, 64, 64, -64, -64, 64, 64, 64, 64, 64, 64, 64, -64, 64, -64, -64, -64, 64, 64, 64, -64, 64, -64, -64, -64, 64, 64, 64, 64, 64, -64, 64, -64, -64, -64, -64, 64, 64, -64, -64, 64, 64, -64, 64, -64, 64, -64, -64, -64, 64, 64, 64, -64, 64, 64, 64, 64, 64, 64, 64, 64, 64, -64, 64, 64, 64, 64, 64, -64, -64, 64, -64, -64, 64, -64, 64, -64, 64, 64, 64, 64, 64, -64, 64, -64, 64, 64, 64, 64, 64, 64, 64, 64, -64, 64, 64, 64, -64, -64, -64, 64, 64, 64, 64, 64, 64, 64, -64, 64, 64, 64, 64, -64, -64, 64, 64, -64, 64, -64, 64, 64, 64, 64, -64, 64, 64, -64, -64, 64, 64, -64, -64, -64, -64, 64, 64, -64, 64, 64, 64, 64, 64, 64, 64, -64, 64, 64, 64, 64, 64, -64, 64, 64, -64, 64, 64, -64, 64, -64, 64, -64, -64, 64, 64, 64, -64, 64, -64, 64, -64, 64, 64, -64, -64, 64, 64, -64, 64, 64, -64, 64, 64, 64, -64, -64, 64, -64, 64, -64, -64, -64, -64, 64, 64, 64, -64, -64, 64, 64, 64, -64, -64, 64, 64, 64, -64, -64, -64, 64, 64, -64, 64, 64, 64, -64, -64, -64, 64, -64, 64, 64, 64, 64, 64, 64, 64, 64, 64, -64, 64, 64, -64, 64, -64, -64, 64, 64, 64, -64, -64, 64, 64, -64, -64, 64, -64, 64, -64, -64, -64, -64, -64, 64, 64, 64, -64, 64, -64, 64, -64, 64, 64, -64, 64, 64, 64, 64, 64, 64, 64, -64, -64, -64, -64, -64, -64, 64, 64, 64, 64, 64, 64, 64, -64, 64, 64, -64, 64, 64, -64, -64, -64, 64, 64, -64, 64, -64, -64, 64, -64, 64, -64, 64, -64, 64, 64, 64, 64, -64, -64, 64, -64, -64, 64, -64, -64, 64, 64, -64, 64, 64, 64, -64, -64, 64, 64, 64, 64, 64, 64, 64, 64, -64, -64, 64, 64, 64, 64, -64, -64, 64, -64, 64, 64, 64, 64, 64, -64, 64, -64, 64, 64, -64, -64, 64, 64, -64, -64, -64, 64, -64, -64, -64, -64, -64, -64, -64, -64, -64, -64, -64, 64, -64, 64, 64, -64, 64, -64, 64, -64, -64, 64, -64, -64, -64, 64, -64, -64, -64, -64, 64, 64, -64, 64, -64, -64, -64, -64, -64, 64, -64, -64, -64, -64, -64, 64, -64, 64, 64, 64, -64, 64, 64, 64, -64, -64, 64, -64, 64, 64, 64, 64, 64, 64, 64, -64, 64, -64, -64, -64, -64, -64, -64, -64, -64, 64, 64, -64, -64, -64, -64, 64, 64, 64, 64, 64, 64, 64, -64, 64, -64, 64, 64, -64, -64, -64, -64, -64, -64, -64, -64, -64, 64, 64, 64, -64, -64, 64, 64, 64, 64, 64, 64, 64, 64, 64, 64, 64, 64, 64, 64, 64, -64, -64, -64, -64, -64, -64, -64, -64, 64, 64, -64, -64, 64, -64, 64, 64, 64, 64, 64, 64, -64, 64, 64, 64, -64, 64, -64, 64, -64, -64, -64, -64, -64, -64, -64, -64, 64, 64, -64, 64, 64, -64, 64, -64, 64, -64, 64, 64, 64, 64, 64, 64, 64, -64, 64, 64, 64, -64, -64, -64, -64, -64, -64, -64, -64, -64, -64, 64, 64, -64, 64, 64, -64, 64, -64, -64, -64, -64, -64, -64, 64, 64, 64, 64, 64, -64, -64, -64, -64, -64, -64, -64, -64, -64, -64, 64, 64, 64, -64, -64, -64, -64, -64, -64, -64, -64, -64, -64, 64, 64, 64, 64, 64, -64, -64, -64, -64, -64, -64, -64, -64, -64, -64, 64, 64, -64, 64, -64, -64, -64, -64, -64, -64, -64, 64, -64, 64, 64, 64, 64, 64, -64, -64, -64, -64, -64, -64, -64, -64, -64, 64, 64, -64, -64, 64, -64, -64, -64, -64, -64, -64, -64, 64, 64, 64, 64, 64, 64, 64, -64, -64, -64, -64, 64, -64, -64, -64, -64, -64, -64, -64, 64, 64, 64, -64, 64, -64, -64, 64, 64, 64, 64, 64, 64, 64, 64, 64, -64, -64, -64, -64, -64, 64, 64, -64, 64, -64, 64, -64, 64, -64, 64, 64, -64, -64, -64, 64, 64, -64, -64, 64, 64, 64, 64, 64, -64, -64, 64, 64, -64, 64, 64, 64, 64, 64, 64, 64, -64, 64, 64, 64, -64, -64, 64, -64, -64, 64, 64, -64, 64, 64, -64, 64, -64, -64, -64, -64, -64, 64, -64, 64, 64, 64, 64, -64, -64, 64, 64, -64, 64, -64, 64, -64, -64, 64, -64, -64, 64, 64, 64, 64, -64, -64, 64, 64, 64, -64, -64, -64, 64, 64, 64, 64, 64, 64, -64, -64, -64, 64, -64, 64, -64, -64, -64, -64, -64, 64, -64, -64, -64, -64, 64, 64, 64, 64, 64, 64, 64, 64, 64, -64, -64, 64, -64, -64, -64, 64, -64, 64, 64, -64, -64, 64, 64, 64, -64, 64, -64, -64, 64, 64, 64, 64, 64, 64, 64, 64, -64, -64, 64, 64, -64, -64, -64, -64, 64, 64, -64, -64, -64, 64, 64, -64, -64, -64, -64, -64, 64, -64, -64, -64, -64, 64, 64, -64, -64, -64, -64, -64, -64, -64, -64, -64, 64, 64, -64, -64, -64, 64, 64, 64, 64, 64, 64, 64, -64, -64, -64, 64, 64, -64, 64, -64, -64, 64, -64, 64, -64, -64, -64, 64, 64, -64, -64, -64, -64, 64, 64, 64, 64, 64, -64, -64, 64, 64, -64, -64, -64, 64, 64, 64, 64, 64, 64, -64, -64, -64, -64, -64, -64, -64, 64, -64, -64, -64, -64, 64, 64, 64, 64, 64, -64, -64, -64, -64, 64, -64, 64, -64, -64, -64, 64, -64, 64, 64, -64, -64, -64, -64, -64, -64, -64, -64, -64, -64, 64, -64, 64, -64, -64, -64, 64, -64, 64, -64, 64, -64, 64, -64, -64, -64, -64, -64, 64, -64, -64, -64, 64, -64, -64, -64, -64, -64, 64, 64, 64, 64, -64, -64, 64, -64, -64, 64, -64, 64, -64, 64, 64, 64, -64, 64, 64, -64, 64, -64, -64, -64, -64, 64, 64, 64, 64, 64, 64, -64, -64, 64, -64, -64, -64, 64, -64, -64, 64, -64, 64, -64, -64, 64, -64, 64, -64, 64, 64, 64, -64, 64, 64, -64, -64, -64, -64, -64, -64, -64, 64, -64, -64, 64, -64, 64, -64, -64, -64, -64, 64, -64, -64, -64, -64, 64, 64, 64, 64, 64, -64, -64, -64, -64, 64, 64, -64, 64, -64, 64, 64, 64, -64, -64, 64, -64, -64, 64, -64, -64, -64, 64, 64, 64, 64, -64, -64, -64, -64, 64, -64, 64, -64, 64, 64, 64, 64, 64, 64, -64, 64, -64, 64, -64, 64, 64, 64, 64, -64, 64, -64, -64, -64, 64, -64, 64, -64, 64, -64, -64, -64, 64, -64, 64, -64, -64, 64, -64, 64, -64, -64, -64, 64, 64, 64, 64, 64, -64, -64, -64, 64, -64, -64, -64, -64, 64, -64, -64, -64, -64, 64, 64, -64, 64, 64, 64, -64, -64, -64, -64, 64, -64, 64, 64, 64, -64, 64, -64, -64, -64, -64, -64, -64, 64, 64, 64, -64, -64, -64, 64, -64, -64, -64, 64, -64, 64, 64, 64, 64, 64, 64, -64, 64, 64, -64, 64, 64, 64, -64, -64, 64, 64, 64, -64, 64, 64, 64, 64, 64, -64, -64, -64, -64, 64, -64, 64, 64, -64, -64, 64, 64, 64, 64, -64, -64, -64, -64, -64, 64, -64, 64, -64, -64, 64, 64, -64, 64, 64, 64, 64, 64, 64, -64, -64, -64, -64, -64, 64, 64, 64, -64, -64, -64, -64, -64, -64, 64, -64, -64, -64, 64, 64, 64, 64, 64, 64, 64, 64, -64, 64, -64, -64, -64, 64, -64, 64, 64, -64, -64, -64, 64, 64, 64, -64, 64, 64, 64, 64, -64, 64, 64, 64, 64, 64, 64, 64, 64, -64, -64, 64, 64, 64, -64, -64, -64, 64, -64, 64, 64, 64, 64, 64, 64, 64, 64, 64, 64, 64, 64, 64, 64, 64, 64, 64, -64, 64, -64, -64, 64, -64, -64, -64, -64, -64, 64, -64, 64, -64, -64, 64, 64, -64, 64, -64, 64, -64, 64, 64, 64, -64, 64, 64, 64, 64, 64, 64, -64, -64, -64, -64, -64, -64, 64, -64, 64, -64, -64, 64, -64, -64, -64, -64, -64, -64, 64, 64, 64, -64, -64, 64, 64, 64, -64, 64, -64, -64, 64, -64, 64, 64, 64, -64, 64, -64, -64, -64, 64, -64, -64, -64, -64, -64, 64, 64, -64, 64, 64, 64, 64, -64, -64, 64, 64, -64, -64, 64, 64, 64, 64, -64, -64, -64, -64, -64, 64, 64, -64, -64, 64, 64, 64, -64, -64, 64, 64, 64, 64, 64, -64, -64, -64, -64, -64, 64, 64, 64, 64, -64, -64, -64, 64, 64, 64, 64, 64, 64, 64, 64, 64, -64, -64, -64, -64, 64, 64, -64, 64, -64, -64, 64, -64, -64, 64, -64, -64, -64, -64, 64, 64, 64, 64, 64, 64, 64, 64, 64, 64, -64, -64, 64, -64, -64, -64, -64, 64, 64, -64, -64, 64, -64, -64, -64, -64, -64, -64, 64, 64, 64, 64, 64, 64, 64, 64, 64, -64, -64, 64, -64, 64, 64, 64, -64, -64, 64, 64, 64, -64, -64, -64, 64, -64, 64, -64, 64, 64, 64, 64, 64, 64, 64, -64, 64, -64, -64, 64, -64, -64, 64, 64, 64, -64, -64, -64, 64, -64, -64, 64, 64, -64, -64, 64, 64, 64, 64, 64, 64, 64, 64, -64, -64, -64, -64, -64, -64, -64, 64, 64, 64, -64, 64, 64, -64, -64, 64, 64, -64, 64, -64, 64, 64, 64, 64, 64, 64, 64, 64, 64, -64, -64, -64, -64, -64, 64, 64, 64, 64, -64, 64, 64, 64, -64, 64, 64, -64, -64, -64, 64, 64, 64, 64, 64, 64, 64, 64, 64, 64, -64, -64, -64, -64, 64, 64, -64, -64, 64, 64, 64, 64, -64, 64, 64, 64, 64, 64, 64, 64, 64, 64, 64, 64, 64, 64, -64, -64, -64, -64, -64, 64, 64, 64, 64, 64, 64, 64, 64, 64, -64, 64, -64, 64, 64, 64, -64, 64, -64, 64, -64, 64, -64, 64, -64, -64, -64, -64, 64, -64, 64, 64, 64, 64, -64, -64, 64, 64, 64, 64, 64, -64, 64, 64, -64, 64, 64, -64, -64, 64, -64, -64, -64, -64, 64, 64, 64, 64, -64, 64, -64, 64, 64, 64, -64, 64, 64, 64, 64, 64, -64, 64, -64, -64, 64, 64, -64, -64, -64, 64, -64, 64, 64, 64, 64, 64, 64, 64, -64, 64, 64, 64, 64, 64, -64, 64, 64, 64, 64, 64, 64, -64, 64, 64, -64, -64, -64, -64, 64, 64, 64, 64, -64, 64, 64, 64, -64, -64, -64, -64, 64, 64, 64, 64, 64, -64, 64, 64, 64, 64, 64, -64, -64, -64, 64, 64, 64, 64, 64, -64, -64, 64, 64, 64, 64, -64, 64, -64, 64, 64, -64, -64, -64, -64, 64, 64, 64, 64, -64, 64, -64, 64, 64, 64, -64, 64, 64, -64, -64, -64, -64, 64, 64, 64, 64, 64, -64, 64, 64, 64, 64, -64, -64, 64, -64, 64, 64, -64, 64, 64, -64, 64, -64, -64, -64, -64, -64, -64, -64, 64, 64, 64, -64, 64, -64, 64, -64, 64, 64, -64, 64, 64, -64, 64, 64, -64, -64, -64, -64, 64, -64, -64, 64, -64, -64, 64, -64, -64, 64, -64, 64, 64, 64, -64, 64, 64, 64, -64, -64, -64, 64, 64, 64, 64, -64, -64, 64, 64, -64, -64, -64, 64, 64, 64, -64, 64, -64, -64, -64, -64, 64, -64, -64, -64, -64, -64, 64, -64, 64, -64, 64, -64, 64, -64, 64, 64, 64, -64, -64, -64, 64, 64, -64, -64, 64, 64, 64, -64, 64, -64, -64, 64, -64, 64, 64, -64, -64, 64, -64, -64, -64, 64, -64, -64, 64, 64, 64, 64, -64, 64, -64, -64, -64, 64, 64, 64, -64, 64, 64, 64, 64, 64, -64, 64, 64, -64, -64, -64, 64, 64, 64, 64, 64, 64, 64, 64, -64, 64, -64, 64, -64, -64, -64, -64, -64, -64, 64, -64, 64, -64, -64, -64, -64, -64, -64, 64, -64, -64, -64, 64, 64, 64, 64, 64, 64, 64, -64, 64, -64, 64, 64, 64, -64, 64, -64, -64, 64, -64, -64, -64, -64, -64, -64, -64, 64, -64, -64, 64, 64, 64, 64, 64, 64, 64, 64, 64, 64, -64, 64, 64, 64, -64, 64, -64, -64, -64, -64, -64, -64, -64, 64, -64, 64, 64, -64, 64, -64, 64, 64, 64, 64, 64, 64, 64, 64, 64, 64, 64, 64, 64, -64, -64, -64, -64, -64, -64, -64, -64, 64, 64, 64, 64, -64, -64, 64, -64, 64, 64, 64, 64, 64, -64, -64, -64, 64, 64, -64, 64, 64, 64, -64, -64, -64, -64, -64, -64, -64, 64, 64, -64, -64, -64, -64, 64, -64, 64, -64, 64, 64, -64, 64, 64, 64, -64, 64, -64, 64, -64, -64, -64, -64, -64, -64, -64, 64, 64, 64, 64, -64, -64, -64, -64, -64, 64, -64, -64, -64, -64, -64, -64, -64, -64, 64, -64, -64, -64, -64, -64, -64, -64, -64, -64, 64, 64, 64, -64, -64, -64, -64, -64, -64, -64, -64, 64, -64, -64, 64, -64, -64, 64, 64, 64, -64, -64, -64, -64, -64, -64, -64, -64, 64, -64, 64, 64, -64, -64, -64, -64, -64, -64, 64, 64, 64, -64, 64, -64, 64, -64, 64, 64, 64, -64, -64, -64, -64, -64, -64, -64, -64, 64, 64, 64, -64, -64, -64, -64, -64, -64, -64, -64, -64, -64, 64, 64, 64, -64, -64, -64, 64, -64, -64, -64, -64, -64, -64, -64, -64, 64, 64, -64, -64, -64, -64, 64, -64, 64, -64, -64, -64, -64, 64, 64, -64, -64, 64, 64, 64, -64, -64, -64, -64, -64, -64, 64, 64, 64, 64, -64, -64, -64, 64, -64, -64, -64, -64, 64, -64, -64, 64, -64, -64, -64, 64, -64, 64, -64, -64, -64, -64, -64, -64, 64, 64, -64, 64, 64, -64, -64, -64, -64, -64, -64, -64, -64, -64, -64, -64, 64, -64, 64, -64, 64, -64, -64, -64, 64, -64, 64, 64, 64, 64, -64, 64, 64, -64, -64, -64, -64, -64, -64, -64, -64, -64, -64, -64, -64, -64, -64, -64, 64, 64, -64, 64, 64, 64, 64, 64, 64, -64, -64, -64, -64, -64, -64, -64, -64, -64, -64, -64, -64, -64, -64, 64, -64, 64, -64, -64, -64, 64, -64, -64, 64, 64, 64, 64, -64, -64, -64, -64, -64, 64, -64, 64, -64, -64, 64, -64, -64, -64, 64, -64, -64, -64, -64, 64, 64, -64, -64, 64, 64, 64, 64, 64, -64, -64, -64, -64, 64, 64, 64, -64, -64, 64, -64, -64, 64, 64, 64, -64, -64, 64, -64, 64, -64, 64, 64, 64, 64, 64, 64, 64, 64, 64, -64, -64, 64, 64, -64, -64, -64, 64, -64, -64, 64, 64, 64, 64, 64, -64, 64, 64, -64, -64, -64, 64, 64, 64, 64, 64, 64, 64, 64, 64, 64, 64, -64, -64, 64, 64, 64, -64, 64, 64, 64, -64, 64, -64, 64, -64, -64, -64, -64, 64, 64, 64, 64, 64, 64, -64, 64, -64, 64, -64, -64, -64, 64, -64, -64, 64, -64, -64, 64, -64, 64, 64, -64, 64, -64, -64, -64, 64, 64, 64, 64, -64, -64, 64, -64, -64, -64, -64, -64, -64, -64, -64, -64, -64, -64, -64, 64, 64, 64, -64, -64, -64, -64, -64, -64, -64, -64, -64, 64, 64, -64, 64, 64, 64, -64, -64, -64, -64, -64, -64, -64, -64, -64, -64, -64, -64, 64, -64, 64, -64, -64, -64, -64, -64, -64, -64, -64, -64, -64, -64, -64, -64, -64, 64, 64, -64, -64, 64, -64, 64, 64, -64, -64, 64, 64, 64, 64, 64, -64, 64, 64, -64, 64, -64, -64, 64, 64, 64, -64, -64, -64, -64, -64, -64, -64, 64, -64, 64, 64, -64, 64, 64, 64, 64, -64, -64, -64, -64, -64, -64, -64, -64, -64, -64, 64, -64, 64, -64, -64, 64, -64, -64, -64, -64, 64, 64, 64, -64, 64, -64, 64, -64, -64, 64, -64, 64, 64, -64, 64, -64, 64, -64, -64, 64, 64, -64, -64, -64, -64, 64, -64, 64, 64, -64, -64, -64, -64, 64, -64, 64, 64, -64, -64, -64, 64, 64, -64, -64, 64, 64, -64, 64, 64, 64, 64, -64, -64, 64, 64, -64, -64, 64, -64, -64, 64, 64, 64, 64, 64, -64, -64, -64, -64, 64, -64, 64, 64, 64, 64, 64, -64, 64, -64, -64, -64, -64, 64, -64, -64, -64, -64, 64, 64, -64, -64, -64, -64, 64, -64, -64, -64, -64, 64, 64, -64, 64, 64, 64, 64, -64, -64, -64, 64, 64, -64, 64, 64, 64, 64, -64, -64, 64, -64, 64, 64, 64, 64, -64, -64, -64, 64, 64, 64, -64, 64, -64, 64, 64, 64, 64, -64, -64, 64, 64, 64, 64, -64, 64, -64, -64, -64, 64, 64, -64, 64, 64, 64, 64, 64, 64, -64, 64, 64, 64, -64, 64, 64, 64, -64, 64, 64, 64, -64, 64, -64, -64, -64, 64, 64, 64, -64, 64, -64, -64, 64, 64, -64, -64, 64, 64, -64, -64, -64, 64, 64, 64, 64, 64, 64, 64, -64, 64, 64, 64, 64, -64, -64, 64, -64, 64, -64, -64, 64, 64, 64, 64, 64, 64, -64, 64, -64, 64, -64, -64, 64, 64, 64, -64, 64, -64, 64, 64, 64, -64, -64, 64, -64, -64, -64, 64, -64, -64, 64, -64, 64, -64, 64, -64, 64, -64, 64, -64, 64, 64, 64, 64, -64, -64, 64, -64, 64, -64, -64, 64, 64, 64, 64, 64, 64, -64, 64, 64, 64, -64, -64, -64, 64, 64, 64, -64, 64, 64, 64, 64, 64, 64, 64, 64, 64, -64, 64, 64, -64, 64, 64, 64, -64, 64, -64, 64, 64, 64, 64, 64, -64, 64, 64, -64, -64, 64, 64, -64, 64, -64, 64, -64, -64, -64, 64, 64, 64, 64, 64, -64, 64, 64, 64, 64, 64, -64, 64, 64, 64, 64, 64, 64, 64, 64, 64, 64, 64, 64, -64, -64, 64, 64, 64, 64, -64, -64, 64, -64, 64, -64, 64, -64, -64, 64, 64, 64, 64, 64, 64, -64, -64, 64, 64, 64, 64, -64, -64, -64, -64, -64, 64, 64, 64, -64, -64, 64, 64, 64, 64, 64, -64, 64, 64, 64, 64, 64, 64, -64, 64, -64, -64, 64, -64, 64, -64, -64, -64, -64, 64, 64, -64, 64, -64, 64, -64, -64, -64, 64, 64, 64, 64, 64, 64, 64, 64, -64, -64, -64, 64, -64, 64, -64, -64, -64, -64, 64, 64, -64, 64, -64, 64, 64, 64, 64, 64, 64, -64, 64, 64, -64, 64, 64, 64, 64, 64, 64, 64, -64, 64, -64, -64, 64, 64, 64, 64, 64, 64, -64, -64, -64, -64, 64, 64, 64, -64, 64, 64, -64, 64, 64, 64, 64, -64, 64, 64, 64, 64, 64, -64, -64, 64, -64, -64, 64, 64, 64, -64, -64, 64, -64, 64, 64, -64, 64, 64, 64, 64, -64, 64, 64, 64, -64, 64, 64, 64, 64, 64, 64, 64, -64, -64, -64, 64, -64, 64, -64, -64, -64, -64, 64, -64, 64, 64, 64, 64, 64, 64, 64, 64, 64, 64, 64, 64, 64, -64, 64, -64, -64, -64, 64, 64, 64, -64, -64, 64, -64, 64, 64, 64, 64, 64, 64, 64, 64, 64, 64, 64, 64, 64, 64, 64, 64, -64, 64, -64, 64, -64, 64, -64, -64, -64, 64, 64, 64, -64, -64, 64, -64, 64, -64, 64, 64, -64, 64, 64, 64, -64, 64, 64, -64, 64, 64, -64, -64, 64, 64, -64, -64, -64, 64, 64, 64, -64, -64, -64, 64, 64, 64, 64, 64, -64, 64, -64, 64, 64, -64, -64, -64, -64, -64, -64, -64, 64, -64, -64, -64, 64, 64, 64, 64, -64, 64, 64, 64, 64, 64, -64, 64, 64, -64, 64, 64, -64, 64, 64, -64, -64, 64, 64, 64, 64, -64, 64, 64, -64, -64, -64, 64, -64, -64, 64, -64, -64, 64, -64, -64, 64, 64, -64, -64, 64, 64, -64, 64, -64, 64, 64, -64, 64, 64, -64, 64, 64, -64, 64, 64, -64, 64, 64, 64, 64, -64, -64, 64, -64, 64, 64, 64, 64, 64, -64, -64, 64, -64, 64, -64, -64, 64, 64, -64, 64, 64, -64, 64, 64, 64, -64, 64, 64, -64, -64, 64, 64, 64, -64, 64, 64, -64, 64, -64, 64, -64, -64, 64, -64, -64, 64, -64, -64, 64, 64, -64, 64, 64, -64, -64, 64, 64, 64, 64, -64, -64, -64, -64, -64, -64, -64, 64, -64, -64, 64, -64, 64, -64, 64, 64, 64, -64, -64, 64, -64, 64, -64, 64, 64, -64, -64, 64, 64, -64, 64, 64, 64, 64, 64, -64, 64, -64, 64, 64, 64, -64, -64, -64, -64, -64, -64, -64, -64, -64, 64, -64, 64, 64, 64, -64, -64, 64, 64, 64, -64, -64, -64, 64, -64, 64, -64, 64, 64, -64, -64, -64, 64, 64, -64, 64, -64, -64, 64, 64, -64, -64, -64, -64, 64, 64, 64, -64, -64, -64, -64, -64, 64, 64, -64, -64, 64, 64, -64, -64, -64, -64, 64, -64, -64, 64, 64, 64, -64, 64, -64, 64, 64, 64, -64, -64, 64, 64, 64, 64, -64, -64, -64, -64, -64, -64, -64, -64, 64, -64, -64, 64, 64, 64, 64, -64, 64, 64, 64, -64, 64, 64, 64, -64, -64, 64, 64, 64, 64, 64, 64, 64, 64, -64, 64, -64, -64, -64, -64, 64, -64, -64, -64, 64, 64, 64, -64, -64, 64, -64, -64, 64, -64, 64, 64, 64, -64, -64, 64, 64, -64, -64, 64, 64, -64, -64, -64, 64, 64, 64, 64, -64, -64, 64, 64, 64, -64, 64, -64, -64, -64, -64, 64, 64, 64, -64, -64, 64, 64, -64, 64, 64, -64, -64, -64, -64, -64, -64, -64, -64, -64, -64, 64, 64, -64, -64, -64, -64, -64, -64, -64, -64, 64, -64, -64, -64, -64, 64, -64, -64, -64, -64, 64, -64, -64, 64, -64, -64, -64, -64, 64, -64, 64, 64, 64, -64, -64, 64, -64, 64, 64, 64, -64, -64, 64, -64, -64, 64, -64, 64, 64, -64, -64, -64, -64, -64, 64, 64, -64, -64, -64, -64, 64, -64, -64, -64, -64, 64, 64, 64, 64, -64, -64, 64, -64, -64, -64, 64, 64, -64, -64, -64, -64, -64, 64, 64, -64, -64, 64, -64, -64, -64, -64, -64, -64, 64, 64, 64, 64, 64, 64, -64, 64, -64, 64, 64, -64, -64, -64, 64, -64, -64, 64, 64, 64, -64, -64, -64, -64, -64, 64, -64, -64, 64, 64, 64, 64, -64, 64, 64, -64, -64, -64, -64, -64, 64, 64, -64, -64, 64, 64, 64, -64, -64, -64, -64, -64, -64, -64, -64, 64, -64, 64, -64, -64, -64, 64, -64, -64, 64, 64, 64, -64, -64, -64, -64, 64, 64, 64, -64, -64, -64, -64, -64, -64, 64, -64, 64, -64, -64, 64, 64, -64, 64, 64, -64, 64, 64, 64, -64, -64, -64, -64, -64, 64, 64, -64, -64, -64, -64, -64, -64, -64, 64, -64, -64, -64, 64, -64, -64, -64, -64, -64, 64, 64, -64, -64, 64, 64, -64, 64, -64, -64, 64, -64, -64, -64, -64, -64, -64, -64, -64, -64, -64, 64, 64, -64, -64, 64, -64, 64, 64, -64, -64, -64, 64, -64, -64, 64, -64, -64, 64, -64, -64, -64, -64, -64, -64, -64, -64, -64, -64, -64, -64, 64, -64, -64, 64, 64, 64, -64, -64, 64, 64, 64, 64, -64, -64, -64, -64, -64, -64, -64, -64, -64, -64, -64, -64, -64, 64, -64, 64, -64, 64, 64, 64, 64, 64, -64, -64, -64, 64, 64, -64, -64, 64, -64, 64, 64, 64, -64, 64, -64, -64, -64, -64, -64, -64, 64, 64, 64, 64, 64, 64, -64, 64, -64, -64, -64, -64, 64, 64, 64, 64, -64, 64, 64, 64, 64, -64, -64, -64, -64, -64, 64, -64, -64, 64, -64, -64, 64, 64, -64, -64, -64, -64, -64, -64, 64, -64, 64, 64, -64, -64, 64, -64, 64, 64, -64, -64, -64, -64, -64, -64, 64, 64, 64, 64, 64, -64, -64, 64, 64, -64, 64, 64, -64, -64, 64, 64, 64, 64, 64, 64, -64, -64, -64, -64, -64, -64, -64, 64, 64, -64, 64, -64, 64, -64, -64, 64, 64, 64, 64, 64, 64, 64, -64, -64, -64, 64, 64, 64, -64, -64, -64, -64, 64, -64, -64, -64, 64, -64, 64, -64, 64, -64, -64, -64, -64, -64, 64, 64, -64, 64, 64, -64, -64, 64, 64, -64, 64, -64, -64, 64, 64, -64, -64, 64, 64, 64, 64, -64, 64, 64, 64, 64, 64, 64, -64, -64, -64, -64, -64, 64, 64, 64, 64, 64, -64, 64, -64, -64, -64, -64, -64, 64, -64, 64, -64, -64, 64, 64, -64, 64, -64, -64, -64, -64, -64, -64, -64, -64, 64, 64, -64, -64, -64, -64, -64, -64, -64, 64, 64, 64, 64, -64, -64, 64, 64, -64, 64, 64, 64, 64, 64, -64, -64, -64, -64, -64, 64, 64, -64, -64, -64, -64, -64, -64, -64, 64, 64, 64, -64, 64, 64, -64, 64, 64, 64, 64, -64, 64, -64, 64, -64, -64, -64, 64, 64, -64, -64, 64, -64, -64, -64, 64, 64, 64, 64, 64, 64, 64, -64, -64, 64, -64, -64, -64, -64, 64, -64, 64, 64, -64, -64, -64, 64, 64, -64, -64, -64, 64, 64, -64, -64, 64, 64, -64, 64, 64, 64, -64, 64, -64, 64, -64, 64, 64, -64, 64, -64, -64, 64, -64, 64, 64, -64, 64, -64, 64, -64, -64, 64, 64, 64, -64, -64, 64, 64, 64, -64, -64, 64, -64, 64, 64, -64, 64, -64, -64, -64, -64, -64, 64, 64, 64, 64, 64, 64, -64, -64, -64, -64, -64, 64, -64, -64, -64, 64, 64, 64, -64, 64, -64, -64, 64, 64, 64, -64, 64, -64, 64, -64, 64, 64, -64, -64, -64, -64, -64, -64, 64, -64, -64, -64, -64, -64, 64, -64, -64, -64, 64, -64, 64, -64, 64, -64, 64, -64, -64, -64, -64, 64, -64, -64, -64, -64, -64, -64, -64, -64, -64, -64, 64, -64, -64, 64, -64, -64, 64, 64, 64, -64, 64, 64, 64, 64, -64, -64, -64, -64, -64, -64, -64, -64, -64, -64, -64, -64, -64, -64, -64, 64, -64, -64, 64, -64, -64, 64, 64, -64, 64, 64, -64, -64, -64, 64, -64, 64, 64, -64, -64, -64, -64, -64, -64, -64, -64, -64, -64, -64, -64, -64, 64, -64, -64, -64, 64, 64, -64, -64, -64, -64, -64, -64, -64, 64, 64, 64, 64, 64, -64, -64, -64, -64, -64, -64, -64, -64, -64, -64, -64, 64, -64, -64, 64, -64, -64, -64, -64, -64, -64, 64, 64, 64, 64, 64, 64, 64, 64, -64, -64, -64, -64, 64, 64, -64, 64, 64, -64, 64, -64, -64, -64, -64, -64, -64, -64, -64, 64, 64, 64, 64, 64, 64, 64, 64, 64, 64, 64, -64, -64, -64, -64, -64, -64, -64, -64, 64, 64, -64, -64, -64, -64, -64, -64, 64, 64, 64, 64, 64, -64, 64, 64, 64, 64, 64, -64, -64, 64, -64, -64, -64, -64, 64, 64, 64, -64, -64, 64, -64, 64, -64, -64, -64, -64, 64, -64, -64, -64, -64, 64, 64, 64, 64, 64, 64, 64, -64, -64, -64, -64, -64, 64, -64, 64, 64, -64, -64, 64, -64, -64, -64, -64, -64, -64, -64, -64, -64, -64, -64, 64, -64, 64, -64, 64, -64, -64, -64, -64, -64, -64, 64, -64, -64, 64, -64, 64, 64, 64, -64, -64, -64, -64, -64, -64, -64, 64, -64, -64, 64, 64, -64, -64, -64, -64, -64, -64, 64, -64, 64, 64, 64, -64, 64, -64, -64, -64, -64, 64, -64, -64, 64, -64, 64, -64, -64, 64, -64, 64, 64, -64, 64, 64, 64, 64, 64, -64, 64, -64, -64, 64, -64, -64, -64, -64, 64, -64, -64, -64, -64, -64, -64, 64, -64, -64, -64, -64, -64, -64, -64, -64, 64, 64, 64, -64, -64, 64, -64, -64, 64, -64, -64, -64, -64, 64, -64, -64, -64, 64, 64, 64, 64, -64, -64, -64, -64, -64, -64, 64, 64, 64, -64, -64, 64, -64, -64, 64, -64, -64, -64, 64, -64, -64, 64, 64, -64, -64, -64, 64, 64, -64, -64, -64, -64, -64, -64, 64, -64, 64, 64, -64, -64, -64, 64, 64, -64, -64, -64, -64, 64, -64, 64, 64, -64, -64, 64, -64, -64, -64, -64, -64, -64, -64, -64, -64, -64, 64, 64, 64, -64, 64, -64, -64, -64, -64, -64, -64, 64, 64, 64, 64, 64, 64, 64, -64, -64, -64, -64, -64, -64, -64, -64, -64, -64, 64, 64, -64, 64, -64, 64, -64, -64, 64, -64, -64, -64, -64, -64, 64, 64, -64, -64, 64, -64, -64, -64, -64, -64, -64, -64, -64, -64, 64, -64, 64, -64, 64, -64, -64, -64, 64, -64, -64, -64, -64, 64, -64, -64, -64, -64, 64, 64, -64, -64, -64, -64, -64, 64, -64, 64, 64, -64, -64, -64, -64, 64, -64, 64, 64, 64, -64, -64, -64, -64, 64, -64, -64, 64, 64, -64, -64, -64, -64, -64, 64, 64, -64, -64, -64, -64, 64, -64, 64, 64, 64, 64, 64, 64, 64, 64, -64, -64, -64, -64, 64, -64, -64, 64, 64, -64, -64, -64, 64, -64, -64, -64, -64, 64, 64, 64, -64, 64, 64, 64, 64, 64, 64, -64, -64, 64, 64, -64, 64, -64, -64, -64, -64, -64, 64, 64, 64, 64, 64, -64, -64, 64, -64, 64, -64, 64, 64, 64, 64, -64, 64, 64, 64, -64, 64, -64, 64, -64, -64, -64, 64, 64, 64, 64, 64, 64, -64, 64, 64, -64, 64, 64, -64, 64, 64, 64, -64, -64, 64, 64, 64, 64, 64, -64, 64, 64, 64, -64, 64, -64, 64, 64, 64, 64, 64, -64, -64, -64, 64, -64, 64, -64, 64, 64, 64, -64, 64, 64, 64, 64, 64, 64, 64, -64, 64, 64, 64, 64, -64, -64, -64, 64, -64, -64, -64, 64, -64, 64, -64, -64, 64, -64, 64, 64, 64, -64, -64, -64, -64, -64, 64, -64, -64, -64, -64, -64, 64, -64, 64, -64, -64, -64, 64, -64, 64, -64, -64, 64, 64, -64, -64, -64, -64, -64, -64, -64, 64, -64, 64, -64, 64, 64, 64, -64, -64, -64, -64, -64, 64, -64, -64, -64, 64, -64, -64, -64, -64, 64, -64, 64, -64, 64, 64, 64, 64, 64, -64, 64, -64, 64, 64, 64, -64, 64, -64, -64, 64, 64, 64, 64, -64, -64, 64, -64, 64, -64, 64, 64, -64, -64, 64, -64, -64, 64, -64, -64, -64, -64, -64, -64, -64, -64, -64, 64, -64, -64, 64, -64, 64, -64, -64, 64, -64, 64, 64, 64, 64, -64, -64, 64, -64, 64, -64, -64, -64, 64, -64, -64, -64, -64, -64, -64, -64, -64, -64, 64, 64, -64, 64, 64, 64, 64, 64, 64, 64, -64, -64, -64, -64, -64, -64, -64, 64, -64, -64, -64, -64, 64, -64, -64, 64, -64, -64, -64, -64, 64, 64, 64, 64, 64, -64, 64, 64, 64, -64, 64, 64, 64, 64, 64, 64, -64, -64, -64, -64, 64, 64, 64, 64, 64, -64, -64, -64, -64, 64, -64, -64, 64, 64, -64, 64, 64, -64, -64, 64, 64, -64, -64, 64, -64, -64, -64, 64, 64, 64, 64, 64, 64, 64, 64, -64, 64, -64, -64, 64, 64, 64, -64, -64, -64, -64, -64, -64, 64, -64, -64, -64, 64, -64, -64, -64, 64, 64, 64, 64, 64, -64, -64, 64, -64, -64, 64, 64, 64, -64, 64, -64, -64, -64, -64, 64, 64, -64, -64, -64, -64, -64, -64, 64, 64, 64, 64, 64, 64, -64, 64, 64, 64, -64, -64, -64, 64, -64, -64, -64, 64, -64, 64, 64, -64, 64, -64, -64, -64, -64, -64, 64, 64, 64, 64, 64, 64, 64, -64, -64, -64, -64, 64, -64, 64, 64, -64, -64, -64, -64, 64, 64, 64, 64, -64, -64, -64, -64, -64, 64, 64, -64, 64, 64, 64, -64, -64, 64, 64, -64, -64, -64, 64, -64, 64, -64, -64, 64, 64, 64, 64, -64, -64, -64, -64, -64, -64, -64, -64, -64, 64, 64, 64, -64, -64, 64, 64, -64, -64, -64, -64, 64, 64, 64, -64, -64, 64, 64, 64, -64, -64, -64, -64, 64, -64, -64, -64, -64, -64, -64, -64, -64, -64, -64, 64, -64, 64, -64, 64, 64, -64, 64, -64, 64, 64, 64, 64, -64, -64, -64, -64, -64, -64, -64, -64, -64, -64, -64, -64, -64, -64, -64, 64, 64, -64, -64, 64, 64, 64, 64, 64, 64, 64, 64, 64, -64, 64, -64, 64, -64, -64, -64, 64, 64, -64, -64, -64, -64, -64, 64, -64, 64, 64, -64, 64, 64, 64, 64, 64, 64, 64, 64, -64, 64, -64, 64, -64, 64, -64, -64, -64, 64, -64, -64, -64, -64, 64, -64, 64, -64, 64, 64, 64, -64, -64, 64, 64, 64, -64, -64, -64, -64, 64, 64, 64, 64, -64, -64, -64, 64, -64, -64, -64, 64, -64, 64, -64, -64, -64, 64, -64, -64, -64, -64, -64, -64, -64, -64, -64, -64, 64, 64, 64, 64, 64, 64, -64, -64, -64, -64, 64, 64, -64, -64, 64, -64, -64, -64, -64, -64, -64, -64, -64, -64, -64, -64, -64, 64, 64, 64, 64, 64, 64, 64, -64, -64, -64, -64, -64, -64, 64, 64, -64, -64, 64, -64, -64, -64, -64, -64, -64, -64, -64, -64, -64, 64, 64, 64, 64, -64, 64, 64, 64, -64, 64, -64, 64, -64, 64, -64, -64, 64, 64, 64, -64, -64, -64, -64, -64, -64, -64, -64, -64, 64, 64, 64, -64, 64, 64, 64, 64, 64, 64, 64, -64, -64, 64, 64, -64, 64, -64, 64, -64, -64, -64, -64, 64, -64, -64, 64, -64, 64, 64, 64, 64, -64, -64, 64, -64, 64, 64, 64, 64, 64, -64, 64, -64, 64, 64, 64, -64, -64, -64, 64, -64, -64, 64, 64, 64, 64, 64, 64, 64, -64, -64, -64, 64, -64, 64, 64, -64, 64, 64, 64, 64, 64, 64, 64, 64, 64, -64, 64, 64, 64, 64, 64, 64, 64, 64, 64, -64, -64, -64, -64, 64, -64, 64, 64, -64, 64, -64, 64, 64, 64, 64, 64, 64, 64, 64, 64, 64, 64, 64, 64, 64, 64, -64, -64, -64, -64, -64, 64, -64, 64, 64, 64, -64, 64, 64, 64, 64, -64, 64, -64, -64, 64, 64, 64, 64, -64, 64, -64, -64, -64, -64, -64, -64, 64, -64, 64, 64, 64, 64, 64, -64, -64, -64, 64, 64, 64, -64, 64, -64, -64, 64, 64, 64, -64, 64, -64, -64, -64, -64, -64, -64, -64, -64, 64, -64, -64, 64, 64, -64, -64, -64, 64, 64, 64, 64, 64, 64, 64, -64, 64, -64, -64, -64, 64, 64, 64, 64, -64, 64, -64, -64, 64, 64, -64, -64, 64, 64, -64, 64, 64, -64, -64, -64, 64, -64, 64, 64, 64, -64, -64, -64, -64, 64, -64, 64, -64, 64, -64, 64, -64, 64, -64, 64, 64, -64, -64, 64, -64, -64, 64, -64, 64, 64, 64, 64, -64, -64, -64, -64, -64, 64, 64, -64, -64, 64, -64, 64, 64, -64, 64, -64, -64, -64, 64, 64, -64, -64, -64, -64, 64, 64, 64, 64, -64, -64, -64, -64, -64, -64, -64, 64, 64, 64, 64, 64, 64, 64, 64, -64, -64, 64, 64, 64, 64, -64, -64, -64, -64, -64, -64, -64, -64, -64, -64, -64, -64, -64, 64, 64, 64, -64, -64, -64, -64, 64, 64, -64, -64, -64, 64, -64, -64, -64, 64, -64, 64, 64, -64, -64, -64, -64, -64, 64, -64, 64, 64, 64, -64, -64, -64, -64, -64, 64, -64, -64, -64, -64, 64, -64, 64, 64, -64, -64, 64, -64, -64, 64, -64, 64, 64, 64, 64, -64, -64, -64, -64, -64, -64, -64, -64, -64, -64, 64, 64, 64, -64, 64, -64, -64, 64, -64, -64, -64, -64, -64, -64, 64, 64, 64, 64, -64, -64, -64, -64, -64, -64, 64, -64, 64, -64, 64, 64, -64, 64, -64, 64, -64, -64, 64, 64, 64, -64, -64, 64, 64, 64, 64, 64, 64, -64, -64, -64, -64, -64, -64, -64, -64, 64, -64, 64, -64, -64, -64, 64, 64, -64, 64, 64, -64, 64, 64, 64, 64, 64, 64, 64, -64, -64, 64, 64, -64, -64, 64, -64, 64, 64, -64, 64, -64, -64, -64, 64, -64, -64, 64, 64, -64, 64, 64, 64, 64, -64, -64, 64, -64, -64, -64, 64, 64, 64, -64, -64, -64, -64, 64, 64, 64, 64, -64, 64, 64, -64, 64, 64, -64, 64, 64, 64, 64, -64, -64, -64, -64, -64, 64, -64, 64, 64, 64, -64, -64, -64, -64, 64, 64, 64, 64, -64, -64, 64, 64, 64, 64, 64, 64, 64, -64, -64, -64, -64, -64, -64, 64, -64, -64, -64, 64, -64, -64, -64, 64, 64, 64, -64, 64, -64, -64, -64, 64, 64, 64, 64, 64, 64, 64, -64, -64, -64, -64, -64, -64, -64, -64, -64, -64, 64, 64, 64, 64, -64, -64, -64, -64, 64, -64, -64, 64, 64, 64, 64, 64, 64, 64, -64, -64, -64, -64, -64, -64, -64, -64, -64, -64, 64, 64, 64, 64, -64, -64, -64, 64, -64, -64, -64, 64, 64, 64, -64, -64, 64, -64, -64, 64, -64, 64, -64, -64, -64, 64, 64, 64, 64, 64, 64, -64, -64, -64, -64, -64, -64, 64, -64, 64, 64, 64, 64, 64, -64, -64, 64, 64, 64, 64, -64, 64, 64, 64, 64, 64, -64, 64, 64, -64, -64, -64, -64, -64, 64, 64, 64, 64, 64, 64, 64, -64, 64, 64, -64, -64, 64, -64, -64, -64, -64, -64, 64, 64, 64, -64, -64, -64, 64, -64, -64, -64, 64, 64, -64, 64, -64, 64, 64, 64, 64, -64, -64, 64, -64, 64, -64, -64, -64, 64, 64, 64, 64, -64, -64, -64, 64, -64, -64, -64, -64, 64, -64, -64, -64, -64, 64, 64, 64, 64, -64, 64, -64, -64, -64, 64, -64, -64, -64, 64, 64, -64, -64, 64, 64, 64, 64, -64, 64, -64, 64, -64, -64, 64, -64, -64, 64, 64, 64, 64, -64, -64, -64, -64, -64, -64, -64, 64, 64, -64, -64, 64, 64, -64, -64, 64, 64, -64, -64, -64, 64, -64, -64, -64, -64, -64, 64, -64, -64, -64, -64, -64, -64, -64, -64, 64, 64, 64, -64, 64, -64, -64, -64, 64, 64, -64, 64, 64, 64, -64, -64, -64, -64, -64, -64, -64, -64, -64, -64, -64, -64, -64, -64, 64, 64, 64, 64, 64, 64, -64, -64, 64, -64, 64, -64, -64, -64, -64, -64, -64, -64, -64, -64, -64, -64, -64, -64, -64, -64, -64, -64, 64, 64, 64, 64, 64, 64, 64, -64, 64, -64, -64, -64, -64, -64, -64, 64, -64, -64, -64, -64, 64, -64, -64, -64, 64, -64, -64, -64, 64, 64, 64, 64, 64, 64, -64, -64, -64, 64, -64, -64, -64, -64, 64, -64, 64, -64, 64, -64, -64, -64, -64, 64, -64, -64, -64, 64, 64, 64, 64, 64, 64, 64, -64, -64, -64, 64, 64, -64, 64, 64, 64, -64, -64, -64, 64, -64, -64, 64, 64, -64, -64, -64, 64, -64, 64, 64, 64, 64, 64, 64, 64, -64, 64, 64, -64, 64, 64, 64, 64, -64, -64, -64, 64, 64, -64, 64, 64, -64, -64, -64, -64, -64, 64, 64, -64, 64, -64, -64, -64, 64, -64, -64, -64, -64, -64, 64, 64, 64, 64, -64, 64, 64, 64, -64, -64, 64, -64, -64, -64, 64, 64, 64, 64, -64, 64, 64, -64, 64, -64, 64, -64, 64, 64, 64, -64, 64, -64, -64, 64, 64, -64, 64, 64, 64, 64, -64, -64, 64, -64, -64, -64, -64, -64, -64, 64, -64, -64, -64, -64, -64, -64, 64, 64, -64, -64, -64, -64, -64, 64, -64, 64, 64, 64, -64, -64, 64, 64, -64, -64, 64, 64, 64, -64, -64, 64, -64, 64, -64, -64, -64, 64, 64, 64, -64, -64, -64, -64, -64, -64, -64, 64, -64, 64, 64, 64, -64, -64, 64, -64, 64, -64, -64, 64, 64, 64, -64, 64, -64, -64, 64, -64, -64, 64, -64, -64, -64, 64, 64, -64, 64, 64, 64, -64, -64, -64, -64, -64, -64, -64, 64, 64, 64, 64, -64, 64, 64, -64, 64, -64, 64, 64, -64, 64, 64, -64, -64, -64, 64, -64, -64, -64, -64, -64, 64, -64, 64, -64, -64, 64, 64, -64, 64, 64, 64, -64, 64, -64, 64, 64, 64, 64, -64, -64, 64, 64, 64, -64, 64, -64, 64, -64, -64, -64, -64, -64, -64, -64, 64, 64, 64, 64, -64, -64, -64, 64, 64, 64, 64, 64, 64, 64, -64, 64, -64, -64, 64, -64, 64, -64, -64, -64, -64, -64, -64, 64, -64, 64, 64, 64, 64, 64, 64, 64, 64, 64, 64, 64, 64, 64, -64, 64, -64, -64, -64, -64, -64, -64, -64, -64, -64, -64, -64, 64, 64, 64, 64, 64, 64, 64, 64, 64, 64, 64, 64, 64, -64, 64, 64, -64, 64, 64, 64, 64, 64, -64, -64, -64, -64, -64, -64, -64, -64, 64, 64, 64, 64, 64, 64, 64, -64, 64, -64, 64, 64, -64, 64, 64, 64, 64, 64, -64, -64, 64, -64, -64, -64, -64, -64, -64, -64, 64, 64, 64, 64, 64, 64, 64, 64, 64, -64, -64, 64, 64, 64, 64, 64, 64, 64, 64, 64, 64, 64, -64, -64, -64, -64, 64, 64, 64, 64, 64, 64, 64, 64, -64, -64, 64, 64, -64, -64, -64, -64, 64, 64, 64, 64, 64, 64, -64, 64, -64, -64, -64, 64, -64, 64, -64, 64, -64, 64, 64, 64, -64, 64, -64, -64, -64, -64, -64, -64, -64, -64, 64, 64, 64, 64, 64, -64, -64, -64, -64, -64, -64, -64, -64, 64, 64, 64, 64, -64, 64, 64, -64, -64, -64, -64, -64, -64, -64, -64, -64, 64, 64, 64, 64, 64, -64, -64, -64, 64, 64, 64, 64, 64, 64, 64, 64, 64, 64, 64, -64, 64, -64, 64, -64, 64, 64, 64, -64, 64, 64, 64, -64, 64, 64, -64, -64, 64, -64, -64, 64, 64, 64, 64, 64, 64, 64, 64, 64, 64, 64, 64, 64, 64, 64, 64, 64, -64, -64, -64, -64, 64, -64, 64, 64, -64, 64, -64, 64, 64, 64, 64, -64, 64, 64, 64, 64, 64, 64, 64, 64, 64, 64, -64, -64, 64, 64, -64, 64, -64, 64, 64, 64, 64, 64, 64, 64, -64, -64, -64, 64, 64, 64, 64, 64, 64, 64, 64, 64, 64, 64, 64, -64, 64, -64, -64, 64, 64, 64, 64, 64, -64, 64, -64, 64, 64, 64, -64, -64, -64, -64, 64, 64, 64, 64, 64, 64, 64, 64, 64, -64, -64, -64, 64, 64, 64, 64, 64, 64, -64, 64, -64, 64, 64, -64, -64, -64, -64, 64, 64, 64, 64, 64, 64, 64, 64, 64, -64, -64, -64, 64, -64, 64, 64, 64, 64, 64, 64, 64, -64, -64, -64, -64, -64, -64, -64, 64, -64, -64, 64, 64, 64, 64, 64, 64, -64, -64, 64, -64, 64, 64, 64, 64, 64, 64, 64, 64, -64, -64, -64, -64, -64, -64, 64, -64, -64, -64, -64, -64, -64, 64, 64, -64, -64, -64, 64, 64, 64, 64, 64, 64, 64, 64, -64, -64, 64, 64, 64, 64, 64, 64, 64, -64, -64, -64, -64, -64, -64, 64, -64, 64, 64, 64, 64, 64, 64, 64, 64, 64, 64, 64, 64, 64, -64, -64, -64, -64, 64, 64, 64, -64, -64, -64, -64, -64, 64, -64, -64, -64, -64, -64, -64, 64, 64, 64, 64, 64, 64, 64, 64, 64, -64, -64, 64, -64, -64, -64, -64, -64, -64, -64, -64, -64, 64, -64, -64, 64, -64, -64, 64, 64, 64, 64, 64, 64, 64, -64, -64, 64, 64, 64, -64, 64, 64, -64, -64, -64, -64, -64, 64, -64, -64, -64, -64, 64, 64, 64, 64, 64, 64, 64, 64, 64, 64, -64, 64, 64, -64, 64, -64, 64, 64, -64, -64, 64, 64, -64, -64, -64, -64, 64, -64, -64, 64, 64, -64, 64, -64, -64, -64, 64, -64, -64, -64, -64, 64, 64, 64, 64, -64, 64, -64, -64, 64, 64, 64, -64, 64, -64, 64, 64, 64, 64, -64, 64, -64, -64, -64, -64, 64, 64, 64, 64, 64, -64, -64, 64, -64, 64, -64, 64, -64, -64, 64, 64, -64, 64, 64, 64, -64, -64, 64, -64, -64, 64, 64, -64, 64, 64, -64, -64, -64, -64, 64, 64, -64, 64, -64, 64, -64, -64, -64, -64, -64, -64, -64, 64, 64, 64, 64, -64, -64, -64, -64, -64, 64, 64, -64, 64, -64, 64, -64, -64, 64, 64, -64, -64, -64, -64, -64, -64, 64, -64, -64, 64, 64, 64, -64, 64, 64, 64, -64, -64, 64, 64, -64, 64, -64, -64, 64, 64, 64, -64, 64, -64, -64, -64, -64, -64, -64, -64, -64, 64, -64, 64, -64, -64, -64, -64, -64, -64, -64, -64, 64, 64, 64, -64, -64, 64, -64, -64, -64, -64, -64, -64, -64, -64, 64, 64, -64, -64, 64, 64, -64, -64, -64, -64, -64, -64, -64, -64, -64, -64, -64, 64, -64, -64, -64, -64, -64, -64, 64, -64, -64, -64, -64, -64, -64, -64, 64, 64, 64, -64, -64, -64, 64, -64, 64, -64, 64, 64, -64, -64, -64, -64, -64, -64, -64, 64, 64, -64, -64, -64, -64, -64, -64, -64, 64, 64, -64, -64, -64, -64, -64, -64, 64, -64, 64, -64, -64, -64, -64, -64, -64, -64, -64, -64, 64, -64, -64, 64, -64, -64, -64, -64, -64, 64, -64, -64, -64, -64, 64, 64, 64, 64, 64, -64, 64, 64, -64, -64, -64, -64, -64, -64, -64, 64, -64, -64, -64, -64, -64, -64, 64, 64, -64, -64, 64, -64, 64, 64, -64, 64, -64, 64, 64, -64, -64, 64, -64, 64, -64, 64, 64, -64, 64, -64, -64, -64, 64, 64, -64, -64, -64, -64, 64, -64, -64, 64, -64, -64, -64, 64, 64, 64, -64, -64, -64, 64, -64, 64, 64, 64, -64, -64, -64, -64, 64, 64, -64, 64, -64, -64, 64, 64, -64, 64, -64, 64, -64, -64, -64, -64, -64, -64, -64, -64, -64, 64, 64, 64, -64, -64, -64, -64, -64, 64, 64, 64, -64, 64, -64, -64, -64, 64, -64, 64, 64, -64, 64, -64, 64, -64, -64, -64, 64, 64, 64, 64, -64, -64, -64, -64, -64, -64, 64, 64, -64, 64, 64, -64, -64, -64, -64, 64, 64, -64, -64, 64, 64, 64, 64, 64, -64, 64, 64, 64, 64, 64, 64, -64, 64, 64, 64, 64, 64, 64, -64, -64, -64, -64, 64, 64, 64, 64, 64, 64, -64, 64, 64, -64, 64, 64, 64, 64, 64, 64, 64, 64, -64, 64, 64, 64, 64, 64, -64, -64, -64, 64, 64, 64, -64, 64, -64, 64, 64, 64, 64, 64, 64, 64, 64, 64, 64, 64, 64, 64, 64, 64, 64, 64, 64, 64, -64, -64, -64, 64, 64, -64, 64, 64, 64, -64, 64, -64, -64, 64, 64, 64, 64, 64, 64, 64, 64, 64, 64, 64, 64, 64, -64, 64, -64, 64, 64, 64, 64, -64, 64, 64, 64, -64, 64, -64, -64, 64, 64, 64, -64, 64, -64, 64, 64, 64, 64, 64, -64, 64, -64, 64, 64, 64, 64, 64, 64, 64, 64, 64, 64, -64, 64, -64, 64, 64, 64, 64, 64, 64, 64, -64, -64, -64, 64, 64, -64, -64, 64, 64, 64, 64, 64, 64, 64, -64, -64, -64, 64, 64, 64, -64, 64, -64, -64, 64, 64, -64, -64, -64, -64, -64, -64, -64, -64, -64, 64, 64, 64, -64, -64, -64, -64, 64, -64, -64, 64, -64, 64, 64, -64, -64, -64, -64, -64, -64, -64, -64, -64, -64, -64, -64, -64, 64, 64, -64, -64, -64, -64, -64, -64, -64, 64, -64, 64, -64, -64, -64, -64, -64, -64, -64, -64, -64, -64, -64, -64, -64, -64, -64, -64, -64, -64, 64, -64, 64, -64, -64, -64, -64, 64, -64, -64, -64, -64, -64, -64, -64, -64, -64, -64, -64, -64, -64, -64, -64, -64, -64, -64, -64, 64, 64, -64, 64, 64, -64, -64, 64, 64, -64, -64, 64, -64, -64, -64, -64, -64, -64, 64, -64, -64, -64, -64, -64, -64, -64, -64, -64, 64, 64, 64, 64, 64, -64, -64, -64, -64, 64, -64, -64, -64, -64, -64, -64, -64, 64, 64, -64, -64, -64, -64, -64, -64, -64, -64, -64, 64, 64, 64, 64, 64, -64, -64, -64, -64, -64, 64, -64, 64, 64, 64, 64, 64, 64, 64, -64, -64, -64, -64, -64, -64, -64, 64, 64, -64, 64, 64, -64, 64, 64, 64, 64, 64, -64, -64, 64, 64, 64, 64, 64, 64, -64, 64, -64, -64, -64, -64, -64, -64, 64, -64, -64, 64, 64, 64, 64, 64, 64, -64, -64, 64, 64, 64, -64, -64, -64, -64, -64, -64, -64, -64, -64, 64, -64, -64, -64, -64, -64, -64, 64, -64, 64, -64, -64, 64, -64, 64, 64, 64, 64, -64, -64, -64, -64, 64, 64, 64, 64, 64, 64, -64, 64, -64, 64, -64, 64, -64, -64, -64, 64, -64, 64, -64, 64, -64, -64, -64, 64, 64, -64, 64, -64, -64, -64, -64, 64, -64, 64, 64, -64, -64, -64, -64, 64, -64, -64, -64, -64, -64, -64, 64, -64, -64, -64, -64, 64, 64, -64, 64, -64, 64, 64, -64, -64, 64, 64, -64, 64, -64, -64, -64, -64, 64, 64, 64, -64, 64, 64, 64, 64, -64, 64, -64, -64, 64, -64, -64, -64, 64, -64, -64, 64, -64, -64, 64, -64, -64, 64, 64, 64, -64, 64, 64, 64, 64, 64, -64, 64, -64, 64, 64, -64, 64, -64, -64, -64, 64, -64, 64, 64, -64, 64, 64, -64, -64, -64, -64, 64, 64, -64, 64, 64, -64, -64, -64, 64, -64, -64, -64, -64, -64, 64, -64, 64, -64, -64, -64, 64, 64, -64, -64, 64, 64, -64, -64, 64, 64, -64, 64, 64, 64, -64, -64, -64, 64, 64, 64, -64, 64, -64, -64, -64, -64, -64, -64, 64, -64, -64, -64, 64, -64, -64, -64, 64, -64, -64, 64, -64, 64, -64, 64, 64, 64, 64, 64, -64, 64, -64, 64, 64, -64, 64, -64, -64, -64, 64, -64, 64, 64, -64, 64, -64, -64, -64, -64, 64, -64, -64, -64, 64, 64, 64, -64, 64, 64, -64, -64, 64, -64, 64, -64, -64, -64, -64, -64, -64, -64, -64, -64, 64, -64, -64, -64, -64, -64, -64, 64, -64, -64, 64, -64, -64, 64, -64, 64, 64, 64, -64, 64, -64, 64, -64, 64, 64, 64, -64, 64, -64, 64, 64, 64, -64, 64, -64, -64, 64, -64, -64, -64, -64, -64, -64, -64, -64, -64, -64, -64, -64, -64, -64, 64, -64, -64, -64, -64, -64, -64, -64, -64, -64, -64, 64, 64, 64, -64, 64, -64, -64, 64, -64, -64, 64, -64, -64, -64, -64, 64, 64, -64, -64, 64, 64, -64, -64, 64, 64, 64, -64, 64, -64, -64, -64, -64, 64, 64, 64, -64, -64, 64, -64, 64, 64, -64, 64, 64, -64, -64, 64, -64, -64, 64, -64, 64, -64, -64, -64, -64, -64, 64, -64, -64, -64, -64, -64, 64, 64, -64, 64, 64, -64, -64, 64, -64, 64, -64, -64, -64, -64, -64, 64, -64, -64, 64, -64, 64, 64, -64, -64, 64, 64, -64, 64, 64, -64, 64, -64, -64, -64, -64, -64, -64, 64, -64, -64, -64, 64, -64, -64, 64, 64, -64, 64, -64, -64, 64, 64, 64, 64, 64, -64, -64, -64, -64, 64, -64, 64, -64, 64, -64, 64, -64, 64, -64, -64, 64, -64, -64, -64, 64, -64, 64, 64, -64, 64, 64, -64, -64, 64, 64, -64, -64, 64, -64, 64, -64, 64, -64, -64, 64, -64, -64, 64, 64, 64, -64, -64, -64, -64, -64, -64, 64, -64, -64, -64, 64, -64, 64, -64, 64, 64, 64, 64, 64, -64, -64, -64, 64, -64, 64, 64, -64, -64, -64, -64, -64, -64, -64, 64, 64, -64, -64, -64, 64, -64, -64, 64, -64, -64, 64, 64, -64, -64, -64, 64, -64, -64, -64, -64, -64, 64, 64, 64, 64, 64, 64, -64, -64, -64, 64, 64, 64, -64, 64, 64, -64, 64, 64, -64, -64, -64, -64, -64, -64, 64, -64, -64, -64, -64, 64, 64, -64, 64, -64, 64, -64, 64, -64, 64, 64, 64, 64, 64, 64, 64, -64, -64, 64, 64, -64, -64, -64, 64, 64, 64, -64, 64, -64, -64, 64, -64, -64, -64, 64, 64, -64, 64, -64, 64, 64, -64, -64, -64, 64, -64, 64, 64, -64, -64, -64, 64, -64, -64, -64, 64, -64, 64, 64, -64, -64, -64, -64, 64, -64, 64, -64, -64, -64, -64, 64, -64, -64, -64, -64, -64, 64, -64, -64, -64, 64, -64, 64, -64, -64, 64, -64, -64, -64, 64, 64, -64, -64, -64, 64, -64, -64, 64, 64, -64, -64, -64, 64, -64, -64, 64, -64, -64, -64, 64, 64, -64, 64, -64, 64, 64, 64, 64, -64, 64, -64, 64, -64, 64, -64, -64, -64, -64, -64, 64, -64, -64, 64, -64, -64, -64, -64, 64, -64, -64, 64, -64, 64, -64, -64, 64, -64, 64, -64, 64, 64, 64, -64, 64, 64, 64, 64, 64, -64, 64, 64, 64, 64, -64, -64, -64, 64, -64, -64, 64, -64, 64, -64, 64, 64, 64, -64, -64, 64, -64, -64, 64, 64, -64, 64, 64, 64, 64, -64, -64, -64, -64, 64, -64, 64, -64, -64, 64, 64, 64, 64, 64, -64, 64, -64, -64, 64, -64, -64, -64, 64, 64, -64, -64, 64, 64, -64, -64, 64, -64, 64, 64, -64, 64, -64, 64, -64, 64, -64, 64, -64, -64, -64, 64, -64, 64, -64, -64, -64, 64, -64, -64, -64, -64, 64, -64, 64, -64, -64, -64, -64, -64, -64, -64, -64, 64, 64, 64, -64, -64, -64, 64, -64, -64, 64, -64, 64, 64, 64, 64, 64, 64, 64, -64, -64, 64, 64, 64, -64, -64, 64, -64, -64, -64, -64, 64, -64, -64, 64, -64, 64, 64, 64, -64, 64, -64, 64, 64, -64, 64, 64, 64, -64, 64, -64, -64, 64, -64, 64, 64, -64, 64, 64, 64, -64, -64, 64, -64, 64, 64, 64, 64, 64, 64, -64, 64, 64, 64, -64, 64, 64, 64, -64, 64, -64, -64, -64, -64, -64, -64, -64, -64, -64, 64, -64, 64, -64, 64, -64, -64, 64, -64, 64, -64, 64, 64, 64, 64, 64, 64, 64, 64, -64, -64, 64, -64, 64, -64, 64, -64, 64, 64, -64, 64, -64, 64, 64, 64, -64, -64, -64, -64, -64, 64, 64, 64, 64, 64, 64, 64, 64, 64, 64, 64, 64, 64, 64, 64, 64, 64, 64, -64, -64, -64, 64, -64, -64, -64, -64, -64, -64, -64, 64, 64, 64, 64, 64, 64, 64, 64, 64, 64, -64, -64, 64, 64, -64, -64, -64, 64, -64, 64, -64, -64, -64, -64, -64, -64, -64, -64, -64, -64, 64, 64, 64, 64, 64, 64, 64, 64, -64, -64, -64, -64, -64, -64, 64, 64, 64, 64, -64, 64, -64, -64, -64, -64, -64, -64, 64, 64, -64, 64, -64, 64, 64, -64, 64, 64, -64, -64, -64, -64, -64, -64, -64, -64, -64, 64, -64, -64, -64, 64, -64, 64, -64, -64, 64, 64, 64, -64, -64, -64, -64, -64, -64, -64, -64, -64, -64, -64, -64, -64, -64, -64, -64, -64, 64, -64, -64, 64, -64, -64, 64, 64, -64, -64, -64, -64, -64, -64, -64, -64, -64, -64, 64, -64, -64, -64, -64, -64, -64, -64, -64, -64, -64, -64, -64, 64, -64, -64, -64, -64, -64, -64, -64, -64, -64, -64, -64, -64, -64, -64, 64, 64, 64, 64, -64, -64, -64, -64, -64, 64, -64, -64, -64, -64, 64, 64, 64, -64, -64, -64, -64, 64, -64, -64, -64, 64, 64, -64, 64, 64, 64, -64, -64, -64, -64, -64, -64, 64, -64, 64, 64, -64, -64, -64, -64, -64, -64, -64, -64, 64, 64, 64, 64, 64, 64, 64, 64, -64, 64, 64, 64, 64, -64, 64, 64, -64, -64, -64, -64, -64, -64, -64, -64, 64, -64, 64, 64, 64, 64, -64, 64, 64, 64, 64, 64, -64, -64, 64, 64, -64, -64, 64, 64, 64, -64, 64, -64, -64, -64, -64, -64, 64, 64, 64, 64, -64, -64, 64, 64, 64, 64, 64, 64, 64, 64, 64, 64, 64, 64, 64, 64, -64, 64, 64, -64, -64, -64, 64, 64, 64, 64, 64, 64, -64, -64, -64, 64, 64, 64, -64, 64, 64, -64, 64, 64, -64, 64, -64, 64, -64, -64, -64, -64, -64, -64, -64, 64, 64, 64, 64, 64, -64, -64, -64, 64, 64, 64, 64, 64, 64, -64, -64, 64, 64, 64, 64, -64, 64, -64, 64, -64, 64, -64, -64, 64, 64, 64, 64, 64, 64, 64, -64, 64, 64, 64, 64, -64, -64, -64, -64, -64, 64, 64, 64, 64, -64, 64, -64, -64, -64, -64, 64, -64, -64, 64, -64, 64, 64, -64, -64, -64, -64, 64, 64, -64, -64, -64, -64, 64, 64, 64, 64, -64, -64, 64, 64, -64, 64, -64, 64, 64, -64, 64, 64, 64, -64, -64, -64, 64, 64, 64, -64, -64, -64, -64, 64, 64, 64, 64, -64, -64, 64, -64, -64, -64, 64, 64, 64, 64, 64, 64, 64, 64, 64, 64, 64, 64, -64, -64, -64, 64, 64, 64, 64, 64, 64, -64, 64, 64, 64, 64, 64, -64, 64, 64, 64, 64, 64, -64, -64, 64, 64, 64, -64, 64, -64, 64, -64, 64, 64, 64, 64, 64, 64, -64, -64, 64, 64, 64, -64, 64, -64, 64, 64, -64, 64, 64, -64, -64, -64, 64, 64, -64, -64, -64, 64, -64, 64, -64, 64, 64, 64, 64, 64, 64, -64, -64, -64, 64, -64, 64, -64, 64, 64, 64, -64, -64, 64, 64, -64, 64, -64, -64, -64, 64, 64, 64, 64, 64, 64, -64, -64, 64, 64, 64, -64, 64, -64, -64, -64, -64, 64, 64, -64, -64, -64, -64, -64, -64, -64, -64, 64, 64, -64, 64, 64, 64, 64, -64, 64, -64, 64, 64, -64, -64, -64, 64, -64, 64, 64, 64, 64, -64, 64, -64, -64, 64, 64, -64, -64, -64, -64, -64, -64, -64, -64, 64, -64, 64, -64, -64, -64, 64, -64, -64, -64, -64, -64, 64, 64, 64, 64, 64, 64, 64, -64, -64, -64, 64, 64, -64, -64, -64, -64, -64, -64, -64, 64, 64, 64, -64, 64, 64, 64, 64, 64, -64, 64, -64, -64, -64, -64, 64, 64, 64, 64, -64, -64, 64, -64, 64, -64, 64, -64, 64, 64, 64, 64, -64, -64, -64, -64, 64, 64, 64, 64, 64, 64, 64, -64, 64, 64, -64, 64, -64, -64, 64, -64, 64, -64, -64, -64, -64, -64, -64, 64, 64, 64, 64, -64, -64, -64, 64, 64, 64, 64, 64, 64, 64, 64, 64, -64, -64, 64, -64, 64, 64, 64, 64, -64, -64, -64, 64, 64, 64, -64, 64, -64, -64, 64, -64, 64, 64, 64, 64, 64, 64, 64, -64, -64, -64, -64, -64, -64, -64, 64, -64, 64, -64, -64, -64, -64, 64, -64, 64, 64, -64, 64, 64, -64, 64, -64, -64, -64, -64, -64, -64, -64, -64, -64, -64, 64, 64, 64, 64, 64, 64, -64, 64, -64, 64, -64, 64, 64, 64, 64, 64, 64, 64, 64, -64, -64, -64, -64, -64, 64, 64, 64, 64, 64, 64, 64, 64, 64, 64, 64, 64, 64, -64, -64, 64, 64, 64, 64, 64, 64, 64, 64, -64, -64, 64, -64, 64, -64, 64, 64, 64, 64, 64, 64, 64, -64, 64, -64, 64, -64, 64, 64, 64, 64, 64, 64, 64, 64, 64, -64, -64, 64, 64, -64, -64, -64, -64, 64, 64, -64, 64, 64, -64, -64, 64, -64, -64, -64, -64, 64, 64, 64, 64, 64, 64, -64, -64, -64, 64, 64, 64, 64, -64, 64, -64, -64, -64, 64, 64, 64, 64, 64, -64, 64, -64, 64, -64, 64, 64, 64, 64, -64, 64, -64, -64, 64, 64, 64, 64, -64, 64, -64, -64, -64, -64, -64, 64, 64, 64, 64, -64, -64, 64, -64, -64, -64, -64, 64, 64, -64, 64, 64, -64, -64, 64, 64, -64, -64, -64, -64, -64, -64, -64, 64, 64, 64, -64, 64, 64, -64, -64, -64, -64, -64, -64, -64, -64, -64, 64, -64, 64, -64, 64, -64, -64, -64, -64, -64, -64, 64, -64, -64, 64, 64, 64, 64, -64, -64, -64, 64, -64, -64, -64, -64, -64, -64, -64, 64, -64, 64, -64, -64, -64, -64, -64, 64, -64, -64, -64, 64, -64, -64, -64, 64, -64, -64, 64, 64, -64, -64, -64, -64, -64, -64, -64, -64, -64, -64, 64, -64, -64, -64, -64, 64, 64, -64, 64, 64, 64, -64, 64, -64, 64, 64, 64, 64, -64, -64, -64, -64, -64, -64, -64, 64, -64, 64, 64, -64, -64, -64, -64, 64, 64, 64, 64, 64, 64, -64, 64, -64, 64, -64, -64, -64, 64, -64, -64, -64, 64, -64, 64, -64, 64, 64, 64, 64, 64, -64, 64, 64, 64, 64, 64, 64, 64, -64, -64, -64, 64, -64, -64, -64, 64, 64, 64, -64, 64, -64, -64, 64, 64, 64, 64, 64, -64, 64, 64, 64, 64, 64, 64, -64, -64, -64, -64, -64, -64, 64, -64, 64, 64, 64, 64, -64, 64, -64, 64, -64, 64, 64, 64, 64, -64, 64, 64, 64, 64, 64, -64, -64, -64, -64, -64, -64, 64, -64, 64, 64, -64, -64, -64, -64, -64, 64, 64, 64, 64, 64, 64, 64, -64, 64, 64, 64, 64, 64, -64, -64, -64, -64, 64, -64, -64, 64, 64, 64, -64, -64, -64, 64, 64, 64, 64, 64, 64, 64, 64, 64, 64, 64, 64, 64, 64, 64, 64, -64, -64, 64, 64, 64, 64, -64, -64, -64, 64, 64, 64, 64, 64, 64, 64, 64, 64, 64, 64, 64, 64, 64, 64, 64, -64, -64, 64, 64, 64, 64, 64, 64, 64, -64, -64, -64, 64, 64, 64, 64, 64, 64, 64, 64, 64, 64, 64, 64, 64, -64, -64, -64, -64, 64, 64, 64, 64, 64, 64, 64, 64, 64, -64, 64, -64, -64, 64, 64, 64, 64, 64, 64, 64, 64, 64, 64, -64, -64, -64, -64, -64, 64, 64, 64, 64, 64, 64, 64, -64, -64, -64, 64, -64, 64, 64, -64, -64, 64, 64, 64, 64, 64, 64, -64, -64, -64, -64, -64, 64, 64, 64, 64, 64, -64, 64, -64, -64, 64, -64, -64, 64, 64, 64, 64, 64, 64, 64, 64, 64, 64, -64, -64, -64, 64, -64, -64, 64, 64, 64, -64, 64, -64, 64, 64, -64, 64, -64, 64, 64, 64, -64, -64, 64, 64, 64, -64, -64, -64, -64, -64, 64, -64, -64, -64, -64, -64, 64, -64, -64, -64, 64, 64, 64, -64, -64, 64, -64, -64, 64, 64, -64, -64, -64, -64, -64, -64, -64, 64, 64, -64, -64, -64, -64, 64, -64, -64, -64, -64, -64, -64, 64, 64, -64, -64, 64, -64, 64, -64, 64, 64, -64, -64, -64, -64, -64, 64, 64, -64, -64, -64, -64, -64, -64, -64, 64, -64, 64, -64, -64, -64, 64, 64, -64, 64, -64, -64, 64, -64, -64, -64, -64, 64, -64, -64, 64, 64, 64, 64, -64, -64, -64, -64, 64, -64, -64, -64, -64, 64, 64, 64, -64, -64, -64, 64, 64, -64, -64, 64, 64, 64, -64, -64, 64, -64, -64, -64, 64, 64, 64, 64, -64, 64, 64, -64, 64, -64, 64, 64, 64, 64, 64, -64, 64, -64, 64, 64, -64, -64, -64, -64, -64, -64, -64, -64, 64, 64, 64, 64, 64, 64, 64, 64, -64, -64, -64, -64, 64, 64, -64, -64, -64, -64, -64, -64, -64, 64, -64, -64, -64, -64, -64, -64, 64, 64, 64, 64, 64, 64, 64, -64, 64, 64, -64, -64, 64, 64, -64, -64, -64, 64, -64, -64, 64, -64, -64, -64, -64, -64, -64, 64, -64, 64, 64, -64, 64, 64, 64, -64, 64, 64, 64, -64, 64, 64, -64, -64, -64, -64, -64, -64, -64, -64, -64, -64, -64, -64, -64, -64, 64, -64, -64, 64, 64, 64, -64, -64, 64, -64, -64, -64, 64, 64, 64, -64, 64, -64, -64, -64, -64, -64, -64, -64, -64, -64, -64, -64, -64, -64, -64, -64, 64, -64, 64, 64, 64, -64, -64, -64, -64, 64, -64, -64, -64, -64, -64, -64, -64, -64, -64, -64, -64, -64, -64, 64, 64, 64, -64, -64, 64, 64, 64, -64, -64, 64, -64, -64, 64, -64, 64, 64, -64, -64, -64, -64, -64, -64, -64, -64, -64, -64, 64, 64, 64, -64, 64, -64, 64, 64, 64, -64, -64, -64, 64, -64, 64, 64, -64, -64, -64, -64, -64, -64, -64, -64, -64, -64, -64, 64, 64, 64, 64, -64, 64, -64, -64, 64, 64, 64, 64, 64, -64, 64, -64, -64, -64, -64, -64, -64, -64, -64, -64, -64, -64, -64, 64, 64, 64, 64, 64, 64, 64, 64, 64, 64, 64, 64, 64, -64, -64, 64, -64, -64, 64, -64, -64, -64, -64, -64, -64, -64, -64, 64, 64, 64, 64, 64, -64, -64, -64, -64, -64, -64, 64, 64, 64, -64, 64, -64, 64, -64, -64, -64, 64, -64, -64, -64, -64, -64, 64, 64, 64, 64, 64, 64, -64, -64, -64, -64, -64, 64, 64, 64, 64, 64, 64, 64, -64, 64, -64, -64, -64, 64, -64, -64, 64, 64, 64, -64, -64, 64, 64, -64, -64, -64, -64, -64, -64, -64, -64, -64, 64, 64, -64, 64, 64, 64, -64, 64, -64, -64, -64, -64, -64, 64, 64, -64, -64, -64, 64, -64, -64, 64, -64, -64, -64, -64, -64, -64, 64, -64, 64, -64, -64, 64, 64, -64, -64, -64, -64, -64, -64, 64, 64, 64, 64, -64, -64, -64, -64, -64, -64, 64, -64, -64, -64, -64, -64, 64, 64, 64, 64, 64, -64, 64, -64, -64, -64, -64, -64, 64, 64, -64, 64, -64, -64, 64, -64, -64, -64, -64, -64, -64, -64, -64, -64, 64, 64, 64, -64, 64, 64, 64, 64, 64, -64, -64, 64, -64, 64, -64, 64, 64, -64, -64, -64, -64, -64, -64, -64, -64, -64, -64, 64, 64, 64, -64, 64, -64, 64, -64, -64, 64, -64, 64, 64, 64, 64, 64, 64, -64, -64, -64, -64, -64, -64, -64, -64, -64, -64, -64, -64, -64, 64, 64, -64, -64, 64, -64, -64, -64, 64, 64, -64, 64, 64, 64, -64, -64, 64, -64, -64, -64, -64, -64, -64, 64, -64, 64, -64, 64, 64, -64, 64, 64, -64, 64, 64, 64, 64, 64, 64, 64, 64, -64, -64, -64, -64, -64, -64, -64, -64, -64, -64, 64, -64, -64, 64, 64, 64, -64, -64, 64, -64, -64, -64, 64, 64, -64, 64, -64, -64, 64, -64, -64, -64, -64, -64, -64, -64, -64, -64, -64, -64, -64, -64, 64, -64, -64, 64, 64, -64, 64, 64, 64, 64, -64, -64, 64, -64, -64, -64, -64, -64, -64, 64, -64, -64, -64, -64, 64, -64, -64, -64, -64, 64, -64, -64, -64, -64, 64, 64, -64, -64, -64, -64, -64, 64, -64, -64, -64, -64, -64, -64, -64, -64, 64, -64, -64, -64, -64, 64, -64, -64, 64, -64, 64, -64, 64, -64, -64, -64, -64, -64, -64, 64, 64, -64, 64, -64, -64, -64, 64, -64, -64, -64, 64, 64, 64, -64, 64, 64, 64, 64, 64, -64, -64, -64, -64, -64, -64, -64, -64, 64, -64, 64, -64, -64, -64, -64, -64, 64, 64, -64, 64, 64, -64, -64, 64, -64, -64, -64, 64, -64, -64, 64, -64, -64, -64, -64, 64, -64, 64, -64, -64, -64, -64, -64, -64, 64, 64, 64, -64, 64, -64, -64, -64, 64, -64, -64, -64, -64, -64, -64, -64, 64, 64, -64, 64, -64, 64, 64, 64, -64, 64, -64, 64, 64, -64, -64, -64, 64, 64, 64, 64, 64, 64, -64, 64, -64, 64, -64, 64, -64, -64, 64, 64, 64, 64, 64, -64, -64, 64, 64, 64, -64, 64, 64, -64, 64, 64, 64, -64, -64, -64, 64, 64, 64, -64, 64, -64, -64, 64, 64, -64, 64, 64, -64, 64, 64, 64, -64, -64, 64, 64, 64, 64, -64, -64, -64, -64, -64, -64, 64, -64, 64, 64, -64, 64, 64, -64, -64, -64, -64, 64, 64, 64, 64, 64, -64, -64, 64, 64, -64, -64, 64, -64, 64, 64, 64, -64, 64, 64, 64, -64, -64, -64, -64, -64, -64, -64, -64, -64, -64, 64, 64, 64, -64, -64, -64, -64, -64, -64, -64, 64, -64, -64, 64, 64, -64, 64, 64, 64, -64, 64, -64, -64, 64, 64, 64, 64, 64, 64, 64, 64, -64, -64, -64, 64, 64, 64, 64, -64, -64, -64, -64, 64, 64, 64, 64, 64, 64, -64, 64, -64, 64, -64, 64, -64, 64, 64, 64, 64, -64, -64, 64, -64, 64, 64, 64, 64, -64, -64, 64, 64, -64, 64, 64, 64, 64, 64, 64, -64, -64, 64, -64, -64, -64, -64, 64, 64, 64, 64, -64, 64, 64, 64, 64, 64, 64, 64, 64, 64, 64, 64, 64, 64, 64, 64, 64, 64, -64, -64, -64, -64, -64, -64, 64, 64, -64, -64, -64, 64, 64, 64, 64, 64, 64, -64, -64, -64, 64, 64, 64, 64, 64, -64, 64, -64, -64, -64, -64, -64, -64, 64, 64, 64, 64, -64, -64, -64, -64, -64, 64, 64, 64, -64, -64, -64, 64, -64, 64, -64, -64, -64, -64, 64, -64, -64, -64, -64, -64, 64, 64, 64, -64, -64, -64, -64, -64, -64, 64, 64, 64, -64, -64, -64, 64, -64, 64, 64, -64, -64, -64, 64, -64, -64, -64, -64, 64, 64, 64, 64, -64, -64, -64, -64, -64, -64, -64, 64, 64, 64, -64, -64, 64, 64, -64, 64, -64, -64, -64, -64, -64, -64, -64, -64, 64, 64, 64, 64, 64, -64, -64, -64, -64, -64, -64, 64, -64, -64, 64, 64, -64, 64, 64, -64, -64, -64, -64, 64, -64, -64, -64, -64, 64, 64, 64, 64, -64, 64, -64, -64, -64, -64, -64, -64, -64, -64, -64, 64, 64, 64, 64, 64, -64, -64, 64, 64, -64, -64, -64, -64, -64, 64, 64, 64, -64, -64, -64, -64, -64, 64, -64, 64, -64, 64, -64, -64, 64, -64, 64, 64, -64, 64, -64, -64, 64, -64, -64, -64, 64, 64, -64, -64, -64, -64, -64, -64, -64, 64, -64, 64, -64, -64, -64, -64, -64, 64, -64, -64, -64, -64, 64, 64, 64, -64, -64, 64, 64, 64, 64, 64, -64, -64, -64, 64, -64, 64, 64, -64, -64, 64, -64, 64, 64, -64, 64, -64, 64, -64, 64, -64, -64, -64, -64, 64, 64, -64, -64, -64, -64, -64, -64, -64, -64, 64, 64, -64, 64, 64, 64, 64, 64, 64, 64, -64, 64, 64, -64, 64, 64, 64, 64, 64, 64, 64, -64, -64, -64, -64, -64, -64, -64, -64, 64, 64, -64, -64, 64, 64, 64, 64, 64, -64, 64, -64, -64, 64, -64, 64, 64, 64, 64, -64, 64, -64, -64, -64, -64, -64, -64, -64, -64, -64, 64, -64, -64, 64, 64, -64, 64, 64, -64, 64, -64, 64, 64, 64, 64, 64, 64, 64, 64, 64, 64, -64, -64, 64, 64, -64, 64, 64, 64, 64, 64, -64, 64, 64, 64, 64, 64, 64, 64, 64, 64, 64, -64, -64, 64, 64, -64, 64, 64, 64, 64, 64, 64, 64, -64, -64, -64, 64, -64, 64, 64, 64, 64, 64, 64, 64, -64, -64, 64, -64, -64, -64, -64, 64, 64, 64, 64, 64, -64, 64, 64, 64, 64, 64, 64, 64, -64, 64, 64, 64, 64, 64, 64, 64, -64, -64, -64, -64, -64, -64, 64, -64, -64, 64, 64, 64, 64, -64, 64, -64, -64, 64, 64, -64, 64, 64, -64, 64, 64, 64, -64, 64, 64, -64, -64, -64, -64, -64, -64, -64, -64, 64, 64, -64, 64, 64, -64, 64, 64, 64, 64, -64, 64, 64, 64, -64, -64, -64, -64, 64, 64, 64, -64, -64, -64, -64, 64, -64, -64, 64, 64, 64, 64, -64, -64, 64, 64, -64, 64, -64, 64, -64, 64, -64, -64, -64, -64, -64, -64, -64, -64, 64, -64, -64, -64, 64, -64, 64, 64, -64, 64, 64, 64, -64, -64, 64, -64, -64, 64, -64, 64, 64, 64, 64, -64, 64, -64, 64, -64, -64, -64, 64, 64, -64, -64, -64, -64, 64, -64, -64, -64, 64, 64, -64, 64, 64, -64, 64, -64, -64, -64, -64, 64, 64, 64, 64, -64, -64, 64, 64, -64, 64, -64, -64, -64, -64, -64, -64, 64, 64, 64, 64, 64, 64, -64, -64, -64, 64, 64, 64, 64, 64, 64, 64, 64, -64, -64, -64, -64, -64, -64, 64, -64, -64, 64, 64, -64, -64, 64, 64, -64, -64, -64, -64, -64, -64, -64, -64, -64, 64, 64, -64, 64, -64, -64, 64, 64, 64, -64, -64, 64, -64, -64, -64, -64, -64, 64, 64, -64, -64, -64, -64, -64, 64, 64, -64, -64, -64, 64, 64, -64, 64, 64, 64, -64, -64, 64, -64, 64, -64, 64, -64, 64, -64, -64, 64, -64, -64, 64, -64, 64, 64, 64, 64, 64, -64, 64, 64, -64, -64, 64, 64, 64, 64, -64, 64, 64, -64, -64, 64, 64, -64, -64, -64, 64, 64, -64, -64, 64, -64, 64, -64, 64, 64, 64, 64, 64, -64, 64, -64, -64, -64, -64, -64, -64, -64, 64, -64, 64, -64, -64, 64, -64, 64, -64, -64, -64, 64, -64, -64, -64, 64, 64, 64, 64, -64, -64, 64, -64, -64, -64, -64, -64, -64, 64, -64, -64, -64, -64, -64, 64, 64, 64, -64, -64, -64, -64, -64, -64, 64, 64, 64, -64, 64, 64, 64, -64, -64, 64, -64, -64, 64, 64, 64, 64, -64, -64, -64, 64, 64, -64, 64, 64, 64, 64, -64, -64, 64, 64, 64, 64, 64, 64, -64, 64, 64, 64, 64, 64, 64, 64, 64, 64, 64, -64, -64, 64, 64, -64, 64, 64, 64, -64, -64, 64, 64, 64, 64, 64, 64, 64, -64, -64, -64, 64, -64, 64, 64, 64, 64, -64, -64, 64, -64, -64, -64, -64, -64, 64, 64, -64, -64, -64, -64, 64, 64, 64, -64, 64, -64, -64, -64, -64, -64, -64, 64, 64, 64, 64, 64, 64, 64, 64, 64, 64, 64, 64, 64, -64, -64, -64, -64, 64, -64, -64, -64, -64, -64, -64, -64, -64, 64, -64, 64, 64, -64, 64, 64, -64, -64, 64, 64, -64, 64, -64, 64, -64, -64, -64, 64, -64, -64, -64, -64, -64, -64, -64, -64, -64, -64, -64, 64, -64, -64, -64, 64, 64, -64, -64, 64, -64, -64, 64, -64, -64, 64, -64, -64, -64, -64, -64, 64, -64, -64, -64, -64, -64, -64, 64, 64, 64, 64, -64, 64, -64, 64, 64, -64, -64, -64, 64, 64, -64, -64, -64, -64, -64, -64, -64, -64, -64, -64, -64, -64, -64, 64, 64, 64, 64, -64, 64, -64, 64, -64, 64, -64, -64, -64, 64, -64, -64, -64, 64, 64, -64, -64, -64, -64, -64, -64, -64, -64, -64, -64, -64, 64, 64, -64, 64, -64, -64, 64, 64, -64, 64, -64, 64, -64, -64, -64, 64, -64, -64, -64, -64, -64, -64, -64, -64, -64, -64, 64, -64, -64, -64, 64, -64, -64, 64, 64, 64, 64, 64, -64, -64, -64, 64, -64, 64, -64, -64, -64, -64, -64, -64, -64, -64, -64, -64, -64, -64, -64, -64, -64, 64, 64, 64, 64, 64, 64, 64, 64, -64, 64, -64, -64, -64, -64, -64, -64, -64, -64, -64, -64, 64, 64, -64, -64, -64, -64, 64, -64, 64, 64, -64, -64, -64, 64, -64, 64, -64, -64, -64, -64, 64, -64, -64, -64, 64, -64, -64, -64, 64, 64, -64, -64, -64, -64, 64, -64, 64, -64, -64, -64, -64, 64, -64, -64, -64, -64, -64, -64, -64, 64, -64, -64, -64, -64, 64, -64, -64, 64, -64, -64, 64, -64, 64, 64, -64, -64, -64, 64, -64, -64, -64, -64, -64, -64, -64, 64, -64, 64, 64, 64, -64, -64, -64, 64, 64, -64, -64, -64, -64, -64, -64, 64, 64, 64, 64, 64, 64, -64, 64, -64, -64, -64, -64, 64, 64, 64, 64, 64, 64, 64, 64, 64, -64, -64, -64, -64, -64, -64, -64, 64, 64, -64, 64, 64, 64, -64, -64, 64, 64, -64, -64, -64, 64, 64, 64, -64, 64, -64, -64, -64, -64, -64, -64, -64, -64, -64, 64, 64, 64, 64, -64, -64, -64, -64, -64, 64, 64, 64, 64, 64, -64, 64, 64, 64, 64, -64, -64, -64, -64, -64, -64, -64, -64, -64, -64, 64, 64, 64, 64, -64, 64, 64, -64, -64, 64, 64, -64, 64, 64, 64, 64, 64, -64, -64, -64, -64, -64, -64, -64, -64, 64, -64, -64, 64, 64, -64, 64, 64, 64, 64, 64, -64, -64, 64, 64, 64, 64, 64, 64, 64, -64, -64, 64, 64, 64, -64, 64, 64, 64, 64, -64, -64, -64, -64, -64, 64, 64, 64, 64, -64, -64, 64, 64, -64, 64, 64, -64, -64, 64, 64, 64, 64, 64, 64, -64, 64, 64, 64, -64, 64, 64, -64, 64, -64, 64, -64, -64, 64, 64, 64, 64, 64, 64, 64, -64, -64, -64, -64, -64, -64, -64, 64, 64, -64, -64, -64, -64, -64, -64, 64, -64, 64, -64, -64, 64, 64, -64, -64, -64, -64, -64, -64, -64, -64, -64, 64, -64, 64, 64, -64, 64, 64, 64, -64, -64, 64, -64, 64, 64, 64, 64, -64, -64, 64, 64, -64, -64, 64, 64, -64, 64, 64, 64, -64, -64, -64, 64, -64, -64, -64, 64, -64, -64, 64, 64, -64, -64, 64, -64, 64, -64, -64, -64, -64, -64, -64, 64, 64, 64, 64, 64, -64, 64, 64, 64, 64, -64, -64, 64, 64, -64, -64, 64, 64, -64, -64, 64, 64, 64, 64, 64, 64, -64, 64, -64, -64, -64, -64, 64, -64, 64, 64, 64, 64, 64, 64, 64, 64, -64, -64, -64, 64, 64, -64, -64, 64, 64, -64, 64, -64, 64, -64, -64, 64, 64, -64, 64, 64, -64, 64, 64, 64, 64, -64, -64, -64, -64, 64, -64, -64, -64, 64, 64, 64, 64, -64, 64, -64, -64, 64, -64, 64, -64, 64, 64, 64, 64, 64, 64, 64, 64, -64, 64, 64, -64, 64, 64, 64, 64, 64, -64, 64, 64, -64, -64, -64, -64, 64, 64, -64, -64, 64, -64, 64, 64, 64, 64, 64, 64, 64, 64, 64, 64, 64, 64, -64, -64, -64, -64, -64, -64, -64, 64, -64, -64, 64, 64, -64, 64, 64, 64, 64, 64, 64, 64, -64, 64, 64, 64, 64, -64, -64, 64, -64, -64, -64, -64, -64, -64, -64, 64, -64, 64, -64, -64, -64, -64, -64, 64, 64, 64, -64, 64, -64, 64, 64, -64, 64, 64, 64, -64, -64, -64, -64, -64, -64, -64, -64, -64, 64, -64, -64, -64, 64, 64, 64, 64, -64, 64, 64, 64, 64, 64, 64, 64, -64, 64, -64, -64, -64, -64, -64, -64, 64, 64, 64, 64, -64, -64, 64, -64, 64, 64, -64, 64, 64, 64, 64, 64, -64, -64, 64, 64, 64, -64, -64, -64, -64, -64, -64, 64, -64, -64, 64, 64, -64, 64, 64, 64, 64, -64, 64, 64, 64, 64, -64, 64, -64, 64, -64, 64, 64, 64, -64, 64, -64, -64, -64, -64, 64, 64, -64, -64, -64, 64, 64, -64, -64, 64, 64, 64, 64, 64, -64, -64, 64, -64, 64, 64, 64, 64, 64, 64, 64, 64, -64, 64, -64, 64, -64, 64, -64, 64, 64, -64, 64, 64, 64, 64, -64, -64, -64, -64, -64, -64, 64, 64, 64, -64, 64, 64, 64, 64, -64, 64, 64, -64, -64, 64, -64, 64, 64, 64, 64, -64, -64, 64, -64, -64, -64, -64, 64, 64, -64, 64, -64, 64, -64, 64, 64, -64, -64, 64, 64, -64, 64, -64, -64, 64, 64, 64, 64, -64, -64, 64, 64, 64, 64, 64, 64, -64, 64, 64, 64, 64, 64, 64, 64, 64, -64, 64, 64, 64, -64, 64, -64, 64, 64, -64, 64, -64, 64, 64, -64, 64, 64, -64, -64, -64, -64, 64, 64, 64, 64, -64, 64, 64, 64, 64, 64, -64, 64, -64, 64, -64, 64, 64, -64, 64, 64, 64, 64, 64, 64, 64, -64, 64, 64, 64, 64, 64, 64, -64, -64, -64, -64, -64, 64, 64, 64, -64, 64, 64, -64, -64, -64, 64, 64, 64, 64, 64, 64, -64, -64, 64, 64, 64, 64, -64, 64, -64, 64, 64, 64, -64, -64, 64, -64, 64, -64, -64, 64, 64, -64, -64, 64, 64, 64, 64, -64, 64, 64, 64, -64, 64, -64, 64, 64, 64, 64, 64, 64, -64, -64, 64, 64, -64, 64, 64, -64, -64, -64, -64, -64, -64, 64, -64, -64, 64, -64, -64, -64, 64, 64, 64, -64, 64, -64, 64, 64, -64, -64, 64, 64, 64, 64, 64, -64, 64, -64, -64, -64, -64, 64, 64, 64, 64, 64, -64, -64, 64, 64, 64, 64, 64, 64, 64, -64, -64, 64, 64, -64, -64, 64, 64, -64, 64, 64, 64, 64, 64, 64, 64, 64, 64, 64, 64, 64, 64, 64, 64, 64, 64, 64, 64, -64, 64, 64, 64, 64, -64, 64, 64, -64, 64, -64, 64, -64, 64, 64, 64, 64, 64, 64, -64, -64, 64, 64, -64, 64, 64, 64, -64, -64, 64, -64, 64, -64, -64, -64, -64, -64, -64, 64, 64, 64, 64, 64, -64, 64, -64, -64, 64, -64, 64, -64, 64, 64, 64, -64, -64, 64, 64, -64, 64, -64, 64, 64, -64, 64, -64, -64, 64, 64, 64, 64, -64, -64, -64, -64, -64, -64, -64, 64, -64, 64, 64, 64, 64, 64, -64, 64, -64, -64, -64, -64, -64, 64, -64, 64, -64, -64, 64, 64, 64, 64, -64, -64, -64, -64, 64, -64, 64, 64, 64, 64, 64, 64, 64, 64, -64, 64, 64, 64, 64, 64, 64, 64, -64, -64, -64, -64, 64, -64, -64, 64, 64, 64, -64, 64, 64, -64, -64, 64, -64, -64, 64, -64, -64, -64, 64, -64, -64, -64, 64, -64, 64, 64, -64, 64, -64, -64, -64, -64, -64, 64, -64, 64, 64, -64, -64, 64, 64, 64, -64, 64, 64, 64, 64, 64, 64, -64, -64, -64, 64, 64, 64, -64, -64, -64, -64, -64, -64, 64, 64, -64, -64, -64, -64, -64, 64, 64, -64, -64, 64, 64, 64, -64, 64, 64, 64, 64, -64, 64, 64, 64, 64, -64, 64, 64, 64, 64, 64, -64, -64, 64, 64, 64, -64, 64, 64, -64, 64, 64, 64, 64, -64, -64, -64, -64, -64, -64, 64, 64, 64, 64, -64, 64, -64, 64, -64, -64, -64, -64, 64, -64, 64, -64, -64, -64, -64, -64, 64, -64, -64, -64, -64, -64, -64, -64, -64, 64, -64, -64, -64, -64, -64, -64, 64, 64, 64, -64, -64, 64, 64, 64, 64, -64, -64, -64, 64, -64, -64, 64, -64, -64, -64, -64, -64, -64, -64, -64, -64, 64, -64, -64, 64, 64, 64, 64, 64, 64, 64, 64, 64, -64, -64, 64, 64, -64, -64, 64, -64, -64, 64, -64, -64, -64, -64, -64, 64, 64, 64, 64, -64, -64, 64, 64, 64, 64, 64, -64, -64, -64, 64, -64, -64, -64, 64, -64, 64, 64, -64, -64, -64, -64, -64, -64, 64, -64, -64, -64, -64, -64, 64, 64, 64, 64, -64, -64, -64, 64, -64, 64, 64, -64, 64, 64, 64, 64, -64, -64, -64, -64, -64, -64, -64, 64, -64, -64, -64, -64, 64, 64, -64, 64, 64, 64, 64, -64, 64, -64, 64, 64, 64, -64, -64, 64, -64, -64, 64, -64, 64, -64, 64, -64, -64, 64, 64, -64, 64, 64, -64, 64, 64, -64, -64, -64, -64, -64, 64, 64, 64, 64, -64, 64, -64, -64, -64, 64, -64, -64, -64, -64, -64, 64, -64, 64, 64, 64, 64, 64, 64, 64, -64, 64, -64, -64, -64, -64, -64, -64, 64, 64, -64, 64, 64, 64, -64, -64, -64, 64, 64, -64, 64, 64, 64, 64, 64, 64, -64, -64, 64, 64, 64, -64, -64, 64, 64, 64, 64, 64, 64, 64, 64, -64, -64, -64, 64, -64, -64, -64, -64, -64, -64, 64, -64, 64, 64, 64, 64, -64, 64, -64, 64, 64, 64, 64, 64, 64, -64, 64, -64, -64, 64, 64, -64, -64, -64, -64, -64, -64, 64, 64, 64, 64, 64, -64, 64, 64, 64, 64, 64, 64, 64, 64, 64, 64, 64, -64, -64, -64, -64, -64, 64, 64, 64, -64, -64, -64, 64, 64, 64, 64, -64, 64, 64, 64, 64, 64, -64, 64, 64, 64, 64, 64, 64, -64, -64, -64, -64, 64, 64, 64, -64, -64, -64, -64, 64, 64, 64, 64, 64, -64, 64, -64, 64, -64, -64, 64, 64, 64, 64, 64, -64, -64, 64, -64, 64, -64, 64, -64, -64, 64, -64, -64, -64, 64, 64, 64, -64, -64, 64, 64, 64, 64, 64, 64, 64, 64, 64, 64, -64, 64, -64, -64, -64, 64, 64, -64, -64, -64, -64, -64, -64, -64, -64, -64, 64, 64, 64, -64, 64, 64, 64, 64, 64, 64, 64, 64, -64, -64, 64, -64, -64, -64, 64, 64, 64, 64, 64, -64, 64, -64, -64, -64, 64, -64, 64, -64, -64, 64, 64, 64, 64, 64, 64, 64, -64, -64, 64, 64, 64, -64, -64, 64, -64, 64, 64, -64, -64, -64, -64, -64, 64, 64, -64, -64, -64, -64, -64, 64, -64, -64, 64, 64, 64, -64, 64, -64, 64, -64, -64, 64, 64, 64, -64, 64, -64, 64, 64, -64, 64, 64, 64, -64, -64, -64, -64, -64, -64, 64, 64, 64, 64, -64, 64, 64, -64, -64, -64, -64, 64, -64, 64, -64, 64, 64, -64, -64, -64, 64, -64, 64, 64, -64, 64, 64, 64, 64, -64, -64, -64, -64, -64, 64, -64, -64, -64, -64, -64, -64, 64, -64, -64, -64, 64, -64, -64, 64, 64, 64, -64, 64, 64, 64, 64, 64, 64, -64, 64, 64, -64, 64, -64, -64, -64, -64, -64, -64, -64, -64, 64, -64, 64, 64, 64, -64, 64, -64, -64, -64, -64, 64, -64, -64, 64, 64, -64, -64, -64, -64, 64, -64, 64, -64, -64, 64, 64, 64, -64, 64, 64, 64, 64, -64, 64, -64, 64, 64, 64, 64, -64, -64, 64, 64, 64, -64, -64, 64, 64, -64, -64, -64, -64, -64, 64, -64, -64, 64, 64, 64, -64, 64, -64, -64, -64, -64, 64, -64, -64, -64, 64, -64, 64, -64, 64, -64, -64, -64, 64, 64, 64, -64, -64, -64, -64, 64, 64, 64, -64, 64, 64, -64, -64, 64, -64, -64, 64, -64, -64, 64, 64, 64, 64, 64, -64, -64, 64, -64, -64, 64, -64, -64, -64, 64, 64, -64, 64, 64, 64, -64, 64, -64, 64, -64, -64, 64, 64, -64, 64, -64, -64, 64, 64, -64, 64, -64, -64, 64, 64, 64, -64, -64, -64, 64, 64, 64, 64, -64, -64, 64, -64, 64, -64, 64, -64, -64, -64, -64, 64, 64, -64, -64, -64, -64, 64, 64, -64, 64, -64, -64, 64, 64, 64, 64, -64, 64, -64, 64, 64, -64, 64, -64, -64, -64, -64, 64, 64, -64, -64, 64, -64, -64, 64, -64, 64, -64, -64, -64, -64, 64, -64, 64, 64, 64, 64, -64, 64, -64, 64, -64, 64, -64, 64, 64, 64, 64, 64, 64, -64, -64, -64, -64, 64, -64, -64, -64, -64, -64, -64, 64, 64, -64, -64, 64, 64, 64, -64, 64, 64, 64, 64, 64, 64, 64, 64, 64, 64, 64, 64, 64, 64, -64, -64, -64, -64, -64, 64, 64, 64, -64, -64, -64, 64, 64, 64, 64, -64, -64, 64, 64, 64, 64, 64, 64, 64, 64, 64, 64, 64, -64, -64, -64, -64, 64, -64, -64, 64, 64, 64, -64, -64, -64, 64, 64, -64, -64, -64, 64, 64, 64, 64, 64, 64, 64, -64, 64, -64, -64, 64, -64, 64, 64, 64, -64, 64, 64, 64, 64, -64, -64, 64, 64, 64, 64, -64, 64, 64, 64, 64, -64, -64, -64, -64, -64, -64, -64, -64, 64, 64, -64, -64, 64, 64, -64, -64, 64, -64, -64, 64, 64, 64, 64, 64, 64, 64, 64, 64, 64, -64, 64, -64, 64, 64, 64, 64, 64, -64, -64, -64, 64, 64, 64, 64, -64, 64, -64, 64, 64, 64, 64, 64, 64, 64, -64, -64, -64, -64, 64, 64, 64, 64, 64, 64, 64, 64, 64, 64, 64, -64, 64, 64, 64, 64, 64, 64, 64, 64, 64, 64, 64, -64, -64, -64, -64, 64, 64, 64, 64, 64, 64, 64, 64, -64, -64, 64, 64, 64, -64, -64, 64, -64, 64, 64, 64, 64, 64, 64, -64, -64, -64, -64, -64, -64, 64, 64, 64, -64, 64, -64, -64, -64, 64, 64, 64, 64, 64, -64, -64, -64, 64, 64, 64, 64, 64, 64, -64, -64, -64, 64, 64, 64, 64, 64, 64, -64, 64, 64, -64, 64, -64, 64, 64, 64, 64, -64, 64, 64, -64, 64, 64, 64, 64, -64, -64, 64, 64, 64, -64, 64, -64, -64, 64, 64, 64, 64, 64, 64, 64, 64, 64, 64, -64, -64, 64, -64, 64, -64, 64, 64, -64, -64, -64, 64, 64, 64, 64, -64, -64, 64, 64, 64, 64, 64, 64, 64, 64, 64, 64, 64, -64, 64, -64, -64, -64, -64, 64, 64, -64, -64, 64, 64, 64, 64, 64, -64, 64, 64, 64, 64, 64, 64, 64, -64, 64, 64, 64, 64, 64, 64, 64, -64, -64, 64, 64, 64, -64, -64, -64, 64, 64, 64, -64, 64, -64, -64, 64, 64, 64, 64, -64, -64, 64, -64, 64, 64, -64, 64, -64, 64, 64, 64, 64, 64, 64, -64, -64, -64, -64, -64, -64, -64, -64, -64, 64, 64, 64, -64, 64, 64, -64, -64, 64, 64, 64, -64, 64, -64, 64, 64, 64, 64, 64, -64, 64, 64, 64, -64, -64, -64, -64, -64, 64, 64, 64, 64, 64, 64, 64, 64, -64, -64, 64, -64, 64, -64, 64, 64, 64, 64, 64, 64, 64, 64, -64, -64, -64, -64, -64, 64, 64, 64, 64, 64, 64, 64, 64, 64, 64, 64, 64, -64, 64, -64, 64, 64, 64, 64, 64, 64, 64, 64, -64, 64, -64, 64, 64, -64, 64, 64, -64, 64, 64, 64, 64, 64, 64, 64, 64, -64, -64, 64, 64, 64, 64, 64, 64, 64, 64, 64, 64, -64, -64, 64, 64, 64, -64, 64, -64, -64, 64, 64, 64, 64, 64, -64, 64, -64, -64, -64, 64, 64, 64, 64, 64, 64, 64, 64, 64, 64, -64, 64, 64, -64, -64, 64, 64, 64, 64, 64, -64, 64, -64, -64, 64, -64, 64, 64, -64, -64, 64, 64, 64, -64, -64, 64, 64, 64, 64, 64, 64, 64, 64, 64, 64, 64, -64, 64, -64, -64, 64, -64, -64, 64, 64, 64, 64, 64, 64, -64, -64, -64, -64, -64, -64, 64, 64, 64, -64, 64, -64, 64, 64, 64, 64, 64, 64, 64, -64, -64, -64, -64, -64, 64, 64, 64, -64, -64, -64, -64, -64, 64, -64, -64, -64, 64, -64, -64, 64, 64, 64, 64, 64, 64, -64, -64, -64, -64, -64, 64, -64, -64, 64, 64, -64, -64, -64, -64, -64, 64, 64, 64, 64, 64, -64, 64, -64, -64, 64, 64, 64, 64, 64, -64, 64, -64, -64, -64, 64, -64, 64, 64, -64, 64, 64, 64, -64, 64, 64, -64, -64, -64, -64, -64, -64, 64, -64, -64, -64, -64, -64, -64, 64, 64, 64, -64, 64, 64, 64, 64, 64, 64, -64, -64, 64, -64, 64, -64, -64, -64, 64, 64, -64, -64, 64, -64, 64, 64, -64, -64, -64, -64, 64, 64, -64, -64, -64, 64, 64, -64, -64, -64, 64, 64, 64, -64, 64, 64, -64, 64, -64, -64, 64, 64, 64, 64, 64, -64, 64, 64, 64, 64, 64, 64, 64, 64, -64, -64, -64, -64, -64, -64, 64, 64, 64, 64, -64, 64, -64, -64, 64, -64, -64, 64, 64, 64, -64, 64, 64, 64, 64, -64, -64, -64, -64, -64, -64, 64, 64, 64, 64, 64, -64, 64, -64, 64, -64, -64, -64, -64, -64, -64, -64, 64, 64, -64, 64, -64, -64, -64, -64, 64, -64, 64, -64, -64, -64, -64, -64, 64, 64, 64, 64, 64, 64, -64, 64, -64, -64, -64, -64, -64, -64, -64, 64, 64, 64, 64, -64, 64, -64, -64, 64, -64, -64, -64, 64, 64, 64, 64, -64, -64, -64, -64, 64, -64, -64, -64, -64, -64, 64, 64, 64, 64, 64, 64, 64, 64, 64, -64, 64, -64, -64, -64, -64, -64, -64, 64, -64, -64, -64, -64, 64, 64, -64, -64, -64, -64, -64, 64, -64, 64, 64, -64, -64, -64, 64, -64, 64, -64, -64, 64, -64, -64, -64, -64, -64, -64, 64, -64, -64, -64, -64, 64, -64, -64, 64, 64, 64, -64, 64, 64, -64, 64, -64, -64, -64, 64, -64, -64, -64, -64, -64, -64, -64, -64, -64, -64, 64, 64, -64, 64, 64, -64, -64, -64, 64, -64, -64, -64, 64, -64, -64, -64, -64, -64, -64, -64, -64, -64, 64, -64, -64, 64, 64, -64, -64, 64, -64, 64, -64, -64, -64, -64, 64, 64, -64, -64, 64, -64, -64, 64, -64, -64, -64, 64, 64, -64, 64, -64, -64, 64, -64, 64, 64, 64, 64, 64, 64, -64, 64, -64, -64, 64, -64, 64, -64, -64, -64, 64, -64, 64, 64, -64, 64, -64, -64, -64, 64, -64, 64, -64, 64, 64, -64, -64, 64, -64, 64, -64, 64, -64, -64, -64, -64, 64, 64, 64, 64, -64, -64, 64, 64, 64, -64, -64, 64, 64, 64, -64, 64, 64, -64, -64, -64, -64, 64, 64, -64, 64, -64, 64, 64, 64, -64, -64, 64, 64, 64, 64, -64, -64, -64, -64, -64, -64, -64, 64, 64, 64, -64, -64, -64, -64, 64, -64, -64, 64, 64, -64, -64, -64, -64, -64, -64, -64, 64, 64, -64, -64, -64, 64, 64, -64, -64, -64, 64, 64, -64, 64, -64, -64, 64, -64, 64, -64, -64, -64, 64, 64, -64, 64, -64, 64, 64, -64, -64, 64, 64, 64, -64, -64, -64, 64, -64, -64, 64, -64, -64, 64, 64, -64, 64, -64, 64, -64, -64, -64, 64, -64, -64, 64, 64, 64, -64, -64, -64, 64, 64, 64, -64, 64, -64, -64, -64, -64, -64, -64, 64, 64, 64, 64, 64, -64, 64, -64, -64, -64, -64, 64, -64, -64, -64, 64, 64, -64, -64, -64, -64, -64, -64, -64, -64, -64, -64, -64, -64, -64, -64, -64, 64, -64, 64, -64, 64, -64, 64, 64, -64, -64, 64, -64, -64, -64, 64, -64, -64, -64, -64, -64, -64, -64, -64, -64, -64, -64, 64, 64, 64, 64, -64, 64, 64, -64, -64, -64, -64, -64, -64, -64, -64, -64, 64, -64, -64, -64, -64, 64, 64, -64, -64, 64, -64, -64, -64, 64, 64, 64, -64, -64, 64, -64, -64, -64, -64, 64, -64, -64, -64, -64, -64, 64, -64, -64, -64, 64, -64, 64, -64, 64, 64, -64, -64, -64, -64, 64, -64, -64, 64, -64, -64, -64, -64, -64, 64, -64, -64, 64, -64, -64, -64, 64, 64, 64, -64, 64, -64, -64, -64, 64, -64, 64, -64, -64, -64, 64, 64, 64, 64, 64, -64, -64, 64, -64, 64, -64, 64, 64, 64, 64, 64, -64, -64, 64, 64, 64, 64, -64, -64, 64, 64, 64, 64, 64, 64, 64, -64, -64, -64, -64, -64, -64, -64, -64, -64, 64, 64, -64, -64, 64, -64, -64, -64, 64, 64, 64, 64, -64, -64, -64, 64, -64, 64, -64, -64, -64, 64, 64, 64, 64, -64, -64, 64, -64, -64, 64, -64, 64, 64, 64, 64, 64, -64, 64, -64, -64, -64, 64, 64, 64, -64, 64, 64, 64, 64, -64, -64, 64, 64, 64, -64, -64, 64, 64, 64, 64, 64, 64, -64, 64, 64, -64, -64, 64, 64, 64, -64, -64, 64, -64, -64, 64, -64, 64, -64, -64, -64, -64, 64, -64, 64, 64, 64, 64, 64, -64, 64, 64, -64, -64, -64, -64, 64, -64, 64, -64, 64, -64, 64, 64, 64, 64, 64, -64, -64, 64, -64, -64, 64, -64, -64, -64, 64, 64, -64, 64, -64, 64, 64, 64, 64, -64, -64, 64, -64, -64, 64, -64, -64, 64, -64, -64, -64, -64, 64, -64, 64, -64, 64, -64, 64, 64, -64, 64, 64, -64, 64, -64, 64, 64, 64, -64, 64, 64, 64, -64, 64, -64, -64, -64, -64, -64, -64, 64, -64, -64, 64, 64, 64, -64, -64, -64, -64, 64, 64, -64, 64, -64, 64, 64, -64, 64, -64, 64, -64, 64, -64, -64, 64, 64, 64, 64, 64, -64, -64, -64, -64, 64, -64, 64, 64, 64, 64, -64, -64, -64, 64, -64, 64, 64, -64, 64, 64, -64, -64, -64, -64, -64, -64, 64, -64, -64, 64, 64, -64, 64, 64, 64, -64, 64, -64, 64, -64, 64, 64, 64, -64, 64, 64, 64, -64, -64, -64, -64, 64, -64, -64, -64, -64, -64, -64, 64, -64, -64, -64, -64, 64, -64, -64, -64, 64, 64, -64, -64, 64, 64, 64, 64, -64, -64, -64, 64, -64, -64, -64, -64, -64, -64, -64, -64, -64, -64, -64, -64, 64, -64, -64, 64, -64, -64, 64, -64, 64, 64, -64, -64, 64, 64, 64, 64, -64, -64, 64, 64, -64, -64, 64, 64, 64, 64, -64, -64, -64, 64, 64, -64, -64, -64, -64, 64, -64, -64, -64, 64, 64, 64, 64, 64, 64, 64, 64, 64, 64, 64, 64, 64, 64, -64, -64, -64, -64, 64, -64, -64, 64, 64, 64, 64, -64, -64, 64, 64, -64, 64, 64, 64, 64, 64, 64, 64, 64, 64, 64, 64, -64, -64, -64, -64, -64, 64, -64, -64, -64, 64, -64, -64, -64, 64, 64, 64, 64, 64, 64, 64, -64, 64, 64, 64, 64, 64, 64, 64, 64, 64, -64, -64, -64, -64, 64, -64, -64, 64, -64, 64, 64, -64, 64, -64, -64, 64, -64, 64, 64, 64, -64, 64, 64, 64, 64, 64, 64, 64, 64, 64, -64, -64, 64, -64, -64, 64, 64, -64, 64, 64, -64, 64, 64, -64, -64, -64, -64, -64, -64, 64, 64, 64, 64, 64, 64, -64, 64, -64, -64, -64, 64, -64, -64, 64, 64, 64, 64, 64, 64, 64, 64, 64, 64, 64, -64, 64, 64, 64, 64, 64, 64, 64, 64, 64, -64, -64, -64, -64, 64, 64, 64, 64, 64, -64, -64, -64, 64, 64, 64, 64, -64, -64, -64, -64, 64, 64, -64, 64, 64, 64, 64, 64, -64, -64, 64, -64, 64, 64, -64, 64, -64, 64, 64, -64, 64, 64, 64, 64, 64, -64, 64, 64, 64, 64, 64, 64, 64, 64, 64, 64, 64, -64, -64, 64, -64, -64, 64, 64, -64, 64, -64, -64, -64, 64, 64, 64, -64, -64, 64, 64, 64, 64, 64, 64, 64, 64, 64, 64, -64, -64, -64, -64, -64, -64, 64, -64, 64, -64, 64, -64, 64, 64, 64, 64, 64, -64, 64, 64, 64, 64, 64, -64, 64, 64, 64, 64, 64, -64, 64, 64, -64, -64, -64, -64, 64, 64, 64, 64, 64, 64, 64, 64, -64, -64, 64, 64, 64, 64, 64, -64, 64, -64, 64, 64, -64, 64, 64, 64, 64, -64, 64, 64, -64, 64, -64, 64, 64, 64, -64, -64, -64, -64, 64, 64, 64, 64, 64, 64, 64, -64, 64, 64, -64, 64, 64, 64, -64, -64, -64, -64, -64, 64, -64, 64, 64, 64, -64, 64, -64, 64, -64, -64, 64, 64, 64, -64, -64, 64, -64, -64, 64, -64, 64, 64, 64, 64, -64, -64, 64, 64, -64, -64, -64, 64, 64, -64, -64, 64, 64, -64, -64, 64, 64, -64, -64, 64, -64, 64, 64, 64, 64, 64, 64, -64, -64, -64, -64, -64, -64, -64, 64, 64, 64, 64, 64, -64, -64, -64, 64, -64, -64, -64, -64, 64, -64, 64, 64, -64, -64, 64, 64, 64, -64, 64, -64, 64, 64, 64, 64, 64, -64, 64, 64, -64, -64, -64, -64, -64, -64, 64, 64, -64, -64, -64, -64, 64, 64, -64, 64, -64, 64, 64, 64, 64, 64, 64, 64, 64, 64, 64, 64, 64, -64, -64, 64, 64, 64, 64, -64, 64, -64, -64, -64, -64, -64, 64, 64, 64, 64, 64, 64, 64, 64, 64, 64, 64, 64, 64, 64, 64, 64, 64, 64, -64, 64, -64, 64, -64, 64, 64, 64, 64, 64, -64, 64, 64, 64, -64, 64, 64, 64, 64, 64, 64, 64, 64, 64, 64, 64, 64, -64, 64, 64, -64, -64, -64, 64, 64, 64, 64, -64, -64, 64, 64, -64, 64, -64, -64, 64, 64, 64, 64, -64, -64, -64, 64, 64, 64, 64, -64, -64, 64, 64, 64, 64, 64, 64, -64, 64, -64, -64, 64, 64, 64, -64, 64, -64, -64, -64, -64, 64, 64, -64, 64, -64, 64, -64, -64, 64, -64, -64, -64, -64, 64, 64, 64, -64, 64, -64, -64, 64, -64, -64, -64, -64, -64, 64, -64, -64, -64, -64, 64, 64, 64, -64, -64, 64, -64, -64, -64, 64, -64, 64, 64, -64, -64, 64, -64, 64, 64, -64, -64, 64, -64, 64, -64, 64, 64, -64, 64, -64, 64, -64, 64, -64, -64, 64, 64, 64, 64, 64, -64, -64, 64, 64, 64, -64, -64, 64, -64, 64, -64, -64, -64, 64, -64, -64, 64, -64, -64, 64, -64, 64, -64, 64, -64, 64, 64, 64, 64, 64, -64, 64, 64, 64, 64, -64, -64, -64, -64, 64, 64, -64, 64, 64, 64, 64, 64, 64, 64, 64, 64, 64, 64, 64, 64, 64, -64, 64, 64, 64, 64, -64, 64, 64, 64, 64, 64, 64, -64, -64, 64, 64, 64, 64, 64, -64, 64, 64, -64, -64, -64, -64, -64, -64, -64, -64, 64, -64, 64, -64, -64, 64, -64, 64, -64, 64, 64, 64, 64, 64, 64, 64, -64, 64, -64, -64, -64, -64, -64, -64, -64, -64, -64, -64, 64, 64, -64, -64, -64, -64, -64, -64, 64, -64, -64, -64, 64, 64, 64, -64, 64, 64, -64, -64, 64, -64, -64, -64, -64, -64, -64, -64, -64, 64, 64, 64, -64, 64, -64, -64, 64, 64, -64, 64, 64, 64, -64, 64, 64, 64, 64, 64, 64, 64, -64, -64, -64, -64, -64, 64, 64, 64, -64, -64, -64, 64, 64, 64, 64, -64, 64, -64, -64, 64, 64, 64, 64, 64, 64, 64, 64, -64, -64, -64, -64, -64, -64, -64, -64, -64, -64, 64, 64, 64, 64, 64, -64, -64, -64, -64, -64, -64, 64, 64, -64, -64, 64, 64, -64, -64, -64, -64, -64, -64, -64, -64, -64, 64, 64, -64, 64, -64, 64, 64, -64, 64, -64, -64, 64, -64, -64, 64, 64, 64, -64, -64, 64, -64, -64, -64, -64, -64, -64, -64, -64, 64, 64, -64, 64, 64, 64, 64, -64, -64, 64, 64, 64, 64, -64, 64, 64, 64, 64, 64, 64, -64, -64, -64, 64, -64, -64, -64, -64, 64, -64, -64, 64, 64, 64, -64, -64, -64, 64, 64, -64, 64, 64, -64, 64, -64, 64, 64, 64, -64, -64, -64, -64, -64, -64, 64, -64, 64, 64, -64, -64, 64, 64, 64, 64, 64, 64, 64, 64, -64, 64, -64, 64, 64, 64, 64, 64, 64, -64, -64, -64, 64, 64, 64, 64, -64, -64, -64, -64, -64, -64, 64, 64, 64, 64, 64, 64, 64, 64, 64, 64, 64, 64, 64, 64, 64, -64, -64, 64, 64, 64, 64, 64, -64, 64, 64, -64, -64, -64, -64, 64, 64, 64, 64, 64, 64, -64, 64, 64, 64, 64, 64, 64, 64, 64, -64, -64, 64, 64, 64, 64, 64, 64, -64, -64, -64, -64, -64, 64, 64, 64, -64, -64, -64, -64, 64, 64, -64, -64, 64, 64, 64, 64, 64, 64, 64, 64, 64, 64, 64, -64, 64, -64, -64, -64, -64, -64, -64, -64, 64, 64, -64, 64, -64, -64, -64, -64, 64, 64, 64, -64, -64, -64, 64, 64, 64, 64, -64, 64, 64, -64, -64, -64, -64, -64, -64, -64, -64, -64, 64, -64, 64, -64, -64, 64, -64, 64, -64, 64, -64, 64, 64, 64, 64, -64, 64, 64, -64, -64, -64, -64, -64, -64, -64, -64, -64, -64, -64, -64, 64, -64, -64, 64, 64, -64, 64, 64, 64, -64, 64, 64, 64, 64, -64, 64, -64, -64, -64, -64, -64, -64, -64, -64, -64, -64, -64, 64, -64, -64, -64, -64, -64, 64, 64, 64, 64, 64, -64, 64, 64, 64, 64, -64, 64, -64, 64, 64, -64, -64, -64, -64, -64, -64, -64, -64, -64, -64, 64, 64, 64, 64, 64, -64, 64, 64, -64, -64, -64, 64, 64, 64, 64, 64, -64, -64, -64, -64, -64, -64, -64, -64, -64, -64, -64, -64, 64, 64, 64, 64, -64, -64, 64, 64, -64, -64, 64, 64, -64, 64, -64, -64, 64, -64, 64, 64, -64, -64, -64, -64, -64, -64, 64, -64, 64, 64, 64, 64, 64, -64, 64, -64, 64, -64, -64, 64, 64, -64, -64, -64, 64, 64, 64, 64, -64, -64, -64, 64, -64, 64, 64, 64, 64, 64, 64, -64, 64, -64, 64, -64, 64, -64, 64, 64, 64, 64, 64, -64, 64, 64, 64, 64, 64, 64, 64, -64, -64, 64, -64, 64, -64, -64, -64, -64, -64, 64, 64, 64, 64, -64, 64, -64, -64, -64, -64, -64, 64, 64, 64, 64, 64, 64, 64, 64, 64, 64, 64, -64, 64, -64, 64, -64, 64, 64, 64, 64, 64, -64, 64, 64, 64, -64, 64, 64, -64, -64, -64, -64, 64, 64, 64, 64, 64, 64, 64, -64, 64, -64, -64, 64, 64, 64, -64, -64, 64, 64, -64, 64, -64, -64, 64, -64, -64, -64, -64, -64, 64, -64, 64, -64, -64, -64, -64, 64, -64, -64, 64, -64, -64, -64, -64, -64, -64, 64, -64, -64, 64, 64, 64, 64, -64, 64, -64, -64, 64, -64, -64, 64, 64, -64, 64, -64, 64, 64, 64, -64, -64, 64, 64, 64, 64, -64, -64, 64, 64, -64, -64, -64, -64, -64, -64, 64, 64, -64, -64, -64, -64, 64, 64, 64, 64, 64, 64, 64, -64, -64, 64, 64, 64, -64, -64, -64, 64, -64, -64, 64, -64, 64, -64, -64, 64, -64, 64, 64, 64, 64, 64, -64, -64, -64, -64, 64, -64, -64, 64, -64, -64, -64, 64, -64, -64, -64, -64, 64, -64, -64, 64, -64, 64, 64, 64, 64, -64, 64, -64, -64, -64, 64, -64, -64, -64, -64, -64, -64, 64, 64, -64, 64, 64, -64, -64, -64, 64, -64, 64, 64, 64, 64, -64, 64, -64, 64, -64, -64, -64, -64, -64, -64, -64, -64, 64, 64, 64, -64, -64, 64, -64, 64, -64, 64, -64, 64, 64, 64, -64, -64, 64, 64, 64, 64, 64, -64, 64, -64, 64, 64, -64, -64, 64, 64, 64, 64, 64, 64, 64, -64, 64, 64, -64, 64, 64, 64, -64, 64, 64, 64, 64, 64, 64, -64, -64, -64, -64, -64, -64, -64, 64, 64, 64, -64, -64, 64, 64, -64, 64, -64, 64, 64, 64, 64, 64, -64, 64, 64, -64, -64, 64, 64, -64, -64, -64, 64, -64, -64, 64, -64, 64, -64, -64, 64, -64, 64, 64, 64, 64, 64, 64, 64, 64, 64, 64, -64, -64, -64, -64, -64, -64, -64, 64, 64, 64, -64, -64, -64, -64, -64, -64, 64, 64, 64, -64, 64, 64, -64, 64, 64, 64, 64, -64, -64, 64, -64, -64, -64, -64, 64, 64, 64, 64, 64, 64, -64, -64, -64, -64, -64, 64, -64, -64, 64, 64, 64, 64, 64, 64, 64, -64, 64, 64, -64, 64, -64, -64, -64, 64, 64, 64, -64, 64, -64, -64, -64, -64, -64, 64, 64, 64, -64, 64, 64, -64, -64, 64, 64, -64, -64, 64, -64, -64, -64, -64, 64, 64, 64, -64, 64, -64, -64, -64, -64, -64, -64, -64, -64, -64, 64, 64, 64, -64, 64, 64, 64, 64, -64, 64, -64, -64, -64, 64, 64, 64, 64, 64, 64, 64, 64, -64, 64, -64, 64, 64, -64, 64, -64, -64, -64, -64, 64, 64, 64, 64, -64, -64, -64, -64, 64, -64, -64, -64, 64, 64, 64, 64, 64, 64, 64, -64, -64, -64, -64, -64, -64, -64, -64, -64, 64, 64, 64, 64, 64, -64, -64, -64, -64, -64, -64, -64, 64, 64, 64, 64, 64, 64, 64, 64, -64, 64, 64, -64, 64, 64, -64, 64, 64, -64, 64, 64, -64, -64, -64, -64, -64, -64, -64, -64, 64, -64, -64, 64, 64, 64, 64, 64, 64, 64, 64, -64, 64, 64, -64, 64, -64, 64, -64, -64, 64, -64, -64, -64, -64, -64, -64, -64, -64, -64, -64, 64, 64, 64, 64, 64, 64, 64, -64, 64, 64, -64, 64, -64, -64, -64, -64, -64, -64, -64, -64, -64, -64, -64, 64, 64, -64, -64, -64, 64, 64, 64, 64, 64, -64, -64, 64, 64, -64, 64, -64, 64, -64, -64, -64, -64, -64, -64, -64, -64, -64, -64, -64, 64, -64, -64, -64, -64, 64, 64, 64, 64, 64, -64, -64, 64, 64, 64, -64, 64, 64, 64, 64, 64, -64, -64, -64, -64, 64, 64, 64, 64, 64, -64, -64, -64, 64, 64, 64, -64, -64, -64, -64, -64, 64, 64, 64, 64, -64, 64, 64, 64, 64, -64, 64, -64, 64, 64, 64, 64, -64, -64, -64, -64, 64, 64, 64, 64, 64, 64, -64, -64, -64, -64, 64, 64, 64, 64, 64, 64, 64, 64, 64, -64, 64, 64, 64, -64, 64, -64, 64, 64, 64, 64, 64, -64, -64, -64, -64, 64, 64, 64, 64, 64, 64, 64, 64, 64, 64, 64, 64, 64, 64, 64, 64, -64, 64, 64, 64, 64, 64, 64, 64, 64, -64, 64, -64, -64, -64, -64, 64, -64, 64, -64, 64, 64, 64, 64, 64, -64, -64, -64, 64, 64, 64, -64, 64, 64, 64, 64, 64, -64, -64, 64, 64, 64, -64, -64, 64, 64, 64, -64, 64, -64, -64, -64, 64, 64, -64, -64, 64, 64, 64, 64, -64, 64, -64, 64, 64, -64, -64, 64, -64, 64, -64, -64, 64, 64, -64, -64, 64, -64, -64, -64, -64, -64, -64, 64, 64, 64, 64, 64, 64, 64, -64, 64, -64, -64, 64, -64, -64, 64, -64, 64, -64, -64, -64, 64, 64, 64, -64, 64, 64, -64, -64, -64, 64, -64, -64, 64, 64, -64, -64, 64, 64, -64, -64, -64, -64, 64, -64, -64, 64, 64, 64, 64, 64, -64, 64, 64, -64, -64, 64, -64, 64, -64, -64, -64, 64, -64, -64, -64, 64, 64, -64, -64, 64, 64, -64, 64, -64, 64, -64, -64, -64, -64, -64, -64, 64, -64, 64, 64, 64, 64, 64, 64, -64, -64, 64, 64, -64, 64, -64, -64, 64, 64, 64, 64, 64, 64, -64, -64, -64, -64, -64, 64, 64, -64, -64, -64, 64, 64, -64, -64, -64, -64, 64, -64, 64, -64, 64, 64, -64, -64, -64, -64, 64, 64, -64, 64, 64, -64, -64, 64, 64, -64, 64, 64, -64, -64, -64, -64, -64, -64, 64, 64, -64, 64, -64, 64, 64, -64, 64, 64, 64, 64, 64, 64, 64, 64, 64, 64, 64, 64, 64, 64, -64, -64, -64, -64, -64, -64, -64, -64, -64, -64, -64, 64, -64, 64, 64, -64, 64, 64, 64, 64, -64, 64, 64, 64, 64, 64, 64, 64, 64, 64, -64, -64, -64, -64, -64, -64, -64, -64, -64, 64, -64, 64, -64, 64, -64, 64, -64, 64, 64, 64, 64, 64, 64, 64, 64, 64, 64, -64, -64, -64, -64, -64, -64, -64, -64, -64, -64, -64, -64, -64, -64, 64, 64, 64, -64, -64, 64, 64, 64, 64, 64, 64, 64, 64, 64, 64, -64, -64, -64, 64, 64, -64, -64, -64, -64, -64, -64, 64, -64, 64, 64, 64, -64, -64, -64, 64, -64, 64, 64, 64, 64, 64, 64, 64, 64, 64, -64, 64, -64, -64, -64, -64, -64, -64, -64, -64, -64, 64, 64, 64, 64, 64, 64, -64, 64, 64, 64, 64, 64, 64, -64, -64, 64, 64, -64, -64, -64, -64, -64, -64, -64, -64, 64, 64, -64, 64, -64, -64, 64, 64, 64, 64, 64, 64, 64, 64, -64, -64, -64, 64, 64, 64, -64, -64, 64, -64, -64, -64, -64, -64, -64, 64, 64, 64, 64, 64, 64, 64, 64, 64, 64, 64, 64, 64, -64, -64, 64, 64, 64, 64, -64, -64, -64, 64, -64, 64, 64, -64, 64, -64, -64, 64, 64, 64, -64, 64, 64, 64, 64, 64, -64, -64, -64, -64, 64, 64, 64, 64, -64, -64, -64, 64, 64, 64, 64, 64, 64, 64, 64, 64, 64, -64, 64, -64, 64, 64, 64, -64, -64, -64, 64, 64, 64, 64, -64, -64, -64, -64, 64, 64, 64, 64, 64, -64, -64, 64, 64, -64, 64, -64, 64, -64, 64, 64, 64, 64, 64, -64, 64, -64, 64, 64, -64, -64, -64, 64, 64, 64, 64, 64, 64, -64, -64, 64, -64, -64, -64, -64, 64, -64, 64, 64, 64, 64, 64, 64, -64, 64, 64, 64, -64, -64, -64, 64, 64, 64, 64, -64, 64, -64, 64, 64, 64, 64, 64, -64, -64, 64, 64, 64, 64, 64, 64, 64, 64, -64, -64, -64, -64, -64, 64, 64, 64, 64, 64, 64, 64, 64, 64, -64, -64, 64, -64, -64, -64, -64, 64, 64, 64, 64, 64, -64, 64, 64, -64, 64, -64, 64, 64, 64, 64, -64, 64, -64, 64, -64, 64, -64, 64, 64, 64, -64, -64, 64, -64, -64, -64, -64, 64, -64, -64, -64, 64, 64, 64, 64, 64, 64, 64, 64, 64, 64, -64, 64, 64, -64, 64, 64, 64, 64, -64, -64, -64, -64, -64, -64, -64, -64, 64, 64, 64, 64, 64, 64, 64, 64, 64, 64, -64, 64, -64, 64, -64, 64, -64, -64, 64, 64, -64, -64, -64, 64, -64, -64, -64, 64, 64, 64, 64, 64, 64, 64, 64, 64, 64, -64, -64, -64, -64, -64, 64, 64, -64, -64, -64, 64, 64, -64, -64, -64, -64, -64, -64, -64, 64, 64, 64, -64, 64, 64, 64, 64, 64, 64, -64, 64, 64, -64, -64, -64, 64, 64, 64, 64, 64, 64, 64, -64, 64, -64, 64, -64, 64, 64, 64, 64, -64, 64, 64, -64, -64, -64, 64, 64, 64, 64, -64, -64, -64, 64, 64, -64, 64, 64, 64, 64, 64, 64, 64, 64, 64, 64, -64, -64, -64, -64, 64, -64, -64, -64, -64, 64, 64, -64, 64, -64, 64, -64, 64, 64, 64, 64, 64, -64, 64, -64, 64, 64, 64, 64, -64, -64, -64, 64, 64, -64, -64, 64, 64, -64, 64, 64, 64, 64, 64, 64, 64, 64, 64, 64, -64, -64, 64, -64, 64, -64, -64, -64, 64, -64, 64, -64, 64, -64, -64, -64, 64, -64, 64, 64, -64, 64, 64, -64, -64, -64, -64, -64, 64, 64, 64, 64, 64, 64, 64, 64, -64, -64, -64, 64, 64, -64, -64, -64, 64, 64, -64, -64, -64, -64, 64, 64, 64, 64, 64, 64, -64, 64, -64, 64, 64, 64, -64, 64, -64, 64, -64, -64, 64, -64, -64, 64, -64, -64, 64, -64, -64, 64, -64, -64, -64, 64, -64, 64, -64, -64, -64, 64, 64, 64, -64, -64, -64, 64, 64, -64, 64, 64, 64, -64, 64, -64, 64, 64, 64, -64, 64, 64, -64, -64, -64, 64, -64, -64, -64, -64, -64, -64, 64, -64, -64, -64, 64, 64, 64, 64, -64, 64, -64, -64, 64, -64, -64, -64, -64, -64, -64, 64, -64, -64, -64, -64, -64, 64, 64, 64, 64, 64, 64, -64, -64, -64, -64, -64, -64, -64, 64, -64, 64, -64, -64, 64, -64, -64, -64, -64, -64, -64, -64, -64, -64, -64, -64, 64, 64, 64, 64, 64, 64, -64, -64, -64, -64, -64, 64, 64, -64, 64, 64, -64, 64, -64, -64, -64, -64, -64, -64, -64, -64, -64, -64, 64, 64, 64, 64, 64, -64, -64, -64, -64, -64, -64, -64, -64, 64, -64, -64, 64, 64, 64, 64, -64, -64, -64, -64, -64, -64, -64, -64, 64, 64, 64, 64, 64, 64, 64, -64, 64, -64, -64, -64, -64, 64, -64, 64, -64, -64, 64, -64, 64, -64, -64, -64, -64, -64, -64, 64, 64, 64, 64, 64, 64, 64, 64, -64, -64, -64, -64, -64, -64, -64, -64, -64, 64, 64, -64, -64, -64, -64, -64, -64, -64, 64, -64, 64, -64, 64, 64, 64, -64, -64, -64, 64, -64, -64, -64, -64, -64, -64, -64, -64, 64, 64, -64, -64, -64, -64, -64, -64, 64, 64, 64, 64, 64, 64, -64, -64, -64, -64, -64, -64, -64, 64, -64, -64, -64, -64, 64, -64, 64, 64, 64, 64, -64, 64, 64, 64, 64, -64, -64, -64, -64, 64, -64, 64, 64, 64, 64, -64, 64, 64, 64, -64, -64, -64, -64, 64, 64, 64, 64, 64, -64, 64, 64, 64, -64, -64, -64, -64, -64, -64, 64, 64, 64, 64, 64, 64, 64, 64, 64, -64, -64, -64, 64, -64, -64, 64, 64, 64, 64, 64, 64, -64, -64, -64, -64, -64, -64, 64, 64, 64, -64, -64, 64, 64, 64, 64, 64, 64, -64, -64, -64, -64, -64, 64, 64, 64, 64, 64, -64, -64, -64, -64, -64, -64, -64, -64, -64, -64, -64, 64, 64, 64, 64, 64, 64, 64, 64, 64, -64, -64, -64, 64, 64, 64, 64, -64, 64, -64, -64, -64, -64, -64, -64, -64, -64, -64, 64, -64, 64, -64, 64, 64, 64, 64, 64, 64, 64, -64, -64, 64, 64, 64, 64, -64, 64, 64, -64, -64, -64, -64, -64, -64, -64, -64, 64, 64, -64, -64, 64, -64, -64, 64, 64, 64, -64, -64, 64, 64, 64, -64, -64, -64, -64, -64, -64, -64, -64, -64, -64, -64, -64, -64, 64, -64, -64, -64, -64, 64, -64, 64, 64, 64, -64, -64, 64, -64, -64, 64, 64, 64, -64, 64, -64, -64, 64, 64, 64, -64, 64, 64, 64, -64, 64, -64, -64, 64, 64, -64, 64, 64, 64, -64, -64, -64, -64, -64, 64, 64, -64, 64, 64, 64, -64, 64, 64, -64, -64, -64, 64, -64, 64, -64, -64, 64, -64, 64, 64, 64, 64, -64, 64, 64, -64, 64, 64, -64, -64, 64, 64, 64, 64, 64, 64, 64, 64, -64, -64, 64, -64, -64, -64, -64, 64, -64, -64, 64, 64, -64, 64, -64, -64, -64, -64, 64, -64, -64, -64, 64, -64, -64, -64, -64, 64, -64, -64, 64, -64, -64, -64, 64, -64, 64, 64, 64, -64, 64, 64, -64, -64, 64, 64, 64, 64, -64, 64, -64, -64, -64, -64, -64, -64, 64, -64, -64, -64, -64, -64, 64, -64, -64, 64, -64, -64, 64, 64, -64, 64, 64, 64, 64, -64, -64, -64, -64, -64, -64, -64, -64, -64, -64, -64, -64, -64, -64, -64, -64, 64, 64, 64, -64, -64, 64, 64, 64, 64, 64, 64, 64, 64, 64, -64, -64, -64, -64, -64, -64, -64, 64, -64, -64, -64, -64, -64, -64, -64, -64, 64, -64, -64, 64, 64, -64, 64, -64, 64, 64, -64, 64, -64, -64, -64, -64, 64, 64, -64, 64, -64, 64, -64, -64, -64, 64, 64, -64, 64, -64, -64, -64, -64, 64, 64, 64, 64, -64, -64, 64, -64, -64, -64, 64, 64, -64, 64, 64, 64, 64, 64, -64, 64, 64, 64, -64, 64, -64, -64, -64, -64, 64, -64, 64, 64, 64, 64, -64, -64, -64, -64, 64, 64, -64, 64, -64, 64, 64, 64, 64, 64, 64, -64, 64, 64, 64, 64, 64, -64, -64, -64, 64, 64, 64, 64, 64, 64, 64, 64, 64, 64, 64, 64, 64, 64, 64, 64, -64, -64, 64, -64, -64, 64, 64, 64, 64, -64, -64, -64, -64, -64, 64, 64, 64, 64, 64, 64, 64, 64, -64, 64, 64, 64, 64, 64, -64, 64, 64, -64, -64, 64, -64, -64, 64, 64, 64, -64, 64, -64, 64, 64, 64, -64, 64, -64, -64, 64, 64, 64, -64, -64, -64, -64, -64, -64, -64, 64, -64, -64, 64, 64, 64, -64, 64, 64, 64, 64, -64, 64, 64, 64, 64, 64, -64, -64, 64, 64, -64, -64, 64, 64, 64, 64, -64, -64, -64, -64, -64, 64, -64, 64, 64, 64, -64, -64, 64, 64, 64, 64, 64, 64, 64, 64, 64, 64, 64, 64, 64, 64, -64, 64, 64, -64, -64, -64, 64, 64, 64, 64, 64, 64, -64, -64, -64, 64, -64, 64, -64, -64, -64, -64, -64, 64, 64, 64, 64, 64, 64, -64, -64, 64, -64, -64, -64, 64, 64, 64, 64, -64, -64, -64, 64, 64, -64, -64, -64, -64, -64, -64, -64, 64, 64, 64, 64, 64, 64, 64, -64, -64, -64, 64, -64, 64, -64, -64, -64, -64, -64, -64, -64, -64, -64, 64, 64, -64, -64, -64, -64, 64, -64, -64, 64, 64, 64, -64, 64, -64, -64, 64, 64, 64, 64, -64, 64, -64, -64, -64, -64, -64, -64, -64, -64, -64, -64, -64, 64, 64, 64, 64, -64, 64, -64, -64, -64, -64, 64, 64, 64, -64, -64, 64, -64, -64, -64, -64, -64, -64, 64, 64, 64, 64, -64, -64, 64, -64, -64, 64, 64, 64, -64, 64, -64, -64, -64, 64, 64, -64, -64, 64, 64, 64, 64, 64, -64, -64, 64, 64, 64, 64, -64, -64, 64, -64, -64, -64, -64, -64, -64, -64, -64, -64, -64, 64, 64, 64, 64, 64, -64, -64, -64, 64, 64, 64, 64, 64, -64, -64, 64, -64, -64, -64, -64, -64, -64, -64, -64, -64, -64, -64, 64, 64, 64, 64, -64, -64, 64, 64, -64, 64, 64, 64, 64, -64, -64, 64, 64, -64, 64, -64, -64, -64, -64, -64, -64, -64, -64, -64, -64, -64, 64, -64, 64, 64, -64, 64, 64, 64, 64, 64, 64, 64, -64, 64, 64, 64, -64, -64, -64, -64, -64, -64, -64, 64, 64, -64, -64, -64, -64, 64, 64, 64, -64, -64, 64, 64, 64, 64, 64, 64, -64, 64, 64, -64, -64, 64, 64, 64, 64, -64, 64, -64, -64, -64, -64, -64, -64, 64, 64, -64, 64, -64, 64, 64, 64, 64, 64, 64, 64, 64, -64, -64, -64, -64, -64, -64, -64, 64, 64, 64, 64, -64, -64, -64, 64, 64, -64, -64, -64, -64, 64, 64, 64, 64, 64, -64, -64, 64, -64, -64, 64, -64, 64, 64, -64, 64, 64, 64, -64, 64, -64, 64, 64, -64, 64, 64, -64, -64, 64, 64, 64, -64, 64, -64, -64, -64, -64, -64, -64, -64, 64, -64, 64, 64, 64, -64, -64, -64, 64, -64, 64, 64, -64, 64, -64, 64, 64, -64, 64, -64, -64, -64, -64, -64, -64, -64, 64, -64, 64, -64, 64, 64, 64, 64, -64, 64, -64, 64, 64, -64, -64, 64, -64, -64, 64, 64, -64, -64, -64, 64, -64, -64, -64, 64, 64, 64, 64, 64, -64, -64, 64, -64, -64, -64, -64, 64, 64, -64, 64, 64, -64, -64, 64, -64, -64, -64, -64, -64, -64, -64, -64, -64, 64, 64, 64, 64, 64, 64, -64, -64, -64, -64, 64, 64, 64, -64, 64, -64, 64, -64, -64, -64, -64, -64, -64, -64, -64, -64, -64, 64, 64, 64, -64, -64, -64, -64, -64, -64, -64, -64, -64, 64, -64, 64, 64, -64, 64, -64, 64, -64, 64, -64, -64, -64, -64, -64, -64, 64, -64, -64, 64, -64, -64, -64, -64, -64, -64, -64, -64, 64, 64, -64, 64, 64, 64, -64, -64, -64, -64, -64, -64, -64, -64, 64, 64, 64, 64, 64, -64, -64, -64, -64, -64, -64, 64, 64, 64, 64, -64, 64, -64, -64, -64, -64, -64, -64, -64, 64, 64, -64, -64, -64, 64, 64, 64, 64, -64, -64, -64, -64, 64, 64, 64, -64, 64, 64, 64, 64, 64, -64, 64, -64, -64, -64, 64, 64, -64, -64, 64, -64, -64, -64, -64, 64, 64, -64, 64, 64, 64, 64, 64, -64, 64, 64, 64, 64, -64, 64, 64, -64, -64, -64, -64, 64, 64, 64, -64, -64, 64, 64, -64, 64, 64, -64, 64, 64, 64, -64, 64, 64, 64, 64, -64, 64, -64, 64, 64, -64, -64, 64, -64, 64, 64, 64, -64, 64, 64, 64, 64, 64, 64, -64, 64, 64, -64, 64, 64, 64, 64, 64, 64, -64, 64, -64, 64, 64, 64, -64, -64, -64, -64, 64, -64, 64, 64, -64, 64, 64, 64, 64, -64, 64, 64, -64, -64, -64, -64, 64, -64, -64, 64, 64, -64, -64, 64, -64, -64, -64, -64, 64, 64, 64, 64, -64, 64, -64, 64, 64, 64, 64, -64, 64, -64, -64, 64, 64, 64, 64, -64, -64, 64, -64, 64, -64, 64, -64, 64, 64, -64, -64, 64, 64, -64, -64, -64, 64, 64, 64, 64, -64, -64, -64, 64, -64, -64, -64, 64, 64, -64, -64, -64, -64, 64, -64, -64, -64, -64, -64, 64, -64, 64, -64, -64, -64, -64, 64, -64, 64, 64, 64, 64, -64, 64, -64, 64, 64, 64, -64, -64, -64, -64, -64, 64, 64, -64, -64, -64, -64, -64, -64, 64, -64, -64, -64, -64, -64, -64, -64, -64, 64, 64, 64, -64, -64, 64, 64, 64, 64, -64, -64, -64, -64, -64, 64, 64, 64, 64, -64, -64, -64, 64, 64, -64, -64, 64, -64, -64, -64, -64, 64, 64, -64, -64, 64, 64, -64, -64, 64, 64, 64, 64, 64, 64, 64, 64, -64, -64, -64, -64, -64, -64, -64, -64, -64, -64, 64, -64, 64, 64, 64, -64, 64, -64, -64, 64, -64, 64, 64, 64, 64, 64, -64, 64, 64, -64, -64, -64, -64, -64, -64, 64, -64, -64, -64, -64, -64, 64, -64, -64, -64, 64, -64, -64, -64, -64, -64, 64, 64, 64, 64, 64, 64, 64, -64, 64, 64, -64, 64, -64, 64, 64, 64, 64, 64, -64, 64, 64, 64, -64, -64, -64, -64, 64, 64, 64, 64, 64, 64, -64, 64, -64, -64, -64, -64, 64, 64, 64, 64, 64, 64, -64, 64, 64, -64, -64, -64, 64, 64, 64, 64, -64, 64, 64, 64, 64, 64, -64, -64, 64, 64, -64, -64, 64, 64, 64, 64, 64, 64, 64, -64, 64, -64, -64, 64, 64, 64, 64, 64, 64, 64, 64, 64, -64, -64, -64, 64, 64, 64, 64, -64, -64, 64, 64, 64, 64, 64, 64, -64, -64, -64, 64, -64, 64, 64, 64, 64, 64, 64, 64, 64, -64, -64, 64, 64, 64, 64, 64, -64, 64, 64, 64, 64, 64, 64, 64, -64, -64, 64, 64, 64, 64, 64, 64, 64, 64, 64, 64, -64, -64, -64, 64, 64, 64, 64, 64, 64, 64, 64, 64, 64, 64, 64, 64, 64, -64, 64, 64, -64, 64, 64, 64, 64, 64, 64, -64, -64, -64, 64, 64, 64, 64, 64, 64, -64, -64, 64, 64, 64, 64, 64, 64, -64, 64, 64, -64, 64, 64, 64, 64, 64, 64, -64, -64, -64, 64, 64, 64, 64, 64, 64, -64, -64, -64, 64, 64, 64, 64, 64, 64, -64, -64, 64, 64, 64, -64, 64, 64, 64, -64, -64, -64, -64, 64, 64, 64, 64, 64, -64, -64, -64, -64, 64, 64, 64, 64, -64, -64, 64, -64, 64, 64, -64, -64, 64, 64, 64, -64, -64, -64, -64, -64, 64, -64, 64, 64, -64, -64, 64, -64, -64, 64, 64, -64, -64, -64, 64, 64, -64, -64, 64, -64, -64, 64, -64, -64, -64, -64, -64, 64, 64, 64, -64, -64, -64, -64, -64, -64, -64, -64, 64, -64, -64, 64, 64, 64, -64, 64, 64, 64, 64, 64, -64, -64, -64, -64, 64, 64, 64, -64, -64, -64, -64, -64, 64, -64, -64, -64, -64, 64, -64, 64, 64, 64, 64, 64, 64, 64, 64, 64, -64, -64, -64, 64, 64, 64, 64, -64, -64, 64, 64, 64, -64, -64, -64, -64, -64, 64, 64, -64, 64, -64, 64, 64, -64, 64, 64, 64, -64, 64, 64, 64, -64, -64, -64, 64, 64, 64, 64, -64, -64, -64, -64, -64, -64, 64, -64, -64, 64, -64, -64, 64, -64, 64, 64, 64, -64, 64, -64, 64, -64, -64, 64, -64, 64, 64, 64, 64, -64, -64, -64, -64, -64, -64, -64, -64, -64, 64, 64, 64, 64, 64, 64, 64, 64, 64, -64, 64, -64, -64, -64, 64, 64, 64, 64, 64, -64, -64, 64, 64, -64, -64, -64, -64, 64, -64, -64, 64, 64, -64, 64, 64, 64, -64, -64, -64, -64, -64, 64, 64, 64, 64, 64, 64, 64, -64, -64, 64, 64, 64, 64, -64, 64, -64, -64, 64, 64, 64, 64, 64, -64, -64, 64, -64, -64, 64, 64, -64, -64, 64, 64, 64, 64, -64, 64, 64, 64, 64, 64, 64, 64, -64, -64, -64, 64, 64, -64, -64, -64, -64, -64, -64, -64, 64, 64, 64, -64, 64, 64, 64, 64, 64, 64, 64, 64, 64, -64, -64, -64, -64, 64, 64, 64, -64, -64, -64, -64, -64, -64, -64, 64, 64, 64, 64, -64, 64, 64, 64, 64, 64, 64, -64, 64, -64, -64, 64, -64, -64, -64, -64, -64, -64, -64, -64, 64, -64, -64, -64, 64, 64, -64, 64, -64, -64, 64, 64, 64, -64, -64, 64, -64, 64, 64, 64, -64, -64, -64, -64, -64, 64, 64, -64, 64, -64, -64, -64, 64, 64, 64, -64, 64, -64, -64, -64, -64, -64, -64, -64, 64, 64, -64, 64, -64, 64, -64, -64, -64, 64, 64, 64, 64, -64, -64, -64, -64, 64, -64, 64, 64, 64, 64, 64, -64, -64, 64, 64, 64, -64, 64, -64, 64, 64, -64, 64, -64, -64, 64, 64, -64, 64, -64, 64, 64, 64, 64, -64, -64, 64, 64, 64, -64, -64, 64, 64, 64, 64, 64, -64, -64, -64, -64, 64, 64, 64, -64, 64, -64, 64, 64, 64, -64, -64, 64, -64, -64, 64, -64, 64, 64, 64, 64, -64, 64, -64, 64, 64, -64, -64, -64, -64, 64, -64, -64, 64, 64, 64, -64, -64, 64, -64, 64, -64, 64, -64, -64, 64, -64, 64, -64, -64, -64, -64, 64, -64, -64, 64, -64, -64, 64, 64, 64, 64, 64, -64, 64, 64, 64, -64, 64, 64, 64, 64, -64, 64, 64, 64, 64, 64, -64, 64, -64, 64, 64, -64, 64, -64, 64, 64, -64, -64, -64, 64, 64, 64, 64, 64, -64, 64, -64, -64, -64, -64, -64, -64, -64, -64, 64, 64, 64, 64, -64, -64, 64, -64, -64, -64, -64, 64, 64, 64, 64, 64, 64, 64, 64, 64, -64, -64, 64, -64, -64, 64, 64, -64, -64, -64, -64, 64, -64, -64, -64, -64, 64, -64, 64, 64, 64, 64, 64, 64, 64, 64, -64, 64, -64, -64, -64, -64, -64, -64, -64, -64, 64, -64, 64, -64, 64, 64, -64, 64, 64, 64, 64, 64, 64, 64, -64, 64, -64, -64, -64, -64, -64, -64, -64, -64, -64, 64, -64, -64, -64, -64, -64, 64, -64, -64, -64, -64, 64, 64, 64, 64, -64, 64, -64, -64, 64, -64, -64, -64, -64, -64, 64, -64, -64, -64, 64, -64, -64, -64, -64, -64, -64, -64, 64, 64, -64, 64, 64, -64, 64, -64, -64, 64, -64, -64, -64, -64, -64, -64, -64, -64, -64, -64, 64, -64, -64, -64, -64, 64, -64, -64, -64, 64, 64, 64, -64, -64, -64, 64, -64, -64, 64, -64, -64, -64, -64, -64, -64, 64, -64, -64, -64, 64, -64, 64, 64, -64, -64, -64, -64, -64, 64, 64, 64, -64, -64, -64, -64, -64, -64, -64, -64, -64, -64, -64, -64, -64, -64, -64, -64, 64, 64, -64, 64, 64, 64, 64, 64, 64, 64, -64, -64, -64, -64, -64, -64, 64, -64, -64, -64, 64, -64, -64, -64, -64, 64, 64, 64, 64, 64, 64, -64, -64, 64, -64, 64, -64, -64, -64, -64, 64, -64, 64, -64, -64, -64, -64, -64, -64, -64, -64, -64, 64, -64, 64, 64, 64, 64, -64, 64, -64, -64, 64, 64, -64, 64, -64, -64, -64, -64, -64, -64, -64, 64, -64, -64, -64, -64, -64, 64, 64, 64, -64, 64, 64, 64, -64, 64, 64, 64, 64, -64, -64, -64, -64, 64, -64, -64, 64, -64, -64, -64, 64, -64, 64, -64, -64, -64, 64, -64, 64, 64, -64, 64, 64, 64, -64, 64, 64, 64, -64, -64, -64, -64, -64, -64, -64, 64, 64, 64, 64, 64, -64, -64, 64, 64, 64, -64, 64, 64, -64, 64, 64, -64, -64, 64, 64, -64, 64, -64, -64, -64, -64, 64, -64, -64, -64, 64, -64, 64, -64, -64, -64, 64, -64, -64, 64, -64, 64, -64, -64, -64, -64, 64, -64, 64, -64, -64, -64, -64, -64, 64, -64, -64, 64, 64, -64, -64, -64, -64, -64, 64, 64, -64, -64, 64, -64, 64, 64, -64, 64, 64, 64, -64, 64, 64, -64, 64, 64, -64, 64, -64, 64, -64, 64, 64, -64, 64, -64, -64, -64, 64, -64, -64, -64, -64, -64, 64, -64, -64, 64, -64, 64, 64, 64, -64, 64, -64, 64, 64, -64, -64, -64, -64, -64, -64, 64, -64, -64, -64, -64, -64, -64, -64, -64, -64, -64, 64, 64, -64, 64, 64, -64, -64, 64, 64, 64, -64, -64, 64, 64, 64, -64, -64, -64, -64, -64, -64, -64, -64, -64, 64, 64, 64, -64, 64, 64, 64, 64, -64, 64, 64, 64, -64, -64, -64, 64, -64, 64, -64, -64, 64, 64, -64, -64, -64, 64, -64, -64, -64, -64, 64, 64, -64, 64, -64, -64, 64, 64, -64, 64, -64, -64, -64, -64, 64, -64, -64, -64, 64, -64, 64, -64, -64, -64, -64, -64, -64, 64, -64, -64, -64, -64, -64, -64, -64, -64, 64, -64, -64, 64, -64, -64, 64, -64, -64, 64, 64, -64, 64, 64, -64, -64, -64, -64, 64, 64, 64, -64, -64, -64, -64, 64, 64, -64, -64, 64, 64, -64, 64, -64, 64, -64, -64, -64, -64, -64, -64, -64, 64, -64, -64, 64, 64, 64, 64, -64, 64, -64, 64, 64, -64, -64, 64, -64, 64, -64, -64, -64, -64, 64, -64, 64, -64, -64, 64, -64, 64, -64, -64, 64, 64, 64, -64, 64, -64, -64, 64, -64, 64, 64, 64, -64, 64, 64, 64, 64, -64, 64, -64, -64, -64, 64, -64, -64, -64, 64, -64, 64, 64, -64, 64, -64, -64, -64, 64, 64, 64, 64, -64, -64, 64, 64, -64, 64, -64, -64, 64, -64, 64, -64, -64, 64, -64, 64, -64, 64, 64, -64, -64, -64, 64, -64, -64, -64, 64, 64, 64, 64, -64, 64, -64, -64, -64, -64, -64, 64, -64, -64, -64, -64, -64, -64, -64, -64, 64, -64, 64, -64, 64, -64, 64, 64, -64, -64, -64, -64, 64, -64, -64, 64, -64, -64, -64, -64, -64, -64, -64, -64, -64, -64, -64, -64, -64, -64, 64, 64, -64, 64, 64, 64, -64, 64, -64, -64, -64, -64, -64, -64, -64, -64, 64, 64, -64, -64, -64, -64, -64, -64, -64, -64, 64, 64, -64, -64, -64, 64, 64, -64, -64, -64, -64, -64, -64, -64, -64, -64, -64, 64, 64, 64, 64, -64, -64, 64, -64, -64, -64, -64, 64, -64, -64, -64, -64, 64, -64, -64, 64, -64, 64, -64, -64, -64, -64, -64, -64, -64, -64, 64, 64, -64, 64, 64, -64, -64, 64, -64, -64, -64, -64, -64, 64, 64, -64, -64, 64, -64, 64, -64, -64, -64, 64, 64, -64, -64, 64, -64, -64, -64, -64, -64, -64, 64, 64, 64, -64, -64, -64, -64, -64, -64, -64, -64, -64, -64, 64, -64, -64, -64, 64, -64, 64, -64, -64, 64, 64, 64, 64, 64, -64, 64, 64, 64, -64, -64, -64, -64, -64, 64, -64, -64, 64, -64, -64, -64, -64, -64, 64, 64, 64, 64, 64, 64, 64, 64, 64, 64, 64, 64, -64, 64, -64, -64, -64, 64, 64, 64, 64, -64, -64, 64, -64, 64, 64, -64, 64, 64, 64, 64, 64, 64, 64, 64, 64, 64, 64, 64, -64, -64, 64, -64, -64, -64, 64, -64, 64, -64, -64, -64, 64, 64, 64, 64, 64, 64, 64, 64, 64, 64, 64, 64, 64, 64, 64, 64, 64, 64, -64, -64, -64, -64, -64, -64, 64, -64, 64, 64, 64, 64, 64, 64, 64, 64, 64, 64, 64, 64, 64, 64, 64, 64, 64, 64, 64, -64, 64, -64, -64, 64, 64, -64, -64, 64, 64, 64, 64, -64, -64, 64, 64, 64, -64, -64, -64, -64, 64, 64, 64, 64, 64, 64, 64, 64, 64, -64, 64, -64, 64, -64, 64, 64, 64, 64, 64, -64, 64, 64, 64, 64, 64, -64, -64, -64, -64, -64, 64, 64, 64, 64, 64, 64, 64, 64, 64, 64, 64, -64, -64, 64, 64, 64, 64, 64, 64, 64, 64, -64, 64, -64, -64, -64, -64, 64, 64, 64, 64, 64, 64, 64, 64, -64, -64, 64, 64, -64, -64, 64, 64, 64, -64, 64, 64, 64, 64, 64, -64, -64, -64, -64, -64, -64, 64, 64, 64, 64, -64, 64, 64, 64, -64, 64, -64, -64, -64, -64, 64, 64, 64, -64, -64, 64, 64, 64, -64, -64, -64, -64, 64, 64, 64, -64, 64, -64, -64, -64, -64, -64, -64, 64, 64, -64, 64, 64, -64, 64, 64, -64, -64, -64, 64, -64, 64, -64, -64, 64, 64, 64, -64, -64, -64, -64, -64, -64, -64, -64, -64, -64, -64, 64, 64, -64, -64, 64, -64, -64, -64, -64, -64, 64, -64, -64, -64, 64, 64, 64, -64, -64, -64, -64, -64, -64, -64, -64, -64, 64, -64, -64, 64, -64, -64, 64, -64, -64, -64, -64, -64, -64, 64, -64, -64, 64, -64, -64, -64, -64, -64, -64, -64, -64, -64, -64, -64, -64, -64, -64, 64, -64, -64, -64, -64, -64, -64, -64, -64, -64, 64, 64, -64, -64, 64, -64, -64, -64, -64, -64, -64, -64, -64, -64, -64, 64, 64, -64, 64, -64, -64, -64, -64, 64, -64, -64, -64, -64, -64, -64, -64, -64, -64, -64, 64, -64, -64, 64, -64, 64, -64, -64, 64, 64, 64, -64, 64, 64, 64, 64, 64, 64, 64, -64, -64, -64, -64, -64, -64, -64, 64, -64, -64, -64, -64, 64, 64, -64, 64, 64, -64, 64, 64, 64, -64, 64, -64, 64, 64, 64, -64, 64, -64, -64, 64, 64, -64, -64, -64, -64, -64, -64, -64, 64, 64, 64, 64, 64, -64, 64, 64, 64, 64, 64, 64, 64, 64, 64, 64, 64, -64, 64, -64, -64, -64, -64, 64, -64, -64, 64, 64, 64, 64, 64, 64, 64, -64, -64, -64, -64, 64, 64, -64, 64, -64, 64, 64, 64, 64, 64, -64, 64, -64, 64, -64, 64, -64, 64, 64, 64, 64, 64, 64, 64, 64, -64, -64, -64, 64, -64, -64, -64, -64, -64, -64, 64, 64, -64, -64, 64, 64, 64, 64, 64, 64, 64, -64, 64, 64, -64, 64, -64, 64, -64, -64, 64, 64, -64, 64, 64, 64, -64, 64, -64, 64, -64, -64, 64, -64, -64, 64, 64, -64, 64, 64, 64, 64, 64, -64, -64, 64, 64, 64, -64, 64, -64, -64, -64, -64, -64, 64, 64, 64, 64, 64, -64, 64, 64, 64, -64, 64, 64, -64, 64, -64, -64, 64, 64, 64, 64, 64, 64, 64, -64, 64, 64, -64, 64, -64, -64, 64, 64, -64, -64, 64, 64, 64, 64, 64, 64, -64, 64, 64, 64, 64, 64, 64, 64, -64, -64, -64, -64, -64, 64, 64, 64, -64, -64, 64, -64, 64, -64, 64, -64, 64, 64, 64, -64, -64, 64, 64, 64, -64, 64, -64, -64, -64, 64, -64, -64, 64, 64, 64, 64, 64, -64, -64, -64, -64, -64, 64, 64, 64, 64, 64, -64, -64, -64, 64, 64, 64, 64, -64, -64, -64, -64, -64, -64, 64, 64, 64, 64, 64, -64, -64, -64, -64, 64, 64, 64, 64, 64, -64, -64, -64, -64, 64, -64, -64, 64, -64, -64, 64, -64, 64, 64, 64, 64, 64, -64, -64, 64, 64, -64, 64, 64, 64, -64, 64, -64, -64, -64, -64, -64, -64, -64, -64, 64, -64, -64, -64, 64, 64, -64, 64, 64, 64, 64, 64, -64, -64, -64, 64, 64, 64, 64, 64, -64, -64, -64, -64, -64, -64, -64, 64, 64, 64, -64, 64, 64, 64, 64, 64, 64, 64, 64, -64, -64, -64, -64, -64, 64, 64, 64, 64, 64, -64, -64, -64, -64, -64, 64, -64, 64, 64, 64, -64, 64, -64, -64, 64, 64, 64, 64, -64, -64, -64, -64, -64, 64, 64, 64, 64, 64, -64, -64, -64, -64, -64, 64, 64, 64, 64, -64, -64, 64, 64, -64, 64, -64, -64, -64, -64, -64, -64, -64, -64, 64, 64, 64, -64, -64, -64, -64, -64, 64, -64, 64, -64, -64, -64, -64, 64, -64, -64, -64, -64, 64, -64, -64, -64, -64, -64, -64, 64, 64, 64, 64, -64, 64, -64, -64, 64, -64, -64, 64, 64, 64, -64, -64, 64, -64, 64, -64, -64, -64, -64, -64, -64, -64, -64, 64, 64, 64, 64, -64, -64, -64, -64, -64, -64, 64, 64, -64, -64, 64, -64, -64, 64, 64, -64, -64, -64, -64, -64, -64, -64, 64, -64, 64, 64, 64, -64, -64, -64, -64, -64, -64, 64, -64, 64, 64, 64, 64, -64, -64, -64, 64, -64, 64, -64, -64, 64, -64, 64, -64, 64, 64, 64, -64, 64, -64, -64, -64, -64, -64, -64, 64, 64, 64, 64, 64, -64, -64, 64, 64, 64, -64, -64, -64, 64, 64, 64, -64, 64, -64, -64, -64, 64, -64, -64, -64, -64, 64, 64, 64, 64, 64, -64, -64, -64, 64, -64, -64, 64, 64, 64, -64, 64, 64, 64, 64, -64, -64, -64, -64, -64, 64, -64, -64, -64, 64, 64, 64, 64, 64, -64, -64, -64, -64, -64, -64, 64, 64, 64, 64, 64, 64, 64, 64, -64, -64, -64, -64, 64, 64, 64, 64, 64, -64, 64, 64, -64, 64, -64, -64, -64, -64, 64, 64, -64, 64, 64, 64, -64, -64, 64, 64, -64, -64, 64, 64, 64, -64, 64, 64, -64, 64, 64, 64, 64, 64, -64, -64, -64, 64, 64, -64, 64, 64, -64, -64, -64, -64, 64, 64, 64, 64, 64, 64, 64, 64, -64, 64, -64, 64, 64, 64, -64, -64, -64, -64, 64, -64, 64, -64, -64, 64, -64, -64, -64, -64, -64, -64, 64, 64, 64, -64, 64, 64, 64, 64, 64, -64, 64, -64, -64, -64, -64, -64, -64, -64, -64, 64, 64, -64, -64, -64, -64, -64, -64, -64, 64, 64, 64, 64, 64, 64, 64, 64, 64, 64, 64, 64, -64, -64, -64, -64, 64, 64, 64, 64, -64, -64, 64, -64, -64, -64, -64, -64, -64, 64, 64, 64, -64, 64, 64, 64, -64, 64, -64, -64, -64, -64, -64, -64, -64, 64, 64, -64, -64, 64, 64, -64, -64, -64, 64, -64, 64, -64, 64, 64, -64, -64, 64, -64, -64, -64, -64, -64, -64, -64, -64, -64, 64, -64, -64, -64, -64, -64, -64, -64, -64, -64, -64, 64, 64, 64, 64, -64, -64, -64, -64, -64, 64, -64, -64, -64, -64, -64, -64, -64, -64, 64, 64, 64, 64, -64, 64, -64, -64, -64, 64, 64, -64, -64, -64, -64, -64, -64, -64, -64, -64, -64, -64, -64, -64, -64, 64, 64, -64, -64, 64, 64, 64, 64, -64, 64, -64, 64, -64, -64, -64, 64, 64, -64, -64, -64, -64, -64, -64, -64, -64, -64, -64, 64, 64, 64, 64, 64, -64, 64, -64, 64, -64, 64, -64, 64, 64, 64, 64, 64, -64, -64, 64, -64, 64, 64, -64, 64, 64, 64, -64, -64, -64, -64, -64, 64, 64, 64, 64, -64, -64, 64, 64, 64, -64, -64, -64, 64, -64, 64, 64, 64, 64, 64, 64, -64, -64, 64, -64, 64, -64, 64, 64, 64, 64, -64, -64, -64, -64, 64, -64, 64, 64, -64, 64, 64, 64, -64, -64, -64, -64, 64, 64, -64, 64, -64, -64, -64, 64, -64, 64, -64, -64, 64, 64, -64, 64, -64, -64, 64, -64, -64, -64, -64, 64, -64, -64, 64, 64, -64, 64, 64, 64, 64, -64, -64, -64, 64, -64, -64, -64, -64, -64, -64, 64, 64, -64, 64, 64, -64, 64, 64, -64, 64, -64, 64, -64, -64, 64, 64, -64, -64, -64, 64, 64, -64, 64, 64, 64, -64, 64, 64, -64, 64, -64, 64, 64, -64, 64, 64, 64, -64, -64, -64, -64, 64, -64, -64, 64, -64, 64, 64, -64, 64, -64, 64, 64, -64, 64, -64, 64, -64, -64, 64, 64, 64, -64, -64, -64, 64, 64, 64, -64, -64, 64, 64, 64, -64, 64, -64, -64, -64, -64, -64, -64, -64, -64, 64, -64, 64, 64, -64, -64, 64, -64, 64, 64, -64, 64, -64, 64, -64, 64, -64, 64, 64, 64, -64, -64, -64, -64, 64, -64, 64, 64, -64, -64, 64, 64, -64, 64, 64, 64, 64, -64, -64, 64, -64, -64, 64, 64, -64, 64, 64, 64, 64, 64, 64, 64, 64, -64, 64, 64, -64, -64, -64, -64, 64, 64, 64, 64, -64, -64, 64, 64, 64, -64, 64, 64, -64, 64, 64, 64, 64, 64, 64, 64, -64, -64, 64, 64, 64, 64, 64, -64, 64, 64, 64, 64, -64, -64, 64, -64, 64, 64, 64, -64, 64, -64, 64, 64, -64, -64, -64, -64, 64, -64, 64, -64, 64, -64, 64, -64, -64, 64, 64, -64, 64, 64, 64, 64, 64, -64, -64, -64, 64, 64, 64, 64, 64, 64, 64, 64, 64, 64, 64, -64, -64, -64, 64, 64, 64, 64, -64, -64, 64, 64, -64, -64, 64, -64, 64, 64, 64, 64, 64, 64, 64, -64, 64, -64, 64, 64, 64, -64, 64, 64, -64, 64, 64, 64, 64, 64, 64, 64, 64, 64, 64, 64, 64, 64, 64, 64, -64, -64, 64, 64, -64, -64, -64, 64, -64, -64, -64, 64, -64, 64, 64, 64, 64, 64, 64, 64, 64, 64, 64, -64, 64, -64, -64, 64, 64, 64, -64, 64, -64, 64, 64, -64, 64, -64, -64, -64, -64, -64, -64, 64, 64, 64, 64, -64, 64, 64, 64, -64, 64, 64, 64, 64, 64, 64, -64, 64, 64, 64, -64, -64, -64, 64, 64, -64, 64, 64, 64, 64, 64, 64, 64, 64, 64, 64, 64, 64, 64, 64, 64, 64, 64, 64, 64, -64, 64, 64, -64, -64, 64, -64, -64, -64, 64, 64, -64, 64, 64, 64, -64, 64, 64, 64, 64, -64, -64, -64, 64, -64, -64, 64, 64, 64, -64, 64, -64, 64, -64, 64, 64, -64, 64, -64, 64, 64, 64, 64, -64, 64, 64, -64, 64, 64, 64, 64, 64, -64, 64, -64, 64, 64, 64, -64, 64, 64, -64, -64, 64, -64, 64, -64, 64, -64, -64, 64, 64, 64, 64, 64, 64, -64, -64, -64, 64, 64, 64, 64, 64, 64, 64, 64, -64, -64, 64, -64, 64, 64, 64, 64, 64, 64, 64, -64, 64, 64, -64, 64, 64, -64, -64, 64, 64, 64, 64, -64, 64, 64, -64, -64, -64, -64, 64, -64, -64, 64, -64, -64, -64, -64, 64, 64, 64, 64, 64, 64, 64, -64, -64, 64, 64, 64, 64, 64, 64, 64, 64, -64, -64, -64, -64, -64, -64, 64, -64, -64, 64, 64, -64, -64, -64, 64, -64, 64, 64, -64, 64, 64, 64, 64, 64, 64, 64, 64, -64, -64, 64, -64, -64, -64, 64, -64, 64, -64, 64, -64, -64, -64, 64, 64, 64, 64, -64, -64, -64, 64, 64, 64, -64, -64, -64, 64, -64, -64, 64, 64, -64, -64, 64, 64, -64, 64, -64, 64, -64, 64, 64, 64, -64, 64, 64, -64, 64, 64, 64, 64, -64, -64, 64, -64, 64, -64, 64, -64, -64, 64, 64, -64, 64, 64, 64, 64, -64, -64, 64, 64, -64, -64, -64, 64, -64, 64, 64, 64, -64, -64, 64, -64, 64, -64, -64, 64, 64, -64, 64, 64, 64, 64, 64, 64, 64, 64, -64, 64, 64, 64, -64, -64, -64, 64, 64, 64, 64, -64, -64, -64, -64, -64, -64, 64, 64, -64, -64, 64, 64, 64, 64, -64, -64, 64, -64, 64, -64, -64, -64, 64, -64, 64, -64, 64, -64, -64, 64, 64, -64, 64, -64, 64, 64, -64, -64, -64, 64, 64, 64, 64, 64, 64, -64, -64, -64, 64, 64, 64, 64, 64, -64, -64, 64, 64, 64, 64, -64, 64, 64, 64, 64, -64, -64, -64, 64, 64, 64, -64, 64, -64, 64, 64, -64, 64, -64, 64, 64, -64, -64, 64, -64, -64, -64, 64, -64, -64, -64, -64, 64, 64, 64, -64, -64, -64, -64, 64, 64, 64, -64, -64, 64, 64, -64, 64, 64, -64, 64, 64, -64, -64, 64, -64, -64, -64, 64, -64, -64, -64, -64, 64, 64, 64, 64, -64, 64, 64, -64, 64, -64, -64, 64, -64, -64, -64, 64, 64, 64, 64, 64, -64, -64, -64, -64, 64, -64, -64, -64, -64, -64, 64, 64, 64, 64, -64, 64, 64, -64, -64, -64, -64, 64, -64, 64, 64, 64, 64, 64, 64, 64, 64, -64, 64, -64, -64, -64, 64, 64, 64, 64, 64, 64, -64, -64, -64, -64, 64, -64, 64, -64, 64, 64, 64, 64, 64, 64, 64, -64, 64, 64, -64, 64, -64, -64, 64, 64, 64, 64, 64, 64, -64, -64, -64, -64, 64, 64, 64, -64, -64, 64, -64, 64, 64, 64, 64, 64, 64, 64, 64, 64, -64, -64, -64, 64, -64, -64, 64, -64, -64, 64, 64, -64, -64, -64, -64, -64, -64, -64, -64, -64, 64, 64, 64, 64, 64, -64, 64, 64, 64, -64, -64, 64, -64, 64, 64, 64, -64, -64, -64, -64, -64, -64, -64, -64, -64, -64, -64, 64, -64, 64, 64, 64, 64, 64, -64, -64, 64, 64, 64, 64, -64, 64, -64, -64, -64, -64, -64, -64, -64, -64, -64, -64, -64, -64, -64, 64, 64, 64, 64, 64, 64, -64, -64, 64, -64, 64, -64, 64, -64, -64, -64, -64, -64, -64, -64, -64, -64, -64, -64, -64, -64, -64, -64, -64, 64, -64, 64, 64, -64, -64, -64, 64, -64, -64, -64, 64, -64, 64, -64, -64, -64, 64, -64, 64, 64, -64, -64, -64, -64, -64, -64, -64, -64, 64, 64, -64, -64, -64, -64, 64, 64, -64, -64, -64, -64, -64, -64, 64, 64, -64, -64, -64, 64, -64, -64, -64, -64, -64, -64, -64, -64, -64, -64, 64, -64, -64, 64, -64, 64, 64, -64, 64, -64, -64, -64, -64, -64, -64, -64, 64, -64, -64, -64, -64, -64, -64, -64, -64, -64, -64, -64, -64, 64, 64, -64, 64, 64, 64, -64, -64, 64, 64, -64, 64, -64, -64, 64, 64, 64, 64, -64, -64, 64, -64, -64, -64, -64, -64, -64, 64, 64, -64, 64, -64, -64, -64, 64, -64, -64, 64, 64, -64, -64, 64, 64, 64, 64, 64, 64, 64, 64, -64, -64, 64, -64, -64, 64, -64, -64, 64, 64, 64, -64, -64, 64, -64, -64, 64, -64, -64, -64, 64, 64, 64, 64, 64, 64, -64, -64, 64, 64, -64, -64, -64, 64, 64, -64, -64, -64, -64, 64, -64, 64, 64, -64, -64, -64, -64, -64, 64, -64, 64, -64, -64, 64, 64, 64, -64, -64, -64, -64, 64, -64, -64, -64, 64, -64, -64, 64, 64, 64, -64, -64, 64, -64, -64, -64, -64, 64, 64, -64, 64, -64, 64, 64, -64, -64, -64, -64, 64, -64, 64, -64, -64, 64, 64, -64, -64, -64, -64, -64, -64, 64, 64, -64, -64, 64, -64, 64, -64, 64, 64, -64, -64, -64, -64, -64, 64, 64, 64, -64, 64, 64, 64, -64, 64, -64, -64, 64, 64, -64, -64, -64, 64, -64, 64, 64, -64, -64, -64, -64, 64, -64, -64, -64, -64, 64, 64, 64, -64, 64, -64, -64, -64, -64, -64, -64, 64, 64, 64, 64, -64, 64, -64, -64, -64, 64, -64, -64, 64, 64, -64, -64, 64, 64, -64, 64, -64, -64, 64, 64, -64, -64, 64, -64, -64, -64, 64, 64, -64, -64, -64, -64, 64, -64, -64, 64, 64, -64, -64, -64, -64, 64, -64, 64, 64, -64, -64, -64, 64, 64, 64, 64, 64, 64, 64, 64, -64, -64, -64, 64, 64, 64, -64, 64, -64, 64, 64, 64, 64, 64, 64, 64, -64, -64, -64, -64, -64, 64, 64, 64, -64, 64, -64, -64, -64, -64, -64, 64, 64, 64, -64, -64, 64, 64, 64, 64, -64, -64, 64, 64, -64, 64, 64, 64, -64, -64, 64, -64, -64, -64, -64, -64, -64, -64, -64, -64, -64, -64, -64, -64, 64, 64, -64, -64, -64, -64, -64, -64, -64, 64, 64, 64, 64, -64, -64, -64, -64, 64, 64, -64, -64, -64, -64, -64, -64, -64, -64, 64, 64, -64, 64, -64, -64, 64, -64, -64, -64, 64, -64, -64, 64, -64, -64, -64, 64, -64, -64, -64, -64, -64, -64, -64, -64, -64, -64, -64, -64, -64, -64, -64, 64, -64, 64, 64, -64, -64, 64, 64, 64, 64, 64, -64, 64, 64, -64, -64, -64, -64, 64, -64, -64, 64, -64, -64, -64, 64, 64, -64, 64, -64, -64, -64, 64, 64, -64, -64, 64, 64, -64, 64, -64, -64, 64, 64, -64, -64, 64, -64, -64, 64, -64, -64, -64, 64, 64, 64, 64, -64, 64, 64, 64, -64, -64, -64, -64, -64, 64, 64, 64, -64, -64, -64, -64, 64, 64, -64, -64, 64, 64, 64, 64, 64, 64, 64, 64, -64, 64, -64, -64, -64, -64, -64, -64, 64, 64, -64, -64, 64, -64, -64, -64, -64, 64, -64, -64, 64, -64, 64, -64, 64, 64, 64, 64, 64, 64, -64, 64, -64, -64, 64, 64, 64, 64, 64, -64, 64, 64, 64, -64, -64, -64, -64, 64, -64, 64, -64, 64, -64, -64, -64, 64, -64, 64, 64, -64, 64, -64, -64, 64, -64, 64, 64, 64, -64, -64, -64, 64, -64, -64, -64, -64, -64, -64, 64, -64, -64, -64, -64, -64, -64, -64, -64, -64, -64, 64, -64, -64, -64, 64, 64, 64, -64, -64, -64, -64, -64, -64, -64, -64, -64, -64, -64, 64, 64, -64, -64, -64, -64, 64, 64, -64, -64, 64, -64, 64, 64, 64, 64, 64, -64, -64, -64, 64, -64, -64, -64, -64, -64, -64, 64, 64, 64, -64, -64, -64, 64, -64, 64, 64, 64, 64, 64, 64, -64, -64, 64, -64, 64, -64, -64, 64, -64, 64, 64, 64, 64, 64, -64, 64, 64, -64, -64, 64, -64, -64, -64, -64, -64, 64, 64, 64, -64, -64, -64, -64, 64, -64, 64, 64, -64, -64, 64, 64, 64, 64, 64, 64, 64, -64, -64, 64, 64, 64, 64, -64, -64, 64, -64, 64, -64, -64, -64, 64, 64, -64, -64, 64, -64, -64, 64, 64, 64, 64, 64, 64, -64, 64, 64, 64, 64, 64, 64, -64, -64, -64, 64, -64, 64, 64, -64, 64, 64, -64, -64, 64, 64, 64, 64, 64, 64, 64, -64, 64, 64, 64, 64, 64, -64, -64, -64, 64, 64, -64, 64, -64, -64, 64, 64, 64, -64, 64, 64, 64, 64, 64, 64, -64, 64, 64, -64, -64, 64, 64, 64, 64, 64, 64, -64, 64, 64, -64, 64, 64, -64, 64, 64, 64, 64, -64, -64, -64, 64, 64, -64, 64, 64, 64, -64, 64, 64, 64, 64, 64, -64, 64, -64, -64, 64, 64, -64, 64, -64, 64, 64, 64, -64, 64, 64, 64, 64, 64, -64, 64, 64, 64, 64, 64, 64, 64, -64, 64, 64, -64, -64, -64, 64, -64, -64, 64, -64, 64, 64, 64, -64, -64, 64, 64, 64, 64, 64, 64, 64, 64, 64, 64, 64, 64, -64, -64, 64, 64, -64, 64, -64, 64, -64, 64, 64, 64, 64, 64, -64, 64, -64, -64, -64, 64, 64, 64, 64, 64, 64, 64, 64, 64, 64, 64, -64, -64, 64, 64, -64, 64, -64, 64, -64, 64, 64, 64, 64, 64, 64, 64, -64, -64, 64, 64, 64, 64, -64, 64, 64, 64, 64, 64, -64, 64, -64, -64, -64, 64, -64, -64, 64, 64, 64, 64, 64, 64, 64, 64, -64, -64, 64, 64, 64, 64, 64, 64, 64, 64, 64, 64, 64, -64, -64, 64, -64, -64, 64, 64, -64, 64, 64, 64, 64, 64, 64, 64, -64, 64, 64, 64, 64, 64, 64, 64, -64, 64, -64, 64, -64, -64, -64, -64, 64, 64, 64, -64, -64, -64, 64, 64, 64, -64, -64, 64, 64, 64, 64, 64, -64, 64, 64, -64, 64, 64, -64, -64, -64, -64, 64, 64, -64, 64, -64, 64, 64, 64, 64, 64, -64, -64, -64, 64, 64, 64, 64, -64, -64, -64, 64, -64, -64, -64, -64, -64, 64, 64, -64, 64, 64, 64, -64, -64, -64, 64, 64, -64, -64, -64, -64, -64, -64, -64, -64, -64, -64, -64, -64, -64, -64, -64, -64, -64, -64, 64, 64, -64, 64, 64, -64, -64, 64, -64, -64, -64, -64, -64, 64, 64, -64, -64, 64, -64, -64, -64, -64, -64, -64, -64, -64, 64, -64, -64, 64, 64, 64, 64, 64, 64, -64, -64, -64, -64, -64, -64, -64, -64, -64, -64, -64, -64, 64, -64, -64, -64, 64, -64, -64, -64, -64, 64, -64, -64, 64, -64, -64, 64, 64, 64, 64, 64, 64, 64, 64, 64, -64, -64, 64, -64, 64, -64, 64, -64, -64, 64, -64, -64, 64, 64, 64, 64, -64, 64, -64, 64, -64, -64, -64, 64, 64, 64, 64, 64, -64, 64, 64, -64, -64, 64, 64, 64, -64, -64, 64, -64, -64, 64, -64, 64, 64, -64, 64, -64, -64, -64, 64, 64, -64, 64, 64, 64, -64, -64, 64, 64, 64, -64, 64, 64, 64, -64, 64, -64, 64, -64, 64, -64, -64, 64, -64, -64, -64, 64, 64, -64, 64, 64, 64, 64, -64, -64, -64, 64, -64, -64, 64, -64, -64, -64, -64, 64, -64, -64, 64, 64, 64, -64, -64, -64, -64, -64, 64, 64, -64, 64, 64, 64, 64, 64, 64, -64, 64, -64, -64, 64, -64, 64, 64, -64, -64, -64, 64, -64, -64, -64, -64, 64, -64, 64, 64, -64, -64, -64, -64, -64, -64, -64, -64, 64, 64, -64, 64, -64, -64, 64, 64, -64, -64, 64, 64, 64, 64, 64, -64, 64, 64, 64, 64, -64, 64, 64, 64, 64, 64, 64, 64, 64, -64, -64, 64, -64, -64, -64, -64, -64, 64, 64, -64, 64, 64, 64, -64, 64, 64, -64, -64, -64, 64, -64, 64, 64, 64, 64, -64, 64, 64, -64, 64, 64, 64, -64, -64, 64, -64, 64, -64, -64, 64, -64, -64, -64, 64, 64, 64, -64, 64, 64, 64, 64, 64, 64, 64, 64, -64, 64, -64, 64, 64, -64, -64, -64, 64, 64, 64, 64, 64, -64, 64, -64, 64, -64, -64, -64, 64, 64, 64, 64, 64, 64, 64, 64, -64, 64, 64, -64, -64, 64, -64, -64, 64, 64, 64, 64, -64, -64, 64, 64, 64, 64, -64, -64, 64, 64, 64, 64, 64, 64, 64, 64, -64, 64, 64, -64, 64, 64, 64, -64, -64, -64, -64, 64, -64, 64, -64, 64, -64, 64, 64, 64, -64, 64, 64, 64, 64, 64, 64, 64, 64, -64, -64, 64, 64, 64, 64, -64, 64, 64, 64, -64, -64, 64, 64, 64, 64, -64, 64, 64, 64, 64, 64, 64, 64, 64, 64, -64, -64, 64, -64, 64, 64, 64, 64, 64, 64, -64, -64, 64, 64, -64, -64, -64, -64, -64, -64, -64, 64, 64, 64, 64, 64, 64, -64, 64, -64, 64, 64, -64, 64, 64, 64, 64, 64, -64, 64, -64, 64, 64, -64, -64, 64, 64, 64, 64, 64, 64, 64, 64, 64, 64, -64, -64, 64, 64, 64, 64, 64, 64, 64, 64, 64, -64, -64, 64, 64, -64, -64, -64, 64, 64, 64, 64, 64, 64, 64, 64, 64, 64, -64, 64, -64, -64, 64, -64, 64, 64, 64, 64, 64, 64, 64, -64, 64, 64, -64, -64, 64, 64, 64, -64, 64, 64, 64, 64, 64, -64, -64, 64, -64, 64, 64, 64, 64, 64, -64, -64, 64, 64, 64, -64, -64, -64, 64, -64, -64, 64, -64, -64, 64, 64, 64, 64, 64, -64, 64, -64, 64, 64, 64, 64, 64, 64, 64, 64, 64, 64, 64, 64, -64, 64, -64, 64, -64, -64, -64, -64, -64, 64, 64, -64, -64, -64, 64, -64, 64, 64, 64, 64, 64, 64, 64, 64, -64, -64, 64, -64, -64, 64, -64, 64, -64, -64, 64, 64, 64, 64, 64, 64, -64, -64, 64, 64, 64, 64, 64, 64, 64, 64, -64, 64, 64, 64, -64, 64, -64, 64, 64, 64, 64, 64, 64, 64, 64, 64, 64, -64, -64, -64, -64, 64, 64, 64, 64, 64, 64, 64, 64, 64, 64, -64, 64, 64, -64, -64, -64, 64, 64, 64, 64, 64, 64, 64, 64, 64, -64, -64, -64, 64, 64, 64, 64, 64, 64, 64, 64, 64, 64, 64, 64, 64, 64, 64, 64, -64, -64, -64, -64, -64, 64, 64, 64, 64, 64, 64, -64, -64, 64, 64, 64, 64, 64, 64, 64, 64, 64, 64, 64, 64, 64, -64, 64, -64, -64, -64, -64, 64, 64, 64, 64, -64, -64, -64, 64, -64, 64, 64, 64, -64, 64, 64, 64, 64, 64, -64, 64, 64, -64, 64, 64, -64, -64, 64, -64, -64, 64, 64, -64, 64, -64, -64, 64, -64, -64, 64, 64, -64, -64, 64, 64, 64, -64, 64, -64, 64, -64, 64, -64, -64, 64, 64, -64, 64, 64, 64, -64, 64, 64, -64, -64, 64, 64, 64, 64, 64, 64, 64, 64, 64, 64, 64, -64, 64, 64, -64, -64, -64, -64, -64, -64, 64, 64, 64, 64, -64, 64, -64, 64, 64, 64, 64, 64, 64, 64, -64, -64, 64, 64, -64, -64, -64, 64, -64, 64, -64, 64, -64, 64, 64, 64, 64, -64, 64, 64, -64, 64, 64, 64, -64, 64, 64, 64, 64, 64, 64, 64, -64, 64, -64, 64, -64, -64, -64, 64, -64, -64, 64, 64, 64, 64, 64, 64, 64, 64, 64, 64, 64, -64, -64, -64, -64, 64, -64, 64, -64, 64, -64, 64, 64, -64, 64, -64, -64, 64, 64, 64, 64, 64, 64, -64, -64, -64, 64, 64, -64, 64, -64, -64, -64, -64, 64, -64, -64, -64, 64, 64, 64, -64, 64, 64, -64, -64, -64, 64, 64, 64, 64, 64, -64, -64, -64, -64, -64, 64, -64, -64, 64, -64, 64, 64, 64, -64, -64, -64, 64, -64, 64, -64, -64, 64, 64, 64, 64, 64, 64, -64, 64, -64, -64, -64, 64, 64, 64, -64, -64, 64, 64, -64, 64, 64, 64, -64, 64, -64, 64, -64, -64, 64, 64, -64, -64, -64, -64, 64, 64, -64, -64, -64, 64, -64, -64, -64, 64, -64, -64, -64, -64, -64, -64, -64, -64, -64, -64, 64, -64, -64, 64, -64, -64, 64, 64, -64, -64, 64, -64, 64, -64, -64, -64, -64, 64, 64, 64, 64, 64, 64, -64, 64, -64, 64, 64, -64, -64, 64, 64, 64, -64, 64, 64, 64, 64, -64, 64, 64, -64, 64, -64, -64, 64, -64, -64, -64, -64, -64, 64, 64, -64, -64, 64, 64, 64, -64, -64, -64, 64, 64, 64, 64, -64, 64, 64, 64, 64, -64, 64, 64, 64, 64, -64, -64, -64, 64, -64, -64, 64, 64, 64, -64, -64, 64, 64, 64, 64, 64, 64, -64, 64, 64, 64, 64, 64, 64, 64, 64, 64, 64, 64, 64, 64, -64, 64, 64, 64, -64, 64, -64, 64, -64, 64, 64, 64, 64, 64, 64, 64, 64, -64, 64, 64, 64, 64, 64, 64, 64, 64, 64, -64, -64, 64, 64, -64, 64, 64, 64, 64, 64, -64, 64, 64, 64, 64, -64, 64, 64, 64, 64, 64, 64, 64, 64, 64, 64, 64, 64, 64, 64, -64, -64, -64, 64, 64, 64, 64, 64, 64, -64, 64, 64, 64, -64, 64, -64, -64, -64, 64, -64, 64, 64, 64, 64, 64, 64, 64, -64, -64, 64, -64, -64, 64, 64, -64, 64, 64, 64, 64, 64, 64, 64, 64, 64, 64, 64, -64, 64, 64, 64, 64, 64, 64, 64, -64, 64, 64, 64, 64, -64, -64, 64, 64, -64, 64, -64, 64, 64, -64, -64, -64, -64, 64, -64, 64, -64, 64, -64, 64, 64, 64, 64, 64, 64, -64, -64, 64, -64, 64, 64, -64, 64, 64, 64, -64, 64, 64, 64, -64, -64, -64, -64, -64, -64, -64, -64, 64, 64, 64, -64, 64, 64, 64, 64, 64, 64, -64, -64, -64, 64, 64, -64, 64, -64, -64, 64, -64, -64, -64, -64, 64, 64, 64, -64, -64, 64, 64, 64, 64, 64, -64, 64, -64, 64, -64, 64, 64, 64, 64, 64, -64, -64, 64, 64, -64, 64, 64, 64, 64, 64, -64, -64, 64, -64, 64, 64, 64, -64, 64, 64, -64, -64, -64, 64, -64, -64, -64, -64, 64, 64, 64, 64, 64, -64, 64, 64, 64, 64, -64, -64, -64, -64, 64, -64, -64, -64, 64, -64, 64, 64, -64, -64, -64, -64, -64, 64, -64, -64, 64, 64, 64, 64, -64, 64, -64, 64, 64, -64, -64, 64, -64, 64, -64, 64, -64, -64, 64, -64, -64, -64, -64, -64, 64, 64, -64, -64, 64, -64, -64, -64, 64, 64, -64, 64, 64, 64, -64, -64, 64, 64, 64, 64, -64, -64, -64, 64, 64, 64, -64, -64, -64, 64, 64, 64, -64, 64, -64, 64, 64, 64, -64, 64, 64, 64, -64, 64, 64, 64, 64, -64, 64, 64, -64, 64, -64, -64, 64, -64, 64, -64, 64, -64, -64, 64, -64, 64, 64, -64, 64, 64, 64, 64, -64, 64, 64, -64, 64, 64, 64, 64, 64, 64, -64, -64, -64, -64, 64, 64, 64, 64, 64, -64, 64, 64, 64, -64, 64, -64, 64, 64, -64, -64, -64, -64, 64, -64, 64, -64, 64, -64, -64, 64, -64, 64, -64, -64, 64, 64, 64, 64, 64, 64, 64, 64, 64, 64, 64, 64, -64, -64, -64, -64, -64, 64, -64, -64, -64, 64, 64, -64, 64, 64, 64, 64, 64, 64, 64, 64, 64, 64, -64, 64, -64, 64, 64, 64, -64, -64, -64, -64, -64, 64, 64, -64, -64, -64, -64, 64, 64, 64, 64, 64, -64, 64, 64, 64, 64, 64, 64, 64, 64, 64, -64, 64, 64, -64, -64, -64, 64, 64, -64, -64, 64, 64, -64, 64, 64, 64, 64, 64, 64, 64, 64, 64, -64, 64, -64, 64, 64, 64, 64, 64, -64, -64, -64, -64, -64, 64, -64, -64, -64, -64, -64, 64, 64, -64, 64, 64, 64, 64, 64, 64, -64, -64, -64, 64, 64, 64, 64, 64, 64, 64, -64, -64, 64, 64, -64, -64, 64, 64, 64, 64, 64, 64, -64, -64, 64, 64, 64, 64, 64, 64, 64, 64, -64, 64, -64, 64, 64, -64, -64, -64, 64, -64, -64, -64, -64, 64, 64, 64, -64, -64, 64, -64, -64, -64, -64, -64, 64, 64, -64, 64, -64, 64, 64, -64, 64, 64, -64, -64, -64, 64, -64, 64, -64, -64, 64, -64, 64, -64, -64, -64, -64, -64, -64, -64, 64, -64, 64, 64, 64, 64, 64, 64, -64, -64, 64, 64, 64, -64, 64, -64, 64, 64, -64, -64, -64, -64, -64, 64, -64, 64, -64, 64, 64, -64, -64, 64, 64, 64, -64, -64, -64, 64, 64, 64, 64, 64, -64, 64, -64, 64, -64, 64, -64, 64, -64, 64, 64, -64, 64, -64, 64, 64, -64, -64, 64, -64, 64, -64, -64, 64, -64, -64, 64, 64, -64, -64, 64, 64, -64, -64, 64, -64, -64, 64, -64, 64, -64, 64, -64, 64, 64, 64, 64, -64, 64, -64, -64, -64, 64, 64, 64, -64, 64, 64, -64, -64, 64, 64, -64, -64, 64, -64, -64, 64, 64, 64, -64, -64, 64, 64, 64, 64, 64, 64, -64, 64, 64, -64, -64, -64, 64, -64, 64, 64, 64, -64, -64, -64, 64, 64, -64, -64, 64, -64, 64, 64, 64, 64, 64, 64, 64, 64, 64, 64, 64, 64, -64, 64, 64, 64, 64, 64, 64, -64, -64, -64, -64, 64, 64, 64, 64, 64, 64, 64, 64, 64, 64, -64, 64, -64, 64, -64, -64, -64, -64, -64, 64, 64, 64, -64, -64, 64, -64, -64, 64, 64, 64, 64, 64, 64, 64, -64, 64, -64, -64, 64, 64, 64, -64, -64, -64, -64, -64, -64, 64, 64, 64, -64, 64, -64, 64, 64, 64, 64, 64, 64, 64, 64, 64, 64, -64, 64, 64, 64, 64, 64, 64, -64, -64, -64, -64, 64, -64, -64, -64, 64, -64, -64, 64, -64, 64, 64, 64, 64, 64, 64, 64, -64, 64, 64, 64, 64, 64, 64, 64, 64, 64, 64, -64, 64, -64, -64, 64, 64, 64, -64, 64, 64, 64, 64, 64, 64, 64, 64, 64, -64, 64, 64, -64, -64, 64, -64, -64, 64, 64, 64, 64, -64, -64, -64, -64, -64, 64, 64, 64, -64, -64, -64, 64, 64, 64, -64, 64, -64, -64, 64, 64, 64, -64, 64, 64, 64, 64, -64, 64, 64, 64, -64, -64, 64, 64, 64, 64, -64, 64, 64, 64, 64, 64, 64, 64, -64, -64, -64, 64, 64, -64, 64, 64, 64, 64, -64, 64, 64, 64, -64, -64, -64, -64, 64, -64, 64, 64, 64, 64, 64, 64, 64, -64, -64, -64, -64, 64, 64, -64, 64, -64, -64, 64, 64, 64, 64, 64, 64, 64, 64, -64, -64, 64, -64, 64, 64, 64, 64, 64, 64, 64, -64, -64, -64, -64, -64, -64, 64, 64, 64, 64, 64, -64, -64, 64, -64, -64, 64, 64, 64, -64, 64, 64, 64, 64, 64, 64, 64, -64, -64, -64, -64, -64, 64, 64, 64, 64, 64, 64, -64, 64, 64, 64, 64, -64, -64, -64, -64, 64, 64, 64, 64, 64, 64, 64, 64, -64, -64, -64, -64, -64, 64, 64, 64, -64, 64, 64, 64, 64, 64, 64, 64, -64, -64, -64, 64, 64, 64, 64, 64, 64, 64, 64, 64, -64, -64, 64, 64, -64, 64, 64, 64, 64, -64, 64, 64, 64, 64, -64, 64, -64, 64, -64, 64, 64, 64, 64, 64, 64, -64, -64, 64, -64, 64, 64, 64, 64, 64, 64, 64, 64, 64, 64, 64, -64, 64, 64, 64, 64, 64, 64, 64, 64, 64, 64, 64, 64, -64, -64, -64, 64, 64, 64, 64, 64, 64, 64, 64, 64, -64, 64, 64, 64, -64, -64, -64, 64, 64, 64, 64, 64, 64, 64, 64, 64, -64, -64, -64, 64, 64, 64, 64, 64, 64, -64, -64, 64, 64, 64, 64, -64, -64, 64, 64, -64, -64, -64, 64, 64, -64, 64, -64, -64, -64, -64, -64, 64, 64, 64, 64, 64, -64, 64, 64, 64, 64, 64, 64, -64, -64, 64, 64, 64, -64, 64, 64, 64, -64, 64, -64, -64, 64, 64, 64, 64, 64, 64, 64, 64, 64, 64, 64, 64, 64, 64, 64, -64, -64, 64, 64, -64, -64, -64, 64, 64, 64, 64, -64, -64, 64, 64, -64, 64, 64, 64, 64, 64, 64, 64, 64, 64, 64, 64, -64, 64, 64, -64, -64, 64, 64, 64, 64, 64, 64, 64, -64, -64, 64, 64, -64, 64, -64, 64, -64, 64, 64, 64, 64, 64, 64, 64, 64, 64, 64, -64, 64, 64, -64, 64, 64, 64, 64, -64, -64, -64, -64, -64, -64, -64, -64, 64, 64, 64, 64, 64, 64, 64, -64, 64, -64, -64, -64, 64, -64, -64, 64, -64, 64, -64, 64, 64, 64, 64, 64, 64, 64, 64, 64, 64, -64, -64, 64, 64, 64, 64, -64, 64, -64, 64, 64, 64, 64, -64, -64, -64, -64, 64, 64, 64, 64, 64, 64, 64, 64, 64, 64, 64, -64, 64, 64, 64, 64, 64, 64, 64, -64, -64, -64, -64, -64, 64, -64, 64, -64, 64, 64, -64, -64, 64, 64, 64, 64, -64, -64, 64, 64, 64, -64, -64, -64, 64, 64, -64, 64, 64, -64, -64, 64, 64, -64, -64, 64, 64, 64, -64, -64, -64, 64, 64, -64, -64, 64, -64, -64, -64, -64, 64, -64, -64, 64, 64, -64, -64, -64, 64, -64, 64, 64, 64, -64, -64, -64, -64, -64, -64, -64, -64, -64, -64, 64, -64, -64, 64, -64, -64, 64, 64, -64, -64, -64, 64, -64, -64, -64, 64, 64, 64, 64, 64, -64, 64, 64, 64, 64, 64, -64, -64, 64, -64, 64, -64, 64, -64, -64, -64, 64, 64, 64, -64, -64, -64, 64, -64, 64, 64, -64, -64, 64, -64, -64, 64, 64, 64, 64, -64, -64, -64, 64, 64, 64, 64, -64, -64, -64, 64, 64, 64, -64, 64, -64, 64, -64, 64, -64, 64, -64, -64, 64, 64, -64, 64, 64, 64, -64, -64, -64, -64, -64, -64, -64, -64, -64, -64, 64, 64, 64, 64, 64, 64, 64, -64, -64, -64, 64, -64, -64, 64, 64, 64, 64, -64, -64, -64, -64, -64, -64, -64, -64, -64, -64, -64, 64, -64, -64, 64, 64, 64, -64, -64, 64, -64, -64, -64, -64, 64, 64, 64, -64, -64, -64, -64, -64, -64, -64, -64, -64, -64, -64, -64, -64, 64, 64, 64, -64, 64, -64, -64, -64, -64, -64, -64, -64, -64, 64, -64, -64, -64, -64, -64, -64, -64, -64, -64, -64, -64, -64, -64, -64, -64, 64, 64, 64, 64, -64, -64, 64, 64, -64, -64, -64, 64, -64, -64, 64, 64, -64, -64, -64, 64, -64, 64, 64, 64, 64, -64, 64, 64, -64, -64, -64, -64, -64, -64, 64, -64, -64, -64, 64, 64, 64, 64, 64, 64, 64, 64, 64, -64, 64, 64, 64, 64, -64, 64, 64, 64, 64, -64, -64, -64, 64, 64, 64, 64, -64, 64, 64, 64, 64, 64, 64, 64, 64, 64, 64, 64, 64, 64, 64, -64, 64, 64, 64, -64, 64, 64, 64, -64, -64, 64, -64, 64, 64, -64, 64, -64, 64, 64, 64, 64, 64, 64, 64, 64, 64, 64, 64, -64, -64, 64, 64, 64, -64, 64, 64, 64, 64, 64, -64, -64, 64, 64, -64, 64, -64, 64, -64, -64, -64, -64, -64, -64, 64, 64, -64, 64, -64, -64, -64, -64, 64, -64, -64, 64, 64, 64, 64, -64, -64, -64, -64, -64, -64, -64, -64, -64, -64, -64, -64, -64, -64, -64, -64, -64, -64, -64, -64, -64, 64, 64, 64, -64, 64, 64, 64, -64, -64, -64, -64, -64, -64, -64, -64, -64, -64, -64, -64, -64, -64, -64, -64, -64, -64, -64, -64, 64, -64, 64, -64, 64, -64, -64, -64, -64, -64, -64, -64, -64, -64, -64, -64, -64, -64, -64, -64, -64, 64, -64, -64, -64, -64, -64, -64, 64, -64, -64, -64, -64, -64, 64, -64, -64, -64, -64, -64, -64, -64, -64, -64, -64, -64, -64, -64, -64, -64, 64, -64, -64, -64, -64, -64, 64, 64, 64, -64, 64, -64, 64, 64, 64, 64, -64, -64, -64, -64, -64, 64, -64, 64, 64, -64, 64, -64, -64, 64, -64, -64, -64, -64, 64, 64, 64, 64, 64, 64, -64, -64, 64, 64, -64, -64, -64, 64, 64, 64, 64, -64, 64, 64, -64, 64, -64, -64, -64, 64, -64, 64, 64, 64, 64, 64, 64, 64, 64, -64, 64, 64, -64, -64, -64, -64, 64, -64, -64, 64, -64, -64, -64, 64, -64, -64, 64, -64, -64, 64, 64, 64, 64, -64, -64, -64, 64, -64, 64, -64, 64, -64, 64, -64, -64, -64, -64, -64, -64, -64, 64, -64, 64, -64, -64, -64, 64, -64, 64, 64, 64, 64, 64, 64, 64, 64, 64, 64, 64, -64, 64, 64, -64, 64, 64, 64, 64, -64, 64, 64, -64, -64, -64, -64, -64, 64, 64, 64, 64, 64, 64, 64, 64, -64, 64, -64, -64, 64, -64, -64, -64, 64, 64, 64, 64, 64, -64, -64, -64, -64, -64, -64, -64, 64, -64, 64, 64, -64, -64, -64, 64, 64, 64, 64, -64, -64, -64, -64, -64, -64, 64, -64, 64, 64, 64, -64, 64, -64, -64, -64, -64, 64, -64, -64, -64, 64, -64, -64, 64, -64, -64, 64, 64, -64, 64, -64, 64, 64, -64, -64, -64, -64, -64, 64, 64, -64, -64, -64, 64, -64, 64, 64, 64, -64, -64, 64, 64, -64, -64, -64, 64, 64, 64, -64, 64, 64, 64, 64, -64, -64, -64, -64, -64, -64, -64, -64, -64, -64, 64, -64, 64, -64, 64, -64, 64, 64, -64, -64, 64, 64, 64, 64, 64, 64, 64, 64, -64, -64, 64, 64, 64, 64, -64, -64, -64, 64, 64, -64, -64, -64, -64, -64, 64, -64, 64, 64, -64, -64, -64, -64, -64, 64, 64, 64, -64, -64, 64, 64, 64, 64, 64, -64, -64, -64, -64, 64, -64, 64, 64, 64, 64, 64, 64, 64, -64, 64, 64, 64, -64, -64, 64, -64, -64, 64, -64, -64, 64, 64, -64, 64, -64, 64, -64, 64, 64, 64, -64, 64, -64, -64, -64, -64, 64, -64, 64, 64, 64, -64, 64, -64, 64, 64, 64, -64, 64, -64, 64, -64, -64, -64, -64, 64, -64, -64, 64, -64, -64, -64, -64, 64, -64, -64, 64, -64, 64, 64, 64, -64, 64, -64, 64, -64, 64, 64, -64, 64, 64, 64, -64, -64, 64, -64, -64, 64, 64, -64, 64, 64, -64, -64, -64, 64, -64, -64, -64, 64, 64, 64, 64, -64, -64, 64, -64, -64, -64, -64, 64, -64, -64, 64, -64, -64, 64, -64, -64, -64, -64, -64, -64, -64, -64, -64, -64, 64, 64, -64, -64, -64, -64, -64, -64, -64, -64, -64, -64, 64, -64, -64, 64, 64, -64, 64, -64, -64, -64, 64, -64, 64, 64, -64, 64, -64, -64, -64, -64, -64, -64, -64, -64, -64, -64, -64, 64, 64, -64, 64, -64, -64, 64, 64, -64, 64, 64, 64, -64, -64, 64, 64, 64, -64, 64, -64, -64, -64, -64, -64, 64, -64, 64, 64, 64, -64, -64, -64, 64, 64, -64, -64, 64, 64, 64, 64, -64, 64, -64, -64, 64, 64, 64, -64, -64, -64, -64, -64, -64, -64, -64, 64, -64, 64, -64, -64, 64, 64, -64, -64, 64, -64, 64, 64, 64, -64, 64, -64, -64, -64, -64, -64, -64, -64, -64, -64, -64, 64, -64, 64, 64, -64, 64, -64, 64, 64, -64, 64, -64, -64, -64, 64, -64, -64, 64, 64, 64, 64, -64, 64, -64, -64, -64, -64, -64, -64, -64, -64, -64, -64, -64, 64, -64, -64, -64, -64, -64, -64, 64, 64, -64, 64, -64, 64, 64, -64, -64, -64, -64, -64, 64, -64, -64, 64, -64, -64, -64, -64, -64, 64, 64, 64, 64, -64, -64, -64, 64, -64, -64, -64, 64, 64, -64, -64, -64, 64, 64, -64, 64, -64, -64, -64, -64, -64, -64, -64, -64, -64, -64, -64, -64, -64, -64, -64, -64, -64, -64, -64, -64, 64, -64, -64, -64, 64, -64, 64, 64, 64, -64, -64, -64, -64, -64, -64, -64, 64, -64, -64, -64, -64, -64, -64, -64, -64, 64, 64, 64, 64, -64, -64, -64, -64, 64, 64, 64, 64, -64, -64, -64, 64, -64, 64, 64, 64, 64, -64, -64, 64, -64, -64, -64, -64, -64, -64, 64, 64, -64, -64, 64, 64, 64, 64, 64, -64, -64, -64, -64, -64, 64, -64, 64, -64, -64, -64, 64, 64, 64, -64, -64, -64, 64, -64, -64, 64, 64, 64, -64, 64, 64, 64, 64, 64, -64, -64, -64, -64, -64, -64, -64, 64, -64, -64, -64, 64, -64, 64, -64, -64, -64, 64, -64, 64, -64, 64, 64, 64, 64, 64, 64, 64, 64, -64, -64, -64, -64, -64, 64, -64, -64, -64, -64, -64, 64, -64, -64, -64, -64, -64, -64, -64, -64, -64, 64, -64, 64, 64, 64, 64, -64, -64, -64, -64, -64, -64, -64, -64, 64, 64, 64, -64, -64, -64, -64, -64, -64, -64, -64, -64, -64, 64, 64, -64, -64, -64, 64, 64, -64, -64, -64, -64, 64, -64, -64, -64, 64, -64, -64, -64, -64, -64, -64, -64, -64, -64, -64, -64, 64, 64, 64, 64, -64, -64, 64, 64, -64, -64, -64, -64, -64, -64, 64, 64, 64, 64, 64, -64, -64, -64, 64, -64, -64, -64, -64, -64, 64, 64, 64, -64, -64, -64, 64, -64, -64, -64, -64, -64, -64, -64, -64, -64, 64, -64, 64, -64, -64, -64, -64, -64, -64, -64, -64, -64, -64, -64, -64, -64, -64, -64, 64, -64, -64, -64, -64, -64, -64, 64, 64, 64, 64, 64, -64, -64, -64, -64, -64, -64, -64, 64, -64, -64, -64, -64, 64, -64, -64, 64, 64, 64, 64, 64, -64, -64, 64, -64, 64, 64, -64, 64, 64, -64, -64, -64, -64, -64, -64, 64, -64, -64, -64, -64, -64, 64, -64, 64, -64, 64, 64, 64, -64, -64, -64, 64, 64, -64, 64, -64, -64, -64, 64, 64, -64, -64, -64, -64, -64, -64, -64, -64, -64, -64, -64, -64, 64, 64, 64, 64, -64, 64, -64, -64, -64, 64, 64, -64, 64, 64, -64, -64, -64, 64, -64, -64, -64, -64, -64, -64, -64, -64, 64, -64, -64, 64, -64, 64, -64, 64, 64, 64, -64, -64, -64, -64, 64, 64, 64, -64, -64, 64, -64, 64, -64, -64, -64, -64, -64, 64, -64, -64, -64, -64, -64, 64, -64, 64, 64, 64, -64, 64, -64, -64, 64, -64, 64, 64, 64, 64, 64, 64, 64, 64, 64, -64, -64, -64, -64, -64, -64, -64, -64, 64, 64, 64, 64, -64, 64, 64, 64, 64, 64, -64, -64, 64, 64, -64, 64, -64, -64, -64, 64, 64, 64, -64, -64, 64, -64, 64, -64, -64, 64, -64, -64, 64, 64, 64, 64, 64, -64, 64, -64, 64, 64, -64, -64, 64, -64, -64, -64, -64, -64, 64, -64, -64, 64, 64, 64, 64, -64, -64, 64, -64, 64, 64, -64, -64, 64, -64, 64, -64, -64, -64, -64, 64, 64, -64, 64, 64, -64, 64, -64, 64, 64, -64, -64, 64, -64, 64, 64, 64, 64, -64, -64, 64, -64, -64, 64, -64, -64, 64, 64, 64, 64, -64, 64, 64, -64, 64, -64, 64, 64, -64, 64, -64, 64, 64, 64, -64, 64, -64, -64, -64, -64, -64, -64, -64, -64, -64, -64, 64, 64, 64, 64, -64, -64, -64, 64, 64, 64, 64, 64, 64, -64, 64, -64, 64, 64, 64, -64, -64, -64, 64, -64, -64, 64, 64, -64, 64, 64, 64, -64, -64, 64, -64, 64, 64, 64, 64, 64, 64, 64, 64, 64, 64, -64, 64, -64, -64, -64, 64, 64, 64, 64, 64, -64, -64, 64, 64, 64, 64, 64, 64, 64, 64, 64, 64, 64, -64, 64, -64, -64, 64, 64, -64, -64, 64, 64, 64, -64, 64, -64, -64, 64, -64, -64, -64, 64, -64, -64, 64, 64, 64, -64, 64, 64, -64, 64, 64, 64, -64, 64, -64, -64, -64, -64, -64, -64, 64, 64, 64, 64, 64, 64, 64, 64, 64, -64, 64, 64, 64, -64, 64, -64, 64, 64, 64, 64, -64, 64, -64, 64, 64, 64, -64, 64, 64, 64, 64, 64, 64, -64, 64, 64, 64, 64, 64, 64, -64, -64, 64, 64, 64, -64, -64, 64, 64, -64, -64, 64, 64, 64, -64, 64, -64, 64, 64, -64, 64, -64, 64, -64, 64, 64, 64, 64, -64, 64, -64, 64, -64, 64, 64, 64, -64, 64, -64, -64, -64, -64, -64, -64, 64, 64, 64, 64, -64, 64, -64, 64, 64, 64, -64, 64, -64, 64, -64, -64, -64, -64, -64, -64, 64, 64, 64, 64, -64, -64, -64, -64, -64, -64, 64, 64, 64, 64, 64, -64, 64, 64, 64, -64, 64, 64, -64, -64, -64, 64, -64, 64, -64, 64, -64, -64, 64, 64, -64, -64, -64, 64, 64, 64, -64, -64, 64, 64, -64, 64, 64, 64, 64, 64, 64, 64, 64, 64, 64, 64, -64, 64, 64, 64, -64, 64, -64, -64, 64, 64, 64, 64, -64, 64, 64, 64, 64, 64, 64, 64, 64, 64, 64, -64, 64, -64, -64, -64, -64, -64, 64, 64, -64, -64, -64, 64, 64, -64, -64, 64, -64, 64, 64, 64, 64, 64, -64, -64, 64, 64, 64, 64, 64, 64, 64, 64, -64, 64, 64, 64, 64, -64, 64, 64, -64, -64, 64, 64, 64, 64, 64, 64, -64, 64, 64, -64, 64, 64, 64, -64, 64, 64, 64, 64, -64, -64, -64, 64, 64, -64, -64, 64, 64, -64, 64, 64, 64, 64, 64, -64, -64, -64, 64, 64, 64, 64, -64, -64, 64, 64, -64, -64, -64, -64, -64, -64, 64, -64, -64, -64, -64, -64, -64, -64, 64, 64, 64, 64, 64, 64, 64, 64, 64, -64, 64, 64, 64, 64, -64, -64, -64, -64, 64, 64, 64, 64, 64, 64, 64, 64, -64, 64, 64, 64, 64, 64, 64, 64, -64, 64, 64, -64, -64, 64, 64, 64, 64, 64, -64, -64, 64, -64, -64, -64, 64, 64, 64, -64, -64, 64, 64, 64, 64, -64, 64, -64, 64, 64, 64, 64, 64, 64, -64, 64, 64, 64, 64, 64, 64, 64, 64, 64, -64, -64, 64, 64, -64, -64, 64, 64, 64, 64, 64, 64, 64, 64, 64, 64, 64, 64, -64, 64, 64, -64, 64, 64, -64, -64, 64, 64, 64, 64, 64, 64, 64, -64, 64, -64, 64, -64, -64, 64, -64, 64, 64, 64, -64, 64, 64, -64, 64, -64, -64, -64, -64, -64, -64, -64, -64, -64, 64, 64, -64, 64, -64, -64, 64, -64, 64, 64, -64, -64, 64, 64, 64, 64, -64, 64, 64, -64, -64, -64, -64, -64, -64, -64, -64, 64, 64, -64, -64, 64, -64, 64, -64, 64, -64, 64, 64, -64, 64, -64, 64, 64, 64, 64, 64, -64, -64, -64, -64, -64, -64, 64, -64, -64, 64, 64, 64, -64, -64, -64, 64, 64, -64, 64, 64, 64, 64, -64, 64, -64, 64, 64, -64, -64, 64, -64, -64, 64, -64, -64, 64, 64, -64, -64, -64, -64, 64, 64, 64, -64, 64, -64, -64, 64, -64, -64, -64, -64, 64, 64, -64, 64, -64, 64, 64, 64, 64, 64, -64, -64, -64, 64, -64, -64, 64, -64, 64, -64, -64, 64, 64, 64, -64, -64, 64, -64, 64, -64, -64, -64, -64, -64, -64, -64, 64, 64, 64, 64, 64, 64, 64, -64, 64, -64, -64, -64, 64, 64, 64, -64, 64, -64, 64, -64, -64, -64, 64, -64, 64, -64, -64, 64, -64, -64, -64, -64, 64, -64, 64, -64, 64, -64, 64, 64, 64, -64, -64, 64, -64, 64, -64, 64, -64, 64, -64, 64, -64, -64, 64, -64, 64, 64, -64, -64, -64, 64, 64, 64, 64, -64, -64, -64, -64, -64, 64, 64, 64, 64, 64, -64, -64, 64, -64, 64, 64, -64, 64, -64, 64, 64, 64, 64, 64, 64, -64, 64, 64, 64, 64, -64, -64, 64, 64, 64, 64, 64, 64, 64, 64, -64, 64, 64, -64, -64, 64, 64, 64, 64, 64, 64, -64, 64, 64, 64, 64, -64, -64, 64, 64, -64, 64, 64, 64, 64, 64, 64, 64, 64, 64, 64, 64, 64, 64, -64, 64, -64, 64, 64, 64, 64, -64, -64, 64, 64, 64, 64, -64, 64, 64, 64, -64, 64, -64, 64, 64, 64, 64, -64, 64, 64, 64, 64, 64, 64, 64, 64, 64, 64, 64, 64, 64, 64, -64, -64, -64, 64, 64, 64, 64, 64, 64, 64, 64, -64, 64, 64, 64, 64, 64, 64, 64, -64, 64, 64, -64, 64, 64, 64, -64, 64, -64, -64, 64, 64, 64, 64, 64, -64, -64, 64, 64, -64, 64, 64, 64, -64, -64, 64, -64, -64, 64, -64, -64, 64, 64, -64, 64, 64, -64, -64, 64, 64, 64, 64, -64, 64, -64, -64, -64, -64, 64, 64, 64, -64, -64, 64, -64, 64, 64, 64, -64, 64, 64, 64, -64, 64, -64, -64, -64, 64, 64, 64, -64, -64, -64, 64, 64, -64, -64, 64, -64, 64, 64, 64, 64, -64, -64, -64, -64, -64, -64, 64, -64, 64, -64, -64, -64, -64, -64, -64, -64, -64, -64, -64, -64, -64, -64, 64, 64, -64, -64, 64, -64, -64, 64, -64, -64, 64, 64, -64, -64, -64, -64, -64, -64, 64, -64, -64, -64, -64, -64, -64, 64, -64, -64, -64, 64, 64, 64, -64, -64, 64, -64, -64, -64, -64, 64, -64, -64, -64, -64, -64, -64, -64, 64, -64, -64, -64, -64, -64, -64, 64, 64, 64, 64, 64, -64, 64, 64, -64, 64, 64, -64, -64, 64, -64, -64, -64, -64, -64, 64, 64, 64, -64, -64, -64, -64, -64, 64, 64, 64, 64, -64, 64, -64, -64, -64, 64, 64, -64, 64, -64, -64, 64, -64, -64, -64, 64, 64, 64, 64, 64, -64, -64, -64, -64, 64, -64, 64, 64, -64, 64, 64, -64, 64, 64, 64, -64, -64, -64, -64, -64, -64, 64, 64, 64, 64, 64, 64, 64, -64, -64, -64, -64, 64, -64, 64, 64, 64, 64, -64, 64, 64, -64, 64, -64, -64, -64, 64, -64, -64, 64, 64, -64, 64, 64, 64, -64, -64, -64, -64, -64, -64, -64, 64, 64, 64, 64, -64, 64, -64, 64, 64, -64, -64, -64, -64, -64, 64, 64, 64, 64, 64, 64, 64, -64, -64, -64, -64, -64, 64, 64, 64, 64, 64, 64, -64, -64, -64, -64, 64, -64, -64, -64, 64, 64, 64, 64, 64, 64, 64, 64, 64, -64, -64, -64, 64, 64, 64, 64, 64, 64, 64, 64, -64, 64, -64, -64, 64, -64, -64, 64, 64, 64, 64, 64, 64, 64, 64, 64, -64, -64, -64, -64, 64, -64, -64, 64, 64, 64, 64, -64, 64, -64, 64, -64, -64, -64, -64, -64, 64, 64, 64, 64, 64, 64, 64, -64, -64, 64, 64, 64, 64, 64, 64, 64, 64, 64, 64, 64, -64, -64, -64, -64, -64, -64, -64, -64, -64, 64, 64, 64, 64, 64, 64, 64, 64, 64, 64, -64, 64, 64, 64, 64, 64, 64, 64, 64, -64, 64, -64, 64, 64, -64, -64, -64, -64, -64, 64, 64, 64, 64, 64, 64, -64, -64, 64, -64, 64, 64, -64, 64, 64, 64, 64, -64, 64, -64, 64, 64, 64, -64, -64, 64, -64, -64, -64, 64, 64, 64, 64, 64, 64, -64, 64, -64, 64, 64, 64, 64, 64, 64, -64, -64, -64, -64, 64, 64, 64, 64, -64, -64, -64, -64, 64, 64, -64, 64, 64, 64, -64, -64, 64, -64, -64, -64, 64, 64, 64, -64, -64, 64, 64, -64, 64, -64, -64, -64, -64, -64, -64, 64, 64, 64, 64, 64, 64, 64, 64, -64, -64, 64, -64, -64, -64, 64, 64, -64, -64, 64, 64, -64, -64, 64, -64, -64, -64, -64, 64, 64, 64, -64, 64, 64, 64, -64, -64, -64, -64, -64, -64, -64, -64, -64, 64, 64, 64, 64, 64, 64, -64, -64, -64, 64, 64, -64, -64, -64, -64, -64, -64, 64, -64, 64, -64, 64, 64, -64, 64, -64, -64, -64, 64, -64, -64, -64, -64, 64, -64, 64, 64, 64, 64, -64, 64, 64, 64, -64, 64, 64, -64, -64, -64, -64, -64, 64, 64, -64, 64, 64, 64, -64, -64, 64, -64, -64, -64, 64, -64, -64, 64, 64, -64, -64, -64, -64, 64, -64, 64, 64, 64, -64, -64, -64, 64, 64, 64, 64, -64, -64, 64, 64, 64, -64, -64, -64, -64, -64, -64, -64, -64, 64, 64, -64, 64, 64, 64, 64, -64, 64, -64, 64, 64, 64, 64, -64, -64, -64, -64, -64, -64, -64, 64, -64, 64, -64, -64, -64, -64, -64, -64, -64, 64, -64, -64, 64, -64, 64, 64, 64, 64, -64, 64, 64, 64, 64, -64, -64, -64, 64, 64, 64, -64, 64, 64, -64, -64, 64, -64, -64, 64, -64, -64, 64, 64, 64, -64, 64, -64, -64, 64, 64, -64, 64, 64, -64, -64, 64, 64, -64, -64, -64, 64, -64, -64, 64, 64, 64, -64, -64, -64, 64, -64, -64, -64, -64, -64, 64, -64, -64, -64, -64, -64, -64, 64, -64, 64, -64, -64, 64, 64, -64, 64, 64, 64, 64, 64, 64, 64, 64, -64, -64, -64, 64, 64, 64, 64, -64, -64, -64, -64, 64, 64, 64, -64, -64, -64, -64, -64, -64, -64, -64, -64, 64, -64, -64, -64, 64, -64, -64, -64, 64, -64, -64, -64, -64, -64, -64, -64, -64, 64, -64, 64, 64, -64, -64, -64, 64, 64, 64, -64, -64, -64, -64, -64, 64, 64, 64, -64, 64, 64, -64, -64, -64, -64, 64, 64, -64, 64, 64, -64, 64, -64, -64, 64, 64, -64, -64, -64, -64, -64, -64, -64, -64, 64, -64, -64, -64, -64, -64, -64, -64, 64, -64, -64, 64, -64, 64, 64, 64, 64, 64, 64, -64, -64, 64, -64, 64, -64, -64, 64, -64, -64, -64, -64, -64, -64, -64, -64, 64, 64, 64, 64, -64, 64, 64, 64, -64, 64, -64, 64, -64, 64, -64, 64, 64, -64, 64, -64, -64, -64, -64, 64, -64, -64, -64, 64, -64, -64, -64, 64, 64, 64, 64, -64, 64, 64, 64, 64, -64, 64, -64, -64, 64, -64, -64, -64, -64, 64, -64, -64, 64, 64, -64, -64, -64, 64, 64, 64, -64, -64, -64, -64, 64, 64, 64, 64, -64, -64, 64, -64, -64, 64, -64, -64, 64, -64, -64, -64, -64, -64, 64, 64, 64, 64, -64, -64, 64, 64, -64, 64, 64, -64, -64, -64, -64, -64, -64, -64, 64, -64, 64, -64, -64, -64, 64, -64, -64, -64, -64, 64, -64, -64, 64, 64, 64, 64, 64, -64, -64, -64, 64, 64, -64, -64, -64, 64, 64, -64, -64, -64, 64, 64, -64, -64, 64, 64, 64, -64, -64, -64, 64, -64, -64, -64, 64, 64, 64, -64, 64, -64, -64, -64, -64, -64, 64, -64, -64, 64, -64, -64, -64, 64, -64, 64, -64, 64, -64, -64, 64, -64, 64, 64, 64, 64, 64, -64, 64, 64, -64, -64, 64, -64, -64, -64, 64, 64, 64, -64, -64, -64, -64, 64, 64, -64, 64, -64, -64, 64, -64, 64, 64, -64, 64, -64, -64, 64, 64, 64, -64, -64, -64, 64, -64, 64, -64, -64, -64, -64, -64, 64, 64, 64, -64, -64, 64, -64, 64, 64, 64, 64, -64, -64, -64, -64, -64, -64, -64, -64, -64, -64, -64, -64, 64, -64, 64, -64, 64, -64, -64, -64, -64, -64, -64, -64, 64, -64, 64, 64, 64, 64, -64, 64, 64, -64, 64, 64, 64, 64, -64, 64, 64, -64, -64, 64, 64, -64, 64, 64, -64, -64, -64, -64, -64, 64, -64, 64, -64, 64, 64, 64, 64, -64, 64, -64, -64, -64, 64, 64, 64, -64, -64, 64, 64, -64, -64, 64, -64, 64, -64, -64, 64, 64, -64, 64, -64, 64, 64, 64, 64, 64, 64, -64, -64, 64, -64, -64, -64, -64, -64, 64, -64, -64, -64, 64, 64, -64, -64, -64, 64, 64, -64, 64, 64, 64, 64, 64, -64, -64, -64, -64, -64, -64, -64, -64, -64, 64, -64, -64, -64, -64, -64, -64, -64, -64, -64, -64, -64, 64, 64, 64, 64, -64, 64, 64, -64, -64, 64, -64, -64, -64, -64, 64, 64, -64, -64, -64, 64, 64, -64, -64, 64, -64, -64, 64, 64, 64, -64, -64, -64, 64, -64, -64, -64, -64, 64, 64, 64, 64, -64, 64, 64, 64, 64, -64, 64, 64, 64, -64, 64, 64, 64, -64, -64, -64, 64, 64, 64, 64, -64, 64, 64, 64, 64, -64, -64, 64, 64, 64, -64, -64, 64, 64, -64, -64, 64, 64, 64, 64, -64, 64, -64, 64, 64, -64, 64, -64, -64, 64, -64, -64, 64, -64, 64, 64, -64, 64, 64, 64, -64, 64, 64, -64, 64, -64, -64, 64, 64, 64, -64, -64, -64, -64, -64, -64, 64, -64, 64, -64, 64, 64, -64, -64, -64, -64, -64, 64, 64, 64, -64, -64, -64, -64, 64, 64, 64, -64, -64, 64, -64, 64, -64, 64, 64, -64, -64, 64, 64, -64, 64, -64, -64, 64, -64, 64, -64, -64, 64, -64, -64, -64, 64, 64, 64, -64, 64, -64, -64, -64, 64, -64, -64, -64, 64, 64, -64, 64, -64, 64, -64, -64, 64, 64, -64, -64, 64, 64, 64, 64, -64, -64, 64, 64, -64, 64, 64, 64, 64, 64, -64, -64, 64, 64, 64, 64, -64, -64, -64, 64, -64, -64, -64, -64, -64, 64, 64, 64, -64, 64, -64, -64, 64, -64, 64, -64, -64, -64, 64, -64, 64, 64, 64, -64, -64, -64, 64, -64, -64, -64, 64, -64, 64, -64, -64, -64, -64, 64, -64, -64, -64, 64, 64, 64, 64, -64, -64, 64, 64, 64, 64, 64, -64, -64, 64, -64, 64, 64, -64, 64, -64, 64, 64, -64, -64, -64, 64, 64, -64, -64, 64, 64, 64, 64, 64, 64, 64, -64, 64, 64, -64, -64, 64, -64, 64, 64, -64, 64, -64, 64, 64, -64, -64, -64, -64, 64, 64, 64, -64, -64, 64, 64, 64, 64, 64, -64, -64, 64, 64, -64, -64, -64, 64, -64, 64, 64, -64, -64, 64, 64, 64, -64, -64, -64, -64, 64, 64, 64, 64, 64, 64, 64, 64, 64, -64, 64, -64, -64, -64, -64, -64, 64, 64, 64, 64, -64, 64, 64, 64, -64, -64, -64, -64, -64, -64, 64, 64, 64, 64, 64, 64, 64, 64, 64, 64, 64, -64, 64, 64, -64, -64, 64, 64, 64, 64, 64, 64, -64, -64, 64, 64, -64, 64, 64, 64, 64, -64, -64, 64, 64, 64, -64, -64, -64, -64, 64, 64, 64, 64, 64, 64, 64, 64, 64, 64, 64, 64, -64, 64, -64, -64, -64, 64, -64, -64, 64, 64, -64, 64, 64, 64, -64, 64, 64, 64, 64, 64, 64, 64, 64, 64, 64, 64, -64, -64, -64, -64, -64, 64, -64, 64, -64, -64, -64, 64, 64, 64, 64, 64, -64, 64, 64, 64, 64, 64, 64, 64, 64, 64, 64, -64, 64, 64, -64, -64, -64, 64, -64, 64, 64, 64, 64, 64, 64, 64, 64, 64, 64, -64, 64, 64, 64, 64, 64, 64, 64, 64, 64, 64, 64, 64, -64, 64, 64, -64, 64, 64, 64, 64, 64, 64, 64, 64, 64, -64, 64, 64, 64, 64, 64, 64, 64, 64, 64, 64, 64, 64, 64, 64, -64, -64, -64, -64, -64, 64, 64, 64, 64, 64, 64, 64, 64, 64, -64, 64, 64, 64, 64, 64, 64, 64, 64, 64, 64, 64, 64, -64, -64, -64, 64, 64, -64, -64, 64, 64, 64, -64, -64, 64, 64, 64, 64, 64, 64, 64, -64, 64, 64, 64, 64, -64, 64, 64, -64, -64, -64, -64, 64, -64, 64, 64, 64, 64, 64, 64, 64, -64, 64, -64, -64, 64, 64, 64, 64, 64, 64, 64, 64, 64, 64, -64, -64, 64, -64, 64, 64, -64, -64, 64, 64, 64, 64, -64, -64, 64, 64, -64, -64, 64, 64, 64, 64, -64, 64, -64, -64, -64, -64, 64, -64, -64, 64, 64, 64, -64, 64, -64, 64, 64, 64, 64, -64, 64, 64, -64, 64, 64, -64, 64, 64, 64, 64, 64, 64, -64, -64, -64, -64, -64, -64, -64, 64, -64, 64, 64, -64, -64, -64, 64, 64, 64, 64, 64, -64, 64, 64, 64, 64, 64, 64, 64, -64, -64, -64, -64, -64, -64, -64, -64, -64, -64, -64, 64, -64, 64, -64, 64, 64, 64, 64, 64, -64, 64, -64, 64, -64, 64, 64, -64, 64, -64, -64, 64, -64, -64, -64, -64, 64, 64, -64, 64, 64, -64, -64, -64, 64, 64, 64, 64, 64, -64, 64, -64, 64, -64, 64, -64, -64, -64, 64, 64, -64, -64, -64, 64, -64, -64, 64, -64, 64, 64, -64, 64, 64, 64, 64, 64, 64, -64, -64, 64, 64, 64, -64, -64, -64, -64, -64, -64, -64, -64, 64, -64, 64, -64, -64, 64, -64, 64, 64, 64, -64, 64, -64, -64, -64, -64, 64, 64, 64, 64, -64, -64, 64, -64, 64, 64, 64, 64, -64, 64, -64, -64, -64, -64, 64, 64, -64, 64, -64, 64, 64, 64, -64, -64, 64, 64, 64, 64, -64, 64, 64, 64, 64, 64, -64, -64, -64, -64, 64, -64, 64, -64, 64, 64, 64, -64, 64, -64, 64, -64, -64, -64, 64, 64, 64, -64, -64, 64, 64, -64, -64, -64, -64, -64, -64, 64, 64, -64, 64, 64, -64, 64, 64, -64, 64, -64, 64, 64, -64, 64, -64, -64, 64, -64, 64, 64, -64, -64, 64, -64, -64, 64, 64, -64, -64, 64, 64, 64, -64, -64, -64, 64, 64, -64, -64, -64, 64, 64, -64, 64, -64, -64, -64, 64, 64, 64, 64, 64, -64, 64, 64, 64, 64, 64, -64, 64, -64, 64, 64, 64, -64, -64, -64, 64, 64, 64, 64, -64, -64, 64, -64, 64, -64, 64, 64, -64, 64, -64, -64, 64, 64, -64, 64, 64, 64, -64, 64, 64, -64, -64, -64, -64, 64, 64, 64, -64, 64, 64, -64, 64, 64, 64, -64, -64, 64, 64, 64, 64, -64, 64, 64, -64, 64, -64, -64, 64, -64, -64, 64, -64, 64, 64, 64, 64, -64, 64, -64, 64, 64, 64, 64, 64, -64, 64, -64, 64, -64, -64, 64, 64, 64, 64, -64, 64, 64, -64, -64, 64, -64, -64, 64, -64, -64, -64, 64, -64, 64, 64, 64, -64, -64, -64, 64, 64, -64, 64, -64, 64, 64, -64, 64, 64, 64, -64, -64, -64, 64, 64, -64, -64, -64, -64, -64, -64, -64, -64, -64, -64, 64, 64, 64, 64, -64, 64, 64, -64, -64, 64, -64, -64, -64, 64, 64, 64, -64, -64, -64, -64, -64, -64, -64, -64, -64, -64, -64, -64, -64, -64, -64, 64, 64, 64, -64, -64, -64, 64, 64, -64, -64, 64, 64, -64, -64, -64, -64, -64, -64, -64, -64, -64, -64, -64, -64, 64, -64, 64, -64, 64, 64, -64, 64, 64, 64, 64, 64, 64, 64, 64, -64, 64, -64, -64, -64, -64, -64, -64, -64, -64, -64, -64, -64, -64, -64, -64, -64, -64, 64, 64, 64, -64, 64, -64, 64, 64, -64, -64, 64, 64, 64, 64, -64, -64, -64, -64, -64, -64, 64, 64, 64, -64, 64, 64, 64, -64, 64, 64, 64, -64, 64, -64, 64, 64, -64, -64, 64, -64, -64, -64, -64, -64, -64, 64, 64, 64, 64, -64, 64, 64, -64, 64, 64, 64, 64, 64, -64, -64, -64, -64, 64, -64, -64, -64, -64, -64, -64, -64, -64, 64, 64, -64, 64, 64, -64, 64, 64, -64, 64, 64, 64, -64, -64, 64, 64, -64, 64, -64, 64, 64, -64, -64, -64, -64, -64, -64, -64, 64, -64, 64, 64, -64, -64, 64, 64, 64, 64, 64, 64, -64, 64, -64, 64, 64, 64, -64, 64, -64, -64, -64, -64, -64, -64, -64, -64, -64, -64, -64, -64, -64, -64, 64, -64, -64, 64, -64, 64, -64, 64, 64, 64, -64, 64, 64, 64, 64, -64, 64, -64, -64, -64, -64, -64, 64, 64, 64, 64, -64, 64, -64, -64, -64, -64, -64, 64, 64, -64, -64, -64, 64, 64, 64, 64, -64, -64, 64, -64, -64, -64, -64, -64, -64, -64, -64, 64, 64, 64, -64, -64, 64, 64, -64, -64, -64, 64, -64, -64, -64, -64, -64, -64, -64, -64, -64, -64, -64, -64, -64, -64, 64, -64, -64, -64, -64, 64, -64, -64, 64, -64, -64, -64, -64, -64, 64, -64, 64, 64, -64, -64, -64, -64, -64, -64, -64, -64, -64, -64, 64, -64, -64, -64, -64, 64, 64, 64, 64, -64, -64, -64, -64, -64, -64, 64, -64, -64, -64, -64, 64, -64, -64, -64, 64, -64, 64, -64, -64, 64, -64, 64, -64, -64, -64, 64, -64, -64, -64, -64, -64, 64, -64, -64, -64, -64, -64, -64, -64, -64, 64, -64, 64, -64, -64, 64, 64, 64, 64, 64, -64, 64, -64, -64, -64, -64, -64, -64, 64, -64, 64, 64, -64, -64, -64, -64, -64, -64, -64, -64, 64, -64, -64, 64, 64, -64, -64, 64, -64, -64, -64, -64, -64, 64, -64, -64, 64, -64, -64, 64, 64, -64, -64, -64, -64, -64, -64, 64, -64, -64, 64, 64, -64, 64, 64, -64, -64, -64, -64, -64, -64, -64, -64, 64, -64, -64, 64, 64, -64, 64, -64, -64, 64, -64, 64, 64, -64, -64, -64, -64, 64, 64, -64, -64, -64, -64, -64, -64, -64, -64, -64, 64, -64, -64, 64, -64, 64, -64, -64, -64, 64, -64, -64, -64, -64, -64, -64, -64, -64, -64, 64, -64, -64, -64, -64, -64, -64, -64, -64, 64, 64, 64, 64, -64, 64, -64, -64, -64, -64, 64, 64, 64, 64, -64, 64, -64, 64, -64, 64, 64, -64, 64, -64, -64, -64, -64, 64, -64, 64, -64, -64, -64, 64, 64, 64, 64, -64, 64, -64, 64, -64, -64, -64, -64, 64, 64, -64, -64, -64, -64, -64, -64, -64, 64, -64, -64, -64, 64, 64, -64, 64, 64, 64, 64, 64, -64, -64, -64, -64, -64, -64, 64, 64, 64, 64, 64, 64, -64, -64, -64, -64, -64, 64, -64, 64, -64, -64, 64, 64, 64, 64, -64, 64, -64, -64, 64, -64, 64, 64, 64, 64, -64, 64, -64, 64, -64, 64, 64, 64, 64, 64, 64, 64, -64, -64, 64, 64, -64, -64, 64, 64, -64, 64, 64, -64, -64, 64, 64, 64, 64, 64, 64, 64, -64, -64, -64, -64, 64, 64, -64, 64, -64, 64, 64, -64, 64, 64, -64, 64, -64, 64, 64, -64, -64, 64, 64, -64, 64, 64, -64, -64, -64, -64, 64, 64, -64, -64, 64, 64, -64, 64, -64, -64, 64, 64, -64, 64, 64, -64, -64, -64, -64, -64, -64, 64, 64, -64, -64, -64, 64, 64, -64, -64, 64, 64, 64, 64, -64, 64, -64, 64, -64, 64, 64, 64, 64, 64, -64, 64, 64, 64, -64, -64, 64, -64, -64, -64, -64, 64, 64, 64, 64, 64, 64, 64, 64, -64, 64, 64, -64, -64, -64, -64, -64, -64, 64, -64, 64, -64, -64, 64, 64, -64, -64, 64, 64, -64, 64, 64, -64, 64, -64, -64, 64, 64, -64, 64, -64, 64, -64, -64, -64, 64, 64, -64, -64, -64, -64, 64, -64, 64, -64, 64, -64, -64, -64, -64, -64, 64, -64, 64, -64, 64, 64, 64, 64, 64, -64, 64, -64, -64, -64, -64, 64, -64, 64, -64, -64, -64, 64, 64, 64, 64, -64, 64, 64, -64, -64, 64, 64, 64, 64, 64, -64, 64, -64, -64, 64, 64, -64, -64, 64, -64, -64, -64, 64, -64, 64, 64, -64, 64, 64, 64, -64, -64, -64, -64, 64, 64, 64, -64, 64, -64, 64, -64, -64, -64, -64, -64, -64, -64, 64, 64, -64, 64, 64, -64, -64, 64, -64, -64, 64, -64, -64, 64, 64, 64, -64, -64, -64, -64, -64, -64, -64, -64, -64, -64, -64, -64, -64, 64, 64, -64, 64, -64, -64, 64, 64, 64, 64, -64, 64, -64, -64, -64, -64, 64, -64, -64, -64, -64, -64, -64, -64, 64, -64, 64, -64, -64, 64, -64, -64, -64, -64, -64, -64, 64, 64, 64, 64, -64, 64, 64, -64, -64, -64, -64, -64, -64, -64, -64, 64, 64, 64, -64, 64, 64, -64, 64, 64, -64, -64, -64, -64, 64, 64, 64, 64, 64, -64, 64, 64, -64, 64, -64, -64, -64, -64, 64, 64, -64, 64, -64, 64, -64, -64, -64, -64, -64, -64, -64, -64, -64, 64, 64, 64, -64, 64, -64, 64, -64, -64, -64, -64, -64, -64, -64, 64, -64, -64, 64, -64, -64, -64, -64, -64, -64, -64, -64, 64, -64, -64, -64, -64, -64, -64, 64, 64, -64, -64, -64, -64, 64, 64, -64, -64, 64, 64, -64, -64, -64, -64, -64, 64, -64, 64, -64, -64, 64, 64, 64, 64, 64, 64, 64, -64, 64, 64, -64, -64, 64, 64, 64, -64, -64, -64, -64, -64, -64, -64, -64, -64, 64, -64, -64, -64, 64, 64, 64, 64, -64, -64, 64, -64, 64, -64, -64, -64, 64, 64, -64, -64, -64, -64, -64, -64, -64, -64, -64, -64, -64, -64, -64, 64, 64, 64, 64, -64, -64, -64, -64, -64, 64, -64, 64, 64, 64, -64, -64, -64, -64, 64, -64, -64, -64, -64, -64, -64, -64, -64, -64, -64, 64, 64, -64, -64, -64, 64, -64, 64, -64, 64, -64, 64, 64, -64, -64, 64, 64, -64, 64, -64, -64, -64, -64, -64, -64, 64, 64, 64, 64, 64, -64, -64, 64, -64, 64, 64, -64, 64, 64, 64, 64, -64, -64, -64, 64, -64, -64, -64, -64, -64, -64, -64, -64, -64, 64, -64, 64, 64, 64, 64, -64, 64, -64, 64, 64, -64, -64, 64, 64, 64, 64, 64, -64, -64, -64, -64, -64, -64, -64, 64, 64, -64, -64, 64, 64, -64, 64, -64, -64, -64, -64, 64, 64, -64, 64, 64, 64, 64, 64, -64, -64, -64, 64, -64, 64, -64, 64, -64, 64, -64, -64, -64, 64, -64, -64, -64, -64, -64, 64, 64, 64, 64, -64, 64, 64, 64, -64, 64, -64, -64, 64, -64, -64, 64, -64, -64, -64, -64, -64, 64, 64, -64, 64, -64, 64, -64, -64, -64, 64, -64, -64, -64, 64, 64, 64, -64, -64, 64, -64, 64, -64, -64, -64, -64, -64, -64, -64, -64, 64, -64, -64, -64, -64, -64, -64, -64, 64, -64, -64, -64, 64, 64, 64, 64, -64, 64, 64, -64, -64, -64, -64, -64, -64, -64, -64, -64, -64, -64, -64, -64, -64, 64, -64, -64, 64, 64, -64, 64, -64, 64, 64, 64, -64, -64, -64, -64, -64, -64, -64, -64, -64, -64, 64, -64, -64, -64, -64, 64, 64, -64, -64, -64, 64, 64, -64, -64, 64, -64, 64, 64, -64, -64, 64, 64, 64, 64, -64, -64, -64, -64, -64, 64, -64, -64, -64, -64, 64, 64, -64, 64, 64, -64, -64, 64, 64, 64, -64, -64, -64, -64, 64, 64, -64, -64, -64, 64, -64, -64, -64, 64, -64, 64, 64, -64, -64, -64, -64, -64, 64, 64, -64, -64, 64, -64, -64, 64, -64, 64, -64, 64, 64, -64, 64, 64, -64, -64, -64, 64, -64, 64, 64, 64, -64, -64, -64, -64, 64, -64, 64, 64, -64, -64, 64, -64, 64, -64, -64, -64, 64, -64, 64, -64, 64, -64, 64, -64, 64, -64, -64, 64, 64, 64, -64, -64, -64, 64, -64, 64, 64, 64, 64, 64, 64, 64, -64, -64, -64, 64, 64, -64, 64, -64, 64, -64, -64, 64, -64, -64, 64, 64, -64, 64, 64, -64, 64, 64, -64, -64, -64, -64, -64, -64, -64, -64, -64, -64, 64, -64, -64, -64, 64, -64, 64, -64, 64, 64, -64, 64, 64, -64, -64, -64, -64, 64, -64, -64, -64, -64, -64, -64, 64, -64, 64, -64, 64, -64, -64, -64, -64, -64, 64, -64, -64, -64, 64, 64, 64, 64, 64, -64, 64, 64, -64, -64, -64, -64, -64, -64, -64, -64, -64, -64, -64, -64, -64, -64, -64, -64, -64, -64, -64, 64, -64, -64, -64, -64, -64, -64, -64, 64, -64, -64, -64, 64, -64, -64, -64, -64, -64, 64, 64, -64, -64, -64, -64, -64, -64, -64, -64, -64, -64, -64, -64, -64, -64, 64, 64, -64, 64, -64, -64, -64, -64, -64, -64, -64, 64, 64, 64, 64, 64, 64, 64, -64, -64, -64, -64, -64, 64, -64, -64, -64, -64, -64, -64, 64, 64, -64, -64, 64, -64, -64, -64, 64, -64, 64, 64, 64, 64, 64, -64, -64, -64, -64, -64, 64, -64, 64, 64, 64, 64, 64, 64, 64, 64, 64, 64, -64, -64, -64, 64, -64, -64, -64, -64, 64, 64, 64, -64, 64, -64, 64, 64, 64, 64, 64, 64, -64, 64, 64, 64, 64, 64, -64, 64, 64, 64, 64, -64, 64, 64, 64, -64, -64, 64, 64, -64, 64, 64, -64, -64, 64, 64, -64, 64, 64, -64, 64, 64, 64, 64, 64, 64, 64, -64, 64, -64, -64, 64, -64, -64, 64, 64, 64, 64, 64, 64, 64, -64, -64, -64, -64, -64, -64, 64, 64, 64, 64, 64, 64, 64, -64, -64, -64, -64, -64, -64, 64, -64, 64, -64, 64, 64, 64, 64, 64, 64, -64, -64, -64, 64, 64, -64, 64, -64, 64, -64, 64, -64, -64, 64, -64, -64, -64, 64, 64, -64, -64, -64, 64, 64, 64, 64, -64, 64, 64, -64, -64, -64, -64, -64, 64, -64, 64, -64, -64, -64, 64, -64, -64, -64, -64, 64, -64, 64, -64, 64, 64, -64, 64, 64, -64, 64, -64, -64, -64, -64, 64, 64, 64, -64, 64, 64, 64, -64, -64, -64, -64, -64, -64, -64, 64, -64, 64, -64, -64, 64, 64, -64, -64, 64, -64, -64, -64, -64, -64, -64, 64, 64, 64, -64, -64, -64, 64, -64, -64, -64, -64, -64, -64, -64, 64, 64, -64, -64, -64, -64, -64, 64, -64, -64, 64, 64, -64, -64, -64, 64, 64, -64, -64, -64, 64, 64, -64, -64, -64, -64, -64, -64, 64, 64, -64, -64, -64, 64, -64, 64, -64, -64, -64, -64, 64, -64, -64, -64, 64, 64, 64, 64, 64, -64, 64, -64, -64, -64, -64, -64, -64, 64, -64, -64, -64, 64, 64, 64, 64, 64, -64, 64, -64, 64, -64, -64, 64, -64, 64, 64, 64, 64, 64, -64, -64, -64, -64, -64, -64, -64, -64, -64, -64, -64, 64, 64, -64, -64, 64, 64, -64, 64, -64, -64, -64, -64, 64, -64, 64, 64, -64, 64, -64, -64, 64, -64, -64, -64, -64, -64, -64, -64, -64, -64, -64, 64, 64, -64, -64, -64, -64, -64, -64, -64, -64, -64, -64, -64, -64, 64, -64, -64, -64, -64, 64, -64, -64, -64, -64, -64, -64, 64, 64, -64, 64, -64, -64, -64, -64, -64, -64, -64, -64, -64, -64, -64, -64, -64, -64, -64, 64, 64, -64, -64, -64, -64, -64, -64, 64, 64, 64, -64, -64, 64, 64, -64, -64, -64, -64, -64, -64, -64, 64, -64, -64, -64, 64, 64, 64, -64, -64, -64, -64, -64, -64, 64, 64, 64, -64, 64, -64, 64, 64, -64, -64, -64, -64, -64, -64, -64, -64, 64, 64, 64, -64, 64, 64, -64, -64, -64, -64, -64, -64, -64, -64, -64, 64, -64, -64, -64, -64, -64, -64, -64, -64, 64, 64, 64, 64, 64, 64, 64, 64, -64, 64, -64, -64, -64, -64, -64, -64, 64, 64, 64, 64, 64, 64, -64, -64, 64, -64, 64, 64, -64, 64, -64, -64, 64, 64, -64, 64, 64, -64, 64, -64, -64, 64, 64, -64, 64, 64, 64, 64, 64, -64, -64, -64, 64, 64, -64, 64, 64, -64, 64, 64, 64, -64, 64, 64, 64, 64, -64, -64, 64, -64, 64, 64, 64, -64, -64, 64, -64, 64, 64, -64, -64, -64, -64, -64, 64, -64, 64, 64, 64, 64, -64, -64, 64, -64, 64, 64, 64, 64, 64, 64, -64, -64, -64, 64, -64, -64, 64, 64, -64, 64, 64, -64, 64, 64, 64, 64, 64, 64, 64, -64, 64, 64, 64, -64, 64, -64, -64, 64, -64, -64, -64, -64, -64, 64, 64, -64, 64, -64, -64, 64, -64, -64, -64, -64, -64, -64, 64, -64, -64, 64, -64, -64, 64, -64, -64, 64, 64, 64, 64, -64, 64, -64, 64, -64, -64, -64, 64, -64, -64, -64, -64, 64, -64, -64, -64, -64, -64, -64, 64, -64, -64, 64, 64, -64, 64, -64, 64, -64, -64, 64, 64, 64, 64, 64, 64, -64, -64, 64, -64, -64, -64, -64, -64, -64, -64, -64, 64, -64, -64, 64, 64, -64, -64, -64, 64, 64, 64, -64, -64, -64, -64, -64, 64, -64, 64, 64, 64, -64, -64, -64, -64, -64, -64, -64, -64, -64, -64, -64, 64, -64, 64, -64, -64, -64, -64, -64, 64, -64, -64, -64, -64, 64, 64, 64, 64, 64, -64, -64, -64, -64, -64, -64, -64, -64, -64, -64, -64, -64, -64, -64, -64, -64, -64, -64, 64, 64, -64, -64, 64, 64, 64, 64, 64, -64, 64, -64, -64, 64, -64, -64, -64, -64, -64, -64, -64, -64, -64, -64, 64, -64, -64, -64, -64, 64, 64, -64, 64, 64, 64, 64, -64, 64, 64, 64, 64, -64, -64, 64, -64, -64, -64, -64, -64, -64, -64, 64, -64, 64, 64, -64, -64, 64, 64, -64, 64, -64, -64, -64, 64, 64, 64, 64, 64, 64, 64, 64, 64, -64, -64, -64, -64, -64, -64, -64, -64, -64, -64, 64, 64, 64, 64, 64, 64, 64, 64, -64, 64, 64, 64, 64, 64, 64, 64, 64, -64, 64, -64, -64, -64, -64, 64, -64, -64, 64, 64, -64, 64, 64, 64, -64, 64, 64, -64, 64, 64, 64, -64, 64, 64, 64, 64, 64, -64, -64, -64, -64, -64, -64, -64, -64, 64, -64, 64, 64, 64, 64, 64, 64, 64, 64, -64, 64, -64, 64, -64, -64, -64, -64, -64, 64, -64, -64, -64, -64, -64, -64, 64, -64, -64, -64, 64, -64, -64, 64, 64, -64, 64, -64, -64, -64, -64, -64, -64, -64, -64, 64, 64, -64, -64, -64, -64, -64, -64, -64, -64, 64, 64, -64, 64, -64, 64, -64, 64, 64, -64, -64, -64, -64, -64, -64, -64, -64, -64, -64, -64, -64, -64, -64, -64, -64, -64, -64, -64, 64, 64, 64, 64, 64, -64, -64, -64, 64, -64, -64, -64, -64, -64, -64, -64, -64, -64, 64, 64, 64, 64, -64, 64, 64, 64, 64, 64, 64, 64, 64, 64, 64, -64, -64, 64, -64, -64, -64, -64, -64, -64, -64, 64, -64, 64, 64, -64, -64, -64, 64, 64, 64, 64, 64, 64, 64, 64, -64, 64, -64, 64, 64, -64, -64, -64, -64, 64, -64, 64, 64, -64, 64, 64, 64, 64, 64, -64, -64, 64, 64, 64, 64, 64, 64, 64, 64, 64, 64, 64, -64, 64, -64, -64, -64, -64, 64, 64, -64, 64, -64, 64, -64, 64, 64, -64, 64, 64, 64, 64, 64, 64, 64, -64, 64, 64, 64, -64, -64, -64, -64, 64, 64, 64, -64, 64, -64, -64, -64, -64, -64, 64, 64, 64, 64, 64, 64, -64, -64, 64, 64, 64, -64, 64, 64, -64, 64, -64, -64, 64, 64, -64, -64, -64, -64, 64, -64, -64, -64, 64, 64, -64, -64, -64, 64, -64, 64, -64, 64, -64, -64, 64, -64, 64, -64, -64, -64, 64, 64, -64, -64, -64, -64, -64, -64, 64, -64, -64, -64, 64, -64, -64, -64, -64, -64, -64, 64, -64, 64, 64, -64, 64, 64, -64, 64, 64, 64, 64, -64, -64, -64, -64, -64, -64, -64, -64, -64, 64, -64, 64, -64, -64, -64, -64, -64, -64, 64, -64, 64, 64, 64, -64, 64, 64, 64, 64, -64, -64, -64, -64, -64, -64, -64, -64, 64, -64, -64, -64, 64, -64, -64, -64, -64, -64, -64, 64, 64, 64, -64, 64, 64, 64, -64, 64, 64, -64, -64, -64, 64, -64, -64, -64, -64, -64, -64, -64, 64, -64, 64, -64, -64, -64, 64, 64, -64, 64, 64, -64, 64, -64, -64, 64, 64, 64, 64, 64, 64, -64, -64, -64, -64, 64, 64, -64, -64, -64, -64, 64, -64, -64, -64, -64, 64, -64, -64, -64, 64, 64, -64, -64, -64, -64, -64, -64, -64, 64, -64, -64, -64, 64, 64, -64, -64, -64, -64, -64, -64, -64, 64, -64, 64, -64, 64, 64, -64, 64, -64, 64, -64, 64, -64, -64, 64, -64, -64, 64, 64, 64, 64, 64, -64, -64, -64, -64, -64, 64, 64, -64, -64, -64, -64, -64, 64, -64, 64, 64, -64, -64, 64, -64, -64, 64, -64, 64, -64, -64, 64, -64, 64, -64, -64, -64, 64, 64, -64, 64, -64, -64, 64, -64, 64, -64, 64, 64, -64, 64, -64, -64, 64, -64, 64, -64, -64, 64, -64, 64, -64, 64, -64, 64, 64, -64, -64, -64, -64, -64, -64, 64, 64, 64, -64, 64, 64, -64, -64, -64, 64, -64, -64, 64, -64, 64, -64, -64, -64, 64, -64, 64, -64, -64, -64, 64, 64, -64, 64, 64, -64, -64, 64, -64, 64, -64, 64, 64, 64, 64, -64, -64, -64, -64, 64, 64, -64, -64, 64, 64, -64, 64, 64, 64, 64, 64, 64, -64, -64, 64, -64, -64, -64, 64, 64, 64, -64, -64, -64, -64, -64, -64, 64, 64, 64, 64, 64, 64, -64, 64, 64, 64, -64, 64, 64, 64, 64, -64, 64, -64, -64, -64, -64, -64, 64, -64, -64, -64, 64, 64, 64, 64, 64, 64, 64, 64, 64, 64, -64, -64, -64, 64, -64, -64, -64, 64, 64, -64, -64, 64, 64, -64, 64, 64, 64, -64, -64, 64, 64, 64, 64, 64, 64, 64, 64, 64, 64, 64, -64, 64, -64, -64, -64, -64, -64, 64, 64, 64, -64, -64, 64, -64, -64, -64, -64, -64, -64, -64, 64, 64, 64, 64, 64, 64, 64, 64, -64, -64, 64, 64, -64, -64, -64, 64, 64, -64, -64, 64, -64, -64, -64, -64, -64, -64, -64, -64, 64, 64, 64, 64, 64, 64, 64, -64, -64, 64, -64, 64, -64, -64, -64, -64, -64, -64, -64, 64, 64, 64, -64, -64, -64, -64, -64, 64, 64, -64, 64, 64, 64, 64, 64, 64, -64, 64, 64, 64, -64, -64, -64, -64, 64, -64, 64, 64, 64, 64, 64, -64, -64, -64, -64, 64, 64, 64, 64, -64, 64, 64, 64, -64, -64, 64, -64, -64, 64, -64, -64, -64, 64, -64, -64, 64, 64, 64, 64, -64, -64, -64, -64, -64, -64, 64, 64, 64, 64, 64, -64, 64, -64, -64, 64, 64, -64, 64, -64, 64, 64, 64, 64, 64, 64, 64, 64, -64, -64, -64, -64, -64, -64, -64, 64, 64, 64, 64, -64, 64, -64, -64, -64, -64, 64, 64, -64, 64, 64, 64, -64, -64, 64, 64, 64, -64, -64, -64, -64, 64, 64, 64, 64, 64, 64, 64, 64, 64, -64, 64, -64, -64, -64, 64, 64, 64, -64, -64, -64, -64, -64, -64, -64, -64, -64, -64, -64, -64, -64, 64, 64, 64, 64, 64, 64, 64, -64, -64, -64, 64, 64, 64, 64, 64, -64, -64, -64, -64, -64, -64, -64, -64, -64, 64, -64, -64, 64, -64, 64, 64, 64, 64, 64, -64, 64, -64, -64, 64, 64, 64, 64, 64, 64, -64, -64, -64, -64, 64, -64, -64, -64, -64, 64, -64, 64, -64, -64, -64, 64, 64, 64, -64, -64, 64, 64, 64, 64, 64, 64, 64, 64, 64, -64, 64, -64, -64, -64, -64, -64, 64, 64, 64, 64, 64, 64, -64, 64, -64, 64, -64, 64, -64, 64, 64, -64, 64, 64, 64, 64, 64, 64, 64, 64, 64, 64, 64, 64, 64, -64, 64, -64, 64, -64, -64, -64, 64, 64, -64, 64, 64, 64, -64, -64, 64, 64, 64, 64, 64, 64, 64, 64, 64, 64, 64, -64, -64, -64, -64, -64, -64, -64, -64, -64, 64, 64, -64, -64, 64, 64, -64, -64, -64, 64, 64, 64, 64, 64, 64, 64, 64, 64, 64, -64, 64, -64, -64, -64, -64, -64, -64, -64, 64, 64, -64, 64, 64, 64, -64, -64, -64, 64, 64, 64, 64, 64, 64, 64, 64, 64, -64, 64, -64, -64, -64, -64, -64, -64, 64, 64, 64, -64, 64, -64, -64, 64, -64, -64, -64, -64, -64, 64, 64, 64, -64, -64, -64, -64, -64, 64, 64, -64, -64, -64, -64, -64, -64, 64, 64, 64, -64, 64, -64, 64, -64, -64, -64, -64, -64, -64, 64, 64, 64, -64, 64, -64, 64, 64, 64, -64, -64, 64, -64, -64, -64, 64, 64, 64, -64, 64, -64, -64, -64, -64, -64, -64, -64, -64, 64, 64, -64, 64, 64, 64, 64, -64, -64, -64, -64, -64, -64, 64, -64, 64, 64, 64, -64, -64, -64, -64, -64, -64, -64, -64, -64, -64, -64, 64, -64, 64, 64, 64, 64, 64, -64, -64, -64, -64, -64, -64, -64, -64, 64, 64, 64, -64, 64, 64, 64, 64, -64, -64, -64, -64, -64, -64, -64, -64, -64, -64, 64, -64, -64, -64, -64, -64, -64, -64, -64, -64, -64, -64, -64, 64, -64, 64, 64, -64, 64, -64, -64, -64, -64, -64, -64, -64, -64, -64, -64, 64, -64, -64, -64, -64, -64, -64, -64, -64, 64, -64, 64, 64, -64, 64, 64, 64, 64, 64, -64, 64, -64, -64, 64, -64, 64, -64, -64, 64, 64, 64, -64, -64, -64, -64, -64, -64, 64, -64, 64, 64, -64, 64, 64, -64, 64, 64, 64, -64, 64, 64, -64, 64, -64, 64, -64, 64, 64, -64, 64, 64, -64, 64, -64, -64, 64, -64, -64, -64, 64, 64, -64, 64, -64, 64, -64, -64, -64, 64, 64, 64, -64, -64, 64, 64, -64, -64, -64, -64, -64, -64, -64, -64, -64, -64, -64, -64, -64, 64, -64, 64, 64, -64, -64, -64, 64, 64, 64, 64, 64, 64, 64, 64, 64, 64, -64, -64, -64, -64, -64, 64, 64, -64, 64, 64, 64, 64, 64, 64, -64, -64, 64, -64, -64, -64, 64, 64, 64, 64, 64, 64, 64, 64, 64, -64, -64, 64, 64, 64, -64, -64, 64, 64, 64, 64, -64, -64, 64, -64, -64, 64, 64, 64, 64, 64, 64, 64, 64, 64, 64, 64, 64, 64, 64, 64, 64, 64, 64, 64, 64, 64, 64, 64, -64, -64, -64, -64, 64, 64, 64, 64, 64, 64, 64, 64, 64, 64, 64, 64, 64, 64, -64, 64, 64, 64, -64, 64, 64, -64, 64, -64, 64, -64, 64, 64, -64, -64, 64, 64, 64, -64, 64, 64, 64, 64, 64, 64, 64, 64, -64, -64, -64, -64, -64, -64, 64, -64, 64, -64, 64, 64, 64, 64, -64, -64, -64, 64, -64, -64, 64, 64, 64, 64, 64, 64, 64, -64, -64, -64, -64, -64, -64, -64, -64, -64, 64, -64, 64, 64, 64, -64, -64, -64, 64, 64, 64, 64, 64, 64, 64, 64, 64, -64, 64, -64, -64, -64, -64, -64, -64, -64, -64, -64, 64, -64, -64, 64, 64, 64, 64, 64, 64, 64, 64, 64, 64, 64, 64, -64, 64, -64, -64, -64, -64, -64, -64, -64, -64, -64, -64, -64, -64, 64, 64, -64, 64, 64, 64, 64, -64, -64, 64, 64, 64, -64, -64, -64, -64, -64, -64, 64, -64, -64, -64, -64, -64, -64, -64, 64, -64, 64, -64, -64, 64, -64, -64, -64, -64, -64, 64, -64, -64, -64, 64, 64, 64, 64, 64, 64, -64, -64, -64, -64, -64, -64, 64, 64, -64, 64, -64, -64, -64, -64, -64, -64, -64, -64, -64, -64, -64, 64, 64, 64, 64, 64, 64, 64, -64, -64, -64, -64, -64, 64, 64, 64, -64, 64, 64, -64, -64, -64, -64, -64, -64, -64, -64, -64, -64, 64, -64, -64, -64, 64, 64, -64, -64, -64, -64, -64, -64, 64, 64, 64, 64, -64, 64, 64, -64, -64, -64, -64, -64, -64, -64, -64, 64, -64, 64, 64, 64, -64, 64, -64, 64, 64, 64, -64, -64, 64, 64, 64, -64, 64, -64, -64, 64, -64, 64, 64, -64, -64, -64, 64, 64, 64, 64, 64, 64, 64, -64, -64, 64, 64, 64, -64, -64, -64, -64, 64, -64, -64, -64, -64, 64, -64, 64, 64, -64, -64, 64, 64, 64, -64, -64, 64, 64, 64, 64, -64, 64, 64, 64, -64, -64, -64, 64, -64, 64, -64, 64, 64, 64, 64, 64, -64, -64, 64, 64, -64, -64, -64, -64, 64, 64, 64, 64, 64, -64, -64, 64, 64, -64, 64, 64, -64, 64, -64, 64, 64, 64, 64, -64, 64, 64, -64, 64, -64, -64, -64, 64, 64, 64, 64, -64, 64, 64, -64, -64, 64, -64, 64, -64, 64, -64, -64, 64, 64, 64, 64, 64, 64, -64, 64, -64, -64, -64, 64, 64, 64, 64, -64, 64, 64, 64, 64, 64, 64, -64, 64, 64, 64, -64, -64, 64, 64, 64, 64, 64, -64, 64, 64, -64, -64, -64, -64, 64, 64, -64, 64, 64, 64, 64, 64, 64, 64, -64, -64, 64, 64, 64, 64, 64, 64, 64, 64, 64, -64, -64, -64, 64, -64, -64, 64, 64, -64, 64, 64, 64, 64, 64, 64, 64, -64, 64, 64, -64, -64, -64, 64, 64, 64, 64, 64, -64, 64, -64, -64, -64, 64, 64, 64, -64, 64, 64, 64, 64, 64, 64, 64, 64, 64, -64, -64, 64, -64, -64, -64, 64, 64, 64, 64, 64, -64, -64, -64, 64, -64, -64, 64, -64, 64, 64, 64, 64, 64, 64, 64, 64, 64, -64, -64, -64, 64, -64, -64, 64, 64, -64, -64, 64, -64, -64, -64, -64, -64, -64, -64, -64, -64, 64, 64, 64, 64, 64, 64, 64, 64, 64, -64, 64, -64, 64, 64, 64, -64, -64, 64, 64, -64, -64, 64, 64, -64, -64, -64, -64, -64, -64, -64, 64, 64, 64, 64, -64, 64, 64, -64, 64, 64, -64, -64, -64, -64, 64, 64, -64, -64, 64, 64, 64, 64, 64, 64, 64, 64, -64, -64, -64, -64, -64, -64, 64, -64, 64, -64, 64, 64, -64, -64, -64, -64, -64, -64, 64, 64, 64, -64, 64, -64, 64, -64, -64, 64, -64, 64, 64, 64, 64, -64, -64, -64, 64, 64, 64, 64, 64, -64, -64, -64, 64, 64, -64, -64, 64, 64, -64, -64, -64, 64, 64, 64, -64, -64, -64, 64, 64, 64, 64, 64, -64, -64, -64, -64, 64, 64, -64, 64, 64, 64, -64, -64, -64, -64, -64, 64, 64, 64, 64, 64, -64, -64, 64, 64, -64, -64, -64, -64, 64, 64, 64, 64, -64, 64, -64, 64, -64, -64, -64, -64, 64, -64, -64, 64, -64, -64, -64, 64, 64, -64, 64, -64, 64, 64, 64, 64, 64, 64, 64, -64, -64, 64, 64, 64, 64, -64, -64, 64, -64, -64, 64, -64, 64, 64, 64, 64, 64, 64, 64, -64, 64, 64, 64, -64, -64, 64, 64, -64, -64, -64, 64, 64, 64, 64, 64, 64, -64, -64, -64, 64, 64, -64, -64, 64, -64, 64, -64, -64, 64, 64, 64, -64, -64, -64, 64, -64, 64, -64, 64, -64, 64, -64, 64, -64, -64, 64, -64, 64, -64, 64, 64, -64, 64, -64, -64, -64, -64, -64, -64, -64, -64, 64, -64, 64, -64, 64, -64, -64, 64, -64, 64, 64, 64, -64, 64, 64, 64, 64, 64, 64, -64, 64, 64, 64, 64, 64, -64, -64, 64, -64, -64, -64, 64, -64, -64, 64, -64, 64, 64, -64, 64, -64, 64, -64, 64, 64, 64, 64, 64, 64, 64, -64, 64, 64, 64, 64, -64, -64, 64, -64, -64, -64, -64, 64, 64, 64, 64, -64, -64, -64, -64, -64, -64, -64, -64, -64, 64, 64, 64, -64, 64, 64, 64, -64, -64, 64, -64, -64, -64, 64, 64, 64, 64, 64, 64, 64, 64, 64, 64, 64, 64, 64, 64, 64, 64, 64, 64, 64, 64, -64, 64, 64, 64, -64, -64, -64, -64, 64, -64, 64, -64, 64, 64, 64, -64, -64, 64, 64, -64, 64, 64, 64, 64, -64, -64, -64, -64, -64, -64, -64, 64, 64, -64, -64, 64, -64, -64, 64, 64, 64, 64, -64, -64, 64, 64, 64, 64, 64, 64, 64, 64, 64, 64, 64, 64, -64, -64, -64, 64, 64, 64, 64, -64, -64, 64, -64, 64, 64, 64, -64, -64, -64, -64, -64, -64, 64, 64, 64, -64, 64, -64, 64, 64, 64, 64, -64, 64, -64, 64, -64, -64, -64, -64, 64, -64, 64, 64, 64, -64, -64, 64, 64, 64, 64, 64, 64, 64, 64, 64, -64, 64, -64, -64, 64, 64, 64, 64, 64, -64, -64, 64, 64, 64, 64, 64, 64, 64, 64, 64, -64, 64, 64, 64, 64, 64, 64, 64, 64, 64, 64, -64, 64, 64, -64, -64, 64, 64, -64, 64, -64, -64, 64, 64, 64, 64, 64, -64, 64, 64, 64, 64, -64, -64, 64, 64, 64, -64, -64, -64, 64, -64, 64, -64, -64, 64, -64, -64, -64, -64, -64, 64, 64, -64, 64, 64, 64, 64, 64, -64, 64, 64, 64, 64, 64, 64, -64, -64, -64, -64, -64, 64, 64, -64, 64, 64, -64, -64, -64, -64, -64, 64, 64, 64, 64, 64, 64, -64, 64, 64, -64, 64, 64, -64, -64, -64, 64, 64, 64, -64, -64, 64, -64, -64, -64, 64, -64, -64, 64, -64, -64, 64, 64, -64, 64, 64, 64, 64, 64, 64, -64, 64, -64, -64, -64, -64, -64, -64, 64, -64, -64, 64, -64, 64, -64, 64, -64, -64, 64, 64, -64, -64, -64, -64, -64, 64, 64, 64, -64, 64, -64, 64, 64, -64, -64, 64, 64, 64, -64, 64, -64, -64, 64, -64, -64, 64, -64, 64, 64, -64, 64, 64, -64, 64, 64, -64, 64, -64, 64, 64, -64, -64, -64, 64, 64, -64, -64, -64, 64, 64, -64, -64, -64, 64, -64, -64, -64, 64, 64, 64, -64, 64, 64, 64, -64, -64, -64, 64, 64, -64, 64, -64, -64, 64, -64, 64, 64, 64, -64, 64, -64, 64, 64, 64, 64, -64, 64, 64, -64, 64, 64, 64, 64, 64, 64, 64, -64, -64, 64, 64, 64, -64, 64, 64, -64, 64, -64, -64, 64, 64, 64, 64, 64, 64, 64, 64, 64, 64, -64, -64, -64, 64, 64, -64, 64, 64, -64, 64, -64, 64, -64, -64, 64, -64, -64, 64, -64, 64, -64, 64, 64, 64, -64, 64, 64, -64, -64, 64, -64, -64, -64, 64, -64, 64, 64, 64, -64, 64, -64, -64, -64, -64, -64, -64, -64, 64, 64, 64, -64, -64, -64, -64, 64, 64, -64, 64, -64, 64, 64, -64, 64, -64, 64, 64, 64, -64, 64, 64, -64, -64, 64, -64, 64, -64, -64, 64, -64, -64, 64, 64, 64, -64, -64, -64, 64, 64, 64, -64, -64, 64, 64, 64, 64, 64, 64, 64, -64, 64, -64, 64, 64, -64, 64, -64, 64, 64, 64, -64, 64, -64, 64, -64, 64, -64, 64, 64, 64, -64, -64, 64, -64, 64, -64, -64, 64, 64, 64, 64, 64, -64, -64, -64, -64, -64, -64, -64, 64, 64, 64, 64, -64, 64, -64, 64, -64, -64, -64, 64, -64, -64, -64, -64, 64, 64, -64, 64, 64, 64, 64, 64, 64, -64, 64, -64, 64, -64, -64, -64, 64, 64, -64, -64, -64, -64, -64, 64, -64, -64, -64, -64, 64, 64, 64, 64, -64, 64, 64, 64, -64, -64, -64, 64, -64, -64, -64, 64, 64, 64, -64, 64, 64, 64, 64, -64, -64, -64, 64, 64, -64, -64, 64, -64, 64, -64, -64, -64, 64, 64, -64, 64, -64, 64, -64, 64, 64, 64, 64, -64, 64, 64, -64, 64, 64, 64, -64, 64, -64, -64, -64, -64, -64, -64, 64, 64, 64, 64, 64, 64, 64, 64, -64, -64, -64, 64, -64, 64, 64, 64, 64, -64, 64, 64, 64, 64, -64, 64, 64, -64, -64, 64, 64, 64, 64, -64, 64, 64, 64, -64, 64, 64, 64, 64, -64, -64, 64, -64, 64, 64, -64, -64, -64, -64, 64, -64, -64, -64, 64, -64, -64, 64, -64, 64, 64, -64, -64, -64, 64, 64, 64, 64, 64, 64, -64, -64, 64, -64, 64, -64, 64, 64, 64, 64, 64, 64, 64, -64, 64, 64, 64, -64, -64, -64, -64, -64, -64, 64, 64, 64, 64, -64, 64, -64, -64, -64, -64, 64, 64, -64, 64, -64, 64, -64, -64, 64, 64, 64, -64, -64, -64, -64, 64, -64, -64, -64, 64, 64, 64, 64, -64, -64, 64, -64, 64, 64, 64, 64, 64, 64, 64, 64, 64, -64, 64, -64, 64, -64, -64, 64, -64, 64, -64, -64, -64, 64, -64, -64, -64, 64, 64, 64, 64, 64, -64, -64, 64, 64, -64, 64, 64, -64, -64, 64, -64, -64, 64, -64, 64, 64, 64, -64, -64, 64, 64, 64, 64, 64, -64, -64, 64, -64, -64, 64, 64, 64, 64, 64, -64, -64, -64, -64, -64, 64, 64, 64, 64, 64, 64, -64, 64, 64, 64, 64, 64, 64, 64, -64, -64, 64, 64, -64, 64, 64, 64, 64, 64, 64, -64, -64, -64, -64, -64, 64, 64, -64, 64, -64, 64, -64, 64, 64, 64, 64, -64, 64, -64, -64, -64, 64, 64, -64, 64, 64, -64, -64, -64, -64, -64, -64, 64, 64, -64, -64, -64, -64, 64, 64, 64, 64, 64, 64, 64, 64, 64, -64, -64, 64, -64, 64, 64, 64, 64, 64, -64, 64, -64, 64, 64, 64, 64, -64, 64, 64, 64, 64, 64, 64, -64, -64, 64, -64, -64, 64, -64, 64, 64, -64, 64, 64, 64, 64, 64, 64, -64, 64, 64, -64, 64, -64, -64, 64, -64, 64, 64, 64, -64, -64, 64, 64, 64, -64, -64, 64, -64, 64, 64, 64, -64, 64, -64, -64, -64, 64, -64, 64, -64, -64, -64, -64, -64, 64, 64, 64, 64, 64, -64, 64, -64, -64, 64, -64, 64, 64, 64, 64, 64, -64, -64, -64, -64, 64, -64, -64, -64, -64, -64, -64, 64, 64, 64, 64, 64, -64, -64, 64, 64, 64, 64, -64, 64, 64, 64, 64, 64, 64, -64, -64, 64, 64, -64, 64, -64, -64, 64, 64, 64, 64, 64, 64, 64, -64, 64, -64, 64, 64, 64, 64, -64, 64, 64, 64, 64, 64, 64, -64, 64, 64, -64, -64, -64, 64, -64, 64, 64, 64, 64, 64, 64, 64, -64, -64, 64, 64, -64, -64, -64, 64, 64, 64, 64, 64, 64, 64, -64, 64, 64, -64, -64, -64, 64, 64, 64, 64, -64, 64, 64, 64, -64, 64, 64, -64, 64, -64, 64, 64, 64, 64, 64, 64, 64, 64, 64, 64, -64, -64, 64, -64, 64, 64, 64, 64, 64, -64, 64, -64, -64, -64, -64, 64, 64, -64, 64, 64, 64, 64, 64, 64, 64, 64, 64, -64, -64, -64, 64, -64, 64, 64, 64, 64, -64, 64, 64, 64, 64, 64, -64, 64, -64, -64, -64, -64, -64, 64, 64, 64, -64, 64, -64, -64, -64, -64, -64, 64, -64, -64, 64, 64, 64, -64, 64, -64, 64, 64, -64, 64, -64, -64, 64, 64, 64, -64, 64, 64, 64, 64, -64, 64, -64, -64, -64, 64, -64, 64, -64, 64, 64, -64, 64, 64, 64, -64, 64, -64, 64, -64, -64, 64, 64, -64, 64, -64, 64, 64, 64, -64, -64, -64, -64, 64, -64, -64, 64, -64, -64, 64, 64, -64, -64, 64, 64, 64, -64, 64, -64, 64, 64, 64, -64, -64, 64, 64, -64, 64, -64, -64, 64, 64, -64, -64, -64, 64, 64, -64, -64, -64, 64, 64, 64, 64, 64, -64, 64, -64, -64, 64, -64, -64, -64, 64, -64, 64, 64, -64, 64, 64, 64, -64, -64, 64, -64, 64, 64, 64, -64, -64, 64, -64, 64, 64, -64, -64, -64, -64, 64, 64, -64, 64, 64, 64, -64, 64, -64, 64, 64, 64, -64, 64, -64, -64, -64, 64, -64, 64, 64, 64, 64, -64, 64, -64, -64, 64, 64, -64, 64, -64, -64, 64, 64, -64, 64, 64, 64, 64, -64, -64, -64, 64, -64, -64, -64, 64, -64, 64, -64, 64, -64, -64, -64, 64, 64, 64, -64, 64, -64, -64, -64, -64, -64, -64, 64, 64, 64, -64, 64, -64, -64, -64, 64, -64, 64, -64, 64, -64, 64, -64, -64, 64, -64, -64, -64, -64, -64, -64, -64, -64, 64, 64, -64, -64, -64, -64, 64, -64, 64, 64, 64, 64, -64, 64, -64, 64, -64, -64, 64, 64, 64, 64, 64, 64, 64, 64, 64, 64, 64, -64, -64, -64, -64, -64, -64, 64, 64, 64, 64, 64, 64, -64, 64, -64, -64, -64, -64, 64, 64, 64, 64, 64, 64, 64, 64, 64, 64, 64, 64, -64, -64, -64, -64, 64, 64, 64, 64, -64, 64, -64, -64, 64, -64, 64, 64, -64, -64, 64, 64, 64, 64, 64, 64, 64, 64, 64, -64, -64, -64, -64, -64, 64, 64, 64, 64, -64, 64, -64, 64, 64, -64, 64, 64, 64, 64, 64, 64, 64, 64, 64, 64, 64, 64, -64, -64, -64, -64, -64, -64, 64, 64, 64, 64, -64, 64, -64, -64, -64, -64, 64, -64, 64, 64, 64, 64, 64, 64, -64, 64, 64, 64, 64, -64, -64, -64, -64, -64, -64, 64, 64, 64, -64, 64, 64, -64, -64, 64, 64, 64, 64, 64, -64, -64, 64, 64, 64, -64, -64, -64, -64, -64, -64, -64, -64, -64, -64, -64, 64, 64, 64, -64, -64, -64, -64, -64, 64, 64, 64, 64, 64, -64, 64, -64, 64, 64, -64, -64, -64, -64, -64, -64, -64, -64, 64, 64, 64, 64, 64, -64, -64, -64, 64, -64, -64, -64, -64, -64, -64, 64, 64, 64, 64, 64, -64, -64, -64, -64, -64, 64, -64, 64, 64, -64, 64, 64, 64, 64, 64, 64, -64, -64, -64, -64, -64, 64, 64, 64, -64, 64, 64, 64, -64, -64, -64, -64, -64, -64, -64, -64, 64, -64, 64, 64, 64, -64, -64, 64, 64, -64, -64, -64, -64, -64, 64, 64, -64, 64, 64, 64, -64, 64, 64, -64, -64, -64, -64, 64, 64, -64, -64, -64, 64, 64, 64, -64, 64, -64, -64, -64, -64, -64, -64, -64, -64, 64, 64, -64, 64, -64, 64, -64, -64, -64, -64, -64, 64, 64, 64, 64, -64, 64, 64, -64, -64, 64, -64, -64, -64, -64, 64, 64, 64, 64, -64, -64, 64, 64, -64, -64, -64, -64, -64, -64, 64, -64, -64, -64, -64, 64, -64, -64, -64, -64, -64, -64, -64, 64, -64, 64, 64, 64, 64, 64, -64, 64, 64, -64, -64, -64, -64, 64, 64, 64, -64, -64, 64, -64, -64, -64, -64, -64, -64, -64, 64, -64, 64, 64, 64, 64, 64, -64, -64, 64, -64, -64, -64, -64, -64, -64, 64, 64, 64, 64, -64, 64, 64, -64, -64, -64, -64, -64, 64, 64, 64, -64, 64, -64, -64, -64, -64, -64, -64, -64, -64, -64, 64, 64, 64, 64, 64, 64, -64, -64, -64, 64, -64, -64, -64, 64, -64, -64, -64, 64, -64, -64, -64, -64, -64, -64, -64, 64, 64, 64, 64, 64, 64, 64, 64, 64, 64, 64, 64, 64, -64, -64, -64, -64, -64, -64, -64, -64, -64, -64, -64, -64, -64, -64, 64, 64, 64, 64, 64, 64, 64, 64, 64, 64, 64, -64, -64, 64, -64, -64, -64, -64, -64, -64, 64, 64, -64, -64, -64, -64, -64, -64, 64, 64, 64, 64, 64, 64, 64, -64, 64, 64, -64, 64, -64, 64, -64, 64, -64, -64, -64, 64, -64, -64, -64, -64, -64, 64, 64, 64, 64, 64, 64, 64, 64, 64, 64, 64, 64, 64, 64, 64, -64, -64, -64, -64, -64, -64, -64, 64, 64, -64, -64, 64, 64, -64, 64, 64, 64, 64, 64, 64, 64, 64, 64, -64, 64, 64, 64, -64, 64, -64, 64, -64, -64, -64, -64, -64, -64, -64, 64, 64, 64, 64, 64, 64, 64, 64, 64, 64, 64, -64, 64, 64, -64, 64, 64, 64, 64, 64, 64, 64, -64, 64, -64, 64, 64, 64, 64, 64, -64, -64, 64, -64, -64, -64, 64, 64, -64, -64, -64, 64, 64, 64, 64, -64, 64, 64, -64, 64, 64, 64, 64, -64, -64, -64, -64, -64, -64, -64, -64, -64, -64, -64, -64, -64, 64, 64, 64, 64, 64, -64, -64, -64, -64, -64, -64, -64, 64, 64, 64, 64, 64, 64, -64, -64, -64, -64, 64, -64, -64, -64, 64, 64, -64, -64, -64, 64, 64, -64, -64, 64, 64, -64, 64, 64, -64, -64, 64, -64, -64, 64, 64, 64, 64, -64, -64, -64, -64, 64, 64, 64, 64, 64, -64, 64, -64, 64, 64, 64, 64, -64, 64, 64, -64, 64, 64, 64, 64, 64, -64, 64, 64, 64, -64, -64, 64, 64, 64, 64, -64, 64, -64, -64, -64, 64, -64, -64, 64, 64, -64, -64, 64, 64, -64, 64, -64, 64, 64, 64, 64, -64, 64, 64, 64, 64, 64, 64, 64, 64, 64, -64, 64, 64, -64, 64, -64, 64, -64, -64, 64, -64, -64, 64, 64, 64, -64, 64, 64, 64, -64, 64, 64, -64, 64, 64, -64, 64, 64, 64, -64, 64, 64, -64, 64, -64, 64, -64, -64, 64, 64, 64, 64, 64, 64, -64, 64, -64, 64, -64, -64, -64, -64, -64, -64, -64, 64, -64, -64, -64, 64, 64, -64, -64, -64, -64, -64, 64, 64, 64, 64, 64, 64, -64, 64, 64, -64, -64, -64, -64, -64, -64, -64, -64, 64, -64, -64, -64, 64, 64, 64, -64, 64, 64, 64, 64, 64, 64, 64, -64, 64, -64, -64, -64, -64, -64, -64, -64, -64, -64, -64, -64, -64, -64, -64, -64, 64, -64, 64, 64, 64, 64, 64, 64, -64, 64, -64, -64, -64, -64, 64, -64, -64, -64, -64, -64, -64, -64, -64, -64, -64, -64, -64, -64, -64, -64, -64, 64, -64, -64, -64, 64, -64, 64, 64, -64, 64, 64, -64, -64, -64, -64, -64, -64, -64, -64, -64, -64, -64, -64, -64, -64, -64, -64, 64, 64, -64, -64, -64, 64, -64, -64, -64, -64, -64, 64, -64, -64, -64, -64, -64, -64, -64, 64, -64, -64, -64, -64, -64, -64, 64, -64, 64, 64, 64, -64, 64, -64, -64, -64, -64, -64, -64, 64, 64, -64, -64, -64, -64, 64, 64, 64, 64, 64, -64, -64, 64, -64, -64, 64, 64, -64, 64, -64, 64, -64, -64, 64, 64, -64, 64, 64, -64, -64, -64, -64, 64, 64, 64, 64, 64, -64, -64, 64, 64, -64, 64, -64, 64, 64, -64, -64, 64, -64, -64, -64, -64, -64, 64, -64, -64, -64, -64, -64, 64, 64, 64, 64, 64, 64, 64, 64, -64, -64, -64, -64, -64, 64, -64, -64, -64, 64, 64, 64, 64, 64, -64, -64, -64, -64, -64, 64, 64, 64, 64, 64, 64, 64, 64, 64, 64, -64, -64, -64, 64, -64, 64, -64, -64, -64, -64, 64, -64, 64, -64, 64, -64, 64, 64, 64, 64, -64, -64, -64, 64, 64, 64, 64, 64, -64, -64, -64, 64, -64, 64, -64, 64, -64, 64, 64, 64, -64, -64, -64, -64, 64, 64, -64, 64, -64, -64, -64, 64, 64, 64, -64, -64, -64, -64, 64, -64, 64, -64, 64, -64, -64, 64, -64, 64, -64, -64, -64, -64, -64, -64, -64, -64, -64, 64, -64, -64, 64, -64, 64, -64, -64, -64, 64, 64, -64, 64, 64, 64, -64, -64, 64, 64, 64, -64, 64, -64, 64, 64, 64, 64, 64, -64, 64, -64, -64, -64, -64, -64, 64, -64, 64, 64, 64, -64, -64, -64, 64, -64, 64, 64, 64, -64, 64, -64, 64, -64, 64, 64, 64, 64, 64, 64, -64, 64, -64, -64, -64, -64, -64, 64, -64, 64, -64, -64, 64, -64, 64, 64, -64, -64, 64, -64, 64, 64, 64, 64, 64, -64, -64, -64, 64, -64, -64, -64, -64, 64, -64, -64, 64, 64, 64, 64, -64, -64, 64, -64, 64, -64, -64, 64, 64, 64, 64, -64, 64, -64, 64, -64, -64, -64, -64, -64, 64, 64, 64, 64, 64, 64, -64, 64, 64, 64, -64, -64, 64, -64, -64, -64, 64, 64, 64, 64, 64, -64, -64, -64, -64, -64, -64, -64, 64, -64, 64, -64, 64, -64, 64, -64, -64, -64, 64, 64, 64, -64, -64, -64, -64, -64, -64, -64, -64, -64, -64, -64, -64, -64, -64, -64, -64, 64, -64, 64, 64, 64, -64, -64, 64, -64, -64, -64, -64, -64, -64, -64, -64, -64, -64, -64, -64, -64, 64, -64, -64, -64, -64, -64, 64, -64, -64, -64, 64, -64, 64, 64, -64, 64, -64, -64, -64, -64, -64, -64, -64, -64, -64, -64, -64, 64, -64, -64, 64, -64, -64, 64, 64, -64, 64, -64, 64, 64, 64, -64, -64, 64, -64, -64, 64, -64, 64, -64, 64, 64, 64, -64, 64, -64, 64, 64, -64, 64, -64, 64, 64, -64, 64, -64, -64, -64, -64, -64, 64, -64, -64, 64, 64, 64, 64, 64, -64, -64, 64, 64, 64, -64, -64, -64, 64, 64, 64, -64, -64, -64, 64, 64, 64, 64, 64, -64, -64, -64, -64, 64, 64, -64, 64, -64, -64, -64, 64, -64, -64, 64, -64, -64, 64, 64, -64, 64, 64, 64, 64, 64, 64, -64, -64, 64, -64, -64, 64, 64, -64, 64, 64, -64, 64, 64, -64, -64, -64, -64, -64, 64, -64, -64, -64, -64, 64, -64, -64, -64, 64, 64, 64, -64, -64, -64, -64, 64, -64, 64, -64, -64, 64, -64, 64, -64, 64, -64, 64, 64, -64, 64, 64, -64, 64, -64, 64, 64, 64, -64, 64, -64, 64, -64, -64, 64, -64, -64, -64, -64, -64, -64, -64, -64, -64, -64, -64, -64, -64, -64, -64, -64, -64, -64, 64, -64, 64, 64, 64, 64, -64, -64, -64, -64, 64, -64, -64, -64, -64, -64, -64, -64, -64, 64, 64, -64, -64, 64, 64, 64, -64, -64, -64, 64, -64, -64, -64, -64, 64, 64, -64, -64, -64, 64, -64, -64, -64, -64, 64, -64, -64, -64, -64, -64, -64, 64, 64, 64, 64, 64, 64, 64, -64, 64, 64, 64, 64, -64, -64, -64, 64, 64, 64, 64, -64, 64, -64, 64, -64, -64, -64, -64, -64, -64, 64, -64, -64, -64, -64, -64, -64, 64, -64, 64, 64, -64, 64, 64, 64, -64, -64, -64, -64, -64, -64, -64, -64, -64, -64, -64, -64, 64, 64, -64, 64, 64, -64, -64, -64, 64, -64, 64, -64, -64, -64, 64, 64, -64, 64, -64, 64, -64, -64, -64, -64, -64, -64, -64, -64, -64, -64, -64, -64, 64, -64, 64, 64, -64, -64, -64, 64, -64, -64, -64, -64, -64, 64, 64, -64, -64, -64, -64, -64, -64, -64, -64, -64, -64, 64, 64, 64, -64, -64, 64, 64, 64, -64, -64, 64, -64, 64, -64, 64, 64, 64, -64, 64, 64, -64, -64, -64, -64, -64, -64, -64, -64, -64, -64, 64, 64, -64, 64, -64, -64, 64, -64, -64, 64, -64, 64, 64, 64, 64, -64, -64, 64, -64, 64, 64, -64, -64, 64, -64, -64, 64, 64, 64, -64, -64, 64, 64, 64, -64, -64, 64, -64, -64, 64, 64, -64, -64, 64, 64, 64, -64, -64, 64, -64, -64, -64, 64, -64, 64, 64, 64, 64, -64, 64, 64, 64, -64, -64, 64, -64, 64, -64, -64, -64, -64, 64, 64, 64, 64, -64, -64, -64, -64, 64, 64, 64, 64, 64, -64, -64, 64, -64, 64, 64, 64, -64, -64, -64, 64, -64, -64, -64, 64, 64, 64, -64, -64, -64, -64, -64, -64, -64, -64, 64, 64, 64, -64, 64, 64, 64, -64, -64, 64, -64, 64, 64, -64, -64, -64, -64, 64, 64, -64, -64, -64, -64, -64, -64, -64, -64, 64, 64, 64, 64, 64, 64, 64, -64, 64, -64, 64, 64, -64, -64, -64, -64, 64, -64, 64, -64, 64, -64, -64, -64, -64, -64, 64, -64, 64, 64, 64, 64, 64, 64, -64, 64, 64, -64, -64, -64, -64, -64, -64, 64, 64, 64, 64, 64, 64, 64, -64, 64, 64, 64, 64, 64, 64, 64, 64, 64, -64, -64, 64, 64, -64, -64, -64, -64, 64, -64, 64, 64, 64, -64, 64, 64, -64, 64, 64, 64, -64, 64, -64, -64, 64, -64, -64, 64, 64, -64, 64, -64, -64, -64, -64, -64, -64, 64, 64, 64, 64, 64, 64, 64, -64, -64, -64, -64, 64, -64, -64, -64, -64, -64, -64, -64, 64, 64, 64, 64, 64, -64, 64, 64, -64, -64, -64, 64, -64, 64, 64, -64, -64, -64, -64, -64, -64, -64, -64, -64, -64, 64, -64, -64, 64, 64, -64, 64, 64, -64, -64, -64, -64, -64, -64, -64, -64, -64, -64, -64, -64, -64, -64, -64, -64, -64, -64, -64, 64, -64, -64, -64, 64, 64, 64, -64, 64, -64, -64, -64, -64, -64, -64, -64, -64, -64, -64, -64, -64, -64, -64, -64, -64, -64, -64, -64, 64, -64, -64, -64, -64, -64, 64, -64, 64, -64, -64, -64, -64, 64, -64, -64, 64, -64, -64, -64, -64, 64, -64, -64, -64, 64, -64, -64, 64, -64, -64, -64, 64, -64, -64, -64, 64, -64, -64, -64, -64, -64, -64, -64, -64, 64, -64, -64, -64, -64, -64, -64, -64, -64, 64, 64, 64, -64, -64, 64, -64, -64, 64, 64, 64, -64, 64, -64, -64, -64, -64, -64, -64, -64, -64, -64, -64, -64, 64, -64, 64, -64, -64, -64, -64, 64, 64, -64, 64, -64, -64, 64, -64, 64, 64, 64, -64, -64, 64, 64, -64, -64, 64, -64, -64, -64, 64, -64, -64, -64, -64, -64, -64, 64, -64, 64, -64, -64, 64, 64, 64, -64, -64, 64, -64, 64, 64, -64, -64, -64, 64, 64, 64, 64, -64, -64, 64, -64, -64, -64, -64, -64, 64, -64, -64, -64, -64, -64, 64, 64, 64, -64, -64, -64, -64, -64, -64, -64, 64, 64, 64, -64, 64, 64, 64, -64, 64, 64, -64, -64, -64, 64, 64, 64, 64, -64, 64, 64, 64, 64, 64, 64, 64, -64, -64, 64, -64, -64, -64, 64, 64, -64, -64, -64, -64, 64, -64, 64, -64, 64, 64, -64, -64, -64, 64, -64, 64, 64, 64, -64, -64, -64, -64, 64, 64, 64, -64, 64, 64, 64, 64, 64, -64, -64, 64, -64, -64, -64, 64, 64, 64, -64, 64, 64, 64, 64, -64, 64, 64, 64, 64, 64, 64, 64, -64, 64, -64, 64, -64, -64, 64, -64, 64, -64, 64, 64, 64, -64, 64, 64, -64, -64, -64, 64, -64, -64, 64, 64, 64, 64, 64, -64, 64, 64, 64, 64, -64, 64, -64, -64, 64, -64, -64, 64, 64, 64, 64, -64, -64, 64, -64, -64, -64, 64, 64, 64, 64, -64, -64, 64, 64, 64, 64, 64, -64, -64, 64, -64, -64, -64, -64, -64, -64, -64, -64, 64, -64, 64, 64, -64, 64, 64, 64, 64, 64, -64, -64, 64, -64, 64, -64, 64, 64, -64, 64, -64, -64, -64, -64, -64, 64, 64, -64, -64, 64, 64, 64, -64, -64, -64, 64, 64, 64, -64, -64, 64, -64, 64, -64, -64, -64, -64, -64, -64, -64, -64, -64, -64, -64, -64, 64, 64, 64, -64, 64, -64, -64, -64, 64, -64, 64, -64, 64, 64, 64, -64, -64, -64, -64, -64, -64, -64, -64, -64, -64, -64, -64, 64, 64, -64, 64, 64, 64, -64, -64, 64, -64, -64, 64, -64, 64, -64, -64, -64, -64, -64, -64, -64, -64, -64, -64, -64, -64, -64, 64, -64, 64, -64, -64, 64, -64, 64, -64, -64, 64, 64, 64, 64, -64, -64, -64, -64, -64, -64, -64, 64, -64, -64, -64, -64, -64, -64, -64, -64, 64, -64, -64, -64, 64, -64, -64, -64, -64, 64, 64, -64, -64, -64, -64, -64, -64, -64, -64, -64, -64, 64, 64, -64, -64, 64, -64, -64, -64, 64, 64, 64, 64, -64, -64, 64, 64, 64, 64, -64, -64, -64, -64, -64, -64, -64, -64, 64, 64, 64, -64, -64, 64, 64, 64, -64, -64, 64, 64, -64, 64, -64, -64, -64, 64, 64, -64, -64, -64, -64, -64, -64, -64, -64, 64, -64, 64, -64, 64, 64, 64, 64, 64, -64, 64, -64, 64, 64, 64, -64, -64, 64, 64, 64, -64, -64, -64, -64, -64, -64, 64, -64, 64, -64, 64, 64, -64, -64, 64, 64, 64, 64, 64, 64, 64, -64, -64, -64, -64, -64, 64, 64, -64, -64, -64, -64, -64, -64, -64, -64, -64, -64, -64, -64, -64, 64, 64, 64, 64, -64, 64, 64, 64, 64, -64, -64, 64, -64, -64, -64, -64, -64, -64, -64, 64, -64, -64, 64, -64, 64, -64, -64, 64, 64, 64, 64, 64, 64, 64, -64, 64, -64, -64, -64, 64, 64, 64, -64, -64, -64, -64, 64, 64, -64, -64, -64, -64, -64, -64, -64, 64, 64, 64, 64, 64, 64, 64, -64, -64, 64, -64, 64, 64, 64, 64, -64, -64, -64, 64, -64, -64, -64, -64, -64, -64, 64, 64, 64, -64, 64, 64, 64, 64, 64, 64, 64, 64, -64, -64, -64, 64, -64, -64, -64, -64, -64, 64, 64, -64, -64, 64, -64, 64, -64, -64, 64, 64, -64, -64, -64, 64, -64, 64, 64, -64, -64, -64, -64, -64, -64, -64, -64, 64, -64, 64, -64, 64, -64, -64, 64, 64, -64, 64, 64, -64, 64, -64, -64, 64, 64, 64, 64, 64, 64, -64, -64, -64, 64, -64, 64, 64, 64, 64, 64, 64, 64, 64, 64, -64, -64, 64, 64, -64, 64, -64, 64, -64, -64, -64, -64, -64, -64, -64, 64, 64, -64, -64, 64, -64, -64, -64, 64, -64, 64, -64, 64, -64, 64, -64, -64, -64, 64, 64, 64, -64, -64, 64, 64, 64, 64, -64, 64, 64, -64, -64, 64, 64, -64, -64, -64, -64, -64, -64, -64, -64, -64, -64, -64, -64, -64, -64, -64, -64, -64, 64, -64, 64, -64, -64, 64, -64, 64, 64, -64, -64, 64, -64, -64, -64, -64, -64, -64, -64, -64, -64, -64, -64, -64, -64, -64, -64, -64, -64, 64, -64, -64, 64, 64, -64, -64, -64, 64, 64, -64, -64, -64, -64, -64, -64, -64, -64, -64, -64, 64, -64, 64, -64, -64, -64, -64, -64, -64, 64, 64, -64, -64, -64, 64, -64, -64, 64, -64, 64, -64, 64, -64, -64, -64, -64, 64, 64, -64, -64, -64, -64, -64, -64, 64, -64, -64, -64, 64, 64, -64, -64, -64, 64, -64, 64, 64, -64, 64, 64, 64, 64, 64, -64, 64, -64, 64, 64, 64, 64, -64, 64, -64, -64, 64, -64, 64, -64, -64, -64, 64, 64, -64, -64, -64, 64, 64, -64, -64, 64, -64, 64, 64, -64, -64, -64, 64, -64, -64, 64, -64, 64, 64, 64, -64, 64, 64, -64, 64, 64, 64, -64, 64, 64, -64, -64, -64, -64, 64, -64, -64, -64, -64, -64, -64, 64, -64, -64, 64, 64, -64, -64, 64, 64, 64, -64, -64, 64, 64, 64, 64, -64, 64, -64, 64, 64, 64, 64, -64, -64, -64, 64, -64, 64, 64, 64, -64, 64, 64, 64, 64, 64, -64, -64, -64, -64, 64, 64, 64, 64, -64, -64, -64, 64, 64, 64, 64, 64, 64, -64, -64, 64, 64, -64, -64, 64, -64, -64, 64, 64, -64, 64, 64, 64, 64, 64, 64, 64, -64, -64, 64, 64, 64, 64, 64, 64, 64, 64, -64, 64, 64, 64, -64, 64, -64, 64, 64, 64, -64, -64, 64, 64, 64, -64, -64, -64, -64, -64, -64, -64, 64, 64, -64, 64, -64, -64, -64, 64, 64, -64, 64, 64, 64, -64, -64, 64, 64, 64, -64, 64, 64, -64, -64, -64, -64, -64, -64, -64, 64, 64, -64, 64, -64, -64, -64, -64, 64, 64, -64, -64, -64, 64, -64, 64, 64, 64, -64, 64, -64, -64, -64, -64, -64, -64, -64, -64, 64, 64, 64, -64, 64, -64, -64, -64, -64, -64, 64, -64, 64, 64, 64, -64, 64, -64, -64, -64, -64, -64, -64, 64, 64, -64, -64, -64, -64, 64, 64, -64, -64, -64, -64, -64, -64, -64, 64, -64, -64, 64, 64, -64, -64, -64, -64, -64, -64, -64, 64, -64, -64, -64, -64, -64, 64, 64, 64, -64, -64, -64, -64, -64, -64, -64, -64, -64, 64, 64, 64, 64, -64, 64, -64, -64, -64, 64, 64, 64, -64, -64, -64, -64, -64, 64, 64, 64, -64, -64, -64, -64, -64, -64, -64, 64, 64, -64, 64, 64, 64, 64, 64, -64, 64, 64, -64, -64, -64, -64, 64, -64, 64, -64, 64, 64, -64, -64, -64, -64, -64, -64, -64, -64, -64, -64, 64, 64, 64, 64, -64, -64, -64, -64, -64, -64, -64, -64, -64, -64, 64, -64, -64, 64, -64, -64, -64, -64, -64, -64, -64, 64, 64, -64, 64, 64, 64, 64, -64, -64, -64, -64, -64, 64, -64, -64, -64, -64, -64, 64, -64, 64, 64, -64, 64, -64, -64, -64, -64, 64, 64, 64, 64, 64, -64, -64, -64, -64, -64, 64, -64, -64, -64, -64, -64, -64, -64, 64, 64, 64, 64, -64, 64, 64, 64, -64, 64, -64, 64, 64, 64, -64, -64, 64, -64, 64, 64, 64, -64, -64, -64, -64, -64, -64, -64, 64, 64, 64, 64, -64, -64, -64, 64, -64, 64, -64, 64, 64, -64, 64, 64, -64, 64, -64, 64, -64, 64, -64, -64, -64, -64, -64, 64, 64, 64, -64, -64, -64, 64, -64, -64, -64, 64, -64, 64, 64, -64, 64, -64, -64, 64, 64, 64, 64, -64, 64, 64, -64, 64, -64, 64, 64, 64, -64, 64, -64, -64, -64, -64, -64, -64, 64, -64, 64, 64, 64, 64, 64, -64, 64, 64, -64, 64, 64, -64, -64, -64, -64, 64, 64, 64, -64, -64, -64, -64, -64, -64, 64, 64, 64, 64, -64, 64, 64, 64, 64, -64, -64, -64, 64, -64, 64, -64, -64, -64, -64, -64, -64, 64, -64, -64, -64, -64, -64, -64, -64, 64, 64, -64, -64, 64, 64, -64, -64, -64, -64, 64, -64, -64, -64, -64, -64, -64, -64, 64, 64, 64, -64, -64, -64, -64, -64, -64, -64, -64, -64, -64, 64, -64, 64, -64, -64, -64, -64, -64, -64, -64, -64, -64, -64, -64, -64, -64, -64, 64, 64, -64, -64, -64, -64, -64, -64, 64, 64, 64, -64, -64, 64, -64, -64, -64, -64, -64, -64, -64, -64, -64, -64, 64, 64, -64, -64, -64, -64, -64, -64, -64, -64, -64, 64, -64, -64, 64, -64, -64, 64, 64, -64, -64, -64, -64, -64, 64, -64, -64, -64, -64, -64, -64, -64, -64, -64, 64, 64, -64, 64, -64, 64, 64, -64, 64, -64, 64, -64, 64, -64, -64, -64, -64, -64, 64, 64, -64, -64, -64, -64, -64, -64, -64, 64, 64, -64, -64, -64, -64, 64, -64, -64, 64, 64, 64, 64, 64, -64, -64, -64, 64, 64, 64, 64, 64, 64, -64, 64, -64, -64, -64, 64, 64, 64, 64, -64, 64, 64, 64, 64, 64, 64, -64, -64, -64, -64, 64, 64, -64, 64, -64, 64, -64, 64, 64, 64, -64, -64, -64, 64, 64, 64, -64, -64, 64, -64, -64, -64, -64, 64, -64, 64, -64, -64, 64, 64, 64, -64, -64, -64, 64, 64, 64, 64, 64, -64, 64, -64, 64, 64, -64, -64, 64, -64, 64, 64, -64, -64, -64, -64, 64, 64, 64, -64, 64, 64, -64, -64, -64, -64, -64, -64, 64, -64, 64, 64, 64, 64, 64, 64, -64, 64, 64, -64, 64, -64, -64, -64, 64, 64, -64, -64, 64, -64, -64, 64, 64, -64, -64, -64, -64, -64, -64, -64, -64, 64, -64, -64, -64, 64, 64, 64, -64, 64, 64, -64, 64, -64, -64, 64, 64, -64, -64, -64, 64, -64, 64, 64, 64, 64, -64, 64, 64, 64, -64, -64, 64, -64, 64, -64, -64, -64, -64, -64, -64, -64, -64, -64, 64, -64, 64, 64, 64, -64, -64, -64, 64, 64, -64, 64, 64, 64, -64, -64, 64, -64, 64, -64, -64, -64, 64, -64, -64, 64, 64, 64, -64, -64, -64, 64, 64, 64, 64, -64, -64, 64, -64, -64, -64, 64, -64, 64, -64, 64, 64, -64, -64, 64, -64, 64, -64, -64, -64, -64, 64, 64, 64, 64, 64, -64, -64, -64, 64, 64, 64, 64, -64, -64, -64, -64, -64, -64, 64, 64, 64, -64, -64, -64, 64, 64, 64, 64, 64, -64, 64, 64, 64, -64, 64, -64, 64, 64, 64, 64, 64, 64, 64, 64, -64, 64, -64, -64, -64, -64, -64, 64, -64, -64, 64, 64, 64, -64, -64, 64, 64, 64, 64, 64, 64, 64, 64, 64, -64, 64, 64, -64, -64, 64, 64, -64, -64, 64, -64, 64, 64, 64, 64, 64, -64, -64, 64, 64, 64, 64, -64, -64, -64, 64, 64, 64, 64, 64, -64, 64, -64, 64, -64, 64, -64, 64, -64, -64, -64, 64, -64, 64, -64, 64, 64, -64, -64, 64, -64, 64, 64, 64, 64, 64, -64, 64, -64, -64, 64, -64, -64, -64, -64, 64, -64, -64, 64, -64, -64, 64, 64, -64, -64, -64, 64, -64, -64, 64, 64, 64, 64, 64, 64, 64, 64, -64, -64, 64, 64, -64, -64, -64, -64, 64, -64, -64, -64, 64, 64, 64, 64, 64, 64, 64, -64, 64, 64, 64, 64, 64, -64, -64, 64, 64, 64, -64, -64, 64, -64, 64, 64, 64, 64, 64, -64, 64, -64, -64, 64, 64, -64, -64, 64, 64, 64, 64, 64, 64, 64, 64, -64, 64, -64, 64, -64, 64, 64, -64, 64, 64, 64, -64, 64, 64, 64, 64, 64, 64, 64, 64, -64, 64, 64, 64, -64, 64, 64, -64, -64, 64, 64, -64, -64, -64, 64, -64, -64, -64, 64, -64, 64, -64, 64, -64, 64, 64, 64, -64, -64, 64, 64, 64, 64, 64, 64, 64, 64, -64, 64, -64, -64, -64, -64, -64, -64, -64, -64, 64, -64, 64, -64, -64, 64, 64, -64, -64, -64, 64, 64, 64, 64, -64, -64, 64, -64, -64, -64, 64, 64, 64, 64, 64, -64, -64, -64, 64, 64, 64, 64, 64, 64, 64, 64, -64, -64, 64, -64, 64, 64, 64, 64, 64, 64, -64, 64, -64, 64, -64, 64, -64, 64, -64, 64, 64, -64, -64, -64, -64, 64, -64, 64, -64, -64, 64, -64, 64, -64, 64, -64, 64, -64, -64, 64, 64, 64, -64, 64, 64, 64, 64, 64, -64, 64, 64, 64, -64, 64, 64, 64, 64, -64, -64, 64, -64, 64, 64, 64, 64, 64, 64, -64, 64, -64, 64, 64, -64, 64, -64, 64, 64, 64, 64, -64, -64, 64, -64, 64, 64, 64, 64, 64, 64, 64, 64, 64, -64, 64, -64, -64, 64, 64, 64, 64, 64, 64, -64, 64, 64, 64, 64, 64, 64, -64, 64, -64, 64, -64, 64, 64, 64, 64, -64, -64, -64, -64, 64, 64, 64, 64, -64, -64, -64, 64, 64, 64, -64, -64, -64, 64, -64, 64, -64, -64, -64, 64, -64, 64, -64, 64, 64, -64, 64, 64, 64, 64, 64, 64, 64, 64, -64, 64, -64, 64, -64, 64, 64, 64, 64, 64, 64, -64, 64, -64, -64, 64, 64, 64, 64, 64, 64, 64, 64, -64, -64, 64, 64, 64, -64, 64, -64, -64, 64, 64, 64, 64, 64, 64, 64, -64, 64, -64, -64, 64, 64, -64, 64, 64, 64, 64, 64, 64, -64, 64, 64, -64, 64, 64, 64, -64, -64, 64, 64, -64, -64, 64, 64, 64, 64, 64, 64, 64, -64, -64, 64, -64, 64, 64, 64, -64, 64, -64, 64, -64, -64, 64, 64, 64, 64, -64, 64, 64, 64, 64, 64, 64, 64, -64, 64, 64, -64, 64, 64, 64, -64, -64, -64, -64, -64, -64, -64, -64, -64, -64, 64, 64, 64, 64, 64, 64, 64, -64, 64, 64, 64, -64, 64, -64, 64, 64, -64, 64, -64, 64, -64, 64, -64, -64, 64, -64, 64, -64, -64, -64, -64, -64, -64, 64, -64, -64, 64, 64, -64, -64, 64, 64, 64, 64, 64, -64, 64, -64, -64, 64, -64, -64, -64, -64, 64, -64, -64, -64, -64, -64, -64, -64, -64, 64, -64, -64, -64, -64, -64, 64, 64, 64, -64, -64, -64, -64, -64, 64, 64, -64, -64, -64, -64, -64, 64, 64, 64, 64, -64, -64, -64, 64, -64, -64, 64, 64, 64, -64, -64, -64, 64, 64, -64, -64, 64, -64, 64, 64, 64, -64, -64, -64, 64, -64, 64, 64, 64, -64, -64, -64, 64, 64, -64, -64, -64, -64, -64, 64, -64, -64, 64, 64, -64, 64, -64, 64, 64, 64, -64, 64, 64, 64, -64, -64, -64, -64, -64, -64, -64, -64, -64, -64, -64, -64, -64, -64, -64, -64, -64, -64, -64, 64, -64, -64, 64, 64, -64, -64, 64, 64, -64, -64, -64, -64, -64, -64, -64, -64, -64, -64, -64, -64, -64, 64, -64, 64, -64, 64, -64, 64, -64, -64, -64, 64, 64, -64, 64, 64, 64, 64, 64, 64, 64, 64, 64, 64, 64, 64, 64, -64, -64, -64, -64, 64, -64, -64, -64, -64, 64, -64, 64, -64, 64, -64, 64, 64, -64, 64, 64, 64, 64, -64, -64, 64, 64, -64, 64, -64, -64, -64, -64, -64, -64, -64, -64, 64, -64, -64, 64, 64, 64, -64, 64, -64, -64, 64, -64, 64, 64, 64, 64, 64, -64, 64, -64, -64, -64, -64, -64, -64, -64, -64, -64, -64, -64, -64, -64, 64, 64, -64, 64, 64, 64, -64, -64, -64, -64, -64, 64, 64, -64, 64, -64, 64, -64, -64, -64, -64, -64, -64, -64, -64, -64, -64, -64, -64, -64, 64, 64, 64, -64, -64, -64, -64, -64, -64, -64, -64, -64, -64, 64, -64, 64, 64, -64, -64, -64, -64, -64, -64, -64, 64, -64, -64, -64, 64, -64, -64, -64, -64, -64, -64, -64, -64, -64, -64, -64, -64, 64, 64, 64, 64, -64, -64, -64, -64, -64, -64, -64, -64, -64, -64, 64, -64, 64, -64, -64, -64, -64, -64, -64, 64, -64, -64, 64, 64, 64, 64, 64, -64, -64, -64, 64, 64, -64, -64, -64, -64, 64, -64, -64, 64, 64, -64, -64, -64, -64, -64, -64, 64, 64, 64, 64, 64, -64, 64, 64, -64, 64, -64, 64, -64, -64, -64, -64, -64, -64, 64, -64, -64, -64, -64, -64, -64, -64, 64, 64, 64, 64, -64, -64, 64, -64, 64, -64, 64, -64, -64, -64, -64, -64, 64, 64, 64, 64, 64, -64, 64, 64, -64, -64, -64, 64, 64, 64, 64, -64, -64, -64, 64, 64, 64, 64, 64, -64, -64, -64, -64, -64, -64, -64, -64, -64, -64, -64, 64, 64, -64, -64, 64, 64, 64, -64, 64, -64, 64, 64, 64, 64, 64, 64, 64, -64, -64, 64, -64, -64, 64, 64, 64, 64, -64, -64, -64, 64, -64, -64, -64, -64, -64, -64, 64, 64, 64, 64, 64, -64, -64, -64, 64, -64, 64, 64, -64, 64, -64, -64, 64, 64, 64, -64, -64, 64, -64, -64, -64, -64, -64, -64, -64, 64, -64, -64, -64, -64, 64, 64, -64, -64, -64, 64, -64, -64, -64, -64, -64, -64, -64, 64, -64, -64, 64, -64, -64, -64, -64, -64, -64, -64, -64, 64, -64, -64, -64, 64, -64, -64, -64, -64, 64, -64, -64, -64, -64, 64, 64, 64, -64, -64, -64, -64, -64, -64, -64, -64, -64, -64, -64, -64, 64, -64, -64, -64, -64, -64, -64, -64, -64, -64, -64, -64, 64, -64, 64, 64, -64, 64, 64, -64, -64, -64, -64, -64, -64, -64, -64, -64, -64, -64, -64, -64, 64, 64, -64, -64, -64, -64, -64, -64, -64, 64, 64, -64, -64, 64, 64, 64, -64, -64, -64, -64, -64, -64, -64, -64, -64, -64, -64, -64, -64, -64, -64, -64, -64, -64, -64, -64, -64, -64, 64, 64, -64, 64, 64, -64, -64, -64, -64, 64, -64, -64, 64, -64, -64, -64, -64, -64, -64, -64, -64, -64, -64, -64, -64, -64, -64, -64, 64, 64, 64, -64, -64, -64, -64, 64, 64, 64, 64, 64, 64, 64, -64, -64, -64, -64, -64, -64, -64, -64, -64, 64, 64, -64, 64, -64, -64, 64, 64, -64, -64, -64, 64, 64, 64, 64, 64, -64, 64, -64, -64, 64, -64, -64, -64, -64, 64, 64, -64, -64, -64, -64, -64, -64, -64, 64, 64, 64, 64, 64, 64, 64, 64, 64, 64, 64, 64, -64, -64, -64, -64, -64, -64, -64, 64, 64, 64, -64, -64, -64, 64, -64, -64, 64, -64, -64, 64, 64, 64, 64, 64, 64, 64, 64, -64, 64, -64, -64, -64, 64, 64, 64, 64, 64, -64, 64, 64, 64, -64, -64, -64, -64, 64, -64, -64, -64, -64, -64, -64, 64, -64, 64, 64, -64, -64, 64, -64, -64, -64, -64, -64, -64, -64, -64, -64, -64, 64, -64, -64, 64, 64, -64, 64, -64, 64, -64, -64, -64, -64, -64, 64, -64, -64, 64, -64, -64, 64, 64, -64, -64, -64, 64, 64, -64, 64, 64, -64, 64, -64, 64, -64, -64, -64, -64, 64, -64, -64, -64, -64, 64, 64, 64, 64, 64, 64, 64, 64, 64, 64, -64, 64, -64, 64, -64, -64, 64, -64, -64, -64, -64, -64, 64, -64, -64, -64, -64, 64, -64, -64, -64, -64, -64, 64, 64, -64, 64, 64, -64, -64, -64, 64, 64, -64, 64, 64, -64, -64, -64, -64, 64, -64, -64, -64, 64, -64, 64, 64, 64, 64, 64, 64, 64, -64, -64, -64, -64, -64, -64, 64, -64, -64, 64, -64, -64, -64, 64, -64, -64, -64, -64, 64, -64, -64, -64, -64, 64, 64, 64, 64, 64, 64, 64, -64, -64, -64, -64, 64, 64, 64, 64, -64, -64, -64, 64, -64, 64, 64, -64, -64, 64, -64, 64, 64, 64, 64, 64, 64, -64, 64, -64, -64, -64, -64, -64, 64, -64, 64, 64, -64, 64, 64, 64, 64, 64, -64, -64, -64, -64, 64, 64, -64, 64, 64, 64, 64, -64, -64, 64, -64, -64, -64, 64, 64, 64, 64, -64, -64, -64, -64, 64, -64, 64, 64, 64, -64, -64, 64, -64, 64, 64, -64, -64, -64, -64, -64, -64, 64, 64, 64, 64, 64, 64, 64, -64, -64, -64, -64, -64, 64, 64, 64, 64, -64, -64, 64, -64, 64, 64, 64, 64, -64, 64, 64, -64, 64, 64, -64, 64, 64, 64, -64, 64, 64, 64, -64, -64, 64, -64, -64, -64, -64, -64, -64, 64, 64, 64, -64, -64, 64, -64, 64, -64, 64, -64, -64, 64, 64, 64, -64, 64, -64, 64, -64, -64, -64, -64, -64, -64, -64, -64, -64, 64, 64, 64, 64, -64, -64, 64, 64, -64, -64, -64, -64, -64, 64, -64, -64, -64, -64, -64, 64, -64, -64, -64, -64, -64, -64, -64, -64, 64, 64, 64, -64, -64, 64, 64, -64, -64, -64, -64, -64, 64, 64, -64, -64, 64, -64, 64, -64, -64, -64, -64, -64, -64, -64, 64, -64, 64, 64, 64, 64, -64, 64, 64, -64, -64, -64, -64, -64, 64, 64, -64, -64, 64, 64, -64, -64, -64, -64, -64, -64, -64, -64, 64, -64, -64, 64, 64, 64, 64, 64, -64, -64, -64, -64, -64, -64, 64, 64, -64, 64, -64, -64, -64, -64, -64, -64, -64, -64, -64, -64, 64, 64, 64, 64, 64, 64, 64, 64, -64, -64, -64, -64, -64, -64, -64, 64, 64, 64, 64, 64, 64, 64, -64, -64, -64, -64, -64, -64, 64, 64, 64, 64, 64, 64, 64, 64, -64, -64, -64, -64, 64, 64, 64, -64, -64, -64, 64, 64, 64, 64, 64, -64, -64, -64, -64, 64, 64, 64, 64, 64, 64, 64, 64, -64, 64, -64, 64, -64, -64, 64, 64, 64, 64, 64, -64, 64, 64, 64, 64, -64, -64, -64, -64, 64, 64, 64, 64, 64, 64, 64, 64, -64, 64, -64, -64, 64, 64, 64, 64, -64, -64, -64, 64, 64, 64, 64, 64, -64, 64, -64, -64, -64, 64, -64, 64, 64, 64, 64, -64, -64, -64, -64, -64, 64, 64, 64, 64, 64, 64, -64, -64, 64, 64, 64, 64, 64, -64, -64, -64, -64, -64, 64, 64, 64, 64, -64, -64, -64, -64, -64, 64, 64, 64, 64, 64, 64, 64, 64, 64, 64, 64, 64, 64, -64, 64, -64, -64, 64, -64, -64, 64, 64, 64, -64, 64, 64, -64, -64, -64, 64, 64, 64, 64, -64, 64, 64, 64, 64, 64, 64, 64, 64, -64, 64, 64, 64, 64, -64, -64, -64, -64, -64, 64, -64, 64, 64, -64, -64, 64, 64, 64, -64, 64, -64, -64, 64, 64, 64, -64, -64, 64, -64, 64, 64, 64, 64, 64, -64, -64, 64, 64, -64, -64, 64, -64, 64, 64, 64, 64, 64, 64, 64, 64, 64, -64, 64, -64, -64, -64, -64, -64, 64, 64, 64, -64, -64, -64, -64, -64, -64, 64, -64, -64, 64, 64, -64, 64, -64, 64, 64, 64, 64, 64, 64, -64, -64, -64, -64, -64, -64, -64, -64, -64, -64, -64, 64, -64, -64, 64, -64, -64, 64, 64, -64, 64, 64, 64, 64, 64, -64, -64, -64, -64, -64, 64, -64, 64, 64, 64, 64, 64, -64, -64, -64, -64, -64, -64, -64, -64, -64, -64, -64, -64, -64, 64, -64, 64, 64, 64, -64, 64, 64, 64, 64, 64, 64, 64, 64, 64, -64, -64, 64, -64, -64, -64, -64, -64, 64, 64, -64, -64, 64, -64, 64, -64, -64, -64, -64, -64, -64, 64, -64, 64, 64, 64, 64, 64, -64, 64, -64, -64, 64, 64, -64, 64, 64, 64, -64, -64, -64, 64, 64, 64, -64, -64, -64, 64, 64, -64, 64, 64, 64, 64, 64, -64, -64, -64, -64, -64, -64, 64, -64, 64, 64, 64, 64, -64, 64, -64, 64, -64, -64, -64, 64, -64, 64, -64, -64, 64, -64, 64, 64, -64, -64, -64, -64, -64, -64, -64, -64, -64, -64, 64, -64, 64, -64, -64, -64, 64, -64, 64, -64, -64, 64, 64, 64, 64, 64, 64, 64, 64, 64, 64, -64, 64, 64, -64, -64, 64, 64, -64, -64, 64, -64, -64, 64, -64, -64, 64, 64, -64, 64, 64, 64, -64, 64, 64, 64, 64, -64, 64, 64, 64, 64, 64, 64, -64, -64, -64, -64, 64, -64, 64, 64, 64, -64, -64, 64, -64, 64, 64, 64, 64, -64, -64, 64, 64, 64, 64, 64, 64, 64, 64, 64, 64, -64, 64, 64, -64, 64, 64, -64, 64, -64, -64, -64, -64, 64, -64, 64, 64, -64, -64, -64, -64, -64, -64, -64, -64, 64, -64, -64, -64, 64, 64, 64, 64, 64, 64, -64, -64, 64, 64, -64, -64, 64, 64, 64, -64, -64, -64, -64, -64, 64, -64, -64, -64, -64, -64, -64, -64, 64, 64, 64, 64, -64, -64, -64, -64, 64, 64, 64, 64, -64, 64, 64, -64, -64, -64, -64, 64, -64, -64, -64, -64, -64, 64, 64, -64, -64, 64, -64, -64, -64, -64, 64, 64, 64, 64, -64, -64, 64, 64, 64, -64, 64, 64, 64, 64, -64, 64, 64, -64, 64, 64, 64, -64, 64, -64, -64, -64, 64, 64, 64, -64, 64, 64, 64, 64, 64, -64, -64, -64, -64, -64, 64, 64, 64, -64, 64, -64, -64, -64, -64, -64, -64, -64, 64, 64, 64, 64, 64, 64, 64, -64, -64, -64, -64, -64, -64, -64, -64, -64, -64, 64, 64, 64, 64, 64, 64, 64, -64, 64, -64, 64, 64, 64, -64, -64, -64, -64, 64, -64, -64, -64, -64, -64, -64, -64, -64, 64, 64, 64, 64, 64, 64, 64, -64, 64, -64, -64, -64, -64, 64, 64, 64, 64, -64, -64, 64, 64, 64, -64, -64, -64, -64, -64, -64, 64, 64, 64, 64, 64, 64, 64, 64, 64, -64, -64, 64, 64, 64, 64, -64, 64, -64, 64, 64, -64, -64, -64, -64, -64, -64, -64, -64, 64, 64, 64, 64, 64, 64, 64, -64, -64, -64, -64, 64, 64, 64, 64, -64, 64, -64, 64, -64, 64, -64, -64, 64, -64, -64, -64, -64, -64, -64, -64, -64, 64, 64, -64, -64, -64, 64, 64, -64, 64, 64, -64, -64, 64, -64, -64, 64, 64, -64, -64, 64, -64, -64, -64, -64, -64, 64, -64, -64, -64, -64, 64, 64, 64, 64, 64, 64, -64, 64, 64, 64, 64, 64, 64, 64, -64, 64, -64, -64, 64, -64, -64, 64, 64, 64, -64, 64, 64, -64, 64, -64, -64, 64, 64, -64, 64, 64, -64, 64, 64, 64, -64, -64, -64, 64, -64, -64, -64, 64, 64, 64, 64, -64, 64, 64, -64, 64, 64, 64, -64, -64, -64, -64, 64, 64, 64, 64, 64, -64, -64, -64, -64, 64, 64, -64, 64, 64, 64, 64, 64, 64, 64, 64, 64, -64, -64, -64, 64, -64, 64, -64, -64, 64, 64, 64, -64, 64, 64, 64, -64, -64, -64, -64, -64, -64, 64, 64, 64, 64, 64, 64, 64, 64, -64, -64, -64, -64, -64, -64, 64, 64, 64, -64, -64, -64, 64, 64, -64, -64, -64, 64, -64, -64, -64, 64, 64, 64, 64, 64, 64, 64, -64, -64, -64, -64, -64, -64, -64, 64, 64, -64, 64, 64, -64, 64, 64, -64, 64, 64, 64, -64, -64, 64, 64, 64, 64, 64, 64, 64, -64, -64, -64, -64, -64, -64, 64, -64, -64, 64, -64, -64, -64, 64, -64, 64, 64, 64, 64, -64, 64, -64, 64, 64, 64, 64, -64, -64, -64, -64, -64, -64, -64, -64, -64, 64, -64, 64, -64, 64, -64, -64, 64, 64, 64, 64, -64, 64, -64, -64, -64, 64, -64, -64, -64, -64, -64, -64, -64, -64, -64, -64, -64, 64, -64, -64, -64, -64, 64, 64, -64, -64, 64, 64, -64, -64, 64, 64, -64, -64, 64, -64, -64, -64, -64, -64, -64, -64, -64, -64, -64, -64, -64, -64, 64, 64, -64, 64, 64, 64, -64, -64, 64, -64, -64, -64, -64, 64, -64, -64, -64, -64, -64, -64, -64, -64, -64, -64, -64, 64, -64, -64, 64, 64, 64, -64, -64, 64, -64, -64, -64, -64, -64, -64, -64, 64, -64, -64, -64, -64, -64, -64, -64, -64, 64, -64, 64, -64, 64, 64, 64, -64, -64, 64, -64, -64, -64, -64, -64, -64, 64, 64, 64, 64, 64, 64, -64, -64, -64, -64, 64, 64, -64, 64, 64, 64, -64, 64, -64, 64, -64, -64, -64, -64, 64, 64, 64, 64, -64, 64, 64, -64, -64, -64, 64, -64, -64, -64, 64, 64, 64, -64, -64, 64, -64, 64, 64, -64, 64, -64, 64, -64, -64, -64, -64, 64, 64, -64, -64, -64, -64, -64, -64, -64, -64, -64, -64, 64, -64, 64, -64, 64, -64, -64, -64, -64, 64, 64, -64, 64, -64, -64, 64, -64, 64, 64, -64, 64, -64, 64, -64, 64, -64, -64, 64, -64, 64, 64, 64, -64, 64, -64, -64, 64, -64, 64, 64, -64, -64, 64, 64, 64, 64, -64, 64, 64, 64, -64, -64, -64, -64, 64, 64, -64, 64, 64, 64, 64, -64, -64, -64, -64, -64, 64, 64, 64, -64, -64, -64, -64, 64, 64, 64, -64, 64, 64, 64, 64, -64, -64, -64, 64, -64, 64, -64, 64, 64, -64, -64, -64, -64, 64, -64, 64, -64, -64, 64, -64, -64, -64, 64, 64, -64, -64, 64, -64, -64, 64, 64, -64, -64, -64, 64, -64, -64, -64, 64, -64, 64, 64, -64, -64, 64, -64, -64, -64, -64, -64, -64, -64, -64, 64, 64, -64, 64, -64, -64, -64, -64, -64, -64, -64, -64, -64, -64, -64, -64, -64, -64, -64, -64, 64, 64, 64, -64, 64, -64, 64, 64, 64, -64, -64, -64, -64, 64, -64, -64, -64, -64, -64, 64, -64, 64, -64, 64, 64, -64, 64, 64, -64, 64, -64, 64, -64, 64, -64, 64, -64, -64, -64, -64, -64, -64, -64, -64, -64, -64, -64, -64, -64, 64, -64, 64, -64, 64, 64, 64, -64, -64, -64, -64, 64, 64, -64, 64, -64, 64, -64, -64, 64, 64, -64, -64, -64, -64, -64, -64, -64, -64, -64, 64, 64, 64, -64, 64, -64, 64, 64, -64, -64, -64, 64, -64, 64, -64, 64, -64, -64, 64, -64, -64, 64, -64, -64, -64, -64, -64, -64, 64, 64, 64, 64, -64, -64, 64, -64, -64, 64, -64, 64, 64, -64, -64, -64, -64, 64, 64, 64, -64, 64, -64, -64, -64, -64, -64, -64, -64, -64, 64, -64, 64, 64, 64, -64, -64, -64, 64, -64, -64, -64, -64, -64, -64, 64, -64, -64, -64, 64, -64, -64, 64, -64, -64, -64, -64, -64, 64, -64, -64, -64, 64, -64, -64, 64, -64, -64, 64, -64, -64, 64, -64, -64, -64, -64, -64, -64, 64, -64, -64, -64, 64, -64, 64, -64, -64, 64, -64, -64, -64, -64, -64, -64, -64, -64, -64, 64, 64, 64, -64, 64, 64, 64, -64, 64, 64, 64, -64, -64, 64, 64, -64, -64, -64, -64, -64, -64, -64, -64, -64, 64, 64, -64, -64, 64, 64, 64, -64, 64, -64, -64, -64, -64, 64, -64, -64, -64, 64, 64, 64, -64, 64, -64, -64, -64, -64, -64, 64, -64, -64, -64, -64, -64, -64, -64, 64, 64, -64, 64, -64, -64, 64, -64, -64, 64, 64, -64, -64, -64, 64, 64, -64, -64, -64, -64, -64, 64, -64, 64, -64, -64, -64, -64, 64, -64, -64, -64, -64, 64, 64, -64, -64, 64, 64, -64, -64, 64, 64, 64, -64, -64, -64, 64, -64, 64, -64, 64, -64, -64, -64, 64, -64, -64, -64, -64, 64, 64, -64, 64, -64, 64, 64, 64, 64, 64, -64, 64, 64, -64, -64, -64, -64, 64, -64, -64, -64, -64, 64, -64, 64, -64, -64, -64, -64, -64, -64, 64, 64, 64, -64, -64, -64, 64, -64, 64, -64, -64, 64, -64, 64, 64, -64, 64, -64, -64, -64, -64, 64, 64, 64, 64, -64, -64, -64, -64, 64, -64, -64, -64, 64, -64, -64, 64, 64, -64, -64, -64, -64, 64, -64, 64, -64, -64, -64, -64, 64, 64, -64, 64, 64, -64, -64, 64, -64, -64, 64, -64, 64, -64, 64, 64, 64, -64, -64, -64, 64, -64, -64, -64, -64, -64, -64, -64, 64, -64, -64, 64, -64, 64, 64, 64, 64, 64, -64, 64, -64, 64, -64, 64, 64, -64, -64, -64, -64, -64, -64, 64, -64, -64, -64, 64, -64, 64, 64, -64, -64, -64, -64, 64, 64, 64, 64, -64, 64, 64, -64, 64, -64, -64, -64, 64, 64, -64, -64, -64, 64, 64, 64, 64, 64, 64, -64, -64, 64, 64, -64, -64, -64, 64, -64, 64, 64, 64, 64, 64, 64, -64, 64, -64, 64, 64, -64, -64, -64, 64, 64, 64, -64, -64, 64, -64, 64, -64, -64, 64, 64, -64, -64, 64, -64, 64, -64, 64, -64, -64, -64, -64, -64, 64, 64, 64, 64, 64, 64, -64, -64, 64, -64, 64, 64, -64, -64, 64, 64, -64, -64, 64, -64, -64, -64, 64, -64, -64, 64, -64, 64, 64, -64, 64, 64, -64, -64, -64, 64, -64, 64, -64, -64, 64, 64, -64, -64, 64, 64, -64, -64, 64, 64, 64, 64, 64, 64, -64, -64, -64, -64, -64, 64, 64, 64, 64, 64, -64, 64, 64, -64, -64, 64, 64, -64, 64, 64, 64, -64, -64, 64, 64, -64, 64, -64, 64, -64, 64, -64, -64, 64, 64, 64, 64, 64, 64, -64, 64, 64, -64, 64, 64, -64, -64, 64, -64, 64, 64, 64, -64, 64, 64, 64, 64, 64, 64, 64, -64, 64, -64, -64, 64, 64, 64, 64, 64, 64, 64, -64, 64, 64, 64, -64, 64, -64, 64, -64, 64, -64, 64, 64, -64, 64, 64, 64, 64, -64, 64, 64, 64, 64, 64, 64, 64, 64, 64, 64, 64, 64, -64, -64, 64, 64, -64, 64, -64, 64, 64, 64, 64, 64, 64, 64, 64, 64, -64, -64, 64, -64, -64, -64, -64, 64, -64, -64, 64, -64, -64, -64, 64, -64, 64, 64, -64, 64, 64, 64, 64, 64, 64, 64, -64, 64, 64, -64, 64, 64, -64, 64, 64, 64, 64, 64, 64, 64, 64, 64, -64, 64, -64, 64, -64, 64, 64, 64, 64, -64, 64, -64, 64, 64, 64, 64, 64, 64, 64, 64, -64, 64, 64, 64, 64, -64, -64, -64, -64, 64, 64, 64, 64, -64, 64, 64, -64, 64, -64, -64, -64, -64, 64, 64, -64, -64, 64, 64, 64, -64, -64, -64, -64, -64, -64, -64, 64, -64, -64, -64, -64, -64, 64, -64, -64, -64, -64, -64, 64, 64, 64, 64, 64, 64, -64, -64, -64, -64, -64, -64, -64, -64, -64, -64, 64, 64, -64, 64, -64, 64, 64, -64, -64, -64, 64, 64, 64, 64, 64, 64, 64, 64, -64, -64, -64, -64, -64, -64, -64, -64, 64, -64, 64, -64, -64, -64, 64, 64, 64, 64, 64, 64, 64, 64, 64, 64, 64, 64, 64, 64, 64, -64, -64, -64, -64, 64, -64, -64, -64, 64, 64, 64, 64, 64, -64, 64, -64, 64, -64, 64, -64, -64, 64, 64, 64, -64, -64, -64, 64, -64, -64, 64, -64, -64, -64, -64, -64, -64, -64, 64, 64, -64, 64, -64, -64, -64, 64, -64, -64, -64, 64, -64, -64, -64, -64, -64, -64, -64, -64, 64, 64, 64, 64, 64, -64, 64, 64, -64, 64, 64, -64, 64, 64, -64, -64, -64, -64, -64, -64, -64, -64, -64, -64, 64, -64, 64, 64, 64, 64, 64, -64, -64, -64, -64, 64, 64, -64, -64, -64, -64, -64, -64, -64, -64, -64, 64, 64, 64, -64, -64, -64, 64, -64, -64, 64, 64, 64, 64, -64, 64, 64, 64, 64, -64, 64, -64, 64, 64, -64, -64, -64, -64, 64, -64, 64, -64, -64, -64, -64, -64, -64, 64, -64, 64, 64, -64, 64, 64, -64, 64, -64, 64, -64, 64, 64, 64, -64, 64, 64, -64, -64, -64, -64, -64, -64, -64, -64, -64, -64, 64, 64, -64, -64, -64, 64, 64, 64, 64, 64, 64, -64, 64, 64, 64, 64, 64, -64, -64, 64, -64, -64, -64, -64, -64, -64, -64, -64, 64, 64, 64, 64, 64, 64, 64, 64, 64, 64, 64, 64, 64, 64, 64, 64, 64, 64, 64, 64, 64, 64, -64, -64, -64, -64, -64, 64, 64, 64, 64, 64, 64, 64, 64, 64, -64, 64, -64, 64, 64, 64, 64, 64, 64, 64, 64, 64, 64, 64, -64, -64, -64, 64, -64, 64, 64, -64, 64, 64, 64, 64, 64, -64, -64, -64, -64, 64, 64, 64, 64, 64, 64, 64, 64, 64, 64, 64, 64, -64, 64, 64, 64, 64, 64, 64, 64, 64, 64, 64, 64, 64, -64, 64, 64, 64, 64, -64, 64, -64, 64, 64, 64, 64, 64, 64, 64, 64, 64, 64, 64, 64, -64, 64, 64, 64, 64, 64, 64, 64, 64, -64, -64, 64, 64, -64, -64, 64, -64, 64, 64, 64, 64, 64, 64, 64, 64, 64, 64, -64, 64, 64, 64, 64, 64, 64, -64, 64, -64, 64, 64, 64, -64, -64, -64, -64, 64, -64, 64, -64, 64, 64, -64, -64, -64, 64, 64, -64, 64, 64, 64, 64, 64, 64, 64, 64, 64, -64, 64, -64, -64, -64, -64, -64, 64, -64, -64, 64, 64, -64, -64, -64, -64, -64, -64, 64, 64, 64, 64, 64, 64, 64, 64, -64, 64, 64, 64, -64, -64, -64, 64, -64, -64, -64, -64, -64, -64, -64, -64, -64, 64, -64, 64, 64, 64, 64, 64, 64, 64, 64, 64, -64, 64, 64, 64, 64, -64, -64, -64, -64, 64, -64, -64, -64, -64, -64, -64, -64, 64, 64, 64, 64, 64, 64, 64, 64, -64, 64, -64, -64, 64, -64, -64, 64, 64, 64, 64, 64, 64, 64, 64, 64, -64, -64, -64, -64, 64, 64, 64, 64, -64, 64, 64, 64, 64, 64, 64, -64, -64, -64, -64, 64, -64, -64, -64, -64, -64, 64, -64, -64, -64, -64, 64, -64, 64, -64, 64, -64, -64, 64, -64, -64, -64, -64, -64, -64, 64, 64, 64, -64, 64, -64, -64, -64, 64, 64, -64, 64, 64, -64, -64, -64, -64, -64, 64, -64, -64, -64, -64, -64, -64, -64, 64, 64, 64, -64, 64, 64, -64, -64, 64, -64, 64, 64, 64, 64, -64, 64, -64, -64, 64, 64, -64, -64, 64, 64, 64, 64, -64, -64, 64, 64, 64, 64, -64, 64, -64, -64, 64, 64, -64, 64, 64, 64, 64, 64, -64, -64, -64, 64, -64, 64, 64, 64, -64, 64, -64, -64, 64, 64, -64, 64, -64, -64, -64, -64, -64, 64, 64, 64, 64, 64, 64, 64, 64, 64, -64, -64, 64, 64, -64, 64, 64, -64, -64, 64, -64, -64, 64, -64, 64, 64, -64, 64, -64, 64, 64, 64, 64, 64, 64, 64, 64, 64, 64, 64, 64, 64, 64, 64, 64, 64, 64, 64, 64, -64, -64, -64, 64, 64, 64, -64, 64, 64, 64, 64, 64, 64, 64, 64, -64, 64, 64, 64, 64, 64, 64, 64, 64, 64, 64, -64, 64, -64, 64, 64, 64, -64, -64, 64, 64, 64, -64, 64, -64, 64, -64, -64, -64, -64, -64, -64, -64, 64, 64, 64, 64, -64, -64, -64, 64, 64, -64, -64, 64, -64, 64, 64, 64, 64, -64, -64, 64, -64, -64, -64, -64, -64, -64, -64, -64, -64, -64, -64, 64, -64, 64, 64, -64, -64, -64, 64, 64, 64, 64, 64, -64, -64, -64, -64, -64, -64, -64, -64, -64, 64, -64, 64, 64, -64, -64, 64, 64, -64, 64, 64, 64, -64, -64, 64, -64, 64, 64, 64, -64, -64, -64, -64, -64, -64, -64, 64, -64, 64, 64, 64, 64, 64, 64, 64, 64, -64, 64, 64, -64, 64, 64, 64, 64, -64, -64, 64, -64, -64, -64, -64, -64, -64, -64, -64, 64, 64, 64, -64, 64, 64, -64, 64, -64, -64, 64, 64, -64, -64, 64, 64, -64, 64, 64, 64, -64, -64, 64, -64, -64, -64, -64, 64, 64, 64, 64, 64, -64, -64, -64, -64, 64, -64, 64, 64, 64, -64, -64, 64, -64, 64, -64, -64, 64, -64, 64, -64, -64, -64, -64, -64, 64, 64, 64, 64, 64, 64, -64, 64, 64, -64, -64, 64, -64, 64, -64, -64, -64, 64, -64, -64, 64, -64, 64, 64, -64, -64, -64, 64, 64, 64, 64, 64, 64, -64, -64, -64, -64, -64, 64, 64, -64, 64, 64, -64, 64, -64, -64, -64, 64, 64, -64, -64, -64, 64, 64, 64, 64, 64, 64, 64, -64, -64, -64, -64, -64, 64, 64, -64, 64, 64, 64, 64, -64, -64, -64, -64, -64, 64, -64, -64, -64, -64, 64, 64, 64, -64, 64, -64, -64, -64, -64, -64, -64, 64, -64, -64, 64, -64, -64, -64, 64, -64, -64, -64, 64, 64, -64, -64, 64, 64, -64, -64, -64, 64, -64, 64, -64, 64, -64, -64, -64, 64, -64, -64, -64, -64, -64, -64, 64, 64, -64, -64, 64, 64, 64, -64, -64, -64, 64, -64, 64, -64, 64, 64, -64, -64, -64, 64, 64, -64, -64, -64, -64, -64, -64, -64, -64, 64, 64, -64, 64, 64, 64, -64, -64, -64, -64, -64, 64, 64, 64, 64, 64, 64, 64, 64, 64, -64, -64, -64, -64, 64, 64, -64, -64, 64, -64, -64, 64, 64, 64, -64, -64, -64, -64, -64, -64, -64, -64, 64, 64, 64, 64, 64, -64, 64, 64, 64, 64, 64, -64, -64, -64, -64, -64, 64, -64, 64, 64, 64, 64, 64, 64, 64, 64, -64, 64, 64, 64, -64, 64, 64, 64, 64, 64, 64, -64, 64, -64, 64, -64, -64, -64, 64, 64, 64, 64, 64, 64, 64, 64, 64, 64, 64, 64, 64, 64, 64, 64, 64, 64, -64, 64, 64, 64, 64, -64, 64, -64, -64, 64, 64, -64, 64, 64, 64, 64, 64, 64, 64, 64, 64, 64, 64, 64, 64, -64, 64, -64, -64, 64, -64, -64, -64, 64, -64, 64, 64, -64, -64, 64, 64, -64, 64, -64, -64, -64, -64, -64, -64, 64, 64, -64, 64, 64, -64, -64, -64, -64, -64, 64, -64, -64, 64, -64, -64, -64, 64, 64, 64, 64, -64, -64, -64, -64, -64, -64, 64, -64, -64, -64, 64, -64, 64, -64, -64, -64, 64, -64, -64, 64, 64, 64, -64, -64, -64, 64, -64, -64, -64, -64, -64, -64, -64, 64, -64, -64, -64, -64, -64, 64, 64, 64, 64, -64, 64, 64, -64, 64, 64, -64, -64, -64, 64, 64, 64, -64, 64, -64, -64, 64, -64, 64, 64, 64, 64, -64, -64, -64, -64, 64, 64, -64, -64, -64, -64, 64, 64, -64, 64, -64, 64, 64, -64, 64, 64, 64, -64, 64, 64, -64, 64, -64, -64, -64, 64, 64, -64, 64, -64, 64, -64, -64, 64, 64, 64, 64, 64, 64, 64, -64, 64, -64, -64, -64, 64, 64, 64, 64, -64, -64, -64, 64, 64, 64, -64, -64, 64, 64, 64, -64, -64, 64, 64, -64, -64, 64, -64, -64, -64, 64, -64, -64, -64, -64, 64, 64, 64, -64, 64, -64, -64, -64, 64, 64, -64, 64, 64, 64, -64, 64, 64, 64, 64, -64, 64, -64, 64, -64, 64, 64, 64, 64, 64, -64, 64, -64, 64, 64, 64, 64, 64, 64, 64, 64, -64, -64, -64, 64, 64, -64, -64, 64, 64, -64, -64, -64, -64, -64, -64, 64, 64, 64, -64, 64, 64, 64, 64, 64, 64, 64, -64, 64, -64, 64, 64, 64, -64, -64, 64, 64, 64, -64, -64, -64, 64, 64, 64, 64, -64, 64, 64, -64, 64, 64, 64, 64, 64, 64, -64, -64, -64, -64, 64, 64, 64, 64, -64, 64, 64, -64, -64, -64, -64, 64, -64, -64, -64, -64, -64, -64, 64, 64, 64, 64, 64, 64, 64, 64, -64, 64, 64, 64, -64, 64, -64, 64, 64, 64, -64, 64, 64, 64, 64, 64, -64, -64, -64, -64, -64, 64, 64, 64, 64, 64, -64, -64, -64, -64, 64, -64, 64, 64, 64, 64, 64, 64, 64, 64, 64, -64, 64, 64, 64, 64, -64, -64, 64, 64, 64, 64, 64, 64, -64, -64, -64, -64, 64, -64, 64, 64, 64, -64, 64, -64, 64, -64, 64, -64, -64, 64, 64, -64, -64, 64, -64, 64, -64, 64, 64, -64, -64, -64, -64, -64, -64, -64, -64, 64, -64, -64, -64, -64, -64, 64, 64, -64, -64, 64, -64, 64, 64, 64, -64, -64, -64, 64, 64, 64, -64, -64, -64, -64, 64, 64, -64, -64, -64, -64, -64, -64, -64, -64, -64, 64, -64, -64, -64, -64, -64, -64, -64, -64, 64, 64, 64, 64, 64, -64, -64, -64, 64, -64, -64, 64, 64, 64, -64, -64, -64, 64, 64, 64, 64, -64, -64, 64, -64, 64, -64, -64, 64, 64, 64, -64, 64, 64, 64, -64, -64, 64, 64, 64, -64, -64, -64, -64, 64, 64, -64, 64, -64, 64, -64, 64, -64, 64, 64, -64, -64, 64, 64, 64, 64, 64, 64, -64, 64, 64, 64, -64, -64, 64, 64, 64, 64, 64, 64, 64, 64, 64, 64, 64, 64, 64, 64, 64, 64, -64, 64, 64, 64, 64, 64, -64, -64, -64, -64, 64, 64, 64, 64, 64, 64, 64, 64, 64, 64, 64, 64, 64, 64, 64, -64, -64, 64, 64, 64, 64, 64, 64, 64, -64, -64, -64, 64, 64, 64, -64, -64, 64, 64, 64, 64, 64, 64, 64, 64, 64, -64, 64, 64, -64, -64, 64, 64, 64, 64, 64, -64, 64, 64, -64, -64, 64, 64, -64, 64, 64, -64, 64, 64, 64, 64, 64, 64, -64, 64, 64, -64, -64, -64, -64, 64, 64, 64, 64, -64, -64, 64, -64, 64, 64, -64, -64, 64, 64, 64, -64, 64, 64, 64, 64, -64, 64, -64, 64, -64, -64, 64, 64, 64, 64, 64, 64, -64, 64, -64, 64, -64, -64, -64, -64, 64, 64, -64, 64, 64, 64, 64, 64, 64, -64, 64, 64, -64, -64, 64, 64, 64, 64, -64, 64, -64, -64, 64, -64, -64, 64, -64, -64, 64, 64, 64, 64, 64, 64, 64, -64, 64, -64, 64, -64, -64, 64, 64, 64, 64, 64, -64, -64, -64, -64, -64, -64, -64, -64, 64, -64, 64, -64, 64, 64, 64, 64, 64, 64, -64, 64, 64, 64, -64, -64, -64, 64, 64, -64, 64, -64, 64, -64, -64, 64, -64, 64, 64, -64, -64, 64, 64, 64, 64, 64, 64, 64, 64, 64, 64, -64, 64, 64, -64, -64, 64, 64, -64, -64, -64, -64, 64, -64, 64, 64, -64, 64, 64, -64, 64, 64, 64, 64, 64, 64, -64, 64, -64, 64, 64, 64, 64, -64, -64, -64, -64, -64, -64, -64, -64, 64, 64, -64, 64, 64, -64, 64, -64, -64, 64, 64, 64, 64, 64, -64, 64, 64, 64, 64, -64, 64, -64, -64, 64, -64, -64, -64, 64, -64, 64, -64, -64, 64, -64, 64, -64, 64, 64, 64, 64, 64, -64, 64, 64, -64, 64, -64, -64, 64, 64, 64, -64, 64, -64, -64, -64, -64, -64, 64, -64, -64, 64, 64, -64, 64, 64, 64, 64, 64, -64, -64, 64, -64, -64, -64, -64, 64, -64, 64, -64, -64, 64, 64, 64, 64, 64, 64, 64, -64, 64, 64, 64, 64, -64, 64, -64, 64, 64, -64, -64, -64, -64, -64, -64, -64, -64, -64, 64, -64, -64, 64, 64, -64, 64, -64, 64, -64, -64, 64, -64, -64, -64, 64, -64, -64, 64, -64, -64, -64, -64, 64, -64, 64, 64, 64, -64, 64, 64, -64, -64, 64, 64, 64, -64, -64, -64, -64, 64, -64, -64, -64, 64, -64, 64, -64, -64, -64, -64, -64, -64, -64, -64, 64, 64, -64, 64, -64, 64, 64, 64, -64, 64, -64, 64, 64, -64, -64, -64, -64, 64, 64, -64, -64, -64, -64, 64, 64, -64, -64, 64, -64, -64, 64, 64, 64, -64, -64, -64, 64, -64, 64, -64, 64, 64, -64, -64, 64, -64, -64, 64, -64, -64, -64, -64, -64, -64, -64, -64, -64, -64, 64, -64, -64, 64, -64, 64, 64, 64, -64, -64, -64, -64, 64, 64, 64, 64, -64, 64, -64, -64, -64, 64, -64, -64, -64, -64, -64, -64, 64, 64, -64, -64, -64, -64, -64, 64, -64, 64, -64, 64, 64, 64, 64, 64, -64, -64, -64, -64, -64, -64, -64, -64, -64, 64, -64, -64, -64, -64, -64, -64, 64, 64, 64, -64, 64, -64, -64, -64, -64, 64, 64, 64, 64, -64, -64, -64, -64, -64, -64, -64, -64, 64, -64, -64, -64, -64, -64, 64, -64, 64, -64, -64, 64, -64, -64, -64, 64, 64, 64, 64, -64, 64, 64, -64, -64, -64, 64, -64, -64, 64, -64, -64, -64, -64, -64, -64, -64, -64, 64, -64, -64, -64, -64, 64, 64, 64, -64, -64, -64, -64, 64, 64, 64, 64, 64, -64, -64, -64, -64, -64, -64, -64, 64, 64, -64, -64, -64, 64, -64, 64, 64, 64, 64, -64, -64, -64, -64, -64, 64, 64, 64, 64, -64, -64, -64, -64, -64, -64, 64, -64, -64, 64, -64, 64, -64, 64, -64, -64, -64, 64, 64, -64, -64, 64, 64, 64, 64, 64, 64, 64, -64, -64, 64, -64, -64, -64, -64, 64, -64, 64, -64, -64, -64, -64, -64, -64, -64, 64, -64, -64, -64, 64, 64, -64, -64, -64, -64, -64, -64, -64, 64, -64, -64, -64, 64, 64, 64, 64, -64, 64, 64, -64, -64, 64, 64, 64, 64, 64, -64, -64, 64, 64, -64, -64, -64, -64, -64, -64, -64, -64, 64, -64, -64, 64, 64, 64, 64, -64, -64, 64, -64, 64, 64, 64, 64, -64, -64, 64, -64, -64, -64, -64, -64, -64, -64, 64, 64, -64, 64, 64, 64, 64, 64, -64, -64, 64, -64, 64, 64, -64, -64, 64, -64, 64, 64, 64, 64, -64, -64, 64, -64, 64, 64, -64, -64, -64, -64, 64, 64, -64, 64, -64, -64, 64, -64, -64, 64, 64, 64, 64, -64, 64, 64, 64, 64, 64, 64, -64, -64, 64, 64, 64, -64, -64, -64, -64, -64, -64, -64, 64, -64, -64, 64, 64, 64, 64, -64, -64, -64, 64, 64, 64, 64, 64, 64, -64, -64, -64, 64, 64, 64, 64, 64, -64, -64, -64, -64, -64, 64, -64, -64, 64, 64, 64, -64, 64, 64, 64, 64, 64, 64, 64, 64, 64, 64, 64, -64, -64, 64, 64, -64, -64, -64, 64, 64, 64, -64, 64, -64, 64, 64, 64, -64, 64, -64, 64, 64, 64, 64, 64, 64, 64, 64, 64, 64, -64, -64, -64, 64, 64, 64, 64, 64, -64, -64, -64, -64, -64, -64, 64, -64, -64, 64, -64, -64, 64, 64, 64, 64, 64, -64, 64, -64, -64, 64, 64, 64, 64, 64, 64, 64, 64, 64, 64, 64, -64, 64, -64, -64, -64, -64, -64, -64, -64, -64, 64, 64, 64, 64, 64, -64, -64, 64, 64, 64, 64, 64, 64, -64, 64, 64, -64, -64, 64, 64, -64, -64, -64, -64, -64, -64, -64, -64, 64, 64, 64, -64, -64, -64, -64, -64, -64, 64, 64, 64, 64, -64, -64, 64, 64, 64, 64, -64, 64, -64, -64, -64, -64, -64, -64, -64, 64, -64, -64, -64, -64, -64, -64, -64, -64, 64, 64, 64, -64, 64, -64, -64, -64, 64, -64, 64, -64, -64, -64, -64, -64, -64, 64, -64, 64, -64, -64, -64, -64, -64, -64, 64, 64, -64, 64, 64, 64, 64, -64, 64, -64, -64, 64, 64, 64, 64, -64, -64, -64, -64, -64, -64, -64, -64, -64, -64, -64, -64, -64, -64, 64, 64, 64, 64, 64, 64, 64, -64, 64, -64, -64, -64, 64, 64, 64, 64, -64, -64, -64, 64, 64, -64, 64, -64, 64, -64, -64, 64, 64, 64, 64, 64, 64, -64, -64, 64, -64, -64, 64, -64, 64, 64, 64, 64, -64, -64, 64, 64, 64, 64, 64, -64, 64, -64, 64, 64, 64, 64, 64, -64, -64, -64, -64, -64, 64, -64, 64, -64, 64, 64, 64, -64, -64, 64, 64, 64, 64, 64, 64, 64, 64, -64, 64, 64, 64, 64, 64, 64, -64, 64, -64, -64, -64, -64, -64, 64, -64, -64, -64, -64, -64, 64, -64, 64, 64, 64, 64, -64, -64, -64, -64, -64, -64, -64, -64, 64, 64, 64, -64, -64, 64, -64, 64, 64, -64, -64, -64, 64, -64, -64, 64, -64, 64, -64, 64, -64, -64, -64, 64, 64, -64, -64, 64, -64, -64, -64, -64, 64, 64, 64, -64, 64, 64, -64, 64, -64, 64, 64, 64, 64, 64, -64, 64, -64, 64, -64, 64, 64, -64, -64, -64, -64, -64, 64, -64, -64, 64, 64, 64, 64, 64, 64, 64, 64, 64, 64, -64, -64, -64, 64, 64, 64, 64, 64, 64, -64, 64, -64, -64, 64, -64, 64, -64, 64, 64, -64, -64, 64, 64, -64, 64, 64, -64, -64, -64, -64, -64, -64, -64, -64, 64, 64, 64, 64, 64, 64, -64, 64, -64, -64, 64, -64, -64, 64, 64, 64, 64, 64, -64, -64, -64, -64, -64, -64, -64, -64, -64, -64, 64, 64, 64, 64, -64, 64, -64, 64, -64, 64, 64, 64, 64, 64, -64, 64, -64, -64, -64, -64, -64, -64, -64, -64, -64, 64, -64, -64, 64, 64, 64, 64, 64, 64, 64, -64, -64, -64, 64, -64, -64, -64, -64, -64, -64, -64, -64, -64, -64, -64, 64, 64, 64, 64, 64, 64, 64, 64, 64, 64, 64, 64, 64, -64, -64, -64, -64, -64, -64, -64, -64, 64, -64, -64, -64, -64, -64, -64, 64, 64, 64, 64, 64, 64, 64, 64, 64, 64, 64, 64, -64, -64, -64, -64, -64, -64, 64, -64, 64, 64, 64, 64, -64, -64, -64, 64, 64, 64, 64, 64, -64, 64, 64, 64, 64, 64, 64, -64, -64, -64, -64, -64, -64, 64, 64, 64, -64, 64, 64, -64, 64, 64, -64, -64, 64, -64, -64, -64, -64, -64, 64, -64, -64, 64, -64, -64, -64, 64, -64, 64, -64, -64, 64, -64, -64, 64, 64, 64, 64, 64, 64, 64, 64, 64, -64, -64, -64, -64, -64, 64, 64, 64, 64, 64, 64, 64, 64, -64, -64, 64, -64, 64, -64, 64, 64, 64, 64, 64, -64, -64, 64, -64, -64, 64, 64, 64, 64, 64, 64, 64, 64, 64, 64, 64, 64, -64, -64, -64, 64, 64, -64, 64, 64, 64, 64, 64, 64, 64, -64, -64, -64, 64, 64, 64, -64, 64, 64, 64, 64, 64, 64, 64, 64, -64, 64, 64, 64, 64, 64, -64, 64, 64, 64, 64, 64, -64, 64, -64, -64, 64, 64, 64, 64, 64, 64, 64, 64, 64, 64, 64, 64, 64, -64, 64, -64, 64, -64, 64, 64, 64, 64, 64, 64, 64, -64, 64, 64, -64, 64, -64, 64, -64, 64, 64, 64, 64, 64, -64, 64, 64, 64, -64, -64, 64, -64, -64, 64, 64, 64, 64, -64, -64, 64, 64, 64, 64, 64, 64, 64, 64, -64, 64, 64, 64, -64, -64, 64, -64, 64, -64, 64, -64, -64, -64, -64, 64, 64, 64, 64, 64, 64, 64, 64, 64, 64, 64, 64, 64, 64, -64, 64, 64, -64, -64, -64, -64, -64, -64, -64, -64, 64, 64, 64, -64, 64, 64, 64, 64, 64, -64, -64, -64, 64, 64, 64, 64, 64, 64, -64, 64, 64, -64, -64, -64, -64, -64, -64, -64, -64, 64, 64, 64, 64, 64, -64, 64, 64, -64, -64, -64, 64, 64, 64, 64, 64, -64, -64, -64, -64, -64, -64, -64, -64, 64, -64, -64, 64, -64, 64, 64, 64, 64, 64, -64, -64, -64, -64, -64, -64, 64, 64, -64, 64, -64, 64, -64, -64, -64, -64, -64, 64, -64, -64, 64, 64, -64, -64, 64, 64, 64, 64, 64, 64, 64, -64, 64, 64, 64, -64, 64, 64, -64, -64, -64, -64, -64, -64, -64, -64, -64, -64, -64, 64, 64, -64, -64, 64, 64, 64, 64, -64, 64, -64, -64, 64, 64, -64, -64, -64, -64, -64, -64, -64, -64, 64, -64, 64, -64, 64, -64, -64, -64, 64, -64, 64, -64, -64, -64, 64, 64, -64, -64, 64, -64, 64, -64, 64, -64, -64, -64, -64, 64, -64, -64, 64, -64, 64, -64, 64, -64, 64, 64, 64, 64, 64, 64, 64, 64, 64, 64, 64, 64, 64, 64, 64, -64, -64, -64, -64, 64, 64, 64, -64, -64, -64, 64, 64, 64, 64, -64, -64, -64, 64, 64, 64, 64, 64, 64, 64, 64, 64, 64, 64, 64, 64, -64, -64, -64, -64, -64, -64, -64, 64, -64, -64, -64, 64, 64, -64, 64, -64, -64, 64, 64, -64, -64, 64, -64, 64, 64, -64, 64, 64, 64, 64, -64, -64, 64, -64, 64, -64, 64, -64, 64, 64, -64, -64, 64, 64, 64, -64, 64, 64, 64, -64, 64, 64, 64, 64, -64, 64, 64, 64, -64, 64, -64, 64, -64, -64, -64, -64, -64, 64, -64, -64, 64, 64, -64, 64, -64, 64, 64, -64, -64, 64, -64, -64, 64, 64, 64, 64, -64, -64, -64, -64, -64, 64, -64, -64, -64, -64, -64, -64, 64, -64, -64, -64, 64, -64, 64, 64, 64, -64, -64, 64, -64, 64, 64, 64, -64, -64, -64, -64, 64, 64, 64, 64, 64, -64, -64, -64, 64, -64, -64, -64, -64, -64, -64, 64, -64, 64, 64, -64, -64, -64, -64, -64, 64, 64, -64, 64, 64, -64, -64, -64, 64, -64, -64, -64, 64, 64, -64, 64, 64, 64, 64, 64, -64, -64, 64, 64, -64, -64, 64, -64, 64, 64, 64, -64, -64, -64, -64, -64, 64, -64, 64, 64, 64, 64, -64, -64, -64, 64, 64, -64, -64, -64, 64, -64, -64, 64, 64, 64, 64, -64, -64, -64, 64, -64, 64, 64, -64, -64, 64, -64, 64, -64, -64, -64, -64, -64, 64, -64, -64, -64, -64, -64, -64, -64, -64, 64, 64, 64, -64, 64, 64, -64, -64, -64, -64, 64, -64, -64, -64, -64, -64, -64, -64, -64, -64, -64, -64, -64, -64, -64, -64, -64, 64, 64, -64, 64, 64, 64, -64, -64, 64, -64, 64, -64, -64, -64, 64, -64, -64, -64, -64, -64, -64, -64, -64, -64, -64, -64, -64, 64, -64, 64, -64, 64, 64, 64, 64, -64, 64, -64, -64, -64, -64, -64, -64, -64, -64, -64, -64, -64, 64, 64, 64, 64, -64, -64, -64, -64, -64, -64, -64, -64, -64, 64, 64, -64, -64, -64, -64, 64, -64, -64, -64, -64, -64, 64, 64, 64, -64, 64, 64, 64, -64, -64, -64, -64, -64, -64, -64, -64, 64, -64, -64, 64, 64, 64, 64, -64, 64, -64, -64, -64, 64, 64, 64, 64, -64, 64, 64, 64, 64, 64, 64, -64, -64, -64, -64, -64, -64, -64, -64, 64, -64, -64, -64, 64, -64, 64, -64, -64, -64, 64, -64, -64, -64, -64, -64, -64, -64, -64, -64, -64, -64, -64, -64, 64, 64, -64, 64, 64, -64, -64, 64, -64, -64, -64, 64, -64, -64, -64, -64, -64, -64, -64, -64, -64, -64, -64, -64, -64, -64, 64, 64, 64, 64, -64, -64, -64, 64, -64, 64, -64, -64, -64, -64, -64, -64, -64, -64, -64, -64, -64, -64, -64, -64, -64, -64, -64, -64, -64, -64, 64, 64, -64, -64, -64, 64, 64, 64, -64, 64, 64, -64, -64, 64, -64, -64, -64, -64, -64, -64, -64, -64, -64, -64, -64, -64, 64, 64, 64, 64, 64, -64, 64, 64, 64, 64, -64, -64, -64, -64, -64, 64, 64, -64, 64, -64, -64, -64, -64, -64, -64, -64, 64, 64, 64, 64, 64, 64, 64, -64, -64, 64, -64, 64, -64, -64, -64, -64, -64, -64, -64, 64, 64, 64, -64, 64, -64, -64, -64, -64, -64, 64, 64, 64, 64, 64, 64, 64, 64, 64, -64, 64, -64, 64, -64, -64, -64, -64, 64, 64, 64, 64, 64, -64, -64, -64, -64, -64, -64, -64, 64, 64, 64, 64, 64, -64, -64, 64, -64, -64, 64, 64, 64, 64, 64, 64, -64, -64, 64, 64, -64, -64, 64, -64, -64, -64, -64, -64, 64, -64, 64, 64, -64, -64, 64, 64, -64, -64, 64, 64, 64, 64, 64, -64, -64, -64, 64, 64, 64, -64, 64, -64, -64, -64, -64, -64, 64, -64, -64, 64, 64, 64, 64, -64, -64, 64, -64, -64, 64, -64, -64, -64, -64, -64, -64, 64, 64, 64, -64, -64, -64, -64, -64, -64, -64, -64, 64, -64, -64, -64, 64, -64, -64, 64, -64, -64, 64, -64, -64, -64, -64, -64, 64, 64, 64, -64, -64, -64, -64, -64, -64, -64, -64, -64, 64, 64, -64, 64, -64, -64, -64, -64, -64, -64, -64, -64, -64, -64, -64, -64, 64, 64, -64, -64, -64, -64, -64, -64, -64, -64, -64, -64, 64, 64, 64, -64, 64, -64, 64, 64, 64, -64, 64, -64, -64, -64, -64, -64, 64, -64, 64, -64, -64, -64, -64, 64, -64, -64, -64, -64, -64, 64, 64, -64, 64, -64, 64, -64, -64, 64, 64, 64, 64, -64, -64, -64, 64, -64, -64, -64, -64, -64, -64, -64, -64, 64, -64, -64, -64, -64, -64, 64, -64, 64, 64, -64, 64, 64, 64, 64, -64, -64, -64, -64, 64, 64, 64, 64, -64, -64, 64, 64, 64, 64, -64, -64, -64, 64, -64, -64, 64, -64, 64, 64, 64, -64, -64, -64, -64, -64, -64, -64, 64, 64, 64, 64, -64, 64, 64, 64, -64, -64, 64, -64, 64, 64, 64, -64, 64, -64, -64, -64, -64, 64, -64, -64, -64, -64, 64, -64, -64, 64, 64, -64, -64, -64, 64, 64, -64, -64, 64, -64, 64, 64, 64, 64, 64, 64, 64, 64, 64, -64, -64, 64, -64, -64, -64, 64, 64, 64, -64, 64, 64, 64, 64, 64, -64, -64, -64, -64, -64, 64, -64, 64, -64, 64, -64, -64, 64, -64, 64, -64, 64, 64, 64, 64, -64, 64, -64, 64, 64, -64, 64, 64, -64, -64, 64, 64, 64, -64, -64, 64, 64, 64, 64, 64, 64, 64, 64, 64, -64, 64, -64, -64, 64, 64, -64, 64, 64, 64, -64, -64, -64, -64, -64, 64, -64, 64, 64, -64, -64, 64, -64, -64, 64, -64, -64, 64, 64, 64, 64, 64, -64, 64, 64, 64, -64, 64, 64, 64, 64, 64, -64, 64, 64, 64, 64, 64, 64, -64, -64, -64, 64, 64, 64, -64, -64, -64, -64, -64, -64, -64, -64, 64, 64, 64, 64, 64, -64, 64, -64, 64, 64, -64, 64, 64, 64, 64, -64, 64, 64, -64, -64, -64, -64, -64, -64, -64, -64, -64, 64, 64, 64, 64, 64, 64, 64, -64, -64, -64, 64, 64, 64, 64, 64, 64, 64, 64, -64, 64, 64, 64, -64, -64, -64, -64, 64, -64, 64, -64, -64, -64, -64, -64, 64, -64, -64, -64, -64, -64, 64, 64, -64, -64, 64, 64, -64, 64, 64, -64, -64, -64, -64, -64, -64, 64, 64, -64, -64, -64, -64, 64, -64, -64, -64, -64, -64, -64, -64, 64, 64, 64, 64, 64, -64, -64, -64, -64, -64, 64, 64, -64, 64, 64, 64, -64, -64, -64, -64, -64, -64, 64, 64, -64, -64, -64, -64, 64, 64, 64, 64, -64, -64, -64, 64, 64, 64, 64, 64, 64, -64, 64, 64, -64, -64, -64, -64, -64, 64, -64, -64, -64, -64, -64, 64, 64, -64, -64, -64, -64, 64, 64, -64, 64, 64, 64, 64, 64, 64, -64, -64, -64, -64, -64, -64, -64, 64, -64, -64, -64, -64, -64, -64, 64, 64, -64, -64, -64, -64, 64, 64, 64, 64, 64, 64, 64, 64, -64, -64, 64, -64, -64, 64, 64, -64, -64, -64, -64, -64, -64, -64, -64, 64, 64, 64, -64, 64, -64, 64, 64, -64, -64, 64, 64, -64, -64, -64, -64, -64, 64, 64, 64, -64, -64, -64, -64, -64, -64, -64, -64, 64, 64, -64, 64, -64, -64, 64, 64, -64, -64, -64, -64, -64, -64, -64, -64, -64, 64, -64, -64, 64, 64, 64, 64, -64, -64, -64, -64, -64, -64, 64, -64, 64, -64, -64, -64, -64, -64, -64, -64, -64, -64, -64, 64, -64, -64, -64, -64, 64, 64, -64, -64, 64, -64, 64, 64, -64, 64, 64, -64, -64, -64, -64, -64, -64, -64, -64, 64, -64, -64, -64, -64, -64, -64, -64, -64, -64, -64, -64, -64, -64, 64, 64, 64, 64, -64, -64, -64, -64, -64, -64, -64, 64, -64, -64, 64, -64, 64, 64, 64, 64, 64, -64, -64, -64, -64, -64, -64, -64, 64, -64, -64, -64, -64, -64, -64, -64, -64, -64, -64, 64, 64, 64, 64, 64, 64, 64, 64, 64, -64, -64, -64, -64, -64, -64, -64, -64, 64, 64, -64, 64, -64, -64, -64, -64, -64, -64, -64, 64, 64, 64, 64, 64, 64, 64, 64, 64, 64, -64, -64, -64, -64, -64, -64, -64, 64, 64, 64, -64, 64, 64, -64, -64, -64, -64, -64, -64, 64, 64, 64, 64, 64, 64, -64, 64, -64, -64, 64, -64, -64, -64, -64, 64, 64, 64, 64, 64, 64, -64, -64, -64, -64, -64, -64, -64, -64, 64, 64, -64, 64, -64, 64, 64, -64, -64, -64, -64, -64, -64, 64, 64, 64, 64, 64, 64, -64, -64, -64, -64, -64, -64, -64, 64, -64, -64, -64, -64, -64, 64, 64, -64, -64, -64, -64, 64, -64, -64, -64, 64, 64, 64, 64, -64, -64, 64, -64, -64, -64, -64, -64, -64, -64, -64, -64, -64, -64, -64, -64, -64, -64, -64, -64, 64, -64, -64, -64, -64, 64, -64, -64, 64, 64, -64, -64, -64, -64, -64, -64, -64, -64, -64, -64, -64, -64, 64, -64, -64, -64, 64, -64, 64, -64, 64, -64, -64, 64, 64, 64, 64, 64, -64, -64, -64, -64, -64, -64, -64, -64, -64, -64, -64, 64, -64, -64, 64, -64, -64, -64, 64, 64, -64, -64, -64, -64, 64, -64, 64, 64, -64, 64, -64, -64, 64, 64, -64, -64, 64, 64, -64, -64, -64, 64, -64, 64, 64, 64, 64, 64, 64, 64, 64, 64, 64, -64, -64, 64, 64, 64, -64, 64, 64, 64, -64, 64, 64, 64, 64, 64, 64, 64, -64, -64, 64, 64, 64, 64, 64, -64, -64, -64, 64, -64, 64, 64, 64, 64, -64, 64, 64, -64, 64, 64, 64, 64, -64, 64, -64, 64, -64, -64, -64, -64, 64, -64, 64, 64, 64, 64, 64, 64, 64, -64, 64, 64, 64, -64, -64, 64, 64, 64, -64, -64, -64, -64, 64, 64, 64, 64, 64, 64, -64, 64, -64, 64, -64, 64, 64, -64, 64, 64, -64, 64, -64, 64, -64, -64, 64, -64, -64, -64, 64, 64, 64, -64, -64, 64, 64, -64, 64, 64, -64, -64, 64, -64, 64, 64, -64, -64, -64, -64, 64, 64, 64, 64, 64, -64, 64, 64, 64, 64, -64, -64, -64, 64, -64, 64, 64, 64, -64, -64, -64, 64, 64, 64, -64, -64, -64, 64, -64, -64, 64, 64, 64, 64, 64, -64, 64, 64, 64, 64, -64, 64, 64, 64, 64, 64, -64, 64, -64, 64, 64, -64, 64, 64, 64, 64, -64, 64, 64, 64, -64, 64, 64, 64, -64, 64, 64, 64, -64, 64, 64, 64, 64, 64, 64, -64, 64, 64, 64, 64, 64, 64, 64, 64, -64, 64, 64, 64, 64, -64, -64, -64, -64, -64, -64, 64, 64, -64, -64, 64, -64, 64, 64, 64, -64, -64, -64, -64, 64, 64, 64, 64, 64, 64, 64, 64, 64, 64, -64, -64, -64, 64, -64, -64, -64, -64, -64, 64, 64, 64, 64, -64, 64, -64, 64, 64, 64, 64, -64, 64, -64, 64, 64, 64, 64, 64, -64, -64, -64, 64, 64, 64, -64, -64, -64, 64, -64, 64, 64, 64, 64, 64, -64, 64, 64, -64, -64, 64, -64, 64, 64, 64, -64, -64, -64, -64, -64, 64, 64, -64, -64, -64, -64, -64, -64, -64, -64, 64, 64, 64, -64, 64, -64, 64, 64, 64, 64, 64, 64, 64, 64, -64, -64, -64, -64, 64, 64, -64, -64, -64, -64, -64, -64, -64, -64, 64, 64, 64, -64, -64, 64, -64, 64, 64, 64, -64, -64, -64, -64, -64, 64, 64, -64, 64, -64, -64, -64, -64, -64, -64, -64, -64, -64, -64, -64, -64, 64, 64, 64, 64, -64, 64, 64, 64, -64, -64, -64, 64, 64, 64, 64, -64, -64, -64, 64, -64, -64, -64, -64, -64, 64, -64, -64, 64, -64, 64, -64, 64, -64, 64, 64, 64, -64, 64, 64, 64, 64, -64, 64, -64, -64, -64, 64, 64, -64, -64, -64, -64, -64, 64, -64, -64, -64, -64, -64, 64, -64, -64, 64, 64, 64, 64, 64, 64, 64, 64, -64, -64, -64, 64, 64, 64, 64, -64, -64, -64, 64, 64, -64, 64, -64, -64, -64, -64, -64, -64, 64, 64, 64, 64, 64, 64, -64, -64, -64, -64, 64, -64, 64, 64, -64, 64, 64, 64, 64, 64, -64, 64, -64, -64, -64, 64, 64, -64, 64, 64, 64, 64, 64, -64, -64, -64, -64, -64, -64, -64, -64, -64, 64, 64, 64, 64, 64, 64, 64, 64, -64, -64, 64, -64, -64, 64, 64, -64, 64, 64, 64, -64, -64, -64, -64, -64, -64, -64, -64, -64, 64, 64, 64, 64, 64, 64, -64, -64, -64, 64, -64, 64, 64, -64, -64, 64, 64, 64, 64, 64, 64, -64, 64, -64, -64, -64, -64, 64, -64, 64, 64, 64, -64, -64, -64, -64, -64, -64, -64, -64, 64, -64, 64, -64, 64, 64, 64, 64, 64, 64, 64, -64, -64, -64, -64, 64, -64, 64, -64, 64, -64, 64, -64, -64, -64, -64, -64, 64, -64, -64, -64, 64, 64, -64, 64, -64, -64, 64, 64, -64, -64, -64, 64, -64, 64, -64, -64, 64, 64, -64, -64, -64, -64, -64, 64, -64, 64, 64, -64, -64, -64, -64, 64, -64, -64, 64, -64, -64, -64, 64, 64, 64, 64, 64, 64, 64, 64, -64, 64, -64, 64, -64, -64, 64, -64, 64, -64, -64, -64, 64, -64, -64, -64, -64, -64, -64, -64, -64, 64, 64, 64, 64, -64, -64, -64, -64, -64, -64, -64, 64, -64, 64, -64, -64, -64, -64, -64, -64, -64, -64, -64, -64, -64, -64, 64, 64, 64, 64, 64, 64, -64, -64, -64, -64, -64, 64, -64, 64, -64, 64, -64, -64, -64, -64, -64, -64, -64, -64, -64, -64, -64, 64, -64, 64, 64, 64, -64, 64, -64, -64, -64, -64, -64, -64, -64, -64, 64, 64, 64, 64, 64, -64, -64, -64, -64, -64, -64, -64, 64, 64, -64, -64, 64, -64, -64, -64, -64, 64, -64, 64, 64, 64, -64, 64, 64, 64, -64, -64, -64, -64, 64, -64, 64, -64, 64, 64, 64, 64, 64, 64, 64, 64, 64, -64, 64, -64, -64, 64, 64, 64, 64, 64, 64, 64, -64, -64, 64, 64, 64, 64, 64, -64, -64, 64, 64, 64, 64, 64, 64, 64, 64, 64, 64, 64, 64, 64, -64, -64, -64, 64, 64, 64, 64, -64, 64, -64, -64, -64, 64, -64, -64, -64, 64, 64, 64, 64, 64, 64, 64, 64, 64, 64, -64, 64, -64, 64, -64, -64, -64, -64, 64, -64, 64, -64, -64, 64, -64, -64, -64, 64, 64, -64, -64, -64, 64, 64, -64, 64, -64, 64, -64, -64, 64, -64, 64, -64, 64, 64, -64, 64, -64, 64, -64, 64, 64, 64, -64, -64, -64, -64, -64, 64, -64, -64, 64, 64, 64, 64, -64, -64, -64, 64, -64, -64, 64, -64, -64, 64, -64, 64, -64, -64, -64, 64, -64, 64, 64, 64, 64, 64, -64, -64, 64, 64, -64, 64, -64, -64, 64, -64, -64, -64, 64, -64, -64, 64, -64, 64, -64, 64, -64, 64, 64, 64, 64, 64, 64, 64, -64, -64, 64, 64, 64, 64, 64, -64, -64, 64, -64, 64, -64, 64, -64, 64, 64, 64, -64, 64, -64, -64, -64, -64, -64, -64, -64, 64, -64, -64, 64, 64, 64, 64, 64, 64, 64, 64, 64, 64, -64, -64, -64, 64, 64, -64, -64, -64, -64, -64, -64, -64, -64, -64, -64, -64, -64, -64, -64, 64, 64, 64, 64, 64, 64, 64, -64, 64, -64, 64, -64, 64, 64, -64, -64, -64, -64, -64, -64, -64, -64, -64, -64, -64, -64, 64, 64, 64, 64, 64, 64, 64, 64, -64, 64, -64, 64, 64, -64, 64, 64, -64, -64, -64, -64, -64, -64, -64, -64, -64, -64, -64, -64, 64, -64, -64, 64, 64, 64, 64, 64, 64, -64, 64, 64, 64, -64, 64, 64, -64, -64, 64, -64, -64, 64, 64, -64, -64, -64, -64, -64, 64, -64, 64, 64, -64, 64, 64, 64, 64, 64, -64, -64, 64, -64, 64, 64, 64, 64, 64, 64, 64, 64, 64, 64, -64, -64, -64, -64, -64, -64, 64, -64, -64, 64, 64, 64, 64, 64, 64, -64, -64, -64, -64, 64, 64, 64, 64, 64, 64, 64, 64, 64, 64, 64, -64, -64, -64, -64, 64, -64, -64, 64, -64, -64, 64, 64, -64, 64, -64, 64, -64, 64, 64, 64, 64, 64, 64, 64, 64, 64, 64, 64, 64, -64, -64, -64, -64, -64, -64, 64, 64, 64, 64, 64, -64, 64, -64, 64, -64, 64, -64, 64, 64, 64, 64, 64, 64, 64, 64, 64, 64, 64, -64, 64, -64, 64, -64, -64, -64, 64, 64, 64, 64, 64, 64, -64, 64, 64, 64, 64, 64, -64, 64, 64, 64, 64, 64, 64, 64, -64, -64, -64, 64, 64, -64, -64, 64, 64, 64, -64, -64, 64, -64, -64, 64, 64, 64, 64, 64, -64, 64, -64, 64, 64, 64, 64, 64, 64, 64, 64, 64, 64, -64, -64, 64, 64, 64, 64, 64, 64, 64, -64, -64, -64, -64, -64, 64, 64, -64, 64, 64, 64, 64, 64, 64, 64, 64, -64, -64, -64, -64, 64, 64, 64, 64, 64, -64, 64, -64, -64, -64, -64, 64, -64, 64, 64, -64, 64, 64, 64, 64, 64, 64, 64, 64, -64, -64, -64, -64, 64, 64, 64, 64, -64, -64, 64, -64, 64, -64, -64, 64, 64, 64, -64, 64, 64, 64, 64, 64, 64, 64, 64, -64, -64, 64, -64, 64, 64, 64, 64, -64, -64, -64, -64, 64, -64, -64, -64, 64, 64, 64, 64, 64, 64, 64, 64, 64, 64, 64, -64, 64, 64, 64, 64, 64, 64, 64, 64, 64, -64, 64, -64, 64, 64, 64, -64, -64, -64, 64, 64, 64, -64, 64, -64, 64, 64, 64, -64, 64, -64, -64, -64, 64, 64, 64, 64, -64, 64, 64, 64, 64, -64, 64, -64, -64, -64, -64, -64, -64, -64, -64, -64, -64, 64, -64, 64, 64, 64, 64, -64, 64, 64, 64, 64, 64, 64, 64, -64, -64, -64, 64, 64, -64, -64, -64, -64, -64, -64, -64, 64, -64, 64, -64, -64, -64, -64, 64, 64, 64, 64, 64, -64, 64, -64, 64, -64, -64, 64, -64, 64, -64, -64, -64, -64, 64, -64, 64, 64, 64, -64, -64, -64, -64, 64, 64, 64, 64, -64, -64, -64, -64, 64, -64, 64, 64, -64, -64, -64, -64, -64, -64, -64, -64, 64, -64, 64, 64, -64, -64, -64, -64, -64, -64, 64, 64, -64, -64, -64, 64, -64, -64, -64, -64, -64, -64, -64, -64, -64, -64, -64, -64, -64, -64, 64, -64, 64, -64, 64, 64, -64, 64, 64, 64, -64, -64, 64, 64, 64, 64, 64, 64, -64, 64, -64, -64, 64, -64, 64, 64, 64, 64, 64, -64, -64, -64, -64, -64, 64, 64, 64, 64, -64, -64, -64, 64, -64, -64, -64, 64, -64, 64, 64, -64, -64, 64, -64, -64, 64, 64, 64, 64, -64, -64, -64, -64, 64, 64, 64, -64, 64, -64, 64, -64, -64, -64, 64, 64, 64, -64, -64, 64, -64, 64, 64, -64, 64, -64, -64, -64, -64, -64, 64, 64, -64, 64, -64, -64, -64, 64, -64, 64, 64, 64, 64, -64, 64, -64, -64, 64, 64, -64, -64, -64, 64, 64, 64, 64, -64, 64, -64, 64, -64, -64, 64, 64, 64, 64, -64, -64, 64, -64, 64, -64, 64, 64, -64, -64, 64, -64, -64, -64, -64, 64, 64, -64, 64, -64, 64, -64, -64, 64, -64, -64, -64, 64, 64, 64, 64, 64, 64, -64, 64, -64, -64, 64, 64, 64, 64, 64, 64, 64, 64, -64, -64, -64, -64, -64, -64, 64, -64, 64, 64, -64, -64, 64, -64, 64, -64, -64, -64, -64, -64, -64, -64, -64, -64, -64, -64, -64, -64, -64, -64, -64, -64, -64, -64, -64, -64, -64, -64, 64, 64, -64, 64, 64, -64, 64, 64, -64, 64, -64, 64, 64, 64, 64, 64, 64, 64, 64, -64, -64, 64, -64, -64, -64, -64, -64, -64, -64, -64, 64, 64, 64, 64, -64, -64, -64, -64, -64, -64, -64, -64, 64, 64, 64, 64, -64, -64, -64, -64, -64, -64, -64, -64, -64, -64, -64, -64, -64, -64, -64, 64, 64, -64, 64, -64, 64, 64, 64, 64, 64, 64, 64, 64, 64, -64, 64, 64, 64, -64, -64, -64, -64, -64, -64, -64, -64, -64, 64, -64, 64, -64, 64, 64, 64, 64, 64, 64, 64, 64, -64, -64, 64, 64, 64, -64, 64, -64, -64, -64, -64, -64, -64, -64, -64, -64, 64, 64, -64, 64, -64, 64, -64, -64, 64, 64, -64, 64, -64, -64, -64, -64, -64, -64, 64, -64, -64, -64, -64, -64, -64, -64, -64, -64, 64, 64, -64, 64, 64, 64, 64, 64, 64, 64, 64, 64, -64, -64, 64, -64, 64, 64, -64, -64, -64, -64, -64, -64, -64, -64, -64, -64, 64, -64, -64, -64, -64, 64, 64, 64, -64, 64, -64, 64, -64, -64, -64, -64, 64, 64, 64, 64, -64, 64, -64, -64, 64, -64, -64, -64, -64, -64, 64, 64, 64, 64, 64, -64, 64, -64, -64, -64, -64, -64, 64, 64, 64, 64, 64, 64, 64, 64, 64, 64, 64, 64, -64, 64, 64, 64, -64, 64, 64, -64, 64, 64, -64, -64, -64, -64, -64, -64, 64, 64, 64, 64, 64, 64, 64, 64, 64, 64, 64, 64, -64, -64, 64, -64, 64, 64, 64, -64, 64, -64, -64, -64, -64, -64, -64, 64, 64, 64, 64, 64, 64, 64, 64, 64, 64, 64, 64, 64, 64, 64, 64, 64, -64, -64, -64, 64, 64, -64, -64, -64, 64, 64, 64, 64, 64, 64, 64, 64, -64, 64, 64, 64, 64, 64, -64, 64, 64, -64, 64, 64, 64, 64, 64, -64, 64, -64, -64, -64, 64, -64, 64, 64, 64, 64, -64, -64, -64, 64, -64, 64, 64, 64, 64, 64, 64, -64, -64, -64, -64, 64, 64, 64, 64, -64, -64, -64, -64, -64, -64, -64, -64, 64, 64, -64, -64, -64, -64, 64, -64, 64, 64, 64, 64, 64, 64, 64, -64, -64, 64, 64, 64, -64, -64, -64, -64, -64, -64, -64, -64, -64, -64, -64, -64, -64, -64, 64, 64, 64, 64, 64, 64, 64, 64, -64, 64, 64, 64, 64, 64, -64, -64, -64, -64, -64, -64, -64, 64, 64, 64, -64, -64, -64, -64, 64, 64, 64, 64, 64, 64, 64, 64, 64, -64, -64, 64, 64, 64, 64, 64, -64, 64, 64, -64, 64, 64, -64, 64, -64, -64, -64, -64, 64, 64, 64, -64, 64, 64, 64, 64, 64, -64, -64, 64, 64, 64, 64, 64, 64, 64, 64, 64, 64, -64, -64, -64, -64, -64, -64, -64, -64, 64, 64, 64, 64, 64, 64, 64, -64, -64, -64, -64, 64, 64, 64, 64, 64, 64, 64, 64, 64, -64, -64, 64, -64, -64, -64, -64, 64, 64, 64, -64, -64, 64, 64, -64, -64, 64, -64, -64, 64, 64, 64, 64, 64, 64, 64, 64, -64, -64, -64, -64, -64, 64, -64, -64, 64, 64, 64, -64, -64, -64, 64, 64, -64, 64, 64, -64, 64, 64, 64, 64, 64, 64, 64, -64, -64, -64, -64, -64, -64, 64, -64, -64, 64, 64, 64, -64, -64, -64, 64, -64, -64, -64, -64, 64, 64, 64, 64, 64, 64, 64, 64, -64, -64, -64, 64, 64, 64, 64, -64, -64, -64, 64, 64, -64, -64, -64, -64, -64, -64, 64, -64, 64, -64, 64, 64, -64, -64, 64, -64, 64, 64, -64, 64, 64, 64, -64, -64, 64, -64, 64, -64, 64, -64, 64, 64, -64, -64, -64, 64, 64, 64, -64, -64, -64, -64, -64, -64, -64, -64, -64, -64, -64, -64, -64, -64, -64, 64, -64, -64, -64, -64, 64, -64, 64, 64, -64, 64, -64, 64, 64, -64, 64, -64, -64, -64, 64, -64, -64, -64, -64, -64, -64, -64, -64, -64, 64, 64, 64, 64, 64, 64, -64, 64, -64, 64, -64, -64, 64, -64, 64, 64, 64, -64, -64, -64, 64, -64, -64, -64, -64, -64, 64, -64, -64, 64, -64, 64, 64, -64, -64, -64, 64, -64, -64, -64, -64, 64, 64, -64, -64, -64, 64, -64, 64, -64, -64, -64, 64, 64, 64, 64, -64, 64, -64, -64, 64, 64, -64, 64, 64, 64, 64, 64, 64, -64, 64, -64, 64, 64, -64, 64, -64, 64, 64, 64, 64, -64, -64, -64, 64, 64, 64, 64, -64, -64, 64, -64, -64, -64, 64, -64, -64, 64, 64, 64, 64, 64, 64, 64, -64, 64, 64, -64, -64, 64, 64, -64, -64, -64, 64, -64, -64, -64, -64, -64, 64, -64, -64, -64, -64, -64, -64, -64, -64, -64, -64, 64, 64, 64, 64, -64, -64, 64, -64, -64, 64, -64, -64, -64, 64, -64, -64, -64, -64, 64, -64, -64, -64, -64, -64, 64, -64, -64, 64, 64, -64, 64, -64, -64, -64, -64, -64, -64, -64, -64, -64, -64, 64, 64, 64, -64, -64, 64, -64, 64, -64, 64, 64, -64, -64, 64, 64, 64, -64, -64, -64, -64, -64, -64, -64, -64, -64, -64, -64, -64, -64, -64, -64, 64, -64, -64, -64, -64, -64, -64, 64, 64, 64, -64, -64, -64, -64, 64, -64, -64, 64, 64, -64, 64, -64, -64, -64, -64, 64, 64, -64, -64, 64, -64, 64, 64, 64, 64, 64, -64, 64, -64, -64, 64, -64, 64, 64, -64, -64, -64, 64, -64, -64, -64, -64, 64, 64, 64, -64, -64, -64, -64, 64, -64, 64, 64, -64, -64, -64, -64, -64, -64, 64, -64, 64, -64, -64, 64, -64, -64, -64, 64, 64, 64, -64, 64, -64, -64, 64, 64, -64, -64, 64, -64, -64, 64, -64, 64, -64, -64, -64, 64, 64, -64, 64, -64, -64, -64, 64, -64, 64, -64, 64, 64, -64, 64, -64, 64, 64, -64, -64, -64, -64, -64, 64, -64, 64, 64, 64, -64, -64, -64, 64, 64, -64, -64, 64, -64, -64, -64, -64, 64, 64, -64, 64, -64, 64, -64, 64, -64, -64, -64, 64, -64, -64, -64, 64, -64, -64, 64, -64, -64, -64, -64, 64, 64, -64, 64, -64, 64, 64, -64, -64, 64, 64, -64, -64, -64, -64, -64, -64, -64, 64, 64, -64, -64, -64, 64, -64, 64, -64, -64, -64, -64, -64, -64, 64, -64, 64, -64, -64, 64, 64, 64, -64, 64, -64, -64, 64, -64, 64, -64, -64, -64, 64, -64, -64, -64, -64, -64, 64, -64, -64, -64, -64, 64, -64, 64, 64, 64, -64, 64, -64, -64, -64, 64, -64, -64, 64, 64, -64, -64, -64, -64, -64, 64, -64, 64, -64, -64, -64, 64, 64, -64, -64, -64, -64, 64, -64, -64, -64, -64, -64, -64, 64, -64, -64, -64, -64, -64, -64, -64, -64, -64, 64, -64, -64, -64, -64, 64, -64, -64, 64, 64, -64, -64, 64, -64, -64, -64, 64, 64, -64, -64, -64, -64, -64, -64, -64, 64, -64, -64, 64, 64, 64, 64, 64, -64, -64, -64, 64, 64, 64, -64, -64, -64, -64, -64, 64, 64, -64, 64, -64, -64, -64, -64, -64, -64, 64, -64, -64, -64, -64, -64, -64, 64, 64, -64, -64, -64, 64, -64, -64, -64, 64, -64, -64, 64, 64, -64, -64, -64, 64, -64, -64, -64, 64, -64, -64, 64, 64, -64, -64, -64, -64, 64, 64, 64, 64, 64, 64, 64, -64, -64, -64, -64, 64, -64, -64, -64, -64, -64, 64, -64, -64, -64, 64, 64, 64, -64, -64, -64, 64, 64, 64, 64, 64, -64, -64, 64, -64, 64, -64, -64, -64, 64, -64, -64, 64, -64, -64, -64, -64, -64, -64, -64, -64, -64, -64, 64, 64, 64, 64, -64, 64, -64, -64, 64, -64, -64, -64, -64, -64, -64, -64, -64, -64, -64, 64, -64, -64, -64, 64, 64, -64, -64, -64, 64, -64, 64, -64, 64, -64, 64, 64, -64, -64, -64, -64, -64, -64, -64, -64, -64, 64, 64, -64, -64, -64, -64, -64, -64, 64, -64, -64, -64, -64, -64, -64, 64, 64, -64, 64, 64, -64, -64, -64, 64, -64, 64, -64, -64, 64, -64, 64, -64, -64, 64, 64, -64, -64, 64, -64, -64, -64, -64, -64, 64, 64, 64, 64, 64, -64, 64, -64, -64, -64, 64, 64, -64, -64, 64, -64, -64, 64, 64, -64, -64, -64, -64, -64, 64, -64, -64, 64, -64, -64, 64, -64, -64, 64, 64, 64, -64, 64, 64, -64, 64, 64, -64, 64, 64, 64, 64, -64, 64, -64, -64, 64, 64, -64, 64, -64, -64, 64, -64, 64, -64, -64, -64, 64, -64, 64, 64, 64, 64, -64, 64, -64, 64, -64, -64, 64, 64, -64, 64, 64, 64, 64, 64, -64, 64, -64, 64, -64, 64, 64, -64, 64, -64, 64, 64, 64, -64, -64, -64, 64, 64, -64, 64, -64, -64, 64, -64, 64, 64, -64, -64, -64, 64, 64, 64, 64, -64, -64, 64, -64, -64, -64, -64, 64, 64, 64, -64, -64, 64, -64, 64, 64, -64, -64, -64, -64, 64, -64, 64, 64, 64, -64, -64, 64, 64, -64, 64, -64, -64, 64, 64, -64, 64, -64, -64, 64, -64, -64, -64, -64, 64, 64, -64, 64, -64, -64, 64, -64, 64, -64, -64, -64, -64, -64, 64, -64, -64, -64, -64, -64, -64, -64, 64, -64, -64, -64, -64, -64, -64, 64, -64, -64, -64, 64, 64, -64, -64, 64, -64, 64, -64, 64, -64, 64, -64, 64, -64, 64, 64, 64, -64, -64, -64, -64, 64, 64, 64, 64, 64, -64, 64, -64, -64, 64, 64, 64, -64, 64, 64, -64, -64, -64, -64, -64, 64, 64, 64, 64, -64, -64, -64, -64, -64, -64, 64, -64, 64, 64, -64, -64, 64, -64, 64, 64, 64, 64, -64, -64, -64, 64, -64, 64, -64, -64, -64, -64, -64, -64, -64, -64, -64, -64, 64, 64, -64, 64, -64, -64, -64, -64, 64, 64, 64, 64, -64, -64, -64, 64, 64, 64, 64, -64, -64, -64, -64, -64, -64, -64, 64, 64, 64, -64, -64, 64, -64, 64, -64, -64, 64, -64, 64, 64, -64, -64, 64, 64, 64, -64, -64, -64, -64, -64, -64, 64, -64, 64, 64, 64, 64, 64, 64, 64, 64, 64, -64, -64, -64, -64, 64, -64, 64, -64, 64, 64, -64, -64, -64, -64, -64, 64, 64, 64, 64, 64, 64, 64, 64, 64, -64, 64, 64, 64, -64, -64, -64, -64, -64, 64, 64, -64, 64, 64, -64, -64, -64, -64, 64, 64, 64, 64, 64, 64, 64, 64, 64, 64, -64, -64, 64, -64, -64, 64, -64, 64, 64, 64, 64, -64, 64, 64, -64, -64, -64, -64, 64, -64, 64, 64, 64, 64, 64, 64, 64, -64, -64, 64, 64, -64, -64, -64, 64, -64, 64, 64, -64, -64, 64, -64, -64, -64, -64, -64, 64, 64, 64, 64, 64, 64, 64, 64, 64, -64, -64, -64, 64, -64, -64, 64, -64, 64, 64, 64, -64, 64, 64, 64, 64, 64, 64, -64, -64, -64, -64, -64, -64, 64, 64, 64, 64, 64, -64, -64, -64, -64, -64, 64, -64, -64, 64, 64, -64, -64, 64, -64, 64, 64, 64, 64, -64, 64, 64, 64, -64, -64, -64, 64, 64, 64, -64, 64, 64, 64, -64, -64, 64, 64, -64, 64, 64, 64, 64, 64, 64, 64, -64, 64, -64, -64, 64, 64, 64, 64, -64, 64, 64, 64, 64, 64, -64, -64, 64, -64, -64, -64, 64, 64, -64, 64, 64, 64, 64, 64, 64, 64, -64, -64, -64, 64, 64, 64, 64, 64, 64, 64, 64, -64, 64, -64, 64, 64, -64, 64, 64, 64, 64, 64, 64, 64, 64, 64, 64, -64, -64, -64, -64, 64, 64, 64, 64, 64, -64, 64, 64, 64, 64, -64, 64, 64, 64, 64, -64, -64, -64, 64, 64, 64, 64, 64, -64, 64, -64, -64, -64, 64, 64, 64, 64, 64, 64, 64, 64, 64, 64, -64, -64, -64, 64, 64, -64, -64, 64, 64, 64, 64, 64, -64, 64, -64, -64, -64, -64, 64, 64, 64, 64, 64, -64, -64, 64, 64, 64, -64, 64, -64, 64, -64, -64, 64, 64, 64, 64, 64, 64, 64, -64, -64, -64, -64, -64, 64, -64, -64, 64, -64, -64, 64, -64, -64, 64, 64, -64, -64, -64, -64, -64, 64, -64, 64, 64, 64, 64, -64, -64, -64, -64, -64, -64, -64, -64, -64, -64, 64, -64, 64, -64, -64, -64, 64, -64, 64, -64, -64, 64, 64, 64, 64, 64, 64, 64, 64, -64, -64, -64, -64, -64, -64, -64, -64, 64, -64, -64, 64, -64, -64, -64, -64, -64, -64, 64, -64, 64, 64, 64, 64, 64, 64, 64, 64, 64, -64, -64, -64, -64, 64, -64, -64, 64, 64, -64, -64, -64, -64, -64, 64, 64, -64, 64, 64, 64, 64, 64, 64, 64, 64, 64, -64, 64, 64, -64, -64, -64, -64, -64, -64, 64, -64, -64, -64, -64, -64, 64, 64, -64, 64, -64, -64, -64, 64, -64, -64, 64, 64, 64, 64, 64, 64, -64, 64, -64, -64, -64, 64, 64, 64, 64, 64, -64, -64, -64, -64, 64, -64, -64, -64, -64, -64, 64, -64, -64, 64, 64, 64, 64, 64, 64, 64, -64, -64, -64, -64, 64, 64, -64, 64, -64, -64, -64, -64, -64, -64, -64, -64, -64, -64, -64, 64, 64, -64, -64, 64, 64, 64, 64, 64, 64, 64, -64, 64, -64, 64, -64, -64, 64, -64, -64, 64, 64, -64, 64, -64, 64, 64, 64, -64, -64, 64, 64, -64, -64, -64, -64, -64, -64, -64, -64, 64, 64, -64, -64, -64, -64, 64, 64, 64, -64, 64, -64, -64, 64, -64, -64, 64, -64, 64, 64, -64, 64, 64, 64, -64, 64, 64, 64, 64, -64, 64, -64, -64, 64, -64, -64, 64, -64, -64, -64, 64, -64, 64, -64, -64, 64, -64, -64, 64, -64, -64, -64, -64, -64, 64, 64, -64, -64, 64, -64, 64, 64, -64, 64, 64, 64, -64, -64, 64, -64, -64, -64, -64, -64, -64, 64, 64, -64, 64, -64, -64, -64, 64, 64, 64, 64, 64, -64, 64, -64, 64, 64, 64, 64, 64, -64, -64, 64, -64, 64, 64, -64, -64, 64, -64, 64, -64, -64, 64, 64, 64, 64, -64, -64, 64, -64, -64, 64, 64, 64, 64, 64, -64, -64, 64, 64, 64, 64, -64, -64, 64, 64, 64, -64, 64, -64, 64, 64, 64, 64, 64, 64, 64, -64, -64, 64, -64, -64, 64, 64, 64, -64, 64, 64, 64, -64, -64, 64, 64, 64, 64, 64, -64, 64, -64, 64, 64, 64, 64, -64, -64, 64, 64, 64, -64, -64, 64, 64, -64, -64, -64, -64, 64, 64, 64, -64, -64, -64, -64, -64, -64, 64, 64, 64, 64, 64, 64, -64, -64, -64, -64, 64, 64, -64, -64, 64, 64, 64, -64, -64, -64, 64, -64, -64, -64, -64, -64, 64, 64, 64, 64, 64, 64, 64, -64, -64, -64, -64, -64, 64, 64, 64, 64, 64, 64, 64, -64, 64, -64, 64, -64, -64, -64, -64, -64, -64, -64, 64, -64, -64, 64, -64, 64, -64, -64, -64, 64, 64, 64, 64, 64, 64, -64, -64, 64, -64, 64, -64, -64, -64, -64, -64, -64, 64, 64, -64, 64, 64, 64, 64, -64, -64, -64, -64, 64, 64, 64, 64, 64, 64, -64, 64, -64, 64, 64, -64, -64, -64, -64, -64, 64, 64, 64, 64, 64, 64, 64, -64, -64, -64, -64, -64, 64, 64, 64, 64, 64, 64, -64, -64, 64, -64, -64, -64, -64, -64, 64, 64, 64, 64, 64, 64, 64, -64, -64, -64, -64, -64, -64, -64, 64, 64, 64, 64, 64, 64, -64, -64, -64, -64, -64, 64, 64, -64, 64, 64, 64, 64, 64, 64, 64, -64, -64, -64, -64, -64, -64, 64, 64, 64, 64, 64, -64, 64, -64, -64, -64, 64, -64, -64, -64, -64, -64, 64, 64, -64, 64, -64, 64, -64, -64, -64, -64, -64, -64, -64, -64, 64, 64, -64, 64, 64, 64, 64, -64, -64, -64, -64, 64, 64, 64, 64, -64, -64, -64, -64, 64, 64, -64, -64, -64, 64, -64, -64, -64, -64, 64, 64, 64, 64, -64, 64, -64, -64, -64, 64, -64, 64, 64, 64, -64, -64, -64, 64, -64, -64, -64, -64, -64, -64, -64, -64, 64, 64, 64, 64, 64, -64, 64, 64, 64, -64, 64, 64, -64, 64, 64, 64, 64, 64, 64, 64, -64, -64, -64, -64, -64, 64, -64, -64, 64, 64, 64, 64, 64, 64, -64, 64, -64, -64, 64, 64, 64, 64, 64, 64, 64, 64, 64, 64, 64, -64, -64, 64, -64, 64, 64, 64, 64, 64, 64, 64, 64, 64, -64, -64, 64, -64, 64, -64, 64, 64, 64, 64, 64, 64, 64, 64, 64, 64, 64, -64, 64, -64, 64, 64, 64, 64, 64, 64, 64, -64, -64, 64, -64, 64, -64, -64, 64, 64, 64, 64, 64, 64, 64, 64, 64, 64, -64, 64, 64, 64, 64, 64, 64, 64, 64, 64, 64, -64, 64, -64, -64, -64, -64, 64, -64, 64, 64, 64, 64, 64, 64, 64, 64, -64, 64, -64, -64, 64, 64, 64, 64, 64, 64, 64, 64, 64, 64, 64, 64, -64, -64, -64, -64, -64, 64, 64, 64, 64, 64, 64, 64, 64, 64, 64, -64, 64, -64, 64, 64, 64, 64, 64, 64, 64, 64, -64, 64, -64, 64, -64, -64, -64, -64, -64, -64, 64, 64, 64, 64, 64, -64, -64, 64, -64, 64, 64, 64, 64, 64, 64, 64, 64, 64, 64, 64, -64, -64, -64, -64, -64, -64, -64, -64, -64, 64, -64, 64, 64, 64, 64, 64, 64, 64, 64, 64, 64, 64, 64, 64, 64, -64, 64, -64, 64, -64, -64, -64, -64, -64, -64, -64, 64, -64, 64, -64, -64, -64, -64, -64, -64, 64, 64, 64, -64, 64, 64, 64, -64, 64, -64, 64, -64, 64, -64, -64, -64, -64, -64, -64, 64, -64, -64, -64, -64, -64, -64, -64, 64, 64, -64, -64, 64, 64, -64, -64, 64, 64, -64, -64, 64, -64, 64, -64, -64, 64, -64, -64, -64, -64, -64, -64, -64, -64, -64, -64, -64, 64, 64, -64, -64, 64, 64, 64, -64, -64, -64, -64, 64, 64, -64, -64, -64, -64, -64, -64, 64, -64, 64, -64, 64, -64, -64, -64, -64, 64, -64, 64, -64, -64, 64, 64, 64, 64, -64, -64, -64, -64, 64, -64, 64, 64, -64, 64, 64, -64, -64, 64, -64, 64, 64, -64, -64, -64, -64, 64, -64, 64, 64, -64, -64, -64, -64, -64, -64, 64, -64, 64, -64, -64, 64, 64, -64, 64, 64, -64, -64, 64, 64, -64, -64, 64, -64, -64, -64, -64, -64, -64, -64, 64, -64, -64, 64, 64, -64, -64, -64, 64, 64, 64, -64, 64, -64, 64, -64, -64, -64, 64, 64, 64, 64, -64, 64, 64, -64, -64, -64, 64, 64, 64, -64, -64, -64, 64, 64, 64, 64, 64, 64, 64, 64, -64, -64, 64, 64, -64, 64, -64, -64, -64, 64, -64, -64, -64, 64, 64, 64, -64, -64, 64, -64, 64, 64, -64, -64, -64, 64, 64, 64, -64, 64, 64, 64, 64, 64, -64, -64, 64, 64, 64, 64, -64, -64, -64, -64, -64, -64, -64, 64, -64, 64, -64, 64, 64, -64, 64, 64, 64, -64, 64, 64, 64, 64, -64, 64, 64, -64, 64, -64, -64, 64, -64, -64, 64, -64, 64, 64, 64, 64, 64, 64, 64, 64, -64, 64, -64, -64, 64, 64, 64, 64, -64, -64, 64, 64, 64, -64, 64, 64, 64, -64, 64, 64, -64, 64, 64, 64, 64, -64, -64, -64, -64, 64, 64, 64, -64, 64, 64, 64, -64, 64, 64, -64, 64, 64, -64, -64, 64, -64, -64, 64, 64, -64, 64, 64, -64, 64, 64, 64, -64, 64, 64, -64, -64, 64, 64, -64, 64, 64, -64, -64, -64, 64, 64, -64, 64, -64, -64, 64, -64, -64, 64, 64, -64, -64, -64, 64, 64, 64, -64, 64, 64, 64, 64, -64, 64, 64, 64, -64, -64, -64, -64, -64, 64, 64, 64, 64, -64, 64, -64, 64, -64, 64, -64, -64, -64, 64, 64, 64, 64, 64, 64, 64, 64, 64, 64, 64, 64, 64, 64, 64, -64, 64, 64, 64, 64, 64, 64, -64, 64, 64, 64, -64, 64, 64, -64, -64, 64, -64, 64, 64, 64, 64, -64, 64, -64, -64, 64, 64, 64, 64, 64, -64, 64, -64, 64, 64, -64, -64, 64, 64, 64, 64, -64, 64, -64, -64, 64, 64, -64, -64, 64, -64, -64, 64, 64, 64, 64, -64, 64, 64, -64, -64, 64, 64, 64, 64, 64, -64, 64, -64, 64, 64, 64, 64, 64, 64, 64, -64, 64, 64, 64, -64, -64, 64, -64, 64, -64, 64, 64, 64, -64, -64, 64, -64, 64, -64, 64, -64, 64, 64, 64, 64, 64, 64, -64, 64, 64, -64, 64, -64, -64, -64, 64, 64, 64, -64, -64, -64, 64, 64, -64, -64, 64, 64, -64, 64, -64, -64, 64, 64, -64, 64, 64, 64, -64, -64, 64, -64, -64, -64, 64, 64, -64, -64, 64, 64, 64, 64, 64, 64, -64, 64, 64, 64, 64, 64, 64, 64, -64, 64, 64, 64, 64, 64, 64, -64, -64, 64, 64, 64, 64, -64, 64, 64, 64, -64, -64, 64, 64, 64, 64, 64, 64, 64, 64, -64, 64, -64, 64, -64, 64, 64, -64, 64, -64, 64, 64, 64, -64, 64, 64, 64, -64, -64, -64, 64, 64, 64, -64, 64, -64, 64, 64, 64, 64, -64, 64, 64, 64, 64, 64, 64, 64, 64, -64, 64, 64, 64, -64, -64, -64, 64, -64, -64, -64, 64, 64, -64, -64, -64, 64, -64, -64, 64, -64, 64, -64, -64, -64, -64, -64, -64, 64, 64, 64, -64, 64, -64, 64, -64, 64, 64, -64, 64, 64, -64, 64, -64, 64, 64, 64, -64, 64, 64, -64, -64, -64, 64, 64, -64, 64, -64, -64, 64, -64, 64, -64, 64, -64, 64, -64, -64, -64, -64, 64, 64, -64, 64, -64, -64, -64, 64, -64, 64, 64, 64, -64, 64, -64, 64, 64, -64, -64, 64, -64, 64, 64, -64, 64, -64, -64, 64, -64, 64, 64, 64, -64, 64, 64, 64, -64, 64, 64, 64, 64, 64, 64, 64, -64, 64, -64, -64, 64, -64, 64, 64, -64, 64, 64, -64, -64, -64, -64, -64, 64, -64, 64, 64, -64, 64, 64, 64, 64, 64, -64, -64, 64, 64, -64, -64, -64, 64, 64, 64, -64, 64, 64, 64, -64, 64, -64, 64, 64, -64, -64, -64, 64, -64, -64, -64, 64, -64, -64, -64, 64, -64, 64, -64, 64, -64, -64, 64, 64, 64, -64, 64, -64, -64, -64, 64, -64, 64, 64, 64, 64, -64, -64, -64, -64, -64, 64, 64, -64, 64, -64, -64, -64, 64, -64, 64, -64, 64, 64, 64, 64, -64, -64, 64, -64, 64, 64, -64, -64, -64, 64, 64, 64, 64, 64, 64, 64, 64, -64, -64, 64, 64, -64, 64, -64, 64, -64, -64, 64, 64, -64, -64, -64, 64, -64, -64, -64, -64, 64, -64, 64, -64, 64, 64, -64, 64, 64, 64, 64, 64, 64, -64, 64, -64, -64, -64, -64, -64, -64, -64, 64, -64, 64, -64, 64, 64, -64, -64, -64, -64, 64, 64, -64, 64, 64, 64, -64, -64, -64, 64, -64, 64, -64, 64, -64, 64, -64, 64, 64, 64, -64, 64, 64, -64, -64, -64, -64, 64, -64, -64, -64, 64, 64, 64, 64, -64, -64, 64, -64, 64, 64, 64, 64, -64, 64, -64, 64, 64, 64, -64, 64, 64, 64, 64, -64, -64, -64, -64, 64, 64, -64, -64, 64, 64, -64, -64, 64, -64, -64, 64, -64, 64, -64, 64, -64, 64, 64, 64, 64, -64, -64, -64, -64, 64, -64, -64, 64, -64, -64, 64, -64, -64, -64, -64, 64, -64, -64, 64, 64, 64, 64, 64, 64, 64, -64, 64, -64, 64, 64, -64, 64, -64, 64, -64, 64, 64, 64, -64, -64, -64, 64, 64, 64, 64, 64, 64, 64, 64, 64, 64, 64, 64, -64, 64, -64, 64, 64, -64, 64, 64, -64, 64, 64, 64, 64, -64, 64, 64, 64, 64, 64, 64, 64, -64, -64, 64, 64, 64, -64, -64, 64, 64, 64, -64, 64, -64, -64, -64, 64, 64, -64, -64, 64, -64, 64, 64, -64, 64, 64, 64, 64, -64, -64, -64, 64, 64, -64, 64, -64, 64, -64, -64, -64, -64, -64, 64, 64, -64, -64, -64, -64, 64, 64, -64, -64, -64, -64, 64, -64, -64, -64, -64, 64, 64, 64, -64, -64, -64, -64, -64, -64, -64, 64, -64, 64, 64, -64, -64, -64, -64, -64, -64, -64, -64, -64, -64, -64, -64, -64, 64, 64, 64, -64, 64, -64, -64, -64, -64, -64, 64, 64, 64, -64, 64, -64, 64, -64, -64, -64, -64, -64, -64, -64, -64, -64, -64, 64, -64, -64, 64, -64, -64, -64, -64, -64, -64, 64, -64, 64, 64, -64, -64, 64, -64, -64, -64, -64, -64, -64, -64, -64, -64, 64, 64, -64, -64, 64, 64, 64, -64, -64, -64, -64, -64, -64, 64, 64, 64, 64, 64, -64, 64, -64, -64, -64, -64, -64, 64, 64, -64, -64, -64, -64, -64, 64, 64, -64, -64, -64, -64, 64, -64, 64, 64, 64, -64, 64, -64, 64, 64, -64, -64, -64, -64, -64, -64, -64, -64, -64, -64, 64, -64, 64, 64, -64, -64, 64, -64, -64, 64, -64, 64, -64, 64, 64, 64, -64, 64, 64, 64, -64, -64, -64, -64, -64, -64, -64, -64, -64, 64, 64, 64, -64, -64, -64, -64, -64, 64, -64, -64, 64, 64, 64, -64, -64, -64, 64, 64, -64, -64, -64, -64, -64, -64, -64, 64, 64, 64, 64, 64, -64, -64, -64, -64, -64, -64, -64, -64, -64, -64, -64, -64, 64, 64, -64, 64, -64, -64, -64, -64, -64, 64, -64, -64, 64, 64, 64, -64, 64, -64, -64, -64, -64, 64, 64, -64, -64, -64, 64, 64, 64, -64, 64, 64, -64, -64, -64, -64, -64, -64, -64, -64, 64, 64, 64, 64, -64, -64, -64, 64, -64, -64, -64, -64, -64, 64, -64, 64, -64, 64, -64, -64, -64, -64, -64, -64, -64, 64, -64, 64, -64, 64, 64, 64, 64, -64, -64, -64, -64, -64, 64, 64, 64, -64, 64, 64, -64, -64, -64, 64, -64, -64, 64, -64, -64, 64, 64, 64, 64, 64, 64, 64, -64, -64, 64, 64, -64, -64, 64, 64, -64, 64, 64, 64, -64, 64, -64, 64, 64, -64, 64, 64, -64, -64, 64, 64, 64, 64, 64, 64, 64, -64, 64, 64, 64, -64, 64, -64, -64, 64, 64, 64, 64, -64, -64, 64, 64, -64, 64, 64, 64, 64, 64, 64, 64, 64, 64, -64, 64, -64, 64, -64, -64, 64, -64, -64, 64, 64, -64, 64, -64, 64, 64, 64, 64, -64, -64, 64, 64, 64, 64, -64, 64, -64, -64, 64, -64, -64, -64, -64, -64, -64, -64, -64, 64, 64, 64, -64, 64, -64, 64, -64, -64, 64, -64, -64, 64, 64, 64, 64, -64, 64, 64, 64, -64, 64, -64, -64, -64, -64, -64, -64, 64, -64, -64, 64, -64, 64, 64, 64, -64, -64, -64, -64, -64, -64, 64, 64, 64, 64, 64, -64, -64, -64, 64, -64, -64, -64, 64, 64, 64, -64, 64, -64, -64, 64, -64, -64, -64, -64, -64, 64, -64, -64, 64, 64, -64, -64, -64, -64, -64, -64, -64, -64, 64, -64, -64, -64, -64, 64, -64, 64, -64, 64, -64, -64, 64, -64, -64, -64, 64, -64, -64, -64, -64, -64, -64, -64, -64, -64, 64, -64, 64, 64, -64, -64, -64, 64, -64, 64, -64, 64, 64, 64, -64, 64, -64, -64, -64, 64, 64, 64, 64, -64, 64, -64, -64, -64, -64, 64, -64, -64, -64, -64, 64, -64, -64, -64, 64, -64, -64, 64, 64, 64, 64, 64, -64, 64, -64, 64, 64, -64, -64, 64, 64, -64, -64, 64, 64, 64, -64, -64, 64, -64, -64, 64, -64, 64, -64, 64, -64, 64, 64, -64, 64, -64, -64, 64, -64, -64, -64, 64, 64, 64, 64, -64, 64, 64, 64, -64, 64, 64, -64, -64, -64, -64, -64, 64, 64, -64, -64, 64, 64, -64, 64, -64, 64, 64, -64, 64, 64, 64, -64, -64, 64, 64, 64, -64, 64, -64, 64, 64, -64, -64, -64, -64, -64, 64, -64, -64, 64, -64, -64, -64, 64, 64, 64, 64, 64, 64, 64, 64, 64, 64, 64, 64, -64, 64, -64, -64, 64, 64, 64, 64, -64, -64, -64, 64, -64, 64, -64, -64, 64, -64, -64, -64, 64, 64, -64, -64, -64, -64, 64, 64, 64, 64, -64, -64, 64, 64, 64, 64, 64, -64, -64, 64, -64, 64, -64, -64, -64, -64, -64, -64, 64, -64, 64, -64, 64, -64, 64, 64, -64, -64, 64, 64, 64, -64, -64, 64, -64, -64, -64, 64, 64, -64, 64, -64, -64, -64, 64, -64, -64, 64, 64, -64, -64, -64, 64, 64, -64, 64, 64, -64, 64, 64, -64, -64, -64, -64, -64, 64, 64, -64, -64, 64, 64, -64, 64, -64, -64, -64, -64, -64, -64, -64, -64, 64, 64, 64, 64, -64, 64, -64, -64, -64, -64, -64, -64, -64, -64, -64, -64, -64, -64, -64, -64, -64, 64, -64, -64, -64, -64, -64, -64, -64, 64, 64, 64, -64, -64, 64, -64, -64, 64, 64, -64, 64, -64, -64, -64, -64, -64, -64, -64, 64, -64, 64, -64, 64, -64, 64, 64, 64, 64, 64, 64, 64, 64, -64, -64, -64, -64, -64, -64, 64, -64, -64, -64, 64, 64, -64, -64, -64, -64, -64, -64, -64, 64, 64, 64, 64, 64, 64, -64, 64, 64, -64, -64, -64, -64, 64, -64, 64, -64, -64, -64, -64, -64, -64, -64, 64, 64, -64, -64, -64, 64, -64, -64, 64, -64, -64, 64, 64, -64, 64, -64, -64, -64, -64, -64, -64, -64, -64, -64, -64, -64, 64, 64, -64, -64, 64, 64, -64, -64, -64, -64, -64, 64, -64, 64, 64, -64, 64, -64, 64, -64, -64, -64, -64, 64, -64, -64, -64, 64, -64, -64, -64, -64, -64, 64, -64, -64, 64, 64, -64, -64, 64, -64, 64, -64, -64, -64, -64, 64, -64, -64, -64, -64, -64, -64, 64, -64, -64, -64, -64, -64, 64, 64, -64, -64, -64, 64, -64, -64, -64, -64, -64, -64, 64, -64, -64, -64, 64, -64, -64, 64, -64, -64, 64, -64, -64, -64, -64, -64, -64, -64, 64, -64, 64, -64, -64, 64, -64, -64, 64, 64, -64, 64, -64, -64, -64, 64, -64, 64, 64, -64, 64, -64, -64, 64, -64, 64, -64, -64, -64, -64, -64, 64, -64, 64, 64, -64, 64, 64, -64, -64, -64, 64, -64, -64, -64, -64, 64, -64, -64, 64, 64, -64, -64, -64, -64, -64, -64, -64, -64, -64, -64, 64, 64, -64, -64, 64, -64, -64, 64, 64, -64, 64, 64, -64, -64, 64, 64, 64, 64, 64, -64, -64, -64, -64, 64, 64, 64, 64, 64, 64, -64, 64, -64, -64, 64, -64, -64, -64, -64, 64, 64, 64, -64, 64, 64, 64, 64, -64, -64, -64, 64, 64, -64, 64, 64, -64, -64, 64, 64, 64, 64, 64, -64, -64, -64, -64, 64, -64, 64, -64, 64, -64, 64, 64, -64, -64, -64, -64, -64, 64, -64, 64, 64, 64, -64, 64, -64, 64, 64, -64, 64, -64, -64, 64, -64, -64, -64, 64, 64, -64, 64, 64, 64, -64, 64, -64, 64, 64, -64, 64, 64, 64, -64, -64, -64, -64, -64, -64, -64, -64, 64, -64, -64, -64, -64, -64, -64, -64, 64, -64, -64, -64, 64, -64, -64, 64, -64, 64, -64, -64, -64, 64, -64, -64, 64, -64, -64, -64, -64, -64, -64, -64, -64, 64, -64, -64, 64, -64, -64, 64, -64, -64, 64, -64, 64, -64, -64, -64, -64, 64, 64, -64, 64, 64, 64, -64, -64, -64, -64, -64, -64, 64, 64, -64, 64, 64, 64, -64, -64, 64, 64, 64, 64, 64, -64, -64, 64, 64, -64, -64, -64, 64, -64, -64, 64, 64, -64, 64, -64, 64, -64, 64, -64, 64, -64, 64, -64, -64, -64, 64, 64, -64, -64, -64, -64, -64, 64, 64, 64, -64, -64, 64, 64, 64, 64, -64, -64, -64, -64, -64, -64, 64, 64, -64, -64, -64, -64, -64, -64, 64, -64, -64, -64, -64, -64, -64, 64, 64, 64, -64, 64, 64, -64, -64, -64, -64, 64, 64, 64, 64, 64, 64, 64, -64, -64, -64, -64, 64, -64, -64, 64, 64, 64, 64, 64, -64, 64, 64, 64, -64, 64, -64, 64, 64, 64, 64, -64, -64, -64, -64, 64, 64, -64, 64, 64, 64, 64, 64, -64, -64, 64, -64, -64, -64, -64, 64, -64, -64, 64, 64, 64, -64, -64, -64, 64, -64, -64, -64, -64, -64, 64, 64, 64, -64, 64, 64, 64, -64, -64, -64, 64, 64, 64, 64, -64, 64, -64, -64, -64, -64, -64, -64, -64, 64, -64, -64, -64, -64, 64, 64, -64, 64, -64, -64, 64, 64, 64, -64, -64, 64, -64, 64, 64, -64, 64, -64, -64, -64, -64, -64, -64, -64, -64, -64, 64, 64, -64, 64, -64, 64, -64, -64, -64, 64, 64, -64, -64, 64, 64, 64, 64, 64, -64, 64, -64, -64, 64, -64, 64, 64, -64, 64, -64, 64, -64, 64, 64, -64, -64, 64, 64, 64, -64, -64, -64, 64, -64, -64, -64, 64, 64, -64, -64, -64, -64, 64, -64, -64, -64, 64, -64, -64, -64, 64, 64, 64, 64, 64, -64, -64, -64, 64, -64, 64, -64, -64, -64, 64, 64, 64, 64, -64, -64, -64, -64, -64, -64, -64, -64, -64, 64, -64, 64, 64, 64, -64, 64, -64, 64, 64, -64, -64, 64, 64, 64, 64, 64, 64, 64, -64, -64, -64, -64, -64, -64, -64, 64, -64, -64, 64, -64, 64, -64, 64, 64, -64, 64, -64, -64, 64, 64, 64, 64, 64, 64, 64, 64, 64, -64, -64, -64, -64, -64, -64, -64, -64, -64, -64, -64, 64, -64, -64, -64, 64, 64, 64, -64, 64, -64, 64, 64, 64, 64, 64, -64, -64, -64, -64, -64, -64, -64, -64, -64, -64, -64, 64, -64, -64, 64, 64, 64, 64, 64, -64, -64, 64, 64, 64, 64, 64, 64, 64, -64, 64, -64, -64, -64, -64, -64, 64, 64, 64, -64, -64, -64, 64, 64, 64, 64, 64, 64, -64, -64, -64, -64, 64, 64, 64, 64, -64, 64, 64, 64, -64, -64, 64, -64, 64, 64, -64, 64, -64, -64, 64, 64, 64, 64, -64, 64, -64, -64, 64, 64, -64, 64, 64, -64, 64, -64, -64, 64, -64, -64, -64, 64, 64, -64, -64, 64, -64, -64, 64, 64, -64, 64, -64, 64, -64, 64, 64, 64, -64, 64, 64, 64, -64, -64, -64, -64, -64, -64, -64, 64, -64, -64, -64, -64, -64, -64, -64, -64, -64, -64, -64, 64, -64, -64, -64, 64, -64, 64, 64, 64, -64, -64, 64, -64, -64, 64, -64, -64, -64, -64, -64, -64, -64, -64, -64, -64, -64, -64, -64, -64, 64, 64, 64, -64, 64, 64, 64, 64, -64, -64, -64, 64, 64, -64, -64, 64, -64, -64, 64, 64, -64, -64, -64, -64, -64, -64, -64, -64, 64, 64, 64, 64, 64, 64, 64, 64, 64, -64, 64, -64, -64, 64, -64, -64, -64, 64, -64, -64, -64, 64, -64, -64, -64, -64, -64, -64, -64, 64, -64, 64, 64, 64, 64, 64, 64, -64, -64, -64, -64, 64, -64, -64, -64, -64, -64, 64, 64, 64, -64, -64, -64, -64, -64, -64, -64, 64, -64, -64, 64, -64, -64, 64, 64, 64, -64, -64, -64, -64, -64, -64, -64, -64, -64, 64, 64, 64, -64, -64, -64, -64, -64, -64, -64, -64, -64, 64, 64, -64, 64, -64, -64, -64, -64, -64, -64, -64, -64, -64, -64, -64, -64, -64, 64, 64, -64, -64, 64, -64, 64, -64, 64, 64, -64, 64, -64, -64, -64, -64, -64, -64, -64, -64, -64, -64, -64, -64, -64, -64, -64, -64, -64, -64, 64, -64, -64, -64, 64, 64, -64, -64, -64, 64, -64, -64, -64, 64, -64, -64, -64, -64, -64, -64, -64, -64, -64, 64, -64, 64, -64, 64, 64, -64, -64, -64, -64, -64, 64, -64, 64, 64, -64, -64, -64, -64, -64, -64, -64, -64, -64, -64, -64, -64, 64, -64, -64, -64, 64, 64, 64, 64, -64, -64, -64, 64, -64, 64, -64, -64, 64, -64, 64, -64, -64, -64, -64, -64, -64, -64, 64, -64, -64, 64, -64, 64, -64, 64, 64, 64, -64, -64, 64, -64, 64, 64, 64, 64, -64, -64, 64, 64, -64, -64, -64, -64, -64, -64, -64, -64, -64, 64, 64, 64, 64, -64, 64, -64, 64, -64, 64, -64, 64, 64, -64, -64, -64, 64, -64, -64, 64, -64, 64, -64, -64, -64, -64, -64, -64, -64, 64, 64, 64, -64, -64, -64, -64, 64, -64, 64, 64, -64, 64, -64, 64, -64, -64, -64, -64, -64, -64, 64, 64, 64, -64, 64, -64, -64, -64, -64, 64, -64, -64, -64, -64, 64, -64, 64, 64, -64, -64, -64, 64, 64, -64, -64, -64, -64, -64, 64, 64, -64, 64, 64, -64, 64, -64, -64, -64, 64, 64, 64, -64, -64, 64, -64, 64, 64, -64, 64, 64, 64, -64, 64, -64, 64, -64, 64, -64, 64, -64, -64, 64, -64, 64, -64, 64, -64, -64, 64, 64, 64, -64, -64, -64, -64, 64, -64, -64, 64, -64, 64, 64, -64, -64, 64, 64, -64, -64, 64, 64, 64, -64, -64, 64, -64, -64, -64, -64, 64, 64, 64, 64, -64, 64, -64, -64, -64, -64, -64, -64, -64, 64, -64, -64, -64, -64, 64, 64, -64, -64, 64, -64, -64, 64, 64, -64, -64, -64, -64, -64, 64, 64, 64, 64, -64, 64, 64, -64, -64, -64, -64, -64, 64, 64, 64, 64, -64, 64, 64, 64, 64, 64, 64, -64, -64, -64, 64, 64, 64, 64, -64, -64, 64, 64, -64, -64, 64, 64, -64, 64, 64, 64, 64, 64, 64, 64, 64, -64, -64, -64, -64, -64, -64, 64, -64, 64, 64, 64, 64, -64, 64, 64, 64, -64, -64, 64, -64, 64, -64, 64, 64, 64, 64, 64, 64, -64, -64, -64, -64, -64, 64, 64, -64, 64, -64, 64, -64, 64, -64, 64, 64, -64, -64, -64, 64, 64, 64, 64, 64, 64, 64, -64, 64, -64, -64, -64, -64, -64, -64, 64, 64, -64, -64, 64, -64, 64, 64, -64, 64, -64, 64, 64, -64, 64, 64, 64, 64, 64, 64, -64, -64, -64, -64, -64, -64, -64, 64, 64, -64, 64, 64, 64, 64, -64, -64, 64, 64, -64, -64, 64, 64, 64, 64, 64, 64, 64, 64, -64, -64, -64, 64, 64, 64, 64, 64, 64, -64, 64, 64, -64, 64, 64, 64, 64, 64, 64, 64, 64, 64, 64, 64, 64, 64, 64, -64, -64, 64, -64, 64, 64, 64, -64, 64, 64, 64, -64, -64, 64, 64, 64, 64, -64, 64, 64, 64, 64, 64, 64, 64, 64, -64, 64, -64, -64, -64, -64, 64, 64, -64, -64, 64, 64, 64, 64, 64, 64, -64, 64, 64, 64, 64, 64, -64, 64, 64, 64, 64, 64, 64, 64, 64, -64, 64, -64, 64, 64, -64, -64, -64, 64, -64, 64, 64, 64, 64, 64, -64, 64, 64, 64, 64, -64, -64, 64, 64, 64, 64, 64, 64, -64, 64, 64, 64, 64, -64, -64, 64, 64, 64, 64, -64, -64, -64, -64, 64, 64, 64, 64, -64, -64, 64, 64, 64, 64, 64, -64, 64, -64, 64, 64, 64, -64, -64, -64, 64, 64, 64, -64, 64, 64, -64, 64, 64, 64, 64, -64, -64, -64, 64, 64, 64, 64, 64, 64, 64, 64, 64, 64, 64, 64, -64, 64, 64, -64, 64, -64, -64, -64, -64, 64, 64, 64, 64, -64, -64, 64, 64, 64, -64, -64, 64, 64, 64, 64, 64, -64, -64, -64, 64, -64, 64, 64, 64, -64, -64, -64, 64, 64, 64, -64, -64, -64, 64, 64, 64, -64, 64, -64, 64, 64, 64, 64, 64, -64, 64, -64, 64, 64, 64, 64, -64, -64, -64, 64, -64, -64, -64, -64, -64, -64, 64, 64, 64, 64, -64, 64, 64, 64, 64, 64, 64, 64, -64, -64, 64, 64, 64, 64, 64, -64, -64, 64, -64, -64, -64, -64, -64, 64, 64, 64, -64, 64, -64, 64, 64, 64, 64, 64, -64, 64, 64, -64, 64, 64, 64, 64, 64, -64, -64, -64, 64, 64, -64, -64, -64, 64, -64, 64, -64, -64, -64, 64, 64, 64, -64, -64, 64, 64, -64, 64, 64, -64, -64, -64, -64, -64, -64, 64, 64, 64, 64, 64, 64, -64, 64, 64, -64, -64, 64, -64, 64, 64, -64, 64, 64, -64, 64, 64, -64, 64, 64, 64, -64, 64, 64, -64, 64, -64, -64, -64, -64, -64, -64, 64, -64, 64, 64, 64, 64, 64, 64, 64, 64, 64, -64, 64, 64, -64, 64, 64, -64, 64, -64, -64, 64, 64, 64, -64, 64, -64, 64, -64, 64, 64, 64, 64, 64, 64, 64, 64, 64, 64, -64, 64, -64, 64, 64, -64, 64, 64, -64, 64, -64, 64, 64, 64, -64, -64, -64, -64, -64, -64, 64, 64, 64, 64, -64, 64, 64, -64, -64, -64, -64, 64, -64, 64, 64, 64, -64, -64, 64, -64, 64, 64, 64, -64, -64, 64, -64, -64, -64, -64, -64, 64, 64, 64, 64, -64, -64, 64, -64, 64, -64, 64, -64, -64, -64, -64, 64, -64, 64, -64, 64, 64, 64, -64, 64, 64, 64, -64, 64, 64, 64, 64, -64, 64, -64, -64, -64, 64, 64, 64, 64, 64, 64, 64, -64, -64, 64, 64, 64, 64, -64, 64, -64, -64, -64, 64, 64, 64, 64, -64, -64, 64, -64, -64, 64, 64, 64, 64, -64, 64, -64, 64, 64, -64, 64, 64, -64, -64, -64, 64, 64, 64, -64, -64, 64, -64, 64, -64, 64, 64, 64, -64, 64, -64, -64, 64, 64, -64, -64, 64, 64, -64, 64, -64, 64, 64, 64, -64, 64, -64, -64, 64, -64, -64, 64, 64, 64, 64, -64, -64, 64, 64, 64, -64, -64, 64, 64, 64, 64, 64, -64, 64, -64, -64, -64, -64, -64, 64, 64, -64, -64, -64, -64, 64, 64, 64, -64, 64, -64, -64, 64, 64, -64, 64, -64, 64, 64, -64, 64, 64, 64, 64, -64, 64, 64, 64, 64, -64, -64, -64, 64, 64, -64, -64, -64, -64, 64, 64, -64, -64, 64, 64, 64, -64, 64, -64, 64, 64, -64, -64, -64, 64, 64, 64, 64, -64, -64, 64, 64, -64, 64, -64, -64, -64, -64, -64, 64, -64, -64, 64, -64, 64, 64, 64, 64, -64, -64, 64, -64, -64, 64, -64, 64, 64, -64, -64, -64, -64, -64, 64, 64, -64, 64, 64, 64, -64, 64, 64, -64, 64, 64, 64, 64, -64, -64, -64, 64, 64, 64, 64, -64, -64, -64, 64, -64, -64, 64, -64, 64, 64, -64, -64, -64, 64, -64, -64, -64, -64, -64, -64, 64, -64, -64, -64, -64, -64, -64, 64, -64, -64, -64, 64, 64, 64, -64, -64, 64, -64, -64, 64, 64, 64, 64, -64, -64, -64, 64, 64, -64, 64, 64, 64, 64, -64, -64, -64, -64, -64, 64, -64, -64, -64, -64, -64, -64, -64, -64, 64, -64, 64, 64, -64, -64, -64, -64, 64, -64, -64, 64, -64, -64, -64, -64, -64, -64, -64, -64, -64, -64, -64, 64, -64, 64, -64, -64, -64, 64, 64, 64, 64, -64, 64, 64, 64, 64, 64, -64, 64, -64, 64, 64, -64, -64, -64, 64, -64, -64, -64, -64, 64, -64, -64, 64, 64, -64, -64, 64, -64, 64, -64, 64, 64, 64, 64, 64, -64, -64, 64, 64, 64, -64, -64, -64, -64, 64, -64, -64, 64, 64, 64, -64, 64, -64, 64, -64, 64, -64, -64, -64, -64, -64, 64, -64, -64, 64, -64, 64, -64, -64, 64, -64, -64, -64, -64, -64, -64, -64, 64, -64, -64, -64, 64, 64, -64, 64, -64, 64, 64, -64, -64, -64, -64, 64, -64, -64, -64, -64, -64, -64, -64, -64, -64, -64, 64, -64, -64, -64, 64, -64, 64, 64, 64, -64, -64, -64, -64, -64, -64, 64, -64, 64, 64, 64, -64, -64, 64, 64, -64, -64, 64, 64, -64, -64, -64, -64, 64, 64, -64, -64, 64, 64, 64, -64, -64, -64, -64, -64, -64, 64, -64, -64, 64, -64, -64, -64, -64, 64, -64, 64, -64, -64, 64, 64, -64, 64, -64, -64, 64, -64, 64, 64, 64, -64, -64, -64, -64, 64, -64, 64, -64, 64, -64, -64, -64, -64, 64, -64, 64, -64, 64, 64, 64, -64, 64, 64, 64, -64, 64, 64, -64, -64, 64, -64, 64, -64, 64, -64, 64, -64, -64, -64, 64, 64, -64, -64, -64, -64, -64, -64, -64, 64, -64, 64, 64, -64, 64, 64, -64, -64, -64, 64, -64, -64, -64, 64, 64, -64, 64, -64, -64, 64, 64, -64, 64, 64, -64, 64, 64, -64, 64, -64, -64, -64, 64, -64, 64, -64, 64, -64, 64, -64, -64, -64, 64, 64, -64, 64, -64, -64, -64, -64, -64, 64, -64, -64, 64, -64, 64, 64, -64, 64, 64, 64, -64, -64, 64, 64, -64, -64, 64, -64, -64, -64, 64, -64, 64, 64, 64, -64, 64, -64, -64, 64, -64, 64, -64, -64, -64, 64, 64, 64, -64, -64, -64, -64, -64, -64, 64, 64, -64, -64, 64, -64, -64, 64, 64, 64, -64, 64, -64, 64, -64, 64, 64, 64, 64, 64, 64, -64, 64, 64, 64, 64, 64, 64, 64, 64, -64, -64, -64, -64, 64, -64, -64, -64, -64, -64, 64, -64, -64, -64, 64, 64, 64, 64, -64, -64, -64, 64, 64, 64, -64, -64, 64, -64, 64, -64, -64, -64, -64, -64, 64, -64, -64, -64, -64, -64, -64, 64, -64, 64, 64, -64, -64, -64, 64, -64, -64, -64, 64, -64, 64, -64, 64, -64, 64, -64, -64, 64, 64, 64, 64, 64, -64, 64, -64, 64, 64, 64, 64, 64, 64, -64, 64, 64, 64, -64, -64, -64, -64, 64, 64, -64, -64, -64, -64, -64, 64, -64, -64, -64, 64, 64, 64, 64, -64, 64, -64, -64, 64, 64, 64, 64, 64, 64, 64, 64, 64, -64, -64, 64, -64, -64, -64, 64, 64, -64, -64, 64, 64, 64, 64, 64, -64, -64, -64, 64, -64, 64, 64, -64, 64, -64, -64, -64, 64, -64, 64, -64, -64, -64, 64, -64, -64, -64, -64, -64, -64, 64, -64, -64, 64, 64, 64, -64, -64, -64, -64, -64, 64, 64, 64, 64, -64, -64, 64, 64, 64, 64, 64, 64, 64, -64, 64, 64, -64, -64, -64, -64, -64, -64, -64, -64, -64, -64, -64, -64, -64, -64, -64, 64, 64, 64, 64, 64, 64, -64, 64, 64, 64, -64, -64, 64, -64, -64, -64, 64, 64, 64, 64, 64, 64, 64, 64, 64, -64, 64, -64, 64, -64, -64, -64, -64, -64, -64, 64, 64, -64, 64, -64, 64, -64, -64, -64, -64, 64, -64, -64, 64, -64, 64, 64, -64, -64, 64, -64, -64, 64, 64, -64, 64, 64, 64, 64, -64, 64, 64, -64, 64, -64, -64, -64, 64, -64, 64, -64, 64, -64, 64, -64, -64, -64, 64, 64, 64, 64, -64, 64, -64, 64, -64, 64, 64, 64, 64, 64, 64, -64, -64, -64, 64, 64, 64, -64, -64, 64, 64, 64, -64, 64, 64, 64, 64, -64, -64, 64, 64, -64, -64, 64, -64, 64, -64, 64, 64, 64, 64, -64, -64, -64, 64, -64, -64, 64, 64, -64, 64, 64, -64, 64, -64, 64, -64, 64, -64, -64, 64, -64, -64, -64, -64, -64, -64, -64, -64, -64, -64, 64, 64, -64, 64, -64, -64, -64, -64, 64, 64, -64, -64, -64, -64, 64, -64, -64, -64, -64, 64, -64, 64, -64, 64, -64, 64, 64, 64, -64, -64, -64, -64, 64, -64, 64, -64, -64, -64, -64, 64, -64, 64, -64, -64, -64, -64, 64, 64, -64, -64, -64, 64, 64, -64, -64, -64, -64, 64, 64, 64, -64, 64, 64, 64, 64, -64, -64, -64, 64, -64, -64, -64, 64, -64, 64, 64, -64, 64, 64, 64, 64, -64, -64, 64, 64, -64, 64, 64, -64, 64, 64, 64, -64, 64, 64, 64, -64, -64, -64, -64, -64, -64, -64, 64, -64, -64, 64, -64, -64, -64, -64, -64, -64, -64, 64, 64, 64, -64, 64, 64, -64, -64, -64, 64, 64, 64, -64, -64, 64, 64, -64, -64, 64, -64, -64, -64, 64, 64, -64, 64, -64, 64, -64, 64, 64, -64, -64, 64, -64, -64, -64, -64, 64, -64, -64, -64, -64, -64, -64, -64, -64, 64, 64, 64, -64, 64, -64, -64, -64, -64, 64, 64, 64, -64, -64, 64, 64, 64, -64, -64, -64, 64, -64, -64, 64, 64, 64, -64, -64, -64, 64, 64, -64, 64, -64, 64, -64, -64, 64, -64, -64, 64, -64, 64, 64, -64, -64, 64, -64, -64, -64, -64, -64, -64, 64, -64, -64, 64, -64, -64, -64, -64, 64, -64, -64, 64, -64, -64, -64, 64, 64, 64, 64, -64, -64, -64, -64, 64, 64, 64, -64, -64, -64, 64, -64, 64, 64, 64, 64, -64, -64, 64, 64, 64, -64, -64, 64, -64, -64, -64, 64, -64, -64, -64, 64, -64, -64, 64, 64, -64, 64, 64, -64, -64, -64, -64, -64, -64, 64, 64, -64, -64, -64, 64, 64, -64, -64, 64, -64, -64, -64, -64, -64, 64, 64, -64, -64, -64, -64, 64, -64, 64, -64, 64, 64, -64, 64, 64, -64, -64, 64, -64, 64, 64, -64, -64, 64, -64, -64, -64, 64, -64, 64, -64, -64, -64, -64, -64, -64, -64, 64, -64, 64, -64, -64, -64, -64, 64, -64, 64, 64, -64, 64, 64, -64, 64, -64, -64, 64, -64, -64, -64, 64, 64, 64, -64, 64, -64, -64, -64, -64, 64, 64, 64, -64, -64, -64, 64, -64, 64, 64, -64, 64, -64, 64, -64, 64, 64, -64, -64, -64, -64, -64, -64, -64, 64, 64, 64, 64, -64, 64, 64, 64, -64, 64, 64, 64, 64, -64, 64, -64, 64, -64, -64, 64, 64, -64, -64, 64, -64, -64, -64, -64, -64, 64, -64, 64, -64, 64, 64, 64, 64, -64, 64, -64, 64, -64, -64, 64, 64, 64, -64, -64, -64, -64, -64, -64, -64, -64, -64, -64, -64, -64, -64, -64, -64, 64, 64, -64, 64, 64, -64, -64, 64, -64, 64, 64, 64, -64, -64, -64, 64, -64, -64, -64, -64, -64, 64, 64, 64, -64, -64, -64, -64, -64, -64, -64, 64, 64, -64, -64, 64, -64, -64, -64, 64, 64, 64, -64, 64, -64, -64, -64, -64, -64, 64, -64, 64, -64, 64, -64, 64, -64, -64, 64, 64, 64, -64, -64, 64, -64, 64, 64, -64, 64, -64, -64, 64, -64, -64, -64, 64, 64, -64, 64, 64, -64, 64, -64, 64, -64, -64, 64, 64, 64, -64, 64, 64, 64, -64, 64, 64, -64, -64, -64, -64, -64, 64, 64, 64, 64, 64, 64, 64, 64, 64, 64, 64, -64, -64, -64, -64, 64, 64, -64, 64, 64, -64, 64, 64, 64, 64, -64, -64, -64, -64, -64, -64, -64, 64, 64, -64, 64, 64, 64, 64, 64, -64, -64, -64, 64, -64, 64, 64, -64, -64, -64, 64, -64, -64, 64, 64, 64, -64, -64, 64, -64, 64, -64, 64, -64, -64, -64, -64, 64, -64, 64, -64, 64, -64, -64, -64, -64, 64, -64, -64, -64, 64, -64, 64, -64, 64, 64, 64, 64, -64, -64, 64, 64, 64, -64, 64, -64, 64, -64, -64, 64, -64, -64, 64, 64, 64, 64, -64, -64, 64, 64, -64, -64, 64, 64, 64, 64, -64, -64, 64, -64, 64, 64, 64, -64, 64, -64, 64, 64, 64, 64, 64, 64, -64, -64, -64, -64, -64, -64, -64, 64, -64, 64, 64, -64, -64, 64, -64, -64, 64, 64, -64, 64, -64, 64, -64, -64, 64, 64, 64, -64, 64, 64, 64, -64, -64, -64, -64, 64, -64, -64, -64, 64, -64, -64, 64, 64, 64, 64, 64, 64, 64, -64, 64, 64, -64, -64, -64, -64, -64, -64, 64, -64, 64, -64, -64, -64, -64, -64, -64, -64, 64, 64, 64, 64, 64, 64, 64, 64, 64, -64, 64, -64, -64, 64, 64, 64, -64, 64, 64, -64, -64, 64, -64, -64, -64, -64, 64, -64, -64, -64, 64, 64, 64, 64, -64, 64, 64, -64, 64, 64, -64, 64, 64, 64, 64, 64, -64, 64, -64, -64, -64, -64, -64, -64, 64, -64, 64, 64, 64, 64, -64, 64, -64, 64, 64, 64, 64, 64, -64, 64, 64, 64, 64, -64, -64, -64, 64, -64, 64, 64, -64, -64, 64, 64, -64, -64, 64, -64, 64, 64, 64, 64, 64, 64, -64, 64, -64, 64, -64, 64, 64, -64, -64, 64, -64, 64, -64, -64, -64, -64, -64, 64, -64, -64, -64, -64, 64, 64, -64, 64, -64, 64, -64, 64, 64, 64, -64, 64, -64, 64, -64, -64, -64, -64, 64, -64, -64, -64, -64, -64, -64, -64, -64, 64, 64, -64, -64, 64, 64, 64, -64, -64, -64, -64, 64, 64, -64, -64, 64, 64, 64, -64, -64, -64, -64, -64, -64, -64, -64, -64, -64, -64, 64, -64, -64, 64, 64, -64, -64, -64, -64, -64, -64, -64, -64, 64, 64, -64, -64, -64, -64, -64, -64, 64, 64, -64, -64, -64, -64, -64, -64, -64, -64, 64, -64, -64, 64, -64, 64, -64, -64, -64, -64, -64, 64, -64, 64, -64, 64, -64, 64, 64, 64, -64, -64, -64, -64, -64, 64, 64, -64, -64, -64, 64, 64, 64, 64, 64, 64, 64, 64, -64, -64, -64, -64, 64, 64, 64, 64, 64, -64, -64, 64, -64, -64, -64, 64, 64, -64, -64, -64, -64, -64, 64, 64, 64, 64, -64, -64, -64, -64, -64, -64, 64, 64, 64, 64, 64, 64, 64, 64, -64, -64, -64, 64, 64, -64, 64, -64, 64, -64, -64, -64, -64, -64, -64, -64, 64, -64, -64, -64, -64, 64, -64, -64, -64, 64, -64, 64, 64, 64, 64, -64, -64, -64, 64, -64, -64, 64, -64, -64, -64, 64, 64, -64, -64, -64, -64, -64, -64, 64, -64, -64, -64, -64, -64, -64, 64, 64, -64, -64, -64, -64, -64, 64, 64, 64, 64, 64, 64, -64, 64, -64, -64, -64, -64, -64, 64, -64, -64, -64, 64, -64, -64, -64, 64, -64, -64, -64, -64, 64, 64, -64, 64, -64, 64, -64, 64, -64, 64, -64, -64, -64, -64, 64, -64, -64, -64, -64, -64, -64, -64, 64, 64, -64, -64, 64, -64, -64, -64, 64, 64, -64, 64, -64, -64, 64, 64, -64, 64, -64, 64, 64, -64, 64, -64, -64, -64, -64, 64, 64, 64, 64, -64, -64, -64, -64, -64, -64, 64, 64, -64, 64, 64, -64, 64, 64, 64, -64, 64, 64, -64, -64, 64, -64, -64, 64, -64, -64, -64, -64, -64, -64, 64, 64, 64, -64, -64, -64, -64, 64, 64, 64, 64, 64, -64, -64, 64, -64, -64, -64, -64, -64, -64, -64, 64, -64, -64, -64, 64, -64, -64, -64, -64, 64, 64, 64, -64, 64, 64, 64, -64, -64, -64, -64, 64, 64, 64, -64, -64, -64, 64, 64, -64, -64, -64, -64, -64, 64, -64, -64, -64, 64, -64, -64, -64, -64, 64, 64, 64, -64, -64, 64, 64, -64, -64, 64, -64, 64, 64, 64, 64, -64, -64, -64, -64, 64, -64, -64, -64, 64, -64, 64, 64, 64, 64, -64, -64, 64, 64, 64, 64, 64, 64, 64, 64, 64, 64, -64, 64, -64, -64, 64, 64, 64, 64, -64, -64, 64, -64, 64, -64, -64, -64, 64, -64, 64, 64, 64, 64, 64, 64, 64, 64, -64, -64, 64, -64, -64, -64, 64, -64, 64, 64, -64, 64, 64, -64, -64, -64, -64, -64, -64, 64, 64, -64, 64, -64, -64, -64, -64, -64, -64, 64, -64, -64, -64, 64, -64, -64, 64, -64, 64, -64, -64, -64, 64, -64, -64, 64, 64, 64, -64, 64, -64, -64, -64, 64, 64, -64, 64, -64, 64, 64, -64, 64, 64, -64, -64, -64, -64, 64, 64, 64, 64, -64, 64, 64, -64, 64, 64, 64, -64, -64, -64, 64, -64, -64, -64, 64, -64, 64, 64, -64, 64, 64, -64, -64, -64, 64, -64, -64, 64, 64, 64, 64, -64, -64, 64, -64, 64, 64, -64, 64, 64, 64, -64, 64, 64, 64, -64, 64, 64, -64, 64, -64, 64, -64, -64, 64, -64, -64, 64, 64, -64, -64, -64, -64, 64, 64, 64, 64, -64, -64, 64, -64, 64, -64, -64, 64, 64, 64, 64, 64, -64, 64, 64, -64, 64, -64, -64, 64, -64, -64, 64, 64, -64, -64, 64, -64, -64, -64, 64, -64, -64, 64, 64, -64, 64, 64, -64, -64, 64, 64, 64, -64, 64, 64, 64, 64, 64, 64, -64, -64, -64, -64, -64, -64, 64, -64, 64, -64, -64, -64, -64, -64, -64, -64, -64, -64, 64, 64, 64, -64, -64, -64, -64, 64, 64, -64, 64, -64, -64, -64, -64, -64, -64, -64, -64, -64, -64, -64, -64, -64, -64, -64, -64, 64, -64, -64, 64, 64, 64, 64, 64, -64, -64, 64, -64, -64, -64, 64, 64, -64, -64, -64, -64, 64, -64, -64, -64, -64, -64, -64, -64, -64, 64, 64, 64, -64, 64, -64, 64, -64, 64, -64, 64, -64, -64, -64, 64, -64, -64, -64, 64, -64, 64, 64, 64, -64, -64, -64, -64, -64, -64, 64, 64, 64, 64, 64, 64, -64, 64, -64, 64, 64, -64, -64, 64, -64, 64, 64, 64, 64, 64, 64, -64, -64, -64, -64, -64, -64, -64, -64, 64, -64, -64, -64, 64, -64, -64, -64, -64, 64, 64, 64, 64, -64, -64, -64, -64, -64, -64, -64, -64, 64, 64, -64, -64, -64, -64, -64, -64, 64, -64, -64, -64, 64, -64, -64, -64, -64, -64, 64, -64, 64, -64, -64, -64, -64, -64, -64, 64, -64, 64, -64, -64, -64, 64, -64, -64, 64, 64, 64, -64, -64, -64, 64, 64, 64, 64, 64, -64, -64, -64, -64, -64, -64, -64, -64, -64, -64, -64, -64, -64, -64, 64, 64, 64, 64, 64, -64, 64, -64, -64, -64, -64, 64, 64, 64, -64, -64, -64, -64, -64, -64, -64, -64, -64, -64, 64, -64, -64, -64, -64, 64, -64, -64, -64, -64, 64, 64, -64, 64, -64, 64, 64, 64, 64, -64, -64, -64, -64, -64, -64, -64, 64, 64, 64, 64, 64, -64, -64, -64, 64, -64, -64, -64, 64, -64, 64, 64, 64, 64, 64, 64, 64, -64, -64, -64, -64, -64, -64, 64, 64, -64, -64, 64, -64, -64, 64, 64, 64, -64, -64, -64, -64, -64, -64, 64, -64, -64, 64, 64, 64, 64, 64, -64, -64, 64, -64, -64, 64, -64, -64, -64, -64, 64, -64, -64, 64, 64, 64, -64, 64, 64, -64, -64, 64, -64, -64, 64, -64, 64, -64, -64, 64, -64, -64, -64, -64, 64, -64, -64, -64, -64, -64, -64, -64, 64, 64, 64, -64, -64, -64, -64, -64, 64, 64, -64, -64, -64, 64, -64, -64, -64, 64, -64, -64, 64, 64, 64, 64, -64, -64, -64, -64, 64, 64, -64, -64, -64, -64, -64, -64, -64, 64, 64, -64, -64, 64, -64, -64, 64, -64, -64, -64, 64, 64, 64, 64, -64, 64, -64, -64, 64, -64, 64, 64, -64, -64, 64, -64, 64, -64, -64, -64, -64, -64, -64, 64, -64, -64, -64, -64, -64, 64, -64, -64, -64, 64, -64, -64, -64, -64, -64, 64, -64, -64, -64, -64, 64, 64, -64, -64, -64, -64, -64, -64, -64, -64, -64, 64, 64, -64, -64, 64, -64, -64, -64, 64, -64, -64, -64, 64, 64, 64, -64, 64, -64, -64, -64, -64, -64, -64, -64, -64, -64, -64, -64, 64, -64, 64, 64, -64, -64, -64, -64, -64, 64, -64, -64, 64, -64, -64, -64, -64, -64, -64, -64, -64, -64, -64, -64, -64, -64, -64, -64, -64, 64, 64, -64, -64, -64, -64, -64, 64, 64, -64, -64, -64, -64, -64, -64, -64, -64, -64, -64, -64, -64, -64, -64, -64, -64, -64, -64, -64, 64, 64, 64, 64, 64, 64, 64, 64, -64, -64, -64, -64, 64, 64, -64, -64, -64, -64, -64, -64, -64, -64, -64, -64, -64, -64, 64, 64, -64, 64, -64, 64, 64, 64, 64, -64, 64, 64, 64, 64, 64, 64, -64, -64, -64, -64, -64, -64, -64, -64, -64, -64, 64, 64, 64, 64, 64, -64, 64, 64, 64, 64, 64, 64, -64, -64, -64, 64, -64, -64, -64, 64, -64, -64, -64, 64, 64, -64, -64, -64, -64, -64, 64, 64, -64, -64, -64, -64, 64, 64, 64, 64, -64, -64, -64, -64, -64, -64, 64, 64, -64, 64, 64, -64, 64, -64, -64, -64, -64, -64, -64, -64, 64, 64, -64, 64, -64, 64, -64, -64, 64, -64, -64, -64, -64, -64, -64, -64, -64, 64, 64, -64, 64, -64, -64, -64, 64, 64, 64, -64, -64, -64, 64, -64, -64, -64, -64, -64, 64, -64, -64, -64, 64, 64, -64, 64, 64, 64, 64, -64, -64, 64, -64, 64, 64, -64, 64, -64, 64, 64, -64, 64, 64, 64, -64, -64, 64, 64, 64, -64, -64, -64, -64, -64, -64, 64, -64, -64, 64, -64, 64, 64, 64, 64, 64, 64, -64, -64, -64, 64, 64, -64, -64, 64, 64, 64, -64, -64, 64, -64, 64, 64, 64, -64, -64, 64, -64, 64, 64, 64, -64, 64, 64, 64, 64, 64, 64, -64, -64, 64, 64, 64, 64, -64, -64, -64, 64, 64, 64, -64, -64, -64, -64, -64, -64, -64, 64, 64, 64, 64, 64, 64, 64, 64, 64, 64, -64, -64, 64, 64, 64, 64, -64, 64, -64, 64, 64, -64, -64, -64, 64, 64, 64, 64, 64, 64, 64, 64, 64, 64, 64, 64, 64, 64, 64, 64, 64, 64, 64, 64, -64, 64, 64, 64, 64, 64, 64, 64, 64, 64, 64, 64, 64, 64, 64, 64, 64, -64, -64, -64, -64, -64, -64, 64, 64, 64, -64, 64, 64, 64, 64, -64, 64, -64, 64, 64, 64, 64, 64, 64, 64, 64, -64, -64, -64, -64, -64, -64, -64, -64, 64, -64, 64, 64, 64, 64, -64, 64, -64, -64, 64, -64, 64, 64, 64, 64, -64, 64, -64, 64, -64, 64, -64, -64, -64, 64, -64, -64, -64, -64, 64, 64, 64, 64, -64, 64, -64, -64, 64, 64, 64, 64, 64, 64, 64, -64, -64, -64, 64, -64, 64, -64, 64, 64, 64, -64, 64, -64, -64, 64, 64, 64, 64, -64, 64, 64, 64, -64, 64, 64, -64, 64, -64, -64, 64, 64, -64, 64, 64, 64, 64, 64, 64, 64, -64, 64, 64, 64, 64, 64, -64, -64, -64, 64, 64, -64, -64, -64, 64, -64, -64, -64, -64, 64, 64, 64, 64, 64, -64, -64, -64, -64, 64, -64, 64, 64, 64, 64, -64, -64, 64, -64, -64, -64, 64, 64, 64, -64, -64, -64, 64, 64, 64, 64, 64, 64, -64, 64, -64, 64, 64, -64, -64, 64, 64, -64, -64, 64, 64, 64, -64, -64, -64, 64, 64, 64, 64, -64, 64, 64, 64, 64, -64, -64, -64, -64, -64, -64, -64, -64, -64, -64, -64, -64, 64, 64, 64, -64, -64, -64, 64, -64, 64, -64, -64, 64, 64, 64, 64, -64, -64, -64, -64, -64, -64, 64, 64, -64, 64, 64, -64, -64, -64, -64, -64, -64, 64, 64, -64, 64, -64, 64, -64, -64, 64, -64, -64, -64, -64, -64, -64, -64, 64, 64, 64, -64, -64, 64, 64, 64, -64, 64, -64, 64, 64, -64, 64, -64, -64, -64, -64, -64, -64, -64, 64, -64, -64, -64, 64, 64, 64, 64, 64, 64, 64, 64, 64, -64, -64, 64, 64, 64, 64, 64, 64, 64, 64, -64, -64, 64, 64, -64, -64, -64, -64, 64, -64, 64, 64, 64, 64, 64, 64, 64, 64, -64, 64, 64, 64, 64, 64, 64, 64, 64, 64, 64, 64, 64, 64, -64, 64, 64, 64, 64, 64, 64, 64, 64, 64, 64, 64, 64, 64, 64, -64, 64, 64, 64, 64, 64, 64, 64, 64, 64, 64, 64, 64, 64, -64, -64, 64, -64, -64, 64, 64, 64, 64, 64, 64, 64, 64, -64, -64, -64, 64, 64, 64, -64, 64, 64, 64, 64, 64, -64, -64, 64, -64, 64, 64, 64, -64, 64, 64, 64, 64, 64, 64, 64, 64, -64, -64, 64, -64, 64, 64, 64, 64, 64, 64, 64, 64, 64, 64, 64, 64, 64, 64, 64, 64, 64, 64, 64, -64, 64, 64, 64, 64, -64, -64, 64, 64, -64, 64, -64, 64, 64, -64, -64, -64, 64, 64, 64, 64, 64, 64, 64, 64, 64, 64, 64, 64, 64, 64, -64, 64, -64, 64, 64, -64, -64, -64, 64, -64, -64, -64, -64, 64, -64, 64, 64, 64, 64, 64, 64, -64, 64, 64, 64, -64, 64, -64, 64, -64, 64, 64, 64, -64, 64, 64, 64, -64, -64, -64, -64, -64, 64, 64, 64, 64, 64, 64, 64, 64, -64, 64, -64, 64, 64, 64, 64, 64, 64, -64, 64, 64, 64, -64, -64, -64, -64, -64, -64, -64, -64, -64, -64, 64, -64, -64, -64, -64, -64, 64, -64, 64, 64, 64, -64, 64, 64, 64, -64, -64, 64, 64, 64, -64, -64, -64, -64, -64, -64, -64, -64, 64, -64, -64, -64, -64, 64, 64, -64, -64, 64, 64, 64, 64, -64, -64, -64, 64, -64, 64, -64, 64, -64, 64, 64, -64, -64, -64, -64, 64, -64, 64, -64, 64, -64, -64, 64, -64, -64, 64, -64, -64, 64, -64, 64, 64, 64, -64, -64, 64, -64, 64, -64, 64, -64, -64, -64, -64, -64, 64, 64, 64, 64, -64, 64, -64, 64, 64, 64, 64, -64, -64, -64, -64, -64, -64, 64, -64, -64, -64, 64, 64, 64, 64, 64, -64, -64, -64, 64, -64, -64, -64, -64, 64, 64, 64, 64, -64, 64, -64, -64, -64, 64, 64, 64, 64, -64, -64, 64, 64, 64, -64, 64, 64, -64, -64, -64, 64, 64, 64, 64, -64, 64, 64, 64, -64, -64, -64, 64, 64, 64, -64, 64, -64, -64, -64, 64, 64, 64, -64, -64, -64, -64, -64, -64, -64, 64, 64, 64, -64, -64, 64, 64, 64, 64, -64, -64, -64, 64, 64, -64, -64, -64, -64, 64, -64, 64, -64, -64, -64, -64, -64, -64, -64, -64, -64, -64, -64, 64, -64, 64, 64, -64, -64, 64, 64, -64, -64, 64, 64, 64, -64, -64, 64, 64, -64, -64, -64, -64, -64, -64, -64, -64, -64, -64, -64, -64, 64, 64, 64, 64, -64, 64, -64, -64, -64, -64, -64, -64, -64, 64, 64, -64, -64, -64, -64, -64, -64, -64, -64, -64, -64, -64, -64, -64, -64, 64, -64, -64, 64, 64, 64, -64, 64, -64, 64, 64, 64, 64, 64, 64, -64, -64, -64, -64, -64, -64, -64, -64, -64, -64, 64, -64, -64, 64, -64, -64, -64, 64, 64, -64, -64, 64, -64, 64, 64, 64, 64, -64, -64, -64, -64, -64, -64, -64, -64, -64, -64, 64, -64, -64, -64, -64, -64, -64, 64, 64, -64, 64, -64, 64, -64, -64, 64, 64, -64, -64, -64, 64, 64, -64, -64, -64, -64, -64, -64, 64, 64, -64, -64, 64, -64, -64, 64, 64, 64, 64, 64, 64, -64, -64, 64, 64, 64, 64, 64, 64, 64, 64, -64, -64, -64, 64, 64, 64, 64, 64, 64, 64, -64, 64, 64, 64, -64, -64, 64, 64, 64, 64, 64, 64, 64, 64, -64, 64, -64, 64, 64, 64, -64, -64, 64, 64, 64, 64, 64, 64, -64, 64, -64, 64, 64, 64, 64, 64, 64, 64, 64, 64, 64, 64, -64, 64, -64, 64, 64, 64, 64, 64, 64, 64, 64, 64, 64, 64, 64, -64, 64, -64, -64, 64, 64, 64, 64, 64, 64, 64, -64, -64, 64, 64, -64, 64, 64, -64, -64, 64, 64, 64, 64, 64, 64, -64, 64, -64, -64, -64, 64, 64, -64, 64, 64, 64, 64, -64, -64, -64, 64, 64, -64, -64, 64, -64, 64, 64, 64, -64, -64, 64, -64, -64, 64, -64, -64, 64, -64, 64, 64, -64, 64, -64, 64, -64, -64, -64, -64, -64, -64, -64, -64, -64, -64, -64, -64, 64, 64, 64, -64, -64, -64, 64, -64, -64, -64, 64, 64, -64, 64, -64, 64, -64, -64, -64, -64, -64, -64, -64, -64, 64, -64, -64, 64, 64, -64, -64, -64, -64, -64, -64, -64, 64, -64, -64, -64, -64, -64, -64, -64, 64, -64, -64, -64, -64, -64, -64, -64, -64, 64, 64, 64, -64, -64, 64, -64, -64, -64, 64, 64, 64, 64, -64, -64, -64, -64, -64, 64, 64, -64, -64, -64, -64, 64, -64, 64, -64, -64, -64, -64, 64, -64, -64, -64, -64, 64, 64, 64, -64, -64, -64, 64, -64, -64, -64, -64, -64, -64, 64, -64, -64, 64, -64, -64, -64, -64, -64, -64, -64, -64, -64, -64, -64, -64, 64, 64, -64, -64, 64, -64, 64, -64, 64, -64, -64, -64, -64, -64, -64, 64, 64, 64, 64, -64, 64, -64, -64, -64, -64, -64, -64, 64, 64, 64, 64, -64, 64, -64, -64, -64, 64, -64, -64, -64, -64, -64, -64, -64, -64, -64, -64, 64, 64, -64, -64, -64, -64, -64, -64, -64, -64, 64, 64, 64, -64, -64, -64, -64, 64, 64, -64, 64, -64, -64, -64, -64, -64, -64, -64, 64, -64, -64, -64, -64, -64, -64, -64, 64, -64, -64, 64, -64, 64, 64, -64, -64, 64, 64, -64, -64, -64, 64, -64, -64, -64, -64, -64, 64, 64, -64, -64, -64, -64, -64, -64, -64, 64, -64, 64, -64, -64, -64, -64, -64, 64, -64, -64, -64, 64, 64, 64, -64, 64, -64, 64, 64, -64, 64, 64, 64, -64, -64, 64, 64, -64, 64, -64, -64, 64, 64, 64, 64, -64, -64, 64, 64, 64, 64, 64, 64, -64, 64, -64, -64, 64, -64, -64, -64, 64, -64, 64, 64, 64, 64, 64, 64, -64, 64, 64, 64, -64, 64, 64, 64, 64, 64, 64, 64, -64, -64, 64, 64, 64, 64, 64, -64, 64, 64, 64, -64, -64, -64, -64, 64, -64, 64, -64, 64, -64, -64, 64, 64, 64, 64, 64, 64, 64, 64, 64, 64, 64, -64, 64, 64, 64, -64, -64, 64, -64, 64, 64, 64, -64, 64, -64, 64, -64, 64, 64, 64, 64, 64, 64, -64, 64, 64, 64, 64, 64, 64, 64, -64, 64, -64, 64, -64, -64, 64, 64, -64, -64, 64, 64, 64, 64, 64, -64, -64, 64, -64, -64, 64, 64, 64, 64, 64, -64, -64, -64, -64, -64, -64, 64, 64, 64, -64, -64, 64, -64, -64, 64, -64, 64, 64, 64, 64, 64, 64, -64, -64, 64, 64, 64, -64, -64, -64, -64, -64, -64, -64, -64, 64, -64, 64, -64, -64, 64, -64, -64, -64, -64, 64, -64, -64, 64, 64, 64, 64, 64, 64, -64, -64, -64, -64, 64, 64, -64, -64, 64, 64, 64, 64, 64, 64, 64, -64, 64, 64, 64, -64, 64, 64, 64, -64, 64, -64, -64, -64, -64, -64, -64, -64, -64, -64, 64, -64, 64, 64, 64, 64, -64, -64, -64, 64, -64, 64, 64, 64, 64, -64, 64, 64, -64, 64, -64, 64, 64, 64, 64, 64, 64, -64, -64, -64, -64, 64, -64, -64, 64, 64, -64, -64, -64, -64, 64, 64, 64, 64, 64, 64, 64, 64, 64, -64, -64, -64, -64, 64, -64, -64, -64, -64, -64, 64, 64, 64, 64, -64, -64, 64, 64, -64, 64, 64, 64, 64, 64, 64, 64, 64, 64, 64, 64, 64, 64, 64, 64, -64, -64, -64, -64, -64, 64, 64, -64, -64, -64, -64, -64, 64, 64, 64, 64, 64, 64, 64, 64, 64, 64, 64, 64, 64, 64, -64, 64, -64, -64, -64, -64, 64, 64, -64, 64, -64, 64, -64, -64, -64, 64, -64, -64, -64, -64, -64, -64, -64, 64, -64, 64, -64, -64, -64, 64, -64, 64, 64, -64, -64, -64, 64, 64, -64, 64, -64, -64, 64, -64, -64, -64, -64, -64, -64, -64, -64, -64, -64, 64, -64, -64, -64, -64, -64, -64, 64, -64, -64, 64, -64, -64, -64, -64, 64, -64, 64, -64, -64, -64, -64, -64, -64, -64, -64, -64, -64, -64, -64, -64, -64, -64, -64, -64, 64, 64, -64, -64, -64, -64, 64, -64, -64, -64, -64, -64, -64, -64, -64, -64, -64, -64, -64, -64, -64, -64, -64, -64, -64, -64, -64, -64, -64, 64, -64, 64, 64, -64, 64, 64, -64, 64, -64, -64, -64, -64, -64, -64, -64, -64, -64, -64, -64, -64, -64, -64, -64, -64, -64, -64, 64, 64, 64, 64, 64, 64, -64, -64, -64, -64, -64, 64, -64, -64, -64, -64, -64, -64, 64, 64, 64, -64, -64, -64, 64, 64, 64, 64, 64, 64, 64, 64, -64, -64, 64, 64, -64, 64, 64, 64, -64, 64, 64, 64, -64, 64, 64, 64, -64, -64, -64, -64, 64, 64, 64, 64, 64, -64, 64, -64, -64, 64, -64, 64, 64, 64, 64, 64, 64, 64, 64, 64, 64, 64, 64, 64, 64, 64, -64, -64, 64, 64, 64, -64, 64, 64, 64, -64, -64, -64, -64, 64, -64, 64, 64, 64, 64, 64, 64, -64, -64, 64, 64, -64, 64, 64, -64, 64, 64, 64, 64, 64, 64, 64, 64, -64, 64, 64, 64, -64, 64, 64, 64, -64, 64, 64, -64, 64, -64, -64, -64, 64, -64, -64, 64, 64, 64, 64, 64, 64, 64, 64, 64, 64, 64, -64, 64, 64, 64, 64, 64, 64, -64, -64, -64, -64, -64, -64, -64, -64, -64, -64, -64, 64, 64, -64, -64, -64, 64, 64, 64, -64, -64, 64, 64, -64, -64, 64, -64, -64, -64, -64, -64, -64, -64, 64, -64, -64, -64, -64, -64, -64, -64, -64, -64, -64, -64, -64, 64, 64, 64, -64, 64, -64, -64, -64, 64, -64, -64, -64, -64, -64, -64, -64, 64, -64, -64, -64, -64, -64, -64, -64, -64, -64, -64, 64, 64, 64, -64, -64, 64, -64, 64, -64, -64, -64, -64, 64, -64, -64, -64, -64, 64, -64, -64, -64, -64, -64, 64, 64, -64, 64, -64, 64, 64, -64, -64, -64, 64, 64, 64, -64, -64, -64, -64, 64, 64, -64, -64, -64, -64, -64, 64, 64, 64, 64, 64, -64, 64, -64, -64, -64, 64, -64, 64, 64, 64, 64, 64, -64, -64, -64, 64, -64, 64, -64, -64, 64, 64, -64, 64, -64, 64, -64, 64, 64, 64, -64, 64, -64, 64, 64, -64, 64, -64, -64, 64, 64, -64, 64, 64, 64, 64, 64, 64, 64, 64, 64, -64, -64, 64, -64, 64, 64, 64, 64, 64, -64, 64, -64, 64, -64, 64, -64, 64, 64, 64, -64, -64, -64, -64, 64, 64, 64, -64, 64, 64, -64, 64, 64, 64, -64, -64, -64, 64, 64, 64, 64, 64, 64, -64, -64, -64, 64, 64, 64, 64, 64, -64, -64, -64, 64, -64, -64, 64, 64, -64, -64, 64, -64, 64, 64, -64, 64, -64, -64, 64, -64, 64, -64, 64, -64, 64, -64, 64, -64, -64, 64, 64, -64, -64, -64, 64, -64, 64, 64, -64, 64, 64, -64, 64, 64, 64, 64, 64, 64, -64, -64, -64, -64, -64, 64, 64, -64, 64, 64, 64, -64, 64, -64, 64, -64, -64, 64, -64, -64, -64, 64, 64, -64, 64, 64, 64, 64, -64, -64, -64, -64, -64, -64, 64, 64, -64, 64, -64, -64, -64, -64, -64, 64, -64, -64, -64, -64, -64, -64, -64, -64, -64, -64, 64, -64, 64, 64, -64, -64, -64, -64, -64, -64, -64, -64, 64, -64, -64, -64, -64, -64, -64, -64, -64, -64, -64, 64, 64, -64, 64, -64, 64, -64, 64, 64, -64, -64, 64, 64, -64, -64, -64, -64, 64, 64, 64, 64, 64, 64, 64, -64, 64, 64, 64, -64, 64, -64, 64, 64, 64, 64, 64, -64, -64, 64, 64, -64, -64, 64, 64, 64, 64, 64, 64, 64, 64, -64, 64, 64, 64, 64, 64, 64, 64, 64, -64, 64, -64, 64, 64, 64, 64, 64, 64, 64, 64, 64, 64, -64, 64, 64, 64, 64, 64, 64, 64, 64, 64, 64, 64, 64, 64, 64, 64, 64, -64, 64, 64, 64, -64, -64, 64, -64, -64, 64, 64, 64, -64, 64, 64, 64, 64, 64, 64, 64, -64, 64, 64, 64, 64, 64, -64, 64, -64, -64, -64, -64, -64, 64, 64, 64, 64, -64, -64, -64, 64, -64, 64, 64, 64, 64, -64, -64, -64, 64, 64, 64, 64, -64, 64, -64, -64, 64, -64, -64, -64, -64, -64, -64, -64, -64, -64, -64, -64, -64, -64, -64, 64, 64, -64, -64, -64, -64, 64, 64, 64, -64, 64, -64, 64, -64, 64, -64, -64, -64, -64, -64, -64, -64, -64, -64, -64, -64, -64, -64, 64, -64, -64, -64, -64, 64, 64, 64, 64, -64, 64, -64, -64, -64, -64, -64, 64, -64, -64, -64, -64, -64, -64, 64, -64, -64, -64, -64, 64, 64, -64, -64, -64, 64, 64, 64, -64, 64, 64, -64, -64, -64, 64, -64, -64, -64, -64, -64, -64, -64, -64, -64, -64, -64, 64, 64, 64, 64, -64, -64, -64, -64, 64, -64, 64, 64, -64, -64, -64, 64, -64, -64, -64, -64, -64, 64, -64, -64, -64, -64, -64, -64, -64, 64, -64, 64, 64, -64, -64, 64, 64, -64, 64, -64, 64, -64, 64, 64, 64, -64, -64, 64, 64, 64, 64, 64, 64, 64, -64, -64, -64, 64, 64, 64, 64, -64, -64, -64, -64, -64, -64, -64, -64, 64, -64, 64, -64, -64, 64, 64, 64, 64, 64, 64, 64, 64, 64, 64, 64, 64, 64, 64, -64, -64, -64, -64, -64, -64, -64, 64, 64, 64, -64, -64, -64, 64, 64, -64, 64, 64, 64, 64, 64, 64, 64, 64, 64, 64, 64, 64, -64, -64, 64, 64, 64, 64, 64, -64, 64, -64, 64, -64, 64, -64, -64, -64, 64, 64, 64, 64, 64, 64, 64, 64, 64, 64, 64, -64, -64, -64, -64, -64, 64, 64, 64, -64, -64, 64, -64, -64, -64, 64, 64, -64, 64, -64, 64, 64, 64, 64, 64, 64, 64, 64, -64, -64, -64, -64, -64, -64, -64, 64, 64, 64, 64, 64, -64, 64, -64, -64, -64, 64, 64, -64, -64, 64, 64, 64, 64, 64, 64, 64, -64, 64, -64, 64, 64, -64, -64, 64, -64, -64, 64, -64, -64, 64, -64, 64, 64, 64, -64, -64, 64, 64, 64, 64, 64, -64, -64, -64, 64, 64, -64, -64, 64, -64, -64, 64, 64, 64, -64, 64, -64, -64, 64, -64, 64, -64, -64, -64, 64, -64, 64, -64, -64, -64, 64, 64, -64, 64, -64, -64, -64, -64, 64, 64, 64, -64, -64, -64, 64, 64, -64, 64, -64, 64, -64, -64, 64, 64, 64, 64, 64, 64, 64, 64, -64, 64, 64, 64, -64, -64, 64, 64, 64, -64, 64, -64, 64, -64, -64, 64, -64, 64, -64, -64, 64, -64, 64, 64, -64, 64, 64, 64, -64, -64, -64, 64, -64, 64, -64, -64, 64, 64, 64, 64, -64, 64, 64, -64, -64, -64, -64, -64, -64, 64, 64, 64, -64, -64, -64, -64, -64, -64, 64, 64, -64, -64, -64, 64, 64, 64, 64, 64, 64, 64, -64, -64, -64, 64, 64, 64, -64, -64, -64, -64, -64, -64, -64, -64, -64, -64, -64, -64, -64, -64, -64, -64, -64, 64, -64, -64, 64, 64, 64, -64, 64, -64, 64, -64, -64, 64, -64, -64, -64, -64, -64, -64, -64, -64, -64, -64, -64, -64, -64, 64, -64, 64, 64, 64, -64, -64, -64, -64, -64, -64, 64, 64, 64, 64, 64, -64, 64, 64, 64, -64, -64, -64, -64, -64, -64, -64, -64, -64, -64, 64, -64, -64, -64, -64, -64, 64, 64, -64, 64, 64, 64, 64, 64, -64, -64, 64, -64, 64, 64, -64, -64, -64, 64, 64, -64, 64, 64, -64, 64, -64, 64, -64, 64, 64, 64, 64, -64, -64, 64, -64, -64, 64, -64, 64, -64, 64, 64, -64, 64, 64, -64, -64, -64, -64, 64, 64, -64, 64, 64, 64, 64, 64, 64, 64, -64, 64, 64, 64, -64, 64, 64, 64, 64, -64, -64, -64, -64, -64, -64, 64, 64, 64, 64, 64, -64, 64, 64, -64, 64, -64, 64, 64, -64, 64, -64, 64, -64, 64, 64, -64, -64, -64, 64, -64, -64, 64, 64, 64, -64, 64, -64, 64, -64, 64, 64, -64, 64, -64, 64, -64, -64, 64, 64, 64, -64, -64, 64, -64, -64, -64, 64, 64, -64, -64, 64, 64, -64, 64, 64, -64, 64, -64, -64, 64, 64, -64, 64, -64, -64, 64, 64, 64, 64, -64, -64, 64, -64, 64, -64, 64, -64, -64, 64, -64, -64, 64, -64, -64, 64, 64, 64, -64, 64, 64, 64, 64, -64, -64, -64, 64, 64, -64, -64, -64, -64, -64, 64, -64, -64, 64, 64, 64, -64, -64, -64, 64, 64, -64, 64, 64, 64, 64, -64, 64, 64, -64, -64, -64, 64, 64, -64, 64, -64, -64, 64, 64, 64, -64, 64, -64, 64, 64, 64, -64, -64, 64, 64, -64, -64, 64, 64, 64, -64, -64, 64, -64, 64, 64, -64, 64, -64, -64, -64, 64, -64, -64, -64, -64, -64, 64, -64, 64, -64, -64, -64, -64, 64, 64, -64, 64, -64, 64, -64, 64, -64, -64, 64, -64, -64, 64, 64, 64, -64, -64, -64, -64, -64, 64, -64, -64, 64, 64, -64, -64, -64, -64, -64, 64, 64, -64, -64, 64, 64, -64, -64, -64, -64, -64, 64, -64, 64, -64, 64, -64, -64, -64, 64, -64, -64, -64, -64, -64, -64, 64, -64, 64, -64, 64, -64, 64, -64, 64, -64, 64, 64, -64, -64, 64, -64, 64, -64, 64, -64, 64, 64, 64, -64, -64, 64, -64, 64, 64, 64, 64, 64, -64, 64, -64, -64, -64, -64, -64, 64, -64, -64, -64, 64, -64, -64, 64, -64, -64, 64, -64, 64, -64, 64, -64, 64, -64, 64, 64, 64, 64, -64, -64, -64, -64, -64, 64, -64, 64, 64, -64, 64, -64, -64, -64, -64, 64, -64, 64, -64, -64, 64, 64, 64, -64, 64, 64, -64, 64, 64, 64, -64, -64, -64, -64, 64, -64, -64, -64, 64, 64, -64, -64, 64, -64, 64, 64, 64, 64, -64, 64, 64, -64, -64, -64, 64, -64, -64, -64, 64, -64, -64, 64, -64, -64, -64, -64, -64, -64, 64, 64, -64, -64, -64, -64, -64, 64, -64, 64, 64, 64, 64, -64, 64, -64, -64, -64, -64, -64, -64, 64, 64, -64, -64, -64, -64, 64, -64, 64, 64, -64, -64, -64, -64, 64, -64, -64, 64, -64, -64, 64, -64, -64, -64, 64, 64, 64, -64, -64, -64, -64, -64, -64, -64, -64, -64, 64, -64, 64, 64, 64, 64, -64, -64, 64, -64, -64, -64, 64, -64, -64, 64, -64, -64, -64, 64, -64, 64, 64, -64, -64, 64, 64, -64, -64, -64, -64, -64, 64, -64, -64, -64, 64, -64, -64, -64, -64, -64, -64, -64, 64, -64, 64, -64, -64, 64, 64, 64, -64, 64, 64, -64, -64, -64, -64, -64, 64, -64, 64, -64, -64, 64, -64, 64, -64, 64, -64, -64, -64, -64, -64, 64, -64, -64, 64, -64, -64, -64, -64, -64, -64, -64, 64, 64, -64, 64, -64, 64, -64, -64, -64, 64, 64, -64, -64, -64, -64, 64, -64, -64, -64, 64, -64, -64, -64, 64, -64, -64, -64, 64, -64, 64, 64, 64, -64, -64, 64, 64, 64, 64, 64, -64, 64, -64, 64, -64, 64, -64, -64, 64, -64, -64, -64, 64, -64, -64, -64, -64, 64, -64, -64, -64, 64, -64, -64, 64, -64, 64, 64, -64, -64, -64, 64, -64, -64, -64, -64, 64, -64, -64, -64, -64, -64, -64, -64, 64, 64, -64, 64, 64, 64, 64, -64, 64, -64, 64, 64, -64, 64, -64, -64, 64, -64, 64, -64, -64, 64, -64, -64, -64, 64, -64, 64, -64, -64, 64, -64, 64, 64, -64, 64, 64, -64, 64, -64, -64, 64, 64, -64, -64, -64, 64, 64, 64, 64, -64, -64, 64, 64, -64, -64, 64, -64, 64, 64, 64, 64, 64, 64, 64, -64, -64, 64, -64, -64, 64, -64, -64, -64, 64, 64, -64, -64, 64, 64, -64, -64, 64, -64, 64, 64, -64, 64, 64, 64, -64, -64, -64, 64, -64, 64, 64, -64, 64, 64, 64, 64, 64, 64, -64, -64, 64, -64, -64, -64, 64, 64, -64, -64, 64, -64, 64, 64, -64, 64, 64, 64, -64, 64, -64, 64, -64, -64, -64, 64, 64, 64, 64, 64, 64, 64, -64, -64, -64, 64, -64, 64, -64, -64, -64, 64, 64, -64, 64, -64, 64, 64, -64, 64, -64, 64, -64, 64, 64, -64, -64, -64, 64, -64, 64, -64, 64, -64, 64, 64, 64, -64, -64, 64, 64, -64, 64, 64, 64, -64, -64, 64, 64, -64, -64, 64, -64, 64, 64, -64, -64, -64, -64, -64, -64, 64, -64, -64, -64, 64, 64, 64, 64, -64, 64, -64, 64, 64, 64, -64, -64, 64, 64, -64, 64, 64, -64, -64, 64, -64, 64, -64, -64, 64, 64, -64, -64, -64, 64, 64, 64, 64, 64, -64, 64, -64, 64, 64, 64, -64, 64, 64, -64, -64, -64, -64, -64, 64, 64, -64, -64, 64, 64, 64, -64, 64, -64, -64, 64, 64, -64, 64, -64, -64, 64, 64, 64, -64, -64, -64, -64, -64, 64, -64, 64, 64, -64, 64, -64, -64, 64, -64, -64, 64, -64, -64, 64, 64, 64, 64, -64, 64, -64, -64, -64, -64, -64, -64, -64, 64, -64, 64, -64, -64, -64, -64, -64, 64, 64, -64, 64, 64, 64, 64, 64, 64, -64, 64, 64, 64, 64, -64, -64, -64, -64, -64, 64, -64, -64, -64, -64, -64, 64, 64, 64, -64, -64, 64, -64, -64, -64, -64, 64, 64, -64, -64, 64, -64, 64, -64, -64, -64, 64, -64, -64, 64, -64, -64, -64, -64, -64, -64, -64, -64, 64, -64, -64, -64, -64, 64, 64, -64, 64, 64, -64, -64, 64, -64, 64, -64, -64, -64, -64, 64, 64, -64, 64, -64, -64, -64, -64, -64, -64, -64, 64, -64, 64, 64, -64, -64, -64, 64, 64, 64, 64, 64, 64, 64, 64, 64, -64, -64, 64, -64, 64, -64, -64, 64, -64, 64, -64, 64, -64, -64, 64, 64, 64, 64, -64, 64, 64, 64, 64, 64, -64, 64, 64, 64, 64, 64, -64, -64, -64, -64, -64, 64, 64, -64, -64, 64, 64, 64, -64, -64, -64, -64, 64, -64, 64, 64, 64, 64, 64, 64, -64, 64, 64, -64, 64, -64, -64, -64, 64, 64, -64, 64, -64, 64, 64, 64, -64, 64, 64, -64, -64, 64, -64, 64, 64, 64, -64, -64, -64, -64, 64, 64, 64, -64, -64, -64, -64, -64, 64, -64, 64, 64, 64, 64, 64, 64, 64, -64, 64, 64, 64, -64, -64, -64, -64, -64, -64, 64, -64, -64, -64, -64, -64, -64, 64, -64, 64, -64, -64, -64, 64, 64, 64, 64, 64, 64, -64, 64, -64, 64, -64, 64, -64, -64, -64, -64, 64, -64, -64, 64, 64, 64, 64, 64, -64, -64, -64, 64, 64, 64, 64, -64, -64, -64, -64, 64, -64, -64, -64, -64, -64, -64, 64, -64, -64, -64, -64, -64, -64, 64, -64, -64, -64, -64, -64, 64, 64, 64, 64, 64, 64, -64, 64, 64, -64, -64, -64, 64, -64, -64, -64, 64, -64, -64, -64, -64, -64, -64, -64, -64, -64, -64, -64, -64, 64, 64, -64, 64, -64, 64, 64, 64, -64, 64, 64, -64, -64, 64, -64, 64, -64, -64, 64, -64, -64, -64, 64, -64, 64, -64, -64, 64, -64, 64, 64, 64, 64, 64, -64, 64, 64, 64, 64, -64, -64, -64, 64, -64, -64, -64, -64, -64, -64, -64, -64, 64, -64, -64, -64, 64, -64, 64, -64, -64, -64, -64, -64, -64, -64, -64, -64, 64, 64, -64, -64, -64, 64, -64, -64, -64, -64, -64, -64, -64, -64, -64, -64, -64, -64, -64, -64, -64, 64, 64, -64, 64, -64, 64, -64, 64, -64, -64, 64, 64, -64, -64, 64, -64, -64, -64, -64, -64, -64, 64, 64, 64, -64, -64, -64, -64, 64, -64, 64, -64, -64, -64, -64, -64, 64, -64, 64, -64, 64, -64, -64, -64, -64, -64, -64, -64, 64, 64, 64, -64, -64, 64, -64, 64, 64, 64, -64, 64, 64, -64, 64, 64, -64, -64, 64, -64, 64, 64, -64, -64, 64, -64, 64, 64, 64, 64, -64, -64, -64, 64, 64, -64, 64, -64, 64, 64, 64, 64, 64, -64, -64, -64, 64, -64, -64, -64, 64, -64, -64, 64, 64, 64, 64, 64, -64, -64, -64, -64, -64, -64, 64, -64, 64, -64, 64, 64, -64, -64, -64, -64, -64, -64, -64, 64, -64, -64, 64, -64, 64, 64, 64, -64, -64, -64, 64, -64, -64, -64, -64, 64, 64, -64, 64, -64, -64, -64, -64, -64, -64, 64, 64, 64, 64, 64, 64, 64, 64, 64, 64, -64, -64, -64, 64, -64, 64, -64, -64, 64, -64, 64, 64, -64, 64, -64, 64, -64, 64, -64, 64, 64, 64, 64, 64, 64, 64, 64, 64, -64, -64, -64, -64, 64, 64, -64, 64, 64, -64, 64, -64, -64, 64, -64, 64, -64, -64, 64, -64, 64, 64, -64, -64, 64, -64, -64, 64, -64, 64, 64, 64, -64, 64, 64, -64, 64, 64, -64, 64, -64, 64, -64, 64, 64, -64, 64, -64, 64, 64, 64, 64, 64, -64, -64, -64, 64, 64, 64, -64, 64, 64, -64, -64, -64, 64, 64, 64, -64, 64, 64, -64, 64, 64, -64, -64, 64, -64, 64, 64, 64, -64, -64, 64, 64, 64, -64, 64, 64, 64, -64, -64, -64, -64, -64, -64, -64, 64, 64, -64, -64, 64, -64, 64, 64, 64, -64, 64, 64, -64, -64, -64, -64, -64, 64, -64, -64, -64, -64, 64, 64, -64, 64, 64, -64, -64, 64, 64, -64, -64, -64, 64, -64, -64, -64, -64, 64, -64, 64, -64, 64, -64, -64, -64, -64, -64, -64, -64, -64, 64, 64, -64, -64, 64, -64, -64, -64, -64, -64, -64, -64, 64, -64, -64, 64, -64, 64, 64, -64, 64, -64, -64, -64, -64, -64, -64, -64, -64, 64, 64, -64, 64, -64, 64, -64, 64, 64, 64, 64, 64, 64, -64, 64, -64, 64, 64, 64, -64, -64, -64, -64, -64, -64, -64, 64, 64, -64, 64, -64, 64, 64, 64, 64, -64, 64, -64, 64, -64, -64, 64, 64, 64, 64, 64, 64, -64, -64, -64, -64, -64, -64, 64, -64, 64, 64, 64, -64, -64, -64, 64, 64, 64, 64, 64, 64, 64, 64, 64, 64, 64, -64, 64, 64, -64, 64, -64, -64, -64, 64, 64, -64, 64, 64, -64, -64, -64, 64, 64, 64, 64, 64, 64, 64, 64, -64, 64, 64, 64, 64, 64, 64, 64, 64, -64, -64, -64, 64, 64, 64, -64, -64, -64, 64, 64, 64, 64, 64, 64, 64, 64, 64, 64, 64, 64, 64, 64, 64, 64, 64, 64, 64, -64, -64, 64, -64, 64, -64, -64, -64, 64, -64, -64, 64, 64, 64, 64, 64, 64, 64, 64, 64, 64, 64, 64, 64, 64, 64, 64, 64, 64, 64, -64, -64, -64, -64, -64, -64, 64, -64, 64, 64, 64, 64, -64, 64, 64, 64, 64, -64, 64, 64, 64, 64, 64, 64, 64, 64, -64, -64, -64, -64, -64, -64, -64, -64, 64, 64, 64, 64, 64, 64, 64, -64, -64, 64, 64, -64, -64, 64, 64, 64, 64, 64, 64, 64, -64, -64, 64, -64, 64, -64, 64, 64, -64, 64, 64, 64, 64, 64, 64, -64, 64, 64, 64, -64, -64, 64, 64, 64, 64, 64, 64, 64, 64, 64, -64, -64, -64, 64, 64, -64, 64, 64, 64, -64, 64, 64, 64, 64, 64, 64, 64, -64, 64, -64, 64, 64, -64, 64, 64, 64, 64, 64, -64, 64, 64, 64, -64, 64, 64, 64, 64, -64, 64, 64, -64, -64, -64, -64, 64, 64, -64, 64, 64, 64, -64, 64, 64, 64, 64, 64, -64, 64, -64, 64, -64, 64, -64, 64, 64, 64, 64, 64, -64, -64, -64, -64, 64, 64, 64, 64, 64, 64, 64, 64, 64, 64, -64, 64, 64, 64, -64, 64, -64, 64, -64, 64, -64, 64, 64, 64, -64, -64, 64, 64, 64, 64, -64, 64, 64, 64, 64, -64, 64, -64, 64, -64, -64, 64, 64, 64, -64, 64, 64, 64, -64, 64, 64, -64, 64, 64, 64, 64, -64, 64, 64, -64, 64, 64, 64, -64, -64, 64, 64, 64, -64, -64, -64, 64, -64, -64, 64, 64, -64, 64, 64, 64, -64, -64, 64, 64, 64, 64, -64, -64, -64, 64, -64, 64, -64, -64, -64, 64, 64, 64, 64, -64, -64, -64, -64, 64, 64, 64, 64, 64, 64, 64, 64, 64, 64, -64, -64, -64, 64, 64, -64, 64, -64, -64, -64, -64, -64, 64, 64, -64, -64, 64, -64, -64, 64, 64, -64, 64, -64, -64, -64, 64, -64, -64, -64, -64, -64, 64, 64, 64, 64, -64, -64, 64, 64, -64, -64, 64, -64, 64, 64, -64, 64, -64, -64, -64, 64, 64, -64, -64, -64, -64, 64, 64, 64, 64, 64, 64, 64, -64, -64, -64, 64, 64, 64, -64, -64, -64, -64, 64, 64, -64, -64, -64, -64, 64, 64, 64, 64, 64, 64, 64, 64, 64, 64, 64, 64, -64, 64, -64, -64, -64, -64, 64, -64, -64, 64, 64, -64, -64, -64, -64, 64, -64, 64, 64, 64, 64, 64, 64, 64, -64, -64, -64, -64, -64, 64, -64, -64, 64, 64, 64, 64, -64, -64, -64, -64, 64, -64, -64, -64, 64, -64, 64, 64, 64, -64, 64, -64, -64, -64, -64, 64, -64, -64, 64, -64, 64, -64, 64, -64, 64, 64, 64, 64, 64, -64, 64, 64, 64, -64, 64, -64, 64, 64, 64, -64, 64, 64, -64, -64, 64, -64, 64, -64, 64, -64, 64, 64, -64, -64, 64, -64, -64, 64, -64, 64, 64, -64, 64, 64, -64, 64, 64, -64, 64, -64, -64, 64, 64, -64, 64, -64, -64, 64, -64, 64, -64, -64, -64, 64, -64, 64, -64, -64, -64, -64, 64, 64, -64, 64, 64, -64, -64, -64, 64, -64, -64, -64, 64, -64, -64, 64, 64, -64, -64, 64, 64, -64, 64, -64, 64, -64, 64, 64, 64, 64, 64, 64, 64, 64, -64, -64, -64, -64, 64, 64, -64, 64, -64, -64, -64, -64, -64, 64, -64, -64, -64, 64, -64, 64, 64, 64, 64, 64, 64, 64, 64, -64, -64, -64, 64, -64, -64, -64, 64, 64, -64, 64, 64, 64, -64, 64, 64, -64, -64, 64, -64, -64, 64, 64, -64, -64, 64, 64, 64, 64, 64, 64, 64, -64, -64, 64, -64, -64, 64, -64, -64, 64, -64, 64, 64, -64, -64, -64, 64, 64, -64, -64, -64, -64, -64, -64, -64, -64, -64, 64, 64, -64, -64, 64, 64, -64, -64, -64, 64, -64, -64, -64, 64, -64, -64, -64, -64, -64, -64, -64, -64, -64, -64, -64, -64, -64, 64, 64, 64, 64, -64, -64, 64, -64, -64, -64, -64, -64, 64, 64, -64, -64, -64, -64, -64, -64, -64, -64, -64, -64, -64, -64, 64, -64, -64, 64, 64, -64, 64, -64, -64, 64, 64, 64, -64, -64, 64, 64, -64, -64, -64, -64, -64, -64, -64, 64, 64, 64, 64, 64, 64, -64, 64, -64, 64, -64, -64, -64, 64, -64, -64, -64, 64, 64, -64, -64, 64, -64, -64, -64, -64, 64, 64, 64, -64, 64, 64, 64, 64, 64, -64, -64, -64, -64, -64, -64, -64, -64, 64, 64, -64, 64, -64, 64, -64, 64, -64, -64, -64, 64, 64, 64, -64, -64, 64, -64, -64, 64, -64, -64, -64, -64, -64, -64, -64, -64, -64, -64, -64, -64, -64, -64, -64, -64, 64, 64, -64, 64, 64, 64, -64, -64, -64, -64, 64, 64, -64, -64, -64, -64, -64, -64, 64, -64, 64, -64, -64, -64, -64, 64, -64, 64, 64, -64, -64, -64, 64, -64, -64, -64, -64, -64, 64, -64, -64, -64, -64, -64, -64, -64, -64, -64, 64, -64, 64, -64, 64, 64, -64, 64, 64, -64, -64, -64, 64, -64, -64, -64, -64, -64, -64, -64, -64, -64, -64, -64, -64, -64, 64, 64, 64, 64, -64, -64, -64, 64, 64, 64, 64, 64, -64, -64, -64, -64, -64, -64, -64, -64, -64, -64, -64, -64, -64, -64, -64, -64, -64, 64, 64, 64, 64, 64, 64, -64, -64, 64, 64, 64, -64, 64, 64, -64, -64, -64, -64, -64, -64, -64, 64, 64, -64, -64, -64, -64, -64, 64, 64, 64, -64, -64, 64, 64, -64, 64, -64, -64, -64, -64, -64, -64, -64, -64, -64, -64, 64, -64, 64, 64, 64, -64, -64, -64, -64, 64, -64, 64, -64, -64, 64, 64, -64, 64, -64, 64, 64, -64, 64, 64, 64, -64, -64, 64, -64, -64, -64, -64, -64, -64, -64, -64, 64, 64, -64, -64, 64, -64, 64, 64, -64, 64, -64, -64, -64, 64, -64, -64, 64, 64, 64, 64, -64, 64, -64, -64, -64, -64, -64, -64, 64, 64, -64, 64, 64, 64, -64, -64, -64, -64, -64, -64, -64, 64, -64, 64, 64, 64, 64, -64, -64, 64, 64, -64, -64, -64, -64, 64, 64, 64, 64, -64, 64, -64, 64, 64, 64, -64, 64, -64, 64, -64, 64, 64, 64, 64, -64, -64, -64, 64, 64, -64, -64, -64, -64, -64, 64, 64, 64, -64, 64, -64, -64, -64, 64, 64, 64, -64, -64, 64, 64, -64, -64, -64, -64, 64, -64, 64, -64, -64, -64, -64, -64, 64, 64, 64, 64, 64, -64, -64, -64, 64, -64, 64, -64, 64, -64, 64, -64, -64, -64, 64, 64, -64, -64, -64, -64, -64, -64, -64, -64, -64, 64, -64, -64, -64, -64, -64, -64, 64, 64, -64, -64, -64, -64, -64, -64, 64, -64, -64, -64, -64, -64, -64, -64, -64, 64, -64, -64, -64, -64, -64, -64, -64, -64, 64, -64, 64, -64, -64, -64, -64, 64, 64, -64, -64, -64, -64, -64, -64, -64, -64, 64, 64, -64, -64, 64, 64, 64, -64, 64, -64, 64, -64, 64, -64, 64, 64, 64, -64, -64, -64, -64, -64, 64, 64, -64, 64, 64, 64, -64, -64, 64, -64, -64, 64, 64, 64, 64, 64, -64, -64, 64, 64, 64, -64, 64, -64, 64, -64, 64, 64, 64, 64, -64, 64, 64, 64, 64, 64, 64, -64, 64, 64, -64, 64, -64, -64, 64, -64, 64, -64, 64, -64, 64, -64, 64, -64, 64, -64, -64, 64, 64, 64, 64, 64, -64, 64, -64, -64, 64, -64, 64, -64, -64, -64, -64, 64, 64, -64, 64, 64, 64, 64, -64, 64, -64, 64, -64, -64, -64, -64, 64, 64, 64, 64, -64, 64, -64, -64, 64, -64, 64, -64, 64, -64, -64, 64, -64, 64, -64, 64, -64, 64, 64, 64, -64, -64, -64, -64, 64, 64, 64, -64, -64, -64, 64, 64, 64, -64, 64, 64, -64, -64, 64, -64, 64, -64, -64, 64, -64, -64, 64, 64, -64, -64, -64, -64, -64, -64, 64, 64, 64, 64, -64, -64, 64, 64, -64, 64, -64, 64, -64, 64, 64, -64, 64, 64, -64, -64, 64, -64, 64, -64, 64, 64, -64, 64, -64, -64, -64, -64, -64, 64, -64, -64, -64, 64, 64, -64, 64, -64, -64, -64, 64, 64, 64, -64, 64, -64, -64, -64, 64, -64, 64, 64, -64, -64, 64, 64, 64, -64, -64, 64, 64, 64, 64, -64, 64, -64, 64, 64, -64, -64, -64, -64, 64, -64, -64, -64, 64, 64, 64, 64, 64, -64, -64, -64, -64, -64, 64, -64, -64, -64, -64, -64, -64, 64, 64, -64, 64, 64, 64, -64, -64, 64, -64, 64, -64, 64, 64, -64, 64, 64, 64, 64, 64, 64, -64, 64, 64, 64, -64, 64, -64, 64, 64, 64, 64, 64, 64, 64, 64, 64, 64, 64, 64, -64, 64, 64, -64, -64, -64, 64, -64, -64, -64, -64, 64, 64, -64, -64, 64, -64, -64, -64, 64, -64, -64, 64, 64, -64, -64, 64, -64, -64, 64, -64, -64, 64, -64, 64, -64, -64, -64, 64, 64, 64, -64, -64, 64, -64, -64, 64, 64, -64, 64, -64, 64, -64, 64, -64, 64, 64, -64, 64, 64, 64, 64, 64, -64, 64, 64, 64, 64, 64, -64, -64, -64, 64, -64, 64, 64, 64, 64, 64, 64, 64, 64, 64, 64, 64, 64, -64, 64, 64, 64, -64, -64, 64, -64, -64, -64, -64, 64, 64, -64, -64, 64, 64, 64, 64, -64, 64, 64, 64, 64, 64, -64, 64, 64, -64, -64, -64, 64, 64, 64, 64, -64, 64, 64, -64, 64, -64, 64, 64, -64, 64, -64, -64, -64, 64, 64, 64, 64, 64, 64, 64, 64, -64, -64, 64, 64, 64, 64, -64, 64, -64, 64, 64, 64, 64, 64, -64, 64, -64, 64, 64, 64, -64, 64, 64, -64, -64, -64, 64, 64, 64, -64, 64, 64, -64, 64, 64, -64, 64, -64, -64, 64, -64, 64, 64, 64, 64, 64, 64, 64, -64, -64, 64, 64, 64, 64, 64, -64, 64, 64, 64, -64, -64, 64, 64, 64, 64, -64, -64, 64, 64, 64, -64, -64, 64, 64, -64, 64, 64, 64, 64, 64, 64, 64, -64, -64, 64, -64, 64, 64, -64, -64, -64, 64, -64, 64, -64, 64, 64, -64, 64, 64, 64, -64, 64, 64, 64, 64, 64, -64, 64, 64, 64, -64, 64, -64, -64, -64, -64, -64, 64, 64, -64, 64, 64, 64, -64, -64, -64, 64, 64, 64, 64, 64, 64, -64, 64, 64, -64, -64, -64, 64, 64, 64, -64, 64, -64, 64, 64, -64, 64, -64, 64, -64, 64, -64, 64, -64, 64, 64, 64, 64, 64, 64, -64, -64, 64, 64, 64, 64, 64, 64, 64, 64, -64, -64, 64, 64, -64, 64, -64, 64, -64, -64, 64, -64, 64, -64, -64, 64, -64, 64, -64, 64, 64, -64, 64, 64, 64, 64, 64, 64, 64, 64, 64, 64, -64, -64, 64, 64, 64, -64, 64, 64, 64, -64, 64, -64, -64, 64, 64, -64, -64, 64, 64, 64, 64, -64, 64, -64, 64, -64, 64, -64, -64, 64, -64, 64, -64, 64, -64, 64, 64, 64, -64, 64, 64, -64, -64, -64, -64, 64, 64, 64, -64, 64, -64, 64, 64, -64, -64, 64, -64, -64, -64, 64, 64, -64, 64, -64, 64, -64, 64, 64, 64, 64, 64, 64, -64, 64, 64, 64, 64, -64, 64, 64, 64, -64, -64, 64, 64, 64, -64, 64, 64, 64, -64, -64, -64, -64, 64, -64, 64, -64, -64, 64, 64, 64, 64, 64, -64, 64, 64, -64, 64, -64, -64, 64, 64, -64, -64, -64, 64, -64, 64, 64, 64, -64, 64, 64, -64, -64, -64, 64, 64, 64, 64, 64, 64, -64, -64, 64, -64, -64, 64, 64, -64, 64, 64, -64, -64, -64, 64, -64, 64, -64, -64, 64, 64, 64, 64, 64, 64, 64, 64, -64, -64, -64, 64, 64, -64, 64, -64, 64, 64, -64, -64, 64, 64, 64, -64, -64, -64, -64, 64, 64, 64, -64, 64, 64, 64, -64, -64, 64, 64, 64, 64, -64, -64, -64, 64, -64, 64, 64, 64, 64, -64, -64, 64, -64, -64, 64, -64, 64, 64, -64, 64, -64, 64, -64, 64, -64, 64, -64, -64, 64, 64, -64, -64, 64, 64, -64, 64, -64, -64, 64, 64, 64, 64, -64, 64, 64, 64, 64, 64, 64, 64, 64, 64, -64, 64, -64, 64, -64, 64, -64, -64, 64, -64, -64, 64, 64, 64, -64, 64, -64, -64, 64, -64, 64, -64, 64, -64, 64, 64, 64, 64, 64, -64, -64, 64, -64, 64, -64, 64, 64, -64, 64, -64, 64, -64, 64, -64, -64, 64, 64, -64, 64, 64, 64, 64, -64, 64, -64, -64, -64, -64, -64, 64, -64, -64, 64, 64, 64, -64, 64, -64, 64, 64, -64, 64, -64, 64, -64, -64, -64, 64, 64, 64, -64, -64, 64, -64, 64, -64, -64, -64, 64, -64, 64, -64, -64, -64, -64, -64, 64, 64, -64, 64, -64, 64, -64, -64, -64, -64, 64, 64, 64, 64, 64, 64, -64, -64, 64, 64, -64, -64, -64, -64, -64, -64, 64, 64, 64, -64, -64, 64, 64, 64, -64, -64, 64, 64, 64, 64, 64, 64, -64, -64, 64, -64, 64, 64, 64, -64, -64, -64, -64, -64, 64, -64, 64, 64, -64, -64, -64, -64, -64, -64, -64, -64, 64, 64, 64, 64, 64, 64, -64, 64, 64, -64, 64, -64, -64, 64, -64, -64, -64, -64, -64, 64, 64, 64, -64, 64, -64, -64, -64, -64, 64, 64, 64, 64, 64, 64, 64, -64, 64, -64, -64, 64, -64, 64, 64, 64, -64, -64, -64, -64, 64, -64, -64, -64, -64, -64, 64, 64, 64, -64, 64, 64, -64, -64, 64, -64, -64, 64, 64, 64, 64, 64, -64, -64, 64, 64, -64, -64, 64, -64, -64, -64, 64, -64, 64, 64, -64, 64, 64, -64, -64, 64, -64, -64, 64, -64, -64, -64, 64, -64, -64, 64, -64, -64, -64, 64, -64, -64, -64, 64, 64, -64, -64, 64, 64, 64, -64, -64, -64, -64, -64, -64, 64, 64, -64, -64, -64, 64, -64, 64, -64, -64, -64, 64, -64, -64, 64, 64, 64, 64, 64, 64, -64, -64, -64, -64, -64, -64, -64, -64, -64, -64, 64, 64, 64, 64, 64, -64, -64, -64, -64, 64, 64, 64, 64, 64, 64, 64, 64, 64, -64, -64, -64, -64, -64, -64, -64, -64, -64, -64, 64, 64, 64, 64, -64, -64, 64, -64, 64, -64, -64, 64, 64, 64, 64, 64, -64, -64, -64, -64, -64, -64, -64, -64, -64, -64, -64, -64, -64, 64, 64, 64, -64, 64, -64, 64, 64, 64, -64, -64, 64, 64, 64, 64, -64, 64, -64, -64, -64, -64, -64, -64, -64, -64, -64, -64, 64, 64, 64, -64, -64, -64, 64, 64, -64, -64, -64, -64, -64, 64, -64, -64, -64, -64, -64, -64, -64, -64, -64, -64, -64, -64, -64, 64, 64, 64, 64, 64, -64, 64, -64, -64, -64, -64, -64, -64, 64, 64, 64, 64, -64, -64, -64, -64, -64, -64, -64, -64, -64, -64, -64, -64, 64, 64, 64, 64, -64, 64, 64, 64, 64, 64, -64, -64, 64, 64, 64, 64, 64, -64, -64, -64, -64, -64, -64, -64, -64, -64, -64, 64, 64, 64, 64, 64, 64, -64, -64, -64, 64, 64, -64, -64, 64, 64, 64, 64, 64, 64, -64, -64, -64, -64, -64, -64, -64, 64, -64, -64, 64, 64, 64, 64, -64, 64, -64, -64, -64, 64, -64, -64, 64, 64, -64, 64, 64, -64, 64, -64, -64, -64, -64, -64, -64, -64, 64, -64, 64, 64, -64, 64, -64, -64, -64, -64, 64, -64, -64, -64, 64, -64, -64, 64, -64, 64, 64, 64, -64, 64, -64, -64, -64, 64, 64, -64, 64, 64, -64, -64, -64, 64, -64, 64, 64, -64, 64, -64, 64, 64, 64, 64, -64, 64, 64, -64, 64, -64, -64, -64, 64, 64, -64, 64, 64, 64, 64, 64, -64, -64, -64, -64, -64, 64, -64, -64, 64, 64, 64, 64, 64, -64, 64, 64, 64, -64, -64, 64, -64, -64, -64, -64, 64, 64, 64, -64, 64, 64, 64, 64, 64, -64, 64, 64, -64, -64, -64, -64, -64, -64, 64, 64, 64, 64, 64, 64, -64, -64, -64, 64, 64, -64, -64, -64, 64, -64, 64, 64, -64, -64, 64, -64, -64, 64, 64, 64, -64, 64, 64, 64, 64, -64, 64, 64, 64, 64, 64, 64, 64, -64, -64, 64, -64, -64, 64, 64, 64, -64, 64, 64, -64, -64, -64, -64, 64, -64, -64, -64, -64, -64, -64, 64, 64, -64, -64, 64, 64, -64, 64, -64, -64, -64, -64, 64, -64, -64, 64, -64, 64, -64, 64, -64, -64, -64, -64, -64, -64, -64, 64, 64, -64, -64, -64, 64, 64, 64, 64, 64, -64, 64, 64, 64, -64, 64, 64, 64, 64, 64, -64, -64, 64, 64, 64, 64, 64, -64, -64, -64, -64, 64, -64, -64, 64, 64, -64, 64, 64, 64, -64, -64, 64, 64, -64, -64, -64, 64, 64, 64, 64, -64, 64, 64, -64, 64, 64, 64, -64, 64, -64, -64, -64, -64, 64, 64, 64, 64, 64, 64, 64, -64, 64, 64, -64, -64, -64, 64, 64, -64, -64, -64, -64, -64, -64, -64, 64, -64, 64, 64, 64, -64, -64, 64, 64, 64, -64, -64, 64, 64, 64, -64, -64, 64, -64, -64, -64, -64, 64, 64, 64, -64, 64, -64, 64, 64, -64, -64, 64, -64, -64, -64, -64, 64, -64, -64, -64, -64, 64, 64, 64, -64, -64, -64, 64, 64, 64, 64, -64, 64, -64, -64, -64, -64, -64, 64, -64, 64, -64, -64, -64, -64, -64, 64, 64, -64, 64, 64, -64, -64, 64, 64, 64, 64, 64, 64, 64, 64, -64, -64, 64, -64, 64, 64, 64, -64, 64, -64, -64, 64, -64, 64, -64, -64, -64, 64, 64, 64, -64, 64, 64, 64, 64, 64, 64, 64, -64, -64, -64, 64, 64, -64, 64, -64, 64, 64, -64, 64, -64, -64, -64, 64, 64, 64, 64, 64, 64, 64, 64, 64, 64, 64, 64, 64, 64, -64, -64, -64, -64, -64, -64, -64, 64, 64, 64, -64, 64, 64, 64, -64, -64, 64, 64, 64, 64, 64, 64, 64, 64, 64, 64, -64, 64, -64, -64, -64, -64, -64, -64, -64, 64, 64, 64, -64, 64, -64, -64, -64, 64, 64, 64, 64, 64, 64, 64, 64, 64, 64, -64, 64, -64, 64, -64, -64, -64, -64, -64, -64, -64, 64, -64, -64, -64, 64, 64, 64, 64, 64, 64, 64, 64, 64, 64, 64, -64, -64, 64, -64, 64, 64, 64, 64, 64, -64, -64, -64, -64, 64, -64, 64, -64, 64, 64, -64, 64, 64, 64, 64, 64, -64, 64, -64, -64, -64, -64, 64, 64, 64, 64, 64, -64, -64, 64, -64, -64, 64, 64, 64, 64, -64, 64, 64, 64, 64, 64, 64, 64, -64, 64, 64, -64, -64, -64, -64, -64, -64, 64, 64, -64, 64, 64, -64, -64, 64, -64, 64, -64, -64, -64, 64, 64, 64, 64, 64, 64, -64, 64, -64, -64, -64, -64, -64, -64, -64, 64, -64, 64, 64, 64, -64, -64, 64, 64, 64, 64, -64, -64, 64, -64, 64, -64, -64, 64, 64, -64, 64, -64, -64, -64, -64, -64, -64, 64, -64, 64, 64, 64, 64, 64, 64, 64, 64, -64, -64, -64, 64, 64, -64, -64, 64, 64, 64, 64, 64, 64, 64, -64, -64, 64, 64, -64, 64, 64, 64, 64, 64, -64, 64, 64, 64, 64, 64, 64, 64, -64, -64, -64, -64, 64, 64, 64, 64, 64, -64, 64, 64, 64, 64, 64, 64, 64, -64, -64, 64, 64, 64, 64, 64, -64, 64, 64, 64, -64, -64, -64, -64, 64, 64, 64, 64, 64, -64, 64, 64, 64, 64, 64, 64, 64, -64, -64, -64, -64, 64, 64, 64, 64, 64, 64, -64, -64, -64, -64, -64, -64, -64, 64, 64, 64, -64, -64, 64, 64, -64, 64, 64, 64, 64, -64, 64, 64, 64, 64, 64, 64, 64, -64, -64, -64, 64, -64, -64, -64, -64, 64, 64, 64, 64, 64, 64, 64, -64, -64, 64, 64, 64, 64, 64, 64, 64, 64, 64, -64, -64, 64, -64, -64, 64, -64, -64, 64, 64, -64, 64, -64, -64, -64, 64, 64, -64, -64, -64, 64, 64, 64, 64, 64, 64, 64, 64, -64, -64, -64, -64, -64, -64, -64, -64, -64, -64, -64, 64, -64, 64, 64, 64, -64, -64, 64, 64, 64, 64, 64, 64, 64, 64, 64, 64, 64, -64, 64, -64, -64, -64, 64, 64, 64, 64, -64, 64, 64, 64, 64, -64, 64, 64, 64, 64, 64, 64, 64, 64, 64, 64, 64, 64, 64, -64, -64, 64, 64, 64, 64, 64, 64, -64, 64, 64, 64, -64, -64, -64, -64, 64, 64, 64, 64, 64, 64, 64, 64, 64, -64, 64, 64, 64, -64, -64, -64, -64, 64, 64, 64, -64, -64, -64, -64, -64, -64, -64, -64, -64, 64, 64, 64, 64, 64, 64, 64, -64, -64, 64, 64, 64, 64, 64, -64, -64, 64, -64, 64, 64, -64, -64, -64, -64, -64, -64, -64, -64, 64, 64, 64, 64, 64, 64, -64, -64, 64, -64, 64, -64, 64, 64, -64, 64, -64, -64, -64, 64, 64, 64, 64, -64, -64, -64, -64, 64, 64, 64, -64, 64, 64, -64, -64, -64, -64, -64, -64, -64, -64, -64, 64, 64, -64, -64, -64, -64, 64, -64, -64, -64, -64, -64, -64, 64, 64, 64, 64, 64, 64, -64, 64, 64, 64, -64, 64, 64, -64, 64, 64, -64, 64, 64, -64, 64, 64, -64, -64, -64, 64, 64, -64, -64, 64, -64, -64, -64, 64, 64, -64, -64, 64, -64, 64, -64, 64, -64, -64, 64, 64, 64, 64, 64, 64, -64, 64, -64, 64, -64, 64, -64, -64, -64, 64, 64, -64, 64, 64, -64, 64, -64, -64, -64, -64, -64, -64, -64, -64, -64, -64, -64, -64, -64, -64, 64, -64, 64, 64, -64, -64, -64, 64, 64, -64, -64, -64, -64, 64, 64, -64, 64, 64, -64, -64, 64, 64, 64, 64, -64, 64, -64, -64, -64, -64, 64, -64, 64, 64, 64, -64, 64, -64, -64, -64, -64, -64, 64, -64, -64, -64, 64, -64, 64, -64, 64, 64, -64, -64, 64, -64, -64, -64, -64, 64, -64, 64, -64, 64, 64, -64, -64, 64, -64, 64, 64, 64, 64, 64, -64, 64, 64, 64, -64, -64, -64, -64, 64, -64, 64, -64, -64, -64, -64, -64, -64, -64, -64, 64, 64, 64, 64, 64, 64, 64, 64, -64, 64, -64, -64, 64, -64, -64, 64, 64, 64, -64, -64, -64, -64, -64, -64, -64, -64, -64, -64, 64, 64, 64, -64, 64, -64, 64, 64, -64, 64, 64, -64, -64, 64, 64, 64, 64, 64, -64, -64, -64, -64, -64, -64, -64, -64, -64, -64, -64, 64, -64, -64, 64, -64, 64, -64, 64, -64, 64, 64, 64, -64, 64, -64, -64, 64, 64, -64, -64, -64, -64, -64, -64, -64, 64, -64, -64, -64, -64, 64, -64, -64, -64, 64, -64, -64, 64, 64, -64, 64, 64, -64, -64, -64, 64, -64, -64, -64, -64, -64, -64, -64, -64, -64, -64, -64, -64, -64, -64, -64, 64, 64, -64, 64, -64, 64, -64, -64, 64, 64, 64, -64, 64, -64, -64, -64, -64, -64, -64, -64, -64, -64, -64, -64, -64, -64, -64, -64, -64, -64, -64, 64, -64, -64, -64, 64, 64, -64, 64, 64, 64, 64, 64, 64, 64, -64, -64, -64, -64, -64, -64, -64, -64, -64, -64, -64, 64, 64, 64, -64, 64, -64, -64, 64, 64, -64, 64, 64, 64, 64, 64, 64, 64, 64, -64, -64, -64, -64, -64, 64, -64, -64, -64, 64, 64, 64, 64, 64, 64, -64, 64, 64, -64, 64, 64, 64, -64, 64, 64, 64, 64, 64, -64, 64, 64, -64, -64, -64, 64, -64, 64, 64, 64, -64, -64, 64, 64, 64, 64, 64, 64, -64, -64, -64, 64, -64, -64, 64, 64, 64, -64, 64, 64, -64, 64, 64, -64, -64, 64, 64, -64, -64, -64, 64, 64, 64, 64, -64, 64, -64, -64, -64, 64, -64, 64, -64, 64, -64, -64, -64, 64, -64, 64, 64, 64, 64, 64, -64, 64, 64, -64, -64, 64, -64, -64, 64, 64, -64, -64, -64, -64, -64, 64, 64, -64, 64, 64, -64, -64, 64, 64, 64, 64, 64, 64, 64, 64, -64, 64, 64, 64, 64, -64, 64, -64, -64, -64, 64, -64, 64, 64, -64, 64, 64, 64, -64, 64, 64, 64, 64, 64, 64, 64, -64, -64, 64, -64, -64, -64, -64, 64, -64, -64, -64, 64, 64, 64, 64, -64, 64, -64, -64, 64, 64, 64, 64, 64, 64, 64, -64, 64, -64, 64, 64, 64, 64, 64, -64, 64, 64, -64, -64, -64, -64, -64, 64, -64, -64, -64, -64, -64, 64, 64, 64, 64, 64, -64, -64, -64, 64, 64, -64, -64, -64, 64, -64, -64, 64, -64, 64, -64, -64, -64, -64, -64, -64, -64, -64, 64, 64, 64, -64, 64, -64, -64, -64, -64, 64, 64, 64, -64, -64, -64, 64, 64, -64, -64, -64, 64, -64, -64, -64, -64, -64, -64, -64, 64, 64, -64, -64, 64, 64, -64, -64, -64, -64, -64, -64, -64, -64, 64, 64, -64, 64, 64, -64, -64, -64, -64, -64, -64, -64, -64, -64, -64, -64, -64, 64, 64, 64, -64, -64, -64, 64, -64, 64, 64, 64, -64, -64, 64, -64, -64, -64, -64, -64, -64, 64, -64, -64, -64, -64, -64, -64, 64, 64, 64, 64, -64, -64, -64, 64, 64, 64, 64, -64, 64, 64, -64, -64, -64, -64, -64, -64, -64, -64, -64, -64, 64, -64, -64, -64, 64, -64, 64, -64, 64, -64, -64, 64, -64, -64, 64, -64, 64, 64, -64, 64, 64, -64, 64, -64, -64, 64, -64, 64, -64, -64, 64, -64, 64, -64, -64, -64, 64, -64, -64, -64, 64, -64, 64, -64, 64, -64, -64, 64, 64, 64, -64, 64, -64, -64, 64, -64, -64, -64, -64, 64, -64, -64, -64, 64, 64, -64, 64, -64, -64, 64, -64, 64, 64, -64, -64, -64, -64, -64, -64, -64, 64, 64, -64, -64, 64, 64, -64, -64, -64, -64, -64, -64, 64, 64, -64, -64, 64, -64, -64, -64, -64, 64, 64, 64, -64, 64, 64, 64, -64, -64, 64, 64, 64, 64, 64, -64, -64, -64, -64, 64, 64, 64, -64, -64, 64, 64, 64, -64, -64, 64, 64, -64, -64, -64, 64, 64, 64, 64, 64, -64, 64, 64, 64, 64, -64, 64, -64, 64, -64, 64, 64, 64, 64, -64, 64, -64, -64, 64, -64, 64, -64, -64, 64, -64, -64, 64, 64, 64, -64, 64, -64, -64, 64, 64, -64, 64, 64, 64, 64, -64, 64, 64, 64, 64, -64, 64, 64, -64, -64, 64, 64, -64, 64, -64, 64, 64, 64, -64, -64, -64, -64, 64, 64, 64, 64, 64, 64, 64, 64, -64, 64, 64, 64, -64, -64, 64, -64, -64, 64, 64, 64, -64, -64, -64, -64, -64, -64, -64, -64, 64, -64, 64, 64, -64, -64, 64, 64, -64, 64, -64, 64, 64, 64, 64, -64, -64, -64, -64, -64, -64, -64, 64, 64, 64, 64, -64, -64, -64, 64, -64, 64, -64, -64, -64, -64, -64, 64, 64, -64, -64, -64, 64, -64, -64, -64, -64, -64, -64, 64, 64, 64, 64, 64, -64, 64, -64, -64, -64, -64, -64, -64, 64, 64, -64, 64, -64, 64, -64, -64, 64, -64, -64, -64, -64, -64, -64, -64, 64, 64, -64, 64, -64, -64, -64, -64, -64, -64, -64, -64, 64, -64, 64, 64, -64, -64, 64, -64, -64, -64, -64, -64, -64, -64, -64, -64, 64, -64, 64, -64, -64, -64, -64, -64, -64, 64, 64, 64, 64, 64, 64, -64, -64, 64, -64, -64, -64, -64, -64, -64, 64, 64, 64, -64, 64, -64, -64, 64, -64, 64, -64, 64, -64, 64, 64, 64, 64, 64, 64, -64, 64, -64, -64, 64, 64, 64, 64, 64, 64, 64, 64, 64, 64, -64, -64, -64, 64, -64, 64, 64, 64, 64, 64, 64, 64, 64, 64, -64, -64, 64, 64, -64, 64, 64, 64, 64, 64, 64, 64, 64, 64, -64, -64, -64, 64, 64, 64, 64, 64, 64, 64, 64, 64, 64, -64, 64, 64, -64, 64, 64, -64, 64, 64, 64, 64, 64, 64, 64, 64, -64, -64, -64, 64, 64, 64, 64, 64, 64, 64, 64, 64, 64, 64, -64, 64, -64, 64, 64, 64, 64, -64, 64, 64, 64, 64, 64, -64, -64, -64, 64, 64, 64, 64, 64, -64, -64, -64, 64, -64, 64, 64, 64, 64, -64, -64, 64, 64, 64, 64, 64, 64, 64, 64, 64, -64, -64, -64, 64, 64, 64, 64, 64, 64, -64, 64, -64, 64, -64, 64, -64, -64, 64, -64, -64, 64, 64, 64, 64, 64, 64, -64, 64, -64, -64, -64, -64, 64, 64, 64, 64, 64, 64, 64, 64, 64, 64, -64, 64, -64, -64, -64, -64, 64, 64, 64, 64, 64, 64, -64, -64, -64, -64, -64, 64, 64, 64, 64, 64, 64, 64, 64, 64, 64, 64, -64, -64, 64, -64, 64, -64, 64, 64, 64, 64, -64, -64, -64, 64, -64, -64, -64, 64, 64, 64, 64, 64, 64, -64, -64, 64, 64, -64, -64, -64, -64, 64, 64, -64, 64, 64, 64, 64, 64, -64, 64, -64, -64, -64, -64, -64, 64, 64, 64, 64, 64, -64, -64, 64, -64, 64, 64, 64, 64, -64, 64, 64, 64, 64, 64, -64, -64, 64, 64, -64, -64, -64, -64, -64, 64, 64, 64, 64, -64, 64, 64, 64, -64, -64, -64, -64, 64, 64, 64, 64, 64, -64, 64, -64, -64, 64, -64, -64, -64, -64, -64, 64, -64, 64, -64, 64, -64, 64, -64, 64, -64, -64, 64, -64, 64, 64, 64, 64, 64, 64, -64, -64, -64, 64, 64, -64, 64, -64, -64, 64, -64, 64, -64, -64, -64, -64, 64, -64, -64, 64, 64, 64, -64, 64, 64, 64, 64, -64, -64, -64, -64, -64, -64, 64, 64, -64, -64, -64, -64, -64, -64, -64, -64, 64, 64, -64, 64, -64, -64, 64, -64, -64, 64, 64, -64, -64, -64, -64, -64, 64, 64, 64, 64, 64, -64, -64, -64, -64, -64, -64, 64, 64, 64, -64, 64, -64, -64, 64, 64, 64, 64, -64, -64, -64, -64, -64, -64, -64, 64, 64, 64, 64, -64, -64, 64, 64, 64, -64, 64, 64, 64, 64, 64, -64, -64, 64, -64, -64, -64, -64, -64, -64, -64, 64, -64, -64, 64, 64, 64, 64, 64, 64, 64, 64, 64, -64, -64, -64, -64, 64, 64, -64, -64, -64, -64, -64, 64, 64, 64, 64, 64, -64, 64, 64, 64, 64, 64, 64, 64, -64, -64, 64, -64, 64, -64, 64, 64, 64, 64, -64, -64, -64, -64, 64, 64, -64, -64, -64, -64, 64, 64, 64, 64, 64, 64, -64, 64, 64, -64, 64, 64, 64, -64, -64, 64, 64, 64, -64, 64, -64, 64, 64, -64, 64, 64, 64, -64, 64, -64, 64, 64, 64, -64, 64, -64, -64, -64, 64, -64, -64, -64, 64, 64, 64, -64, 64, 64, 64, 64, 64, 64, 64, 64, 64, 64, -64, 64, 64, 64, 64, -64, -64, 64, 64, -64, 64, -64, 64, -64, -64, -64, -64, -64, -64, -64, 64, 64, -64, -64, -64, -64, -64, -64, -64, -64, 64, -64, 64, 64, -64, -64, -64, 64, 64, -64, -64, 64, 64, 64, -64, -64, -64, -64, -64, 64, -64, -64, 64, -64, -64, -64, -64, 64, -64, -64, -64, 64, -64, -64, -64, 64, -64, 64, 64, -64, 64, 64, -64, -64, 64, -64, -64, 64, 64, 64, -64, 64, 64, -64, 64, 64, -64, -64, -64, -64, -64, 64, -64, -64, 64, 64, 64, 64, 64, 64, 64, -64, 64, -64, -64, 64, -64, 64, -64, 64, 64, 64, -64, 64, 64, 64, -64, -64, 64, 64, 64, 64, 64, 64, 64, 64, 64, 64, 64, 64, 64, -64, -64, -64, 64, 64, 64, -64, -64, 64, 64, 64, 64, -64, -64, 64, -64, 64, 64, 64, 64, 64, 64, 64, 64, 64, 64, -64, -64, -64, -64, 64, 64, 64, 64, 64, 64, 64, 64, 64, -64, -64, 64, 64, 64, 64, -64, 64, 64, 64, 64, 64, 64, -64, 64, -64, -64, 64, -64, 64, -64, 64, 64, 64, 64, -64, 64, 64, 64, 64, 64, 64, 64, -64, -64, 64, 64, -64, -64, -64, -64, 64, -64, -64, -64, -64, 64, 64, -64, 64, -64, 64, 64, 64, 64, 64, 64, 64, 64, 64, 64, 64, 64, -64, 64, -64, -64, -64, 64, 64, -64, 64, -64, -64, 64, 64, -64, -64, -64, 64, 64, 64, 64, -64, 64, -64, 64, 64, -64, 64, 64, -64, 64, 64, -64, -64, -64, -64, 64, -64, -64, -64, -64, -64, 64, 64, 64, -64, -64, -64, -64, -64, -64, -64, -64, -64, -64, -64, -64, 64, 64, 64, -64, -64, 64, -64, 64, -64, -64, 64, 64, -64, 64, 64, -64, -64, -64, -64, -64, -64, -64, 64, -64, -64, -64, -64, -64, -64, 64, 64, 64, 64, -64, -64, -64, -64, -64, -64, -64, -64, 64, 64, -64, -64, 64, -64, -64, -64, -64, 64, -64, -64, -64, -64, -64, -64, -64, 64, -64, -64, -64, -64, 64, -64, 64, 64, -64, 64, 64, -64, -64, -64, 64, -64, -64, -64, -64, 64, 64, -64, -64, -64, -64, -64, 64, 64, 64, 64, -64, -64, 64, 64, -64, 64, -64, 64, 64, 64, -64, -64, -64, -64, -64, -64, -64, -64, -64, -64, -64, -64, -64, -64, -64, -64, 64, 64, -64, -64, -64, -64, 64, 64, -64, 64, 64, -64, -64, 64, -64, -64, -64, -64, -64, -64, 64, -64, -64, -64, -64, -64, -64, -64, -64, 64, 64, 64, 64, -64, 64, -64, 64, 64, 64, -64, 64, 64, -64, -64, -64, -64, -64, -64, -64, -64, -64, -64, -64, -64, -64, -64, 64, 64, -64, -64, 64, 64, -64, 64, 64, 64, 64, 64, 64, 64, -64, -64, -64, -64, -64, -64, -64, -64, -64, -64, -64, -64, 64, -64, 64, 64, 64, -64, -64, -64, -64, -64, -64, 64, -64, 64, 64, -64, -64, -64, -64, -64, -64, -64, -64, -64, -64, -64, -64, -64, -64, -64, 64, -64, 64, -64, 64, 64, -64, 64, -64, 64, 64, 64, 64, 64, -64, -64, -64, -64, -64, -64, -64, -64, -64, -64, 64, -64, 64, 64, -64, -64, 64, 64, -64, -64, -64, 64, -64, -64, -64, 64, 64, -64, -64, -64, -64, -64, 64, 64, 64, 64, 64, 64, 64, 64, 64, 64, -64, -64, 64, 64, -64, -64, 64, 64, 64, -64, 64, 64, -64, 64, -64, 64, 64, 64, 64, 64, 64, 64, 64, 64, 64, 64, 64, 64, 64, 64, 64, -64, -64, 64, -64, 64, -64, 64, -64, -64, -64, -64, -64, 64, 64, -64, 64, 64, 64, 64, 64, 64, 64, 64, 64, 64, 64, 64, -64, -64, -64, 64, -64, 64, -64, -64, 64, 64, -64, -64, 64, 64, 64, 64, 64, 64, 64, 64, 64, 64, 64, 64, 64, 64, -64, -64, 64, -64, 64, 64, -64, -64, 64, 64, 64, 64, -64, 64, -64, 64, 64, 64, 64, 64, -64, 64, 64, 64, 64, 64, 64, 64, -64, -64, 64, 64, -64, -64, 64, 64, 64, 64, -64, 64, -64, -64, -64, -64, 64, 64, 64, 64, 64, 64, 64, 64, -64, 64, 64, 64, 64, -64, -64, 64, 64, -64, 64, -64, -64, -64, -64, -64, 64, -64, 64, -64, -64, -64, 64, 64, 64, 64, -64, -64, 64, -64, 64, -64, -64, -64, -64, -64, -64, 64, -64, 64, -64, -64, -64, 64, -64, 64, 64, 64, -64, 64, 64, 64, -64, -64, 64, 64, -64, 64, 64, -64, 64, 64, -64, -64, 64, 64, 64, 64, -64, -64, -64, -64, 64, -64, -64, -64, 64, 64, -64, -64, 64, -64, 64, -64, 64, 64, 64, 64, -64, 64, 64, 64, 64, 64, -64, 64, 64, 64, 64, 64, 64, 64, -64, 64, 64, -64, -64, 64, 64, 64, 64, -64, -64, -64, 64, -64, -64, -64, -64, 64, 64, -64, -64, 64, 64, 64, -64, 64, 64, -64, -64, -64, 64, 64, 64, -64, 64, 64, 64, -64, 64, -64, -64, -64, 64, -64, 64, 64, 64, 64, 64, 64, 64, -64, 64, -64, -64, 64, 64, 64, 64, 64, -64, 64, 64, -64, 64, -64, 64, 64, 64, 64, 64, -64, -64, -64, -64, -64, 64, -64, -64, 64, -64, -64, -64, -64, 64, 64, -64, -64, -64, 64, 64, 64, -64, 64, 64, 64, 64, 64, 64, 64, 64, -64, 64, -64, 64, -64, 64, -64, 64, 64, -64, 64, 64, 64, 64, 64, 64, 64, -64, -64, 64, 64, 64, 64, 64, 64, 64, 64, -64, 64, -64, 64, 64, 64, -64, -64, 64, -64, 64, -64, -64, -64, 64, 64, 64, -64, 64, -64, 64, -64, 64, 64, 64, 64, 64, -64, -64, 64, 64, 64, 64, -64, -64, -64, 64, 64, 64, 64, -64, 64, -64, 64, 64, 64, 64, -64, 64, 64, 64, -64, 64, 64, -64, -64, -64, -64, -64, 64, -64, 64, -64, -64, -64, 64, -64, 64, -64, 64, 64, 64, 64, 64, 64, 64, 64, 64, 64, 64, 64, -64, -64, -64, 64, 64, -64, -64, -64, -64, -64, 64, -64, -64, -64, 64, 64, -64, -64, 64, 64, 64, -64, 64, -64, -64, -64, 64, 64, -64, 64, -64, -64, -64, -64, -64, 64, -64, -64, 64, -64, -64, 64, 64, -64, 64, 64, 64, -64, -64, 64, 64, -64, -64, 64, 64, 64, 64, 64, 64, 64, 64, -64, -64, 64, 64, -64, 64, 64, 64, -64, -64, -64, 64, -64, 64, 64, 64, -64, -64, 64, -64, -64, 64, 64, -64, -64, -64, 64, 64, -64, -64, 64, 64, -64, -64, -64, 64, 64, -64, 64, -64, 64, 64, 64, -64, 64, -64, -64, -64, 64, -64, 64, 64, -64, 64, 64, 64, -64, 64, -64, -64, -64, -64, -64, 64, -64, 64, 64, -64, -64, 64, -64, -64, -64, 64, -64, 64, 64, 64, 64, 64, 64, -64, 64, 64, -64, 64, -64, 64, -64, 64, -64, 64, 64, 64, -64, -64, 64, 64, 64, 64, 64, 64, 64, 64, -64, 64, 64, 64, 64, -64, -64, 64, 64, -64, -64, -64, 64, 64, 64, 64, 64, -64, -64, 64, 64, 64, 64, 64, 64, 64, 64, -64, 64, 64, -64, 64, 64, -64, -64, -64, -64, -64, 64, -64, 64, 64, 64, 64, -64, 64, -64, 64, 64, -64, 64, 64, 64, 64, 64, 64, 64, -64, -64, 64, 64, 64, -64, -64, -64, 64, 64, 64, -64, 64, 64, 64, 64, -64, 64, 64, -64, -64, 64, 64, 64, 64, -64, 64, -64, 64, 64, -64, -64, 64, 64, -64, 64, -64, -64, -64, 64, -64, 64, 64, 64, -64, 64, 64, 64, -64, 64, 64, 64, -64, -64, -64, 64, -64, 64, -64, 64, 64, 64, -64, -64, 64, -64, 64, -64, 64, 64, 64, 64, 64, -64, -64, -64, 64, 64, 64, 64, 64, 64, 64, 64, 64, 64, 64, -64, 64, -64, 64, -64, -64, -64, 64, -64, 64, 64, 64, -64, -64, -64, 64, 64, 64, 64, 64, 64, 64, 64, 64, 64, -64, -64, 64, 64, 64, -64, 64, -64, -64, -64, 64, -64, -64, 64, -64, 64, -64, -64, -64, -64, 64, 64, -64, 64, 64, 64, 64, 64, -64, -64, -64, -64, 64, 64, 64, -64, -64, 64, 64, -64, -64, 64, -64, 64, 64, 64, -64, 64, 64, 64, 64, -64, -64, 64, 64, -64, -64, 64, 64, 64, -64, 64, 64, -64, -64, 64, -64, -64, -64, -64, -64, 64, 64, 64, -64, 64, 64, 64, -64, 64, 64, 64, -64, 64, 64, 64, -64, -64, -64, 64, 64, -64, 64, -64, -64, -64, 64, -64, -64, -64, 64, -64, 64, 64, -64, 64, 64, 64, 64, 64, 64, 64, 64, 64, 64, -64, 64, -64, -64, -64, -64, 64, 64, -64, 64, 64, -64, 64, -64, 64, -64, -64, -64, -64, -64, -64, 64, 64, 64, -64, 64, -64, 64, 64, -64, -64, 64, -64, -64, -64, -64, -64, -64, -64, 64, 64, -64, 64, -64, -64, -64, -64, -64, 64, 64, -64, 64, -64, 64, -64, 64, -64, 64, -64, 64, 64, -64, -64, -64, -64, 64, -64, -64, -64, -64, 64, -64, -64, -64, 64, -64, -64, 64, -64, -64, -64, -64, -64, -64, 64, -64, 64, -64, 64, -64, -64, -64, 64, 64, 64, 64, 64, 64, -64, 64, 64, 64, -64, 64, 64, 64, 64, 64, 64, -64, -64, -64, -64, -64, 64, 64, -64, -64, -64, -64, 64, 64, -64, 64, -64, 64, -64, 64, -64, 64, 64, 64, 64, 64, -64, -64, 64, -64, -64, -64, 64, 64, 64, -64, -64, -64, 64, -64, -64, 64, -64, -64, 64, 64, 64, -64, 64, 64, 64, -64, -64, -64, -64, -64, -64, -64, -64, 64, 64, 64, 64, 64, 64, 64, 64, 64, -64, -64, -64, -64, 64, 64, -64, -64, -64, -64, -64, -64, -64, 64, 64, -64, -64, -64, -64, -64, 64, -64, -64, -64, -64, 64, 64, 64, 64, -64, 64, -64, 64, 64, -64, -64, -64, -64, -64, -64, -64, -64, -64, -64, -64, -64, -64, -64, -64, -64, 64, 64, 64, 64, 64, -64, 64, 64, -64, 64, -64, -64, -64, -64, -64, 64, -64, -64, -64, -64, -64, -64, -64, -64, -64, -64, 64, -64, -64, 64, 64, -64, 64, -64, -64, 64, 64, 64, -64, -64, -64, -64, -64, -64, -64, -64, -64, -64, -64, -64, -64, -64, -64, 64, -64, 64, -64, 64, 64, -64, 64, -64, -64, -64, 64, -64, -64, 64, 64, -64, 64, 64, 64, 64, 64, 64, 64, -64, 64, 64, 64, 64, 64, -64, 64, 64, -64, -64, 64, -64, 64, -64, 64, -64, -64, -64, 64, -64, 64, 64, 64, 64, 64, 64, 64, 64, 64, -64, -64, 64, -64, 64, 64, -64, -64, 64, -64, 64, -64, 64, 64, -64, -64, -64, 64, -64, 64, 64, -64, 64, 64, 64, 64, 64, 64, -64, -64, -64, -64, 64, 64, -64, -64, 64, -64, 64, 64, 64, 64, -64, -64, -64, -64, 64, -64, -64, 64, -64, 64, 64, 64, 64, 64, -64, -64, -64, -64, -64, 64, 64, -64, -64, -64, 64, 64, -64, 64, -64, -64, -64, 64, 64, -64, -64, 64, 64, 64, -64, -64, -64, 64, -64, -64, -64, -64, 64, 64, -64, -64, -64, 64, 64, 64, 64, -64, 64, 64, -64, -64, -64, -64, -64, 64, 64, -64, -64, -64, -64, -64, -64, -64, -64, -64, -64, -64, 64, -64, -64, 64, -64, 64, -64, 64, 64, -64, 64, -64, 64, -64, -64, 64, 64, 64, -64, -64, -64, -64, -64, -64, 64, -64, 64, 64, 64, 64, -64, -64, 64, 64, 64, -64, -64, -64, 64, -64, 64, 64, 64, -64, 64, 64, -64, -64, -64, 64, -64, -64, 64, -64, 64, 64, 64, 64, 64, 64, -64, -64, 64, -64, -64, -64, 64, -64, 64, 64, 64, 64, -64, -64, -64, -64, 64, 64, 64, 64, -64, -64, 64, 64, 64, 64, 64, 64, 64, -64, 64, -64, -64, -64, 64, -64, -64, -64, 64, 64, 64, -64, -64, -64, -64, 64, 64, -64, -64, -64, -64, 64, -64, 64, -64, 64, 64, 64, 64, 64, 64, -64, 64, -64, -64, -64, 64, 64, -64, -64, -64, -64, -64, -64, -64, -64, -64, -64, 64, 64, 64, 64, -64, 64, -64, 64, 64, 64, -64, 64, -64, -64, -64, -64, 64, 64, -64, -64, -64, 64, 64, -64, 64, 64, -64, -64, -64, -64, 64, -64, -64, 64, 64, -64, 64, 64, -64, 64, -64, -64, -64, -64, -64, -64, -64, -64, -64, 64, 64, 64, -64, -64, -64, -64, -64, -64, -64, 64, -64, -64, -64, -64, 64, 64, -64, -64, -64, -64, -64, -64, -64, -64, -64, -64, 64, 64, 64, -64, -64, -64, -64, -64, -64, -64, -64, 64, -64, -64, 64, -64, -64, 64, -64, -64, -64, -64, -64, -64, -64, -64, -64, -64, 64, 64, 64, -64, -64, -64, -64, -64, -64, 64, -64, 64, -64, -64, 64, -64, 64, 64, -64, 64, 64, -64, 64, -64, -64, 64, -64, -64, 64, -64, -64, -64, -64, -64, -64, -64, -64, -64, 64, 64, 64, -64, 64, -64, -64, -64, -64, 64, 64, 64, 64, 64, 64, 64, 64, 64, 64, 64, -64, -64, -64, -64, -64, -64, -64, -64, 64, -64, 64, -64, -64, 64, -64, -64, 64, 64, 64, 64, 64, 64, 64, 64, 64, 64, 64, 64, 64, 64, 64, -64, -64, -64, -64, -64, -64, -64, -64, 64, 64, 64, -64, -64, 64, 64, 64, -64, -64, -64, 64, 64, 64, 64, 64, 64, 64, 64, -64, -64, -64, 64, 64, -64, 64, -64, 64, -64, -64, -64, 64, -64, -64, 64, 64, -64, 64, 64, 64, 64, 64, 64, 64, 64, 64, -64, -64, -64, -64, -64, -64, 64, -64, 64, 64, -64, -64, -64, 64, 64, -64, -64, 64, -64, -64, -64, 64, 64, 64, 64, 64, 64, -64, -64, 64, 64, -64, -64, -64, 64, 64, 64, -64, 64, 64, -64, -64, -64, 64, -64, -64, -64, 64, -64, -64, -64, -64, -64, -64, -64, -64, 64, -64, -64, 64, 64, -64, 64, 64, -64, -64, 64, -64, -64, -64, -64, 64, 64, 64, -64, -64, 64, 64, -64, 64, -64, -64, -64, 64, 64, 64, 64, 64, -64, 64, -64, 64, 64, -64, -64, 64, 64, 64, -64, -64, -64, 64, 64, 64, 64, -64, 64, 64, 64, 64, 64, 64, 64, 64, 64, 64, -64, 64, 64, 64, -64, -64, 64, -64, -64, 64, -64, 64, 64, 64, 64, 64, 64, 64, 64, 64, 64, 64, 64, 64, 64, 64, 64, -64, -64, -64, 64, 64, 64, -64, -64, 64, 64, -64, -64, 64, 64, -64, 64, 64, 64, 64, -64, 64, -64, 64, -64, 64, -64, -64, -64, -64, 64, -64, -64, 64, 64, -64, -64, 64, 64, -64, -64, 64, -64, 64, 64, 64, 64, -64, -64, 64, 64, 64, 64, 64, -64, -64, -64, -64, -64, -64, -64, 64, -64, -64, 64, 64, -64, 64, 64, -64, 64, 64, 64, 64, 64, -64, -64, -64, 64, 64, 64, 64, 64, 64, -64, -64, -64, -64, -64, -64, 64, -64, 64, 64, 64, -64, -64, -64, -64, 64, 64, -64, -64, -64, -64, 64, 64, 64, 64, 64, 64, -64, -64, 64, 64, -64, -64, -64, -64, -64, -64, 64, 64, 64, 64, 64, 64, 64, -64, -64, -64, -64, -64, 64, 64, 64, 64, 64, 64, 64, 64, 64, -64, 64, -64, -64, -64, 64, 64, -64, 64, -64, 64, 64, -64, -64, -64, 64, -64, 64, -64, -64, 64, 64, 64, 64, 64, 64, -64, 64, -64, -64, -64, 64, 64, -64, 64, -64, 64, -64, 64, -64, 64, 64, 64, -64, 64, -64, -64, -64, -64, 64, 64, 64, 64, 64, 64, -64, 64, 64, 64, 64, -64, -64, -64, 64, 64, 64, 64, -64, -64, 64, 64, -64, -64, -64, -64, -64, -64, 64, -64, 64, 64, -64, 64, 64, 64, 64, 64, 64, -64, -64, 64, -64, 64, -64, -64, 64, 64, 64, 64, -64, -64, -64, -64, -64, -64, -64, 64, 64, -64, -64, 64, -64, 64, 64, 64, 64, -64, -64, -64, -64, -64, 64, -64, -64, 64, 64, -64, -64, -64, 64, -64, -64, -64, 64, -64, 64, 64, 64, -64, 64, -64, -64, 64, 64, 64, 64, -64, 64, -64, 64, -64, 64, 64, 64, 64, 64, 64, 64, -64, -64, 64, -64, 64, 64, 64, 64, -64, 64, -64, 64, 64, -64, 64, 64, 64, -64, -64, -64, 64, -64, -64, 64, 64, -64, 64, -64, 64, -64, -64, 64, -64, 64, 64, 64, -64, -64, -64, -64, -64, 64, 64, 64, 64, 64, 64, -64, -64, -64, -64, -64, 64, 64, 64, -64, 64, 64, 64, 64, -64, -64, -64, -64, 64, -64, -64, 64, -64, -64, -64, 64, -64, 64, -64, 64, 64, 64, 64, 64, -64, -64, 64, 64, 64, 64, 64, 64, 64, 64, 64, -64, -64, 64, -64, -64, 64, -64, -64, 64, -64, -64, -64, -64, 64, -64, -64, -64, -64, 64, 64, 64, 64, 64, 64, 64, 64, 64, 64, 64, 64, -64, -64, 64, 64, -64, -64, -64, -64, 64, 64, 64, -64, 64, 64, -64, 64, 64, -64, -64, 64, 64, 64, 64, 64, 64, 64, -64, 64, -64, -64, 64, 64, 64, -64, 64, 64, -64, 64, -64, 64, 64, 64, 64, 64, 64, 64, 64, 64, 64, 64, 64, 64, 64, 64, 64, -64, -64, -64, -64, 64, -64, 64, 64, 64, 64, 64, 64, -64, 64, -64, 64, 64, 64, 64, 64, 64, 64, 64, -64, -64, 64, 64, 64, -64, -64, -64, -64, -64, -64, -64, 64, -64, -64, -64, 64, -64, -64, -64, 64, 64, 64, -64, 64, 64, 64, 64, 64, 64, 64, -64, -64, -64, -64, -64, -64, 64, 64, -64, 64, 64, -64, -64, -64, 64, -64, 64, 64, -64, 64, 64, 64, 64, 64, -64, 64, -64, -64, -64, -64, -64, -64, -64, -64, 64, -64, 64, 64, -64, -64, -64, -64, 64, 64, 64, 64, -64, 64, 64, -64, -64, -64, 64, 64, 64, 64, -64, -64, 64, 64, 64, 64, 64, -64, -64, 64, -64, 64, 64, 64, -64, 64, 64, 64, 64, 64, 64, 64, -64, 64, 64, 64, 64, 64, 64, 64, 64, -64, -64, 64, 64, -64, 64, 64, -64, 64, -64, -64, 64, -64, -64, 64, 64, -64, 64, 64, 64, 64, 64, 64, 64, 64, 64, 64, 64, 64, 64, 64, 64, -64, -64, -64, 64, -64, 64, -64, -64, 64, -64, 64, -64, 64, 64, 64, -64, -64, 64, -64, 64, 64, 64, 64, 64, -64, -64, 64, 64, 64, -64, 64, 64, -64, -64, -64, 64, 64, -64, 64, 64, 64, 64, -64, 64, 64, -64, -64, 64, -64, 64, -64, -64, -64, -64, -64, -64, 64, -64, -64, 64, -64, 64, -64, 64, 64, -64, 64, 64, 64, -64, 64, 64, 64, -64, 64, 64, -64, -64, -64, -64, 64, 64, 64, 64, 64, 64, 64, 64, 64, 64, -64, -64, 64, 64, 64, 64, 64, -64, 64, -64, -64, -64, 64, -64, -64, -64, -64, 64, -64, -64, 64, 64, 64, -64, -64, 64, -64, 64, 64, -64, -64, 64, -64, 64, -64, -64, 64, 64, 64, -64, -64, 64, -64, -64, 64, -64, 64, 64, -64, 64, -64, 64, -64, -64, -64, 64, -64, 64, -64, -64, 64, 64, -64, 64, -64, 64, -64, 64, 64, -64, 64, -64, 64, 64, -64, 64, -64, 64, 64, 64, -64, 64, -64, -64, -64, 64, -64, -64, -64, 64, 64, -64, 64, -64, -64, 64, 64, 64, -64, -64, -64, 64, 64, 64, 64, 64, -64, -64, 64, 64, 64, -64, 64, -64, 64, 64, -64, 64, 64, 64, -64, -64, 64, 64, -64, -64, 64, 64, 64, -64, 64, 64, 64, -64, -64, 64, -64, 64, 64, -64, -64, 64, 64, 64, 64, 64, 64, -64, 64, 64, 64, -64, 64, 64, -64, -64, 64, 64, 64, 64, 64, 64, 64, -64, 64, 64, -64, 64, -64, -64, 64, -64, -64, 64, 64, -64, 64, -64, 64, 64, 64, 64, -64, 64, 64, 64, 64, 64, 64, -64, 64, 64, 64, 64, -64, -64, -64, -64, -64, 64, 64, 64, 64, 64, 64, -64, 64, -64, 64, -64, 64, 64, 64, 64, 64, 64, 64, -64, 64, 64, -64, 64, -64, 64, 64, -64, 64, -64, -64, 64, 64, -64, 64, 64, 64, 64, -64, -64, 64, 64, -64, 64, 64, 64, -64, 64, -64, -64, -64, 64, -64, 64, -64, -64, 64, 64, 64, -64, 64, 64, 64, -64, -64, -64, -64, -64, -64, 64, 64, 64, 64, -64, -64, 64, -64, 64, 64, -64, -64, 64, -64, -64, 64, -64, 64, -64, 64, -64, 64, -64, 64, 64, 64, 64, 64, 64, -64, -64, 64, 64, -64, -64, 64, 64, -64, 64, 64, -64, -64, 64, -64, -64, -64, -64, 64, 64, 64, 64, 64, 64, 64, -64, 64, 64, 64, 64, 64, -64, 64, 64, 64, 64, 64, 64, 64, -64, 64, -64, 64, -64, 64, 64, 64, 64, 64, 64, -64, 64, 64, 64, 64, 64, 64, -64, 64, 64, 64, 64, -64, -64, -64, 64, -64, 64, 64, 64, -64, 64, -64, 64, 64, 64, -64, 64, -64, 64, 64, 64, 64, 64, 64, 64, 64, -64, 64, -64, 64, 64, -64, -64, -64, 64, -64, 64, -64, 64, 64, 64, 64, 64, 64, 64, -64, 64, 64, 64, 64, 64, -64, -64, -64, 64, 64, 64, 64, 64, -64, -64, -64, -64, 64, -64, -64, -64, -64, 64, 64, 64, 64, 64, 64, 64, 64, 64, -64, 64, 64, 64, 64, 64, -64, 64, 64, -64, -64, -64, -64, 64, 64, 64, -64, 64, 64, 64, 64, -64, -64, -64, -64, 64, 64, -64, 64, 64, 64, 64, -64, 64, -64, -64, -64, -64, 64, -64, 64, 64, -64, -64, -64, 64, -64, 64, 64, 64, -64, 64, -64, 64, 64, -64, 64, -64, 64, 64, -64, 64, 64, 64, 64, 64, 64, -64, 64, -64, -64, -64, -64, 64, -64, 64, 64, 64, 64, 64, 64, 64, -64, -64, 64, 64, -64, 64, 64, 64, 64, 64, 64, 64, -64, -64, 64, 64, -64, 64, -64, -64, 64, -64, 64, -64, 64, 64, -64, -64, 64, -64, 64, 64, 64, 64, -64, 64, 64, 64, -64, 64, -64, -64, 64, -64, -64, 64, 64, 64, 64, 64, 64, 64, 64, -64, 64, 64, -64, 64, -64, 64, -64, 64, -64, 64, 64, -64, 64, -64, 64, -64, -64, -64, 64, -64, -64, 64, -64, 64, 64, -64, 64, -64, -64, 64, -64, 64, -64, 64, 64, 64, -64, -64, -64, 64, 64, -64, 64, -64, -64, 64, -64, 64, 64, 64, -64, -64, -64, -64, -64, 64, 64, -64, 64, 64, -64, -64, 64, -64, 64, 64, 64, -64, 64, -64, -64, -64, -64, -64, -64, 64, -64, 64, 64, 64, -64, 64, 64, -64, -64, 64, 64, -64, 64, 64, -64, 64, -64, 64, -64, 64, -64, -64, 64, -64, -64, -64, 64, 64, -64, -64, -64, 64, -64, 64, -64, 64, -64, -64, -64, -64, 64, -64, -64, 64, -64, 64, 64, -64, 64, 64, 64, -64, -64, 64, -64, 64, 64, 64, 64, 64, 64, -64, 64, -64, 64, 64, 64, -64, -64, 64, 64, 64, 64, 64, -64, 64, 64, 64, -64, 64, 64, 64, -64, -64, -64, 64, 64, -64, 64, 64, 64, -64, 64, 64, 64, 64, -64, -64, 64, -64, 64, 64, -64, -64, 64, -64, 64, 64, 64, -64, -64, -64, 64, -64, 64, 64, -64, 64, 64, -64, -64, 64, 64, -64, -64, 64, -64, 64, 64, 64, -64, -64, -64, 64, -64, 64, -64, 64, 64, -64, -64, 64, -64, 64, -64, -64, -64, 64, 64, -64, -64, -64, 64, -64, -64, 64, 64, -64, 64, 64, -64, 64, -64, -64, -64, 64, 64, 64, -64, -64, -64, -64, 64, -64, -64, 64, -64, -64, 64, -64, 64, -64, 64, -64, 64, 64, 64, -64, 64, -64, -64, -64, -64, 64, -64, 64, -64, -64, 64, 64, -64, 64, 64, 64, -64, -64, -64, 64, -64, -64, 64, -64, -64, -64, 64, 64, 64, -64, -64, 64, -64, 64, -64, 64, -64, 64, 64, 64, 64, -64, -64, 64, 64, -64, 64, 64, 64, 64, 64, 64, 64, 64, 64, 64, 64, 64, 64, -64, 64, -64, 64, 64, -64, 64, -64, -64, 64, 64, -64, -64, 64, 64, -64, 64, 64, 64, 64, 64, -64, 64, 64, 64, 64, 64, -64, 64, -64, 64, -64, -64, 64, 64, -64, 64, 64, 64, -64, 64, 64, 64, 64, 64, 64, 64, -64, 64, 64, -64, 64, 64, 64, -64, 64, -64, -64, -64, -64, -64, 64, -64, -64, 64, -64, -64, 64, -64, -64, -64, 64, -64, 64, 64, 64, -64, -64, 64, 64, 64, 64, 64, 64, 64, 64, -64, 64, -64, 64, -64, 64, 64, -64, 64, -64, 64, -64, 64, -64, 64, -64, 64, 64, 64, -64, 64, 64, -64, 64, 64, 64, 64, -64, 64, 64, 64, 64, 64, 64, 64, 64, 64, -64, -64, 64, 64, 64, 64, 64, 64, 64, 64, -64, -64, -64, -64, 64, 64, 64, -64, -64, 64, 64, -64, -64, -64, 64, -64, 64, 64, 64, -64, -64, 64, 64, -64, -64, 64, -64, 64, 64, -64, 64, 64, -64, 64, 64, 64, 64, -64, -64, 64, 64, 64, 64, -64, -64, 64, 64, 64, 64, 64, 64, 64, 64, 64, 64, -64, -64, 64, 64, 64, -64, -64, -64, -64, -64, -64, -64, 64, -64, 64, 64, 64, 64, -64, -64, 64, 64, -64, -64, 64, -64, -64, -64, 64, -64, 64, 64, 64, 64, 64, -64, 64, 64, 64, 64, 64, -64, -64, 64, 64, 64, 64, 64, 64, 64, 64, 64, 64, 64, -64, 64, -64, 64, 64, 64, -64, 64, -64, 64, 64, -64, 64, 64, -64, -64, 64, -64, 64, -64, 64, 64, -64, -64, 64, -64, -64, 64, -64, 64, 64, -64, -64, 64, 64, -64, 64, 64, 64, -64, 64, 64, -64, 64, 64, 64, -64, -64, 64, 64, -64, -64, -64, 64, 64, -64, 64, 64, -64, 64, 64, -64, 64, 64, 64, -64, -64, 64, 64, -64, 64, 64, -64, 64, 64, 64, 64, 64, 64, 64, -64, 64, 64, 64, -64, 64, 64, 64, -64, 64, -64, -64, -64, 64, 64, -64, -64, 64, -64, -64, -64, 64, 64, 64, 64, 64, -64, 64, 64, 64, 64, 64, 64, -64, -64, -64, -64, 64, 64, 64, 64, 64, 64, -64, -64, -64, 64, -64, -64, 64, 64, -64, -64, 64, -64, -64, -64, -64, 64, 64, -64, 64, 64, -64, 64, -64, 64, 64, 64, 64, -64, -64, 64, -64, 64, 64, -64, 64, 64, -64, 64, 64, 64, -64, -64, -64, -64, 64, -64, 64, -64, 64, -64, -64, 64, 64, -64, -64, 64, -64, 64, -64, -64, -64, 64, -64, -64, 64, -64, 64, 64, -64, 64, 64, 64, 64, 64, -64, 64, 64, -64, 64, 64, -64, -64, -64, -64, 64, -64, -64, -64, -64, 64, 64, 64, 64, -64, 64, 64, 64, 64, 64, 64, 64, 64, -64, 64, -64, -64, -64, -64, 64, -64, -64, -64, -64, -64, -64, 64, 64, 64, -64, -64, -64, 64, -64, -64, 64, -64, 64, 64, 64, -64, 64, 64, 64, -64, -64, -64, 64, 64, 64, -64, 64, 64, -64, -64, -64, -64, -64, 64, 64, 64, 64, 64, -64, -64, -64, -64, 64, 64, 64, -64, -64, 64, 64, 64, 64, -64, 64, -64, -64, -64, 64, -64, 64, 64, -64, -64, -64, -64, -64, -64, -64, 64, 64, 64, -64, 64, 64, -64, -64, 64, -64, -64, -64, 64, 64, 64, -64, 64, 64, 64, -64, -64, -64, -64, -64, -64, -64, -64, -64, -64, 64, 64, 64, -64, -64, -64, 64, 64, -64, -64, -64, 64, 64, 64, -64, -64, 64, -64, 64, 64, -64, 64, 64, 64, 64, -64, -64, 64, 64, -64, 64, -64, -64, -64, -64, -64, -64, -64, -64, -64, -64, 64, 64, 64, -64, 64, -64, 64, -64, 64, 64, -64, 64, -64, 64, 64, -64, -64, -64, -64, -64, -64, 64, -64, -64, 64, 64, 64, 64, -64, 64, 64, 64, -64, -64, 64, -64, 64, -64, 64, -64, 64, -64, -64, 64, -64, -64, -64, 64, 64, 64, 64, 64, -64, -64, 64, 64, -64, -64, -64, 64, -64, -64, -64, 64, 64, 64, -64, 64, 64, -64, -64, -64, 64, -64, -64, 64, -64, 64, 64, 64, -64, 64, -64, 64, 64, 64, -64, -64, 64, 64, 64, -64, 64, 64, 64, 64, 64, -64, -64, 64, -64, 64, 64, 64, -64, 64, 64, 64, 64, -64, 64, 64, -64, -64, 64, -64, -64, 64, 64, 64, 64, 64, 64, 64, 64, 64, 64, 64, 64, 64, 64, 64, 64, 64, 64, 64, 64, -64, -64, -64, -64, 64, -64, 64, 64, 64, 64, 64, 64, 64, 64, 64, 64, 64, 64, 64, 64, 64, 64, 64, 64, 64, -64, -64, -64, -64, -64, -64, 64, 64, -64, 64, 64, 64, -64, 64, 64, 64, 64, 64, -64, -64, 64, -64, 64, 64, 64, 64, 64, 64, -64, -64, -64, -64, -64, 64, -64, -64, 64, 64, -64, 64, 64, -64, -64, -64, -64, 64, -64, -64, -64, -64, 64, 64, -64, -64, -64, -64, 64, -64, 64, -64, -64, -64, -64, -64, 64, 64, 64, -64, -64, -64, -64, 64, -64, -64, -64, -64, -64, -64, -64, 64, -64, -64, 64, 64, -64, -64, 64, 64, -64, -64, -64, 64, -64, 64, -64, -64, -64, -64, -64, -64, 64, -64, -64, -64, -64, -64, 64, -64, -64, -64, -64, -64, -64, -64, -64, -64, -64, -64, -64, -64, -64, -64, -64, 64, -64, -64, 64, -64, -64, -64, -64, -64, -64, -64, 64, 64, -64, -64, 64, -64, -64, 64, -64, -64, -64, -64, -64, -64, 64, -64, 64, -64, 64, 64, 64, -64, -64, -64, -64, -64, -64, 64, 64, 64, 64, -64, -64, -64, -64, 64, -64, 64, -64, -64, 64, 64, 64, -64, -64, -64, 64, 64, 64, -64, -64, -64, -64, -64, -64, 64, 64, 64, 64, 64, -64, -64, 64, -64, -64, -64, 64, -64, -64, -64, -64, -64, 64, -64, 64, 64, -64, -64, -64, -64, -64, -64, -64, 64, 64, -64, -64, -64, -64, -64, -64, 64, -64, 64, 64, -64, -64, -64, 64, 64, -64, 64, 64, 64, 64, -64, -64, -64, -64, -64, -64, 64, 64, -64, -64, -64, 64, -64, -64, 64, -64, -64, -64, -64, -64, -64, 64, -64, -64, 64, 64, 64, 64, 64, -64, -64, -64, -64, -64, -64, 64, 64, 64, -64, 64, 64, -64, -64, 64, 64, 64, 64, 64, 64, -64, 64, 64, 64, 64, 64, 64, 64, -64, -64, -64, 64, -64, 64, -64, -64, -64, 64, -64, -64, -64, 64, 64, 64, -64, -64, 64, 64, 64, -64, -64, 64, 64, 64, 64, 64, -64, 64, -64, 64, -64, -64, -64, -64, -64, 64, 64, 64, 64, 64, 64, 64, -64, 64, 64, -64, 64, 64, -64, 64, 64, 64, 64, 64, -64, -64, 64, 64, -64, -64, -64, -64, -64, 64, 64, 64, 64, 64, 64, 64, -64, 64, 64, -64, -64, -64, 64, 64, 64, 64, 64, 64, 64, 64, 64, -64, -64, -64, 64, 64, 64, 64, 64, 64, 64, 64, -64, -64, -64, 64, -64, -64, 64, 64, 64, -64, 64, 64, 64, 64, -64, 64, 64, -64, -64, -64, 64, 64, 64, 64, 64, 64, 64, 64, 64, -64, 64, -64, 64, 64, 64, -64, 64, -64, 64, 64, 64, -64, 64, 64, -64, -64, 64, 64, 64, -64, -64, 64, 64, 64, -64, 64, 64, -64, -64, 64, 64, 64, 64, 64, 64, 64, 64, 64, 64, 64, 64, 64, -64, -64, -64, 64, -64, -64, -64, 64, 64, 64, 64, 64, 64, 64, 64, 64, 64, -64, 64, 64, -64, -64, 64, 64, -64, 64, 64, 64, -64, -64, -64, -64, -64, -64, -64, 64, 64, 64, 64, -64, -64, 64, 64, 64, 64, 64, -64, -64, -64, 64, -64, 64, 64, -64, 64, -64, -64, -64, 64, 64, -64, -64, -64, 64, 64, 64, 64, 64, 64, 64, -64, 64, 64, 64, 64, -64, 64, 64, 64, 64, 64, -64, 64, -64, -64, -64, 64, 64, 64, -64, -64, -64, 64, 64, 64, 64, 64, -64, 64, 64, 64, -64, 64, -64, -64, -64, -64, 64, 64, 64, 64, 64, 64, -64, -64, 64, 64, -64, -64, -64, 64, 64, 64, 64, 64, 64, -64, -64, -64, -64, 64, -64, -64, 64, 64, 64, 64, -64, 64, -64, 64, -64, -64, 64, 64, 64, 64, 64, -64, 64, 64, 64, 64, 64, -64, 64, 64, -64, 64, -64, -64, 64, 64, -64, -64, -64, 64, -64, -64, 64, -64, -64, 64, -64, -64, -64, -64, 64, 64, 64, -64, -64, -64, -64, 64, 64, 64, -64, 64, -64, -64, 64, 64, -64, 64, 64, 64, -64, 64, 64, 64, -64, -64, -64, -64, -64, 64, 64, -64, 64, 64, -64, 64, 64, 64, 64, 64, 64, -64, 64, -64, -64, 64, -64, 64, -64, -64, 64, -64, 64, -64, 64, 64, -64, 64, -64, 64, 64, 64, -64, 64, -64, 64, -64, -64, -64, -64, -64, -64, 64, 64, 64, 64, 64, 64, 64, 64, 64, 64, 64, -64, 64, -64, -64, 64, 64, -64, -64, -64, 64, -64, -64, 64, 64, -64, -64, -64, 64, 64, 64, 64, 64, 64, 64, 64, 64, 64, 64, 64, -64, 64, -64, 64, -64, 64, -64, 64, -64, 64, -64, 64, -64, 64, -64, -64, -64, 64, 64, 64, 64, 64, 64, 64, 64, 64, -64, 64, 64, 64, 64, 64, 64, 64, 64, -64, 64, 64, 64, 64, 64, 64, -64, -64, 64, -64, -64, 64, 64, 64, -64, 64, 64, 64, 64, -64, 64, 64, 64, 64, 64, -64, 64, 64, -64, -64, 64, 64, 64, 64, -64, -64, 64, -64, 64, 64, 64, 64, 64, 64, 64, 64, -64, 64, 64, 64, 64, 64, 64, 64, -64, -64, -64, 64, -64, -64, 64, -64, 64, 64, -64, 64, 64, 64, -64, 64, 64, 64, 64, 64, 64, 64, 64, 64, 64, 64, 64, 64, 64, 64, -64, -64, -64, 64, 64, -64, -64, -64, 64, 64, -64, 64, -64, 64, 64, -64, 64, 64, 64, 64, 64, 64, 64, 64, -64, 64, 64, -64, -64, -64, -64, -64, -64, -64, 64, -64, 64, 64, 64, -64, 64, 64, 64, -64, -64, 64, 64, 64, 64, 64, 64, 64, -64, -64, 64, -64, 64, -64, 64, 64, 64, 64, 64, -64, 64, 64, -64, 64, 64, 64, -64, 64, -64, 64, 64, 64, 64, 64, 64, 64, 64, -64, 64, 64, -64, 64, 64, -64, 64, 64, 64, -64, 64, 64, 64, 64, 64, -64, -64, 64, 64, 64, 64, 64, 64, 64, 64, 64, 64, 64, 64, -64, 64, -64, 64, -64, 64, 64, 64, 64, 64, 64, 64, 64, 64, 64, -64, 64, 64, 64, 64, 64, -64, -64, -64, 64, 64, -64, 64, -64, -64, -64, -64, 64, 64, 64, 64, 64, 64, 64, 64, 64, 64, 64, -64, -64, 64, 64, 64, 64, -64, 64, 64, -64, 64, 64, -64, 64, 64, -64, -64, -64, -64, 64, 64, 64, 64, -64, 64, 64, 64, 64, -64, 64, 64, 64, 64, 64, 64, 64, 64, -64, 64, 64, 64, 64, 64, 64, 64, 64, 64, 64, -64, 64, 64, 64, 64, 64, 64, 64, -64, 64, 64, 64, 64, 64, 64, -64, 64, -64, -64, -64, -64, 64, 64, 64, -64, 64, 64, -64, 64, 64, 64, 64, -64, 64, 64, 64, -64, -64, 64, 64, 64, 64, -64, -64, 64, 64, 64, 64, 64, 64, -64, 64, -64, 64, 64, 64, -64, 64, -64, -64, 64, 64, 64, -64, 64, 64, 64, 64, 64, 64, -64, 64, 64, 64, -64, 64, -64, -64, 64, -64, -64, -64, 64, -64, -64, 64, 64, 64, 64, 64, 64, 64, -64, -64, 64, 64, 64, 64, -64, 64, 64, 64, -64, 64, -64, -64, 64, -64, 64, -64, 64, 64, -64, 64, -64, 64, -64, 64, 64, 64, 64, -64, -64, 64, 64, 64, 64, -64, 64, 64, -64, -64, 64, -64, 64, 64, 64, 64, -64, 64, 64, -64, 64, 64, 64, 64, 64, 64, 64, -64, -64, 64, 64, 64, 64, -64, -64, 64, -64, 64, -64, -64, -64, 64, -64, 64, 64, -64, 64, 64, 64, -64, 64, 64, 64, 64, 64, -64, -64, -64, 64, 64, 64, -64, -64, 64, -64, 64, 64, -64, -64, -64, 64, 64, -64, 64, 64, 64, 64, 64, 64, 64, 64, 64, 64, 64, -64, -64, 64, 64, 64, 64, 64, 64, 64, -64, -64, 64, -64, 64, 64, -64, -64, -64, -64, 64, 64, 64, 64, 64, 64, 64, 64, 64, -64, -64, 64, 64, -64, 64, 64, 64, 64, 64, 64, 64, 64, -64, 64, -64, 64, 64, -64, -64, 64, 64, -64, 64, -64, -64, -64, 64, 64, -64, -64, -64, -64, 64, 64, 64, -64, -64, -64, -64, -64, -64, 64, 64, -64, -64, 64, 64, -64, -64, 64, 64, -64, 64, -64, -64, 64, -64, 64, -64, -64, 64, -64, 64, -64, 64, 64, 64, -64, 64, -64, -64, -64, -64, 64, -64, -64, -64, 64, -64, 64, -64, -64, -64, -64, 64, 64, 64, 64, -64, -64, -64, 64, -64, 64, -64, 64, -64, -64, -64, -64, -64, 64, -64, 64, 64, -64, 64, 64, -64, 64, 64, 64, 64, 64, 64, -64, -64, -64, -64, -64, -64, -64, 64, -64, 64, -64, -64, -64, -64, -64, -64, -64, -64, -64, -64, -64, -64, 64, 64, 64, 64, 64, 64, 64, -64, -64, 64, -64, 64, 64, 64, -64, 64, 64, -64, 64, 64, 64, -64, 64, 64, 64, 64, -64, -64, 64, -64, -64, -64, -64, -64, 64, 64, 64, -64, -64, -64, 64, -64, -64, 64, 64, -64, -64, 64, 64, 64, -64, -64, -64, -64, -64, -64, -64, -64, -64, -64, -64, -64, 64, 64, 64, -64, 64, 64, -64, 64, -64, 64, 64, -64, -64, 64, 64, 64, 64, -64, -64, 64, -64, 64, 64, -64, -64, -64, -64, 64, 64, 64, -64, -64, 64, 64, 64, 64, 64, 64, -64, -64, 64, 64, -64, 64, -64, 64, -64, -64, -64, -64, 64, -64, -64, -64, 64, -64, -64, -64, -64, 64, 64, 64, 64, -64, 64, -64, -64, 64, 64, -64, -64, -64, 64, 64, 64, 64, -64, -64, 64, -64, 64, -64, 64, -64, 64, 64, 64, -64, 64, -64, 64, 64, -64, -64, 64, 64, 64, -64, -64, -64, -64, 64, -64, -64, 64, 64, -64, -64, 64, 64, -64, 64, 64, 64, 64, -64, -64, -64, 64, 64, -64, 64, -64, 64, -64, -64, 64, -64, -64, -64, 64, -64, -64, -64, -64, 64, -64, -64, -64, 64, 64, 64, 64, 64, 64, 64, 64, 64, 64, -64, -64, -64, -64, -64, -64, 64, -64, -64, 64, 64, 64, -64, -64, -64, -64, -64, -64, -64, -64, 64, 64, -64, 64, -64, -64, -64, -64, -64, 64, -64, 64, 64, 64, -64, -64, -64, 64, -64, -64, 64, -64, -64, -64, -64, -64, -64, 64, -64, -64, 64, 64, 64, 64, -64, 64, 64, 64, 64, 64, 64, -64, -64, -64, -64, 64, 64, 64, 64, -64, -64, -64, -64, -64, -64, 64, 64, 64, -64, -64, -64, -64, 64, 64, -64, 64, -64, 64, 64, -64, 64, -64, -64, 64, 64, -64, -64, -64, -64, -64, -64, -64, 64, 64, -64, 64, -64, -64, -64, -64, -64, -64, 64, -64, -64, 64, 64, -64, 64, -64, -64, 64, 64, 64, -64, -64, -64, -64, 64, 64, -64, -64, -64, 64, 64, 64, -64, -64, -64, 64, -64, -64, 64, 64, 64, 64, 64, -64, 64, -64, 64, -64, -64, -64, -64, -64, 64, 64, -64, 64, 64, 64, 64, 64, -64, -64, -64, 64, -64, -64, -64, -64, -64, 64, 64, 64, 64, 64, -64, -64, -64, -64, -64, 64, 64, 64, 64, -64, -64, -64, -64, 64, -64, -64, -64, 64, -64, -64, 64, -64, -64, 64, 64, 64, 64, -64, -64, -64, -64, -64, -64, 64, 64, 64, 64, 64, -64, 64, -64, 64, -64, -64, -64, -64, -64, 64, 64, -64, -64, 64, 64, 64, 64, -64, -64, -64, -64, 64, -64, -64, 64, 64, 64, 64, -64, 64, -64, -64, -64, -64, 64, 64, 64, 64, -64, -64, -64, -64, -64, 64, -64, -64, -64, -64, 64, 64, 64, 64, -64, 64, 64, -64, -64, -64, -64, -64, -64, -64, 64, -64, -64, -64, 64, -64, -64, -64, -64, -64, -64, -64, 64, 64, -64, 64, -64, -64, -64, -64, -64, -64, -64, -64, -64, -64, -64, -64, 64, -64, 64, 64, -64, -64, -64, -64, -64, -64, -64, -64, 64, 64, -64, 64, -64, -64, -64, -64, -64, -64, -64, -64, -64, -64, -64, 64, -64, -64, 64, 64, -64, -64, -64, -64, -64, -64, -64, -64, -64, -64, 64, -64, -64, -64, -64, -64, -64, -64, -64, 64, -64, -64, -64, -64, 64, 64, -64, 64, 64, -64, -64, -64, -64, 64, 64, -64, 64, 64, 64, -64, -64, -64, -64, 64, -64, -64, -64, 64, 64, 64, 64, 64, 64, 64, 64, 64, -64, 64, -64, -64, 64, 64, -64, 64, 64, 64, -64, -64, -64, -64, -64, -64, -64, -64, 64, -64, 64, 64, 64, -64, 64, -64, 64, 64, 64, 64, 64, 64, 64, -64, 64, 64, 64, -64, -64, -64, -64, -64, 64, 64, -64, -64, 64, 64, -64, 64, 64, -64, 64, -64, 64, -64, -64, 64, 64, 64, 64, 64, 64, 64, 64, 64, 64, 64, 64, -64, -64, -64, -64, -64, 64, -64, 64, 64, 64, -64, -64, 64, 64, -64, -64, 64, -64, 64, 64, 64, 64, 64, -64, 64, -64, -64, -64, -64, -64, -64, -64, -64, 64, -64, -64, 64, -64, 64, 64, 64, 64, 64, -64, 64, -64, -64, 64, 64, 64, -64, 64, -64, 64, 64, -64, 64, 64, -64, -64, 64, -64, -64, 64, -64, -64, -64, 64, -64, -64, 64, 64, 64, 64, -64, -64, 64, 64, 64, -64, -64, 64, -64, 64, 64, -64, -64, -64, 64, 64, -64, 64, 64, 64, 64, -64, 64, -64, -64, -64, 64, -64, 64, -64, 64, 64, -64, -64, -64, 64, -64, 64, 64, 64, -64, 64, -64, -64, 64, -64, 64, 64, 64, 64, -64, 64, 64, 64, 64, -64, -64, -64, 64, -64, -64, -64, 64, 64, 64, -64, 64, -64, -64, -64, 64, 64, 64, 64, -64, -64, 64, -64, -64, 64, -64, -64, 64, 64, 64, -64, 64, -64, -64, -64, -64, 64, 64, 64, 64, -64, 64, -64, 64, 64, -64, 64, -64, -64, -64, 64, -64, 64, -64, -64, -64, 64, -64, 64, 64, -64, 64, 64, 64, -64, -64, 64, 64, -64, -64, -64, 64, 64, 64, 64, -64, 64, 64, 64, 64, -64, 64, -64, -64, -64, 64, -64, -64, 64, -64, 64, 64, 64, 64, 64, 64, 64, -64, 64, 64, 64, 64, -64, -64, -64, -64, -64, -64, 64, 64, -64, -64, -64, -64, 64, -64, -64, -64, -64, 64, 64, 64, 64, -64, -64, 64, 64, 64, 64, 64, 64, 64, 64, -64, -64, -64, -64, -64, -64, -64, -64, -64, -64, 64, -64, 64, 64, 64, -64, 64, 64, 64, -64, 64, -64, -64, -64, 64, 64, 64, 64, -64, -64, 64, 64, -64, -64, -64, -64, -64, -64, -64, -64, 64, 64, 64, -64, -64, -64, 64, 64, -64, 64, 64, -64, 64, 64, -64, 64, -64, -64, -64, -64, -64, 64, -64, -64, -64, -64, -64, -64, -64, 64, 64, 64, -64, 64, 64, 64, -64, -64, 64, 64, -64, -64, -64, 64, -64, -64, -64, -64, 64, -64, -64, -64, 64, -64, 64, 64, 64, 64, 64, 64, -64, 64, -64, -64, -64, 64, 64, -64, 64, -64, -64, -64, -64, 64, -64, 64, -64, -64, -64, -64, 64, 64, 64, 64, 64, 64, 64, 64, 64, -64, -64, -64, 64, 64, 64, -64, -64, -64, -64, 64, -64, 64, -64, 64, -64, -64, -64, 64, 64, 64, 64, 64, 64, 64, 64, 64, -64, -64, -64, -64, -64, -64, 64, -64, -64, -64, -64, 64, -64, 64, -64, -64, -64, 64, -64, 64, 64, 64, 64, 64, 64, 64, 64, -64, -64, -64, -64, -64, -64, 64, 64, 64, 64, 64, 64, -64, 64, -64, 64, 64, -64, -64, 64, 64, 64, 64, 64, 64, 64, 64, -64, -64, -64, -64, -64, -64, 64, 64, -64, -64, 64, 64, 64, 64, -64, -64, 64, 64, -64, 64, 64, 64, 64, 64, 64, 64, 64, 64, -64, -64, -64, -64, -64, -64, 64, -64, -64, -64, -64, -64, -64, -64, -64, -64, -64, -64, 64, -64, 64, 64, 64, -64, 64, 64, 64, 64, -64, -64, -64, -64, -64, -64, 64, -64, -64, -64, -64, 64, -64, 64, 64, 64, -64, 64, 64, -64, 64, -64, 64, 64, -64, -64, -64, 64, -64, -64, -64, -64, 64, 64, 64, 64, -64, -64, 64, -64, -64, 64, 64, -64, -64, -64, 64, -64, -64, 64, -64, 64, -64, -64, 64, -64, -64, -64, -64, -64, 64, 64, 64, 64, 64, 64, -64, -64, -64, -64, -64, -64, -64, -64, -64, -64, -64, 64, 64, -64, -64, -64, -64, -64, -64, -64, -64, -64, 64, 64, -64, 64, 64, -64, 64, 64, -64, -64, -64, -64, 64, 64, 64, -64, -64, 64, 64, -64, -64, 64, 64, -64, -64, 64, 64, -64, -64, 64, 64, -64, 64, 64, 64, 64, 64, 64, 64, -64, -64, -64, -64, 64, 64, 64, 64, 64, -64, -64, 64, -64, 64, 64, 64, -64, -64, -64, 64, 64, 64, 64, 64, 64, -64, 64, 64, -64, -64, -64, -64, -64, -64, 64, 64, 64, -64, 64, -64, 64, 64, 64, -64, -64, -64, 64, 64, 64, 64, 64, 64, 64, -64, -64, -64, -64, -64, -64, 64, -64, 64, 64, 64, -64, -64, -64, 64, 64, 64, 64, 64, 64, -64, -64, 64, 64, -64, 64, 64, -64, -64, 64, 64, -64, -64, 64, 64, 64, 64, -64, -64, -64, -64, -64, -64, -64, 64, 64, -64, 64, -64, 64, -64, 64, -64, 64, 64, 64, 64, 64, -64, 64, 64, 64, -64, -64, -64, 64, -64, -64, -64, -64, 64, 64, 64, 64, 64, -64, -64, 64, -64, 64, 64, 64, 64, 64, -64, 64, -64, -64, -64, 64, 64, 64, -64, 64, 64, 64, 64, 64, -64, 64, 64, 64, 64, 64, -64, -64, 64, 64, 64, 64, 64, -64, 64, -64, 64, 64, -64, 64, 64, 64, 64, -64, 64, -64, -64, -64, 64, -64, 64, 64, -64, 64, -64, -64, -64, 64, 64, -64, 64, 64, 64, 64, 64, 64, -64, -64, 64, 64, -64, 64, -64, -64, -64, -64, -64, -64, 64, 64, -64, -64, -64, 64, 64, 64, -64, 64, -64, -64, -64, -64, 64, 64, -64, 64, -64, 64, 64, -64, -64, 64, -64, 64, 64, -64, -64, -64, -64, -64, 64, -64, 64, -64, -64, 64, 64, 64, 64, -64, -64, 64, -64, -64, -64, 64, -64, 64, 64, -64, -64, -64, 64, -64, 64, -64, 64, -64, 64, -64, -64, -64, -64, -64, -64, -64, 64, 64, -64, -64, -64, 64, -64, 64, 64, 64, 64, 64, -64, -64, -64, -64, -64, -64, 64, 64, 64, 64, 64, 64, 64, -64, -64, 64, 64, -64, -64, -64, -64, 64, 64, -64, 64, -64, 64, 64, -64, -64, -64, -64, -64, -64, 64, 64, 64, -64, 64, -64, 64, 64, -64, -64, 64, -64, 64, -64, 64, -64, 64, 64, -64, -64, -64, 64, -64, 64, -64, -64, 64, 64, -64, 64, -64, 64, 64, 64, 64, -64, 64, -64, 64, 64, -64, 64, -64, -64, -64, 64, -64, 64, -64, -64, 64, 64, -64, -64, -64, 64, -64, 64, -64, 64, 64, -64, -64, 64, -64, 64, -64, -64, 64, -64, 64, 64, -64, 64, -64, -64, -64, -64, -64, 64, 64, -64, 64, -64, 64, -64, 64, -64, -64, 64, -64, 64, 64, -64, 64, -64, -64, -64, 64, 64, -64, 64, -64, -64, -64, -64, -64, 64, 64, 64, 64, 64, -64, -64, -64, -64, -64, -64, -64, -64, -64, -64, 64, 64, 64, 64, -64, 64, -64, 64, -64, 64, -64, -64, -64, 64, -64, -64, 64, 64, -64, -64, 64, 64, -64, -64, -64, -64, -64, 64, 64, 64, 64, 64, -64, 64, -64, -64, 64, -64, -64, 64, -64, -64, -64, -64, 64, -64, -64, 64, 64, -64, -64, -64, -64, -64, 64, 64, -64, 64, 64, 64, -64, 64, 64, -64, -64, 64, -64, -64, -64, 64, 64, -64, -64, 64, -64, 64, -64, -64, -64, -64, -64, -64, -64, 64, -64, 64, -64, 64, 64, 64, 64, -64, -64, -64, -64, -64, 64, -64, -64, 64, -64, -64, 64, 64, -64, -64, -64, -64, -64, -64, -64, 64, 64, 64, -64, 64, 64, 64, 64, 64, 64, -64, -64, -64, 64, 64, 64, -64, 64, -64, 64, -64, 64, 64, -64, 64, -64, 64, 64, 64, -64, -64, -64, 64, -64, 64, 64, -64, -64, -64, -64, 64, -64, 64, -64, -64, 64, 64, -64, -64, -64, -64, -64, -64, -64, 64, 64, -64, -64, -64, 64, 64, 64, 64, -64, -64, 64, 64, -64, -64, -64, -64, -64, 64, -64, 64, 64, -64, 64, -64, -64, -64, 64, -64, -64, -64, 64, 64, 64, -64, 64, -64, 64, -64, 64, 64, -64, -64, -64, 64, -64, 64, -64, -64, 64, -64, -64, -64, -64, -64, -64, -64, -64, -64, 64, -64, -64, 64, 64, 64, 64, 64, -64, 64, 64, -64, -64, -64, -64, -64, 64, -64, -64, 64, -64, -64, -64, -64, -64, -64, -64, -64, -64, -64, -64, 64, -64, 64, -64, 64, 64, -64, 64, -64, 64, -64, 64, -64, -64, -64, -64, -64, -64, -64, -64, -64, -64, -64, 64, -64, 64, -64, 64, 64, -64, 64, 64, -64, 64, -64, -64, -64, -64, -64, -64, -64, -64, -64, -64, -64, -64, 64, -64, 64, 64, -64, -64, 64, -64, 64, -64, 64, -64, -64, -64, -64, -64, -64, -64, 64, -64, -64, 64, -64, -64, -64, 64, -64, -64, 64, -64, -64, -64, -64, -64, -64, -64, -64, -64, 64, 64, -64, 64, 64, 64, -64, -64, -64, 64, -64, 64, -64, -64, -64, -64, 64, -64, -64, -64, 64, -64, -64, -64, -64, 64, 64, -64, 64, -64, 64, -64, -64, -64, -64, -64, 64, -64, 64, -64, -64, 64, -64, -64, -64, -64, -64, -64, -64, -64, -64, 64, -64, -64, -64, -64, -64, 64, -64, -64, 64, 64, -64, 64, -64, 64, 64, -64, 64, -64, -64, -64, -64, 64, 64, 64, -64, 64, -64, 64, 64, 64, -64, 64, 64, -64, -64, 64, 64, 64, 64, -64, -64, -64, -64, 64, 64, 64, 64, -64, 64, 64, -64, -64, -64, -64, -64, 64, 64, 64, -64, -64, -64, -64, -64, -64, 64, 64, -64, -64, -64, -64, 64, -64, -64, -64, -64, -64, -64, 64, 64, -64, -64, 64, -64, -64, -64, -64, 64, 64, -64, 64, -64, 64, 64, -64, -64, -64, -64, 64, -64, -64, 64, -64, 64, 64, 64, -64, -64, -64, 64, -64, 64, -64, 64, -64, -64, -64, -64, 64, -64, -64, -64, 64, 64, -64, 64, 64, 64, -64, 64, -64, 64, 64, 64, 64, -64, -64, -64, -64, -64, 64, 64, 64, -64, -64, 64, -64, -64, -64, -64, 64, 64, -64, -64, -64, 64, 64, 64, -64, 64, -64, 64, -64, 64, -64, 64, -64, 64, 64, 64, -64, -64, 64, -64, -64, -64, -64, -64, 64, 64, 64, -64, -64, 64, 64, 64, -64, 64, -64, 64, -64, -64, -64, 64, 64, 64, 64, -64, -64, -64, 64, 64, 64, -64, 64, 64, -64, -64, 64, 64, -64, 64, -64, 64, 64, 64, 64, 64, 64, 64, 64, 64, 64, 64, 64, 64, -64, 64, 64, -64, -64, -64, -64, 64, -64, -64, -64, 64, -64, 64, 64, 64, 64, 64, 64, 64, -64, 64, -64, 64, -64, 64, 64, -64, 64, 64, 64, -64, 64, 64, 64, 64, 64, 64, 64, 64, 64, 64, 64, 64, -64, 64, -64, 64, 64, 64, 64, 64, -64, 64, -64, 64, -64, 64, 64, -64, 64, 64, -64, -64, 64, -64, -64, -64, 64, 64, 64, -64, 64, -64, 64, 64, -64, 64, -64, 64, 64, -64, 64, 64, 64, 64, 64, 64, -64, -64, 64, 64, -64, 64, 64, 64, -64, -64, 64, 64, -64, 64, -64, -64, -64, 64, -64, -64, 64, 64, -64, 64, -64, 64, -64, 64, 64, -64, -64, 64, 64, -64, -64, 64, 64, 64, -64, -64, 64, -64, -64, 64, -64, 64, 64, -64, 64, -64, 64, 64, -64, 64, -64, 64, 64, 64, -64, 64, -64, 64, 64, 64, 64, -64, -64, 64, -64, 64, 64, 64, -64, 64, 64, 64, 64, 64, 64, -64, -64, -64, 64, 64, 64, 64, 64, -64, 64, -64, 64, -64, 64, 64, 64, 64, 64, 64, 64, 64, 64, 64, -64, 64, -64, 64, 64, 64, 64, 64, -64, 64, 64, 64, 64, 64, 64, 64, 64, 64, 64, 64, -64, 64, 64, 64, -64, 64, 64, 64, 64, 64, 64, -64, -64, -64, 64, 64, -64, 64, 64, -64, 64, 64, -64, 64, 64, 64, 64, 64, 64, 64, -64, 64, 64, 64, 64, 64, -64, 64, 64, 64, -64, 64, -64, 64, 64, 64, -64, 64, -64, 64, -64, 64, -64, 64, -64, 64, -64, 64, 64, 64, -64, 64, -64, 64, 64, 64, 64, -64, -64, 64, 64, -64, -64, -64, 64, -64, -64, 64, 64, -64, 64, 64, 64, 64, 64, 64, -64, -64, -64, 64, -64, -64, 64, 64, 64, 64, -64, 64, 64, 64, 64, -64, -64, -64, 64, -64, 64, 64, -64, -64, 64, 64, -64, 64, -64, -64, 64, 64, 64, 64, 64, 64, 64, 64, 64, 64, 64, -64, -64, -64, 64, -64, -64, 64, 64, 64, 64, -64, -64, -64, 64, 64, 64, 64, 64, -64, 64, 64, 64, -64, 64, 64, -64, 64, -64, 64, -64, -64, -64, 64, 64, -64, 64, -64, -64, -64, 64, 64, -64, -64, -64, -64, -64, -64, 64, -64, -64, -64, 64, 64, -64, 64, -64, -64, -64, 64, 64, -64, -64, -64, 64, 64, -64, -64, -64, 64, -64, 64, 64, 64, -64, 64, 64, -64, 64, 64, 64, -64, 64, -64, -64, -64, -64, -64, 64, -64, 64, 64, 64, -64, -64, -64, 64, 64, -64, 64, 64, 64, 64, -64, 64, 64, 64, -64, 64, 64, -64, -64, 64, 64, 64, -64, -64, -64, -64, -64, 64, 64, -64, -64, 64, -64, -64, 64, 64, -64, 64, -64, 64, 64, 64, 64, -64, 64, -64, 64, 64, 64, 64, -64, -64, 64, -64, -64, 64, -64, -64, 64, 64, -64, 64, -64, -64, -64, -64, 64, -64, -64, 64, 64, -64, -64, -64, 64, 64, 64, -64, -64, -64, 64, -64, 64, 64, -64, -64, 64, -64, 64, 64, 64, 64, 64, 64, 64, 64, 64, 64, 64, -64, -64, -64, -64, -64, -64, 64, 64, 64, 64, -64, -64, -64, 64, -64, -64, -64, 64, 64, 64, 64, 64, -64, -64, -64, 64, 64, -64, -64, 64, -64, 64, -64, 64, 64, 64, 64, -64, -64, 64, 64, -64, 64, -64, 64, 64, -64, 64, 64, -64, 64, 64, -64, 64, -64, -64, 64, 64, 64, -64, -64, 64, 64, 64, -64, 64, 64, 64, 64, -64, 64, 64, -64, 64, 64, -64, 64, 64, 64, -64, 64, 64, 64, 64, -64, 64, -64, 64, -64, 64, -64, -64, -64, -64, 64, -64, -64, -64, 64, 64, 64, 64, 64, 64, 64, -64, 64, 64, -64, 64, 64, 64, 64, 64, 64, 64, 64, -64, -64, 64, 64, 64, -64, 64, 64, -64, -64, 64, -64, 64, -64, 64, -64, -64, -64, 64, 64, 64, 64, 64, 64, 64, -64, 64, 64, 64, -64, 64, 64, 64, -64, 64, -64, -64, 64, 64, 64, 64, -64, -64, -64, 64, 64, 64, -64, 64, -64, -64, 64, -64, 64, -64, -64, -64, -64, 64, 64, -64, 64, 64, 64, -64, 64, 64, -64, -64, -64, -64, -64, -64, 64, 64, -64, 64, 64, -64, 64, 64, -64, -64, 64, 64, -64, 64, -64, 64, 64, -64, -64, 64, 64, 64, -64, -64, -64, -64, -64, -64, -64, 64, -64, -64, 64, 64, 64, 64, -64, 64, 64, 64, -64, -64, -64, 64, 64, -64, -64, 64, 64, 64, -64, 64, -64, -64, 64, 64, -64, 64, -64, -64, -64, 64, 64, 64, -64, 64, -64, -64, -64, -64, 64, 64, 64, 64, 64, 64, -64, -64, 64, 64, -64, -64, -64, 64, -64, 64, -64, 64, 64, 64, 64, 64, 64, -64, -64, 64, 64, -64, 64, -64, -64, 64, 64, 64, -64, -64, -64, -64, -64, -64, -64, 64, 64, -64, 64, 64, 64, 64, 64, 64, 64, 64, -64, 64, -64, -64, 64, -64, -64, 64, -64, 64, -64, 64, -64, 64, -64, -64, -64, -64, -64, -64, -64, -64, -64, -64, 64, 64, 64, 64, 64, 64, -64, -64, 64, -64, 64, -64, 64, -64, 64, 64, 64, 64, 64, -64, -64, -64, -64, -64, -64, -64, 64, 64, 64, 64, 64, 64, 64, 64, 64, 64, 64, 64, 64, 64, -64, 64, 64, 64, -64, -64, 64, -64, -64, 64, 64, 64, -64, 64, 64, 64, 64, 64, 64, 64, 64, 64, 64, 64, 64, 64, -64, 64, 64, 64, 64, -64, -64, -64, 64, -64, 64, 64, 64, -64, -64, -64, -64, 64, 64, 64, 64, 64, 64, 64, 64, 64, 64, -64, -64, -64, -64, 64, -64, -64, -64, -64, 64, -64, -64, 64, -64, -64, -64, -64, -64, -64, -64, 64, -64, 64, 64, 64, 64, 64, 64, 64, 64, -64, -64, -64, -64, -64, 64, -64, -64, -64, -64, -64, 64, -64, -64, -64, -64, 64, -64, -64, -64, -64, 64, 64, 64, 64, -64, 64, -64, 64, -64, -64, -64, -64, -64, -64, -64, -64, 64, 64, 64, -64, -64, -64, -64, 64, 64, -64, -64, -64, -64, 64, 64, 64, 64, -64, -64, 64, -64, -64, -64, -64, -64, 64, -64, 64, 64, 64, -64, 64, -64, -64, 64, 64, -64, -64, -64, -64, -64, 64, 64, 64, -64, -64, 64, 64, 64, -64, -64, -64, -64, -64, 64, 64, 64, 64, 64, -64, 64, 64, 64, 64, -64, -64, -64, -64, -64, 64, 64, -64, 64, 64, 64, -64, -64, -64, -64, -64, -64, 64, 64, 64, 64, 64, 64, 64, 64, 64, 64, 64, -64, -64, -64, -64, -64, 64, 64, -64, 64, 64, -64, 64, 64, 64, -64, -64, -64, -64, 64, -64, 64, 64, -64, 64, -64, 64, -64, 64, -64, -64, -64, -64, 64, 64, 64, 64, -64, -64, 64, -64, -64, -64, 64, -64, -64, -64, -64, -64, 64, -64, 64, -64, 64, 64, -64, -64, -64, -64, 64, 64, -64, -64, -64, -64, 64, 64, 64, 64, -64, -64, 64, -64, -64, -64, -64, -64, -64, -64, -64, -64, 64, 64, -64, -64, -64, -64, -64, -64, 64, -64, 64, -64, 64, -64, 64, 64, -64, 64, 64, -64, -64, -64, -64, -64, -64, -64, 64, 64, 64, -64, -64, -64, -64, -64, -64, 64, 64, -64, 64, -64, -64, -64, 64, -64, -64, 64, 64, -64, -64, 64, -64, 64, -64, 64, 64, 64, 64, -64, -64, -64, -64, -64, -64, 64, 64, -64, 64, -64, -64, 64, -64, 64, -64, 64, 64, 64, 64, 64, -64, -64, 64, 64, 64, 64, 64, -64, -64, -64, -64, -64, 64, -64, -64, -64, 64, 64, 64, -64, 64, 64, 64, -64, -64, 64, 64, 64, 64, 64, 64, 64, 64, 64, 64, -64, -64, -64, -64, -64, 64, 64, -64, -64, 64, 64, 64, 64, 64, -64, -64, 64, 64, 64, 64, 64, 64, 64, 64, 64, 64, 64, 64, -64, -64, -64, 64, -64, -64, 64, 64, 64, 64, -64, 64, 64, 64, 64, -64, 64, 64, 64, 64, 64, 64, 64, 64, 64, 64, 64, 64, -64, 64, 64, 64, -64, -64, -64, -64, 64, 64, -64, 64, 64, -64, 64, 64, 64, 64, 64, 64, 64, 64, 64, 64, 64, 64, 64, 64, -64, -64, -64, -64, -64, -64, 64, -64, 64, 64, -64, 64, -64, 64, -64, 64, 64, 64, -64, 64, -64, 64, 64, 64, -64, 64, 64, 64, -64, -64, -64, -64, 64, -64, -64, 64, 64, -64, -64, 64, -64, -64, 64, -64, 64, -64, 64, -64, 64, 64, 64, 64, -64, 64, -64, -64, -64, -64, 64, -64, -64, -64, 64, 64, 64, -64, -64, -64, -64, -64, 64, -64, -64, -64, 64, -64, 64, 64, 64, 64, -64, -64, -64, -64, -64, -64, 64, 64, 64, 64, 64, -64, -64, -64, 64, -64, 64, 64, 64, -64, -64, -64, 64, -64, 64, 64, 64, -64, 64, 64, -64, 64, -64, -64, 64, -64, 64, 64, 64, -64, 64, 64, -64, -64, 64, -64, -64, 64, 64, -64, -64, -64, 64, -64, 64, -64, 64, 64, 64, -64, -64, -64, -64, -64, -64, -64, -64, -64, -64, 64, -64, 64, 64, 64, -64, 64, -64, -64, 64, -64, 64, -64, 64, -64, 64, -64, -64, -64, 64, -64, 64, 64, -64, -64, -64, -64, -64, 64, -64, 64, -64, -64, -64, -64, 64, 64, 64, 64, -64, -64, -64, -64, 64, -64, -64, 64, 64, 64, 64, 64, -64, -64, -64, -64, -64, 64, -64, -64, 64, -64, -64, -64, -64, -64, -64, -64, -64, -64, -64, -64, -64, 64, 64, -64, 64, -64, -64, 64, -64, 64, 64, 64, 64, 64, 64, -64, 64, -64, 64, -64, -64, 64, -64, -64, -64, 64, -64, 64, 64, 64, 64, 64, -64, 64, 64, 64, -64, -64, -64, -64, 64, -64, 64, 64, 64, -64, -64, 64, 64, -64, 64, 64, 64, 64, 64, 64, 64, 64, 64, 64, -64, 64, 64, -64, 64, 64, -64, -64, 64, 64, -64, 64, 64, 64, -64, -64, 64, -64, -64, 64, 64, -64, 64, 64, 64, 64, 64, 64, -64, 64, -64, 64, 64, 64, 64, -64, -64, -64, 64, -64, 64, 64, 64, -64, -64, -64, 64, 64, 64, 64, 64, 64, 64, 64, -64, 64, 64, 64, 64, -64, 64, -64, 64, -64, 64, 64, 64, 64, -64, 64, -64, 64, 64, 64, 64, 64, 64, -64, 64, 64, 64, 64, 64, 64, -64, 64, 64, -64, 64, 64, -64, 64, -64, -64, 64, -64, 64, 64, -64, -64, 64, -64, 64, -64, -64, -64, -64, 64, 64, 64, 64, 64, 64, 64, -64, 64, 64, 64, 64, -64, 64, 64, -64, 64, 64, 64, 64, -64, -64, 64, -64, 64, -64, 64, 64, 64, -64, 64, 64, 64, 64, 64, 64, -64, 64, 64, -64, -64, 64, 64, 64, 64, -64, -64, 64, -64, -64, -64, -64, -64, -64, -64, -64, -64, 64, 64, 64, 64, 64, 64, 64, -64, 64, -64, -64, -64, 64, -64, 64, 64, -64, 64, -64, 64, -64, -64, 64, 64, 64, 64, -64, 64, 64, 64, 64, 64, -64, -64, 64, -64, -64, -64, -64, -64, -64, 64, 64, 64, -64, 64, -64, -64, -64, -64, 64, 64, -64, 64, 64, 64, 64, 64, 64, 64, -64, -64, -64, -64, 64, 64, -64, -64, 64, -64, 64, -64, -64, 64, 64, 64, 64, 64, -64, -64, 64, 64, 64, 64, 64, 64, 64, -64, -64, -64, 64, 64, 64, 64, 64, 64, 64, -64, 64, 64, 64, 64, 64, 64, -64, 64, -64, -64, 64, -64, 64, 64, 64, 64, 64, 64, 64, -64, 64, 64, 64, 64, -64, -64, -64, 64, 64, 64, 64, -64, -64, 64, 64, 64, 64, 64, 64, 64, 64, 64, 64, 64, 64, 64, 64, 64, 64, 64, -64, 64, -64, 64, -64, -64, -64, -64, -64, 64, -64, 64, 64, 64, 64, 64, 64, 64, 64, 64, 64, 64, -64, 64, -64, -64, 64, 64, 64, -64, 64, 64, 64, 64, -64, 64, 64, -64, -64, 64, 64, -64, 64, 64, 64, 64, -64, -64, -64, 64, 64, -64, -64, -64, 64, -64, 64, -64, -64, -64, -64, -64, 64, -64, 64, -64, -64, 64, -64, -64, -64, 64, 64, 64, -64, -64, 64, -64, -64, 64, -64, -64, -64, -64, 64, 64, -64, 64, 64, 64, -64, 64, 64, -64, -64, 64, -64, -64, 64, -64, 64, 64, -64, 64, 64, -64, -64, 64, -64, 64, 64, 64, 64, 64, -64, 64, -64, -64, 64, -64, 64, 64, -64, 64, -64, -64, -64, -64, -64, 64, 64, 64, 64, 64, -64, 64, 64, 64, 64, 64, 64, 64, -64, 64, -64, -64, 64, -64, 64, 64, -64, 64, 64, 64, 64, 64, 64, -64, 64, -64, 64, 64, 64, 64, 64, 64, 64, -64, 64, 64, 64, 64, -64, 64, 64, -64, 64, 64, -64, 64, 64, 64, 64, 64, -64, 64, 64, -64, 64, 64, 64, 64, -64, 64, -64, -64, 64, 64, 64, 64, 64, 64, 64, 64, -64, 64, -64, 64, -64, -64, 64, 64, 64, 64, 64, 64, 64, 64, 64, -64, -64, -64, -64, 64, 64, -64, 64, 64, -64, 64, -64, -64, 64, -64, -64, -64, 64, 64, 64, -64, 64, -64, 64, 64, 64, 64, 64, 64, -64, 64, -64, -64, 64, 64, -64, 64, -64, -64, -64, -64, 64, -64, -64, -64, 64, -64, 64, 64, 64, 64, 64, 64, -64, -64, -64, -64, 64, 64, -64, -64, -64, 64, 64, -64, 64, 64, 64, 64, 64, 64, 64, -64, 64, -64, 64, 64, 64, -64, 64, -64, -64, -64, -64, 64, 64, 64, -64, -64, -64, 64, 64, -64, 64, 64, -64, -64, -64, 64, 64, -64, 64, 64, 64, -64, -64, 64, 64, -64, 64, 64, -64, 64, 64, -64, 64, 64, -64, 64, -64, -64, 64, 64, 64, -64, 64, -64, -64, -64, -64, 64, 64, 64, 64, -64, 64, -64, 64, 64, 64, 64, 64, 64, 64, 64, 64, 64, 64, -64, 64, 64, 64, -64, -64, -64, -64, -64, -64, 64, -64, 64, 64, 64, 64, 64, -64, -64, -64, 64, 64, 64, 64, 64, 64, -64, 64, 64, -64, -64, -64, -64, -64, 64, -64, -64, 64, 64, 64, 64, 64, 64, 64, 64, -64, -64, -64, -64, -64, 64, -64, 64, -64, 64, 64, -64, -64, -64, -64, -64, 64, -64, -64, 64, 64, 64, 64, 64, 64, 64, 64, 64, -64, -64, -64, 64, -64, -64, -64, -64, -64, -64, -64, 64, -64, -64, 64, 64, 64, -64, -64, 64, 64, 64, 64, 64, 64, 64, -64, -64, -64, -64, 64, -64, 64, 64, -64, -64, -64, -64, -64, -64, -64, -64, -64, 64, -64, -64, -64, 64, -64, 64, 64, 64, 64, 64, -64, -64, -64, -64, -64, -64, -64, -64, -64, -64, -64, -64, -64, -64, -64, -64, -64, -64, -64, 64, 64, 64, -64, -64, 64, 64, 64, 64, -64, -64, -64, -64, -64, -64, -64, 64, -64, -64, -64, -64, -64, -64, -64, -64, -64, -64, -64, -64, -64, -64, -64, -64, 64, 64, 64, 64, -64, -64, -64, -64, -64, -64, -64, 64, -64, -64, -64, -64, -64, -64, -64, -64, -64, -64, 64, -64, 64, -64, -64, -64, 64, -64, -64, -64, -64, -64, -64, -64, -64, -64, -64, 64, 64, 64, -64, -64, -64, -64, -64, -64, -64, -64, -64, -64, 64, -64, -64, -64, -64, -64, 64, 64, -64, -64, -64, -64, -64, -64, 64, 64, 64, 64, 64, 64, 64, -64, -64, -64, -64, -64, 64, 64, 64, -64, -64, 64, -64, 64, 64, -64, 64, 64, -64, -64, -64, -64, 64, 64, 64, 64, -64, 64, 64, -64, -64, -64, -64, -64, 64, -64, -64, 64, 64, 64, -64, 64, 64, 64, -64, 64, -64, 64, -64, 64, 64, 64, 64, -64, 64, 64, 64, -64, -64, -64, -64, 64, -64, -64, 64, 64, 64, 64, -64, 64, 64, -64, 64, -64, -64, -64, 64, -64, 64, 64, 64, 64, 64, -64, 64, 64, 64, 64, 64, 64, 64, -64, -64, 64, 64, 64, 64, 64, 64, 64, 64, 64, -64, -64, -64, 64, -64, 64, 64, 64, 64, 64, -64, 64, 64, 64, 64, 64, 64, -64, -64, -64, -64, -64, 64, 64, 64, 64, -64, 64, -64, -64, -64, 64, 64, 64, 64, 64, 64, 64, -64, -64, -64, 64, 64, 64, 64, -64, -64, -64, -64, -64, -64, 64, 64, -64, 64, -64, -64, -64, -64, 64, 64, 64, 64, 64, 64, -64, -64, -64, -64, 64, 64, -64, 64, -64, -64, -64, -64, -64, 64, 64, -64, -64, -64, -64, -64, -64, 64, -64, 64, 64, 64, 64, -64, -64, -64, -64, -64, 64, 64, 64, -64, 64, -64, -64, -64, -64, -64, 64, -64, -64, -64, -64, -64, -64, 64, 64, 64, 64, 64, 64, -64, -64, -64, -64, 64, 64, 64, 64, -64, 64, 64, 64, -64, -64, -64, -64, -64, -64, -64, -64, -64, 64, 64, -64, 64, 64, -64, -64, -64, -64, -64, -64, -64, 64, 64, 64, 64, 64, 64, -64, -64, -64, -64, -64, -64, -64, -64, -64, -64, 64, 64, -64, -64, -64, -64, -64, -64, -64, -64, -64, 64, 64, -64, 64, 64, 64, 64, -64, -64, -64, -64, -64, -64, -64, -64, -64, 64, -64, -64, -64, 64, -64, -64, -64, -64, 64, -64, -64, 64, -64, -64, 64, 64, -64, -64, -64, -64, -64, -64, -64, -64, -64, 64, -64, 64, 64, -64, 64, 64, 64, -64, -64, -64, -64, 64, -64, -64, 64, -64, 64, 64, 64, -64, -64, -64, -64, -64, 64, -64, 64, -64, -64, -64, -64, -64, -64, 64, 64, 64, 64, -64, 64, 64, 64, -64, 64, 64, -64, -64, 64, -64, -64, -64, -64, -64, 64, 64, 64, -64, 64, 64, -64, 64, -64, 64, -64, -64, -64, 64, -64, -64, -64, 64, 64, -64, 64, 64, -64, -64, 64, 64, 64, 64, 64, 64, -64, 64, 64, 64, -64, 64, -64, 64, -64, -64, -64, 64, 64, -64, 64, 64, 64, 64, 64, 64, -64, -64, 64, -64, 64, -64, -64, -64, 64, 64, 64, 64, 64, 64, 64, 64, 64, 64, -64, 64, 64, 64, -64, 64, 64, 64, 64, -64, 64, 64, -64, 64, 64, -64, 64, -64, -64, 64, -64, -64, -64, 64, 64, 64, 64, 64, -64, 64, 64, 64, -64, -64, -64, 64, 64, 64, 64, 64, -64, -64, -64, 64, 64, 64, 64, -64, -64, 64, 64, 64, 64, 64, 64, -64, 64, 64, 64, -64, -64, 64, 64, -64, 64, 64, -64, -64, -64, -64, 64, 64, 64, 64, 64, 64, 64, 64, 64, 64, 64, -64, 64, -64, -64, -64, -64, -64, 64, -64, -64, -64, 64, 64, 64, 64, 64, 64, 64, -64, 64, 64, 64, 64, 64, -64, 64, 64, 64, 64, 64, 64, -64, -64, 64, -64, -64, -64, 64, 64, 64, -64, 64, 64, -64, 64, 64, 64, 64, 64, 64, 64, 64, 64, 64, -64, 64, 64, 64, 64, -64, 64, 64, 64, 64, 64, -64, 64, 64, -64, 64, 64, -64, 64, -64, -64, -64, -64, 64, 64, -64, -64, -64, -64, 64, -64, 64, 64, -64, 64, 64, -64, -64, -64, -64, 64, 64, -64, 64, 64, 64, 64, 64, -64, -64, -64, 64, 64, 64, 64, -64, 64, 64, -64, -64, -64, 64, 64, 64, 64, 64, 64, 64, -64, 64, -64, 64, 64, 64, -64, 64, -64, 64, 64, -64, 64, -64, -64, -64, 64, 64, 64, 64, -64, 64, 64, 64, 64, -64, 64, -64, -64, -64, -64, -64, 64, 64, 64, -64, -64, -64, 64, -64, 64, 64, 64, 64, 64, -64, 64, 64, 64, 64, 64, 64, 64, -64, 64, -64, -64, 64, 64, -64, 64, 64, 64, -64, 64, 64, 64, 64, 64, 64, -64, -64, -64, 64, -64, 64, 64, 64, 64, 64, -64, -64, -64, 64, 64, 64, -64, -64, -64, 64, 64, 64, 64, 64, -64, -64, 64, 64, -64, -64, -64, -64, 64, 64, 64, 64, 64, 64, 64, -64, 64, -64, 64, 64, 64, 64, 64, 64, 64, 64, 64, 64, 64, 64, 64, 64, 64, -64, -64, -64, 64, 64, 64, -64, 64, 64, -64, 64, 64, 64, 64, 64, -64, 64, -64, 64, 64, -64, -64, -64, -64, 64, 64, 64, -64, -64, -64, -64, 64, 64, -64, -64, 64, 64, 64, -64, -64, 64, -64, -64, 64, 64, 64, 64, 64, 64, 64, 64, 64, -64, -64, 64, -64, -64, -64, 64, -64, -64, -64, -64, -64, 64, -64, -64, 64, 64, -64, -64, 64, 64, 64, -64, -64, -64, -64, 64, -64, -64, 64, 64, -64, -64, -64, 64, -64, -64, -64, -64, 64, 64, 64, 64, 64, 64, 64, -64, 64, 64, 64, -64, 64, 64, -64, -64, 64, 64, 64, 64, 64, -64, 64, -64, -64, 64, -64, -64, -64, 64, 64, 64, 64, 64, 64, -64, -64, 64, 64, -64, 64, 64, 64, 64, -64, 64, 64, 64, 64, -64, -64, -64, 64, -64, -64, 64, -64, 64, 64, 64, 64, -64, -64, 64, 64, -64, -64, -64, -64, 64, 64, 64, 64, 64, 64, 64, -64, -64, -64, -64, -64, 64, 64, -64, 64, 64, -64, 64, 64, -64, -64, 64, 64, -64, -64, -64, 64, 64, 64, 64, 64, 64, 64, 64, 64, -64, -64, -64, 64, 64, 64, 64, 64, 64, -64, 64, -64, 64, -64, 64, 64, -64, 64, -64, -64, 64, 64, 64, 64, 64, 64, 64, -64, -64, -64, -64, 64, 64, 64, 64, 64, 64, 64, 64, -64, -64, 64, 64, -64, 64, 64, 64, 64, 64, 64, 64, 64, 64, 64, -64, -64, -64, -64, -64, 64, 64, 64, 64, 64, 64, 64, 64, -64, -64, 64, -64, 64, -64, 64, 64, 64, 64, 64, 64, 64, 64, 64, -64, -64, 64, 64, -64, 64, 64, -64, 64, 64, 64, 64, 64, -64, 64, 64, 64, 64, -64, 64, -64, 64, 64, 64, 64, 64, -64, 64, -64, -64, 64, 64, -64, -64, 64, 64, 64, 64, 64, -64, -64, 64, -64, -64, -64, -64, 64, 64, -64, 64, 64, 64, 64, 64, -64, -64, -64, -64, 64, 64, -64, -64, 64, 64, 64, 64, -64, 64, -64, -64, 64, -64, -64, -64, -64, -64, -64, -64, 64, 64, 64, 64, -64, -64, -64, 64, 64, 64, -64, 64, 64, -64, -64, -64, -64, 64, 64, 64, -64, 64, -64, 64, 64, 64, 64, 64, -64, 64, 64, -64, -64, -64, 64, 64, 64, 64, 64, -64, -64, 64, 64, -64, -64, -64, -64, 64, -64, -64, 64, -64, 64, 64, 64, -64, 64, 64, 64, 64, 64, 64, 64, 64, 64, 64, 64, 64, 64, 64, -64, -64, 64, -64, -64, -64, 64, -64, 64, -64, 64, 64, 64, 64, 64, -64, 64, -64, 64, 64, 64, -64, -64, -64, 64, -64, 64, -64, 64, -64, 64, 64, 64, 64, 64, 64, -64, 64, -64, 64, -64, -64, -64, 64, 64, -64, -64, 64, -64, 64, -64, 64, -64, 64, -64, -64, -64, 64, 64, 64, -64, -64, 64, -64, -64, 64, 64, -64, 64, 64, -64, 64, -64, 64, -64, -64, 64, 64, 64, 64, -64, -64, -64, -64, -64, 64, 64, 64, 64, -64, -64, -64, 64, 64, -64, 64, -64, -64, 64, 64, -64, -64, 64, -64, -64, -64, 64, 64, -64, -64, 64, 64, 64, -64, -64, -64, -64, -64, -64, -64, 64, 64, 64, -64, -64, 64, 64, 64, -64, 64, 64, -64, -64, 64, 64, 64, -64, -64, -64, 64, 64, -64, 64, -64, 64, -64, -64, -64, 64, 64, -64, -64, -64, 64, -64, -64, -64, 64, -64, -64, -64, -64, 64, 64, -64, -64, -64, -64, 64, 64, 64, -64, 64, -64, -64, 64, -64, 64, -64, -64, 64, 64, 64, -64, -64, 64, 64, 64, 64, 64, -64, -64, 64, 64, -64, -64, -64, -64, 64, -64, 64, 64, -64, 64, 64, -64, -64, 64, -64, 64, 64, 64, -64, -64, 64, 64, -64, -64, 64, -64, 64, -64, 64, 64, -64, -64, 64, -64, 64, -64, -64, -64, -64, -64, 64, 64, 64, -64, 64, -64, -64, 64, -64, 64, -64, 64, -64, -64, -64, -64, -64, -64, 64, -64, 64, -64, -64, -64, -64, 64, 64, -64, 64, -64, 64, -64, -64, -64, -64, -64, -64, 64, -64, -64, -64, -64, -64, -64, -64, 64, -64, -64, -64, 64, 64, 64, 64, -64, -64, 64, -64, 64, 64, 64, 64, -64, 64, -64, 64, 64, -64, -64, -64, 64, -64, -64, -64, 64, -64, -64, 64, -64, 64, 64, 64, 64, 64, 64, 64, 64, -64, 64, -64, 64, -64, 64, 64, -64, -64, 64, 64, 64, -64, 64, -64, -64, 64, -64, -64, 64, 64, -64, 64, 64, 64, -64, 64, 64, -64, 64, 64, -64, 64, 64, 64, -64, -64, -64, -64, 64, -64, -64, 64, -64, -64, -64, -64, -64, 64, -64, 64, -64, 64, -64, 64, 64, 64, -64, -64, 64, -64, -64, -64, -64, -64, 64, -64, 64, -64, -64, -64, -64, -64, -64, -64, -64, -64, -64, 64, -64, -64, -64, 64, -64, -64, -64, -64, -64, -64, 64, 64, -64, -64, -64, -64, 64, -64, -64, -64, 64, 64, 64, 64, -64, -64, 64, -64, 64, -64, -64, 64, -64, -64, 64, -64, 64, -64, -64, 64, -64, 64, -64, 64, -64, 64, -64, 64, -64, 64, -64, -64, 64, 64, -64, 64, -64, -64, 64, -64, -64, 64, -64, -64, -64, 64, -64, 64, 64, 64, -64, -64, 64, -64, -64, -64, -64, -64, -64, -64, 64, -64, -64, -64, 64, 64, 64, -64, -64, -64, 64, 64, 64, -64, -64, -64, -64, -64, -64, 64, -64, -64, -64, 64, 64, -64, -64, -64, -64, 64, 64, -64, 64, -64, -64, 64, -64, -64, 64, 64, 64, -64, -64, -64, -64, -64, 64, -64, 64, -64, -64, -64, -64, -64, 64, 64, -64, -64, 64, -64, -64, 64, 64, -64, -64, 64, 64, 64, -64, -64, -64, 64, 64, -64, -64, -64, 64, 64, -64, 64, -64, -64, -64, 64, -64, 64, -64, -64, 64, -64, -64, 64, 64, 64, -64, -64, -64, -64, 64, -64, -64, 64, -64, -64, -64, -64, 64, -64, -64, 64, -64, 64, 64, 64, 64, -64, -64, -64, 64, -64, -64, -64, 64, -64, 64, -64, 64, -64, -64, -64, -64, -64, 64, -64, 64, -64, -64, -64, -64, -64, 64, -64, -64, -64, 64, -64, 64, 64, 64, 64, 64, -64, -64, -64, 64, 64, 64, -64, -64, -64, -64, -64, 64, -64, -64, 64, -64, -64, -64, 64, 64, 64, 64, 64, 64, 64, -64, -64, 64, -64, -64, -64, -64, -64, 64, -64, 64, -64, -64, 64, -64, -64, 64, -64, -64, 64, 64, -64, -64, 64, -64, -64, -64, -64, -64, -64, 64, -64, -64, 64, 64, -64, -64, -64, -64, -64, 64, -64, -64, -64, 64, -64, 64, 64, 64, -64, -64, -64, -64, 64, -64, -64, -64, 64, -64, 64, 64, -64, 64, 64, 64, -64, -64, -64, -64, 64, -64, -64, 64, 64, 64, -64, 64, 64, -64, -64, -64, 64, -64, -64, -64, 64, 64, 64, 64, 64, -64, 64, 64, 64, -64, 64, -64, -64, -64, -64, -64, -64, 64, 64, -64, -64, -64, -64, -64, 64, 64, 64, 64, 64, -64, -64, 64, -64, -64, -64, 64, -64, 64, -64, -64, -64, 64, 64, 64, 64, 64, -64, -64, 64, -64, 64, -64, -64, -64, 64, 64, 64, 64, 64, 64, 64, -64, -64, -64, -64, -64, -64, -64, 64, 64, 64, -64, -64, -64, -64, -64, 64, 64, -64, -64, -64, -64, -64, -64, -64, 64, 64, 64, 64, 64, 64, -64, 64, -64, 64, 64, 64, -64, -64, -64, -64, 64, -64, -64, 64, 64, 64, 64, -64, 64, 64, -64, 64, -64, 64, -64, 64, 64, 64, -64, -64, -64, 64, 64, -64, -64, 64, -64, 64, 64, -64, 64, -64, -64, 64, 64, 64, -64, 64, 64, 64, -64, 64, 64, 64, -64, -64, 64, -64, -64, 64, 64, -64, 64, -64, -64, -64, 64, 64, 64, -64, -64, -64, 64, 64, -64, -64, -64, -64, 64, 64, -64, -64, -64, -64, -64, -64, -64, 64, -64, -64, 64, 64, -64, -64, -64, 64, -64, -64, -64, -64, 64, 64, 64, 64, 64, -64, -64, -64, 64, -64, -64, -64, -64, 64, 64, -64, -64, -64, -64, -64, -64, -64, -64, -64, -64, 64, 64, -64, -64, 64, -64, -64, -64, -64, 64, 64, 64, -64, 64, 64, 64, 64, 64, 64, 64, -64, -64, -64, -64, -64, -64, -64, -64, -64, 64, -64, 64, -64, -64, -64, -64, 64, 64, 64, 64, 64, 64, 64, 64, 64, 64, -64, -64, -64, -64, -64, -64, -64, -64, -64, 64, -64, 64, 64, 64, -64, -64, 64, 64, 64, 64, -64, 64, 64, 64, 64, 64, 64, 64, 64, 64, 64, 64, -64, 64, -64, -64, -64, -64, -64, 64, 64, 64, -64, -64, 64, -64, 64, 64, 64, 64, -64, -64, 64, -64, -64, 64, 64, 64, 64, 64, 64, -64, -64, -64, -64, -64, -64, -64, 64, 64, -64, 64, 64, 64, 64, -64, -64, 64, -64, -64, 64, 64, 64, 64, 64, 64, 64, 64, 64, -64, -64, -64, -64, -64, 64, 64, 64, -64, -64, -64, -64, -64, 64, -64, -64, -64, -64, 64, 64, -64, 64, -64, 64, 64, 64, -64, 64, -64, -64, -64, -64, -64, 64, -64, 64, 64, -64, -64, -64, -64, -64, 64, -64, -64, -64, -64, -64, -64, -64, 64, -64, 64, 64, 64, -64, -64, -64, 64, -64, -64, -64, -64, -64, -64, 64, 64, 64, -64, -64, -64, -64, -64, -64, 64, -64, 64, 64, -64, 64, 64, -64, 64, -64, 64, -64, 64, -64, -64, -64, -64, 64, -64, -64, -64, -64, -64, -64, -64, -64, -64, -64, 64, 64, -64, 64, 64, 64, -64, -64, -64, -64, -64, -64, -64, -64, -64, -64, -64, 64, -64, 64, 64, 64, -64, 64, 64, -64, -64, 64, 64, -64, -64, -64, -64, -64, -64, -64, 64, 64, -64, -64, -64, -64, -64, 64, 64, 64, 64, 64, 64, -64, 64, 64, -64, -64, -64, -64, -64, -64, -64, -64, -64, -64, -64, -64, 64, -64, 64, -64, -64, -64, -64, -64, -64, 64, 64, 64, 64, -64, -64, -64, -64, -64, -64, -64, -64, -64, -64, -64, -64, -64, -64, 64, -64, -64, 64, -64, -64, 64, -64, -64, 64, 64, -64, -64, -64, 64, -64, -64, -64, 64, -64, -64, -64, -64, -64, -64, -64, 64, 64, -64, 64, -64, -64, -64, -64, -64, 64, 64, 64, 64, -64, 64, -64, -64, 64, 64, 64, -64, 64, 64, -64, -64, -64, -64, 64, 64, 64, 64, 64, -64, -64, -64, 64, -64, 64, -64, 64, -64, -64, -64, 64, -64, -64, -64, 64, 64, 64, 64, -64, -64, -64, -64, 64, 64, 64, 64, -64, 64, -64, 64, 64, -64, 64, 64, 64, -64, -64, -64, 64, 64, -64, -64, -64, -64, 64, -64, -64, -64, -64, -64, 64, 64, 64, 64, 64, -64, -64, -64, 64, -64, 64, -64, 64, -64, 64, 64, -64, 64, 64, 64, -64, -64, -64, 64, -64, -64, -64, -64, -64, -64, 64, -64, -64, -64, -64, -64, 64, 64, -64, 64, 64, 64, 64, 64, 64, -64, 64, -64, -64, -64, -64, 64, -64, -64, -64, -64, -64, -64, -64, 64, -64, -64, -64, 64, 64, 64, 64, 64, 64, -64, -64, -64, 64, 64, -64, 64, 64, 64, -64, 64, 64, -64, -64, 64, 64, -64, -64, 64, 64, -64, 64, 64, 64, 64, 64, 64, 64, -64, -64, -64, -64, 64, 64, -64, 64, -64, 64, 64, 64, 64, 64, 64, 64, -64, 64, -64, -64, 64, 64, 64, 64, 64, 64, 64, -64, -64, -64, 64, 64, -64, -64, -64, 64, 64, -64, 64, 64, 64, 64, 64, 64, 64, 64, 64, 64, 64, 64, 64, 64, 64, 64, 64, -64, 64, -64, -64, -64, -64, -64, -64, -64, -64, -64, -64, -64, -64, -64, 64, -64, -64, 64, 64, 64, -64, -64, -64, -64, -64, -64, 64, -64, -64, 64, 64, -64, -64, -64, 64, -64, 64, 64, -64, 64, 64, 64, -64, -64, -64, 64, 64, 64, -64, -64, 64, -64, 64, -64, -64, -64, -64, -64, 64, -64, -64, -64, 64, -64, 64, -64, 64, -64, -64, -64, 64, -64, -64, 64, -64, -64, -64, 64, 64, -64, -64, -64, 64, 64, -64, 64, -64, -64, 64, 64, 64, -64, 64, -64, -64, -64, -64, 64, -64, 64, -64, 64, 64, 64, 64, -64, -64, -64, -64, -64, 64, -64, -64, -64, 64, 64, -64, 64, 64, 64, -64, 64, 64, -64, -64, 64, 64, -64, -64, 64, -64, -64, -64, -64, -64, -64, -64, 64, 64, 64, 64, -64, 64, 64, 64, -64, -64, 64, 64, 64, -64, -64, -64, -64, 64, -64, 64, 64, 64, 64, -64, 64, -64, -64, -64, 64, 64, 64, 64, -64, 64, 64, 64, 64, 64, -64, 64, -64, -64, -64, -64, -64, 64, -64, 64, 64, 64, 64, -64, -64, -64, 64, -64, 64, -64, 64, -64, 64, -64, 64, -64, -64, -64, -64, -64, -64, -64, 64, -64, -64, 64, 64, 64, -64, 64, 64, -64, -64, -64, -64, -64, -64, -64, -64, -64, 64, 64, -64, 64, 64, -64, 64, -64, -64, -64, -64, -64, -64, 64, 64, 64, 64, 64, -64, -64, -64, -64, -64, -64, -64, -64, -64, -64, -64, 64, -64, -64, -64, 64, -64, -64, -64, -64, -64, 64, 64, 64, 64, 64, 64, 64, 64, -64, -64, -64, -64, -64, -64, -64, -64, -64, 64, -64, 64, 64, 64, 64, -64, -64, -64, -64, -64, 64, 64, 64, -64, -64, 64, 64, -64, -64, 64, -64, -64, -64, -64, -64, -64, -64, 64, 64, -64, 64, 64, 64, 64, 64, -64, -64, -64, 64, 64, -64, -64, 64, 64, 64, -64, -64, -64, -64, -64, -64, -64, -64, -64, -64, -64, -64, 64, 64, 64, 64, 64, -64, -64, -64, -64, 64, -64, 64, -64, -64, 64, 64, 64, -64, 64, -64, -64, -64, -64, -64, -64, -64, 64, -64, 64, 64, 64, 64, 64, -64, -64, -64, -64, 64, 64, -64, -64, 64, -64, 64, 64, 64, -64, -64, 64, -64, -64, -64, -64, -64, 64, 64, -64, -64, -64, -64, -64, -64, -64, -64, 64, 64, 64, -64, 64, -64, -64, 64, 64, 64, 64, -64, -64, -64, 64, 64, -64, 64, 64, 64, -64, 64, -64, 64, -64, -64, -64, -64, -64, -64, -64, -64, -64, -64, -64, 64, 64, -64, 64, -64, 64, -64, -64, -64, 64, 64, 64, -64, -64, 64, -64, -64, 64, -64, -64, -64, -64, -64, -64, -64, 64, -64, -64, -64, 64, -64, -64, -64, -64, -64, 64, -64, -64, -64, -64, 64, 64, 64, -64, -64, -64, -64, -64, -64, -64, 64, 64, -64, 64, -64, -64, -64, -64, -64, 64, -64, -64, -64, 64, -64, -64, -64, -64, -64, -64, -64, 64, -64, -64, 64, -64, -64, -64, -64, 64, -64, -64, -64, -64, 64, -64, 64, -64, -64, -64, -64, -64, -64, -64, -64, -64, -64, -64, 64, 64, -64, -64, -64, -64, -64, -64, -64, -64, -64, -64, -64, -64, 64, 64, -64, 64, -64, -64, -64, -64, -64, 64, -64, -64, 64, 64, -64, -64, -64, 64, -64, -64, -64, -64, -64, -64, -64, -64, -64, 64, 64, 64, -64, -64, -64, -64, -64, -64, -64, -64, 64, 64, -64, -64, -64, 64, -64, -64, -64, -64, 64, -64, -64, -64, -64, -64, -64, -64, 64, 64, 64, -64, 64, -64, -64, -64, 64, -64, -64, 64, -64, 64, 64, -64, -64, -64, -64, -64, 64, 64, -64, -64, -64, -64, -64, 64, 64, 64, 64, -64, -64, -64, -64, -64, -64, -64, -64, -64, 64, 64, 64, 64, 64, 64, 64, 64, 64, -64, -64, -64, -64, -64, -64, 64, 64, 64, -64, 64, -64, -64, -64, -64, -64, -64, 64, -64, 64, 64, 64, 64, -64, -64, 64, -64, 64, -64, -64, -64, -64, -64, -64, 64, 64, 64, -64, -64, -64, -64, -64, -64, -64, 64, 64, 64, -64, 64, 64, 64, -64, -64, -64, -64, -64, -64, -64, -64, -64, -64, -64, -64, 64, 64, -64, -64, -64, -64, -64, -64, 64, 64, -64, -64, -64, -64, 64, -64, -64, -64, 64, -64, -64, -64, -64, -64, -64, -64, -64, 64, -64, -64, -64, -64, -64, 64, -64, -64, -64, -64, 64, 64, -64, 64, 64, -64, -64, -64, 64, -64, -64, -64, -64, -64, -64, -64, -64, 64, 64, 64, -64, -64, 64, 64, 64, -64, -64, 64, 64, -64, -64, 64, 64, -64, -64, 64, 64, -64, -64, 64, 64, 64, -64, -64, 64, 64, 64, 64, 64, 64, 64, 64, -64, 64, -64, -64, 64, -64, 64, 64, -64, 64, 64, -64, -64, -64, 64, -64, -64, 64, 64, -64, 64, 64, 64, -64, -64, 64, 64, -64, 64, -64, -64, -64, 64, -64, 64, -64, -64, -64, 64, -64, 64, 64, -64, -64, 64, 64, -64, 64, -64, 64, -64, -64, -64, 64, 64, -64, -64, -64, -64, -64, 64, -64, 64, -64, -64, 64, -64, 64, -64, -64, 64, 64, -64, -64, -64, -64, 64, 64, 64, -64, 64, -64, 64, 64, 64, -64, -64, -64, -64, 64, 64, 64, 64, -64, -64, 64, 64, -64, 64, -64, -64, -64, -64, 64, -64, -64, 64, 64, -64, -64, 64, -64, 64, 64, 64, 64, -64, 64, 64, 64, -64, 64, -64, -64, -64, -64, 64, 64, -64, -64, -64, -64, -64, -64, -64, -64, -64, -64, 64, -64, -64, -64, -64, 64, -64, 64, 64, -64, -64, -64, -64, 64, -64, -64, 64, -64, 64, 64, 64, -64, 64, 64, -64, -64, 64, 64, 64, -64, -64, 64, 64, 64, 64, -64, 64, -64, 64, -64, 64, -64, -64, 64, -64, -64, 64, -64, -64, -64, -64, -64, -64, -64, -64, -64, -64, -64, -64, -64, 64, 64, 64, 64, 64, -64, 64, 64, -64, -64, -64, -64, -64, -64, 64, -64, 64, 64, -64, 64, -64, -64, -64, -64, -64, 64, 64, -64, -64, 64, 64, 64, -64, -64, -64, -64, -64, -64, -64, -64, -64, -64, 64, 64, 64, -64, 64, -64, -64, -64, -64, -64, 64, -64, 64, -64, 64, 64, 64, -64, -64, 64, -64, -64, -64, -64, 64, 64, 64, -64, 64, 64, -64, -64, -64, -64, -64, -64, -64, 64, -64, -64, 64, -64, 64, 64, 64, 64, 64, -64, 64, -64, -64, 64, 64, 64, -64, 64, 64, -64, -64, -64, -64, -64, -64, -64, -64, -64, -64, -64, -64, -64, 64, -64, 64, -64, 64, 64, -64, 64, -64, -64, -64, 64, 64, -64, -64, -64, -64, -64, 64, -64, -64, -64, -64, -64, 64, -64, -64, -64, -64, 64, 64, -64, 64, 64, 64, 64, 64, -64, 64, -64, 64, 64, 64, 64, -64, 64, 64, -64, -64, -64, -64, -64, -64, -64, -64, -64, -64, -64, 64, 64, 64, 64, 64, -64, 64, -64, -64, -64, 64, 64, -64, -64, 64, 64, 64, -64, -64, 64, 64, -64, -64, -64, 64, 64, 64, -64, -64, -64, -64, -64, 64, 64, -64, -64, -64, -64, 64, -64, -64, -64, -64, 64, -64, -64, 64, 64, -64, -64, -64, -64, 64, 64, 64, -64, -64, -64, -64, 64, 64, 64, -64, -64, -64, -64, -64, -64, 64, -64, 64, 64, 64, -64, -64, -64, 64, -64, -64, -64, -64, -64, 64, -64, -64, -64, -64, -64, 64, -64, -64, -64, -64, -64, -64, -64, 64, -64, 64, -64, -64, -64, 64, 64, 64, -64, -64, -64, -64, -64, 64, -64, 64, -64, -64, -64, 64, -64, -64, -64, -64, -64, -64, -64, -64, -64, 64, -64, -64, -64, 64, 64, -64, -64, -64, -64, -64, 64, -64, 64, -64, -64, -64, -64, 64, -64, -64, -64, -64, -64, -64, -64, -64, 64, 64, 64, 64, 64, 64, 64, -64, -64, -64, -64, -64, 64, -64, 64, -64, -64, 64, 64, 64, 64, -64, -64, -64, -64, -64, 64, -64, 64, -64, -64, 64, 64, -64, 64, -64, -64, -64, -64, -64, -64, -64, -64, 64, 64, -64, 64, 64, 64, -64, -64, -64, -64, -64, -64, -64, 64, 64, -64, -64, 64, -64, -64, -64, -64, -64, -64, -64, 64, -64, 64, 64, -64, -64, 64, 64, -64, -64, -64, -64, -64, -64, -64, -64, -64, 64, -64, -64, -64, -64, -64, 64, -64, -64, -64, -64, 64, 64, -64, 64, -64, -64, 64, -64, -64, -64, -64, -64, -64, -64, -64, -64, -64, -64, -64, 64, -64, -64, -64, -64, -64, -64, 64, -64, -64, 64, -64, -64, -64, -64, 64, 64, -64, -64, -64, -64, -64, -64, -64, -64, -64, -64, -64, -64, -64, 64, 64, 64, 64, -64, -64, 64, -64, 64, 64, 64, 64, -64, 64, -64, -64, -64, -64, 64, -64, -64, -64, -64, -64, 64, 64, -64, -64, -64, -64, 64, 64, -64, -64, -64, 64, 64, -64, 64, -64, -64, 64, -64, -64, -64, 64, -64, 64, 64, -64, -64, 64, 64, -64, -64, -64, 64, -64, 64, 64, 64, 64, 64, 64, 64, 64, 64, -64, -64, -64, -64, 64, 64, 64, 64, 64, 64, 64, -64, -64, -64, -64, -64, -64, 64, -64, 64, 64, 64, 64, 64, 64, -64, 64, -64, 64, -64, -64, 64, 64, -64, -64, 64, 64, 64, 64, 64, 64, -64, -64, 64, -64, -64, -64, 64, 64, -64, 64, -64, -64, -64, 64, -64, -64, -64, 64, 64, 64, -64, -64, -64, -64, -64, 64, 64, 64, -64, -64, 64, 64, 64, 64, 64, -64, 64, -64, -64, -64, -64, 64, 64, 64, 64, 64, 64, -64, -64, 64, -64, 64, -64, -64, 64, -64, -64, -64, -64, 64, 64, -64, 64, 64, 64, -64, 64, 64, -64, 64, -64, -64, -64, -64, -64, 64, 64, -64, 64, -64, -64, -64, 64, 64, 64, -64, 64, 64, 64, -64, 64, -64, -64, 64, 64, 64, -64, 64, 64, -64, 64, 64, 64, 64, -64, -64, -64, 64, 64, 64, -64, 64, 64, -64, 64, 64, -64, -64, -64, -64, -64, -64, 64, 64, 64, 64, 64, 64, 64, 64, 64, 64, 64, 64, -64, 64, 64, 64, -64, 64, 64, 64, 64, 64, 64, -64, 64, -64, 64, -64, -64, -64, -64, 64, -64, 64, 64, 64, -64, 64, 64, -64, -64, 64, 64, 64, 64, 64, -64, -64, 64, 64, -64, 64, -64, -64, -64, -64, -64, -64, 64, -64, 64, 64, 64, -64, -64, 64, 64, -64, 64, 64, 64, 64, 64, -64, 64, 64, -64, -64, 64, -64, -64, -64, -64, -64, -64, 64, -64, -64, -64, -64, 64, -64, 64, -64, 64, -64, 64, -64, 64, 64, 64, 64, -64, -64, 64, -64, -64, -64, 64, 64, -64, -64, -64, 64, -64, 64, 64, -64, -64, 64, -64, -64, 64, -64, -64, 64, 64, 64, 64, 64, 64, -64, -64, 64, 64, 64, -64, -64, -64, -64, -64, -64, -64, 64, 64, 64, 64, 64, 64, 64, 64, 64, 64, -64, 64, 64, 64, -64, -64, -64, 64, 64, 64, 64, 64, 64, 64, -64, -64, -64, -64, -64, -64, 64, -64, 64, -64, -64, -64, 64, 64, 64, -64, -64, 64, 64, -64, 64, 64, -64, 64, 64, 64, 64, 64, 64, -64, -64, -64, -64, -64, -64, -64, 64, 64, -64, 64, 64, 64, 64, -64, -64, 64, 64, 64, -64, 64, 64, 64, 64, 64, 64, 64, 64, -64, -64, -64, -64, -64, -64, 64, 64, 64, 64, 64, -64, -64, 64, 64, 64, -64, 64, -64, -64, 64, -64, 64, 64, 64, 64, 64, -64, 64, -64, -64, -64, -64, 64, -64, -64, -64, 64, 64, 64, -64, 64, 64, 64, 64, 64, 64, 64, -64, 64, 64, 64, 64, 64, 64, 64, 64, -64, -64, -64, -64, -64, -64, 64, 64, 64, 64, -64, -64, 64, -64, -64, 64, 64, 64, -64, 64, 64, 64, 64, 64, 64, 64, 64, -64, 64, -64, -64, -64, -64, 64, -64, 64, 64, 64, 64, -64, 64, 64, 64, 64, 64, 64, 64, 64, 64, 64, 64, 64, 64, 64, 64, 64, -64, -64, -64, -64, 64, -64, 64, 64, 64, -64, 64, 64, 64, 64, 64, 64, 64, 64, 64, -64, 64, 64, 64, 64, 64, 64, 64, 64, -64, -64, -64, 64, 64, -64, 64, 64, -64, -64, -64, -64, -64, -64, 64, 64, 64, 64, -64, -64, -64, 64, 64, 64, 64, 64, -64, -64, -64, -64, -64, -64, 64, -64, -64, -64, 64, 64, 64, -64, -64, -64, 64, 64, 64, 64, 64, 64, 64, 64, 64, 64, 64, 64, 64, 64, 64, -64, -64, -64, 64, -64, -64, 64, 64, -64, 64, -64, -64, -64, -64, 64, 64, 64, 64, 64, 64, 64, 64, 64, 64, 64, -64, -64, 64, 64, 64, 64, 64, -64, 64, 64, -64, 64, 64, -64, -64, -64, -64, 64, 64, -64, 64, 64, 64, -64, -64, 64, -64, -64, 64, 64, -64, -64, -64, 64, -64, -64, 64, 64, 64, -64, 64, -64, -64, -64, -64, 64, 64, 64, 64, 64, -64, -64, -64, -64, -64, 64, -64, -64, -64, -64, -64, 64, -64, -64, 64, -64, -64, 64, 64, 64, -64, 64, -64, 64, -64, 64, 64, 64, 64, 64, 64, 64, 64, -64, -64, -64, -64, -64, -64, 64, -64, -64, 64, 64, 64, 64, -64, -64, -64, -64, -64, -64, 64, 64, -64, -64, -64, -64, -64, 64, 64, -64, 64, 64, -64, -64, -64, -64, 64, 64, 64, 64, -64, -64, 64, -64, 64, -64, -64, 64, -64, 64, -64, -64, 64, 64, -64, 64, 64, -64, 64, 64, -64, -64, 64, -64, 64, -64, -64, -64, -64, -64, 64, 64, 64, 64, 64, 64, 64, -64, 64, -64, -64, -64, -64, 64, 64, 64, -64, 64, 64, -64, -64, -64, 64, 64, 64, -64, -64, -64, 64, 64, 64, 64, 64, 64, -64, 64, 64, -64, -64, -64, -64, 64, 64, -64, -64, -64, 64, 64, 64, 64, -64, -64, -64, 64, 64, 64, -64, 64, 64, -64, 64, 64, 64, 64, 64, 64, -64, -64, -64, 64, -64, -64, 64, -64, -64, -64, -64, 64, 64, -64, 64, -64, -64, 64, -64, -64, -64, 64, 64, 64, 64, -64, -64, 64, 64, -64, 64, 64, -64, 64, 64, 64, 64, -64, 64, 64, -64, 64, 64, -64, -64, -64, 64, 64, 64, 64, 64, 64, 64, 64, 64, -64, 64, -64, -64, 64, -64, -64, -64, 64, -64, -64, 64, -64, -64, 64, 64, 64, -64, -64, 64, 64, -64, 64, -64, 64, 64, -64, -64, 64, -64, 64, -64, 64, 64, -64, 64, 64, -64, 64, -64, -64, 64, -64, -64, 64, -64, -64, -64, -64, 64, 64, -64, -64, 64, 64, -64, -64, -64, -64, -64, 64, 64, -64, -64, 64, -64, 64, 64, 64, 64, 64, -64, 64, -64, 64, 64, 64, 64, 64, -64, 64, -64, -64, -64, -64, -64, -64, -64, -64, -64, 64, 64, 64, 64, -64, 64, -64, 64, -64, -64, 64, 64, 64, 64, 64, 64, -64, -64, -64, -64, -64, 64, 64, 64, 64, -64, -64, -64, -64, -64, -64, -64, 64, 64, 64, -64, -64, -64, -64, 64, -64, -64, -64, 64, -64, -64, -64, -64, 64, 64, -64, -64, 64, 64, -64, -64, -64, -64, 64, 64, -64, 64, 64, 64, -64, -64, -64, 64, -64, 64, -64, -64, 64, -64, -64, -64, -64, -64, -64, 64, 64, 64, 64, 64, -64, -64, -64, -64, -64, 64, 64, -64, 64, 64, 64, -64, -64, -64, -64, 64, -64, -64, -64, -64, -64, 64, 64, -64, 64, 64, -64, -64, -64, -64, -64, -64, 64, 64, 64, -64, -64, -64, -64, -64, -64, 64, 64, 64, -64, 64, -64, -64, -64, -64, -64, -64, -64, 64, -64, -64, -64, -64, -64, -64, -64, 64, 64, -64, 64, 64, -64, -64, 64, -64, 64, 64, 64, -64, -64, 64, 64, -64, -64, -64, -64, 64, -64, -64, -64, -64, -64, -64, -64, 64, -64, -64, -64, -64, 64, 64, 64, 64, -64, -64, -64, -64, 64, 64, -64, -64, -64, -64, 64, 64, -64, -64, -64, -64, -64, -64, -64, -64, -64, -64, 64, -64, -64, -64, 64, 64, -64, -64, 64, 64, 64, -64, 64, 64, 64, 64, 64, 64, -64, -64, -64, -64, -64, -64, -64, -64, -64, -64, 64, -64, -64, -64, 64, 64, -64, -64, -64, -64, 64, -64, -64, 64, 64, 64, 64, 64, 64, -64, -64, -64, -64, 64, 64, 64, 64, 64, -64, 64, 64, -64, -64, 64, -64, -64, -64, -64, 64, 64, 64, 64, 64, 64, 64, 64, -64, -64, -64, -64, -64, -64, -64, 64, 64, 64, -64, 64, -64, 64, 64, 64, 64, -64, -64, -64, 64, -64, -64, -64, 64, 64, -64, -64, -64, -64, -64, -64, -64, -64, -64, -64, -64, -64, 64, -64, -64, -64, 64, -64, -64, -64, -64, -64, -64, -64, -64, -64, 64, 64, 64, 64, -64, -64, -64, -64, -64, -64, -64, -64, -64, -64, -64, -64, 64, -64, -64, -64, -64, 64, -64, -64, -64, -64, -64, -64, -64, 64, 64, -64, -64, -64, -64, -64, -64, -64, -64, -64, -64, 64, 64, -64, -64, 64, -64, -64, -64, -64, -64, -64, -64, -64, -64, -64, -64, 64, 64, 64, -64, -64, -64, -64, -64, -64, -64, -64, 64, -64, -64, 64, 64, -64, -64, -64, -64, -64, -64, -64, -64, -64, -64, -64, -64, -64, 64, -64, -64, -64, -64, -64, -64, -64, -64, -64, -64, -64, -64, -64, 64, 64, 64, -64, -64, -64, -64, -64, -64, -64, -64, -64, -64, 64, -64, 64, 64, -64, -64, 64, -64, -64, -64, -64, 64, 64, -64, 64, -64, -64, -64, -64, -64, -64, -64, -64, -64, -64, 64, 64, 64, -64, 64, -64, 64, -64, 64, -64, -64, 64, -64, 64, 64, 64, -64, 64, 64, -64, 64, -64, -64, -64, -64, -64, -64, -64, -64, -64, 64, -64, -64, -64, 64, -64, -64, -64, 64, 64, -64, -64, -64, 64, 64, -64, -64, -64, -64, -64, -64, -64, -64, -64, -64, -64, -64, 64, 64, 64, -64, 64, -64, 64, 64, 64, 64, 64, 64, -64, 64, 64, 64, 64, -64, 64, 64, -64, -64, -64, -64, -64, -64, -64, -64, -64, -64, 64, -64, -64, 64, 64, 64, 64, 64, 64, -64, -64, -64, -64, -64, 64, 64, 64, -64, -64, -64, -64, -64, -64, -64, 64, -64, -64, -64, -64, -64, 64, 64, 64, 64, 64, 64, 64, 64, 64, 64, 64, -64, 64, 64, -64, 64, -64, -64, -64, 64, -64, 64, 64, -64, -64, 64, -64, -64, 64, 64, 64, -64, -64, -64, -64, 64, -64, 64, 64, -64, 64, 64, 64, 64, 64, -64, 64, -64, -64, -64, -64, -64, -64, 64, -64, -64, -64, 64, -64, -64, -64, -64, -64, 64, -64, 64, -64, -64, -64, -64, 64, -64, 64, -64, 64, -64, -64, -64, -64, 64, -64, -64, -64, -64, 64, -64, 64, -64, 64, -64, 64, -64, 64, 64, -64, -64, 64, 64, 64, 64, 64, -64, -64, 64, -64, -64, -64, -64, 64, 64, -64, 64, -64, 64, -64, 64, 64, 64, -64, -64, 64, -64, 64, 64, -64, -64, 64, 64, -64, -64, -64, 64, 64, 64, 64, 64, -64, -64, -64, 64, -64, 64, 64, -64, 64, -64, 64, 64, -64, 64, 64, -64, -64, 64, -64, 64, 64, 64, -64, -64, 64, 64, 64, -64, 64, -64, -64, 64, 64, 64, 64, 64, -64, 64, 64, -64, -64, 64, -64, -64, 64, -64, -64, -64, -64, -64, 64, 64, 64, -64, -64, 64, 64, 64, 64, 64, 64, 64, 64, -64, 64, -64, -64, 64, -64, 64, 64, 64, 64, 64, -64, -64, -64, 64, -64, -64, -64, -64, -64, -64, -64, 64, 64, -64, 64, -64, 64, 64, 64, -64, 64, 64, 64, -64, -64, -64, -64, -64, 64, 64, -64, -64, -64, 64, 64, 64, -64, -64, 64, 64, -64, 64, -64, 64, -64, 64, -64, 64, 64, 64, -64, -64, 64, 64, -64, 64, -64, -64, -64, -64, 64, -64, 64, -64, -64, 64, -64, -64, 64, 64, 64, 64, 64, 64, -64, 64, 64, -64, 64, -64, 64, -64, 64, -64, 64, -64, 64, 64, -64, 64, 64, -64, 64, 64, 64, 64, -64, 64, 64, -64, 64, -64, -64, -64, 64, -64, 64, -64, 64, 64, -64, -64, -64, 64, 64, -64, 64, -64, 64, 64, -64, 64, 64, 64, 64, 64, 64, -64, 64, 64, 64, -64, -64, 64, 64, -64, 64, -64, 64, 64, 64, -64, 64, 64, 64, 64, 64, -64, 64, -64, -64, -64, -64, 64, 64, -64, 64, -64, 64, 64, 64, 64, 64, -64, -64, -64, -64, -64, -64, 64, 64, 64, -64, -64, 64, 64, 64, 64, -64, -64, 64, 64, -64, 64, 64, -64, -64, -64, -64, 64, 64, -64, -64, -64, -64, -64, -64, 64, 64, -64, 64, 64, -64, 64, 64, 64, -64, -64, 64, -64, -64, -64, -64, 64, 64, -64, -64, -64, 64, -64, 64, 64, 64, -64, 64, 64, 64, 64, -64, -64, 64, 64, 64, 64, -64, -64, -64, -64, -64, -64, -64, -64, 64, 64, 64, 64, 64, 64, -64, -64, 64, 64, 64, -64, -64, -64, -64, 64, 64, 64, -64, -64, 64, 64, -64, 64, 64, -64, 64, 64, -64, 64, 64, 64, 64, -64, -64, -64, -64, 64, -64, 64, 64, 64, -64, -64, 64, 64, -64, -64, 64, 64, 64, 64, -64, -64, 64, 64, 64, -64, 64, 64, 64, 64, 64, -64, -64, -64, -64, -64, -64, 64, 64, 64, 64, 64, 64, -64, 64, -64, 64, 64, -64, -64, -64, -64, -64, -64, 64, 64, 64, 64, 64, 64, 64, -64, -64, -64, -64, -64, 64, -64, 64, 64, 64, 64, 64, 64, 64, 64, -64, -64, 64, -64, -64, 64, 64, 64, -64, 64, -64, 64, -64, -64, -64, 64, -64, -64, -64, 64, -64, 64, 64, 64, 64, 64, -64, 64, 64, -64, -64, -64, 64, 64, 64, 64, -64, 64, 64, 64, -64, -64, -64, -64, 64, -64, 64, 64, 64, 64, 64, 64, 64, -64, 64, 64, 64, -64, 64, 64, 64, -64, 64, 64, 64, -64, -64, -64, 64, -64, -64, -64, -64, 64, 64, 64, 64, 64, 64, 64, 64, 64, 64, -64, 64, 64, 64, -64, 64, 64, 64, 64, -64, 64, -64, -64, 64, 64, -64, -64, 64, -64, -64, -64, -64, 64, 64, 64, 64, 64, 64, 64, 64, 64, -64, 64, -64, 64, 64, 64, 64, 64, 64, 64, 64, -64, 64, -64, -64, -64, 64, 64, 64, 64, 64, 64, 64, 64, 64, 64, -64, 64, 64, -64, 64, 64, 64, 64, 64, -64, -64, 64, -64, 64, 64, 64, -64, 64, 64, 64, 64, 64, 64, -64, 64, -64, -64, 64, -64, 64, 64, 64, 64, -64, 64, 64, -64, 64, 64, -64, -64, 64, -64, -64, -64, -64, -64, 64, 64, -64, 64, -64, 64, 64, 64, 64, -64, 64, -64, -64, 64, 64, 64, -64, -64, -64, -64, -64, -64, -64, -64, -64, -64, 64, 64, 64, 64, -64, -64, 64, -64, 64, -64, 64, -64, -64, 64, 64, -64, -64, 64, -64, 64, -64, 64, -64, -64, 64, -64, -64, -64, -64, 64, -64, 64, -64, -64, -64, 64, 64, -64, -64, 64, -64, -64, -64, -64, -64, -64, 64, -64, -64, 64, 64, 64, 64, 64, -64, 64, -64, -64, 64, 64, 64, 64, -64, -64, -64, -64, -64, 64, -64, -64, 64, -64, -64, -64, -64, -64, -64, 64, 64, -64, -64, -64, 64, 64, 64, 64, -64, 64, -64, -64, -64, -64, 64, 64, 64, 64, -64, 64, -64, 64, -64, -64, -64, 64, 64, 64, 64, -64, -64, -64, 64, -64, 64, -64, 64, -64, -64, -64, -64, 64, -64, -64, 64, -64, 64, 64, -64, 64, 64, -64, -64, -64, 64, -64, -64, 64, -64, 64, 64, 64, -64, -64, -64, -64, 64, -64, 64, -64, 64, 64, -64, -64, -64, 64, -64, -64, -64, -64, 64, 64, -64, -64, -64, -64, -64, 64, 64, 64, 64, 64, 64, 64, 64, 64, 64, 64, -64, 64, -64, -64, 64, -64, -64, 64, 64, -64, -64, -64, 64, 64, 64, 64, 64, -64, -64, 64, -64, -64, -64, -64, -64, -64, 64, 64, -64, 64, 64, -64, 64, -64, -64, -64, 64, 64, -64, 64, -64, 64, -64, -64, -64, -64, 64, 64, 64, 64, 64, 64, 64, -64, 64, -64, -64, -64, -64, -64, -64, -64, -64, 64, 64, -64, -64, 64, 64, -64, -64, -64, 64, -64, -64, 64, 64, 64, 64, -64, -64, 64, -64, -64, -64, -64, 64, -64, 64, 64, 64, -64, 64, 64, 64, -64, -64, -64, 64, -64, -64, 64, -64, 64, -64, 64, -64, -64, -64, -64, -64, 64, -64, -64, -64, -64, -64, -64, -64, -64, 64, -64, -64, 64, -64, -64, -64, -64, 64, 64, -64, 64, -64, -64, 64, -64, -64, 64, -64, 64, -64, -64, -64, -64, -64, 64, 64, 64, 64, 64, 64, 64, 64, -64, 64, 64, 64, 64, -64, 64, 64, 64, -64, -64, 64, -64, 64, -64, -64, -64, 64, -64, 64, -64, 64, -64, -64, 64, -64, -64, 64, 64, -64, 64, 64, 64, -64, -64, 64, -64, -64, -64, 64, -64, -64, -64, -64, -64, 64, 64, -64, -64, 64, -64, 64, -64, -64, -64, -64, -64, -64, 64, -64, -64, 64, 64, -64, -64, -64, -64, 64, -64, -64, -64, 64, 64, 64, -64, -64, 64, -64, 64, 64, -64, -64, 64, -64, -64, 64, 64, -64, -64, -64, -64, -64, -64, -64, 64, -64, -64, -64, 64, -64, 64, 64, -64, -64, -64, -64, -64, -64, -64, -64, 64, -64, -64, 64, 64, -64, 64, -64, -64, -64, -64, -64, -64, -64, 64, 64, -64, 64, 64, 64, -64, -64, -64, -64, -64, -64, -64, 64, 64, -64, 64, 64, 64, 64, 64, -64, 64, -64, 64, 64, 64, 64, -64, -64, 64, -64, -64, -64, -64, 64, -64, 64, -64, -64, 64, -64, 64, 64, 64, -64, -64, -64, 64, -64, 64, -64, -64, -64, 64, -64, -64, -64, -64, -64, -64, 64, -64, 64, -64, 64, -64, -64, 64, -64, 64, -64, 64, -64, 64, 64, -64, -64, -64, -64, 64, -64, -64, 64, -64, 64, -64, -64, 64, 64, -64, -64, -64, -64, -64, -64, 64, 64, -64, -64, -64, 64, -64, -64, 64, 64, -64, -64, -64, 64, -64, -64, -64, -64, -64, 64, -64, -64, 64, -64, -64, -64, -64, 64, -64, 64, 64, -64, -64, -64, -64, -64, 64, 64, 64, 64, -64, -64, 64, -64, -64, -64, -64, -64, -64, 64, -64, 64, 64, 64, -64, -64, 64, -64, 64, 64, -64, 64, 64, -64, 64, -64, 64, 64, 64, 64, -64, -64, 64, -64, -64, -64, -64, -64, -64, -64, 64, 64, -64, 64, 64, 64, 64, 64, 64, 64, 64, -64, 64, -64, -64, -64, 64, 64, -64, 64, -64, -64, -64, -64, 64, -64, 64, -64, 64, -64, -64, 64, 64, 64, -64, -64, -64, -64, -64, 64, -64, 64, -64, -64, 64, -64, -64, -64, 64, -64, -64, 64, 64, -64, -64, 64, -64, 64, -64, -64, -64, -64, -64, 64, 64, -64, 64, -64, 64, -64, -64, -64, -64, -64, -64, 64, 64, -64, 64, -64, -64, -64, 64, -64, -64, -64, 64, -64, -64, 64, 64, -64, -64, -64, -64, 64, 64, 64, -64, -64, -64, 64, 64, -64, -64, -64, 64, -64, 64, -64, 64, -64, -64, 64, -64, 64, -64, 64, 64, 64, -64, -64, -64, 64, -64, 64, 64, -64, -64, 64, 64, -64, -64, -64, -64, 64, 64, -64, -64, -64, 64, -64, -64, 64, -64, -64, 64, -64, -64, -64, -64, -64, -64, 64, -64, 64, -64, 64, 64, -64, -64, -64, -64, 64, -64, 64, -64, -64, 64, 64, -64, -64, 64, 64, 64, 64, -64, -64, -64, -64, -64, 64, 64, 64, 64, -64, -64, -64, -64, 64, 64, -64, 64, -64, -64, -64, 64, 64, -64, -64, 64, 64, 64, 64, 64, 64, 64, -64, 64, 64, 64, -64, -64, -64, 64, 64, -64, -64, 64, 64, 64, 64, -64, 64, 64, 64, 64, 64, -64, 64, -64, 64, 64, -64, -64, 64, 64, -64, -64, 64, 64, -64, -64, 64, -64, 64, -64, 64, -64, -64, 64, 64, 64, 64, 64, 64, -64, -64, 64, -64, 64, -64, 64, 64, 64, -64, 64, 64, 64, -64, 64, -64, 64, -64, 64, 64, 64, -64, 64, -64, 64, -64, 64, 64, 64, 64, -64, -64, 64, -64, 64, -64, 64, -64, 64, 64, -64, -64, 64, -64, -64, 64, 64, -64, -64, 64, -64, -64, -64, -64, -64, 64, -64, 64, 64, -64, 64, 64, 64, -64, -64, 64, -64, 64, -64, 64, -64, 64, 64, 64, 64, 64, -64, 64, -64, 64, 64, -64, 64, 64, -64, 64, 64, -64, -64, -64, -64, 64, -64, 64, 64, 64, 64, -64, -64, -64, -64, 64, -64, -64, 64, -64, 64, 64, 64, -64, 64, 64, 64, 64, 64, -64, 64, 64, 64, -64, 64, -64, 64, 64, -64, -64, -64, -64, -64, -64, -64, -64, 64, 64, 64, 64, -64, 64, -64, -64, -64, 64, -64, -64, 64, 64, 64, 64, 64, 64, -64, -64, -64, -64, -64, -64, 64, 64, -64, 64, -64, -64, -64, 64, -64, 64, -64, 64, -64, 64, -64, -64, -64, 64, 64, 64, 64, -64, -64, 64, -64, -64, -64, -64, -64, 64, 64, -64, 64, -64, -64, -64, 64, -64, -64, 64, 64, 64, 64, 64, -64, 64, -64, -64, -64, 64, 64, 64, -64, -64, 64, -64, -64, 64, 64, 64, 64, 64, -64, -64, -64, -64, -64, 64, 64, 64, 64, 64, 64, 64, 64, 64, -64, 64, 64, -64, -64, -64, -64, 64, -64, 64, 64, 64, -64, 64, 64, 64, -64, -64, -64, 64, 64, 64, 64, 64, 64, -64, -64, -64, -64, 64, 64, -64, -64, -64, -64, 64, 64, 64, 64, 64, 64, -64, 64, 64, 64, -64, -64, 64, 64, 64, 64, 64, -64, -64, -64, -64, -64, 64, 64, -64, -64, 64, 64, 64, 64, 64, 64, 64, -64, -64, -64, 64, 64, 64, 64, 64, 64, 64, 64, 64, -64, -64, -64, 64, 64, 64, 64, 64, 64, 64, 64, 64, 64, 64, 64, 64, -64, -64, -64, 64, 64, 64, -64, 64, 64, 64, 64, -64, -64, -64, -64, -64, 64, -64, 64, 64, 64, 64, 64, 64, 64, 64, 64, -64, -64, -64, 64, 64, 64, 64, -64, 64, 64, -64, -64, -64, 64, 64, 64, 64, 64, -64, 64, 64, 64, 64, 64, 64, 64, 64, 64, -64, -64, -64, -64, 64, 64, 64, 64, 64, -64, -64, -64, 64, 64, 64, -64, 64, -64, -64, 64, 64, 64, 64, 64, 64, 64, 64, -64, -64, -64, -64, 64, 64, 64, 64, 64, -64, -64, 64, 64, 64, 64, 64, -64, 64, -64, -64, -64, 64, 64, 64, 64, -64, 64, 64, -64, -64, -64, -64, 64, 64, 64, 64, 64, -64, 64, 64, 64, 64, 64, 64, -64, -64, -64, -64, 64, -64, 64, -64, 64, -64, 64, -64, -64, -64, -64, -64, 64, 64, 64, 64, 64, 64, 64, 64, 64, 64, 64, -64, 64, -64, -64, 64, 64, 64, -64, -64, 64, 64, -64, -64, -64, -64, -64, 64, 64, 64, 64, 64, 64, 64, 64, -64, -64, -64, -64, -64, 64, -64, -64, 64, 64, 64, 64, 64, 64, 64, 64, -64, 64, -64, -64, 64, -64, -64, 64, 64, 64, -64, 64, 64, 64, 64, -64, 64, 64, -64, -64, 64, 64, 64, 64, 64, 64, 64, 64, -64, -64, -64, 64, 64, -64, -64, -64, -64, 64, 64, 64, 64, 64, 64, 64, -64, -64, 64, -64, -64, -64, 64, 64, -64, 64, 64, 64, 64, -64, -64, 64, 64, 64, -64, 64, -64, 64, 64, -64, 64, 64, -64, 64, 64, -64, -64, 64, -64, -64, -64, 64, 64, -64, 64, 64, 64, 64, 64, -64, 64, 64, -64, -64, 64, 64, 64, 64, 64, -64, 64, -64, -64, -64, -64, -64, -64, -64, 64, -64, -64, 64, 64, -64, 64, -64, -64, -64, 64, 64, -64, -64, 64, 64, 64, 64, 64, 64, 64, 64, 64, 64, -64, -64, 64, 64, 64, 64, -64, -64, -64, -64, 64, -64, -64, 64, 64, 64, 64, 64, 64, 64, 64, 64, 64, 64, 64, 64, -64, 64, -64, -64, -64, -64, -64, -64, -64, -64, -64, -64, -64, 64, 64, -64, 64, 64, 64, 64, 64, 64, -64, 64, 64, -64, -64, -64, -64, 64, 64, 64, -64, -64, -64, 64, -64, -64, -64, -64, -64, 64, 64, 64, 64, 64, 64, 64, -64, 64, 64, 64, 64, 64, -64, 64, 64, 64, 64, 64, 64, 64, 64, 64, 64, 64, 64, 64, 64, 64, 64, 64, 64, 64, 64, -64, 64, -64, 64, -64, 64, -64, -64, 64, -64, 64, 64, -64, 64, -64, 64, -64, -64, -64, 64, -64, -64, -64, -64, 64, 64, 64, 64, 64, -64, 64, 64, 64, 64, -64, -64, -64, -64, 64, 64, 64, -64, -64, 64, 64, -64, 64, 64, 64, 64, -64, 64, -64, 64, -64, 64, -64, -64, -64, -64, -64, 64, 64, 64, -64, -64, 64, -64, -64, -64, -64, 64, -64, -64, 64, -64, 64, -64, 64, -64, -64, -64, -64, -64, -64, 64, 64, -64, -64, -64, -64, 64, 64, -64, -64, 64, 64, -64, 64, 64, -64, -64, -64, -64, -64, -64, -64, -64, -64, -64, 64, 64, 64, 64, -64, -64, -64, -64, 64, -64, 64, 64, -64, 64, 64, 64, 64, 64, 64, -64, -64, -64, -64, -64, -64, -64, -64, 64, 64, 64, 64, 64, -64, 64, -64, 64, -64, -64, -64, 64, -64, 64, -64, 64, 64, -64, -64, -64, 64, -64, -64, 64, -64, 64, 64, 64, 64, 64, 64, -64, -64, -64, -64, -64, -64, 64, -64, 64, -64, 64, -64, 64, -64, 64, -64, -64, -64, 64, -64, -64, -64, -64, 64, 64, 64, 64, 64, -64, -64, -64, -64, 64, 64, 64, 64, -64, -64, -64, 64, 64, 64, 64, 64, 64, 64, -64, 64, 64, 64, 64, 64, 64, 64, 64, 64, 64, 64, 64, -64, 64, 64, 64, 64, -64, 64, -64, -64, 64, 64, 64, 64, 64, 64, 64, 64, 64, -64, 64, 64, 64, 64, 64, 64, 64, 64, -64, -64, 64, 64, -64, 64, -64, -64, 64, -64, -64, 64, 64, -64, -64, 64, 64, 64, -64, -64, 64, 64, 64, 64, 64, 64, -64, 64, -64, -64, -64, -64, 64, -64, -64, 64, 64, -64, -64, -64, -64, -64, 64, -64, -64, 64, -64, 64, 64, 64, 64, 64, 64, -64, -64, 64, -64, -64, -64, 64, 64, 64, 64, 64, 64, -64, -64, -64, 64, 64, 64, -64, 64, 64, -64, 64, 64, 64, 64, -64, -64, 64, -64, -64, -64, -64, -64, -64, -64, -64, -64, -64, 64, -64, -64, -64, 64, -64, -64, -64, 64, -64, 64, -64, 64, 64, 64, 64, -64, -64, 64, -64, -64, -64, -64, -64, 64, -64, 64, -64, 64, 64, 64, 64, -64, -64, -64, -64, -64, 64, -64, 64, 64, 64, 64, 64, -64, -64, 64, -64, -64, -64, -64, 64, 64, -64, -64, 64, -64, 64, 64, -64, 64, -64, -64, -64, -64, -64, 64, 64, 64, 64, 64, -64, 64, 64, -64, -64, -64, -64, -64, -64, -64, -64, -64, 64, 64, -64, 64, 64, -64, 64, 64, 64, 64, 64, 64, 64, -64, -64, 64, -64, -64, 64, 64, 64, -64, -64, 64, 64, 64, 64, 64, 64, 64, 64, 64, 64, -64, 64, -64, 64, 64, 64, 64, 64, 64, -64, -64, 64, 64, 64, 64, 64, 64, -64, -64, 64, 64, 64, 64, 64, -64, 64, 64, 64, 64, 64, 64, 64, 64, 64, 64, 64, 64, 64, 64, 64, 64, 64, 64, 64, 64, -64, -64, 64, 64, 64, -64, 64, -64, -64, 64, 64, 64, 64, -64, 64, 64, 64, 64, 64, 64, 64, 64, 64, 64, 64, 64, 64, 64, -64, 64, 64, 64, -64, 64, 64, -64, -64, -64, 64, 64, 64, 64, 64, 64, 64, 64, 64, 64, -64, -64, -64, 64, 64, 64, -64, 64, 64, 64, 64, 64, -64, 64, -64, 64, 64, -64, 64, -64, 64, -64, 64, 64, 64, 64, 64, 64, -64, 64, 64, 64, 64, 64, 64, 64, 64, 64, 64, -64, -64, 64, -64, -64, 64, -64, 64, -64, 64, -64, 64, 64, 64, 64, 64, -64, 64, 64, 64, -64, 64, 64, 64, 64, 64, 64, 64, 64, 64, -64, 64, 64, -64, 64, -64, -64, 64, 64, 64, 64, 64, 64, 64, -64, 64, 64, 64, -64, 64, 64, 64, 64, 64, 64, 64, 64, -64, 64, -64, 64, 64, 64, -64, -64, 64, -64, 64, 64, 64, 64, -64, 64, -64, 64, -64, 64, 64, 64, 64, 64, 64, 64, -64, 64, 64, 64, 64, -64, -64, -64, -64, -64, -64, -64, -64, 64, -64, -64, -64, 64, 64, 64, 64, 64, 64, 64, 64, 64, 64, 64, 64, 64, 64, -64, 64, -64, -64, 64, -64, -64, -64, -64, -64, -64, -64, -64, -64, -64, 64, -64, -64, -64, 64, 64, 64, -64, -64, -64, 64, 64, 64, 64, 64, -64, -64, -64, 64, -64, 64, 64, -64, -64, -64, -64, -64, -64, 64, 64, -64, 64, 64, 64, 64, 64, 64, 64, 64, 64, -64, -64, 64, -64, 64, -64, -64, -64, 64, 64, -64, -64, 64, 64, 64, -64, 64, -64, -64, -64, -64, 64, 64, 64, 64, 64, -64, -64, -64, 64, -64, 64, 64, 64, -64, 64, 64, 64, 64, 64, 64, -64, -64, -64, -64, 64, -64, -64, 64, -64, 64, -64, 64, 64, -64, 64, 64, 64, 64, -64, -64, -64, -64, -64, -64, 64, -64, 64, -64, 64, -64, -64, -64, 64, 64, 64, 64, 64, 64, 64, 64, 64, -64, -64, 64, -64, -64, -64, -64, -64, 64, -64, 64, -64, -64, -64, -64, -64, 64, -64, 64, -64, 64, -64, -64, -64, 64, 64, -64, -64, 64, -64, -64, -64, -64, 64, -64, -64, 64, 64, -64, 64, -64, 64, 64, -64, -64, -64, 64, -64, -64, 64, -64, 64, -64, -64, -64, 64, -64, -64, -64, -64, 64, -64, -64, 64, 64, 64, -64, 64, 64, -64, -64, 64, -64, -64, -64, 64, 64, 64, -64, 64, 64, 64, -64, -64, 64, 64, 64, 64, -64, 64, -64, 64, 64, -64, 64, 64, -64, -64, -64, -64, -64, -64, 64, 64, 64, 64, -64, 64, -64, -64, -64, -64, 64, -64, 64, 64, -64, -64, -64, -64, -64, -64, -64, 64, -64, -64, -64, 64, -64, 64, 64, -64, -64, -64, 64, -64, -64, 64, -64, -64, -64, -64, -64, -64, 64, 64, 64, -64, -64, -64, 64, -64, 64, -64, -64, -64, -64, 64, -64, -64, 64, 64, 64, 64, 64, -64, -64, -64, 64, 64, -64, 64, -64, 64, -64, -64, -64, -64, -64, 64, 64, 64, 64, 64, 64, -64, 64, 64, 64, 64, 64, -64, 64, -64, 64, 64, -64, 64, 64, -64, 64, 64, 64, -64, -64, 64, 64, 64, 64, 64, 64, -64, 64, 64, 64, 64, 64, 64, 64, 64, 64, -64, 64, 64, 64, 64, 64, -64, 64, 64, -64, 64, -64, 64, -64, 64, 64, 64, 64, 64, 64, 64, -64, 64, 64, 64, 64, 64, 64, 64, 64, 64, 64, -64, 64, -64, 64, 64, -64, -64, -64, 64, 64, 64, -64, 64, 64, 64, 64, 64, 64, 64, 64, 64, -64, 64, -64, 64, 64, -64, 64, 64, -64, 64, 64, 64, 64, 64, -64, -64, 64, -64, 64, 64, 64, 64, 64, 64, 64, 64, 64, 64, 64, 64, 64, -64, 64, 64, 64, 64, 64, 64, 64, -64, -64, 64, 64, -64, 64, -64, 64, 64, -64, 64, 64, 64, 64, 64, 64, 64, 64, 64, 64, 64, -64, 64, 64, -64, 64, -64, 64, 64, -64, 64, -64, 64, 64, 64, -64, -64, -64, -64, -64, 64, 64, 64, 64, 64, -64, 64, 64, -64, -64, -64, 64, 64, 64, -64, -64, -64, 64, -64, -64, 64, 64, 64, 64, 64, -64, -64, 64, 64, 64, 64, 64, -64, 64, 64, 64, -64, -64, -64, 64, -64, 64, 64, 64, 64, -64, 64, 64, 64, 64, 64, -64, 64, 64, 64, -64, -64, -64, 64, 64, 64, 64, -64, 64, 64, -64, -64, 64, 64, 64, 64, 64, 64, 64, -64, 64, 64, 64, 64, 64, 64, 64, -64, -64, 64, 64, 64, -64, 64, 64, -64, 64, -64, -64, 64, -64, -64, 64, 64, -64, 64, 64, 64, -64, 64, 64, 64, 64, 64, 64, 64, 64, 64, 64, 64, 64, 64, 64, -64, 64, -64, -64, -64, -64, -64, -64, -64, -64, -64, -64, -64, -64, -64, 64, 64, 64, 64, 64, 64, 64, 64, 64, -64, -64, 64, 64, -64, 64, 64, -64, 64, -64, -64, 64, -64, -64, 64, 64, -64, -64, -64, 64, 64, 64, 64, 64, 64, 64, 64, 64, -64, 64, 64, 64, 64, 64, -64, 64, 64, -64, 64, 64, -64, -64, 64, 64, 64, 64, -64, 64, -64, -64, 64, 64, 64, 64, -64, 64, 64, 64, 64, 64, 64, 64, -64, 64, 64, -64, 64, -64, -64, -64, 64, 64, 64, -64, -64, -64, -64, -64, -64, -64, -64, -64, -64, -64, 64, -64, 64, 64, 64, -64, -64, 64, -64, -64, 64, -64, 64, 64, 64, 64, -64, -64, -64, -64, -64, -64, 64, 64, 64, -64, -64, 64, 64, 64, 64, 64, -64, 64, 64, 64, 64, -64, -64, -64, 64, 64, 64, -64, -64, 64, -64, -64, -64, 64, -64, 64, -64, 64, -64, 64, 64, 64, 64, 64, -64, 64, 64, 64, 64, 64, -64, 64, 64, 64, 64, -64, -64, -64, 64, 64, 64, 64, 64, 64, -64, -64, 64, 64, 64, 64, 64, 64, 64, 64, 64, 64, 64, 64, -64, -64, -64, 64, -64, 64, -64, 64, 64, 64, -64, 64, -64, 64, 64, 64, 64, 64, 64, 64, 64, 64, 64, 64, 64, 64, 64, 64, 64, -64, -64, 64, 64, 64, 64, 64, -64, -64, -64, -64, -64, 64, 64, 64, 64, 64, 64, 64, 64, 64, 64, 64, -64, -64, -64, 64, -64, -64, -64, 64, 64, -64, -64, 64, -64, 64, 64, -64, -64, 64, 64, 64, 64, -64, 64, 64, -64, -64, -64, 64, -64, -64, 64, -64, -64, -64, 64, -64, 64, -64, 64, -64, 64, 64, -64, 64, 64, -64, 64, 64, 64, -64, 64, -64, 64, -64, -64, 64, 64, -64, -64, 64, 64, 64, 64, 64, -64, -64, -64, -64, -64, 64, -64, 64, 64, 64, -64, -64, 64, -64, -64, -64, -64, 64, 64, 64, -64, -64, -64, -64, -64, 64, -64, -64, -64, -64, -64, -64, -64, -64, 64, -64, 64, -64, -64, -64, -64, -64, 64, -64, -64, 64, -64, -64, -64, -64, -64, -64, -64, -64, 64, -64, 64, 64, -64, 64, -64, 64, 64, -64, -64, -64, 64, -64, -64, 64, -64, -64, 64, -64, -64, 64, -64, -64, -64, -64, -64, -64, -64, 64, 64, 64, -64, 64, 64, 64, 64, 64, -64, 64, 64, -64, -64, -64, -64, -64, 64, 64, 64, -64, 64, 64, 64, 64, 64, 64, -64, -64, -64, -64, -64, 64, 64, 64, -64, -64, 64, 64, 64, 64, -64, -64, -64, -64, -64, -64, -64, 64, 64, -64, -64, -64, -64, -64, -64, 64, -64, 64, 64, 64, 64, 64, 64, 64, 64, 64, -64, 64, -64, -64, -64, -64, 64, -64, -64, -64, -64, -64, -64, -64, -64, -64, -64, 64, -64, -64, 64, 64, 64, 64, 64, 64, 64, 64, -64, -64, -64, -64, -64, -64, 64, -64, -64, -64, -64, -64, 64, 64, -64, 64, -64, 64, 64, 64, 64, 64, 64, -64, -64, 64, 64, -64, -64, -64, -64, -64, -64, -64, -64, -64, -64, 64, 64, -64, -64, -64, -64, -64, -64, 64, 64, 64, -64, 64, -64, -64, 64, -64, 64, 64, -64, -64, -64, -64, -64, -64, -64, 64, 64, -64, 64, 64, 64, -64, 64, 64, -64, -64, -64, 64, 64, 64, -64, 64, 64, 64, 64, 64, -64, -64, -64, -64, -64, -64, -64, 64, 64, -64, 64, 64, 64, -64, -64, -64, 64, 64, 64, 64, 64, -64, 64, 64, 64, 64, 64, -64, -64, -64, -64, -64, -64, -64, -64, 64, 64, 64, 64, 64, 64, -64, -64, -64, 64, 64, 64, 64, 64, 64, 64, 64, 64, 64, -64, 64, 64, -64, -64, -64, -64, -64, -64, -64, 64, 64, 64, -64, 64, 64, -64, -64, -64, 64, -64, 64, 64, 64, 64, 64, 64, 64, -64, -64, -64, -64, -64, -64, -64, -64, -64, 64, -64, -64, 64, 64, 64, -64, -64, -64, 64, 64, -64, 64, 64, 64, 64, 64, 64, -64, -64, -64, -64, -64, -64, -64, -64, -64, -64, -64, -64, 64, 64, 64, 64, 64, 64, 64, 64, 64, 64, -64, 64, 64, 64, 64, 64, 64, -64, -64, -64, -64, -64, -64, -64, -64, -64, 64, 64, 64, -64, 64, 64, -64, 64, 64, 64, -64, 64, 64, -64, 64, 64, 64, 64, 64, -64, -64, -64, 64, -64, -64, -64, -64, 64, 64, 64, 64, 64, 64, 64, 64, 64, 64, 64, 64, 64, -64, -64, 64, 64, 64, 64, 64, 64, 64, -64, 64, -64, -64, -64, -64, 64, 64, 64, 64, 64, -64, 64, 64, 64, 64, 64, 64, 64, 64, 64, 64, -64, 64, 64, -64, 64, 64, 64, 64, 64, -64, -64, 64, 64, 64, 64, -64, -64, 64, -64, -64, -64, 64, 64, 64, 64, 64, 64, 64, -64, -64, 64, 64, -64, -64, -64, -64, -64, -64, 64, 64, 64, 64, 64, 64, 64, 64, -64, -64, -64, -64, -64, -64, 64, 64, 64, 64, -64, 64, -64, 64, 64, -64, -64, -64, -64, -64, 64, 64, -64, -64, -64, 64, 64, -64, -64, -64, -64, 64, -64, 64, -64, -64, -64, 64, -64, -64, -64, -64, -64, -64, -64, -64, -64, -64, -64, 64, -64, -64, 64, 64, 64, -64, -64, -64, -64, 64, -64, -64, -64, 64, 64, -64, 64, -64, -64, -64, -64, -64, -64, -64, -64, -64, -64, 64, -64, 64, 64, 64, -64, -64, -64, -64, 64, -64, 64, -64, -64, 64, 64, -64, -64, -64, -64, -64, -64, -64, -64, -64, -64, -64, -64, 64, 64, 64, -64, -64, 64, 64, -64, -64, 64, 64, -64, -64, -64, 64, 64, -64, -64, 64, 64, -64, 64, -64, -64, -64, -64, -64, -64, -64, -64, -64, -64, 64, 64, 64, -64, -64, 64, -64, -64, -64, -64, -64, 64, -64, 64, -64, -64, 64, -64, 64, -64, -64, -64, -64, -64, -64, 64, -64, -64, 64, -64, 64, -64, 64, -64, 64, -64, -64, 64, 64, 64, -64, 64, -64, 64, 64, -64, 64, 64, 64, -64, -64, 64, 64, 64, 64, -64, 64, 64, -64, -64, 64, -64, 64, -64, 64, 64, 64, 64, -64, 64, -64, -64, 64, 64, 64, 64, 64, -64, 64, 64, 64, 64, 64, 64, 64, 64, -64, -64, 64, -64, 64, -64, 64, 64, 64, -64, -64, 64, -64, -64, 64, -64, 64, 64, 64, -64, 64, -64, -64, -64, -64, 64, -64, 64, -64, -64, -64, -64, -64, 64, -64, -64, 64, -64, 64, 64, 64, 64, 64, -64, -64, -64, -64, 64, 64, 64, 64, 64, -64, -64, 64, 64, 64, -64, 64, -64, 64, 64, 64, 64, -64, 64, 64, 64, -64, -64, -64, -64, 64, -64, 64, 64, 64, 64, 64, -64, -64, -64, 64, 64, 64, -64, 64, -64, -64, -64, -64, -64, -64, -64, -64, 64, 64, 64, 64, -64, 64, -64, -64, 64, -64, -64, -64, -64, -64, 64, -64, -64, -64, 64, 64, -64, -64, 64, 64, 64, 64, -64, 64, -64, -64, -64, 64, 64, 64, 64, 64, 64, -64, -64, -64, -64, -64, -64, -64, -64, -64, -64, 64, -64, -64, -64, 64, -64, -64, -64, 64, 64, 64, -64, 64, 64, 64, 64, 64, 64, -64, -64, -64, -64, -64, -64, -64, -64, -64, -64, 64, -64, -64, -64, 64, 64, 64, 64, 64, 64, -64, 64, 64, 64, 64, 64, -64, -64, 64, 64, 64, -64, -64, -64, -64, -64, -64, -64, -64, -64, -64, 64, -64, 64, 64, 64, 64, -64, 64, 64, 64, 64, -64, -64, 64, 64, 64, -64, 64, -64, -64, -64, -64, -64, -64, -64, -64, -64, -64, -64, 64, -64, -64, 64, 64, 64, 64, 64, 64, 64, 64, -64, -64, 64, 64, 64, -64, 64, -64, -64, -64, -64, -64, -64, -64, -64, 64, 64, 64, 64, 64, 64, 64, 64, -64, 64, 64, 64, 64, 64, 64, 64, 64, 64, 64, 64, -64, -64, -64, -64, -64, -64, -64, -64, -64, 64, -64, 64, 64, 64, 64, 64, -64, 64, -64, -64, -64, 64, 64, 64, 64, 64, 64, 64, -64, -64, -64, -64, -64, -64, -64, -64, -64, -64, -64, 64, 64, 64, -64, 64, -64, -64, -64, -64, -64, 64, 64, 64, 64, 64, 64, 64, 64, -64, -64, -64, -64, -64, -64, -64, -64, 64, -64, -64, -64, -64, -64, -64, -64, -64, 64, -64, -64, 64, -64, 64, 64, 64, -64, -64, -64, -64, -64, -64, -64, 64, 64, -64, -64, -64, -64, -64, 64, -64, -64, -64, -64, -64, 64, -64, -64, -64, -64, -64, 64, -64, -64, -64, -64, -64, -64, 64, -64, 64, -64, 64, -64, -64, -64, -64, -64, 64, -64, -64, -64, -64, -64, 64, 64, 64, -64, 64, 64, -64, 64, 64, 64, -64, -64, -64, -64, -64, -64, 64, 64, 64, 64, -64, -64, 64, -64, -64, -64, -64, -64, -64, -64, -64, -64, -64, -64, 64, 64, 64, -64, -64, 64, 64, 64, 64, -64, -64, -64, 64, 64, -64, 64, -64, 64, -64, -64, -64, -64, -64, -64, -64, 64, -64, -64, 64, -64, -64, -64, -64, 64, -64, 64, -64, -64, -64, -64, 64, 64, 64, 64, -64, 64, -64, -64, -64, -64, -64, -64, -64, 64, -64, -64, 64, 64, -64, 64, -64, -64, -64, 64, -64, -64, -64, 64, -64, -64, -64, -64, -64, 64, -64, -64, -64, -64, -64, -64, -64, -64, -64, -64, 64, 64, -64, -64, -64, 64, -64, -64, -64, -64, -64, -64, 64, 64, 64, -64, -64, -64, -64, -64, -64, -64, -64, -64, -64, -64, -64, 64, 64, 64, 64, -64, 64, 64, 64, 64, -64, -64, -64, -64, -64, 64, 64, 64, -64, 64, -64, -64, -64, -64, -64, -64, -64, -64, -64, -64, 64, 64, -64, -64, -64, 64, 64, 64, -64, 64, -64, 64, 64, -64, 64, -64, -64, -64, -64, -64, -64, -64, -64, -64, -64, -64, -64, 64, 64, 64, 64, -64, -64, 64, -64, 64, -64, -64, 64, 64, -64, 64, 64, 64, -64, 64, -64, -64, -64, -64, -64, -64, -64, -64, -64, 64, 64, 64, -64, -64, 64, 64, 64, -64, -64, -64, -64, 64, -64, -64, 64, -64, -64, -64, -64, 64, 64, -64, -64, -64, -64, -64, 64, 64, 64, 64, 64, 64, 64, 64, -64, -64, -64, -64, 64, -64, 64, 64, 64, -64, -64, 64, -64, 64, 64, 64, -64, -64, -64, -64, 64, 64, 64, 64, 64, -64, -64, 64, -64, -64, -64, -64, -64, 64, -64, 64, 64, -64, 64, 64, 64, -64, -64, 64, -64, 64, -64, 64, 64, 64, 64, 64, 64, -64, 64, 64, -64, 64, 64, 64, -64, -64, 64, 64, 64, -64, -64, 64, 64, -64, -64, 64, 64, 64, 64, 64, 64, 64, 64, 64, 64, 64, -64, 64, 64, 64, 64, -64, 64, -64, 64, 64, 64, 64, 64, -64, -64, 64, -64, 64, 64, 64, 64, 64, -64, -64, 64, 64, 64, -64, -64, 64, -64, -64, -64, 64, -64, 64, 64, 64, 64, 64, -64, 64, 64, -64, -64, -64, 64, 64, 64, 64, -64, 64, -64, -64, -64, -64, -64, 64, -64, 64, -64, 64, -64, 64, 64, 64, -64, 64, -64, 64, 64, -64, 64, -64, -64, -64, -64, -64, 64, -64, -64, -64, -64, 64, -64, -64, -64, -64, -64, 64, 64, 64, -64, 64, -64, -64, 64, 64, -64, 64, 64, 64, -64, -64, -64, -64, -64, 64, -64, -64, -64, 64, 64, -64, -64, -64, 64, -64, 64, -64, -64, -64, 64, -64, 64, 64, 64, -64, -64, 64, -64, -64, -64, -64, 64, 64, 64, 64, 64, -64, -64, -64, -64, 64, -64, -64, 64, -64, -64, -64, 64, 64, 64, -64, 64, -64, 64, -64, -64, -64, -64, -64, 64, 64, 64, 64, 64, 64, 64, -64, -64, -64, 64, -64, -64, -64, 64, 64, 64, -64, 64, -64, -64, 64, -64, 64, 64, 64, 64, 64, 64, 64, 64, 64, -64, -64, 64, 64, -64, -64, -64, -64, 64, 64, -64, 64, 64, 64, 64, 64, 64, 64, -64, 64, -64, 64, 64, 64, 64, 64, 64, -64, -64, -64, -64, -64, -64, -64, -64, -64, 64, 64, 64, 64, 64, 64, -64, -64, 64, -64, -64, 64, 64, 64, 64, 64, 64, 64, 64, -64, -64, 64, 64, 64, -64, -64, -64, -64, -64, -64, 64, -64, 64, -64, -64, -64, 64, -64, 64, 64, 64, 64, 64, 64, 64, 64, -64, -64, -64, 64, 64, -64, -64, -64, -64, -64, 64, -64, -64, 64, 64, 64, 64, 64, -64, 64, 64, 64, 64, 64, 64, 64, 64, 64, -64, -64, -64, -64, -64, -64, 64, -64, -64, -64, -64, -64, -64, 64, -64, 64, -64, -64, 64, 64, 64, 64, 64, 64, 64, 64, -64, -64, -64, -64, 64, 64, 64, 64, -64, -64, -64, -64, -64, -64, 64, 64, 64, -64, -64, 64, 64, 64, 64, 64, 64, -64, -64, -64, -64, -64, -64, -64, 64, 64, 64, 64, 64, -64, -64, -64, -64, -64, -64, 64, 64, 64, -64, -64, 64, 64, 64, 64, 64, -64, -64, 64, -64, 64, 64, 64, 64, 64, 64, 64, 64, 64, -64, -64, -64, 64, -64, 64, -64, -64, 64, 64, 64, 64, 64, 64, -64, -64, 64, 64, 64, 64, 64, 64, 64, 64, 64, 64, 64, 64, -64, -64, -64, -64, -64, 64, 64, 64, -64, 64, 64, 64, 64, 64, 64, -64, -64, -64, 64, 64, 64, 64, 64, 64, 64, 64, 64, -64, 64, -64, -64, -64, -64, -64, 64, 64, 64, 64, 64, 64, -64, 64, 64, -64, -64, -64, -64, -64, -64, 64, 64, 64, 64, 64, 64, 64, -64, -64, -64, -64, -64, 64, 64, -64, -64, -64, -64, 64, 64, 64, 64, -64, 64, -64, -64, -64, -64, -64, -64, 64, -64, 64, 64, 64, -64, -64, -64, 64, -64, 64, -64, 64, -64, -64, -64, -64, 64, -64, -64, 64, -64, -64, -64, -64, -64, -64, -64, 64, 64, -64, 64, 64, 64, 64, 64, -64, -64, 64, -64, 64, 64, 64, -64, 64, -64, 64, -64, -64, 64, -64, -64, -64, -64, -64, -64, -64, 64, 64, 64, 64, 64, 64, -64, 64, -64, 64, -64, 64, -64, 64, 64, 64, -64, 64, 64, 64, 64, -64, -64, -64, -64, -64, -64, 64, 64, 64, 64, 64, 64, 64, -64, 64, 64, -64, -64, 64, -64, 64, 64, 64, -64, -64, -64, 64, -64, -64, -64, -64, -64, -64, -64, 64, 64, 64, 64, 64, 64, 64, -64, 64, 64, 64, 64, 64, 64, -64, -64, -64, -64, -64, 64, -64, -64, 64, -64, -64, -64, 64, 64, 64, 64, 64, 64, 64, 64, 64, -64, 64, 64, 64, -64, 64, -64, 64, -64, -64, -64, 64, -64, 64, 64, 64, -64, 64, 64, 64, 64, 64, 64, 64, 64, 64, 64, 64, 64, 64, -64, -64, 64, -64, -64, 64, -64, 64, 64, -64, 64, 64, 64, 64, 64, 64, 64, 64, 64, 64, 64, 64, 64, 64, -64, 64, -64, 64, -64, -64, 64, 64, 64, 64, 64, -64, 64, 64, 64, 64, 64, 64, 64, 64, 64, 64, 64, 64, -64, 64, 64, -64, -64, 64, 64, 64, -64, -64, -64, -64, 64, 64, 64, -64, 64, 64, 64, 64, -64, -64, -64, 64, -64, 64, 64, -64, 64, 64, -64, -64, -64, 64, -64, 64, 64, -64, 64, 64, 64, -64, 64, 64, 64, 64, 64, 64, -64, 64, 64, 64, 64, 64, 64, -64, 64, -64, 64, 64, -64, -64, -64, -64, -64, 64, -64, -64, 64, 64, -64, 64, -64, 64, 64, -64, 64, -64, 64, 64, 64, -64, 64, 64, -64, 64, 64, -64, -64, 64, -64, -64, 64, -64, 64, -64, 64, 64, 64, 64, 64, 64, -64, 64, -64, 64, -64, -64, -64, -64, 64, 64, -64, 64, 64, 64, -64, -64, -64, -64, -64, 64, -64, 64, -64, -64, 64, -64, -64, 64, 64, 64, -64, 64, 64, 64, 64, 64, 64, -64, 64, -64, -64, -64, 64, -64, 64, 64, -64, 64, 64, 64, 64, -64, 64, -64, 64, 64, -64, 64, -64, -64, -64, 64, 64, 64, -64, -64, 64, -64, 64, -64, -64, 64, -64, -64, -64, 64, 64, -64, -64, -64, -64, -64, 64, -64, 64, -64, 64, 64, 64, -64, 64, 64, 64, 64, 64, 64, -64, 64, 64, -64, 64, 64, 64, -64, 64, 64, -64, -64, -64, 64, -64, -64, -64, -64, -64, 64, 64, 64, 64, 64, 64, 64, -64, 64, 64, 64, 64, 64, -64, -64, 64, 64, 64, 64, -64, 64, -64, -64, 64, 64, 64, 64, -64, 64, 64, 64, 64, 64, 64, 64, -64, -64, 64, 64, 64, 64, -64, -64, -64, -64, -64, 64, -64, -64, 64, -64, 64, -64, -64, -64, -64, -64, 64, 64, -64, 64, 64, -64, 64, 64, 64, 64, -64, -64, -64, 64, 64, -64, 64, 64, 64, -64, 64, 64, 64, 64, 64, 64, 64, -64, -64, 64, 64, -64, 64, -64, 64, 64, 64, 64, -64, -64, 64, 64, -64, -64, 64, -64, -64, -64, 64, 64, 64, 64, -64, -64, -64, 64, 64, 64, -64, 64, 64, 64, 64, 64, -64, 64, 64, 64, -64, -64, 64, 64, 64, 64, 64, -64, 64, 64, 64, 64, 64, 64, 64, 64, -64, 64, 64, -64, -64, 64, 64, 64, -64, -64, 64, 64, 64, 64, 64, -64, 64, -64, -64, -64, 64, -64, 64, 64, 64, 64, -64, 64, 64, 64, -64, -64, 64, 64, 64, -64, 64, 64, -64, 64, 64, 64, 64, -64, -64, 64, -64, -64, -64, 64, 64, 64, 64, 64, 64, 64, 64, -64, -64, 64, 64, -64, 64, 64, 64, -64, 64, -64, 64, 64, 64, -64, -64, 64, 64, 64, 64, 64, 64, -64, 64, 64, 64, -64, 64, -64, 64, -64, -64, 64, 64, -64, -64, -64, -64, 64, 64, -64, 64, -64, -64, 64, 64, 64, 64, 64, -64, 64, 64, 64, -64, 64, 64, -64, 64, 64, -64, 64, 64, 64, -64, -64, 64, 64, 64, -64, 64, -64, -64, -64, -64, 64, 64, 64, -64, -64, -64, -64, -64, 64, 64, 64, 64, 64, 64, -64, 64, 64, 64, 64, 64, 64, 64, -64, 64, -64, 64, -64, -64, -64, 64, 64, -64, -64, -64, 64, -64, 64, 64, 64, 64, -64, 64, -64, 64, 64, 64, 64, 64, 64, -64, -64, 64, 64, 64, 64, -64, -64, 64, 64, -64, -64, -64, 64, -64, -64, 64, 64, -64, 64, 64, 64, -64, 64, -64, 64, -64, -64, -64, 64, -64, 64, -64, 64, -64, -64, 64, 64, 64, -64, 64, -64, -64, 64, 64, -64, -64, -64, 64, 64, 64, -64, -64, -64, -64, 64, -64, -64, -64, 64, 64, -64, -64, 64, -64, 64, 64, 64, 64, 64, 64, -64, 64, 64, 64, -64, 64, 64, 64, -64, -64, -64, 64, -64, 64, -64, -64, 64, 64, 64, -64, 64, 64, 64, 64, -64, -64, 64, 64, 64, -64, 64, 64, -64, 64, -64, -64, 64, -64, -64, -64, -64, -64, -64, -64, -64, 64, -64, 64, 64, -64, 64, -64, 64, 64, 64, 64, 64, 64, 64, -64, 64, 64, -64, 64, -64, 64, 64, -64, -64, -64, 64, 64, -64, -64, -64, -64, -64, -64, 64, 64, 64, 64, 64, 64, 64, 64, 64, -64, -64, 64, 64, -64, 64, -64, -64, -64, -64, -64, -64, 64, 64, -64, 64, -64, -64, 64, -64, 64, -64, -64, -64, -64, -64, -64, 64, 64, 64, 64, 64, 64, -64, 64, 64, 64, 64, 64, 64, -64, -64, -64, -64, 64, 64, 64, -64, -64, 64, 64, 64, -64, 64, 64, 64, 64, 64, 64, 64, -64, 64, 64, 64, 64, -64, -64, 64, 64, 64, 64, 64, 64, 64, 64, -64, 64, 64, 64, -64, -64, 64, 64, -64, -64, 64, 64, -64, 64, -64, 64, 64, 64, -64, -64, 64, -64, 64, 64, 64, -64, 64, 64, -64, -64, 64, 64, 64, -64, 64, 64, 64, 64, 64, 64, 64, -64, 64, 64, -64, -64, 64, 64, 64, -64, -64, -64, -64, -64, -64, -64, 64, -64, 64, 64, -64, -64, 64, -64, -64, -64, 64, 64, 64, 64, 64, 64, 64, -64, 64, 64, 64, 64, 64, -64, -64, 64, 64, -64, 64, -64, -64, -64, -64, 64, -64, -64, -64, -64, 64, -64, -64, -64, 64, -64, 64, 64, 64, -64, -64, -64, -64, -64, -64, -64, -64, 64, -64, -64, 64, 64, 64, -64, 64, -64, 64, -64, 64, -64, 64, 64, -64, -64, 64, -64, -64, -64, -64, 64, -64, 64, -64, -64, 64, -64, -64, -64, -64, -64, -64, -64, -64, 64, -64, -64, 64, -64, -64, -64, -64, 64, 64, -64, 64, -64, -64, -64, 64, 64, -64, 64, 64, -64, -64, -64, -64, -64, -64, -64, 64, -64, 64, -64, -64, -64, -64, -64, -64, -64, -64, -64, 64, -64, -64, 64, 64, 64, 64, 64, -64, -64, 64, 64, 64, 64, 64, 64, 64, -64, 64, 64, 64, 64, -64, -64, 64, -64, -64, -64, 64, -64, 64, 64, -64, 64, 64, 64, 64, 64, 64, 64, 64, 64, 64, 64, 64, 64, 64, -64, 64, 64, 64, 64, -64, -64, 64, -64, 64, -64, -64, -64, -64, -64, -64, 64, -64, 64, 64, 64, -64, -64, -64, -64, -64, -64, 64, -64, -64, -64, -64, -64, -64, -64, -64, 64, -64, 64, -64, 64, 64, 64, -64, -64, 64, 64, 64, -64, 64, -64, -64, -64, -64, -64, -64, 64, -64, 64, -64, -64, -64, 64, -64, -64, -64, -64, -64, 64, -64, -64, -64, 64, -64, 64, 64, 64, -64, 64, -64, -64, -64, -64, -64, -64, -64, -64, 64, -64, -64, 64, -64, -64, 64, 64, 64, -64, -64, 64, 64, 64, -64, 64, -64, 64, -64, -64, -64, -64, -64, 64, 64, -64, 64, -64, 64, -64, 64, 64, 64, 64, -64, -64, -64, 64, 64, -64, 64, 64, 64, 64, -64, 64, -64, -64, -64, 64, 64, 64, 64, 64, 64, 64, 64, 64, 64, 64, -64, -64, 64, -64, 64, 64, -64, 64, 64, 64, -64, 64, -64, 64, 64, 64, -64, 64, 64, 64, -64, -64, 64, 64, 64, 64, -64, 64, 64, 64, 64, 64, 64, 64, 64, -64, -64, 64, 64, 64, -64, -64, -64, -64, 64, 64, -64, -64, -64, -64, 64, -64, -64, 64, -64, -64, -64, -64, -64, 64, 64, 64, -64, -64, -64, -64, 64, -64, -64, 64, -64, -64, 64, -64, -64, -64, -64, -64, 64, -64, 64, -64, -64, -64, -64, -64, -64, -64, 64, 64, -64, 64, -64, 64, 64, -64, -64, -64, -64, -64, -64, -64, -64, 64, -64, 64, 64, 64, -64, -64, -64, -64, -64, -64, -64, -64, 64, -64, -64, 64, 64, -64, 64, -64, -64, 64, -64, -64, -64, -64, -64, -64, -64, -64, -64, 64, -64, -64, -64, 64, 64, -64, 64, 64, 64, -64, 64, -64, -64, 64, 64, 64, -64, -64, -64, -64, -64, -64, -64, -64, -64, -64, -64, -64, 64, 64, 64, 64, -64, 64, 64, -64, 64, -64, 64, 64, 64, 64, 64, 64, 64, 64, -64, -64, -64, -64, -64, -64, -64, -64, -64, -64, -64, 64, 64, 64, 64, 64, 64, 64, -64, -64, -64, 64, 64, 64, 64, 64, 64, 64, 64, -64, -64, -64, -64, -64, -64, -64, -64, -64, -64, 64, 64, 64, 64, 64, 64, 64, 64, 64, 64, -64, -64, 64, 64, 64, 64, 64, 64, 64, 64, -64, -64, -64, 64, 64, -64, 64, 64, -64, 64, 64, 64, 64, 64, 64, 64, -64, -64, 64, -64, -64, 64, 64, 64, 64, 64, 64, 64, 64, -64, -64, 64, -64, -64, -64, -64, 64, 64, 64, 64, 64, 64, 64, 64, -64, 64, 64, 64, -64, -64, 64, 64, 64, -64, 64, 64, 64, 64, -64, -64, -64, -64, -64, -64, 64, 64, 64, 64, 64, 64, 64, -64, -64, -64, -64, -64, 64, -64, -64, -64, -64, -64, -64, -64, -64, -64, 64, 64, -64, -64, -64, 64, 64, 64, 64, 64, 64, 64, 64, 64, 64, 64, -64, -64, 64, -64, -64, -64, -64, -64, -64, -64, -64, -64, -64, -64, 64, -64, 64, 64, 64, -64, 64, 64, 64, 64, 64, 64, -64, -64, 64, 64, -64, 64, -64, -64, -64, -64, -64, -64, -64, -64, 64, -64, -64, -64, -64, 64, 64, 64, -64, 64, -64, 64, 64, 64, -64, -64, 64, 64, 64, -64, 64, 64, -64, -64, -64, -64, -64, 64, -64, -64, -64, -64, -64, 64, 64, 64, 64, 64, 64, 64, 64, -64, -64, -64, -64, -64, -64, 64, 64, 64, 64, -64, 64, 64, 64, 64, 64, 64, 64, 64, 64, 64, 64, -64, 64, 64, 64, 64, -64, -64, -64, -64, 64, 64, -64, 64, -64, 64, 64, 64, 64, 64, -64, 64, 64, 64, 64, 64, 64, 64, 64, 64, 64, 64, 64, -64, -64, -64, -64, 64, -64, 64, -64, -64, -64, -64, -64, 64, 64, -64, 64, 64, -64, 64, 64, 64, -64, -64, 64, 64, 64, 64, 64, 64, 64, 64, 64, 64, -64, 64, -64, -64, 64, -64, 64, -64, -64, -64, -64, -64, -64, 64, 64, -64, -64, -64, 64, 64, -64, -64, -64, 64, -64, -64, -64, 64, -64, -64, 64, 64, -64, 64, 64, 64, 64, 64, 64, -64, -64, -64, 64, 64, -64, -64, -64, -64, -64, -64, -64, 64, -64, -64, -64, -64, -64, -64, 64, -64, -64, 64, 64, 64, 64, -64, -64, 64, -64, 64, 64, 64, 64, 64, 64, 64, -64, -64, 64, 64, -64, -64, -64, -64, -64, 64, -64, -64, -64, -64, 64, -64, 64, 64, 64, 64, 64, 64, 64, -64, 64, -64, 64, 64, -64, 64, -64, -64, 64, 64, -64, 64, 64, -64, 64, 64, 64, 64, 64, -64, -64, 64, -64, 64, 64, 64, 64, 64, 64, 64, 64, 64, -64, -64, -64, -64, -64, -64, 64, -64, 64, -64, 64, 64, 64, 64, 64, -64, -64, 64, -64, -64, -64, 64, 64, -64, -64, 64, 64, 64, 64, -64, 64, 64, 64, -64, 64, 64, 64, -64, -64, -64, 64, 64, 64, -64, -64, 64, 64, 64, 64, 64, 64, 64, 64, 64, 64, 64, -64, -64, 64, -64, -64, 64, 64, -64, 64, 64, 64, -64, -64, 64, 64, 64, 64, 64, 64, 64, 64, 64, -64, -64, -64, -64, 64, 64, 64, -64, -64, -64, -64, 64, 64, 64, 64, -64, -64, -64, -64, 64, 64, 64, 64, -64, 64, 64, 64, -64, -64, -64, -64, -64, 64, -64, -64, 64, -64, -64, -64, 64, -64, 64, -64, 64, -64, -64, -64, 64, -64, 64, -64, -64, 64, 64, 64, 64, -64, -64, 64, 64, 64, 64, -64, -64, -64, -64, -64, 64, -64, 64, -64, 64, -64, 64, 64, -64, -64, -64, -64, 64, -64, 64, -64, -64, -64, -64, -64, 64, 64, 64, 64, 64, -64, 64, -64, -64, 64, 64, -64, -64, -64, -64, 64, 64, 64, 64, 64, 64, 64, -64, -64, -64, -64, 64, -64, 64, 64, 64, 64, -64, 64, 64, -64, -64, 64, -64, -64, 64, -64, 64, 64, -64, 64, 64, -64, 64, 64, -64, -64, 64, -64, -64, -64, 64, 64, 64, -64, -64, 64, 64, 64, 64, 64, -64, 64, -64, -64, 64, 64, 64, 64, 64, 64, -64, -64, -64, -64, 64, 64, -64, -64, -64, 64, 64, 64, 64, 64, 64, 64, 64, 64, -64, -64, -64, -64, 64, 64, 64, 64, 64, 64, 64, -64, -64, -64, -64, -64, 64, -64, -64, 64, 64, 64, 64, 64, 64, 64, 64, 64, -64, 64, -64, 64, 64, 64, -64, 64, 64, 64, 64, 64, -64, -64, -64, -64, -64, 64, 64, 64, 64, 64, 64, -64, -64, 64, 64, -64, -64, 64, -64, -64, -64, -64, -64, 64, 64, 64, 64, 64, 64, 64, 64, -64, 64, 64, 64, 64, 64, 64, 64, 64, 64, 64, 64, 64, 64, -64, -64, -64, -64, -64, 64, 64, 64, 64, 64, 64, 64, -64, -64, 64, 64, 64, 64, 64, 64, 64, 64, 64, 64, 64, -64, -64, 64, 64, 64, 64, -64, -64, -64, 64, -64, 64, 64, 64, -64, 64, 64, 64, 64, 64, 64, 64, 64, 64, 64, 64, 64, 64, 64, -64, 64, -64, -64, -64, -64, -64, -64, -64, 64, 64, 64, -64, -64, 64, 64, 64, 64, 64, 64, 64, 64, 64, 64, 64, 64, 64, -64, 64, 64, 64, -64, 64, 64, -64, 64, 64, 64, 64, 64, -64, -64, 64, 64, 64, -64, -64, 64, 64, -64, -64, -64, -64, 64, 64, 64, 64, -64, 64, 64, 64, 64, -64, 64, 64, 64, 64, 64, -64, -64, 64, 64, 64, 64, -64, 64, -64, 64, -64, -64, 64, -64, 64, -64, -64, -64, -64, 64, 64, -64, -64, 64, 64, 64, 64, 64, -64, 64, 64, 64, 64, -64, -64, -64, 64, 64, -64, 64, -64, -64, 64, -64, 64, 64, -64, -64, -64, -64, -64, 64, 64, 64, 64, 64, 64, 64, 64, 64, -64, -64, -64, -64, 64, 64, -64, 64, -64, 64, 64, -64, -64, -64, 64, -64, 64, -64, -64, 64, -64, 64, 64, 64, -64, 64, 64, -64, 64, -64, -64, 64, 64, 64, 64, -64, -64, 64, 64, -64, 64, 64, -64, 64, 64, 64, 64, -64, 64, -64, 64, -64, -64, 64, 64, 64, 64, 64, -64, -64, -64, 64, 64, 64, -64, -64, 64, -64, 64, -64, -64, -64, -64, -64, -64, 64, 64, -64, 64, 64, 64, -64, 64, -64, 64, 64, 64, -64, 64, 64, -64, -64, -64, 64, 64, 64, -64, -64, -64, -64, -64, 64, 64, -64, -64, 64, -64, 64, 64, 64, 64, 64, 64, -64, -64, -64, -64, -64, -64, -64, -64, 64, 64, 64, 64, -64, 64, -64, -64, 64, -64, 64, 64, 64, -64, 64, 64, 64, -64, -64, 64, 64, -64, 64, -64, -64, -64, 64, -64, 64, 64, -64, 64, 64, 64, -64, 64, -64, 64, 64, -64, 64, 64, 64, -64, -64, 64, -64, 64, -64, 64, 64, -64, 64, 64, 64, -64, 64, 64, 64, 64, 64, 64, 64, 64, -64, -64, -64, -64, -64, 64, -64, 64, -64, -64, -64, -64, 64, 64, 64, 64, -64, -64, -64, -64, 64, 64, -64, -64, -64, -64, -64, 64, -64, 64, -64, -64, -64, -64, -64, -64, -64, -64, -64, -64, -64, -64, -64, -64, 64, -64, -64, -64, -64, 64, 64, 64, -64, -64, -64, 64, 64, 64, 64, 64, -64, 64, -64, 64, 64, -64, 64, -64, 64, 64, -64, 64, 64, -64, -64, 64, 64, 64, -64, -64, -64, 64, 64, 64, 64, 64, 64, 64, -64, -64, 64, 64, 64, 64, -64, -64, -64, -64, -64, 64, 64, -64, -64, 64, 64, 64, -64, -64, 64, 64, 64, 64, 64, 64, 64, -64, -64, -64, -64, -64, -64, 64, -64, 64, -64, 64, -64, -64, -64, -64, -64, 64, 64, 64, 64, -64, 64, -64, 64, -64, -64, -64, 64, -64, -64, 64, -64, -64, 64, 64, -64, -64, -64, 64, -64, -64, -64, -64, -64, -64, 64, 64, 64, 64, -64, 64, -64, 64, -64, -64, 64, 64, -64, -64, -64, -64, -64, 64, -64, 64, -64, -64, -64, -64, 64, -64, -64, -64, 64, 64, 64, -64, -64, -64, -64, -64, -64, 64, -64, -64, -64, -64, -64, 64, -64, -64, -64, -64, -64, -64, -64, -64, -64, -64, -64, 64, 64, 64, 64, -64, 64, -64, -64, -64, -64, -64, 64, -64, -64, -64, 64, 64, -64, -64, -64, -64, -64, -64, -64, -64, 64, -64, -64, 64, -64, 64, 64, 64, 64, 64, 64, -64, -64, -64, -64, -64, -64, 64, 64, -64, -64, -64, -64, 64, -64, 64, -64, -64, -64, -64, -64, 64, -64, 64, -64, -64, -64, -64, -64, 64, 64, 64, 64, -64, -64, -64, 64, 64, 64, -64, 64, 64, 64, 64, -64, -64, -64, -64, -64, 64, -64, -64, -64, 64, 64, -64, 64, 64, 64, 64, 64, -64, 64, -64, -64, 64, -64, -64, 64, -64, -64, 64, 64, -64, -64, 64, -64, -64, 64, -64, -64, -64, -64, 64, 64, 64, -64, 64, 64, 64, 64, -64, 64, -64, -64, -64, -64, -64, -64, -64, -64, -64, -64, -64, -64, -64, -64, -64, -64, 64, -64, -64, -64, -64, -64, 64, -64, -64, -64, -64, 64, -64, 64, -64, 64, -64, -64, -64, -64, 64, -64, 64, 64, -64, 64, -64, -64, 64, 64, 64, -64, -64, -64, -64, -64, -64, -64, -64, -64, -64, -64, 64, -64, -64, -64, -64, -64, -64, -64, -64, -64, 64, -64, -64, -64, 64, 64, 64, -64, 64, -64, -64, -64, -64, -64, 64, -64, -64, -64, -64, -64, -64, -64, 64, 64, -64, -64, -64, 64, 64, -64, -64, 64, 64, 64, 64, -64, 64, -64, 64, 64, 64, -64, -64, -64, -64, -64, -64, -64, 64, 64, -64, 64, -64, -64, 64, 64, 64, 64, 64, -64, -64, 64, 64, -64, -64, -64, -64, 64, -64, -64, 64, -64, -64, -64, -64, -64, -64, -64, -64, -64, -64, -64, 64, 64, 64, 64, -64, -64, 64, -64, 64, -64, -64, 64, 64, -64, -64, -64, -64, -64, 64, -64, 64, -64, -64, 64, 64, -64, 64, -64, -64, -64, -64, 64, -64, -64, 64, -64, -64, -64, -64, -64, -64, -64, -64, -64, 64, 64, -64, 64, -64, 64, 64, 64, -64, 64, 64, 64, -64, -64, -64, 64, -64, -64, 64, -64, 64, 64, -64, -64, -64, -64, -64, -64, -64, 64, -64, -64, -64, -64, 64, 64, 64, -64, -64, 64, -64, -64, 64, -64, -64, -64, -64, -64, 64, -64, -64, -64, -64, -64, -64, -64, 64, -64, -64, -64, -64, -64, -64, -64, -64, 64, -64, -64, -64, -64, -64, -64, 64, -64, -64, 64, -64, 64, -64, -64, -64, -64, 64, -64, -64, -64, -64, -64, -64, -64, -64, -64, 64, -64, -64, 64, 64, -64, -64, 64, -64, 64, -64, 64, 64, 64, -64, -64, -64, -64, 64, 64, 64, 64, -64, 64, 64, 64, -64, -64, 64, 64, 64, 64, -64, 64, 64, 64, -64, 64, 64, -64, -64, 64, 64, -64, -64, 64, 64, -64, -64, -64, 64, 64, -64, -64, -64, -64, 64, -64, 64, 64, 64, 64, 64, 64, -64, 64, -64, -64, -64, -64, -64, -64, 64, -64, -64, 64, -64, 64, 64, 64, -64, 64, -64, -64, -64, 64, -64, 64, -64, -64, 64, -64, -64, -64, 64, 64, 64, 64, -64, 64, 64, -64, -64, -64, -64, 64, -64, -64, 64, 64, -64, -64, -64, -64, -64, -64, -64, 64, 64, 64, -64, 64, -64, 64, -64, -64, -64, -64, 64, 64, 64, 64, 64, -64, 64, -64, 64, -64, 64, 64, 64, -64, -64, 64, -64, 64, -64, 64, 64, -64, 64, -64, 64, -64, 64, -64, -64, -64, 64, 64, 64, 64, 64, 64, 64, 64, -64, -64, 64, -64, 64, -64, -64, -64, 64, 64, 64, -64, -64, -64, -64, 64, -64, 64, -64, -64, 64, -64, 64, 64, 64, 64, 64, 64, 64, -64, 64, -64, 64, 64, 64, 64, 64, 64, 64, -64, -64, -64, 64, 64, -64, -64, -64, -64, -64, -64, 64, -64, 64, 64, 64, 64, 64, 64, 64, 64, -64, -64, -64, 64, 64, -64, 64, 64, 64, -64, -64, 64, 64, -64, -64, -64, -64, -64, -64, 64, 64, 64, 64, 64, 64, -64, -64, 64, -64, -64, -64, 64, 64, -64, 64, 64, -64, 64, -64, -64, -64, -64, -64, -64, -64, -64, 64, 64, 64, 64, 64, 64, 64, 64, 64, -64, -64, 64, -64, -64, -64, -64, 64, -64, -64, 64, 64, 64, -64, -64, -64, -64, -64, -64, 64, 64, 64, 64, 64, 64, 64, 64, -64, 64, 64, -64, -64, -64, -64, 64, 64, -64, -64, -64, -64, -64, -64, -64, -64, -64, -64, 64, -64, 64, -64, -64, 64, 64, -64, -64, 64, 64, -64, -64, -64, -64, -64, 64, 64, -64, 64, 64, 64, 64, -64, -64, 64, -64, 64, 64, 64, 64, 64, 64, 64, 64, -64, -64, -64, 64, 64, -64, -64, -64, 64, -64, 64, 64, 64, -64, 64, 64, 64, 64, 64, 64, 64, -64, 64, 64, 64, 64, -64, -64, -64, -64, -64, -64, -64, -64, -64, -64, 64, 64, 64, 64, -64, -64, -64, 64, 64, 64, 64, 64, 64, 64, 64, 64, 64, 64, -64, -64, -64, -64, 64, 64, -64, -64, -64, 64, 64, 64, 64, 64, 64, 64, -64, 64, 64, 64, 64, 64, 64, 64, 64, 64, -64, -64, -64, -64, -64, -64, 64, -64, -64, -64, 64, 64, 64, 64, 64, 64, 64, 64, 64, 64, -64, 64, 64, 64, -64, -64, -64, -64, -64, -64, -64, -64, -64, -64, -64, -64, -64, 64, -64, 64, 64, 64, 64, 64, -64, 64, -64, -64, -64, -64, 64, -64, -64, -64, -64, -64, -64, -64, -64, -64, -64, -64, -64, -64, -64, -64, -64, -64, 64, 64, 64, 64, -64, 64, -64, 64, 64, -64, -64, 64, 64, -64, 64, -64, -64, -64, -64, -64, -64, -64, 64, -64, -64, -64, -64, 64, -64, 64, 64, -64, -64, 64, -64, -64, 64, -64, 64, 64, 64, 64, 64, 64, 64, -64, -64, -64, -64, -64, 64, 64, -64, -64, -64, 64, -64, 64, 64, -64, -64, 64, -64, -64, -64, -64, 64, 64, 64, 64, 64, 64, 64, 64, 64, 64, -64, -64, -64, -64, -64, -64, -64, -64, -64, -64, 64, -64, 64, 64, -64, -64, -64, -64, -64, -64, -64, 64, 64, 64, 64, 64, 64, 64, 64, -64, 64, -64, -64, -64, -64, -64, 64, 64, 64, -64, 64, 64, -64, -64, -64, -64, -64, -64, -64, 64, 64, 64, 64, 64, 64, 64, -64, -64, 64, 64, -64, 64, -64, 64, 64, 64, 64, 64, -64, -64, 64, -64, -64, -64, -64, -64, -64, -64, 64, 64, 64, 64, 64, -64, -64, -64, 64, -64, -64, 64, 64, 64, 64, 64, -64, -64, -64, -64, -64, 64, 64, -64, -64, -64, -64, -64, 64, -64, 64, 64, -64, -64, -64, 64, -64, -64, -64, -64, 64, 64, 64, 64, 64, -64, -64, 64, -64, 64, 64, -64, -64, -64, -64, -64, -64, 64, -64, -64, -64, 64, 64, -64, 64, -64, -64, -64, 64, 64, 64, 64, 64, -64, -64, 64, 64, 64, -64, 64, -64, -64, -64, -64, -64, -64, 64, 64, 64, 64, 64, -64, -64, 64, -64, 64, -64, 64, 64, -64, -64, -64, -64, -64, 64, -64, -64, -64, -64, -64, -64, -64, -64, -64, -64, 64, -64, 64, 64, 64, 64, 64, 64, 64, 64, 64, 64, 64, -64, -64, 64, -64, -64, -64, 64, -64, -64, -64, -64, -64, -64, -64, 64, 64, -64, -64, -64, 64, 64, 64, -64, 64, 64, 64, 64, 64, -64, -64, -64, -64, -64, 64, 64, -64, -64, -64, -64, 64, 64, 64, 64, 64, 64, 64, -64, -64, 64, 64, -64, -64, 64, 64, -64, 64, 64, 64, 64, -64, -64, -64, -64, 64, 64, 64, -64, -64, -64, -64, 64, 64, 64, 64, 64, 64, -64, 64, -64, 64, 64, 64, 64, -64, 64, -64, 64, 64, -64, 64, -64, 64, 64, -64, -64, -64, -64, -64, -64, -64, -64, -64, 64, -64, 64, 64, -64, -64, 64, 64, -64, 64, 64, -64, -64, 64, -64, 64, -64, -64, 64, 64, 64, -64, -64, 64, 64, 64, 64, -64, 64, -64, 64, 64, 64, -64, 64, 64, -64, -64, 64, -64, -64, 64, -64, 64, 64, 64, 64, 64, -64, 64, 64, 64, 64, 64, 64, 64, 64, 64, 64, 64, 64, -64, -64, 64, 64, 64, -64, 64, 64, -64, -64, 64, -64, 64, 64, 64, 64, 64, 64, 64, -64, -64, 64, 64, 64, -64, 64, 64, 64, 64, 64, 64, 64, 64, -64, 64, 64, -64, 64, 64, 64, 64, 64, -64, 64, 64, 64, -64, 64, -64, -64, -64, 64, 64, 64, -64, -64, -64, -64, 64, -64, 64, 64, -64, -64, -64, 64, -64, -64, 64, -64, -64, 64, -64, -64, -64, 64, 64, -64, -64, -64, 64, 64, -64, -64, -64, -64, -64, -64, 64, 64, 64, 64, -64, 64, -64, 64, 64, -64, -64, -64, -64, 64, 64, 64, 64, -64, -64, 64, 64, 64, 64, -64, -64, -64, -64, -64, 64, 64, -64, -64, 64, 64, 64, -64, -64, -64, -64, -64, -64, -64, 64, -64, -64, -64, 64, 64, 64, 64, 64, 64, -64, -64, -64, -64, 64, 64, 64, -64, 64, -64, 64, -64, -64, -64, -64, -64, 64, 64, -64, -64, -64, 64, 64, 64, 64, 64, 64, -64, -64, -64, -64, 64, 64, 64, 64, 64, 64, 64, -64, -64, -64, -64, -64, 64, 64, -64, -64, 64, -64, -64, 64, 64, 64, 64, -64, -64, -64, -64, -64, 64, 64, 64, -64, -64, -64, -64, -64, -64, -64, -64, -64, 64, 64, 64, 64, -64, -64, -64, 64, 64, 64, -64, 64, -64, -64, 64, 64, 64, 64, 64, 64, 64, 64, 64, -64, -64, 64, 64, 64, 64, 64, 64, 64, -64, 64, 64, 64, 64, 64, 64, -64, 64, 64, 64, 64, 64, 64, 64, 64, 64, -64, 64, 64, -64, 64, 64, 64, 64, 64, 64, 64, 64, 64, 64, 64, 64, 64, 64, -64, -64, 64, 64, 64, 64, 64, 64, 64, -64, 64, 64, -64, -64, 64, 64, 64, 64, -64, 64, 64, 64, 64, 64, 64, 64, 64, -64, 64, -64, 64, 64, 64, -64, -64, 64, 64, -64, 64, 64, -64, 64, 64, 64, 64, -64, -64, 64, 64, -64, 64, 64, 64, 64, 64, 64, -64, -64, -64, 64, 64, -64, -64, -64, -64, -64, -64, -64, -64, -64, -64, -64, -64, 64, -64, -64, -64, 64, 64, 64, 64, 64, 64, -64, -64, -64, -64, -64, -64, -64, -64, -64, -64, -64, 64, 64, -64, -64, -64, -64, -64, -64, -64, 64, -64, 64, 64, 64, 64, 64, -64, -64, -64, -64, 64, -64, -64, -64, -64, -64, 64, -64, 64, 64, 64, 64, -64, -64, -64, -64, -64, 64, 64, 64, 64, 64, 64, 64, -64, -64, -64, 64, -64, -64, -64, -64, -64, 64, -64, -64, 64, 64, -64, 64, -64, -64, -64, -64, -64, 64, 64, 64, 64, 64, 64, 64, 64, 64, -64, -64, 64, -64, -64, 64, 64, 64, -64, -64, -64, -64, 64, -64, -64, -64, -64, -64, 64, 64, 64, -64, 64, 64, 64, -64, -64, -64, -64, -64, 64, -64, -64, -64, -64, 64, -64, 64, -64, -64, 64, -64, -64, 64, -64, -64, -64, 64, -64, -64, -64, -64, 64, -64, -64, -64, -64, -64, -64, -64, -64, 64, -64, -64, -64, 64, 64, 64, 64, -64, -64, -64, 64, 64, -64, -64, -64, -64, 64, 64, 64, 64, 64, -64, -64, -64, -64, -64, -64, 64, -64, -64, -64, 64, 64, -64, -64, 64, -64, 64, 64, -64, -64, -64, -64, 64, -64, 64, 64, 64, -64, -64, -64, -64, 64, -64, -64, -64, -64, -64, 64, 64, -64, 64, -64, -64, -64, -64, -64, -64, -64, -64, 64, -64, 64, 64, 64, 64, 64, 64, 64, 64, 64, 64, 64, 64, -64, -64, -64, -64, -64, -64, -64, -64, -64, -64, -64, -64, 64, 64, 64, 64, 64, 64, 64, 64, 64, 64, 64, 64, 64, 64, -64, -64, -64, -64, -64, -64, -64, 64, -64, -64, 64, -64, 64, 64, 64, 64, 64, 64, 64, 64, 64, 64, 64, 64, 64, 64, 64, 64, -64, -64, -64, -64, -64, 64, 64, 64, -64, 64, -64, 64, 64, 64, 64, -64, 64, 64, 64, 64, 64, 64, 64, 64, 64, 64, 64, 64, -64, 64, 64, -64, 64, 64, -64, -64, -64, -64, -64, -64, 64, 64, -64, -64, 64, 64, 64, 64, 64, 64, 64, -64, 64, 64, -64, -64, 64, 64, 64, 64, -64, -64, 64, -64, 64, 64, -64, -64, -64, -64, -64, -64, 64, 64, 64, -64, -64, 64, 64, 64, 64, -64, -64, -64, -64, -64, 64, -64, -64, -64, 64, -64, -64, -64, 64, -64, -64, 64, -64, 64, -64, 64, 64, -64, -64, -64, 64, 64, 64, 64, 64, 64, -64, -64, -64, -64, -64, -64, 64, -64, 64, -64, -64, -64, -64, 64, 64, 64, -64, -64, -64, 64, -64, 64, 64, -64, -64, -64, -64, 64, 64, -64, 64, -64, -64, -64, 64, -64, 64, -64, 64, 64, -64, 64, 64, -64, 64, 64, 64, -64, 64, -64, -64, -64, -64, -64, -64, -64, -64, 64, -64, 64, 64, -64, 64, -64, 64, -64, -64, 64, 64, 64, 64, 64, 64, 64, 64, 64, -64, -64, -64, -64, -64, -64, 64, -64, 64, 64, -64, 64, -64, 64, 64, 64, 64, -64, -64, 64, 64, 64, 64, 64, 64, 64, 64, 64, 64, -64, -64, -64, 64, -64, -64, 64, 64, -64, -64, 64, 64, -64, -64, 64, 64, -64, 64, -64, 64, 64, 64, 64, 64, 64, 64, -64, -64, -64, 64, 64, 64, -64, -64, -64, 64, 64, -64, -64, 64, -64, -64, 64, -64, -64, -64, 64, 64, 64, 64, -64, -64, 64, 64, 64, 64, 64, -64, -64, -64, 64, -64, -64, 64, -64, -64, -64, -64, 64, 64, 64, -64, -64, -64, 64, 64, 64, 64, -64, 64, -64, -64, 64, -64, 64, 64, 64, 64, -64, 64, -64, -64, -64, -64, -64, -64, -64, 64, -64, -64, 64, 64, 64, 64, -64, 64, -64, -64, -64, 64, -64, 64, 64, 64, -64, -64, -64, -64, -64, -64, -64, -64, -64, -64, -64, 64, 64, -64, 64, 64, 64, -64, -64, 64, 64, -64, -64, -64, -64, -64, 64, -64, -64, 64, 64, 64, 64, 64, 64, -64, -64, -64, 64, -64, 64, -64, -64, 64, 64, 64, 64, 64, -64, -64, -64, -64, -64, -64, -64, -64, -64, -64, -64, -64, 64, 64, 64, 64, -64, 64, 64, 64, 64, -64, 64, 64, 64, 64, 64, 64, -64, -64, -64, -64, -64, -64, -64, -64, -64, -64, -64, -64, 64, 64, 64, -64, -64, -64, 64, -64, 64, -64, 64, 64, 64, 64, 64, 64, -64, -64, -64, -64, -64, -64, -64, -64, -64, -64, -64, -64, 64, 64, 64, 64, 64, 64, -64, -64, -64, 64, 64, 64, 64, 64, -64, -64, -64, -64, -64, -64, -64, -64, -64, -64, -64, -64, -64, -64, 64, 64, 64, 64, 64, -64, -64, -64, -64, 64, -64, -64, 64, -64, -64, -64, -64, 64, -64, -64, -64, -64, -64, -64, -64, -64, -64, -64, 64, 64, 64, 64, 64, -64, 64, 64, -64, -64, 64, 64, 64, -64, -64, 64, 64, -64, 64, 64, 64, -64, -64, -64, -64, -64, -64, -64, 64, 64, 64, 64, 64, 64, -64, -64, -64, -64, -64, 64, 64, -64, -64, -64, 64, -64, 64, 64, 64, -64, -64, -64, -64, -64, 64, 64, 64, 64, 64, -64, -64, 64, 64, -64, 64, 64, -64, 64, -64, -64, -64, 64, 64, 64, 64, 64, -64, -64, -64, -64, -64, -64, -64, 64, 64, 64, 64, 64, 64, -64, 64, 64, -64, 64, -64, 64, -64, -64, -64, 64, 64, -64, 64, -64, -64, -64, -64, -64, 64, 64, 64, 64, 64, 64, 64, 64, 64, -64, 64, -64, 64, -64, -64, -64, -64, -64, -64, 64, -64, -64, 64, 64, 64, 64, 64, -64, 64, 64, 64, 64, 64, 64, 64, 64, 64, 64, 64, 64, 64, -64, -64, 64, -64, 64, 64, -64, 64, 64, 64, -64, 64, -64, -64, 64, 64, -64, 64, 64, 64, 64, 64, 64, 64, -64, -64, -64, 64, 64, -64, -64, 64, -64, 64, 64, -64, 64, 64, 64, 64, -64, -64, -64, 64, -64, 64, -64, 64, -64, 64, 64, 64, 64, -64, -64, 64, -64, -64, 64, -64, -64, -64, -64, 64, -64, -64, 64, -64, -64, 64, 64, -64, -64, -64, -64, 64, 64, 64, -64, -64, 64, -64, 64, -64, -64, -64, -64, -64, -64, -64, -64, -64, -64, -64, -64, -64, -64, -64, -64, -64, -64, -64, -64, -64, 64, 64, 64, -64, -64, 64, 64, -64, -64, -64, -64, -64, -64, -64, -64, -64, -64, -64, -64, -64, -64, -64, -64, -64, -64, 64, 64, 64, -64, 64, -64, 64, -64, -64, -64, -64, 64, 64, 64, 64, -64, 64, 64, -64, -64, -64, -64, -64, -64, -64, 64, -64, 64, -64, -64, 64, -64, -64, 64, -64, -64, -64, 64, 64, -64, -64, -64, -64, 64, -64, 64, 64, -64, -64, 64, 64, 64, 64, 64, -64, -64, 64, -64, 64, 64, 64, -64, -64, 64, -64, -64, -64, -64, -64, 64, -64, 64, -64, 64, -64, 64, -64, 64, -64, 64, -64, 64, 64, 64, -64, -64, -64, 64, -64, 64, 64, 64, 64, -64, 64, 64, -64, 64, -64, -64, -64, -64, 64, -64, -64, -64, 64, -64, 64, 64, 64, 64, -64, -64, 64, -64, -64, -64, 64, -64, 64, 64, -64, 64, -64, 64, 64, -64, -64, 64, -64, -64, -64, 64, 64, 64, -64, 64, -64, 64, 64, -64, -64, 64, -64, 64, -64, 64, -64, -64, -64, -64, 64, -64, 64, 64, 64, 64, 64, 64, 64, 64, 64, 64, -64, 64, 64, -64, -64, -64, -64, -64, 64, 64, -64, -64, 64, -64, 64, -64, 64, -64, 64, -64, 64, 64, 64, 64, 64, 64, 64, 64, -64, 64, -64, -64, -64, 64, -64, 64, -64, -64, 64, 64, -64, 64, 64, -64, -64, 64, 64, 64, 64, 64, 64, -64, -64, 64, 64, 64, 64, -64, -64, -64, 64, 64, -64, 64, -64, -64, 64, -64, 64, 64, 64, -64, 64, 64, 64, 64, 64, 64, -64, 64, 64, 64, -64, 64, -64, -64, -64, -64, -64, 64, -64, 64, -64, -64, -64, 64, -64, -64, -64, 64, -64, 64, 64, 64, 64, 64, 64, 64, 64, 64, 64, -64, 64, -64, 64, -64, 64, -64, 64, -64, -64, -64, -64, -64, 64, -64, 64, 64, 64, 64, 64, 64, 64, 64, 64, 64, 64, 64, -64, 64, -64, -64, 64, -64, 64, 64, 64, -64, -64, -64, -64, -64, -64, 64, 64, 64, -64, 64, 64, 64, 64, 64, 64, 64, 64, 64, 64, -64, -64, -64, -64, 64, 64, 64, 64, 64, -64, -64, -64, -64, -64, -64, 64, 64, -64, 64, 64, 64, 64, 64, 64, 64, 64, -64, 64, -64, 64, 64, 64, 64, 64, 64, 64, 64, 64, 64, 64, 64, 64, 64, -64, -64, 64, -64, 64, 64, 64, 64, 64, 64, 64, 64, -64, 64, -64, 64, 64, 64, 64, 64, 64, 64, 64, 64, 64, -64, 64, -64, -64, -64, 64, 64, 64, 64, 64, 64, 64, -64, 64, -64, -64, -64, -64, -64, -64, 64, 64, 64, 64, 64, 64, 64, -64, 64, 64, 64, 64, 64, -64, 64, 64, 64, 64, 64, 64, -64, -64, -64, -64, -64, 64, -64, 64, 64, -64, 64, 64, 64, 64, 64, 64, -64, -64, -64, 64, 64, 64, 64, 64, 64, 64, 64, 64, 64, -64, -64, -64, 64, 64, 64, 64, 64, -64, 64, 64, 64, 64, 64, 64, 64, -64, -64, 64, 64, 64, 64, 64, 64, 64, 64, 64, 64, -64, 64, 64, 64, 64, 64, 64, -64, -64, 64, 64, 64, 64, 64, 64, 64, 64, -64, -64, -64, 64, -64, 64, 64, 64, 64, 64, 64, 64, 64, 64, -64, 64, 64, 64, -64, -64, 64, 64, 64, 64, -64, 64, 64, -64, -64, -64, -64, -64, -64, 64, 64, 64, 64, 64, 64, 64, 64, 64, 64, -64, -64, -64, -64, -64, -64, 64, 64, 64, 64, 64, -64, 64, 64, -64, -64, -64, -64, -64, -64, 64, 64, 64, 64, 64, 64, 64, 64, -64, -64, -64, -64, -64, -64, 64, 64, 64, 64, 64, -64, 64, -64, -64, -64, -64, -64, -64, -64, 64, -64, 64, 64, 64, 64, 64, 64, -64, -64, -64, -64, 64, 64, 64, 64, 64, 64, 64, 64, 64, 64, -64, 64, 64, -64, -64, -64, -64, -64, 64, -64, -64, -64, -64, -64, 64, -64, -64, -64, 64, 64, 64, 64, 64, 64, 64, 64, -64, -64, -64, 64, -64, -64, -64, 64, -64, -64, 64, -64, -64, -64, -64, -64, -64, -64, 64, 64, 64, 64, 64, 64, 64, 64, 64, -64, -64, -64, 64, -64, 64, 64, 64, 64, 64, -64, -64, -64, -64, -64, 64, -64, 64, 64, 64, 64, 64, 64, 64, 64, 64, 64, 64, -64, 64, -64, -64, -64, -64, -64, -64, 64, -64, -64, 64, 64, -64, 64, 64, 64, 64, 64, 64, 64, 64, 64, 64, 64, 64, 64, 64, 64, -64, 64, -64, -64, -64, -64, -64, -64, -64, -64, -64, -64, 64, 64, 64, 64, 64, 64, 64, 64, 64, -64, 64, 64, 64, -64, 64, 64, 64, 64, 64, 64, -64, -64, -64, -64, 64, -64, -64, -64, -64, 64, 64, 64, 64, 64, 64, 64, 64, -64, -64, 64, -64, 64, -64, -64, -64, -64, -64, -64, -64, 64, 64, 64, 64, 64, -64, 64, 64, 64, 64, 64, 64, 64, 64, -64, 64, -64, -64, -64, 64, 64, 64, -64, -64, -64, -64, -64, -64, -64, -64, -64, -64, -64, 64, -64, 64, 64, 64, -64, 64, -64, 64, -64, -64, 64, 64, 64, -64, 64, 64, 64, -64, 64, -64, 64, -64, -64, -64, 64, 64, 64, 64, -64, -64, -64, -64, 64, -64, -64, -64, 64, 64, 64, -64, -64, -64, -64, 64, -64, 64, 64, -64, 64, 64, -64, -64, -64, -64, -64, -64, -64, -64, 64, 64, -64, 64, -64, 64, 64, 64, -64, 64, 64, 64, -64, -64, 64, -64, -64, 64, 64, 64, 64, 64, 64, 64, 64, 64, 64, 64, 64, -64, 64, 64, 64, 64, -64, -64, -64, 64, 64, -64, 64, 64, -64, -64, -64, -64, 64, 64, 64, 64, 64, -64, -64, -64, -64, -64, 64, -64, 64, 64, 64, 64, -64, -64, -64, -64, 64, 64, -64, 64, -64, 64, -64, 64, -64, 64, -64, -64, 64, -64, 64, -64, 64, 64, 64, 64, 64, 64, -64, 64, -64, -64, 64, -64, -64, 64, 64, 64, -64, -64, 64, 64, -64, 64, 64, 64, 64, 64, 64, 64, 64, 64, 64, 64, 64, 64, 64, 64, 64, -64, -64, -64, -64, 64, 64, 64, 64, 64, 64, -64, 64, -64, 64, 64, 64, 64, -64, 64, 64, 64, 64, 64, -64, -64, 64, 64, 64, -64, -64, -64, -64, 64, -64, 64, 64, 64, 64, 64, 64, 64, 64, 64, 64, 64, 64, 64, 64, 64, 64, -64, 64, 64, -64, 64, -64, -64, -64, -64, -64, -64, -64, -64, 64, 64, 64, 64, 64, -64, 64, -64, -64, -64, -64, -64, 64, -64, -64, -64, -64, -64, -64, 64, -64, -64, -64, 64, -64, -64, -64, -64, 64, 64, -64, 64, 64, 64, 64, -64, 64, 64, 64, 64, -64, -64, -64, -64, -64, -64, 64, -64, -64, -64, -64, 64, -64, -64, -64, -64, -64, 64, -64, 64, -64, -64, -64, 64, 64, 64, 64, 64, -64, -64, -64, -64, -64, -64, 64, -64, 64, 64, -64, -64, -64, -64, 64, -64, -64, -64, 64, -64, -64, -64, -64, 64, 64, 64, 64, -64, 64, -64, -64, -64, -64, -64, -64, -64, -64, 64, -64, -64, -64, 64, -64, -64, -64, 64, 64, -64, -64, 64, 64, 64, 64, 64, 64, 64, -64, -64, 64, 64, 64, 64, -64, -64, 64, -64, -64, -64, 64, 64, 64, -64, -64, -64, -64, 64, 64, 64, 64, 64, 64, 64, 64, -64, 64, 64, 64, 64, 64, -64, 64, -64, 64, -64, 64, -64, 64, 64, 64, 64, -64, 64, 64, 64, 64, 64, 64, 64, -64, -64, -64, 64, 64, 64, 64, 64, -64, 64, -64, 64, 64, -64, -64, 64, 64, -64, 64, -64, 64, -64, -64, 64, -64, 64, 64, 64, 64, 64, -64, 64, 64, 64, 64, -64, 64, -64, -64, -64, 64, 64, 64, 64, 64, -64, 64, 64, 64, -64, 64, -64, 64, 64, 64, 64, 64, 64, 64, -64, -64, 64, -64, -64, 64, -64, -64, 64, -64, 64, 64, 64, 64, 64, 64, 64, -64, -64, -64, -64, 64, 64, 64, 64, 64, 64, 64, 64, -64, -64, -64, -64, -64, -64, -64, -64, 64, 64, 64, 64, 64, 64, 64, 64, -64, -64, -64, -64, -64, 64, 64, 64, 64, 64, 64, -64, 64, 64, -64, -64, -64, -64, -64, 64, 64, 64, 64, 64, 64, 64, 64, 64, -64, -64, -64, -64, 64, 64, 64, 64, 64, 64, 64, 64, 64, 64, 64, 64, 64, 64, 64, 64, 64, 64, 64, 64, 64, 64, -64, 64, 64, -64, -64, 64, 64, 64, 64, 64, 64, 64, 64, 64, 64, 64, 64, -64, -64, -64, 64, 64, 64, 64, 64, 64, 64, 64, -64, 64, 64, -64, -64, 64, -64, 64, 64, 64, -64, 64, 64, 64, 64, 64, 64, -64, -64, 64, -64, 64, 64, 64, 64, 64, 64, 64, 64, 64, -64, -64, 64, -64, -64, -64, -64, 64, -64, -64, -64, 64, 64, -64, -64, -64, -64, -64, -64, 64, 64, 64, 64, 64, 64, 64, -64, -64, 64, 64, -64, -64, 64, 64, -64, -64, -64, -64, -64, -64, -64, -64, -64, -64, 64, -64, 64, 64, 64, 64, 64, 64, 64, -64, 64, 64, -64, 64, -64, -64, -64, 64, -64, -64, -64, -64, -64, -64, -64, 64, -64, -64, -64, -64, -64, 64, 64, 64, 64, -64, 64, 64, 64, -64, -64, -64, -64, 64, -64, 64, -64, -64, 64, 64, -64, -64, -64, -64, -64, -64, -64, 64, -64, -64, 64, 64, 64, -64, -64, 64, 64, -64, 64, -64, -64, 64, -64, -64, 64, 64, -64, -64, -64, -64, -64, -64, -64, -64, -64, -64, -64, -64, 64, 64, 64, -64, 64, -64, 64, 64, -64, 64, 64, -64, 64, -64, 64, -64, -64, -64, -64, 64, -64, 64, -64, 64, -64, -64, 64, 64, -64, 64, -64, -64, -64, -64, 64, 64, 64, -64, -64, 64, -64, -64, -64, -64, -64, 64, -64, -64, -64, 64, 64, -64, 64, -64, -64, 64, 64, -64, 64, 64, 64, 64, 64, 64, -64, 64, -64, 64, 64, -64, 64, 64, 64, -64, 64, -64, -64, 64, 64, 64, 64, -64, -64, 64, -64, -64, 64, -64, -64, 64, 64, -64, 64, -64, 64, 64, 64, -64, 64, 64, -64, 64, -64, 64, 64, -64, -64, -64, -64, 64, -64, 64, 64, 64, 64, 64, 64, 64, -64, 64, 64, 64, 64, -64, 64, -64, -64, -64, 64, -64, -64, 64, -64, 64, -64, -64, -64, -64, -64, -64, 64, -64, -64, -64, 64, -64, -64, -64, -64, -64, 64, -64, 64, 64, -64, 64, 64, 64, 64, -64, -64, -64, 64, 64, -64, 64, -64, -64, -64, -64, 64, 64, -64, -64, 64, 64, 64, 64, 64, 64, -64, 64, -64, 64, -64, 64, -64, -64, -64, -64, 64, -64, -64, -64, -64, -64, 64, 64, -64, -64, -64, -64, 64, 64, -64, -64, 64, -64, -64, 64, 64, 64, -64, -64, 64, -64, 64, -64, -64, -64, -64, 64, -64, 64, 64, -64, 64, -64, 64, -64, -64, -64, 64, 64, -64, -64, 64, -64, -64, 64, -64, -64, -64, 64, -64, -64, -64, 64, -64, 64, -64, -64, -64, -64, -64, -64, -64, 64, 64, 64, -64, -64, 64, -64, -64, 64, -64, -64, -64, -64, 64, 64, 64, 64, -64, -64, -64, -64, -64, 64, -64, -64, -64, 64, -64, -64, 64, 64, -64, -64, 64, -64, -64, -64, 64, -64, 64, -64, -64, -64, -64, -64, 64, -64, -64, -64, -64, -64, -64, -64, 64, 64, -64, -64, -64, -64, -64, 64, 64, 64, -64, -64, -64, -64, 64, -64, -64, 64, -64, -64, -64, -64, -64, 64, 64, 64, 64, -64, 64, 64, -64, 64, -64, -64, -64, 64, 64, 64, -64, 64, 64, -64, -64, -64, 64, 64, 64, -64, -64, -64, -64, -64, -64, -64, 64, -64, 64, -64, -64, -64, 64, -64, 64, -64, -64, -64, -64, 64, -64, -64, 64, 64, -64, -64, -64, -64, -64, 64, -64, 64, 64, -64, -64, 64, -64, -64, -64, -64, -64, 64, -64, -64, -64, -64, 64, 64, 64, -64, 64, -64, -64, -64, 64, 64, -64, -64, 64, -64, -64, 64, 64, 64, 64, -64, 64, -64, 64, 64, 64, 64, -64, 64, -64, 64, 64, -64, 64, 64, -64, 64, 64, -64, 64, 64, -64, 64, -64, 64, -64, -64, 64, -64, -64, -64, 64, -64, -64, 64, 64, -64, -64, 64, 64, 64, 64, -64, -64, 64, -64, 64, -64, -64, 64, 64, -64, 64, -64, -64, -64, 64, 64, -64, -64, -64, 64, -64, -64, 64, -64, 64, 64, -64, 64, -64, -64, -64, -64, -64, 64, -64, -64, -64, -64, 64, -64, -64, -64, -64, 64, 64, -64, -64, -64, 64, 64, 64, 64, 64, 64, -64, -64, -64, 64, -64, -64, -64, 64, 64, -64, -64, -64, 64, 64, -64, 64, -64, -64, 64, 64, -64, 64, 64, 64, 64, 64, 64, -64, -64, -64, -64, -64, -64, -64, -64, -64, 64, -64, 64, -64, -64, -64, -64, 64, -64, 64, -64, 64, 64, -64, -64, 64, 64, -64, 64, -64, -64, 64, -64, 64, -64, -64, -64, -64, -64, -64, -64, 64, -64, 64, -64, -64, -64, -64, -64, 64, -64, -64, 64, -64, 64, 64, -64, 64, -64, -64, -64, -64, 64, -64, -64, 64, -64, 64, -64, -64, 64, 64, -64, 64, -64, -64, -64, -64, -64, -64, 64, -64, -64, 64, -64, 64, 64, 64, -64, -64, -64, -64, 64, -64, 64, -64, -64, -64, 64, -64, -64, -64, -64, -64, -64, 64, -64, 64, 64, 64, 64, 64, -64, 64, -64, -64, 64, -64, -64, -64, 64, -64, -64, 64, -64, -64, -64, 64, -64, -64, 64, -64, 64, -64, -64, 64, 64, -64, 64, 64, 64, 64, 64, -64, 64, 64, -64, 64, -64, -64, -64, 64, -64, -64, -64, 64, 64, -64, 64, 64, -64, 64, 64, 64, -64, -64, 64, 64, 64, -64, -64, -64, -64, 64, -64, 64, -64, -64, -64, 64, 64, 64, -64, 64, -64, 64, -64, 64, 64, -64, 64, -64, 64, 64, 64, 64, -64, -64, 64, -64, -64, -64, 64, 64, -64, -64, -64, 64, -64, -64, 64, -64, -64, -64, 64, -64, -64, -64, 64, 64, -64, -64, -64, 64, -64, 64, -64, -64, -64, 64, -64, -64, -64, 64, -64, -64, -64, -64, -64, 64, 64, 64, 64, -64, -64, 64, -64, -64, 64, 64, -64, 64, 64, 64, -64, 64, 64, -64, -64, 64, -64, 64, -64, 64, -64, -64, 64, 64, -64, 64, 64, 64, -64, -64, 64, 64, 64, 64, 64, 64, -64, 64, 64, 64, 64, -64, -64, -64, -64, 64, -64, 64, -64, -64, -64, 64, -64, 64, 64, -64, 64, -64, -64, 64, -64, 64, 64, 64, -64, 64, 64, -64, 64, 64, -64, 64, -64, -64, -64, 64, 64, 64, -64, -64, -64, 64, 64, 64, -64, -64, -64, 64, 64, 64, -64, -64, -64, -64, -64, -64, 64, -64, 64, -64, -64, -64, 64, 64, 64, -64, 64, 64, 64, -64, 64, -64, 64, -64, -64, 64, -64, -64, 64, -64, 64, 64, 64, 64, 64, -64, -64, 64, -64, -64, 64, 64, 64, 64, 64, 64, 64, 64, 64, 64, 64, 64, -64, -64, -64, -64, 64, 64, 64, 64, 64, 64, -64, -64, 64, -64, -64, 64, 64, -64, 64, -64, 64, 64, 64, 64, 64, 64, -64, 64, 64, -64, -64, -64, 64, -64, 64, -64, 64, 64, -64, -64, 64, 64, -64, 64, 64, -64, 64, 64, 64, 64, 64, 64, 64, -64, 64, 64, -64, 64, -64, -64, 64, 64, -64, 64, 64, 64, 64, -64, -64, 64, 64, -64, 64, 64, -64, 64, -64, -64, 64, 64, 64, 64, 64, -64, -64, 64, 64, -64, -64, -64, -64, 64, -64, 64, 64, 64, 64, 64, -64, 64, -64, 64, 64, 64, -64, 64, 64, 64, 64, -64, -64, -64, 64, -64, 64, -64, -64, 64, 64, 64, 64, -64, -64, -64, 64, 64, -64, 64, 64, 64, 64, -64, 64, -64, 64, 64, 64, 64, 64, -64, -64, -64, 64, 64, 64, 64, 64, 64, 64, 64, 64, 64, 64, 64, 64, -64, 64, -64, 64, 64, -64, -64, 64, -64, -64, 64, -64, -64, 64, 64, 64, 64, 64, 64, -64, -64, -64, 64, -64, 64, 64, 64, 64, 64, 64, -64, 64, 64, 64, -64, 64, 64, 64, -64, -64, 64, 64, -64, 64, -64, 64, -64, -64, -64, 64, 64, -64, 64, 64, -64, 64, 64, 64, -64, 64, 64, -64, 64, 64, 64, -64, 64, -64, 64, 64, 64, 64, 64, 64, 64, 64, -64, 64, -64, -64, 64, -64, 64, 64, 64, 64, -64, 64, -64, -64, -64, 64, 64, 64, 64, 64, 64, -64, 64, 64, -64, -64, -64, 64, 64, 64, 64, 64, -64, 64, 64, 64, -64, 64, 64, 64, -64, -64, 64, -64, -64, 64, 64, -64, 64, -64, -64, -64, 64, -64, 64, 64, 64, 64, -64, 64, 64, 64, 64, 64, -64, 64, 64, 64, 64, 64, -64, 64, 64, 64, 64, 64, 64, 64, 64, -64, 64, 64, 64, -64, 64, 64, 64, 64, 64, -64, -64, -64, -64, 64, -64, 64, 64, 64, 64, 64, 64, 64, 64, 64, 64, 64, -64, 64, -64, 64, -64, 64, 64, -64, 64, 64, -64, 64, -64, -64, 64, -64, -64, 64, 64, 64, -64, 64, -64, 64, 64, -64, 64, -64, -64, 64, -64, 64, 64, -64, 64, -64, 64, 64, 64, 64, 64, 64, 64, 64, -64, 64, 64, -64, 64, 64, 64, 64, 64, -64, -64, 64, 64, -64, -64, -64, -64, 64, 64, -64, -64, -64, 64, 64, -64, 64, 64, -64, -64, 64, 64, 64, -64, 64, 64, 64, 64, 64, 64, -64, -64, -64, -64, -64, -64, 64, -64, 64, -64, -64, 64, 64, -64, -64, 64, 64, -64, -64, 64, 64, -64, -64, -64, 64, 64, 64, 64, -64, -64, 64, -64, -64, 64, -64, -64, 64, -64, 64, 64, 64, 64, -64, -64, -64, 64, -64, 64, 64, -64, 64, -64, -64, 64, 64, -64, -64, -64, 64, -64, -64, 64, -64, -64, -64, 64, 64, -64, 64, 64, 64, 64, -64, 64, -64, 64, 64, -64, 64, -64, -64, -64, -64, -64, 64, 64, -64, -64, -64, 64, -64, 64, -64, -64, 64, -64, 64, -64, -64, 64, 64, 64, -64, 64, 64, -64, -64, -64, 64, 64, 64, -64, 64, 64, 64, -64, 64, 64, 64, 64, 64, 64, -64, 64, 64, -64, 64, -64, 64, 64, -64, 64, -64, -64, 64, 64, -64, -64, -64, -64, -64, -64, -64, 64, 64, 64, 64, -64, -64, -64, -64, 64, -64, -64, 64, 64, -64, 64, 64, -64, 64, 64, 64, 64, -64, -64, 64, -64, -64, 64, 64, 64, 64, -64, 64, 64, 64, -64, 64, -64, -64, -64, 64, 64, -64, 64, 64, 64, 64, 64, -64, 64, 64, 64, 64, 64, -64, 64, -64, -64, 64, -64, 64, -64, -64, 64, 64, 64, 64, -64, 64, 64, 64, 64, 64, 64, 64, -64, -64, 64, 64, 64, -64, -64, -64, -64, -64, 64, 64, 64, -64, -64, 64, -64, -64, 64, -64, -64, 64, -64, -64, 64, -64, -64, -64, -64, -64, 64, -64, 64, 64, 64, 64, -64, 64, -64, -64, 64, -64, -64, 64, -64, 64, -64, -64, -64, 64, -64, 64, -64, 64, 64, -64, 64, 64, 64, -64, 64, 64, -64, -64, 64, -64, -64, 64, 64, 64, -64, 64, -64, 64, -64, -64, 64, 64, 64, 64, -64, 64, 64, -64, 64, 64, -64, 64, 64, 64, -64, -64, -64, 64, 64, -64, 64, 64, 64, -64, -64, 64, 64, 64, 64, 64, 64, 64, 64, 64, 64, 64, 64, 64, -64, 64, -64, 64, -64, -64, 64, -64, -64, -64, 64, -64, -64, -64, 64, -64, 64, 64, 64, 64, -64, 64, 64, 64, -64, -64, 64, 64, -64, -64, 64, 64, 64, -64, -64, 64, -64, 64, 64, 64, -64, -64, 64, 64, -64, 64, 64, 64, 64, -64, 64, -64, -64, -64, -64, 64, -64, 64, -64, 64, 64, 64, -64, 64, 64, 64, -64, 64, -64, 64, 64, 64, 64, 64, 64, 64, 64, 64, -64, -64, 64, 64, -64, -64, -64, -64, -64, -64, 64, 64, 64, -64, -64, 64, 64, -64, -64, -64, -64, 64, 64, 64, 64, -64, -64, 64, -64, 64, 64, 64, 64, -64, 64, -64, -64, -64, -64, 64, 64, -64, -64, -64, 64, 64, -64, 64, 64, 64, 64, 64, 64, 64, -64, -64, -64, 64, 64, -64, 64, -64, -64, -64, -64, 64, 64, 64, 64, -64, -64, -64, 64, -64, -64, 64, 64, 64, 64, 64, 64, -64, -64, -64, -64, -64, -64, -64, -64, -64, -64, -64, 64, 64, 64, 64, 64, -64, -64, 64, 64, -64, -64, 64, 64, 64, 64, -64, -64, -64, 64, -64, -64, -64, -64, -64, 64, -64, 64, 64, 64, 64, 64, 64, 64, 64, 64, 64, 64, -64, -64, -64, -64, 64, 64, 64, 64, 64, 64, -64, 64, 64, 64, 64, 64, 64, 64, 64, 64, 64, 64, 64, 64, 64, -64, -64, -64, -64, -64, -64, 64, 64, 64, 64, 64, -64, 64, 64, 64, 64, -64, 64, 64, 64, 64, 64, 64, 64, 64, 64, 64, -64, -64, -64, -64, -64, -64, 64, 64, 64, 64, 64, -64, 64, 64, 64, 64, 64, 64, 64, 64, -64, -64, 64, 64, 64, 64, 64, -64, 64, 64, 64, -64, 64, -64, -64, -64, 64, 64, 64, 64, 64, 64, 64, 64, 64, 64, 64, -64, -64, -64, 64, 64, 64, 64, 64, -64, -64, 64, -64, 64, -64, -64, 64, 64, 64, 64, 64, 64, 64, 64, 64, 64, 64, 64, -64, -64, -64, -64, 64, -64, 64, 64, 64, -64, 64, 64, 64, 64, -64, -64, -64, 64, 64, 64, 64, -64, 64, 64, 64, 64, 64, 64, -64, 64, -64, 64, 64, 64, 64, 64, 64, 64, -64, 64, 64, 64, 64, -64, 64, 64, 64, 64, -64, 64, 64, 64, 64, 64, 64, 64, -64, -64, -64, -64, -64, 64, 64, 64, 64, 64, 64, 64, 64, 64, 64, 64, -64, -64, 64, 64, -64, 64, 64, 64, 64, 64, 64, 64, 64, -64, 64, 64, -64, -64, 64, 64, -64, 64, 64, -64, 64, 64, 64, 64, 64, -64, 64, -64, 64, 64, 64, 64, 64, 64, 64, -64, 64, 64, 64, 64, -64, 64, 64, -64, -64, -64, -64, 64, 64, 64, 64, 64, -64, 64, -64, -64, 64, 64, 64, 64, 64, 64, 64, -64, -64, 64, 64, 64, 64, -64, 64, 64, 64, 64, 64, -64, -64, 64, -64, -64, 64, 64, 64, 64, 64, 64, 64, 64, 64, 64, 64, 64, 64, 64, 64, 64, 64, 64, 64, -64, -64, 64, 64, -64, -64, -64, 64, -64, -64, 64, 64, -64, 64, 64, 64, 64, 64, 64, 64, -64, 64, 64, 64, 64, 64, -64, 64, -64, -64, 64, 64, 64, 64, -64, -64, -64, -64, -64, -64, 64, -64, 64, -64, -64, -64, -64, 64, 64, 64, 64, -64, 64, 64, -64, -64, -64, 64, 64, 64, -64, 64, 64, 64, 64, 64, 64, 64, -64, 64, -64, -64, 64, 64, 64, -64, -64, -64, 64, 64, -64, -64, -64, -64, -64, -64, -64, 64, -64, -64, 64, -64, -64, 64, -64, 64, -64, -64, -64, 64, 64, 64, -64, -64, 64, 64, 64, -64, -64, -64, -64, 64, 64, -64, 64, 64, -64, 64, -64, -64, 64, -64, -64, -64, 64, 64, 64, -64, -64, -64, -64, -64, -64, -64, 64, -64, -64, -64, 64, -64, -64, 64, 64, 64, -64, 64, 64, 64, -64, 64, -64, -64, -64, -64, 64, -64, -64, -64, -64, -64, -64, -64, -64, -64, -64, -64, -64, -64, -64, 64, 64, -64, 64, 64, -64, -64, 64, -64, 64, -64, 64, -64, 64, -64, -64, -64, -64, -64, 64, -64, 64, 64, -64, -64, -64, 64, -64, 64, -64, 64, 64, 64, -64, -64, -64, -64, 64, -64, -64, 64, 64, 64, 64, -64, -64, -64, 64, -64, 64, -64, -64, -64, 64, -64, 64, 64, 64, -64, -64, 64, 64, -64, 64, 64, 64, 64, -64, -64, 64, 64, 64, 64, 64, 64, -64, -64, 64, 64, 64, -64, -64, 64, 64, 64, 64, -64, 64, 64, 64, 64, 64, 64, -64, -64, 64, -64, 64, 64, -64, 64, 64, -64, -64, -64, 64, -64, 64, -64, 64, 64, 64, 64, -64, 64, 64, 64, 64, -64, -64, 64, 64, -64, 64, 64, 64, 64, 64, 64, 64, 64, 64, 64, 64, 64, -64, -64, -64, -64, -64, -64, 64, 64, -64, -64, -64, -64, -64, -64, -64, -64, 64, 64, 64, 64, 64, 64, 64, 64, 64, 64, 64, 64, -64, -64, -64, -64, -64, -64, -64, 64, -64, -64, -64, 64, -64, -64, -64, -64, -64, 64, 64, 64, 64, 64, 64, 64, -64, -64, 64, -64, -64, 64, -64, -64, -64, -64, 64, -64, 64, 64, 64, -64, -64, 64, 64, -64, 64, 64, 64, 64, 64, 64, 64, 64, 64, -64, 64, 64, 64, 64, 64, -64, -64, -64, -64, -64, 64, 64, 64, 64, 64, 64, 64, 64, 64, 64, 64, 64, 64, -64, 64, 64, -64, 64, 64, -64, 64, 64, 64, -64, -64, -64, -64, -64, 64, -64, 64, -64, 64, -64, 64, 64, 64, 64, 64, -64, -64, 64, 64, -64, -64, -64, -64, -64, -64, -64, 64, 64, -64, -64, -64, -64, 64, 64, 64, 64, 64, -64, -64, 64, 64, 64, -64, -64, 64, -64, -64, -64, -64, -64, -64, -64, 64, -64, -64, -64, -64, -64, -64, -64, 64, -64, 64, 64, 64, -64, 64, 64, 64, 64, -64, -64, -64, -64, -64, -64, -64, -64, -64, 64, 64, 64, 64, -64, -64, -64, -64, -64, 64, 64, 64, -64, 64, 64, 64, 64, 64, 64, -64, -64, -64, -64, -64, -64, -64, -64, 64, 64, 64, 64, -64, -64, -64, -64, -64, -64, 64, 64, -64, 64, -64, -64, 64, 64, 64, 64, -64, -64, -64, -64, -64, -64, 64, 64, 64, 64, -64, -64, -64, -64, -64, -64, -64, -64, 64, 64, -64, 64, -64, 64, -64, 64, 64, -64, -64, -64, -64, 64, 64, 64, 64, 64, 64, 64, 64, -64, -64, -64, -64, -64, 64, -64, 64, 64, 64, 64, 64, -64, -64, -64, -64, -64, -64, -64, -64, -64, 64, 64, 64, 64, 64, 64, 64, -64, -64, -64, -64, 64, 64, 64, -64, -64, 64, 64, -64, -64, -64, 64, -64, -64, -64, 64, -64, -64, 64, 64, 64, 64, 64, 64, -64, -64, 64, -64, -64, -64, -64, -64, 64, 64, 64, 64, -64, -64, -64, -64, -64, -64, -64, 64, 64, 64, 64, 64, 64, -64, 64, 64, 64, 64, 64, -64, -64, 64, -64, 64, 64, 64, 64, 64, -64, -64, -64, -64, -64, 64, 64, 64, -64, -64, -64, 64, -64, -64, 64, 64, 64, 64, -64, -64, 64, -64, -64, 64, -64, -64, -64, 64, -64, -64, -64, -64, -64, 64, 64, -64, -64, 64, -64, -64, 64, -64, 64, 64, 64, 64, 64, 64, 64, 64, 64, 64, 64, 64, 64, 64, 64, -64, -64, -64, -64, 64, 64, -64, 64, 64, -64, 64, 64, 64, 64, 64, 64, 64, 64, 64, 64, 64, 64, 64, 64, -64, 64, 64, 64, -64, -64, -64, -64, -64, -64, -64, -64, -64, -64, 64, 64, 64, 64, 64, 64, 64, -64, -64, 64, 64, -64, 64, -64, 64, 64, 64, 64, 64, -64, -64, -64, -64, 64, -64, 64, -64, 64, 64, 64, 64, 64, 64, 64, 64, 64, 64, 64, 64, -64, -64, -64, -64, 64, 64, 64, 64, 64, 64, -64, 64, 64, -64, 64, -64, -64, 64, 64, 64, 64, 64, 64, 64, 64, -64, 64, -64, -64, -64, -64, 64, 64, 64, 64, 64, -64, -64, -64, 64, -64, -64, -64, 64, -64, 64, 64, 64, 64, 64, 64, 64, -64, -64, -64, 64, 64, -64, -64, 64, -64, 64, 64, 64, 64, 64, -64, 64, 64, 64, -64, -64, 64, -64, -64, 64, 64, 64, 64, 64, 64, -64, 64, 64, -64, 64, 64, -64, 64, -64, -64, -64, 64, 64, 64, 64, 64, -64, 64, 64, -64, 64, -64, -64, -64, 64, -64, -64, -64, -64, -64, -64, -64, 64, -64, -64, -64, 64, -64, -64, 64, -64, 64, -64, -64, 64, -64, 64, 64, -64, -64, -64, -64, 64, -64, 64, -64, -64, 64, 64, -64, 64, -64, 64, 64, 64, -64, 64, -64, -64, -64, -64, -64, -64, 64, -64, 64, -64, 64, 64, 64, -64, -64, 64, 64, 64, -64, -64, -64, 64, -64, -64, 64, -64, 64, -64, 64, -64, 64, -64, 64, -64, 64, 64, -64, -64, 64, 64, -64, 64, -64, 64, 64, 64, -64, -64, 64, -64, -64, 64, 64, 64, -64, -64, -64, 64, 64, 64, 64, -64, 64, -64, -64, -64, -64, -64, -64, -64, -64, 64, -64, 64, -64, 64, 64, -64, -64, 64, -64, 64, 64, -64, -64, -64, -64, 64, 64, -64, 64, 64, -64, -64, -64, -64, -64, 64, 64, 64, -64, 64, -64, -64, -64, 64, 64, -64, 64, 64, 64, -64, -64, 64, -64, -64, -64, 64, 64, 64, 64, -64, 64, 64, 64, 64, 64, 64, 64, 64, -64, -64, -64, -64, 64, -64, -64, 64, 64, 64, -64, -64, -64, 64, -64, -64, -64, 64, -64, 64, 64, -64, 64, 64, 64, 64, 64, 64, 64, -64, 64, -64, 64, 64, 64, 64, -64, -64, -64, -64, -64, 64, -64, 64, -64, -64, 64, -64, -64, 64, 64, 64, 64, -64, 64, 64, -64, 64, -64, -64, 64, 64, -64, 64, 64, -64, -64, -64, -64, -64, 64, -64, -64, -64, -64, -64, -64, -64, -64, -64, 64, 64, 64, 64, 64, -64, 64, 64, 64, 64, 64, -64, -64, -64, -64, -64, 64, -64, -64, -64, -64, -64, -64, -64, -64, -64, -64, -64, -64, 64, -64, 64, 64, 64, -64, -64, -64, 64, -64, -64, -64, -64, -64, -64, 64, -64, -64, -64, -64, -64, -64, -64, -64, -64, -64, -64, 64, -64, 64, 64, 64, -64, -64, -64, -64, 64, -64, -64, -64, -64, -64, -64, -64, -64, 64, -64, -64, -64, -64, -64, -64, -64, -64, -64, -64, -64, -64, -64, -64, -64, -64, -64, -64, -64, -64, 64, -64, -64, 64, -64, -64, -64, 64, -64, -64, -64, -64, -64, -64, -64, -64, -64, -64, -64, -64, -64, -64, -64, -64, 64, -64, -64, -64, 64, 64, -64, -64, 64, 64, -64, 64, -64, -64, -64, -64, -64, -64, -64, -64, -64, -64, -64, 64, 64, -64, -64, -64, 64, -64, -64, -64, -64, -64, -64, -64, 64, 64, -64, -64, -64, -64, -64, -64, -64, 64, -64, -64, -64, -64, -64, -64, -64, 64, -64, -64, 64, 64, -64, 64, -64, -64, -64, -64, 64, 64, -64, -64, 64, -64, -64, -64, 64, 64, -64, -64, 64, -64, 64, -64, 64, 64, -64, 64, -64, -64, 64, -64, -64, -64, -64, 64, 64, 64, 64, -64, -64, -64, -64, 64, -64, 64, -64, -64, 64, -64, 64, 64, -64, 64, 64, -64, 64, 64, 64, -64, -64, -64, -64, 64, 64, -64, 64, -64, -64, -64, -64, -64, -64, -64, 64, -64, 64, 64, 64, 64, 64, -64, 64, 64, 64, -64, 64, -64, 64, -64, 64, 64, 64, -64, -64, -64, 64, -64, -64, -64, -64, -64, -64, 64, -64, -64, -64, -64, 64, -64, 64, -64, -64, 64, -64, 64, -64, -64, 64, 64, -64, -64, -64, -64, 64, -64, -64, 64, 64, -64, -64, -64, -64, 64, 64, -64, -64, -64, 64, -64, 64, -64, 64, -64, -64, -64, 64, -64, 64, 64, 64, 64, 64, 64, -64, 64, 64, 64, -64, -64, 64, -64, 64, -64, -64, -64, 64, 64, 64, -64, 64, 64, 64, 64, -64, -64, -64, 64, -64, -64, 64, -64, -64, -64, -64, 64, 64, -64, -64, 64, -64, 64, -64, -64, -64, 64, 64, -64, -64, -64, -64, -64, -64, -64, -64, -64, -64, -64, -64, 64, 64, -64, -64, 64, -64, -64, -64, -64, -64, 64, 64, -64, -64, -64, -64, -64, -64, 64, 64, 64, -64, -64, -64, -64, -64, -64, 64, 64, -64, -64, -64, 64, -64, -64, -64, -64, -64, 64, 64, -64, -64, 64, -64, 64, 64, 64, -64, -64, -64, -64, -64, -64, -64, 64, 64, -64, 64, -64, 64, 64, -64, -64, -64, -64, -64, 64, 64, 64, 64, -64, -64, 64, -64, 64, -64, 64, -64, -64, -64, -64, -64, -64, 64, -64, -64, -64, -64, -64, -64, -64, -64, 64, 64, 64, 64, -64, 64, -64, -64, 64, -64, 64, 64, -64, -64, -64, 64, 64, -64, -64, 64, -64, -64, -64, -64, -64, -64, -64, -64, -64, -64, -64, 64, -64, 64, 64, -64, 64, -64, 64, -64, -64, -64, -64, -64, -64, -64, 64, -64, -64, -64, -64, -64, -64, -64, -64, -64, -64, -64, -64, 64, 64, 64, -64, -64, -64, -64, -64, -64, 64, 64, -64, 64, 64, 64, 64, 64, -64, -64, -64, -64, -64, -64, 64, 64, -64, 64, 64, 64, 64, 64, -64, -64, -64, 64, -64, 64, 64, -64, -64, 64, 64, 64, -64, -64, 64, -64, 64, -64, -64, -64, -64, 64, -64, 64, -64, 64, -64, 64, -64, 64, -64, -64, 64, 64, -64, 64, 64, -64, 64, 64, 64, 64, 64, 64, 64, -64, 64, 64, 64, -64, 64, -64, -64, -64, -64, 64, -64, -64, 64, 64, 64, 64, -64, -64, 64, 64, -64, -64, -64, -64, 64, 64, 64, -64, 64, -64, 64, -64, 64, 64, 64, 64, -64, -64, 64, 64, -64, -64, 64, -64, 64, -64, -64, 64, -64, 64, 64, 64, 64, -64, 64, 64, 64, 64, 64, 64, 64, 64, 64, -64, 64, -64, -64, 64, -64, 64, 64, 64, 64, -64, -64, -64, -64, -64, -64, -64, -64, -64, -64, -64, 64, -64, -64, 64, -64, 64, 64, 64, 64, 64, 64, 64, -64, 64, 64, -64, -64, -64, -64, -64, -64, -64, -64, -64, -64, -64, -64, -64, -64, 64, 64, 64, 64, 64, 64, 64, 64, -64, 64, -64, -64, 64, -64, -64, -64, -64, 64, -64, -64, -64, -64, -64, -64, -64, -64, -64, -64, -64, 64, 64, 64, 64, 64, 64, 64, -64, -64, -64, -64, 64, -64, 64, -64, -64, -64, -64, -64, -64, -64, -64, -64, -64, -64, 64, -64, -64, -64, 64, 64, 64, 64, 64, 64, -64, -64, -64, -64, -64, -64, 64, -64, -64, -64, -64, -64, -64, -64, -64, -64, -64, 64, 64, -64, -64, -64, 64, -64, 64, 64, 64, 64, -64, 64, 64, 64, -64, 64, -64, -64, -64, -64, -64, -64, -64, -64, 64, 64, 64, 64, 64, -64, 64, -64, -64, -64, -64, 64, 64, 64, -64, -64, 64, 64, -64, 64, 64, -64, -64, -64, -64, -64, -64, -64, 64, 64, 64, 64, 64, -64, -64, -64, -64, -64, -64, -64, -64, -64, -64, 64, 64, 64, -64, -64, -64, -64, -64, -64, -64, -64, -64, -64, 64, 64, 64, 64, 64, 64, -64, -64, -64, -64, -64, 64, -64, -64, -64, 64, 64, 64, 64, 64, -64, -64, -64, -64, -64, -64, -64, 64, 64, 64, 64, 64, 64, 64, 64, -64, -64, -64, -64, -64, -64, -64, -64, -64, -64, 64, 64, -64, -64, -64, -64, -64, -64, -64, 64, 64, 64, 64, -64, -64, 64, -64, 64, 64, -64, -64, -64, -64, -64, -64, -64, -64, -64, 64, 64, -64, -64, -64, -64, 64, -64, -64, 64, 64, 64, -64, 64, 64, -64, 64, 64, 64, 64, -64, 64, -64, -64, -64, -64, -64, -64, 64, 64, -64, -64, 64, -64, -64, -64, -64, 64, 64, 64, 64, -64, 64, -64, 64, 64, -64, 64, 64, -64, -64, -64, -64, -64, -64, -64, -64, 64, 64, -64, -64, -64, -64, -64, 64, 64, 64, 64, 64, 64, 64, 64, 64, 64, 64, 64, 64, -64, -64, -64, -64, -64, -64, -64, -64, 64, -64, -64, -64, -64, -64, -64, 64, 64, 64, 64, 64, -64, 64, -64, 64, 64, -64, -64, -64, -64, -64, -64, -64, -64, -64, -64, -64, 64, -64, -64, -64, -64, -64, -64, 64, -64, 64, 64, -64, -64, 64, 64, -64, 64, 64, -64, -64, -64, -64, -64, -64, 64, -64, -64, -64, -64, -64, -64, 64, -64, -64, 64, -64, 64, -64, -64, -64, 64, 64, -64, -64, -64, -64, -64, 64, -64, -64, -64, -64, -64, -64, 64, 64, 64, -64, -64, -64, -64, -64, -64, -64, -64, -64, 64, 64, 64, 64, 64, -64, -64, -64, -64, -64, -64, -64, -64, -64, 64, -64, 64, 64, 64, 64, -64, -64, 64, -64, -64, 64, 64, 64, 64, 64, 64, 64, 64, -64, 64, -64, -64, -64, -64, -64, -64, -64, 64, -64, -64, 64, 64, -64, -64, -64, 64, 64, 64, 64, 64, 64, 64, 64, 64, -64, 64, -64, -64, -64, 64, -64, -64, -64, -64, -64, 64, -64, 64, -64, -64, 64, -64, 64, 64, -64, 64, 64, 64, 64, -64, 64, -64, 64, -64, -64, -64, -64, 64, -64, 64, -64, -64, -64, 64, 64, -64, 64, -64, 64, -64, 64, 64, -64, 64, 64, -64, 64, -64, -64, -64, -64, 64, 64, 64, -64, 64, -64, -64, 64, -64, -64, 64, -64, -64, -64, 64, -64, -64, -64, 64, -64, 64, 64, 64, -64, -64, -64, -64, -64, -64, -64, -64, -64, 64, 64, -64, -64, -64, -64, 64, 64, 64, 64, 64, 64, -64, 64, 64, 64, 64, 64, 64, -64, -64, -64, -64, -64, -64, 64, -64, -64, 64, -64, 64, -64, -64, 64, 64, 64, 64, -64, -64, -64, 64, -64, -64, 64, 64, -64, 64, -64, -64, 64, 64, 64, 64, 64, 64, 64, -64, -64, -64, 64, 64, 64, 64, 64, 64, -64, 64, -64, -64, -64, 64, 64, 64, 64, 64, 64, -64, -64, 64, -64, -64, 64, -64, -64, -64, -64, -64, 64, 64, 64, 64, 64, -64, -64, 64, -64, 64, 64, -64, -64, -64, 64, -64, -64, 64, 64, 64, -64, -64, 64, 64, 64, 64, -64, -64, -64, -64, -64, 64, 64, -64, -64, 64, 64, -64, 64, 64, -64, -64, 64, 64, 64, -64, 64, 64, -64, -64, -64, 64, 64, 64, -64, 64, -64, -64, 64, 64, -64, 64, -64, -64, -64, 64, -64, -64, 64, -64, -64, -64, -64, -64, -64, -64, -64, 64, -64, 64, -64, 64, 64, 64, -64, 64, 64, -64, -64, 64, -64, -64, -64, -64, -64, -64, 64, -64, 64, -64, -64, -64, -64, -64, -64, -64, 64, -64, -64, -64, 64, 64, 64, 64, 64, 64, 64, -64, -64, -64, -64, 64, -64, 64, 64, -64, -64, -64, -64, -64, -64, -64, -64, -64, -64, -64, -64, 64, -64, -64, 64, 64, -64, -64, -64, -64, -64, 64, -64, 64, 64, 64, 64, 64, -64, -64, -64, -64, -64, -64, -64, -64, -64, -64, 64, 64, -64, 64, 64, 64, -64, 64, 64, -64, -64, -64, -64, 64, -64, 64, 64, 64, 64, -64, -64, -64, -64, -64, -64, -64, -64, 64, 64, 64, 64, 64, 64, 64, 64, -64, 64, 64, 64, 64, 64, 64, 64, 64, 64, 64, 64, 64, -64, -64, -64, -64, -64, -64, 64, -64, 64, -64, -64, 64, 64, 64, -64, -64, 64, -64, 64, 64, 64, 64, 64, 64, 64, -64, 64, 64, -64, -64, -64, -64, -64, -64, 64, 64, -64, 64, -64, -64, 64, 64, 64, 64, -64, -64, -64, -64, -64, 64, 64, 64, 64, 64, 64, 64, -64, -64, -64, -64, -64, 64, -64, -64, -64, -64, -64, 64, 64, 64, 64, -64, -64, -64, 64, -64, 64, 64, 64, 64, 64, -64, 64, 64, -64, -64, 64, 64, 64, -64, -64, -64, -64, -64, 64, 64, 64, -64, 64, -64, 64, 64, 64, 64, 64, 64, 64, 64, 64, 64, 64, -64, 64, 64, -64, 64, -64, -64, -64, -64, -64, -64, 64, 64, 64, -64, 64, -64, -64, -64, 64, 64, 64, 64, 64, -64, 64, -64, 64, -64, -64, -64, -64, 64, -64, -64, -64, -64, 64, -64, 64, 64, 64, -64, -64, -64, -64, -64, 64, 64, 64, 64, -64, 64, 64, 64, 64, -64, -64, -64, 64, -64, -64, -64, -64, -64, -64, 64, -64, -64, 64, 64, -64, -64, 64, -64, -64, -64, 64, 64, 64, 64, 64, 64, 64, 64, -64, -64, -64, -64, -64, -64, -64, -64, -64, -64, 64, 64, 64, 64, 64, 64, -64, -64, 64, -64, 64, 64, 64, 64, 64, 64, -64, -64, -64, -64, -64, -64, -64, -64, -64, -64, 64, -64, -64, -64, 64, -64, -64, -64, -64, -64, -64, 64, -64, 64, 64, -64, 64, 64, -64, -64, -64, -64, -64, -64, -64, -64, -64, -64, -64, -64, -64, 64, -64, 64, -64, -64, 64, 64, 64, 64, -64, 64, 64, 64, 64, -64, -64, -64, -64, -64, -64, -64, -64, -64, -64, 64, 64, -64, 64, 64, 64, 64, -64, -64, 64, -64, 64, -64, 64, -64, -64, 64, 64, 64, 64, -64, -64, -64, -64, -64, -64, -64, -64, -64, -64, -64, -64, 64, 64, -64, -64, -64, -64, 64, -64, 64, -64, -64, 64, -64, 64, 64, -64, -64, -64, -64, -64, -64, 64, -64, -64, -64, -64, -64, 64, 64, 64, -64, -64, -64, -64, -64, -64, -64, 64, -64, -64, 64, 64, -64, 64, 64, -64, -64, -64, 64, -64, 64, -64, 64, -64, 64, -64, -64, 64, 64, 64, 64, -64, -64, -64, 64, -64, 64, -64, 64, 64, 64, 64, 64, 64, -64, -64, -64, -64, -64, -64, -64, 64, -64, -64, 64, 64, -64, 64, -64, -64, 64, 64, 64, -64, -64, -64, 64, -64, 64, 64, 64, -64, -64, -64, -64, -64, -64, -64, -64, -64, -64, 64, 64, 64, 64, 64, -64, 64, 64, -64, -64, -64, 64, 64, 64, -64, 64, 64, 64, -64, 64, -64, 64, 64, -64, -64, 64, 64, -64, 64, 64, 64, 64, 64, -64, 64, -64, 64, 64, -64, -64, 64, -64, -64, -64, -64, -64, -64, 64, -64, 64, -64, -64, -64, -64, 64, 64, 64, 64, 64, -64, -64, 64, -64, -64, 64, -64, -64, 64, -64, 64, -64, -64, -64, -64, -64, -64, -64, -64, -64, -64, -64, 64, 64, 64, -64, -64, -64, -64, -64, 64, -64, 64, 64, -64, -64, 64, -64, 64, 64, 64, 64, -64, 64, 64, 64, 64, -64, -64, -64, -64, -64, -64, -64, -64, -64, -64, -64, -64, -64, 64, 64, -64, -64, 64, 64, -64, -64, -64, 64, -64, 64, 64, 64, 64, 64, 64, 64, -64, -64, 64, 64, 64, -64, -64, 64, 64, -64, -64, 64, 64, 64, -64, 64, -64, -64, 64, -64, 64, -64, -64, 64, 64, 64, 64, -64, 64, -64, 64, -64, 64, 64, 64, -64, -64, -64, -64, 64, 64, -64, 64, -64, 64, -64, -64, -64, -64, 64, 64, -64, -64, -64, -64, 64, -64, 64, -64, 64, 64, -64, -64, -64, -64, 64, 64, -64, -64, -64, -64, 64, 64, -64, 64, -64, -64, -64, -64, -64, -64, -64, -64, -64, -64, -64, 64, -64, -64, 64, -64, -64, -64, 64, 64, 64, -64, 64, -64, 64, -64, 64, 64, -64, -64, 64, 64, -64, -64, -64, -64, 64, 64, -64, 64, 64, 64, -64, 64, 64, 64, -64, -64, -64, -64, -64, 64, -64, -64, -64, -64, -64, -64, -64, -64, -64, -64, -64, 64, 64, -64, -64, -64, 64, 64, 64, 64, 64, 64, 64, 64, 64, -64, -64, -64, -64, 64, -64, -64, -64, 64, -64, -64, -64, -64, -64, -64, 64, -64, -64, -64, -64, -64, -64, 64, -64, -64, 64, 64, -64, -64, 64, -64, 64, 64, -64, -64, -64, 64, 64, -64, -64, -64, -64, -64, 64, 64, -64, -64, -64, 64, 64, 64, -64, -64, -64, -64, 64, -64, 64, 64, 64, 64, 64, 64, -64, -64, -64, 64, -64, -64, -64, -64, 64, 64, 64, 64, -64, -64, 64, -64, -64, -64, 64, 64, -64, 64, 64, 64, -64, 64, 64, 64, 64, 64, 64, 64, -64, -64, -64, 64, 64, 64, 64, 64, 64, -64, -64, -64, -64, -64, -64, 64, -64, 64, 64, 64, -64, -64, -64, -64, -64, -64, -64, -64, -64, -64, -64, 64, 64, 64, 64, 64, 64, -64, 64, 64, 64, -64, -64, -64, 64, 64, 64, -64, -64, -64, -64, -64, -64, -64, 64, -64, -64, -64, 64, 64, 64, 64, 64, 64, 64, 64, 64, 64, -64, 64, 64, 64, 64, -64, 64, 64, -64, -64, -64, -64, -64, -64, -64, -64, -64, -64, -64, 64, 64, 64, 64, 64, 64, 64, 64, 64, 64, -64, -64, 64, 64, 64, -64, 64, -64, -64, -64, 64, -64, 64, -64, 64, 64, -64, -64, 64, 64, 64, 64, 64, 64, 64, 64, 64, 64, 64, 64, 64, -64, -64, 64, 64, 64, -64, -64, 64, 64, 64, 64, 64, -64, -64, -64, -64, -64, 64, 64, 64, 64, 64, 64, 64, 64, 64, 64, -64, 64, 64, 64, 64, 64, 64, 64, 64, 64, 64, 64, 64, 64, 64, -64, -64, 64, 64, 64, 64, 64, 64, 64, 64, 64, 64, -64, -64, -64, -64, 64, 64, 64, 64, 64, 64, 64, 64, 64, -64, -64, -64, -64, -64, -64, 64, 64, 64, 64, 64, 64, 64, 64, 64, -64, 64, 64, 64, -64, 64, 64, 64, 64, 64, 64, 64, 64, -64, -64, -64, -64, -64, -64, 64, 64, 64, 64, 64, 64, -64, -64, -64, -64, -64, 64, -64, 64, -64, 64, 64, 64, 64, 64, 64, -64, -64, -64, -64, -64, -64, -64, 64, 64, 64, -64, -64, -64, -64, -64, -64, -64, -64, 64, 64, -64, -64, 64, 64, 64, 64, 64, 64, 64, -64, 64, 64, 64, -64, -64, -64, 64, 64, 64, -64, -64, -64, -64, 64, 64, -64, -64, -64, -64, -64, -64, 64, 64, 64, 64, -64, 64, 64, 64, 64, -64, -64, -64, -64, -64, -64, -64, -64, -64, -64, -64, 64, -64, -64, 64, -64, -64, -64, -64, 64, 64, 64, 64, -64, -64, 64, -64, -64, 64, -64, -64, -64, -64, -64, -64, -64, -64, -64, -64, -64, -64, -64, 64, 64, 64, 64, 64, -64, -64, 64, -64, -64, -64, -64, 64, -64, -64, -64, -64, -64, -64, -64, -64, -64, -64, -64, 64, -64, -64, -64, -64, 64, -64, 64, 64, -64, -64, -64, -64, -64, 64, -64, -64, 64, 64, -64, -64, -64, -64, -64, -64, -64, -64, -64, 64, -64, -64, -64, 64, 64, -64, -64, 64, -64, -64, -64, -64, -64, 64, -64, -64, -64, -64, -64, -64, -64, -64, -64, -64, -64, -64, -64, 64, 64, -64, 64, 64, 64, -64, -64, 64, 64, -64, -64, 64, -64, -64, 64, 64, -64, -64, -64, -64, -64, -64, -64, -64, 64, 64, -64, 64, -64, -64, 64, -64, 64, -64, -64, 64, 64, 64, 64, 64, -64, -64, -64, 64, -64, -64, -64, -64, -64, -64, -64, -64, -64, -64, -64, 64, -64, 64, -64, 64, 64, 64, -64, 64, -64, 64, 64, 64, -64, -64, -64, 64, 64, 64, -64, 64, -64, -64, -64, -64, 64, -64, -64, 64, 64, 64, -64, -64, -64, 64, -64, 64, 64, -64, 64, 64, 64, -64, -64, -64, -64, 64, 64, -64, 64, 64, 64, -64, 64, 64, -64, 64, 64, 64, 64, -64, -64, -64, -64, -64, 64, 64, -64, -64, 64, -64, -64, -64, -64, -64, 64, -64, 64, 64, -64, -64, -64, -64, 64, 64, -64, -64, 64, -64, -64, -64, -64, -64, 64, 64, 64, 64, -64, -64, -64, 64, 64, 64, 64, -64, 64, 64, -64, 64, -64, 64, -64, -64, 64, 64, -64, 64, -64, -64, -64, 64, 64, -64, -64, -64, 64, -64, 64, 64, -64, -64, -64, -64, 64, 64, 64, -64, -64, 64, 64, -64, -64, 64, -64, -64, 64, 64, -64, 64, -64, 64, 64, 64, -64, -64, 64, 64, 64, -64, -64, 64, -64, -64, -64, -64, -64, -64, -64, 64, -64, 64, 64, 64, 64, -64, 64, 64, 64, 64, -64, -64, -64, -64, -64, -64, -64, -64, 64, -64, 64, 64, -64, -64, -64, -64, -64, -64, -64, -64, 64, 64, 64, 64, -64, 64, -64, -64, 64, 64, -64, -64, -64, 64, 64, 64, 64, 64, 64, -64, -64, 64, 64, 64, -64, -64, 64, -64, -64, -64, 64, -64, 64, -64, -64, -64, -64, -64, -64, -64, 64, 64, 64, -64, 64, 64, 64, -64, -64, 64, 64, 64, -64, -64, -64, 64, 64, 64, -64, 64, 64, 64, 64, 64, -64, -64, -64, 64, -64, 64, -64, 64, -64, -64, -64, 64, 64, 64, 64, 64, -64, -64, 64, 64, -64, 64, -64, -64, -64, 64, -64, 64, 64, 64, 64, -64, -64, 64, 64, 64, 64, 64, 64, 64, -64, 64, 64, 64, 64, 64, 64, 64, -64, 64, -64, -64, 64, -64, 64, -64, 64, 64, -64, 64, -64, -64, 64, 64, 64, 64, 64, 64, -64, -64, 64, 64, -64, -64, -64, -64, 64, 64, 64, -64, -64, 64, 64, 64, 64, 64, 64, 64, 64, -64, 64, -64, -64, 64, 64, -64, 64, 64, -64, 64, 64, -64, 64, -64, 64, -64, -64, -64, -64, 64, -64, 64, -64, -64, 64, -64, -64, 64, -64, 64, 64, 64, 64, 64, 64, 64, -64, -64, 64, -64, -64, -64, -64, -64, -64, 64, -64, 64, -64, 64, 64, -64, -64, -64, 64, 64, 64, 64, 64, -64, -64, 64, 64, 64, 64, 64, 64, -64, 64, 64, -64, -64, 64, -64, 64, 64, 64, -64, 64, 64, 64, 64, -64, 64, 64, -64, 64, -64, -64, -64, 64, 64, 64, -64, 64, -64, -64, -64, -64, 64, 64, -64, 64, -64, 64, -64, 64, 64, -64, 64, 64, 64, -64, 64, 64, 64, 64, 64, -64, 64, 64, -64, 64, -64, -64, -64, 64, -64, -64, -64, -64, 64, 64, -64, 64, -64, -64, 64, 64, 64, -64, 64, 64, 64, 64, -64, 64, 64, -64, -64, -64, -64, -64, 64, 64, -64, 64, -64, -64, 64, 64, 64, -64, -64, -64, 64, -64, 64, -64, -64, -64, 64, 64, 64, 64, 64, -64, 64, 64, 64, -64, -64, 64, -64, -64, -64, -64, -64, 64, -64, 64, 64, -64, 64, -64, 64, 64, -64, -64, -64, 64, -64, -64, 64, 64, 64, 64, 64, -64, 64, 64, -64, 64, 64, -64, -64, -64, -64, -64, 64, -64, -64, 64, 64, 64, 64, 64, 64, 64, -64, 64, -64, 64, 64, 64, -64, 64, 64, 64, -64, 64, 64, -64, 64, 64, 64, -64, -64, -64, -64, 64, 64, -64, 64, 64, 64, 64, -64, 64, 64, -64, 64, -64, 64, 64, 64, -64, 64, 64, -64, 64, 64, 64, -64, 64, 64, 64, 64, 64, 64, 64, -64, 64, -64, -64, -64, -64, 64, 64, 64, -64, 64, -64, -64, -64, 64, -64, -64, -64, -64, -64, 64, 64, -64, -64, 64, -64, 64, 64, 64, 64, -64, 64, 64, -64, 64, 64, 64, 64, -64, 64, -64, 64, -64, -64, 64, -64, -64, -64, -64, 64, 64, 64, -64, 64, -64, 64, 64, 64, 64, 64, -64, -64, -64, -64, 64, 64, -64, 64, -64, -64, 64, 64, -64, 64, 64, 64, 64, -64, -64, -64, 64, 64, 64, 64, -64, 64, -64, 64, 64, 64, -64, -64, 64, -64, -64, -64, 64, 64, -64, 64, 64, -64, -64, -64, -64, -64, -64, 64, 64, 64, -64, 64, 64, -64, 64, 64, 64, 64, -64, -64, 64, -64, 64, -64, 64, 64, 64, -64, 64, 64, 64, -64, -64, -64, -64, 64, 64, 64, 64, -64, 64, -64, 64, 64, 64, -64, 64, 64, 64, -64, -64, 64, -64, 64, -64, -64, -64, 64, 64, -64, 64, 64, -64, 64, 64, -64, -64, 64, 64, -64, -64, 64, -64, -64, 64, 64, 64, -64, -64, 64, -64, -64, 64, -64, 64, 64, -64, -64, -64, -64, -64, 64, -64, -64, 64, -64, 64, -64, -64, 64, -64, -64, 64, -64, 64, -64, -64, 64, -64, -64, -64, -64, 64, -64, -64, -64, 64, 64, -64, -64, -64, 64, -64, -64, -64, 64, -64, 64, 64, -64, 64, 64, 64, 64, -64, -64, 64, 64, 64, 64, -64, 64, -64, -64, -64, -64, 64, 64, -64, -64, 64, -64, 64, 64, 64, -64, 64, -64, -64, 64, 64, 64, 64, -64, 64, -64, 64, -64, -64, 64, -64, -64, -64, 64, 64, 64, 64, 64, -64, -64, 64, 64, -64, -64, -64, 64, -64, 64, 64, 64, 64, -64, -64, -64, -64, -64, 64, 64, 64, 64, 64, 64, 64, 64, 64, 64, 64, 64, 64, 64, -64, 64, 64, 64, -64, -64, -64, -64, 64, -64, -64, -64, 64, 64, 64, 64, -64, -64, 64, -64, 64, 64, 64, 64, 64, 64, 64, 64, 64, 64, 64, 64, -64, -64, 64, 64, 64, -64, -64, 64, -64, -64, -64, -64, 64, 64, 64, -64, -64, -64, 64, -64, 64, 64, 64, -64, 64, 64, 64, -64, -64, 64, -64, -64, 64, 64, 64, 64, 64, 64, 64, 64, -64, 64, -64, 64, 64, 64, 64, -64, -64, 64, 64, -64, 64, -64, 64, 64, 64, 64, 64, 64, -64, -64, -64, 64, -64, 64, -64, -64, 64, 64, -64, 64, -64, 64, -64, 64, 64, 64, 64, -64, -64, 64, 64, 64, -64, 64, -64, -64, -64, 64, -64, 64, 64, -64, 64, 64, 64, 64, 64, -64, -64, -64, 64, -64, -64, 64, 64, 64, 64, 64, 64, 64, 64, 64, -64, 64, 64, -64, 64, -64, -64, -64, 64, 64, 64, 64, 64, -64, -64, 64, 64, 64, 64, 64, 64, 64, 64, -64, 64, 64, 64, -64, 64, -64, -64, -64, 64, -64, -64, 64, 64, 64, -64, -64, 64, -64, -64, -64, 64, 64, 64, -64, 64, -64, -64, 64, -64, -64, 64, 64, 64, 64, 64, -64, -64, -64, -64, 64, 64, -64, 64, -64, 64, 64, 64, -64, 64, 64, 64, 64, 64, 64, 64, -64, 64, -64, 64, 64, 64, 64, -64, -64, -64, -64, -64, -64, -64, 64, 64, 64, 64, 64, 64, 64, 64, 64, 64, -64, 64, 64, 64, 64, 64, 64, 64, 64, -64, 64, 64, -64, -64, -64, 64, 64, 64, 64, 64, 64, -64, 64, -64, -64, -64, -64, 64, 64, 64, 64, -64, 64, 64, 64, 64, -64, -64, 64, 64, -64, 64, 64, 64, 64, -64, -64, 64, 64, -64, -64, -64, 64, -64, 64, -64, -64, 64, 64, 64, 64, -64, -64, 64, 64, 64, 64, 64, -64, -64, 64, 64, 64, -64, -64, 64, -64, 64, -64, 64, 64, 64, 64, -64, -64, 64, -64, 64, -64, 64, 64, 64, -64, 64, 64, 64, -64, -64, -64, -64, 64, 64, -64, -64, 64, 64, -64, -64, -64, -64, 64, 64, 64, -64, -64, 64, -64, 64, 64, 64, -64, -64, -64, -64, -64, 64, 64, -64, 64, 64, -64, 64, -64, -64, 64, 64, -64, 64, 64, 64, -64, -64, -64, 64, 64, 64, -64, -64, 64, -64, 64, 64, -64, 64, -64, 64, -64, 64, -64, -64, -64, -64, -64, 64, -64, -64, 64, -64, -64, 64, 64, 64, 64, 64, -64, -64, -64, 64, -64, 64, -64, -64, -64, -64, -64, -64, -64, -64, -64, -64, 64, 64, 64, 64, 64, -64, 64, -64, 64, 64, 64, -64, 64, 64, 64, -64, 64, 64, 64, -64, -64, -64, 64, -64, -64, -64, -64, -64, 64, 64, 64, -64, 64, 64, 64, 64, 64, 64, 64, -64, 64, 64, 64, 64, 64, 64, -64, -64, -64, -64, -64, 64, -64, -64, 64, 64, 64, 64, 64, 64, 64, 64, 64, 64, -64, -64, 64, 64, -64, 64, 64, 64, -64, 64, 64, 64, -64, 64, 64, -64, -64, -64, 64, 64, 64, -64, 64, 64, 64, -64, 64, 64, -64, 64, 64, -64, -64, -64, -64, -64, 64, 64, -64, -64, 64, 64, -64, -64, -64, 64, 64, -64, -64, 64, 64, 64, 64, 64, 64, 64, 64, 64, 64, -64, 64, 64, 64, -64, -64, 64, 64, 64, 64, -64, -64, -64, 64, -64, -64, 64, 64, 64, 64, 64, -64, 64, -64, -64, -64, -64, -64, 64, 64, 64, -64, -64, 64, 64, -64, -64, -64, -64, -64, 64, 64, -64, 64, 64, 64, 64, 64, 64, 64, 64, 64, 64, 64, 64, 64, 64, 64, 64, 64, 64, 64, -64, -64, -64, -64, 64, -64, 64, -64, -64, 64, -64, -64, -64, -64, -64, 64, 64, 64, 64, 64, -64, 64, 64, 64, -64, 64, 64, 64, -64, -64, -64, -64, 64, -64, -64, 64, -64, -64, 64, -64, 64, -64, -64, -64, 64, 64, 64, 64, -64, -64, 64, -64, -64, -64, 64, -64, -64, -64, 64, -64, 64, 64, 64, -64, -64, 64, -64, -64, 64, -64, 64, 64, 64, 64, -64, 64, -64, -64, 64, -64, -64, 64, -64, 64, -64, 64, -64, -64, -64, 64, -64, 64, 64, 64, -64, 64, -64, -64, 64, 64, 64, 64, -64, -64, -64, 64, 64, 64, 64, -64, 64, 64, -64, 64, -64, 64, 64, 64, 64, -64, 64, 64, 64, 64, 64, 64, 64, 64, 64, 64, -64, 64, 64, 64, 64, 64, 64, 64, -64, 64, 64, 64, 64, -64, 64, 64, 64, 64, 64, 64, 64, 64, 64, -64, 64, 64, 64, 64, 64, 64, 64, -64, -64, 64, 64, 64, 64, 64, 64, -64, -64, 64, -64, 64, -64, 64, -64, 64, -64, -64, 64, -64, 64, 64, 64, 64, 64, 64, 64, -64, -64, 64, -64, -64, -64, -64, -64, -64, 64, 64, -64, 64, -64, 64, 64, 64, 64, -64, 64, 64, 64, 64, 64, 64, 64, 64, 64, -64, -64, -64, -64, -64, -64, -64, -64, -64, -64, 64, 64, -64, -64, -64, -64, -64, -64, -64, -64, 64, 64, 64, 64, 64, 64, 64, -64, -64, -64, -64, -64, -64, -64, -64, -64, -64, -64, 64, 64, -64, 64, -64, 64, -64, -64, 64, 64, 64, 64, 64, 64, 64, 64, -64, -64, 64, -64, -64, -64, -64, -64, -64, -64, -64, -64, -64, -64, -64, 64, 64, 64, 64, -64, 64, 64, 64, 64, 64, 64, 64, 64, 64, -64, -64, -64, -64, -64, -64, -64, -64, -64, -64, 64, -64, -64, -64, 64, 64, -64, -64, -64, 64, 64, 64, 64, 64, -64, 64, -64, 64, -64, -64, -64, 64, -64, -64, -64, -64, -64, -64, -64, -64, 64, -64, -64, 64, -64, -64, -64, 64, 64, 64, 64, 64, 64, 64, -64, -64, -64, 64, 64, 64, 64, -64, -64, -64, -64, -64, -64, 64, 64, -64, -64, -64, -64, -64, -64, 64, 64, 64, -64, -64, 64, 64, 64, 64, -64, -64, -64, -64, -64, -64, -64, -64, 64, -64, -64, 64, -64, 64, 64, -64, -64, -64, -64, -64, 64, -64, -64, -64, -64, -64, 64, -64, -64, 64, -64, -64, -64, 64, -64, 64, 64, 64, 64, 64, -64, 64, 64, -64, -64, -64, -64, -64, 64, -64, -64, -64, -64, -64, 64, 64, 64, -64, -64, 64, -64, 64, 64, 64, 64, 64, 64, -64, 64, -64, -64, 64, -64, -64, -64, 64, 64, 64, -64, 64, 64, -64, 64, -64, -64, -64, -64, -64, 64, 64, 64, 64, 64, 64, -64, -64, 64, -64, -64, -64, 64, -64, 64, 64, 64, -64, 64, 64, 64, 64, 64, -64, 64, -64, -64, -64, -64, -64, 64, 64, 64, 64, 64, 64, 64, -64, 64, -64, -64, 64, 64, 64, -64, 64, 64, 64, 64, 64, 64, 64, -64, -64, -64, 64, 64, -64, -64, 64, 64, 64, 64, -64, -64, -64, -64, 64, -64, -64, -64, 64, -64, 64, 64, 64, 64, 64, 64, 64, -64, -64, -64, -64, 64, -64, -64, 64, 64, 64, -64, -64, -64, 64, 64, 64, -64, -64, -64, -64, 64, 64, 64, -64, 64, -64, 64, -64, -64, 64, -64, 64, -64, 64, 64, -64, -64, -64, -64, -64, 64, -64, 64, -64, -64, -64, -64, -64, 64, 64, 64, 64, -64, -64, -64, -64, 64, 64, -64, 64, 64, 64, 64, 64, -64, 64, -64, 64, 64, -64, -64, 64, -64, -64, -64, -64, -64, 64, 64, -64, -64, -64, 64, 64, 64, 64, 64, 64, 64, 64, 64, 64, 64, 64, -64, -64, 64, -64, 64, -64, 64, -64, -64, -64, -64, 64, 64, -64, 64, 64, 64, 64, 64, 64, 64, 64, 64, 64, 64, 64, 64, 64, -64, -64, -64, 64, -64, -64, -64, -64, -64, -64, -64, 64, -64, 64, -64, -64, 64, 64, 64, 64, 64, 64, 64, 64, 64, 64, -64, 64, -64, 64, 64, -64, -64, -64, -64, -64, -64, -64, -64, -64, -64, -64, -64, -64, 64, -64, -64, -64, -64, 64, -64, 64, 64, -64, -64, -64, -64, 64, -64, 64, 64, -64, -64, -64, -64, -64, -64, -64, -64, -64, -64, -64, -64, 64, -64, -64, -64, -64, -64, -64, -64, 64, -64, 64, 64, 64, -64, 64, -64, -64, -64, 64, -64, -64, -64, -64, -64, -64, -64, 64, 64, 64, 64, -64, -64, -64, -64, -64, 64, 64, -64, -64, -64, -64, -64, -64, -64, -64, 64, 64, -64, -64, 64, -64, 64, 64, -64, -64, 64, -64, 64, -64, -64, -64, 64, -64, 64, -64, 64, 64, -64, 64, 64, -64, 64, 64, -64, -64, 64, 64, 64, -64, -64, 64, 64, -64, 64, 64, -64, 64, 64, 64, -64, -64, -64, 64, 64, -64, -64, -64, -64, 64, 64, 64, -64, 64, -64, -64, -64, -64, 64, -64, -64, -64, 64, 64, 64, -64, -64, -64, -64, -64, -64, 64, -64, 64, -64, -64, -64, -64, 64, 64, 64, 64, 64, 64, -64, 64, -64, 64, 64, 64, -64, -64, -64, -64, 64, 64, 64, -64, 64, -64, 64, -64, -64, -64, -64, 64, 64, 64, 64, -64, 64, -64, 64, -64, -64, -64, -64, 64, 64, 64, 64, -64, 64, 64, 64, -64, -64, 64, 64, -64, 64, 64, 64, -64, -64, 64, 64, -64, 64, 64, 64, 64, -64, 64, -64, 64, -64, -64, 64, 64, 64, -64, -64, 64, -64, 64, -64, 64, 64, -64, -64, -64, 64, 64, 64, -64, 64, 64, -64, 64, -64, 64, 64, 64, 64, 64, 64, -64, -64, -64, 64, 64, -64, -64, -64, 64, -64, 64, 64, 64, 64, -64, 64, -64, -64, -64, -64, 64, -64, -64, -64, -64, -64, -64, -64, -64, -64, -64, -64, -64, 64, 64, -64, -64, -64, -64, 64, 64, -64, 64, 64, -64, -64, -64, 64, 64, -64, -64, 64, 64, -64, 64, -64, -64, -64, -64, -64, -64, 64, 64, -64, 64, -64, 64, -64, -64, -64, -64, -64, -64, 64, 64, -64, -64, -64, -64, -64, -64, -64, -64, 64, -64, 64, -64, 64, -64, 64, -64, 64, 64, -64, -64, -64, -64, 64, 64, -64, 64, 64, -64, -64, 64, -64, -64, -64, -64, 64, -64, -64, 64, -64, -64, -64, -64, 64, 64, 64, 64, 64, -64, 64, -64, 64, -64, 64, -64, -64, 64, -64, 64, 64, -64, -64, -64, -64, -64, -64, -64, 64, 64, -64, -64, 64, 64, -64, -64, -64, 64, 64, -64, -64, 64, 64, 64, 64, -64, 64, -64, 64, 64, 64, 64, 64, -64, 64, 64, -64, -64, 64, -64, -64, -64, -64, 64, -64, -64, -64, -64, 64, 64, -64, -64, -64, -64, -64, 64, -64, 64, 64, 64, -64, -64, -64, -64, 64, -64, -64, -64, -64, -64, 64, -64, -64, -64, -64, 64, 64, 64, 64, -64, 64, -64, -64, -64, 64, -64, 64, -64, -64, -64, -64, 64, -64, 64, -64, -64, -64, -64, -64, -64, -64, 64, -64, 64, -64, -64, -64, 64, -64, -64, 64, -64, 64, 64, -64, 64, -64, -64, -64, -64, -64, 64, -64, -64, -64, 64, 64, -64, -64, 64, 64, -64, 64, 64, 64, -64, -64, -64, -64, -64, -64, -64, -64, -64, 64, 64, -64, -64, -64, 64, -64, -64, -64, 64, 64, -64, -64, 64, -64, 64, -64, 64, 64, -64, -64, 64, -64, -64, -64, -64, -64, -64, -64, -64, -64, 64, -64, -64, -64, 64, -64, 64, -64, -64, 64, -64, -64, -64, 64, 64, 64, -64, -64, -64, -64, -64, -64, -64, -64, -64, 64, -64, -64, -64, -64, -64, -64, 64, -64, 64, -64, 64, 64, -64, 64, 64, 64, -64, 64, -64, 64, -64, -64, 64, 64, -64, -64, 64, -64, -64, -64, -64, -64, -64, -64, -64, -64, -64, -64, 64, 64, -64, 64, 64, -64, -64, 64, -64, -64, -64, 64, -64, -64, 64, -64, -64, -64, 64, 64, -64, -64, -64, 64, -64, -64, 64, -64, 64, -64, -64, 64, 64, 64, 64, 64, -64, -64, -64, -64, 64, 64, 64, -64, -64, 64, -64, -64, -64, 64, -64, 64, -64, -64, -64, -64, 64, 64, -64, -64, -64, -64, -64, -64, -64, -64, 64, -64, -64, -64, -64, 64, 64, -64, -64, -64, 64, -64, -64, 64, -64, -64, -64, -64, 64, 64, 64, 64, -64, 64, 64, 64, -64, 64, -64, -64, 64, -64, -64, -64, 64, -64, -64, -64, 64, -64, 64, -64, 64, 64, -64, 64, -64, 64, 64, 64, 64, 64, -64, 64, 64, 64, 64, 64, 64, 64, -64, 64, -64, -64, -64, -64, 64, -64, -64, -64, 64, 64, -64, -64, -64, 64, -64, -64, -64, 64, -64, 64, -64, 64, -64, -64, 64, -64, -64, -64, 64, -64, 64, -64, 64, -64, 64, -64, 64, -64, -64, 64, 64, -64, 64, -64, 64, 64, 64, 64, -64, 64, -64, 64, -64, -64, -64, -64, -64, -64, 64, 64, 64, 64, -64, 64, 64, 64, -64, -64, 64, 64, 64, -64, 64, -64, -64, -64, -64, 64, 64, 64, 64, -64, -64, -64, -64, -64, 64, 64, -64, -64, -64, 64, 64, -64, -64, -64, 64, -64, -64, -64, 64, -64, 64, 64, -64, 64, 64, -64, 64, -64, 64, 64, 64, -64, 64, 64, -64, 64, -64, -64, -64, 64, -64, -64, 64, 64, -64, -64, -64, -64, -64, -64, -64, -64, 64, -64, 64, -64, 64, -64, 64, 64, 64, -64, 64, 64, 64, 64, -64, 64, -64, 64, -64, -64, -64, 64, -64, -64, -64, 64, 64, 64, -64, -64, 64, 64, -64, -64, 64, 64, -64, -64, -64, -64, -64, 64, 64, 64, -64, -64, -64, -64, -64, 64, 64, 64, -64, -64, 64, 64, -64, -64, 64, 64, -64, -64, 64, 64, 64, -64, 64, -64, -64, 64, -64, -64, 64, 64, 64, -64, -64, 64, -64, 64, 64, -64, 64, 64, 64, -64, -64, -64, 64, 64, -64, 64, -64, -64, -64, -64, -64, 64, 64, -64, 64, 64, 64, -64, 64, -64, -64, 64, 64, 64, 64, -64, -64, -64, 64, -64, 64, -64, 64, -64, 64, -64, -64, 64, 64, -64, -64, -64, 64, -64, 64, -64, -64, 64, 64, -64, -64, -64, -64, 64, -64, -64, -64, -64, -64, -64, -64, 64, 64, -64, -64, 64, -64, -64, 64, 64, -64, 64, 64, -64, -64, 64, 64, -64, 64, 64, -64, -64, -64, 64, -64, -64, 64, -64, -64, 64, -64, -64, -64, -64, -64, 64, -64, 64, -64, 64, -64, 64, 64, -64, 64, 64, -64, 64, 64, 64, -64, 64, -64, -64, -64, -64, 64, -64, -64, -64, 64, -64, -64, -64, -64, -64, -64, 64, 64, -64, -64, -64, 64, 64, -64, 64, -64, -64, -64, -64, -64, -64, -64, -64, 64, -64, -64, 64, -64, 64, -64, 64, 64, 64, -64, 64, 64, -64, 64, -64, -64, -64, -64, -64, -64, 64, 64, -64, -64, -64, 64, -64, -64, -64, 64, -64, -64, -64, -64, -64, 64, -64, 64, 64, -64, -64, 64, -64, 64, -64, -64, -64, 64, -64, 64, -64, 64, -64, -64, 64, -64, -64, -64, -64, -64, -64, -64, -64, 64, 64, 64, 64, 64, 64, 64, 64, 64, -64, -64, 64, -64, 64, -64, -64, -64, -64, 64, 64, -64, -64, -64, -64, 64, -64, 64, -64, -64, -64, 64, -64, -64, 64, -64, -64, 64, -64, 64, 64, 64, -64, -64, -64, -64, -64, 64, 64, -64, -64, -64, -64, 64, -64, 64, -64, -64, -64, -64, 64, -64, -64, 64, -64, -64, 64, 64, -64, -64, 64, 64, 64, -64, -64, 64, 64, 64, -64, -64, -64, -64, -64, -64, -64, -64, 64, -64, -64, 64, 64, 64, 64, -64, -64, -64, -64, 64, -64, 64, 64, -64, -64, -64, -64, -64, -64, -64, -64, 64, -64, -64, -64, 64, -64, 64, -64, 64, 64, 64, 64, 64, -64, -64, -64, -64, -64, -64, -64, -64, -64, 64, 64, -64, -64, -64, -64, -64, -64, -64, -64, -64, -64, -64, 64, -64, 64, 64, -64, -64, -64, -64, -64, -64, -64, -64, -64, -64, -64, -64, -64, 64, 64, 64, -64, -64, -64, -64, -64, -64, -64, -64, 64, -64, 64, -64, -64, 64, 64, -64, 64, -64, -64, -64, -64, -64, -64, -64, 64, 64, 64, -64, 64, -64, -64, -64, -64, -64, 64, 64, 64, -64, 64, 64, -64, 64, -64, 64, -64, -64, -64, 64, 64, -64, -64, -64, -64, -64, 64, 64, 64, -64, 64, 64, -64, -64, -64, 64, 64, 64, 64, -64, -64, 64, 64, -64, -64, -64, -64, 64, -64, -64, -64, -64, -64, -64, -64, -64, 64, 64, -64, 64, -64, -64, -64, 64, -64, 64, 64, 64, -64, -64, 64, -64, -64, -64, 64, 64, -64, 64, -64, 64, -64, 64, 64, 64, 64, -64, -64, -64, -64, -64, 64, 64, 64, 64, -64, 64, 64, -64, -64, 64, 64, 64, 64, 64, -64, -64, -64, -64, -64, -64, 64, -64, 64, -64, 64, 64, 64, -64, 64, -64, -64, 64, -64, -64, 64, -64, 64, 64, -64, 64, 64, -64, 64, 64, 64, -64, -64, -64, -64, 64, -64, -64, -64, -64, -64, 64, 64, -64, -64, -64, -64, 64, 64, -64, -64, 64, 64, -64, -64, -64, 64, 64, -64, -64, 64, -64, 64, 64, -64, -64, 64, 64, -64, -64, 64, 64, 64, -64, 64, -64, 64, 64, -64, 64, -64, 64, 64, -64, -64, 64, 64, 64, 64, -64, 64, -64, 64, -64, -64, -64, -64, -64, 64, -64, -64, -64, -64, -64, 64, -64, 64, 64, 64, 64, -64, 64, -64, -64, -64, -64, -64, -64, -64, 64, -64, -64, -64, 64, -64, 64, 64, -64, -64, 64, 64, 64, -64, 64, -64, 64, -64, 64, 64, -64, -64, -64, 64, -64, -64, -64, 64, 64, -64, 64, 64, 64, -64, -64, -64, 64, -64, -64, 64, 64, 64, -64, -64, 64, 64, -64, -64, -64, -64, 64, -64, -64, 64, 64, 64, 64, 64, -64, 64, -64, 64, 64, 64, -64, 64, -64, -64, 64, -64, -64, 64, -64, -64, 64, 64, 64, 64, 64, 64, -64, 64, 64, 64, -64, -64, 64, 64, 64, 64, 64, -64, 64, -64, -64, -64, 64, 64, -64, -64, 64, 64, -64, -64, -64, -64, -64, -64, 64, -64, 64, -64, 64, -64, -64, -64, -64, 64, -64, 64, 64, 64, -64, -64, -64, 64, -64, -64, -64, -64, -64, -64, 64, 64, 64, -64, 64, 64, 64, -64, 64, 64, -64, -64, -64, -64, 64, 64, 64, 64, -64, 64, 64, -64, -64, 64, -64, 64, 64, 64, 64, -64, -64, -64, -64, 64, 64, 64, 64, -64, 64, 64, -64, -64, -64, 64, -64, 64, 64, 64, -64, -64, -64, 64, 64, -64, 64, 64, -64, 64, -64, 64, 64, -64, -64, -64, -64, -64, 64, -64, 64, -64, 64, 64, 64, -64, -64, -64, 64, 64, 64, 64, 64, 64, 64, 64, 64, 64, 64, 64, -64, 64, -64, -64, 64, -64, 64, 64, -64, 64, -64, -64, 64, -64, -64, -64, 64, -64, -64, 64, 64, 64, 64, 64, 64, 64, 64, 64, 64, 64, 64, 64, -64, -64, -64, 64, 64, -64, 64, -64, -64, -64, -64, -64, 64, 64, -64, 64, 64, -64, 64, 64, 64, 64, -64, 64, 64, -64, -64, 64, 64, -64, 64, -64, 64, -64, 64, -64, 64, 64, -64, -64, 64, 64, 64, -64, 64, 64, 64, -64, 64, 64, 64, 64, 64, 64, 64, 64, -64, 64, 64, 64, 64, 64, 64, 64, 64, 64, -64, 64, 64, 64, 64, 64, 64, -64, -64, 64, 64, -64, 64, 64, 64, -64, -64, 64, 64, -64, -64, -64, -64, 64, -64, -64, 64, 64, 64, 64, 64, -64, 64, -64, -64, -64, 64, 64, 64, 64, 64, 64, -64, -64, 64, 64, 64, 64, 64, -64, -64, 64, 64, -64, -64, -64, 64, 64, -64, -64, -64, 64, -64, 64, 64, 64, 64, -64, -64, 64, 64, -64, 64, 64, -64, -64, 64, 64, 64, -64, -64, -64, 64, 64, 64, -64, -64, -64, -64, -64, 64, 64, -64, 64, 64, 64, -64, -64, -64, 64, 64, 64, 64, 64, 64, -64, -64, -64, -64, 64, -64, 64, -64, 64, 64, 64, -64, -64, -64, 64, 64, -64, 64, -64, 64, 64, -64, 64, 64, 64, 64, 64, 64, 64, -64, 64, 64, 64, 64, 64, -64, 64, -64, 64, -64, 64, 64, 64, 64, 64, 64, -64, 64, -64, 64, -64, 64, 64, 64, 64, 64, 64, -64, 64, 64, -64, -64, 64, -64, -64, 64, -64, 64, -64, 64, 64, -64, 64, 64, 64, 64, 64, -64, 64, 64, 64, 64, 64, -64, 64, 64, -64, -64, -64, -64, 64, 64, -64, 64, -64, -64, -64, -64, 64, 64, 64, -64, -64, -64, 64, -64, 64, 64, 64, 64, 64, 64, 64, -64, 64, 64, 64, -64, 64, 64, 64, -64, -64, -64, -64, -64, -64, 64, -64, 64, -64, -64, 64, -64, 64, 64, 64, 64, 64, 64, -64, 64, -64, 64, 64, 64, -64, 64, -64, -64, -64, 64, 64, 64, 64, 64, -64, -64, -64, -64, 64, 64, 64, 64, -64, 64, 64, 64, 64, 64, 64, 64, -64, -64, -64, -64, -64, 64, -64, -64, 64, 64, -64, -64, -64, 64, 64, -64, 64, -64, 64, 64, 64, 64, -64, 64, 64, -64, -64, 64, 64, -64, -64, 64, 64, 64, 64, -64, -64, 64, 64, -64, 64, -64, 64, -64, 64, 64, 64, 64, 64, -64, 64, 64, -64, 64, 64, -64, -64, -64, 64, 64, -64, 64, 64, -64, -64, 64, 64, 64, -64, -64, 64, -64, 64, 64, 64, 64, 64, -64, -64, 64, 64, 64, -64, -64, 64, -64, 64, -64, 64, 64, -64, 64, 64, -64, -64, -64, -64, -64, 64, 64, -64, 64, 64, -64, -64, 64, 64, 64, 64, 64, 64, -64, 64, 64, 64, -64, -64, -64, 64, -64, 64, -64, 64, -64, -64, -64, 64, 64, -64, 64, 64, 64, 64, 64, 64, -64, 64, 64, -64, 64, -64, 64, 64, -64, 64, -64, -64, 64, -64, 64, -64, 64, -64, -64, 64, 64, -64, -64, -64, 64, 64, 64, 64, 64, 64, 64, -64, 64, -64, 64, 64, 64, 64, -64, 64, 64, 64, 64, 64, 64, 64, 64, 64, -64, -64, 64, -64, -64, 64, 64, 64, 64, 64, 64, 64, -64, -64, -64, 64, -64, 64, 64, 64, -64, 64, -64, -64, -64, 64, 64, -64, 64, 64, 64, -64, 64, 64, 64, 64, 64, 64, 64, -64, -64, -64, 64, -64, 64, 64, 64, 64, -64, -64, 64, -64, -64, 64, 64, -64, -64, -64, 64, -64, -64, -64, 64, 64, 64, 64, 64, 64, -64, 64, -64, 64, 64, 64, 64, 64, -64, 64, 64, -64, 64, -64, -64, 64, -64, 64, 64, -64, -64, -64, 64, -64, 64, 64, -64, 64, 64, -64, -64, 64, -64, 64, 64, -64, 64, 64, 64, -64, 64, -64, 64, -64, -64, -64, -64, 64, 64, 64, 64, -64, -64, -64, -64, 64, 64, 64, 64, 64, -64, 64, -64, 64, -64, -64, 64, -64, 64, 64, 64, 64, -64, 64, -64, -64, 64, -64, 64, -64, 64, -64, -64, -64, 64, -64, -64, -64, -64, 64, 64, 64, 64, 64, -64, 64, -64, -64, 64, 64, -64, 64, -64, -64, 64, -64, 64, 64, 64, -64, -64, -64, 64, 64, 64, -64, 64, -64, -64, -64, -64, 64, -64, -64, -64, 64, -64, 64, -64, 64, -64, -64, -64, -64, -64, 64, 64, -64, 64, 64, 64, 64, -64, -64, 64, 64, -64, -64, 64, 64, 64, -64, -64, -64, 64, 64, -64, 64, -64, -64, 64, -64, -64, 64, -64, -64, -64, -64, -64, -64, 64, -64, -64, -64, -64, 64, -64, -64, 64, -64, 64, 64, 64, 64, 64, 64, 64, -64, -64, -64, 64, 64, -64, 64, -64, -64, -64, 64, 64, -64, -64, -64, 64, 64, -64, -64, 64, -64, 64, 64, 64, 64, 64, 64, 64, 64, -64, 64, -64, 64, 64, 64, -64, -64, -64, 64, -64, -64, -64, 64, 64, -64, -64, -64, -64, 64, 64, 64, 64, 64, 64, 64, 64, 64, 64, 64, -64, 64, 64, 64, 64, 64, 64, -64, 64, 64, 64, -64, -64, 64, 64, -64, 64, 64, 64, 64, 64, 64, 64, 64, 64, -64, -64, -64, 64, 64, 64, 64, -64, 64, -64, 64, -64, -64, 64, 64, 64, -64, -64, 64, 64, -64, -64, 64, 64, 64, 64, -64, 64, -64, -64, -64, -64, 64, 64, -64, -64, 64, -64, 64, -64, -64, -64, -64, 64, 64, -64, -64, 64, 64, -64, 64, 64, 64, 64, -64, -64, -64, -64, -64, 64, 64, -64, 64, 64, 64, -64, 64, -64, -64, 64, -64, -64, 64, -64, 64, 64, -64, 64, 64, -64, 64, 64, 64, 64, 64, -64, 64, -64, 64, 64, -64, -64, -64, 64, 64, -64, -64, -64, -64, -64, 64, -64, -64, -64, 64, 64, 64, 64, 64, 64, 64, 64, -64, 64, -64, -64, 64, 64, 64, 64, -64, 64, 64, 64, -64, -64, -64, 64, 64, -64, 64, -64, -64, -64, -64, 64, 64, 64, 64, 64, 64, 64, -64, -64, 64, 64, 64, 64, -64, 64, 64, 64, 64, -64, -64, 64, -64, -64, 64, 64, -64, 64, 64, 64, 64, 64, 64, 64, 64, 64, -64, 64, 64, 64, 64, 64, 64, 64, 64, -64, 64, 64, 64, 64, 64, 64, -64, -64, 64, 64, 64, 64, 64, 64, 64, -64, -64, -64, 64, -64, 64, 64, 64, 64, 64, 64, 64, 64, 64, 64, 64, 64, 64, 64, 64, -64, 64, -64, 64, 64, 64, -64, -64, 64, 64, -64, -64, -64, 64, 64, 64, 64, 64, 64, 64, 64, 64, 64, -64, 64, -64, 64, 64, 64, 64, -64, 64, 64, 64, -64, -64, -64, -64, 64, 64, -64, 64, 64, 64, 64, 64, 64, 64, 64, 64, 64, 64, -64, 64, 64, 64, -64, 64, 64, 64, 64, -64, -64, -64, -64, 64, 64, 64, -64, 64, 64, 64, 64, 64, 64, 64, 64, 64, 64, 64, 64, -64, 64, -64, 64, 64, 64, 64, 64, -64, -64, -64, 64, 64, 64, 64, 64, 64, 64, 64, 64, 64, 64, 64, 64, 64, -64, -64, 64, 64, -64, -64, -64, -64, 64, 64, -64, -64, -64, 64, 64, 64, 64, -64, -64, 64, 64, -64, 64, 64, 64, 64, -64, 64, -64, -64, -64, -64, -64, 64, -64, 64, -64, -64, -64, -64, 64, 64, 64, 64, -64, 64, 64, -64, 64, -64, 64, 64, 64, 64, -64, -64, 64, -64, 64, 64, 64, -64, 64, 64, 64, -64, -64, -64, 64, -64, -64, -64, 64, -64, 64, 64, -64, 64, 64, 64, 64, 64, -64, 64, -64, -64, -64, 64, -64, -64, -64, 64, 64, -64, -64, -64, 64, -64, -64, -64, -64, 64, -64, 64, 64, 64, 64, 64, -64, 64, -64, -64, -64, -64, -64, 64, -64, -64, -64, 64, 64, 64, 64, 64, 64, 64, 64, 64, 64, 64, 64, 64, 64, 64, 64, 64, 64, 64, 64, -64, 64, 64, 64, -64, 64, -64, 64, 64, 64, 64, -64, 64, 64, 64, 64, 64, 64, -64, 64, -64, 64, -64, 64, 64, 64, -64, -64, 64, 64, 64, -64, 64, -64, -64, -64, -64, 64, -64, 64, 64, 64, 64, -64, 64, 64, 64, 64, -64, 64, 64, 64, -64, -64, -64, 64, 64, -64, 64, 64, -64, 64, -64, -64, 64, -64, -64, 64, -64, 64, 64, -64, 64, -64, -64, -64, -64, 64, -64, -64, 64, -64, 64, 64, -64, 64, 64, 64, -64, 64, 64, 64, -64, 64, -64, -64, -64, 64, -64, 64, -64, 64, -64, -64, -64, -64, 64, 64, 64, -64, 64, 64, 64, -64, -64, -64, -64, -64, -64, 64, -64, -64, 64, 64, -64, -64, -64, -64, 64, -64, -64, 64, -64, -64, -64, -64, -64, 64, -64, -64, 64, 64, -64, 64, 64, -64, 64, -64, 64, -64, -64, -64, 64, 64, 64, 64, -64, -64, 64, 64, 64, -64, 64, -64, -64, -64, 64, 64, -64, -64, 64, 64, 64, -64, 64, 64, 64, 64, -64, 64, -64, 64, 64, 64, 64, 64, 64, 64, -64, -64, -64, -64, -64, -64, -64, 64, -64, 64, 64, 64, -64, -64, -64, 64, 64, 64, 64, 64, 64, 64, 64, 64, -64, 64, 64, 64, -64, -64, -64, -64, -64, -64, -64, -64, -64, -64, -64, -64, -64, 64, -64, 64, 64, 64, 64, 64, 64, 64, -64, -64, -64, 64, -64, 64, 64, -64, -64, -64, -64, -64, -64, -64, -64, -64, 64, -64, 64, -64, 64, 64, 64, 64, 64, -64, 64, -64, -64, -64, 64, -64, -64, 64, 64, -64, -64, -64, -64, -64, -64, -64, -64, -64, 64, -64, 64, 64, -64, -64, 64, 64, 64, 64, 64, 64, 64, 64, 64, 64, 64, -64, 64, 64, 64, -64, 64, -64, 64, -64, 64, 64, -64, -64, 64, 64, -64, 64, 64, 64, 64, -64, 64, 64, 64, 64, 64, 64, 64, 64, 64, 64, 64, 64, -64, 64, 64, 64, -64, -64, -64, 64, -64, -64, 64, 64, -64, 64, 64, 64, 64, 64, 64, -64, -64, 64, 64, 64, 64, 64, -64, 64, 64, -64, -64, -64, -64, -64, 64, -64, 64, -64, 64, 64, -64, 64, 64, -64, 64, 64, -64, -64, -64, -64, 64, 64, -64, -64, 64, -64, -64, -64, -64, 64, -64, -64, -64, 64, 64, -64, 64, -64, -64, 64, -64, 64, -64, -64, -64, -64, -64, -64, 64, -64, 64, -64, 64, -64, -64, -64, -64, 64, 64, -64, -64, 64, 64, 64, 64, -64, -64, -64, -64, 64, -64, -64, -64, -64, -64, -64, -64, -64, 64, -64, -64, -64, -64, -64, 64, -64, 64, 64, 64, 64, 64, -64, 64, 64, -64, -64, -64, -64, 64, -64, -64, -64, -64, -64, -64, 64, 64, 64, -64, -64, -64, 64, -64, 64, 64, 64, 64, 64, -64, -64, -64, -64, -64, -64, -64, 64, -64, -64, -64, -64, -64, -64, -64, 64, 64, 64, -64, -64, -64, 64, 64, 64, 64, -64, 64, -64, 64, -64, 64, -64, -64, -64, -64, -64, 64, -64, -64, -64, -64, 64, -64, 64, 64, -64, -64, -64, 64, 64, 64, 64, 64, 64, 64, 64, 64, 64, -64, 64, 64, 64, 64, 64, 64, 64, 64, 64, -64, -64, 64, 64, 64, 64, -64, -64, -64, -64, 64, 64, 64, 64, 64, 64, 64, -64, 64, 64, 64, 64, 64, 64, -64, -64, 64, 64, 64, 64, 64, 64, -64, -64, -64, -64, -64, 64, -64, -64, 64, 64, 64, 64, 64, -64, -64, 64, 64, 64, -64, 64, 64, 64, 64, -64, -64, 64, 64, 64, -64, -64, 64, -64, -64, 64, -64, 64, 64, 64, -64, 64, -64, 64, -64, 64, -64, -64, -64, -64, 64, 64, 64, -64, 64, 64, 64, 64, -64, -64, -64, 64, 64, 64, 64, 64, 64, 64, -64, 64, 64, -64, 64, -64, -64, -64, -64, -64, -64, -64, 64, 64, 64, 64, 64, -64, 64, -64, 64, -64, 64, 64, 64, 64, 64, 64, 64, 64, 64, 64, -64, 64, 64, -64, -64, -64, -64, 64, 64, 64, 64, 64, 64, -64, -64, -64, -64, -64, 64, 64, 64, 64, 64, 64, 64, 64, -64, -64, 64, -64, -64, -64, -64, -64, -64, 64, 64, 64, -64, -64, -64, -64, -64, -64, -64, -64, -64, 64, 64, 64, 64, -64, 64, -64, -64, 64, -64, 64, 64, -64, -64, 64, -64, 64, 64, 64, -64, 64, 64, -64, -64, -64, -64, -64, -64, -64, 64, -64, 64, -64, 64, 64, 64, -64, 64, -64, 64, -64, 64, 64, -64, -64, 64, -64, 64, 64, 64, -64, -64, -64, -64, -64, -64, -64, -64, -64, 64, -64, 64, -64, 64, -64, -64, -64, -64, 64, -64, 64, 64, -64, 64, 64, 64, 64, -64, -64, -64, -64, -64, -64, -64, -64, -64, -64, -64, -64, 64, 64, 64, -64, -64, 64, -64, -64, -64, 64, 64, 64, 64, 64, -64, 64, -64, -64, -64, 64, -64, -64, -64, -64, 64, 64, -64, 64, 64, 64, -64, 64, 64, 64, -64, -64, 64, 64, -64, 64, 64, -64, 64, -64, -64, 64, -64, -64, 64, 64, -64, 64, -64, -64, 64, 64, -64, -64, 64, 64, 64, -64, -64, -64, 64, -64, -64, -64, -64, -64, 64, -64, -64, 64, 64, -64, -64, -64, 64, -64, 64, -64, -64, 64, 64, -64, 64, 64, -64, 64, -64, -64, 64, 64, -64, 64, 64, 64, 64, 64, -64, -64, -64, -64, -64, -64, -64, -64, 64, 64, -64, 64, -64, -64, 64, -64, 64, 64, -64, -64, -64, -64, -64, 64, 64, 64, 64, 64, 64, 64, -64, 64, -64, -64, -64, 64, 64, 64, 64, -64, 64, 64, -64, 64, 64, 64, -64, 64, 64, 64, 64, 64, 64, 64, 64, 64, 64, 64, 64, 64, 64, 64, 64, 64, 64, 64, 64, 64, 64, -64, -64, -64, 64, 64, -64, -64, -64, 64, -64, -64, -64, -64, -64, -64, 64, 64, 64, 64, -64, 64, 64, 64, 64, -64, -64, -64, -64, -64, -64, 64, 64, -64, -64, 64, -64, -64, -64, -64, -64, -64, -64, -64, -64, -64, -64, -64, -64, 64, 64, 64, 64, 64, -64, 64, 64, 64, -64, -64, -64, -64, -64, -64, -64, -64, -64, -64, -64, -64, 64, 64, 64, -64, -64, 64, 64, 64, 64, 64, 64, 64, -64, -64, -64, -64, -64, -64, -64, -64, 64, -64, -64, -64, -64, -64, 64, -64, 64, 64, 64, -64, -64, 64, -64, 64, 64, 64, 64, 64, 64, 64, -64, -64, 64, 64, -64, -64, -64, -64, -64, -64, -64, -64, -64, 64, 64, -64, -64, 64, -64, 64, -64, -64, 64, -64, 64, -64, -64, 64, 64, -64, 64, -64, -64, -64, 64, -64, -64, -64, -64, 64, 64, -64, -64, -64, -64, -64, -64, -64, -64, 64, 64, -64, -64, -64, 64, -64, -64, -64, 64, 64, -64, -64, -64, -64, -64, -64, -64, -64, 64, 64, -64, -64, -64, -64, -64, -64, -64, -64, 64, 64, -64, 64, 64, -64, -64, -64, -64, 64, -64, -64, -64, -64, -64, -64, 64, 64, 64, -64, 64, -64, -64, -64, -64, 64, 64, 64, 64, 64, -64, -64, -64, -64, -64, 64, -64, 64, 64, -64, -64, -64, 64, 64, 64, -64, -64, -64, 64, 64, 64, 64, 64, -64, 64, 64, 64, 64, -64, 64, 64, -64, -64, 64, 64, -64, 64, -64, -64, -64, 64, -64, 64, 64, -64, 64, 64, 64, 64, 64, 64, -64, 64, 64, 64, 64, -64, 64, 64, -64, 64, 64, -64, -64, -64, -64, -64, 64, -64, 64, 64, -64, -64, 64, 64, 64, 64, 64, 64, 64, 64, 64, -64, -64, -64, -64, -64, 64, 64, -64, 64, -64, 64, 64, 64, 64, 64, -64, 64, 64, 64, 64, 64, 64, -64, 64, 64, 64, -64, -64, -64, -64, -64, -64, -64, -64, -64, -64, 64, -64, 64, 64, 64, 64, 64, 64, 64, 64, 64, 64, 64, 64, 64, 64, 64, 64, -64, -64, -64, -64, -64, -64, -64, -64, 64, 64, 64, 64, 64, 64, -64, -64, 64, 64, 64, 64, 64, 64, 64, 64, 64, 64, 64, 64, -64, -64, -64, -64, -64, -64, -64, -64, 64, 64, -64, 64, 64, -64, -64, -64, 64, 64, 64, 64, 64, 64, 64, 64, -64, -64, 64, 64, -64, -64, -64, -64, -64, 64, -64, 64, 64, -64, -64, -64, -64, 64, -64, 64, 64, 64, 64, 64, 64, 64, -64, -64, -64, -64, 64, -64, 64, 64, -64, -64, -64, -64, 64, 64, 64, -64, 64, 64, -64, 64, -64, 64, -64, 64, 64, 64, -64, -64, -64, -64, -64, -64, 64, 64, -64, 64, -64, 64, -64, 64, -64, 64, 64, -64, 64, -64, 64, 64, -64, -64, -64, 64, -64, -64, -64, -64, -64, -64, -64, -64, 64, 64, -64, 64, -64, -64, -64, 64, -64, 64, 64, -64, -64, -64, -64, 64, 64, -64, -64, -64, -64, -64, -64, -64, -64, -64, 64, 64, 64, 64, 64, -64, -64, -64, -64, -64, -64, 64, -64, -64, -64, 64, -64, 64, -64, 64, 64, -64, -64, -64, -64, -64, -64, 64, 64, 64, 64, 64, -64, -64, 64, -64, -64, -64, -64, -64, -64, -64, -64, -64, -64, -64, -64, -64, -64, 64, -64, -64, -64, -64, -64, 64, 64, 64, 64, 64, 64, 64, 64, -64, 64, 64, 64, -64, -64, 64, 64, -64, -64, -64, 64, 64, 64, -64, -64, 64, -64, -64, 64, -64, -64, 64, 64, 64, 64, -64, -64, -64, -64, 64, 64, -64, -64, 64, -64, 64, -64, 64, 64, 64, 64, 64, -64, -64, -64, -64, -64, -64, 64, -64, 64, 64, -64, -64, -64, 64, 64, -64, -64, 64, -64, -64, -64, 64, 64, 64, 64, 64, 64, 64, -64, -64, 64, -64, -64, -64, -64, -64, 64, -64, -64, -64, -64, -64, -64, -64, -64, 64, 64, 64, -64, -64, -64, 64, 64, 64, -64, 64, -64, -64, 64, -64, -64, 64, 64, -64, -64, 64, -64, 64, 64, 64, -64, 64, 64, 64, 64, 64, -64, 64, -64, 64, -64, 64, 64, 64, -64, -64, 64, 64, 64, -64, -64, -64, -64, -64, 64, 64, 64, -64, -64, 64, -64, 64, 64, 64, 64, 64, -64, -64, 64, 64, -64, 64, 64, 64, -64, -64, -64, -64, 64, 64, 64, -64, 64, -64, -64, 64, -64, -64, 64, 64, -64, -64, 64, 64, 64, 64, -64, 64, 64, 64, -64, -64, -64, -64, -64, 64, 64, 64, 64, 64, -64, 64, 64, -64, 64, 64, -64, -64, 64, -64, -64, -64, 64, 64, -64, -64, -64, 64, -64, 64, 64, -64, 64, -64, 64, 64, 64, 64, 64, 64, 64, 64, 64, 64, 64, 64, 64, -64, 64, 64, -64, -64, -64, -64, -64, 64, 64, 64, -64, -64, -64, -64, -64, 64, -64, 64, 64, 64, -64, 64, 64, -64, 64, 64, 64, -64, 64, -64, -64, 64, -64, -64, -64, -64, -64, -64, -64, -64, -64, 64, 64, -64, -64, 64, 64, -64, 64, 64, 64, 64, 64, -64, -64, -64, 64, -64, 64, -64, -64, -64, -64, -64, -64, -64, -64, -64, -64, 64, -64, -64, 64, -64, 64, 64, -64, 64, -64, 64, 64, -64, -64, -64, 64, -64, -64, -64, -64, 64, -64, -64, -64, -64, -64, 64, 64, 64, 64, 64, -64, -64, -64, 64, 64, -64, -64, -64, -64, -64, -64, 64, 64, 64, -64, -64, -64, -64, -64, -64, -64, -64, -64, -64, 64, -64, -64, -64, -64, -64, -64, 64, -64, -64, -64, -64, -64, -64, 64, -64, -64, 64, 64, -64, 64, -64, 64, -64, -64, -64, 64, -64, 64, -64, -64, 64, 64, -64, -64, 64, 64, -64, -64, -64, -64, -64, 64, 64, -64, -64, -64, 64, 64, -64, -64, -64, -64, -64, -64, -64, -64, -64, 64, -64, 64, 64, -64, 64, -64, 64, -64, -64, -64, 64, 64, 64, -64, -64, -64, -64, -64, -64, -64, -64, -64, -64, 64, 64, 64, -64, -64, 64, 64, 64, -64, 64, -64, 64, -64, -64, -64, 64, -64, -64, -64, 64, -64, -64, -64, 64, -64, -64, -64, 64, 64, 64, 64, -64, 64, 64, 64, 64, -64, -64, 64, 64, -64, 64, 64, -64, -64, 64, 64, -64, -64, -64, -64, -64, -64, -64, -64, -64, 64, -64, 64, -64, 64, 64, 64, -64, -64, -64, -64, 64, 64, 64, -64, 64, -64, 64, -64, 64, -64, -64, -64, 64, -64, -64, 64, -64, -64, -64, -64, 64, 64, 64, 64, 64, -64, -64, -64, -64, 64, -64, -64, -64, -64, -64, -64, 64, -64, 64, 64, -64, -64, -64, 64, 64, 64, -64, -64, 64, 64, 64, 64, 64, -64, -64, -64, -64, -64, 64, 64, 64, 64, -64, 64, -64, 64, 64, 64, -64, -64, 64, 64, 64, 64, 64, 64, 64, 64, 64, 64, 64, -64, -64, -64, -64, -64, -64, 64, 64, 64, -64, 64, -64, -64, 64, 64, 64, 64, 64, 64, -64, -64, 64, 64, 64, 64, 64, 64, 64, -64, -64, -64, -64, -64, 64, 64, 64, 64, 64, -64, -64, 64, 64, -64, 64, 64, -64, 64, 64, -64, 64, 64, 64, 64, 64, 64, -64, -64, -64, -64, -64, -64, 64, -64, -64, 64, -64, 64, 64, -64, 64, 64, -64, -64, 64, 64, -64, -64, 64, 64, 64, 64, 64, 64, -64, -64, -64, -64, -64, -64, -64, 64, -64, -64, 64, 64, 64, -64, 64, -64, -64, -64, -64, -64, -64, 64, 64, 64, -64, 64, 64, -64, -64, -64, -64, -64, -64, -64, 64, 64, -64, 64, -64, -64, -64, 64, 64, -64, 64, -64, -64, -64, -64, 64, 64, 64, -64, 64, -64, -64, -64, -64, -64, -64, -64, 64, -64, -64, -64, 64, 64, -64, 64, -64, 64, 64, 64, 64, -64, -64, -64, -64, -64, -64, -64, -64, -64, -64, -64, -64, -64, -64, 64, 64, 64, -64, 64, -64, -64, 64, -64, -64, -64, 64, 64, -64, 64, 64, -64, -64, 64, -64, -64, -64, -64, -64, -64, -64, -64, -64, 64, 64, 64, 64, 64, -64, 64, -64, -64, 64, 64, -64, -64, -64, 64, 64, 64, 64, 64, 64, -64, -64, -64, -64, -64, -64, -64, -64, -64, -64, -64, 64, 64, 64, 64, -64, 64, -64, 64, -64, 64, -64, 64, 64, 64, 64, -64, -64, -64, 64, -64, -64, -64, -64, 64, -64, -64, 64, 64, 64, 64, 64, 64, 64, 64, 64, -64, 64, 64, 64, 64, -64, 64, 64, 64, 64, 64, 64, -64, 64, -64, 64, -64, -64, -64, 64, 64, -64, 64, 64, 64, 64, -64, 64, 64, 64, -64, -64, -64, 64, 64, -64, 64, -64, 64, -64, -64, 64, -64, 64, -64, 64, 64, 64, -64, -64, -64, 64, 64, 64, 64, 64, 64, -64, -64, -64, 64, 64, -64, 64, 64, 64, -64, 64, 64, -64, 64, 64, 64, 64, 64, 64, 64, -64, -64, 64, 64, -64, 64, -64, 64, -64, -64, -64, -64, -64, 64, 64, -64, -64, 64, 64, -64, 64, -64, -64, -64, -64, -64, -64, 64, 64, -64, 64, -64, -64, 64, 64, 64, -64, -64, 64, 64, 64, 64, -64, -64, 64, -64, -64, -64, -64, -64, -64, -64, 64, -64, -64, -64, 64, 64, -64, -64, -64, -64, -64, 64, -64, -64, 64, -64, 64, 64, -64, 64, -64, -64, -64, 64, 64, 64, -64, -64, -64, 64, 64, -64, -64, -64, -64, 64, -64, -64, -64, 64, -64, 64, 64, -64, -64, -64, -64, -64, -64, 64, 64, 64, 64, 64, -64, -64, -64, -64, -64, -64, -64, 64, 64, -64, 64, 64, 64, 64, -64, -64, 64, -64, -64, -64, -64, -64, -64, -64, 64, 64, -64, -64, -64, -64, -64, -64, -64, -64, -64, 64, -64, -64, 64, -64, 64, 64, 64, 64, -64, -64, -64, -64, 64, 64, 64, -64, 64, -64, 64, 64, 64, -64, -64, -64, -64, -64, -64, -64, -64, 64, 64, -64, -64, -64, 64, -64, 64, 64, -64, 64, 64, -64, -64, 64, -64, -64, 64, 64, -64, -64, 64, 64, -64, -64, -64, -64, 64, -64, -64, 64, -64, -64, 64, -64, -64, -64, -64, 64, 64, -64, -64, -64, -64, 64, 64, 64, -64, -64, 64, -64, 64, -64, 64, -64, 64, -64, -64, -64, 64, -64, -64, -64, 64, -64, -64, -64, 64, 64, -64, 64, 64, 64, 64, -64, -64, -64, 64, -64, -64, -64, -64, -64, 64, 64, 64, -64, -64, -64, -64, -64, 64, -64, -64, -64, 64, -64, -64, -64, -64, 64, 64, 64, -64, -64, -64, 64, -64, -64, -64, 64, 64, 64, 64, 64, -64, -64, -64, -64, -64, 64, -64, -64, -64, -64, -64, -64, -64, 64, -64, -64, -64, -64, -64, -64, -64, -64, 64, 64, -64, 64, 64, -64, 64, -64, -64, -64, 64, -64, -64, -64, -64, -64, -64, -64, -64, 64, -64, -64, -64, 64, -64, -64, -64, -64, 64, 64, 64, 64, -64, 64, 64, -64, -64, -64, -64, -64, -64, -64, -64, -64, -64, 64, -64, -64, -64, -64, -64, -64, 64, -64, -64, -64, -64, 64, 64, 64, -64, 64, -64, -64, -64, -64, -64, -64, -64, -64, -64, -64, 64, 64, 64, -64, 64, 64, 64, 64, -64, -64, -64, -64, 64, 64, 64, -64, -64, -64, -64, 64, -64, -64, -64, -64, -64, -64, -64, 64, 64, 64, -64, 64, -64, -64, 64, -64, -64, -64, -64, -64, -64, 64, 64, 64, 64, 64, -64, 64, -64, -64, -64, -64, -64, -64, 64, 64, 64, 64, 64, -64, -64, 64, -64, -64, -64, -64, -64, 64, -64, 64, 64, 64, -64, -64, -64, -64, -64, -64, -64, -64, -64, 64, 64, 64, 64, 64, -64, -64, -64, -64, -64, -64, -64, 64, -64, 64, 64, 64, 64, -64, -64, -64, -64, -64, 64, -64, -64, -64, -64, 64, 64, 64, 64, 64, -64, -64, -64, -64, -64, -64, -64, 64, 64, 64, 64, 64, -64, 64, -64, 64, -64, -64, -64, -64, -64, -64, 64, 64, 64, -64, 64, 64, -64, -64, -64, -64, -64, -64, -64, -64, 64, 64, 64, 64, -64, -64, -64, -64, 64, 64, -64, -64, -64, -64, -64, -64, -64, -64, 64, 64, -64, -64, -64, -64, -64, 64, -64, 64, 64, 64, -64, 64, -64, 64, -64, 64, 64, 64, -64, 64, -64, -64, -64, -64, -64, -64, -64, -64, -64, -64, -64, -64, -64, 64, -64, 64, 64, 64, -64, -64, -64, -64, 64, 64, 64, -64, -64, -64, -64, -64, 64, -64, -64, -64, 64, 64, -64, 64, -64, -64, -64, 64, -64, 64, 64, 64, -64, -64, -64, 64, -64, 64, 64, 64, -64, -64, -64, -64, -64, -64, -64, -64, 64, 64, 64, 64, -64, -64, -64, -64, -64, -64, 64, 64, 64, -64, 64, 64, 64, -64, -64, 64, -64, -64, -64, 64, 64, -64, 64, -64, 64, 64, 64, 64, -64, -64, -64, -64, -64, -64, -64, -64, -64, 64, -64, 64, 64, 64, 64, -64, -64, 64, 64, -64, 64, 64, 64, 64, -64, -64, 64, -64, 64, 64, -64, -64, 64, -64, -64, -64, -64, 64, -64, -64, -64, 64, -64, -64, 64, -64, 64, 64, 64, -64, -64, -64, 64, -64, 64, 64, -64, 64, -64, 64, 64, 64, 64, 64, 64, 64, 64, 64, -64, 64, 64, -64, 64, -64, -64, -64, -64, -64, -64, 64, 64, -64, 64, -64, 64, 64, -64, 64, 64, -64, 64, -64, -64, -64, -64, -64, 64, 64, -64, -64, -64, 64, 64, -64, -64, -64, -64, -64, -64, 64, 64, -64, 64, 64, -64, -64, -64, -64, 64, -64, -64, 64, 64, 64, 64, 64, 64, 64, -64, -64, 64, 64, 64, -64, -64, 64, 64, 64, 64, 64, -64, -64, 64, -64, -64, -64, 64, 64, 64, 64, -64, -64, 64, 64, 64, -64, 64, -64, 64, 64, 64, -64, 64, 64, -64, 64, -64, 64, -64, -64, -64, -64, 64, 64, 64, 64, -64, 64, -64, 64, 64, -64, -64, 64, 64, 64, 64, 64, 64, -64, 64, 64, 64, 64, 64, -64, -64, 64, -64, -64, 64, -64, -64, -64, -64, -64, 64, -64, 64, 64, 64, 64, 64, 64, -64, 64, -64, 64, 64, -64, -64, -64, -64, -64, -64, 64, -64, 64, 64, 64, 64, -64, 64, 64, 64, -64, -64, -64, 64, -64, 64, -64, 64, 64, 64, -64, -64, 64, 64, -64, -64, -64, -64, 64, -64, -64, -64, -64, 64, 64, 64, 64, 64, 64, 64, -64, -64, 64, -64, 64, 64, 64, 64, -64, -64, -64, -64, -64, -64, -64, -64, 64, -64, -64, -64, -64, -64, 64, 64, -64, 64, -64, -64, -64, 64, 64, 64, 64, 64, 64, -64, 64, 64, 64, -64, -64, -64, -64, 64, 64, -64, -64, -64, -64, 64, -64, 64, 64, -64, 64, 64, -64, 64, 64, 64, 64, 64, 64, 64, 64, -64, -64, -64, -64, -64, -64, -64, -64, -64, -64, -64, -64, -64, 64, 64, -64, -64, -64, -64, -64, -64, -64, 64, 64, 64, 64, -64, 64, -64, -64, -64, -64, -64, -64, -64, 64, -64, -64, -64, 64, 64, 64, -64, 64, -64, -64, 64, 64, -64, -64, -64, 64, 64, -64, -64, 64, -64, -64, -64, -64, -64, -64, -64, -64, -64, -64, -64, 64, 64, -64, -64, 64, -64, -64, 64, 64, 64, -64, -64, 64, 64, 64, 64, 64, -64, -64, -64, -64, -64, -64, -64, -64, -64, -64, -64, 64, -64, 64, 64, -64, 64, 64, -64, -64, 64, 64, 64, -64, 64, -64, 64, 64, -64, -64, -64, -64, -64, -64, 64, 64, -64, -64, 64, -64, 64, -64, 64, -64, 64, -64, -64, 64, 64, 64, -64, -64, 64, 64, -64, 64, -64, -64, -64, -64, -64, -64, 64, 64, 64, -64, -64, 64, 64, -64, 64, 64, -64, -64, -64, 64, 64, 64, 64, 64, -64, 64, -64, 64, 64, -64, -64, -64, -64, -64, -64, 64, 64, -64, -64, -64, 64, 64, 64, 64, -64, -64, -64, -64, 64, 64, -64, -64, -64, 64, -64, -64, 64, 64, 64, 64, -64, -64, -64, -64, -64, -64, -64, -64, 64, 64, 64, 64, -64, 64, -64, -64, 64, 64, -64, -64, -64, -64, -64, 64, 64, 64, -64, 64, -64, -64, -64, -64, -64, -64, -64, -64, 64, 64, 64, 64, -64, -64, 64, -64, 64, -64, -64, -64, -64, -64, -64, -64, -64, 64, 64, 64, -64, -64, 64, -64, 64, -64, -64, -64, 64, 64, 64, 64, -64, -64, 64, -64, 64, -64, -64, -64, -64, -64, -64, -64, -64, 64, -64, 64, -64, -64, -64, -64, 64, -64, -64, -64, -64, -64, 64, -64, -64, 64, 64, -64, 64, -64, -64, -64, -64, -64, -64, -64, -64, -64, -64, -64, -64, 64, -64, -64, -64, 64, -64, 64, 64, -64, -64, -64, -64, -64, -64, 64, 64, -64, -64, -64, -64, -64, 64, -64, -64, -64, -64, -64, -64, -64, -64, 64, 64, 64, -64, 64, 64, 64, -64, 64, 64, -64, 64, 64, 64, 64, 64, -64, -64, 64, -64, -64, -64, -64, -64, -64, -64, 64, -64, 64, 64, -64, 64, -64, -64, 64, -64, -64, 64, -64, 64, 64, -64, 64, -64, 64, -64, -64, 64, 64, -64, -64, -64, 64, -64, -64, -64, 64, -64, -64, 64, 64, 64, -64, -64, 64, -64, -64, -64, 64, -64, 64, -64, 64, -64, 64, 64, 64, 64, -64, -64, -64, -64, -64, -64, -64, -64, -64, 64, -64, 64, 64, -64, -64, 64, -64, -64, -64, 64, 64, 64, 64, -64, -64, -64, 64, -64, -64, -64, -64, -64, -64, -64, -64, -64, -64, -64, 64, -64, 64, -64, -64, 64, 64, -64, 64, -64, 64, 64, -64, -64, -64, -64, -64, -64, 64, -64, 64, -64, -64, -64, -64, -64, -64, -64, -64, -64, 64, 64, 64, -64, 64, 64, -64, 64, -64, 64, -64, 64, -64, -64, -64, -64, 64, -64, -64, -64, -64, -64, -64, 64, -64, 64, -64, -64, 64, 64, 64, 64, 64, 64, 64, 64, 64, -64, 64, 64, -64, 64, 64, -64, -64, 64, 64, 64, 64, 64, -64, -64, -64, 64, 64, 64, 64, -64, 64, -64, -64, -64, -64, 64, -64, 64, -64, 64, 64, 64, -64, 64, -64, 64, -64, 64, -64, -64, -64, -64, 64, -64, -64, -64, 64, 64, -64, -64, -64, -64, -64, 64, -64, -64, 64, 64, 64, -64, -64, 64, -64, -64, -64, 64, -64, -64, -64, -64, 64, 64, 64, 64, 64, -64, -64, -64, -64, 64, -64, 64, 64, -64, 64, 64, -64, -64, 64, 64, -64, -64, 64, -64, -64, 64, -64, 64, -64, 64, -64, -64, 64, 64, 64, 64, 64, 64, -64, -64, 64, 64, -64, -64, -64, 64, -64, 64, -64, 64, 64, 64, 64, 64, -64, 64, 64, 64, 64, 64, 64, -64, 64, -64, -64, 64, -64, -64, -64, 64, 64, -64, -64, 64, 64, -64, -64, 64, 64, 64, 64, 64, 64, -64, 64, 64, -64, 64, 64, 64, 64, 64, 64, 64, -64, 64, 64, -64, 64, 64, -64, 64, -64, 64, -64, -64, 64, 64, 64, 64, 64, -64, 64, 64, 64, 64, 64, -64, -64, -64, 64, -64, 64, 64, -64, 64, -64, 64, 64, -64, 64, -64, 64, 64, 64, 64, -64, 64, 64, 64, 64, 64, 64, 64, 64, 64, -64, 64, 64, 64, -64, -64, 64, 64, 64, -64, 64, -64, -64, -64, 64, 64, 64, -64, 64, 64, -64, 64, 64, 64, 64, 64, 64, 64, 64, 64, -64, -64, -64, 64, 64, -64, -64, -64, 64, 64, 64, 64, 64, 64, 64, 64, 64, -64, -64, 64, 64, 64, 64, -64, -64, -64, -64, 64, 64, 64, 64, 64, -64, -64, -64, -64, -64, 64, 64, 64, 64, 64, 64, 64, 64, 64, -64, 64, 64, 64, 64, -64, -64, -64, -64, -64, -64, 64, -64, 64, 64, 64, -64, -64, 64, 64, 64, 64, 64, 64, 64, 64, 64, 64, -64, -64, 64, -64, -64, -64, 64, 64, -64, 64, -64, -64, -64, 64, -64, 64, -64, 64, -64, 64, 64, -64, 64, 64, 64, -64, 64, 64, 64, -64, 64, 64, -64, 64, 64, 64, -64, 64, 64, -64, 64, -64, 64, 64, 64, -64, -64, -64, 64, 64, 64, 64, 64, 64, -64, -64, 64, -64, 64, -64, 64, -64, 64, -64, 64, 64, 64, 64, -64, -64, 64, 64, 64, -64, -64, -64, -64, 64, -64, 64, 64, -64, 64, 64, -64, -64, 64, -64, 64, 64, 64, 64, 64, 64, -64, -64, 64, -64, 64, -64, 64, 64, 64, 64, -64, -64, 64, 64, -64, -64, 64, 64, -64, 64, -64, -64, 64, 64, -64, -64, 64, -64, -64, -64, 64, 64, 64, 64, 64, 64, -64, -64, -64, 64, 64, -64, 64, 64, 64, 64, -64, -64, 64, 64, 64, 64, 64, 64, 64, 64, 64, -64, 64, 64, -64, 64, 64, 64, 64, 64, 64, 64, 64, -64, 64, 64, 64, 64, -64, -64, 64, 64, 64, 64, 64, 64, -64, 64, -64, -64, -64, 64, -64, 64, 64, 64, 64, 64, 64, -64, 64, 64, -64, -64, -64, -64, -64, 64, 64, 64, 64, 64, -64, -64, 64, 64, 64, 64, 64, -64, -64, -64, -64, 64, -64, 64, 64, 64, 64, 64, -64, 64, -64, -64, -64, -64, 64, 64, 64, 64, 64, -64, 64, -64, -64, -64, 64, -64, 64, -64, 64, 64, 64, -64, 64, -64, 64, 64, 64, 64, 64, 64, -64, -64, -64, -64, 64, -64, 64, -64, -64, -64, -64, -64, 64, -64, -64, -64, -64, 64, 64, 64, 64, 64, -64, 64, 64, 64, -64, 64, 64, 64, 64, 64, -64, 64, 64, 64, -64, -64, -64, 64, 64, -64, -64, -64, -64, -64, 64, 64, 64, 64, 64, 64, -64, -64, 64, -64, 64, 64, -64, -64, -64, 64, -64, -64, -64, -64, 64, -64, 64, 64, 64, 64, -64, -64, 64, 64, 64, 64, -64, 64, 64, 64, 64, -64, -64, 64, -64, 64, -64, 64, -64, -64, 64, 64, -64, 64, 64, -64, -64, -64, -64, -64, 64, 64, 64, 64, 64, 64, 64, -64, 64, 64, 64, 64, 64, 64, 64, -64, 64, 64, -64, 64, -64, -64, -64, 64, -64, 64, 64, 64, 64, 64, -64, 64, 64, 64, 64, -64, -64, -64, -64, 64, 64, -64, 64, -64, 64, -64, 64, 64, -64, 64, 64, -64, -64, 64, 64, 64, 64, -64, 64, 64, -64, 64, -64, -64, 64, 64, 64, -64, 64, -64, 64, -64, -64, 64, -64, 64, 64, -64, 64, -64, -64, 64, 64, -64, -64, 64, 64, 64, -64, 64, -64, -64, -64, 64, 64, -64, -64, 64, 64, -64, 64, -64, 64, 64, -64, -64, 64, 64, 64, -64, 64, 64, 64, -64, 64, -64, -64, 64, -64, 64, -64, 64, 64, 64, -64, 64, 64, -64, -64, -64, -64, -64, -64, -64, 64, 64, -64, -64, -64, 64, 64, -64, -64, 64, -64, -64, 64, -64, 64, 64, 64, 64, 64, 64, -64, 64, -64, -64, 64, -64, 64, -64, 64, 64, -64, 64, 64, 64, -64, 64, 64, 64, -64, -64, -64, 64, -64, -64, -64, 64, -64, 64, -64, 64, 64, 64, 64, -64, -64, -64, 64, -64, -64, 64, -64, -64, -64, -64, 64, 64, 64, -64, -64, 64, 64, -64, 64, 64, 64, 64, -64, 64, 64, 64, 64, 64, -64, 64, -64, -64, -64, -64, 64, 64, 64, 64, -64, -64, -64, -64, 64, 64, 64, -64, 64, 64, -64, -64, -64, 64, 64, 64, 64, -64, -64, -64, -64, -64, -64, -64, 64, 64, -64, 64, 64, 64, -64, -64, 64, -64, -64, 64, 64, -64, 64, 64, -64, 64, -64, 64, -64, -64, -64, -64, 64, 64, 64, -64, -64, -64, -64, -64, -64, 64, -64, -64, 64, -64, -64, -64, -64, -64, 64, -64, -64, 64, -64, 64, -64, -64, -64, -64, -64, -64, -64, 64, -64, 64, -64, -64, 64, -64, -64, 64, -64, -64, -64, -64, 64, 64, 64, -64, -64, 64, -64, 64, 64, 64, -64, 64, -64, 64, 64, 64, 64, -64, 64, 64, 64, 64, 64, -64, 64, -64, 64, 64, 64, -64, 64, 64, 64, 64, 64, 64, -64, -64, 64, 64, -64, 64, 64, -64, 64, 64, -64, -64, -64, 64, -64, -64, 64, 64, 64, 64, -64, 64, 64, 64, 64, 64, 64, -64, -64, -64, 64, 64, 64, -64, -64, -64, 64, 64, 64, -64, 64, 64, -64, -64, 64, -64, 64, -64, 64, -64, 64, 64, 64, -64, -64, 64, 64, -64, 64, -64, 64, 64, 64, -64, -64, -64, 64, 64, 64, -64, -64, 64, 64, 64, 64, 64, 64, -64, 64, -64, -64, 64, -64, 64, 64, 64, 64, -64, 64, -64, 64, 64, -64, 64, -64, 64, 64, -64, 64, -64, 64, 64, 64, -64, 64, 64, -64, -64, -64, 64, -64, 64, -64, 64, -64, 64, -64, 64, 64, 64, 64, 64, -64, 64, -64, 64, 64, -64, 64, 64, 64, -64, -64, -64, 64, 64, 64, -64, 64, 64, 64, 64, -64, 64, -64, 64, 64, -64, 64, -64, 64, -64, -64, 64, 64, 64, 64, 64, 64, 64, -64, 64, 64, 64, 64, -64, 64, 64, -64, -64, -64, -64, 64, 64, -64, 64, 64, -64, 64, 64, -64, 64, 64, -64, -64, 64, 64, 64, 64, 64, 64, 64, 64, 64, 64, 64, 64, -64, 64, 64, -64, 64, -64, 64, 64, 64, -64, 64, 64, 64, 64, 64, 64, -64, 64, 64, 64, 64, 64, 64, -64, -64, -64, 64, 64, 64, -64, 64, -64, -64, 64, -64, 64, 64, -64, 64, 64, 64, 64, 64, 64, 64, 64, -64, 64, 64, -64, 64, 64, -64, -64, -64, 64, -64, -64, 64, 64, 64, -64, -64, 64, 64, 64, 64, 64, 64, 64, -64, 64, 64, 64, 64, 64, 64, -64, -64, 64, 64, 64, -64, 64, -64, 64, 64, -64, 64, 64, 64, 64, -64, 64, 64, 64, 64, 64, 64, 64, 64, 64, 64, 64, 64, 64, -64, -64, 64, 64, -64, 64, -64, -64, 64, 64, 64, -64, 64, 64, -64, -64, -64, 64, 64, 64, 64, -64, 64, 64, -64, 64, -64, 64, 64, -64, -64, -64, 64, -64, 64, -64, 64, -64, 64, -64, -64, -64, 64, -64, 64, -64, 64, 64, 64, 64, 64, 64, -64, 64, 64, -64, 64, 64, 64, -64, 64, 64, -64, -64, 64, -64, -64, 64, 64, 64, -64, -64, -64, -64, 64, 64, 64, 64, 64, 64, 64, -64, 64, -64, 64, -64, 64, -64, 64, 64, 64, 64, -64, 64, -64, -64, -64, -64, -64, -64, -64, -64, -64, -64, -64, 64, 64, 64, -64, -64, -64, -64, -64, -64, 64, 64, 64, 64, 64, -64, -64, -64, -64, -64, 64, -64, 64, 64, 64, -64, 64, 64, -64, -64, -64, -64, 64, -64, 64, 64, -64, -64, 64, -64, -64, -64, 64, -64, 64, -64, -64, -64, 64, -64, 64, -64, -64, -64, 64, 64, 64, 64, 64, 64, 64, 64, -64, 64, 64, 64, 64, -64, 64, 64, 64, -64, 64, 64, -64, 64, -64, 64, 64, 64, 64, 64, 64, 64, 64, 64, 64, 64, -64, 64, -64, 64, 64, -64, -64, -64, 64, -64, -64, 64, 64, 64, -64, -64, 64, 64, -64, -64, 64, -64, 64, -64, -64, -64, 64, 64, 64, -64, -64, 64, -64, 64, 64, -64, 64, -64, -64, -64, 64, -64, 64, -64, -64, 64, 64, -64, -64, -64, -64, -64, -64, 64, 64, 64, 64, 64, -64, 64, 64, 64, -64, -64, -64, -64, 64, 64, -64, -64, -64, 64, -64, -64, 64, -64, -64, -64, 64, 64, -64, -64, 64, -64, 64, -64, -64, -64, -64, -64, 64, 64, -64, -64, -64, 64, 64, -64, 64, 64, 64, 64, 64, 64, 64, 64, 64, 64, 64, -64, 64, -64, 64, -64, -64, 64, -64, 64, -64, 64, -64, 64, 64, -64, -64, -64, 64, 64, -64, -64, -64, 64, 64, 64, -64, 64, 64, -64, 64, -64, 64, 64, -64, -64, 64, -64, 64, 64, -64, -64, 64, -64, 64, -64, 64, -64, -64, 64, 64, -64, -64, 64, 64, 64, 64, -64, -64, -64, -64, 64, -64, -64, -64, 64, -64, -64, -64, -64, 64, -64, -64, -64, -64, 64, -64, 64, -64, 64, 64, 64, -64, -64, 64, 64, 64, -64, 64, -64, -64, -64, 64, -64, -64, -64, 64, 64, -64, -64, 64, -64, -64, -64, -64, -64, -64, -64, -64, -64, -64, 64, -64, 64, -64, -64, -64, -64, -64, -64, -64, 64, 64, -64, 64, -64, 64, 64, -64, -64, 64, 64, 64, 64, 64, -64, 64, 64, -64, -64, -64, 64, 64, -64, -64, -64, -64, -64, 64, 64, 64, 64, 64, -64, 64, 64, 64, -64, -64, -64, -64, -64, -64, -64, -64, -64, 64, -64, -64, -64, -64, -64, 64, 64, -64, -64, 64, 64, -64, 64, -64, 64, -64, -64, 64, 64, -64, 64, -64, -64, -64, -64, 64, 64, 64, 64, -64, -64, -64, -64, -64, 64, -64, -64, 64, -64, 64, 64, -64, -64, -64, -64, -64, -64, -64, 64, 64, 64, -64, -64, 64, -64, 64, 64, 64, -64, -64, -64, -64, -64, -64, -64, -64, -64, -64, 64, 64, -64, -64, -64, 64, -64, -64, 64, -64, -64, -64, 64, 64, -64, -64, -64, -64, -64, 64, -64, -64, 64, -64, -64, -64, -64, 64, 64, -64, -64, 64, -64, -64, 64, -64, -64, -64, -64, -64, -64, -64, -64, -64, 64, -64, -64, -64, -64, -64, -64, 64, -64, -64, 64, -64, 64, -64, -64, -64, 64, 64, 64, -64, 64, -64, -64, 64, -64, 64, 64, -64, -64, -64, -64, -64, -64, -64, -64, -64, 64, -64, 64, 64, 64, -64, -64, 64, -64, -64, 64, -64, -64, 64, 64, -64, -64, -64, -64, 64, 64, -64, -64, -64, 64, -64, 64, 64, 64, -64, -64, 64, -64, 64, -64, 64, -64, -64, 64, -64, -64, -64, 64, -64, -64, -64, -64, -64, -64, -64, -64, -64, -64, -64, -64, 64, -64, -64, 64, 64, 64, 64, 64, 64, 64, 64, -64, -64, 64, -64, 64, -64, -64, -64, 64, -64, -64, -64, -64, -64, -64, -64, 64, -64, -64, -64, 64, -64, -64, -64, -64, 64, -64, 64, 64, 64, -64, -64, 64, -64, -64, -64, -64, -64, -64, -64, -64, -64, -64, 64, -64, -64, -64, -64, 64, 64, -64, 64, -64, -64, 64, -64, -64, -64, -64, 64, 64, 64, -64, 64, -64, -64, -64, -64, -64, -64, 64, -64, -64, -64, -64, -64, -64, 64, 64, 64, -64, -64, -64, -64, -64, -64, -64, 64, -64, -64, 64, -64, -64, 64, -64, 64, -64, -64, -64, -64, -64, -64, 64, 64, 64, -64, -64, -64, -64, 64, -64, 64, -64, -64, -64, 64, -64, 64, -64, -64, 64, -64, -64, 64, 64, -64, 64, 64, -64, -64, -64, -64, 64, -64, -64, -64, 64, -64, 64, -64, -64, 64, -64, -64, -64, -64, -64, -64, -64, -64, 64, -64, 64, -64, -64, -64, -64, -64, -64, -64, -64, -64, 64, -64, 64, -64, -64, -64, 64, -64, 64, 64, 64, 64, 64, -64, -64, -64, 64, 64, -64, -64, -64, 64, -64, -64, -64, -64, -64, -64, -64, -64, 64, 64, -64, 64, 64, -64, -64, -64, -64, -64, 64, -64, -64, 64, -64, -64, 64, -64, -64, -64, -64, 64, 64, 64, -64, 64, 64, -64, 64, -64, -64, 64, 64, -64, 64, 64, 64, -64, 64, 64, -64, -64, -64, 64, 64, -64, -64, -64, 64, -64, 64, -64, -64, 64, 64, -64, -64, 64, -64, -64, 64, 64, -64, 64, -64, -64, 64, -64, 64, -64, -64, -64, -64, -64, -64, 64, -64, 64, -64, -64, 64, -64, -64, -64, 64, 64, 64, -64, 64, -64, -64, 64, 64, 64, -64, 64, -64, -64, 64, -64, 64, 64, 64, -64, 64, -64, -64, 64, 64, -64, -64, -64, 64, -64, -64, 64, -64, 64, 64, -64, -64, 64, -64, 64, 64, 64, 64, 64, 64, 64, -64, 64, 64, 64, -64, 64, -64, 64, -64, -64, 64, -64, -64, -64, -64, -64, 64, 64, -64, -64, -64, 64, -64, 64, -64, -64, 64, -64, -64, -64, -64, 64, -64, 64, 64, -64, -64, 64, -64, -64, -64, -64, -64, 64, 64, -64, -64, 64, -64, 64, -64, 64, 64, 64, 64, 64, -64, 64, -64, -64, -64, -64, -64, 64, -64, -64, 64, 64, 64, 64, 64, 64, 64, -64, 64, -64, -64, 64, -64, 64, -64, 64, 64, -64, 64, 64, 64, 64, -64, 64, -64, 64, 64, -64, -64, -64, -64, 64, -64, 64, 64, 64, 64, 64, 64, 64, 64, -64, 64, -64, 64, -64, -64, 64, 64, -64, -64, 64, -64, 64, 64, -64, -64, 64, -64, -64, -64, -64, 64, -64, 64, -64, -64, 64, 64, 64, 64, -64, -64, -64, -64, 64, 64, 64, 64, 64, 64, 64, 64, -64, -64, 64, -64, -64, -64, 64, 64, -64, 64, -64, -64, -64, -64, -64, 64, 64, 64, -64, -64, 64, 64, 64, 64, 64, 64, 64, 64, 64, 64, 64, 64, 64, -64, -64, -64, -64, -64, -64, -64, -64, -64, -64, -64, -64, 64, 64, 64, 64, 64, 64, 64, 64, 64, 64, 64, 64, 64, 64, 64, -64, 64, 64, -64, 64, -64, -64, -64, -64, -64, -64, -64, -64, 64, 64, -64, 64, 64, 64, 64, 64, 64, 64, 64, 64, 64, 64, -64, -64, 64, 64, 64, -64, -64, -64, -64, -64, 64, 64, -64, 64, 64, 64, 64, 64, -64, 64, 64, 64, 64, -64, 64, 64, 64, -64, 64, -64, -64, -64, 64, 64, -64, -64, 64, 64, 64, 64, -64, 64, 64, 64, -64, -64, -64, 64, 64, 64, -64, -64, 64, 64, 64, -64, 64, 64, -64, 64, 64, 64, -64, 64, 64, 64, 64, 64, 64, 64, -64, -64, -64, 64, -64, 64, -64, 64, -64, -64, 64, 64, 64, 64, 64, -64, -64, 64, -64, 64, 64, 64, 64, 64, 64, 64, 64, 64, -64, 64, -64, 64, -64, -64, 64, 64, -64, 64, 64, 64, 64, 64, -64, -64, -64, -64, -64, -64, 64, 64, 64, 64, 64, -64, 64, 64, 64, 64, 64, -64, -64, -64, 64, -64, 64, 64, 64, 64, 64, 64, 64, 64, -64, -64, -64, -64, -64, -64, -64, 64, 64, 64, 64, 64, 64, 64, 64, -64, 64, 64, -64, -64, 64, -64, 64, -64, -64, 64, -64, 64, -64, -64, -64, 64, -64, -64, -64, 64, 64, 64, 64, 64, 64, 64, 64, 64, -64, 64, 64, -64, 64, -64, -64, -64, -64, 64, 64, -64, -64, -64, 64, -64, -64, -64, -64, -64, -64, 64, 64, 64, 64, 64, -64, 64, 64, 64, -64, -64, -64, -64, -64, 64, 64, 64, 64, 64, 64, -64, 64, -64, -64, -64, 64, -64, 64, 64, 64, 64, 64, 64, 64, -64, 64, -64, 64, -64, 64, -64, 64, 64, 64, 64, -64, 64, 64, -64, 64, -64, -64, 64, 64, 64, 64, 64, 64, 64, 64, 64, -64, 64, 64, -64, -64, -64, -64, -64, -64, -64, -64, 64, 64, -64, -64, 64, -64, -64, -64, 64, 64, 64, 64, 64, 64, 64, 64, -64, -64, -64, -64, -64, -64, -64, -64, 64, -64, -64, 64, -64, 64, -64, -64, 64, 64, -64, 64, 64, 64, 64, 64, 64, -64, -64, 64, -64, 64, 64, 64, 64, 64, -64, -64, 64, 64, 64, -64, -64, -64, -64, 64, 64, 64, 64, 64, 64, 64, 64, 64, 64, -64, -64, -64, -64, -64, 64, -64, 64, 64, -64, 64, 64, 64, 64, 64, 64, -64, -64, -64, 64, -64, 64, 64, 64, 64, 64, 64, -64, 64, -64, -64, -64, -64, -64, 64, 64, 64, 64, 64, 64, 64, 64, 64, 64, 64, 64, 64, 64, -64, 64, 64, 64, 64, 64, -64, -64, 64, 64, -64, -64, 64, 64, 64, 64, 64, 64, 64, 64, -64, 64, 64, -64, 64, -64, -64, 64, 64, 64, -64, 64, 64, -64, -64, -64, 64, 64, 64, 64, 64, 64, 64, 64, 64, 64, -64, 64, 64, -64, 64, 64, 64, 64, -64, 64, -64, -64, -64, 64, 64, -64, 64, 64, 64, 64, 64, -64, 64, 64, 64, 64, 64, 64, 64, 64, 64, 64, 64, -64, 64, -64, 64, -64, -64, -64, 64, 64, 64, -64, -64, 64, 64, 64, -64, -64, 64, 64, -64, 64, -64, 64, -64, -64, 64, 64, -64, -64, -64, -64, 64, 64, 64, -64, -64, 64, 64, -64, 64, 64, 64, -64, 64, 64, -64, -64, -64, 64, 64, 64, -64, -64, -64, 64, -64, -64, 64, 64, 64, 64, 64, -64, 64, -64, 64, -64, 64, 64, 64, 64, -64, -64, 64, 64, 64, 64, -64, -64, -64, -64, 64, 64, 64, -64, -64, -64, 64, 64, -64, 64, -64, -64, 64, 64, -64, -64, 64, 64, 64, 64, 64, -64, 64, 64, 64, -64, 64, -64, -64, 64, 64, -64, 64, -64, -64, 64, 64, 64, 64, 64, 64, -64, 64, -64, -64, 64, 64, 64, 64, 64, -64, -64, -64, 64, -64, 64, -64, 64, 64, 64, -64, -64, 64, -64, -64, 64, -64, -64, -64, 64, -64, 64, -64, -64, -64, -64, -64, 64, 64, 64, -64, 64, -64, -64, -64, -64, -64, -64, 64, -64, -64, -64, -64, -64, -64, -64, 64, -64, -64, -64, -64, -64, -64, -64, -64, -64, -64, -64, -64, -64, 64, -64, -64, -64, 64, 64, 64, -64, 64, 64, 64, -64, -64, -64, -64, -64, -64, 64, 64, 64, -64, -64, 64, -64, -64, -64, -64, 64, -64, -64, -64, -64, -64, 64, 64, -64, 64, 64, -64, -64, -64, -64, 64, -64, -64, -64, 64, 64, -64, -64, 64, -64, 64, -64, 64, -64, 64, 64, -64, -64, -64, -64, 64, -64, -64, -64, 64, -64, -64, 64, -64, -64, 64, 64, 64, 64, -64, 64, -64, -64, -64, -64, 64, 64, 64, 64, -64, -64, 64, 64, 64, 64, 64, 64, 64, -64, -64, 64, -64, 64, 64, -64, 64, 64, -64, -64, -64, -64, 64, -64, 64, 64, 64, -64, 64, -64, -64, 64, -64, -64, 64, 64, 64, 64, 64, -64, 64, -64, -64, -64, 64, -64, -64, 64, -64, 64, 64, -64, 64, -64, 64, 64, 64, 64, 64, -64, -64, -64, -64, -64, -64, -64, -64, 64, -64, -64, -64, 64, -64, 64, -64, -64, -64, -64, -64, 64, -64, -64, 64, 64, 64, 64, 64, 64, 64, 64, 64, 64, 64, -64, -64, 64, 64, -64, 64, 64, -64, 64, -64, -64, -64, 64, -64, -64, -64, 64, -64, -64, -64, -64, 64, 64, -64, -64, 64, -64, -64, -64, -64, 64, -64, -64, -64, 64, -64, -64, -64, -64, 64, -64, 64, -64, 64, -64, -64, 64, 64, 64, -64, -64, -64, 64, 64, 64, 64, -64, -64, 64, 64, -64, 64, -64, -64, -64, -64, -64, -64, -64, 64, 64, 64, 64, 64, 64, 64, -64, 64, 64, -64, -64, 64, 64, 64, -64, 64, 64, -64, 64, -64, -64, 64, -64, -64, -64, 64, -64, -64, 64, -64, 64, -64, 64, 64, 64, -64, -64, -64, 64, 64, -64, 64, 64, 64, -64, 64, -64, -64, -64, -64, -64, 64, 64, 64, -64, 64, 64, -64, -64, 64, -64, -64, 64, -64, -64, -64, 64, 64, -64, 64, -64, 64, -64, -64, 64, -64, 64, 64, -64, -64, -64, -64, -64, -64, 64, -64, -64, -64, -64, 64, -64, -64, 64, 64, 64, -64, 64, 64, -64, -64, -64, 64, -64, -64, -64, -64, -64, -64, -64, -64, -64, 64, -64, -64, -64, -64, -64, 64, 64, -64, 64, 64, 64, 64, -64, 64, 64, 64, -64, 64, -64, 64, -64, -64, 64, -64, 64, 64, -64, -64, -64, -64, -64, -64, -64, 64, 64, -64, -64, 64, 64, 64, 64, -64, -64, 64, 64, 64, -64, -64, -64, -64, 64, 64, -64, -64, -64, 64, -64, -64, -64, -64, -64, -64, -64, 64, 64, 64, 64, 64, 64, -64, 64, -64, 64, 64, -64, -64, -64, -64, -64, 64, -64, -64, 64, -64, -64, -64, -64, -64, -64, -64, -64, 64, 64, 64, 64, 64, 64, -64, 64, 64, 64, 64, -64, -64, 64, -64, -64, -64, 64, -64, -64, -64, -64, -64, 64, -64, 64, 64, 64, 64, 64, 64, 64, -64, -64, -64, -64, 64, 64, 64, 64, -64, 64, -64, -64, -64, -64, -64, -64, -64, -64, 64, -64, 64, -64, -64, -64, -64, 64, -64, 64, -64, 64, -64, -64, 64, 64, -64, 64, -64, -64, -64, 64, 64, -64, 64, 64, -64, 64, -64, -64, -64, 64, -64, 64, -64, -64, 64, 64, 64, -64, -64, 64, 64, -64, -64, -64, -64, 64, 64, -64, -64, -64, -64, -64, -64, -64, 64, 64, 64, -64, -64, 64, 64, 64, -64, -64, -64, -64, -64, -64, -64, -64, 64, 64, 64, -64, 64, -64, 64, 64, -64, -64, 64, 64, 64, 64, 64, 64, 64, -64, 64, 64, 64, 64, -64, -64, -64, 64, -64, -64, -64, 64, 64, -64, -64, -64, -64, -64, 64, -64, 64, 64, 64, 64, 64, 64, 64, -64, 64, 64, -64, 64, -64, 64, -64, 64, -64, 64, 64, -64, 64, -64, 64, 64, -64, -64, -64, 64, -64, 64, 64, -64, 64, -64, -64, -64, 64, 64, 64, -64, -64, -64, 64, 64, 64, -64, -64, 64, 64, -64, 64, 64, 64, 64, -64, -64, -64, -64, -64, 64, -64, 64, 64, 64, 64, -64, 64, -64, -64, -64, 64, 64, 64, 64, -64, 64, 64, -64, 64, -64, 64, 64, -64, 64, 64, -64, -64, 64, -64, -64, -64, 64, -64, -64, 64, -64, 64, -64, -64, -64, 64, -64, -64, -64, -64, -64, 64, 64, 64, -64, 64, 64, -64, 64, 64, 64, 64, -64, 64, -64, 64, 64, 64, -64, 64, -64, 64, 64, 64, -64, 64, 64, 64, -64, -64, 64, 64, 64, 64, 64, 64, 64, 64, 64, 64, 64, -64, -64, 64, 64, 64, -64, -64, -64, 64, -64, -64, 64, 64, 64, 64, 64, -64, -64, -64, 64, 64, 64, 64, 64, 64, 64, -64, 64, 64, 64, 64, 64, -64, -64, -64, -64, -64, 64, 64, 64, 64, 64, 64, 64, 64, -64, 64, 64, -64, -64, 64, -64, 64, -64, 64, -64, 64, 64, -64, -64, -64, 64, -64, 64, 64, 64, 64, 64, 64, -64, -64, -64, -64, -64, -64, 64, -64, -64, -64, -64, -64, -64, 64, 64, 64, 64, -64, 64, 64, 64, -64, -64, -64, 64, -64, 64, -64, 64, -64, -64, -64, -64, -64, -64, -64, -64, -64, -64, -64, -64, -64, -64, 64, 64, 64, 64, 64, -64, 64, -64, 64, 64, 64, 64, 64, -64, 64, -64, -64, -64, -64, -64, -64, -64, -64, -64, -64, -64, -64, -64, 64, 64, -64, 64, 64, -64, -64, -64, -64, 64, 64, 64, -64, -64, -64, -64, 64, -64, -64, -64, -64, -64, -64, -64, 64, -64, -64, -64, 64, 64, -64, -64, -64, -64, 64, -64, 64, -64, -64, -64, 64, -64, 64, 64, -64, 64, -64, -64, 64, -64, -64, 64, -64, 64, 64, -64, -64, 64, 64, 64, 64, 64, 64, 64, 64, -64, -64, -64, -64, -64, 64, -64, -64, 64, 64, -64, 64, -64, 64, 64, -64, -64, -64, -64, -64, 64, 64, 64, 64, 64, 64, 64, -64, -64, 64, 64, -64, -64, -64, -64, 64, 64, -64, -64, 64, 64, 64, -64, -64, -64, -64, -64, 64, 64, -64, -64, 64, -64, 64, 64, 64, 64, -64, -64, 64, 64, -64, 64, 64, 64, 64, 64, -64, 64, -64, -64, -64, -64, -64, -64, -64, 64, 64, 64, 64, 64, -64, 64, -64, -64, -64, 64, 64, 64, -64, 64, 64, 64, -64, 64, 64, 64, -64, -64, -64, 64, -64, 64, 64, 64, 64, 64, -64, 64, -64, -64, -64, -64, 64, -64, 64, 64, 64, 64, 64, 64, 64, -64, -64, -64, -64, 64, -64, -64, -64, 64, 64, 64, 64, -64, 64, 64, -64, -64, 64, -64, 64, 64, 64, 64, -64, 64, 64, 64, 64, -64, 64, 64, 64, -64, -64, -64, 64, 64, 64, 64, 64, -64, -64, 64, 64, -64, -64, -64, 64, -64, -64, -64, 64, 64, 64, 64, 64, 64, 64, 64, -64, -64, 64, 64, 64, 64, 64, 64, 64, 64, -64, -64, 64, -64, -64, -64, -64, -64, -64, 64, 64, -64, -64, -64, 64, 64, 64, 64, 64, -64, -64, -64, 64, 64, 64, 64, 64, 64, 64, -64, -64, -64, -64, 64, -64, -64, -64, -64, 64, 64, 64, 64, 64, 64, 64, 64, 64, -64, -64, 64, 64, 64, 64, 64, -64, 64, -64, -64, -64, 64, -64, -64, -64, -64, 64, 64, 64, 64, 64, 64, 64, 64, 64, 64, -64, -64, -64, 64, 64, 64, 64, 64, -64, -64, -64, 64, -64, 64, -64, -64, 64, -64, -64, 64, -64, -64, -64, 64, 64, -64, 64, 64, 64, -64, 64, -64, -64, -64, 64, 64, -64, -64, 64, 64, -64, 64, -64, 64, -64, -64, -64, -64, -64, -64, -64, -64, 64, 64, 64, -64, 64, -64, -64, -64, -64, -64, 64, 64, -64, -64, -64, 64, -64, -64, -64, 64, 64, -64, -64, -64, -64, 64, -64, -64, -64, -64, -64, -64, -64, -64, -64, -64, -64, -64, 64, 64, 64, -64, -64, -64, 64, 64, -64, -64, 64, 64, -64, 64, -64, 64, -64, -64, -64, -64, -64, -64, -64, -64, -64, -64, -64, 64, 64, 64, -64, 64, -64, 64, 64, 64, 64, -64, 64, -64, 64, -64, 64, 64, -64, -64, -64, -64, -64, -64, -64, -64, -64, -64, -64, 64, 64, 64, 64, -64, -64, 64, -64, -64, 64, -64, 64, 64, 64, -64, 64, -64, -64, -64, -64, -64, -64, -64, -64, -64, -64, -64, -64, 64, 64, 64, 64, -64, 64, -64, 64, 64, 64, -64, 64, 64, -64, -64, 64, 64, -64, -64, -64, -64, -64, -64, -64, 64, 64, -64, -64, 64, -64, -64, -64, 64, -64, -64, -64, -64, 64, 64, -64, 64, -64, -64, -64, -64, -64, 64, -64, -64, -64, -64, -64, 64, -64, 64, 64, -64, -64, -64, -64, -64, -64, 64, -64, 64, 64, -64, -64, 64, 64, -64, -64, 64, -64, -64, 64, 64, 64, -64, 64, -64, -64, -64, 64, 64, 64, -64, 64, -64, 64, 64, -64, 64, -64, -64, 64, -64, 64, 64, 64, 64, 64, 64, -64, -64, 64, 64, 64, -64, -64, -64, -64, -64, -64, 64, 64, -64, 64, -64, -64, -64, 64, 64, -64, -64, 64, 64, 64, 64, -64, 64, 64, 64, 64, 64, -64, -64, 64, 64, -64, -64, 64, 64, 64, -64, -64, 64, -64, -64, -64, -64, -64, 64, 64, 64, -64, -64, -64, 64, -64, 64, 64, -64, 64, -64, 64, 64, 64, -64, 64, -64, -64, 64, -64, -64, -64, 64, 64, 64, 64, 64, -64, 64, -64, -64, -64, 64, 64, -64, 64, 64, 64, 64, 64, 64, 64, 64, -64, -64, -64, 64, 64, -64, 64, -64, 64, 64, 64, 64, 64, 64, 64, -64, -64, -64, 64, -64, -64, 64, -64, -64, 64, -64, -64, 64, -64, -64, 64, 64, 64, -64, -64, -64, 64, 64, 64, 64, 64, 64, -64, 64, -64, 64, 64, -64, 64, -64, -64, -64, -64, -64, -64, 64, -64, -64, 64, -64, 64, 64, 64, -64, -64, 64, 64, 64, 64, 64, 64, 64, 64, 64, 64, 64, 64, 64, -64, -64, 64, 64, 64, -64, 64, -64, -64, 64, 64, -64, 64, -64, -64, 64, 64, 64, 64, 64, -64, -64, 64, 64, 64, 64, 64, 64, -64, -64, -64, -64, -64, -64, -64, -64, -64, 64, -64, -64, 64, -64, 64, 64, 64, 64, -64, -64, -64, -64, 64, 64, -64, 64, 64, 64, 64, 64, -64, -64, -64, -64, -64, -64, -64, 64, -64, 64, 64, -64, 64, 64, 64, 64, -64, -64, -64, -64, -64, -64, -64, 64, 64, 64, -64, -64, -64, -64, -64, -64, -64, -64, -64, -64, 64, 64, 64, -64, 64, 64, 64, -64, -64, 64, 64, 64, 64, -64, -64, -64, -64, -64, -64, 64, -64, -64, -64, -64, -64, 64, 64, 64, -64, 64, -64, -64, 64, 64, -64, -64, -64, -64, -64, -64, -64, 64, -64, -64, 64, 64, -64, -64, -64, -64, -64, -64, 64, -64, -64, -64, 64, 64, 64, -64, -64, -64, -64, -64, -64, -64, 64, 64, 64, -64, 64, 64, -64, -64, -64, -64, -64, -64, -64, -64, 64, 64, -64, 64, -64, -64, -64, 64, 64, -64, -64, -64, -64, -64, 64, 64, 64, -64, -64, 64, 64, 64, 64, 64, 64, -64, -64, -64, -64, -64, -64, 64, 64, 64, 64, 64, 64, 64, -64, -64, -64, -64, 64, 64, 64, 64, 64, -64, 64, -64, -64, -64, -64, 64, -64, -64, -64, -64, 64, 64, -64, -64, 64, -64, 64, 64, 64, -64, -64, -64, 64, 64, 64, 64, 64, 64, 64, -64, -64, -64, -64, 64, 64, -64, 64, 64, 64, 64, -64, 64, 64, 64, 64, 64, 64, -64, -64, -64, 64, 64, 64, 64, 64, 64, -64, -64, 64, 64, -64, 64, -64, 64, 64, 64, 64, -64, -64, -64, -64, 64, 64, 64, 64, -64, -64, -64, 64, 64, 64, 64, 64, 64, 64, 64, 64, 64, 64, -64, 64, 64, -64, 64, 64, 64, -64, 64, 64, -64, 64, 64, -64, -64, -64, -64, 64, 64, 64, 64, 64, 64, 64, -64, 64, 64, 64, 64, 64, -64, 64, -64, 64, -64, 64, 64, 64, -64, 64, 64, -64, -64, -64, 64, 64, 64, 64, 64, 64, -64, -64, -64, -64, 64, -64, 64, 64, 64, -64, -64, -64, -64, 64, 64, 64, -64, 64, -64, -64, -64, -64, -64, -64, 64, -64, -64, -64, 64, 64, -64, 64, 64, 64, 64, 64, 64, 64, 64, -64, 64, 64, -64, -64, -64, -64, -64, -64, -64, -64, -64, 64, 64, -64, -64, 64, -64, 64, -64, -64, 64, 64, 64, 64, 64, -64, -64, 64, 64, -64, -64, 64, 64, -64, -64, -64, -64, -64, -64, -64, -64, -64, -64, 64, 64, 64, 64, 64, 64, 64, 64, 64, 64, -64, -64, 64, 64, 64, 64, 64, 64, -64, -64, -64, -64, -64, -64, -64, -64, -64, 64, 64, -64, -64, -64, -64, -64, 64, 64, 64, -64, 64, 64, 64, 64, -64, 64, 64, 64, 64, -64, -64, -64, -64, -64, -64, -64, -64, 64, 64, 64, 64, 64, 64, 64, 64, -64, -64, -64, -64, 64, 64, -64, -64, -64, 64, -64, -64, -64, 64, -64, 64, -64, -64, -64, -64, -64, -64, -64, -64, -64, -64, -64, -64, -64, -64, -64, 64, 64, 64, 64, 64, -64, -64, 64, -64, 64, -64, 64, 64, -64, -64, -64, -64, -64, 64, -64, 64, -64, -64, 64, 64, 64, -64, -64, 64, 64, 64, -64, 64, 64, 64, -64, -64, -64, -64, -64, -64, 64, 64, 64, -64, -64, 64, -64, -64, -64, -64, -64, -64, 64, -64, 64, 64, -64, 64, -64, 64, 64, -64, 64, 64, -64, -64, 64, 64, 64, 64, -64, -64, 64, 64, 64, -64, -64, -64, -64, 64, -64, 64, -64, 64, 64, -64, -64, -64, -64, 64, -64, -64, -64, -64, 64, -64, 64, 64, -64, 64, -64, 64, 64, -64, -64, 64, -64, 64, 64, 64, 64, 64, -64, 64, -64, -64, 64, 64, 64, 64, -64, 64, 64, 64, 64, 64, 64, 64, -64, 64, -64, -64, -64, 64, -64, 64, -64, 64, 64, -64, -64, 64, -64, 64, -64, -64, 64, 64, 64, -64, 64, -64, -64, 64, -64, -64, -64, -64, -64, -64, 64, -64, -64, 64, -64, -64, -64, -64, 64, 64, 64, 64, -64, 64, 64, 64, 64, 64, 64, 64, 64, -64, -64, -64, -64, -64, -64, -64, -64, -64, -64, 64, 64, 64, 64, 64, -64, 64, -64, 64, 64, -64, 64, 64, 64, 64, 64, 64, 64, -64, 64, -64, -64, -64, -64, -64, -64, -64, -64, -64, -64, -64, 64, 64, 64, -64, -64, 64, 64, -64, -64, -64, 64, 64, 64, 64, -64, 64, -64, 64, 64, 64, -64, -64, -64, -64, -64, -64, -64, 64, 64, -64, -64, -64, 64, -64, -64, -64, 64, 64, 64, 64, 64, -64, 64, 64, 64, -64, -64, 64, -64, -64, -64, -64, -64, 64, 64, 64, 64, 64, -64, 64, -64, 64, -64, -64, 64, -64, 64, 64, 64, 64, 64, 64, -64, -64, -64, -64, -64, -64, 64, 64, 64, -64, -64, -64, -64, -64, -64, 64, -64, -64, -64, -64, 64, -64, 64, 64, 64, 64, 64, -64, -64, -64, -64, -64, -64, -64, 64, -64, 64, 64, -64, -64, -64, -64, -64, 64, -64, -64, -64, 64, 64, 64, 64, 64, 64, 64, -64, -64, -64, -64, -64, 64, -64, -64, -64, 64, -64, -64, -64, 64, 64, 64, -64, -64, 64, 64, 64, -64, -64, -64, 64, 64, 64, 64, -64, -64, -64, -64, -64, 64, 64, 64, -64, -64, 64, -64, -64, 64, 64, -64, -64, -64, 64, -64, 64, 64, 64, 64, 64, 64, 64, 64, -64, -64, -64, -64, -64, -64, -64, -64, -64, -64, 64, -64, 64, 64, 64, 64, -64, -64, -64, 64, -64, 64, 64, -64, 64, 64, 64, 64, -64, -64, -64, -64, -64, 64, -64, -64, -64, -64, -64, 64, -64, 64, 64, 64, -64, -64, -64, -64, 64, 64, 64, 64, 64, 64, 64, 64, 64, -64, -64, -64, 64, -64, -64, -64, -64, 64, 64, 64, -64, -64, -64, 64, -64, -64, 64, -64, 64, 64, 64, 64, 64, 64, 64, -64, 64, 64, 64, -64, -64, -64, -64, -64, -64, -64, 64, -64, -64, -64, 64, 64, -64, -64, 64, 64, 64, 64, 64, -64, 64, 64, 64, 64, 64, 64, 64, -64, -64, 64, -64, -64, -64, 64, 64, 64, -64, 64, 64, 64, -64, -64, -64, -64, -64, -64, 64, 64, 64, 64, 64, -64, -64, -64, -64, 64, 64, -64, -64, -64, -64, -64, -64, -64, 64, 64, 64, 64, -64, -64, -64, 64, 64, 64, -64, 64, -64, -64, 64, -64, 64, -64, -64, -64, -64, -64, -64, 64, -64, 64, -64, -64, 64, 64, 64, 64, -64, -64, -64, -64, -64, -64, -64, -64, 64, -64, 64, -64, -64, -64, 64, -64, -64, -64, -64, -64, 64, 64, -64, -64, 64, 64, 64, -64, 64, -64, -64, 64, -64, 64, -64, -64, -64, 64, 64, -64, -64, -64, -64, -64, -64, -64, 64, -64, -64, -64, 64, 64, 64, 64, 64, 64, 64, -64, -64, -64, -64, 64, -64, 64, 64, 64, 64, 64, -64, -64, -64, -64, -64, -64, -64, -64, -64, -64, -64, 64, 64, 64, 64, 64, -64, 64, 64, 64, 64, 64, 64, 64, -64, -64, -64, 64, -64, 64, -64, -64, 64, -64, -64, -64, -64, -64, 64, 64, 64, 64, 64, 64, 64, 64, -64, -64, 64, 64, 64, -64, -64, -64, 64, -64, 64, -64, 64, 64, 64, -64, -64, -64, -64, 64, 64, 64, 64, 64, 64, 64, -64, 64, -64, 64, -64, -64, -64, 64, -64, -64, -64, -64, -64, -64, 64, -64, -64, 64, -64, -64, -64, 64, 64, 64, 64, 64, 64, -64, -64, -64, 64, -64, -64, -64, 64, 64, 64, 64, -64, -64, 64, -64, -64, -64, 64, -64, 64, -64, -64, 64, -64, 64, 64, 64, 64, 64, 64, -64, -64, -64, -64, 64, 64, -64, -64, -64, -64, 64, -64, 64, -64, 64, -64, 64, 64, -64, -64, 64, -64, -64, -64, -64, 64, 64, -64, -64, 64, 64, 64, -64, -64, 64, 64, 64, 64, -64, -64, -64, 64, 64, 64, 64, 64, -64, 64, 64, -64, 64, -64, 64, -64, 64, -64, 64, -64, 64, 64, -64, -64, -64, -64, -64, 64, -64, -64, 64, 64, -64, 64, -64, -64, -64, -64, -64, -64, 64, 64, 64, 64, 64, 64, 64, 64, 64, 64, -64, -64, 64, 64, -64, -64, -64, 64, 64, -64, -64, 64, 64, 64, -64, 64, 64, 64, -64, 64, 64, -64, 64, 64, -64, -64, 64, 64, 64, 64, -64, -64, 64, 64, -64, 64, 64, -64, -64, 64, 64, -64, -64, -64, 64, -64, -64, -64, -64, -64, -64, 64, 64, -64, -64, 64, -64, 64, -64, 64, 64, 64, 64, 64, -64, 64, -64, 64, -64, -64, -64, -64, -64, -64, -64, -64, -64, -64, -64, -64, -64, 64, 64, -64, -64, 64, 64, -64, 64, 64, 64, 64, 64, -64, -64, -64, -64, -64, -64, 64, -64, -64, -64, -64, -64, -64, -64, -64, -64, 64, 64, -64, 64, -64, 64, 64, 64, 64, 64, 64, 64, -64, -64, -64, -64, 64, -64, 64, 64, -64, -64, -64, -64, -64, -64, -64, -64, -64, 64, -64, 64, 64, 64, 64, 64, 64, 64, -64, -64, -64, -64, -64, -64, 64, 64, 64, 64, 64, -64, -64, -64, -64, -64, -64, -64, 64, 64, -64, -64, 64, -64, 64, 64, 64, 64, 64, -64, -64, -64, -64, 64, 64, 64, 64, 64, 64, -64, -64, -64, -64, -64, -64, -64, 64, -64, 64, -64, 64, 64, 64, 64, 64, 64, -64, -64, -64, -64, -64, 64, 64, 64, 64, -64, 64, 64, 64, -64, -64, -64, -64, -64, -64, 64, 64, -64, 64, 64, -64, 64, 64, 64, 64, -64, -64, -64, -64, 64, -64, 64, 64, 64, 64, 64, -64, -64, -64, -64, -64, -64, -64, 64, 64, 64, 64, 64, 64, 64, -64, 64, 64, -64, -64, -64, 64, -64, 64, -64, 64, 64, 64, 64, 64, -64, -64, -64, -64, -64, 64, -64, -64, 64, 64, -64, 64, 64, -64, 64, 64, 64, 64, 64, -64, 64, -64, 64, 64, 64, 64, -64, 64, 64, 64, 64, -64, -64, -64, -64, -64, 64, 64, -64, 64, 64, 64, 64, 64, 64, -64, -64, -64, 64, -64, 64, 64, 64, 64, 64, -64, 64, 64, -64, 64, -64, -64, -64, 64, 64, 64, -64, 64, 64, 64, 64, 64, 64, 64, -64, -64, -64, -64, 64, 64, 64, 64, 64, -64, 64, 64, 64, -64, -64, -64, -64, 64, 64, -64, -64, 64, 64, 64, 64, 64, 64, 64, 64, -64, -64, -64, -64, 64, 64, -64, 64, 64, 64, 64, 64, -64, -64, -64, 64, -64, -64, 64, -64, 64, 64, -64, 64, 64, -64, -64, -64, -64, -64, -64, 64, 64, 64, 64, -64, 64, 64, 64, -64, 64, -64, -64, 64, -64, -64, 64, -64, 64, -64, 64, -64, 64, -64, -64, -64, -64, -64, -64, -64, -64, -64, -64, -64, 64, 64, 64, -64, -64, -64, -64, -64, 64, -64, -64, -64, -64, -64, -64, 64, 64, -64, -64, -64, -64, -64, -64, 64, 64, 64, -64, 64, 64, -64, -64, -64, -64, -64, -64, 64, 64, 64, 64, -64, -64, -64, -64, 64, 64, -64, -64, -64, -64, -64, -64, -64, 64, 64, -64, 64, -64, 64, -64, -64, -64, -64, 64, -64, -64, 64, -64, -64, 64, 64, 64, 64, 64, 64, -64, -64, -64, -64, 64, -64, 64, -64, 64, -64, -64, 64, -64, -64, -64, -64, 64, 64, 64, -64, -64, 64, -64, -64, -64, -64, 64, 64, -64, -64, -64, 64, -64, -64, 64, -64, 64, 64, -64, -64, -64, -64, -64, -64, 64, 64, 64, -64, -64, -64, -64, -64, 64, 64, 64, 64, -64, -64, -64, -64, -64, -64, 64, 64, 64, 64, -64, -64, -64, 64, 64, -64, 64, 64, 64, -64, -64, 64, 64, -64, 64, 64, -64, -64, -64, -64, -64, -64, -64, -64, -64, 64, 64, 64, -64, 64, 64, 64, 64, 64, 64, 64, -64, -64, 64, 64, 64, -64, -64, 64, -64, -64, 64, -64, 64, -64, 64, -64, 64, 64, 64, 64, 64, 64, 64, 64, 64, 64, 64, 64, 64, -64, 64, -64, -64, 64, 64, 64, -64, -64, 64, 64, -64, -64, -64, -64, -64, 64, 64, 64, 64, 64, 64, 64, -64, 64, -64, 64, 64, -64, 64, -64, -64, 64, 64, 64, 64, 64, -64, 64, 64, 64, 64, 64, 64, 64, 64, 64, 64, 64, 64, -64, 64, 64, -64, -64, -64, 64, -64, 64, -64, 64, -64, 64, -64, -64, 64, 64, -64, 64, 64, 64, 64, 64, 64, -64, 64, 64, -64, 64, -64, 64, -64, 64, 64, -64, 64, 64, 64, 64, -64, 64, -64, 64, -64, 64, 64, 64, -64, 64, -64, -64, 64, -64, 64, -64, 64, 64, -64, -64, -64, 64, 64, -64, -64, -64, 64, -64, 64, -64, -64, 64, -64, 64, 64, -64, 64, -64, -64, -64, -64, 64, 64, -64, -64, 64, -64, -64, 64, -64, -64, -64, -64, -64, -64, 64, 64, 64, 64, -64, -64, -64, -64, 64, 64, 64, 64, 64, 64, 64, -64, 64, 64, 64, 64, -64, 64, -64, -64, 64, 64, -64, -64, 64, 64, 64, 64, -64, -64, 64, 64, 64, 64, 64, 64, 64, 64, 64, 64, 64, 64, 64, -64, -64, -64, 64, 64, 64, -64, 64, -64, 64, 64, 64, 64, 64, 64, 64, 64, 64, 64, 64, 64, 64, -64, 64, -64, -64, 64, -64, -64, -64, -64, -64, 64, -64, -64, 64, -64, 64, 64, 64, 64, 64, 64, 64, 64, 64, 64, 64, -64, 64, -64, -64, -64, -64, 64, 64, -64, -64, -64, 64, 64, 64, 64, 64, 64, 64, 64, -64, -64, -64, -64, -64, 64, -64, -64, -64, 64, 64, -64, -64, 64, -64, -64, 64, 64, 64, 64, 64, 64, -64, 64, 64, 64, 64, -64, -64, 64, -64, 64, 64, -64, -64, -64, 64, -64, 64, 64, 64, 64, 64, 64, 64, 64, -64, 64, -64, 64, -64, -64, 64, 64, 64, 64, -64, -64, 64, -64, 64, -64, 64, 64, -64, 64, -64, -64, 64, 64, 64, 64, 64, -64, 64, -64, 64, -64, 64, -64, 64, -64, -64, -64, -64, 64, 64, 64, 64, 64, 64, 64, 64, 64, 64, 64, 64, 64, 64, 64, -64, -64, -64, -64, -64, 64, -64, -64, 64, -64, -64, -64, -64, -64, -64, 64, 64, 64, 64, 64, -64, 64, 64, -64, 64, 64, -64, -64, -64, -64, -64, -64, 64, -64, -64, 64, 64, -64, -64, -64, -64, 64, 64, 64, 64, 64, 64, 64, 64, -64, 64, 64, -64, -64, -64, -64, -64, -64, -64, -64, -64, -64, -64, -64, 64, -64, -64, -64, -64, 64, 64, 64, 64, -64, 64, -64, -64, -64, 64, 64, -64, -64, -64, -64, 64, -64, -64, 64, 64, 64, 64, -64, -64, -64, -64, 64, -64, 64, -64, -64, 64, 64, 64, 64, -64, -64, 64, 64, 64, -64, -64, -64, -64, -64, -64, 64, 64, 64, 64, 64, 64, -64, 64, -64, 64, 64, 64, 64, -64, 64, 64, 64, -64, -64, 64, 64, 64, 64, 64, -64, 64, -64, -64, -64, 64, 64, 64, -64, 64, 64, -64, 64, -64, 64, 64, 64, -64, 64, 64, 64, 64, 64, 64, 64, 64, 64, 64, 64, 64, 64, -64, -64, -64, -64, 64, 64, 64, 64, 64, -64, 64, 64, 64, 64, 64, 64, 64, 64, 64, 64, 64, 64, 64, 64, 64, 64, 64, -64, -64, 64, 64, -64, 64, -64, 64, 64, 64, 64, -64, 64, 64, 64, 64, -64, 64, 64, 64, 64, 64, 64, 64, 64, 64, -64, 64, -64, -64, -64, -64, -64, -64, -64, 64, 64, 64, -64, 64, 64, -64, -64, -64, -64, -64, -64, 64, 64, 64, 64, 64, 64, 64, -64, -64, -64, -64, -64, -64, 64, -64, 64, 64, 64, 64, -64, -64, -64, -64, -64, -64, -64, -64, 64, 64, 64, 64, 64, 64, 64, 64, 64, -64, -64, 64, -64, -64, -64, 64, 64, -64, 64, -64, 64, -64, -64, -64, -64, -64, 64, 64, 64, 64, 64, 64, 64, 64, 64, -64, -64, 64, 64, -64, -64, -64, -64, -64, 64, 64, -64, 64, 64, 64, -64, 64, 64, 64, 64, 64, 64, 64, 64, 64, -64, -64, -64, 64, -64, -64, 64, -64, 64, 64, -64, -64, 64, 64, -64, 64, 64, -64, -64, -64, 64, 64, 64, 64, 64, 64, 64, 64, -64, -64, -64, 64, -64, -64, -64, -64, -64, -64, 64, -64, -64, -64, -64, 64, -64, 64, 64, 64, 64, 64, 64, 64, 64, 64, 64, -64, -64, -64, 64, 64, 64, -64, -64, -64, -64, -64, -64, -64, 64, -64, 64, -64, -64, 64, 64, 64, -64, -64, 64, 64, 64, 64, 64, -64, -64, -64, -64, 64, 64, -64, 64, -64, 64, 64, 64, 64, -64, -64, -64, 64, -64, 64, 64, 64, 64, -64, 64, 64, 64, 64, -64, -64, -64, -64, -64, 64, 64, 64, -64, -64, 64, -64, -64, 64, -64, 64, -64, -64, -64, -64, -64, -64, 64, -64, -64, -64, -64, -64, -64, 64, 64, -64, -64, -64, -64, -64, -64, 64, 64, 64, -64, 64, -64, -64, 64, -64, 64, 64, -64, 64, -64, -64, -64, -64, -64, 64, -64, 64, -64, -64, 64, 64, 64, 64, 64, -64, -64, 64, -64, 64, -64, -64, 64, -64, -64, 64, 64, 64, 64, 64, 64, 64, -64, 64, 64, -64, -64, 64, -64, 64, -64, -64, 64, -64, 64, -64, 64, -64, 64, 64, -64, 64, 64, -64, -64, -64, -64, 64, -64, 64, -64, -64, 64, -64, 64, 64, 64, 64, 64, 64, -64, 64, -64, 64, -64, 64, 64, -64, -64, -64, -64, -64, -64, -64, -64, 64, -64, -64, -64, 64, 64, 64, -64, -64, 64, 64, -64, -64, 64, 64, 64, 64, 64, 64, 64, 64, 64, 64, 64, 64, 64, 64, 64, -64, 64, -64, -64, -64, -64, -64, 64, 64, 64, -64, 64, -64, -64, 64, -64, 64, -64, 64, 64, 64, 64, -64, -64, -64, -64, -64, 64, -64, -64, 64, 64, -64, -64, -64, -64, -64, 64, -64, -64, 64, -64, 64, -64, -64, -64, -64, 64, 64, -64, -64, -64, -64, -64, -64, -64, 64, 64, -64, 64, -64, -64, -64, -64, -64, -64, -64, -64, -64, -64, 64, 64, 64, -64, 64, -64, -64, 64, 64, -64, 64, 64, -64, -64, 64, 64, -64, -64, -64, -64, -64, 64, 64, -64, 64, 64, 64, 64, 64, 64, 64, 64, 64, 64, 64, -64, -64, 64, 64, 64, -64, 64, 64, -64, 64, -64, -64, -64, 64, -64, -64, 64, 64, -64, -64, -64, -64, -64, -64, -64, 64, -64, 64, -64, -64, -64, -64, -64, -64, -64, -64, 64, -64, -64, -64, 64, -64, -64, -64, -64, 64, 64, -64, -64, -64, 64, 64, -64, -64, -64, -64, -64, -64, 64, 64, -64, 64, -64, 64, -64, -64, 64, 64, -64, -64, 64, -64, -64, 64, -64, 64, 64, -64, 64, -64, -64, 64, -64, 64, 64, -64, -64, -64, 64, 64, 64, -64, 64, 64, 64, -64, 64, 64, -64, -64, -64, -64, -64, 64, -64, 64, 64, -64, -64, 64, -64, -64, -64, 64, 64, -64, -64, -64, -64, -64, -64, 64, -64, -64, 64, -64, 64, -64, 64, -64, 64, -64, -64, 64, -64, -64, 64, 64, -64, 64, -64, 64, 64, -64, 64, -64, -64, 64, -64, -64, -64, -64, -64, -64, -64, -64, -64, -64, -64, -64, -64, -64, -64, -64, 64, 64, -64, 64, -64, -64, -64, -64, 64, 64, -64, 64, -64, -64, -64, -64, -64, -64, -64, -64, -64, -64, -64, -64, -64, 64, 64, -64, -64, -64, 64, -64, 64, -64, -64, 64, -64, 64, 64, -64, -64, -64, -64, 64, 64, -64, 64, -64, 64, 64, -64, -64, 64, -64, -64, -64, -64, 64, -64, -64, 64, 64, 64, -64, 64, -64, -64, -64, 64, 64, 64, 64, 64, -64, -64, -64, -64, 64, 64, -64, -64, 64, -64, 64, 64, -64, -64, -64, -64, -64, -64, -64, -64, 64, 64, -64, -64, 64, -64, -64, 64, -64, 64, 64, -64, -64, -64, -64, -64, 64, 64, 64, 64, -64, 64, -64, 64, -64, 64, 64, -64, -64, -64, -64, 64, -64, -64, -64, -64, -64, -64, 64, -64, -64, 64, -64, -64, -64, 64, 64, -64, -64, 64, 64, -64, -64, -64, 64, -64, 64, -64, 64, -64, -64, -64, -64, -64, -64, -64, -64, -64, -64, -64, -64, 64, 64, 64, 64, 64, 64, 64, 64, 64, 64, 64, 64, 64, -64, -64, 64, -64, 64, -64, -64, -64, -64, 64, -64, 64, -64, 64, 64, -64, -64, 64, -64, 64, -64, -64, 64, -64, -64, 64, -64, -64, 64, -64, -64, -64, -64, -64, -64, -64, -64, -64, 64, 64, -64, -64, 64, 64, 64, 64, 64, -64, 64, 64, 64, -64, -64, -64, -64, -64, 64, 64, -64, -64, 64, 64, -64, -64, -64, 64, -64, -64, -64, -64, -64, -64, -64, 64, -64, 64, -64, 64, 64, -64, 64, 64, 64, -64, -64, -64, 64, 64, 64, -64, 64, -64, -64, -64, 64, -64, -64, 64, -64, 64, -64, 64, 64, -64, 64, 64, 64, -64, -64, 64, -64, 64, -64, -64, -64, -64, -64, 64, -64, -64, -64, 64, 64, 64, 64, 64, 64, -64, 64, 64, 64, 64, 64, -64, 64, -64, 64, -64, -64, -64, -64, -64, 64, -64, -64, -64, -64, -64, 64, 64, 64, -64, -64, 64, -64, 64, 64, -64, -64, -64, 64, -64, 64, -64, -64, -64, -64, 64, 64, -64, 64, 64, -64, 64, -64, -64, 64, 64, 64, 64, -64, 64, 64, -64, -64, 64, 64, -64, -64, -64, 64, -64, -64, -64, 64, -64, -64, -64, 64, -64, 64, -64, -64, -64, 64, 64, -64, -64, -64, -64, 64, 64, 64, 64, 64, 64, 64, 64, 64, 64, 64, -64, 64, 64, -64, -64, -64, -64, 64, -64, 64, -64, 64, 64, 64, 64, -64, -64, -64, 64, -64, -64, 64, -64, 64, -64, 64, -64, 64, 64, 64, -64, -64, 64, 64, -64, 64, -64, 64, 64, -64, 64, 64, 64, 64, 64, -64, -64, -64, -64, 64, -64, -64, 64, -64, 64, 64, -64, 64, -64, -64, -64, -64, 64, 64, -64, 64, -64, 64, -64, -64, 64, -64, -64, 64, 64, -64, 64, -64, 64, -64, -64, -64, -64, -64, 64, -64, -64, 64, 64, -64, 64, 64, 64, 64, 64, 64, -64, 64, 64, -64, 64, -64, 64, 64, 64, 64, 64, 64, -64, 64, -64, 64, 64, 64, -64, 64, 64, -64, 64, 64, 64, 64, -64, 64, 64, 64, -64, -64, 64, -64, -64, -64, 64, 64, -64, -64, -64, -64, 64, 64, -64, 64, 64, 64, 64, 64, -64, -64, 64, 64, 64, -64, 64, 64, -64, -64, -64, -64, 64, -64, -64, 64, -64, -64, -64, -64, 64, -64, -64, -64, -64, 64, -64, -64, -64, 64, 64, -64, -64, -64, -64, -64, -64, -64, -64, -64, -64, 64, 64, 64, 64, 64, 64, -64, 64, 64, 64, -64, 64, 64, 64, -64, -64, 64, 64, 64, 64, 64, 64, -64, -64, -64, -64, -64, -64, 64, 64, 64, 64, -64, 64, 64, 64, -64, -64, 64, 64, 64, 64, -64, 64, 64, 64, 64, -64, 64, 64, 64, -64, -64, -64, -64, -64, -64, -64, 64, 64, -64, 64, 64, -64, 64, 64, 64, 64, -64, 64, 64, 64, -64, 64, 64, 64, 64, 64, -64, -64, -64, -64, -64, -64, -64, -64, 64, -64, -64, 64, 64, 64, 64, -64, 64, 64, 64, 64, 64, -64, 64, -64, -64, 64, 64, 64, 64, -64, -64, -64, -64, -64, 64, 64, -64, -64, -64, 64, 64, 64, 64, -64, 64, 64, 64, -64, -64, -64, -64, 64, 64, 64, 64, 64, -64, 64, -64, -64, -64, -64, 64, -64, -64, -64, 64, 64, -64, -64, 64, -64, 64, 64, -64, -64, 64, 64, -64, 64, 64, 64, 64, 64, 64, 64, -64, -64, -64, -64, -64, -64, 64, -64, 64, -64, -64, 64, 64, 64, 64, -64, -64, -64, -64, 64, 64, 64, 64, 64, 64, 64, 64, -64, -64, -64, -64, 64, -64, -64, 64, 64, 64, -64, -64, 64, 64, -64, 64, -64, -64, 64, 64, 64, 64, 64, 64, 64, 64, 64, -64, 64, -64, 64, -64, -64, -64, -64, 64, 64, 64, 64, 64, -64, 64, -64, -64, -64, -64, -64, 64, 64, 64, 64, 64, 64, 64, 64, 64, 64, -64, 64, -64, -64, -64, -64, 64, 64, 64, 64, 64, 64, 64, -64, -64, -64, -64, -64, 64, -64, -64, 64, 64, 64, 64, -64, 64, -64, 64, 64, -64, -64, 64, -64, -64, 64, 64, -64, 64, 64, -64, -64, -64, -64, -64, -64, -64, 64, 64, 64, 64, 64, 64, -64, 64, -64, -64, 64, -64, -64, 64, 64, -64, 64, 64, 64, 64, 64, -64, -64, -64, -64, -64, -64, 64, -64, 64, 64, 64, 64, -64, 64, 64, -64, -64, 64, 64, 64, 64, 64, 64, -64, -64, 64, -64, 64, -64, -64, -64, -64, 64, -64, -64, -64, 64, 64, 64, 64, 64, 64, 64, 64, -64, -64, 64, 64, 64, -64, 64, -64, 64, 64, -64, -64, -64, -64, -64, -64, 64, -64, 64, 64, 64, -64, 64, 64, 64, 64, 64, 64, -64, 64, 64, 64, 64, -64, 64, -64, -64, -64, 64, -64, -64, -64, -64, 64, 64, 64, -64, 64, -64, -64, 64, 64, 64, 64, 64, -64, 64, 64, 64, 64, 64, -64, 64, -64, -64, -64, 64, -64, -64, -64, -64, -64, -64, -64, 64, 64, -64, 64, 64, 64, 64, 64, 64, 64, 64, 64, 64, -64, 64, 64, 64, 64, -64, -64, -64, -64, 64, -64, -64, -64, 64, 64, -64, 64, -64, 64, 64, 64, 64, -64, 64, -64, 64, 64, -64, -64, -64, 64, -64, 64, 64, -64, 64, -64, 64, -64, 64, 64, -64, -64, -64, 64, 64, 64, 64, 64, 64, 64, -64, 64, -64, 64, -64, -64, 64, 64, 64, 64, -64, -64, 64, 64, 64, 64, -64, -64, -64, -64, -64, 64, -64, -64, -64, -64, 64, 64, 64, 64, -64, -64, 64, 64, 64, -64, 64, 64, 64, 64, 64, 64, -64, 64, -64, 64, 64, 64, 64, 64, 64, 64, 64, 64, 64, 64, 64, -64, 64, -64, 64, 64, -64, -64, -64, -64, -64, -64, 64, 64, 64, -64, 64, -64, -64, -64, -64, -64, 64, 64, 64, 64, -64, 64, 64, -64, 64, 64, 64, -64, 64, -64, -64, -64, 64, -64, -64, -64, 64, 64, -64, 64, -64, 64, 64, 64, 64, -64, -64, 64, -64, -64, -64, -64, -64, 64, 64, 64, -64, -64, -64, -64, 64, 64, 64, 64, 64, -64, -64, -64, 64, -64, 64, 64, -64, -64, -64, 64, -64, -64, 64, -64, -64, -64, 64, -64, 64, -64, 64, -64, 64, -64, -64, -64, -64, 64, -64, -64, -64, -64, -64, -64, 64, 64, 64, 64, 64, -64, 64, 64, 64, -64, 64, 64, 64, -64, 64, -64, 64, 64, 64, -64, -64, -64, 64, 64, 64, 64, -64, 64, -64, 64, -64, -64, 64, -64, -64, -64, 64, 64, -64, 64, 64, 64, 64, -64, -64, 64, -64, 64, 64, 64, 64, -64, -64, -64, -64, 64, -64, 64, 64, 64, -64, -64, -64, -64, -64, -64, -64, -64, -64, -64, -64, 64, 64, -64, 64, -64, -64, 64, 64, 64, -64, -64, 64, -64, 64, 64, -64, -64, -64, -64, -64, -64, -64, -64, -64, -64, -64, 64, 64, 64, 64, 64, -64, 64, 64, -64, 64, -64, -64, -64, -64, -64, -64, 64, 64, 64, -64, -64, 64, 64, 64, 64, -64, -64, 64, 64, 64, -64, -64, -64, 64, 64, 64, 64, 64, -64, 64, 64, -64, -64, -64, -64, 64, 64, -64, -64, -64, -64, 64, -64, 64, 64, 64, 64, -64, 64, 64, -64, -64, -64, 64, 64, 64, 64, -64, 64, -64, -64, -64, -64, 64, -64, -64, -64, -64, -64, 64, 64, 64, 64, 64, 64, -64, 64, -64, -64, 64, -64, 64, -64, -64, 64, 64, -64, -64, -64, -64, 64, 64, -64, -64, 64, -64, 64, 64, 64, 64, 64, 64, 64, -64, 64, 64, -64, 64, 64, 64, -64, -64, -64, -64, 64, -64, -64, 64, 64, -64, -64, 64, -64, -64, -64, 64, 64, 64, 64, 64, 64, 64, 64, -64, -64, 64, 64, -64, -64, 64, -64, 64, 64, -64, -64, -64, 64, -64, -64, -64, 64, 64, 64, -64, 64, 64, 64, 64, 64, 64, 64, -64, -64, 64, 64, -64, 64, -64, -64, -64, -64, -64, -64, -64, 64, -64, -64, -64, -64, 64, -64, 64, -64, -64, 64, 64, 64, -64, 64, 64, 64, 64, 64, 64, 64, 64, 64, 64, -64, -64, 64, 64, 64, 64, 64, -64, -64, -64, 64, -64, -64, -64, -64, -64, -64, -64, -64, -64, 64, 64, -64, 64, -64, 64, -64, 64, -64, -64, -64, 64, -64, 64, 64, -64, -64, -64, -64, -64, -64, -64, -64, 64, 64, 64, -64, 64, 64, 64, -64, 64, 64, -64, -64, -64, -64, -64, -64, -64, -64, -64, -64, -64, -64, -64, -64, -64, -64, 64, 64, 64, -64, -64, -64, -64, 64, 64, 64, 64, 64, 64, -64, -64, -64, -64, 64, -64, -64, 64, -64, -64, -64, -64, 64, -64, 64, -64, 64, 64, -64, -64, 64, 64, -64, 64, 64, -64, 64, -64, -64, -64, -64, -64, -64, 64, -64, -64, -64, -64, -64, -64, 64, 64, -64, 64, 64, 64, -64, -64, -64, -64, -64, 64, 64, 64, 64, -64, -64, -64, -64, -64, -64, -64, -64, -64, -64, -64, 64, -64, -64, 64, -64, -64, 64, -64, -64, -64, 64, 64, 64, 64, 64, 64, -64, 64, -64, -64, -64, -64, -64, -64, -64, -64, -64, -64, -64, -64, 64, -64, -64, -64, 64, -64, -64, -64, -64, -64, -64, 64, 64, 64, -64, -64, 64, -64, -64, -64, 64, -64, -64, -64, -64, -64, -64, -64, -64, -64, 64, 64, 64, -64, -64, -64, -64, 64, -64, 64, 64, -64, -64, -64, -64, -64, -64, -64, -64, 64, -64, 64, -64, -64, -64, -64, -64, -64, -64, -64, -64, 64, 64, 64, 64, 64, -64, -64, -64, -64, -64, -64, -64, -64, -64, 64, 64, -64, 64, -64, -64, -64, -64, -64, -64, -64, -64, -64, 64, 64, 64, -64, -64, 64, 64, -64, -64, -64, 64, -64, -64, -64, -64, 64, -64, 64, -64, -64, 64, 64, -64, -64, -64, -64, -64, 64, -64, 64, 64, -64, 64, -64, 64, 64, -64, 64, 64, -64, -64, -64, 64, 64, -64, 64, 64, 64, 64, 64, -64, -64, -64, -64, -64, 64, 64, 64, 64, -64, 64, -64, 64, 64, 64, 64, 64, 64, -64, -64, 64, 64, -64, -64, 64, 64, 64, 64, -64, -64, 64, 64, -64, -64, -64, -64, 64, 64, 64, -64, 64, -64, 64, -64, -64, -64, 64, 64, 64, 64, -64, -64, 64, 64, 64, 64, -64, 64, -64, -64, -64, -64, -64, 64, 64, 64, 64, 64, 64, 64, -64, -64, -64, 64, -64, 64, 64, 64, -64, -64, 64, 64, 64, 64, -64, -64, -64, -64, 64, 64, -64, -64, -64, 64, 64, -64, -64, 64, 64, 64, -64, 64, 64, 64, -64, -64, -64, 64, -64, 64, -64, -64, -64, -64, 64, 64, -64, -64, -64, -64, 64, -64, -64, 64, 64, 64, -64, 64, -64, -64, 64, -64, 64, -64, 64, 64, 64, -64, 64, 64, 64, -64, -64, -64, -64, 64, 64, 64, 64, -64, -64, -64, -64, 64, 64, 64, -64, -64, -64, 64, -64, 64, -64, 64, -64, -64, -64, 64, 64, -64, 64, -64, 64, 64, -64, -64, -64, -64, 64, 64, -64, 64, -64, -64, -64, -64, -64, -64, -64, -64, 64, -64, -64, -64, 64, 64, 64, -64, 64, -64, 64, 64, 64, 64, 64, -64, -64, -64, -64, 64, -64, -64, -64, 64, -64, 64, -64, -64, 64, -64, 64, -64, -64, -64, 64, 64, -64, -64, -64, -64, -64, 64, -64, -64, -64, 64, -64, -64, 64, -64, 64, -64, 64, 64, 64, -64, 64, 64, 64, -64, 64, 64, -64, -64, 64, -64, -64, 64, -64, 64, 64, 64, -64, -64, 64, 64, -64, 64, -64, 64, -64, -64, 64, 64, -64, 64, -64, -64, 64, -64, 64, -64, -64, -64, 64, -64, 64, -64, 64, 64, -64, -64, -64, 64, -64, -64, 64, -64, -64, -64, -64, -64, -64, -64, -64, -64, -64, -64, -64, -64, -64, 64, -64, -64, 64, -64, -64, -64, -64, -64, 64, 64, -64, -64, 64, -64, 64, -64, -64, -64, -64, -64, -64, -64, -64, 64, -64, -64, -64, -64, -64, -64, -64, 64, -64, -64, -64, -64, -64, -64, 64, 64, 64, 64, -64, -64, -64, 64, -64, -64, -64, 64, -64, 64, 64, 64, 64, -64, -64, 64, -64, -64, -64, -64, -64, 64, -64, -64, 64, 64, -64, -64, 64, -64, -64, -64, -64, -64, -64, -64, -64, -64, -64, -64, 64, 64, -64, 64, -64, -64, 64, -64, 64, -64, -64, -64, 64, -64, -64, -64, 64, -64, -64, -64, -64, -64, -64, -64, -64, 64, -64, -64, -64, -64, 64, -64, 64, 64, -64, -64, -64, -64, -64, 64, -64, 64, -64, -64, 64, 64, -64, 64, -64, -64, 64, -64, 64, -64, -64, -64, -64, -64, -64, -64, 64, -64, -64, -64, 64, -64, 64, -64, -64, 64, -64, 64, 64, -64, -64, -64, -64, -64, -64, -64, -64, -64, -64, 64, 64, 64, -64, 64, 64, 64, 64, 64, 64, 64, 64, 64, -64, 64, -64, -64, -64, 64, -64, 64, -64, -64, -64, -64, -64, -64, -64, -64, 64, 64, -64, 64, 64, 64, 64, -64, 64, -64, -64, 64, -64, -64, -64, 64, 64, -64, -64, -64, -64, -64, 64, -64, -64, -64, -64, 64, 64, -64, -64, 64, 64, 64, -64, -64, 64, -64, -64, -64, 64, -64, 64, 64, 64, 64, 64, -64, 64, 64, -64, -64, -64, -64, -64, -64, -64, -64, 64, -64, -64, 64, 64, 64, -64, 64, 64, -64, 64, 64, 64, -64, 64, -64, 64, -64, 64, 64, -64, -64, -64, -64, -64, 64, 64, -64, -64, 64, 64, 64, -64, 64, 64, 64, 64, 64, -64, 64, -64, 64, 64, -64, -64, 64, 64, -64, -64, 64, -64, -64, 64, -64, -64, -64, -64, 64, 64, -64, -64, -64, 64, 64, -64, 64, 64, -64, 64, 64, -64, 64, 64, 64, -64, -64, -64, -64, -64, -64, -64, -64, -64, -64, -64, 64, -64, 64, -64, 64, 64, 64, 64, -64, 64, -64, -64, -64, -64, -64, 64, 64, 64, -64, -64, 64, -64, -64, -64, -64, -64, -64, 64, 64, 64, 64, -64, 64, 64, -64, -64, 64, 64, 64, 64, 64, -64, -64, -64, 64, 64, 64, -64, 64, 64, -64, -64, 64, 64, 64, 64, 64, 64, 64, 64, -64, -64, -64, -64, 64, -64, 64, 64, -64, -64, -64, -64, 64, 64, -64, 64, 64, 64, -64, 64, -64, 64, 64, 64, 64, -64, -64, -64, -64, 64, 64, -64, 64, -64, -64, 64, -64, -64, -64, -64, -64, -64, -64, -64, -64, 64, -64, -64, 64, -64, 64, -64, -64, 64, 64, -64, 64, -64, 64, 64, -64, -64, 64, 64, 64, -64, -64, -64, 64, -64, -64, -64, -64, -64, -64, -64, 64, 64, -64, -64, 64, 64, -64, 64, -64, 64, -64, 64, -64, -64, 64, -64, -64, -64, 64, 64, -64, -64, -64, -64, 64, -64, -64, -64, -64, -64, -64, -64, 64, -64, 64, -64, -64, 64, 64, -64, 64, 64, -64, -64, -64, -64, 64, -64, -64, -64, -64, -64, -64, -64, -64, -64, 64, -64, 64, -64, -64, 64, 64, -64, -64, 64, 64, -64, -64, 64, 64, 64, -64, -64, -64, -64, 64, -64, 64, -64, -64, -64, -64, -64, -64, 64, -64, 64, 64, 64, 64, 64, 64, 64, -64, -64, -64, -64, -64, 64, -64, -64, -64, 64, -64, -64, -64, 64, 64, -64, 64, 64, 64, 64, -64, 64, -64, 64, 64, 64, 64, -64, 64, -64, -64, 64, -64, 64, 64, -64, 64, 64, -64, -64, -64, 64, -64, 64, -64, 64, 64, 64, -64, 64, -64, 64, -64, -64, -64, -64, -64, 64, -64, -64, 64, 64, 64, 64, 64, 64, -64, 64, 64, -64, 64, 64, 64, -64, 64, 64, -64, 64, 64, 64, 64, 64, -64, 64, -64, 64, -64, -64, 64, -64, 64, 64, 64, 64, 64, 64, 64, -64, -64, 64, -64, 64, 64, -64, 64, 64, 64, 64, -64, 64, 64, 64, 64, 64, -64, -64, 64, -64, -64, -64, 64, -64, 64, 64, -64, -64, 64, 64, 64, -64, 64, 64, -64, -64, 64, 64, 64, -64, 64, 64, -64, -64, 64, -64, 64, 64, -64, -64, -64, 64, -64, 64, -64, 64, -64, -64, 64, 64, -64, 64, -64, -64, 64, 64, -64, -64, -64, -64, -64, 64, -64, 64, 64, -64, -64, 64, 64, 64, 64, -64, -64, 64, -64, 64, -64, -64, -64, -64, -64, 64, 64, -64, 64, -64, -64, -64, -64, -64, 64, 64, 64, 64, -64, 64, -64, -64, -64, -64, -64, -64, -64, -64, -64, -64, 64, -64, -64, -64, 64, -64, -64, 64, -64, 64, -64, 64, -64, 64, -64, -64, -64, -64, -64, -64, -64, -64, -64, -64, -64, -64, 64, -64, -64, -64, -64, -64, 64, 64, -64, 64, -64, -64, -64, -64, -64, 64, -64, -64, 64, -64, -64, -64, 64, 64, -64, -64, 64, -64, -64, -64, -64, 64, 64, 64, -64, -64, 64, -64, -64, 64, 64, 64, 64, 64, 64, -64, 64, 64, 64, -64, 64, -64, -64, -64, 64, -64, -64, -64, -64, -64, -64, 64, -64, -64, -64, -64, 64, 64, -64, 64, 64, 64, -64, -64, -64, 64, 64, 64, 64, -64, -64, 64, -64, 64, -64, -64, -64, 64, 64, 64, -64, 64, 64, -64, -64, -64, 64, 64, -64, 64, -64, -64, 64, -64, -64, 64, -64, 64, -64, -64, -64, -64, -64, -64, -64, 64, -64, -64, 64, 64, -64, -64, -64, 64, 64, -64, 64, 64, -64, 64, -64, 64, -64, 64, -64, -64, -64, -64, -64, -64, -64, 64, -64, 64, -64, -64, -64, 64, -64, 64, -64, 64, -64, 64, 64, -64, -64, -64, 64, 64, -64, -64, -64, -64, -64, -64, -64, -64, -64, 64, 64, 64, -64, -64, 64, 64, 64, -64, -64, 64, 64, -64, -64, -64, -64, 64, 64, 64, -64, 64, -64, -64, -64, -64, -64, -64, -64, -64, 64, 64, -64, 64, -64, 64, 64, -64, 64, 64, 64, 64, -64, -64, 64, -64, 64, -64, 64, 64, -64, -64, 64, 64, -64, 64, 64, 64, -64, 64, 64, -64, 64, 64, -64, 64, 64, 64, 64, -64, -64, -64, 64, -64, -64, 64, -64, -64, 64, -64, -64, -64, 64, -64, -64, 64, -64, -64, 64, -64, -64, 64, 64, -64, -64, 64, -64, 64, 64, -64, -64, 64, -64, -64, -64, -64, -64, -64, 64, -64, -64, -64, -64, 64, 64, -64, 64, -64, 64, 64, 64, 64, -64, -64, 64, -64, -64, 64, -64, 64, -64, -64, -64, -64, -64, -64, -64, -64, -64, -64, 64, -64, -64, -64, -64, -64, 64, 64, -64, -64, 64, 64, -64, -64, 64, 64, -64, 64, -64, 64, -64, 64, -64, -64, -64, -64, -64, -64, -64, 64, -64, -64, 64, 64, 64, 64, -64, 64, -64, 64, 64, 64, -64, 64, -64, -64, 64, 64, -64, 64, -64, -64, -64, 64, -64, -64, -64, -64, 64, -64, -64, -64, -64, -64, -64, -64, -64, -64, 64, 64, -64, -64, 64, -64, -64, -64, -64, 64, 64, -64, -64, -64, -64, 64, 64, -64, 64, -64, -64, 64, -64, -64, 64, -64, -64, 64, -64, 64, 64, -64, 64, 64, 64, -64, -64, -64, -64, -64, -64, -64, -64, 64, 64, -64, 64, 64, -64, -64, -64, -64, 64, 64, 64, 64, 64, 64, 64, -64, -64, -64, 64, 64, -64, 64, 64, 64, -64, 64, -64, -64, 64, -64, -64, 64, -64, 64, -64, -64, 64, -64, 64, -64, -64, 64, -64, -64, 64, 64, -64, -64, 64, -64, -64, -64, -64, 64, -64, 64, 64, 64, -64, -64, 64, -64, 64, -64, -64, -64, -64, -64, 64, 64, 64, 64, -64, 64, -64, 64, 64, -64, 64, 64, 64, 64, -64, -64, 64, -64, 64, -64, -64, 64, 64, 64, -64, -64, 64, 64, 64, -64, -64, -64, -64, -64, -64, 64, 64, 64, 64, 64, -64, -64, 64, -64, 64, -64, 64, -64, -64, -64, 64, -64, -64, 64, 64, -64, -64, -64, -64, -64, -64, 64, -64, -64, -64, 64, 64, 64, -64, 64, -64, -64, -64, -64, -64, 64, -64, 64, 64, 64, 64, 64, 64, 64, 64, -64, 64, -64, 64, 64, 64, 64, -64, 64, -64, 64, 64, 64, -64, -64, 64, -64, -64, 64, 64, 64, 64, 64, 64, -64, -64, 64, 64, -64, -64, -64, -64, -64, -64, 64, 64, 64, 64, -64, 64, -64, 64, 64, 64, -64, 64, -64, 64, -64, 64, -64, -64, -64, -64, 64, -64, 64, 64, 64, -64, 64, -64, 64, 64, 64, -64, 64, 64, -64, -64, 64, -64, 64, -64, -64, 64, 64, -64, 64, -64, -64, -64, 64, -64, -64, 64, 64, 64, 64, 64, 64, 64, -64, -64, -64, 64, 64, 64, 64, 64, 64, 64, 64, 64, -64, -64, -64, 64, 64, 64, 64, -64, 64, 64, -64, -64, 64, 64, 64, 64, 64, 64, -64, -64, 64, 64, 64, 64, -64, -64, 64, 64, 64, 64, 64, -64, -64, -64, 64, -64, -64, -64, -64, -64, 64, 64, -64, -64, 64, 64, 64, 64, 64, 64, -64, 64, -64, 64, -64, 64, 64, 64, -64, -64, -64, -64, -64, 64, -64, 64, 64, 64, -64, 64, 64, -64, -64, 64, -64, -64, 64, 64, 64, -64, 64, 64, 64, 64, -64, 64, 64, 64, -64, -64, 64, -64, -64, -64, 64, 64, 64, 64, 64, -64, -64, -64, -64, 64, -64, -64, -64, 64, 64, -64, 64, -64, 64, 64, 64, 64, 64, -64, -64, 64, 64, -64, -64, -64, 64, 64, 64, -64, 64, -64, 64, 64, 64, -64, -64, 64, -64, -64, -64, 64, 64, 64, 64, -64, 64, 64, 64, -64, 64, -64, 64, 64, -64, 64, -64, -64, 64, 64, -64, -64, 64, 64, 64, 64, -64, -64, -64, -64, 64, 64, 64, 64, -64, -64, 64, -64, 64, 64, -64, 64, 64, 64, 64, -64, 64, -64, 64, 64, 64, 64, -64, 64, 64, -64, -64, 64, 64, -64, 64, -64, 64, 64, -64, 64, 64, -64, 64, -64, 64, -64, 64, 64, -64, -64, 64, 64, -64, -64, 64, 64, 64, -64, 64, 64, -64, 64, 64, 64, 64, -64, -64, -64, 64, 64, 64, 64, 64, 64, 64, 64, 64, 64, 64, 64, -64, 64, 64, 64, -64, 64, 64, -64, 64, -64, -64, 64, -64, -64, -64, -64, -64, -64, -64, 64, 64, -64, 64, 64, 64, 64, -64, -64, 64, 64, 64, 64, 64, 64, 64, 64, -64, 64, -64, 64, -64, -64, -64, 64, -64, -64, -64, 64, 64, -64, 64, 64, 64, 64, 64, 64, 64, -64, 64, -64, 64, 64, 64, 64, 64, -64, 64, -64, 64, 64, -64, -64, 64, -64, 64, 64, -64, 64, -64, 64, -64, 64, -64, -64, 64, 64, -64, 64, -64, 64, 64, 64, -64, -64, 64, 64, 64, 64, -64, 64, -64, 64, -64, -64, 64, 64, 64, 64, 64, 64, 64, -64, -64, -64, 64, 64, 64, 64, 64, -64, 64, -64, -64, -64, 64, -64, 64, 64, -64, 64, -64, 64, 64, 64, -64, 64, 64, -64, 64, -64, 64, -64, -64, 64, 64, -64, -64, 64, 64, -64, 64, -64, 64, -64, -64, 64, -64, -64, 64, -64, 64, 64, 64, -64, 64, -64, 64, -64, 64, 64, 64, 64, -64, -64, 64, 64, -64, -64, 64, 64, 64, 64, 64, 64, 64, 64, -64, 64, 64, 64, -64, -64, 64, -64, 64, 64, 64, -64, 64, 64, 64, 64, -64, -64, 64, -64, 64, -64, -64, 64, 64, 64, -64, -64, -64, -64, -64, 64, 64, -64, 64, -64, 64, 64, 64, -64, 64, 64, 64, 64, -64, 64, 64, 64, 64, -64, 64, 64, -64, -64, -64, 64, -64, -64, 64, -64, 64, 64, 64, -64, -64, 64, 64, -64, 64, 64, -64, 64, 64, 64, 64, 64, 64, -64, 64, -64, -64, 64, -64, 64, -64, 64, -64, 64, 64, 64, 64, 64, 64, 64, -64, 64, 64, 64, -64, -64, -64, 64, -64, -64, -64, -64, 64, -64, -64, 64, -64, 64, 64, 64, 64, 64, 64, 64, -64, 64, -64, 64, 64, 64, -64, 64, 64, -64, -64, 64, -64, 64, 64, -64, -64, 64, -64, 64, -64, 64, -64, -64, -64, 64, 64, 64, -64, 64, 64, 64, -64, -64, 64, 64, 64, 64, 64, 64, 64, -64, -64, -64, 64, 64, -64, -64, -64, 64, -64, -64, -64, 64, 64, 64, 64, -64, 64, -64, 64, 64, -64, 64, 64, -64, 64, 64, 64, -64, -64, -64, 64, -64, -64, -64, -64, -64, 64, -64, -64, 64, 64, 64, 64, -64, 64, 64, -64, -64, 64, -64, -64, -64, 64, -64, -64, 64, -64, -64, -64, 64, -64, -64, -64, 64, -64, 64, 64, 64, 64, 64, -64, -64, 64, -64, -64, 64, -64, -64, 64, 64, 64, 64, 64, -64, 64, -64, 64, -64, 64, 64, -64, -64, 64, -64, -64, 64, -64, -64, 64, -64, -64, 64, 64, -64, -64, -64, -64, -64, 64, 64, -64, -64, -64, -64, -64, 64, -64, 64, -64, -64, 64, -64, 64, 64, 64, 64, -64, 64, -64, 64, 64, 64, 64, 64, 64, 64, 64, -64, 64, 64, -64, -64, -64, -64, 64, 64, -64, 64, 64, -64, 64, 64, -64, -64, -64, -64, -64, -64, -64, 64, 64, 64, 64, 64, 64, 64, 64, -64, 64, -64, 64, -64, 64, -64, -64, -64, -64, -64, -64, 64, 64, 64, 64, -64, -64, 64, -64, -64, -64, 64, -64, -64, -64, -64, 64, 64, 64, 64, -64, 64, 64, -64, 64, -64, -64, -64, -64, -64, 64, 64, 64, 64, 64, -64, 64, -64, -64, -64, -64, -64, -64, 64, 64, 64, 64, 64, -64, -64, -64, 64, -64, 64, -64, -64, 64, 64, 64, -64, 64, 64, 64, 64, -64, -64, 64, 64, -64, -64, 64, 64, 64, 64, 64, 64, 64, -64, 64, -64, 64, 64, 64, 64, 64, 64, 64, 64, 64, 64, -64, -64, -64, 64, -64, -64, 64, 64, 64, 64, -64, 64, 64, -64, 64, -64, 64, -64, -64, -64, -64, -64, 64, 64, 64, 64, 64, 64, 64, 64, -64, -64, -64, 64, -64, 64, 64, -64, -64, 64, 64, -64, 64, -64, -64, 64, 64, -64, 64, -64, 64, 64, 64, 64, 64, -64, 64, -64, -64, -64, -64, -64, -64, 64, -64, -64, 64, 64, 64, 64, 64, 64, -64, 64, -64, -64, 64, 64, 64, 64, 64, 64, 64, 64, 64, 64, -64, -64, -64, -64, 64, -64, -64, -64, 64, 64, 64, -64, 64, -64, -64, 64, -64, -64, 64, -64, 64, -64, 64, 64, 64, 64, 64, 64, -64, -64, -64, 64, -64, -64, 64, 64, 64, -64, 64, -64, 64, 64, -64, -64, -64, -64, -64, -64, 64, 64, 64, 64, 64, 64, 64, -64, -64, -64, -64, -64, -64, 64, 64, 64, 64, 64, 64, -64, 64, -64, 64, -64, 64, 64, 64, -64, 64, 64, 64, 64, 64, 64, -64, -64, -64, -64, -64, -64, -64, 64, 64, 64, 64, 64, 64, 64, -64, -64, 64, 64, -64, -64, 64, 64, 64, 64, 64, 64, 64, 64, -64, -64, -64, -64, -64, -64, -64, 64, 64, 64, 64, 64, 64, 64, -64, 64, 64, -64, -64, 64, 64, 64, -64, 64, -64, 64, 64, 64, 64, -64, -64, -64, 64, -64, -64, -64, 64, -64, 64, 64, 64, 64, -64, 64, -64, 64, -64, 64, 64, 64, -64, 64, 64, 64, 64, 64, -64, -64, 64, 64, 64, -64, -64, 64, 64, -64, 64, -64, 64, 64, -64, 64, -64, 64, 64, 64, 64, 64, 64, -64, 64, 64, 64, 64, 64, 64, 64, 64, 64, 64, -64, 64, 64, 64, 64, 64, 64, 64, -64, 64, 64, -64, -64, -64, 64, -64, 64, 64, 64, 64, 64, 64, 64, 64, 64, 64, -64, -64, 64, 64, 64, 64, 64, 64, 64, 64, 64, 64, 64, 64, 64, -64, -64, -64, 64, 64, 64, 64, 64, 64, 64, 64, 64, -64, -64, -64, 64, 64, 64, 64, 64, 64, 64, 64, 64, -64, -64, 64, -64, -64, -64, -64, -64, 64, 64, 64, 64, 64, 64, 64, -64, 64, -64, -64, 64, 64, 64, -64, 64, 64, 64, -64, -64, -64, 64, -64, -64, -64, -64, -64, -64, 64, -64, -64, 64, 64, 64, -64, -64, 64, 64, -64, 64, 64, 64, 64, 64, 64, 64, -64, 64, -64, 64, -64, -64, -64, -64, -64, -64, -64, -64, 64, 64, -64, 64, 64, -64, 64, -64, 64, 64, 64, 64, 64, 64, 64, 64, 64, 64, -64, 64, -64, -64, -64, -64, -64, -64, -64, 64, 64, 64, 64, -64, 64, 64, 64, 64, 64, 64, 64, 64, 64, -64, -64, -64, -64, -64, 64, 64, -64, -64, -64, -64, -64, -64, -64, -64, -64, 64, -64, 64, 64, 64, 64, 64, -64, 64, 64, 64, 64, 64, -64, -64, -64, 64, 64, 64, -64, -64, -64, -64, -64, -64, -64, -64, -64, -64, 64, 64, 64, 64, 64, 64, -64, 64, 64, 64, 64, 64, 64, -64, -64, 64, -64, -64, -64, -64, 64, 64, -64, -64, -64, -64, -64, -64, -64, -64, -64, 64, 64, -64, -64, 64, 64, 64, 64, 64, 64, -64, -64, 64, -64, -64, 64, -64, -64, -64, 64, -64, 64, 64, -64, -64, -64, -64, -64, -64, 64, -64, -64, 64, 64, 64, -64, 64, -64, 64, -64, -64, 64, -64, 64, 64, 64, 64, -64, -64, -64, -64, -64, 64, -64, 64, 64, -64, 64, -64, 64, 64, -64, -64, 64, 64, -64, -64, 64, -64, -64, 64, -64, 64, 64, -64, -64, -64, -64, -64, -64, 64, -64, 64, 64, -64, 64, 64, 64, 64, -64, 64, 64, 64, 64, 64, 64, 64, 64, -64, 64, -64, -64, 64, 64, 64, -64, 64, 64, 64, 64, 64, 64, 64, 64, -64, 64, -64, 64, 64, -64, 64, 64, 64, 64, -64, -64, 64, -64, -64, 64, -64, -64, -64, 64, 64, 64, -64, 64, 64, -64, 64, 64, 64, 64, -64, -64, -64, 64, -64, 64, 64, -64, -64, 64, -64, 64, 64, -64, -64, -64, 64, -64, -64, 64, -64, -64, -64, 64, -64, -64, 64, -64, -64, 64, -64, 64, -64, 64, 64, -64, -64, -64, -64, -64, 64, 64, 64, 64, -64, 64, -64, -64, -64, -64, 64, 64, -64, -64, 64, -64, 64, -64, 64, 64, 64, -64, -64, 64, 64, -64, 64, 64, 64, 64, 64, -64, -64, -64, -64, -64, -64, -64, -64, 64, -64, -64, -64, 64, -64, -64, -64, 64, -64, -64, 64, -64, -64, -64, -64, 64, -64, 64, 64, 64, 64, -64, -64, -64, -64, -64, 64, 64, 64, -64, -64, -64, 64, -64, -64, 64, 64, -64, 64, 64, -64, -64, 64, 64, -64, -64, -64, -64, -64, -64, -64, -64, -64, -64, 64, -64, -64, 64, -64, 64, 64, -64, -64, -64, -64, 64, 64, 64, -64, 64, 64, 64, -64, -64, 64, -64, -64, -64, 64, 64, 64, 64, 64, -64, -64, -64, 64, 64, 64, -64, -64, 64, 64, -64, -64, -64, 64, 64, 64, -64, 64, -64, 64, 64, -64, -64, 64, 64, -64, 64, -64, 64, 64, 64, -64, -64, -64, 64, 64, 64, 64, -64, -64, 64, -64, 64, -64, 64, -64, -64, 64, -64, -64, -64, -64, -64, -64, -64, -64, -64, -64, -64, -64, -64, 64, -64, 64, -64, -64, 64, 64, 64, -64, 64, -64, 64, -64, -64, -64, -64, -64, 64, 64, -64, 64, -64, 64, 64, -64, 64, -64, -64, -64, 64, 64, -64, -64, 64, -64, 64, -64, 64, 64, 64, -64, -64, 64, -64, -64, -64, 64, -64, -64, -64, -64, 64, 64, -64, 64, -64, -64, 64, -64, 64, -64, -64, -64, 64, -64, 64, -64, 64, 64, -64, -64, -64, -64, -64, -64, -64, 64, 64, -64, 64, 64, 64, 64, -64, -64, -64, -64, 64, 64, 64, -64, 64, -64, -64, -64, -64, 64, 64, -64, 64, -64, -64, 64, 64, 64, -64, -64, -64, 64, -64, -64, -64, -64, -64, 64, -64, 64, -64, -64, -64, 64, 64, 64, -64, -64, 64, -64, -64, -64, 64, 64, -64, 64, -64, -64, -64, -64, -64, -64, -64, 64, 64, -64, 64, 64, -64, -64, 64, 64, -64, -64, 64, -64, 64, 64, -64, -64, -64, -64, -64, -64, -64, -64, -64, -64, -64, 64, -64, -64, -64, -64, -64, 64, 64, -64, 64, -64, 64, -64, 64, 64, -64, -64, -64, -64, -64, -64, -64, 64, 64, -64, -64, -64, 64, -64, -64, -64, -64, 64, -64, -64, 64, -64, 64, 64, -64, -64, 64, -64, 64, -64, -64, -64, -64, 64, -64, 64, -64, -64, -64, 64, 64, 64, 64, -64, -64, 64, 64, -64, -64, -64, -64, -64, 64, 64, 64, 64, 64, -64, -64, 64, -64, 64, 64, 64, -64, 64, 64, 64, -64, -64, -64, -64, 64, 64, -64, 64, 64, -64, -64, 64, -64, 64, 64, -64, -64, -64, 64, -64, -64, 64, -64, 64, -64, -64, -64, -64, -64, -64, -64, 64, -64, -64, 64, 64, 64, 64, 64, -64, 64, 64, 64, -64, -64, -64, 64, -64, -64, -64, -64, 64, -64, -64, -64, 64, -64, -64, -64, 64, 64, -64, 64, -64, -64, -64, 64, -64, -64, 64, -64, 64, 64, 64, -64, -64, 64, -64, 64, 64, -64, -64, -64, -64, -64, -64, 64, 64, -64, -64, 64, -64, -64, -64, -64, 64, -64, -64, 64, 64, 64, -64, -64, 64, -64, -64, 64, 64, 64, -64, 64, -64, -64, -64, 64, 64, 64, -64, -64, 64, 64, -64, 64, -64, -64, 64, 64, 64, 64, -64, -64, 64, 64, 64, 64, -64, -64, -64, -64, -64, -64, 64, -64, -64, 64, -64, -64, 64, -64, 64, 64, -64, -64, 64, 64, -64, 64, 64, 64, -64, -64, -64, 64, -64, -64, -64, -64, -64, -64, -64, 64, 64, 64, -64, -64, 64, 64, -64, 64, 64, 64, -64, 64, -64, 64, -64, 64, -64, -64, 64, 64, -64, -64, 64, -64, -64, -64, 64, 64, -64, 64, 64, -64, 64, 64, -64, -64, 64, -64, -64, -64, 64, 64, -64, 64, 64, -64, 64, -64, 64, -64, -64, -64, 64, 64, -64, 64, -64, 64, 64, 64, 64, -64, -64, -64, 64, 64, -64, -64, 64, -64, 64, 64, 64, -64, 64, -64, 64, 64, 64, 64, -64, -64, 64, -64, -64, 64, 64, -64, -64, 64, -64, 64, 64, 64, 64, -64, 64, 64, 64, 64, -64, 64, -64, 64, -64, -64, -64, -64, -64, -64, -64, -64, 64, -64, -64, 64, 64, 64, 64, -64, -64, -64, 64, 64, 64, -64, 64, 64, 64, 64, -64, 64, -64, -64, -64, -64, -64, -64, 64, 64, 64, -64, -64, -64, -64, 64, -64, 64, 64, -64, -64, -64, -64, 64, 64, -64, -64, 64, 64, 64, 64, -64, -64, 64, 64, -64, -64, -64, 64, -64, -64, -64, -64, 64, 64, -64, 64, -64, -64, -64, -64, 64, -64, 64, 64, -64, 64, -64, -64, -64, -64, 64, -64, 64, 64, 64, 64, -64, -64, -64, -64, 64, 64, -64, -64, -64, 64, -64, -64, -64, -64, -64, -64, -64, -64, -64, -64, -64, -64, -64, -64, -64, -64, -64, -64, -64, -64, -64, -64, 64, 64, -64, -64, 64, 64, 64, 64, -64, 64, 64, 64, 64, -64, 64, -64, -64, -64, -64, -64, -64, -64, -64, -64, -64, -64, -64, -64, -64, -64, -64, -64, -64, -64, 64, 64, 64, -64, 64, 64, 64, 64, -64, 64, 64, -64, 64, -64, -64, -64, -64, -64, -64, -64, -64, -64, -64, -64, -64, -64, -64, 64, 64, 64, 64, -64, 64, 64, 64, 64, 64, 64, 64, -64, -64, -64, -64, -64, -64, -64, 64, -64, -64, -64, -64, 64, -64, 64, 64, -64, -64, -64, -64, -64, 64, 64, 64, 64, -64, 64, 64, 64, -64, -64, -64, -64, -64, -64, -64, -64, 64, 64, -64, -64, -64, -64, -64, -64, -64, -64, 64, -64, -64, -64, 64, 64, 64, 64, 64, 64, 64, -64, 64, 64, -64, -64, -64, -64, -64, -64, -64, -64, -64, 64, -64, -64, -64, 64, -64, -64, 64, -64, 64, 64, -64, 64, -64, 64, -64, -64, 64, 64, 64, -64, -64, -64, -64, -64, 64, 64, 64, -64, -64, -64, 64, -64, 64, -64, 64, -64, 64, 64, 64, 64, -64, -64, -64, -64, 64, 64, -64, 64, 64, -64, -64, 64, 64, 64, 64, 64, -64, -64, 64, -64, -64, -64, 64, 64, 64, -64, -64, -64, 64, -64, -64, 64, 64, 64, 64, 64, 64, 64, 64, -64, 64, 64, -64, 64, 64, -64, -64, -64, 64, -64, -64, -64, 64, 64, -64, -64, 64, -64, -64, -64, 64, 64, 64, 64, 64, 64, 64, 64, 64, 64, -64, 64, 64, -64, -64, -64, 64, -64, 64, 64, 64, 64, 64, -64, -64, -64, -64, -64, 64, 64, 64, 64, 64, -64, 64, 64, -64, 64, -64, -64, -64, -64, -64, 64, 64, -64, 64, 64, 64, -64, 64, -64, -64, -64, 64, -64, 64, 64, 64, 64, 64, -64, 64, 64, -64, -64, -64, -64, 64, -64, -64, -64, 64, 64, 64, 64, 64, 64, -64, 64, -64, -64, 64, -64, -64, 64, 64, 64, -64, -64, 64, 64, 64, -64, -64, -64, -64, 64, -64, 64, -64, 64, -64, -64, -64, -64, -64, 64, 64, 64, 64, -64, -64, -64, -64, -64, -64, 64, 64, -64, -64, -64, 64, -64, -64, -64, -64, 64, -64, -64, -64, -64, -64, -64, -64, -64, 64, -64, 64, -64, -64, -64, -64, -64, -64, -64, -64, -64, 64, 64, -64, -64, -64, -64, -64, -64, 64, -64, -64, -64, -64, -64, -64, -64, -64, -64, -64, 64, -64, -64, -64, -64, -64, -64, -64, 64, 64, 64, 64, -64, -64, 64, -64, -64, -64, -64, -64, -64, -64, -64, -64, -64, -64, -64, -64, -64, -64, -64, -64, -64, -64, -64, 64, 64, 64, 64, 64, -64, -64, 64, 64, 64, -64, 64, -64, 64, -64, -64, -64, -64, -64, -64, -64, -64, -64, -64, -64, 64, -64, 64, -64, 64, -64, 64, 64, -64, -64, 64, -64, -64, -64, -64, 64, -64, -64, -64, -64, -64, -64, -64, -64, -64, -64, -64, -64, -64, 64, 64, 64, -64, -64, -64, 64, -64, 64, -64, -64, -64, -64, 64, -64, -64, -64, -64, -64, -64, -64, -64, -64, -64, 64, 64, 64, 64, 64, 64, 64, -64, -64, -64, -64, 64, -64, 64, 64, -64, -64, 64, 64, -64, -64, -64, -64, 64, 64, 64, 64, 64, 64, 64, 64, 64, -64, 64, 64, 64, -64, 64, 64, 64, 64, 64, 64, 64, 64, -64, 64, 64, -64, 64, 64, 64, 64, 64, 64, 64, 64, -64, 64, -64, 64, 64, 64, 64, -64, -64, -64, 64, -64, 64, 64, 64, -64, -64, -64, -64, 64, 64, 64, 64, -64, 64, -64, -64, -64, 64, -64, -64, 64, 64, -64, -64, -64, -64, 64, -64, -64, 64, -64, 64, -64, -64, -64, 64, -64, -64, 64, -64, 64, 64, -64, -64, -64, -64, -64, 64, -64, -64, -64, 64, -64, 64, 64, 64, -64, -64, 64, -64, 64, -64, -64, -64, -64, 64, -64, -64, 64, 64, 64, -64, 64, 64, -64, -64, 64, 64, -64, -64, 64, 64, -64, 64, 64, -64, -64, -64, -64, 64, 64, -64, -64, -64, -64, -64, -64, -64, -64, 64, 64, -64, 64, 64, 64, 64, 64, 64, -64, -64, -64, -64, -64, 64, -64, -64, -64, -64, -64, 64, -64, -64, -64, -64, -64, 64, -64, -64, -64, -64, -64, 64, 64, 64, 64, 64, 64, 64, 64, -64, -64, 64, -64, -64, 64, -64, 64, 64, 64, 64, 64, 64, 64, -64, -64, 64, 64, 64, 64, 64, 64, 64, 64, 64, 64, 64, -64, -64, -64, -64, 64, -64, -64, 64, 64, 64, 64, 64, 64, 64, -64, 64, -64, 64, 64, 64, 64, 64, 64, 64, 64, 64, 64, 64, 64, 64, -64, -64, 64, 64, -64, 64, 64, 64, 64, 64, -64, -64, -64, -64, -64, 64, -64, 64, 64, 64, -64, -64, 64, 64, 64, 64, 64, 64, -64, -64, -64, -64, -64, 64, 64, 64, 64, -64, -64, -64, -64, -64, -64, 64, -64, 64, 64, -64, -64, -64, -64, -64, -64, 64, 64, -64, -64, -64, -64, -64, -64, 64, 64, -64, -64, -64, -64, -64, -64, -64, -64, -64, 64, 64, -64, -64, -64, -64, -64, -64, 64, 64, 64, 64, 64, 64, -64, -64, 64, 64, -64, -64, -64, 64, -64, -64, -64, -64, 64, 64, -64, 64, -64, -64, -64, -64, -64, -64, 64, 64, 64, 64, 64, -64, -64, -64, 64, -64, -64, -64, 64, 64, -64, -64, -64, -64, 64, 64, 64, -64, -64, -64, -64, -64, 64, 64, -64, 64, 64, 64, -64, -64, 64, -64, -64, -64, -64, -64, -64, -64, 64, -64, -64, 64, 64, 64, -64, -64, -64, -64, -64, -64, 64, 64, 64, 64, -64, 64, 64, 64, 64, 64, -64, -64, 64, -64, -64, -64, -64, 64, 64, 64, 64, -64, -64, -64, -64, -64, 64, -64, 64, 64, 64, -64, 64, -64, 64, -64, -64, -64, 64, -64, -64, -64, -64, 64, 64, 64, 64, 64, -64, 64, 64, -64, -64, -64, 64, 64, 64, 64, 64, -64, -64, -64, 64, -64, -64, -64, -64, -64, -64, 64, -64, 64, 64, 64, -64, 64, 64, -64, 64, -64, 64, 64, -64, 64, 64, 64, -64, -64, -64, -64, -64, -64, 64, 64, -64, -64, 64, -64, 64, 64, 64, 64, 64, 64, 64, 64, -64, -64, -64, -64, -64, 64, 64, 64, -64, 64, -64, -64, -64, -64, 64, -64, 64, -64, -64, -64, -64, -64, 64, -64, -64, -64, 64, 64, 64, -64, -64, -64, -64, 64, 64, 64, 64, 64, -64, -64, -64, -64, 64, -64, -64, -64, -64, 64, -64, -64, 64, -64, -64, -64, 64, 64, 64, 64, -64, -64, -64, -64, 64, -64, 64, 64, 64, -64, -64, -64, 64, 64, -64, -64, -64, 64, -64, 64, 64, -64, 64, -64, 64, -64, 64, -64, -64, -64, -64, -64, 64, 64, 64, 64, 64, -64, 64, 64, -64, 64, -64, -64, -64, 64, -64, -64, 64, 64, -64, -64, 64, -64, 64, -64, -64, -64, 64, 64, 64, 64, 64, 64, 64, -64, -64, -64, 64, -64, -64, -64, -64, -64, -64, -64, -64, 64, -64, 64, 64, -64, -64, -64, -64, -64, 64, 64, 64, 64, 64, 64, 64, -64, -64, -64, 64, 64, -64, 64, -64, -64, -64, -64, -64, -64, 64, 64, -64, 64, 64, -64, 64, -64, 64, 64, 64, 64, -64, 64, -64, -64, -64, -64, 64, -64, 64, 64, 64, -64, -64, -64, -64, -64, -64, 64, 64, 64, 64, 64, 64, 64, 64, 64, 64, 64, -64, -64, 64, 64, -64, 64, -64, 64, 64, 64, -64, -64, -64, -64, -64, -64, 64, 64, 64, 64, 64, -64, 64, 64, -64, -64, 64, -64, -64, -64, -64, -64, -64, 64, 64, -64, -64, 64, -64, 64, -64, -64, 64, -64, 64, -64, -64, -64, 64, -64, -64, -64, -64, -64, -64, -64, -64, 64, -64, 64, 64, 64, -64, -64, 64, -64, -64, 64, -64, -64, -64, -64, -64, -64, -64, -64, -64, -64, -64, -64, -64, -64, -64, -64, 64, -64, 64, 64, -64, 64, 64, -64, 64, -64, -64, -64, 64, -64, -64, -64, -64, -64, -64, -64, -64, -64, -64, -64, -64, -64, -64, -64, -64, 64, 64, 64, 64, 64, 64, 64, -64, 64, 64, 64, -64, -64, -64, 64, -64, -64, 64, 64, 64, 64, -64, -64, -64, -64, -64, 64, -64, 64, -64, -64, 64, -64, 64, -64, 64, -64, 64, -64, 64, -64, -64, -64, -64, -64, -64, 64, -64, 64, 64, -64, -64, -64, -64, -64, -64, -64, -64, -64, 64, 64, -64, -64, -64, -64, -64, -64, -64, -64, 64, 64, 64, -64, 64, -64, -64, -64, -64, 64, -64, -64, 64, -64, -64, 64, 64, 64, 64, -64, 64, 64, 64, 64, 64, -64, -64, -64, 64, 64, 64, 64, -64, -64, -64, -64, -64, -64, 64, -64, 64, -64, -64, -64, 64, -64, -64, -64, -64, -64, -64, 64, -64, -64, -64, 64, 64, 64, 64, 64, -64, -64, -64, -64, -64, -64, -64, -64, -64, 64, 64, 64, -64, -64, -64, 64, -64, 64, -64, -64, -64, 64, 64, 64, 64, 64, 64, 64, 64, -64, -64, -64, -64, -64, -64, -64, -64, 64, 64, 64, 64, 64, -64, 64, 64, 64, -64, 64, 64, 64, 64, 64, 64, 64, 64, 64, -64, -64, -64, -64, -64, -64, -64, -64, -64, -64, -64, -64, 64, 64, -64, -64, 64, -64, -64, -64, 64, 64, 64, -64, 64, 64, 64, -64, -64, -64, -64, -64, -64, -64, -64, -64, -64, -64, 64, 64, -64, -64, -64, -64, 64, -64, -64, -64, 64, 64, 64, -64, 64, 64, 64, -64, -64, -64, -64, -64, 64, 64, -64, -64, -64, 64, 64, 64, 64, -64, -64, 64, 64, -64, -64, 64, 64, 64, 64, 64, -64, 64, -64, -64, -64, 64, 64, 64, 64, 64, 64, 64, 64, 64, 64, 64, 64, -64, 64, -64, 64, 64, 64, 64, 64, 64, 64, -64, -64, -64, -64, -64, -64, 64, 64, 64, 64, 64, 64, 64, 64, 64, 64, 64, 64, -64, 64, 64, -64, 64, 64, 64, 64, 64, 64, 64, -64, -64, -64, -64, -64, 64, 64, 64, 64, 64, 64, 64, 64, 64, 64, 64, 64, 64, 64, 64, 64, 64, 64, -64, 64, 64, -64, -64, -64, 64, -64, 64, 64, -64, -64, 64, 64, 64, 64, 64, 64, 64, 64, 64, 64, 64, -64, -64, -64, -64, -64, -64, 64, 64, 64, 64, 64, 64, -64, 64, 64, 64, 64, 64, -64, -64, -64, 64, 64, 64, 64, 64, 64, -64, 64, 64, -64, -64, -64, 64, 64, 64, 64, -64, 64, 64, -64, 64, 64, 64, -64, 64, 64, 64, -64, -64, 64, 64, 64, 64, -64, -64, 64, -64, 64, 64, -64, 64, 64, 64, 64, 64, 64, 64, 64, 64, 64, 64, 64, 64, 64, 64, 64, -64, 64, 64, -64, 64, -64, 64, -64, 64, 64, 64, 64, 64, 64, -64, 64, 64, 64, 64, 64, 64, 64, 64, 64, 64, 64, 64, -64, 64, 64, 64, 64, 64, 64, 64, 64, 64, -64, 64, 64, 64, -64, 64, 64, 64, 64, 64, 64, 64, 64, 64, -64, 64, 64, 64, 64, -64, 64, 64, 64, 64, 64, 64, -64, 64, -64, 64, 64, 64, 64, 64, 64, 64, 64, 64, 64, 64, 64, -64, 64, 64, 64, 64, -64, 64, 64, -64, -64, 64, -64, -64, 64, -64, -64, 64, -64, 64, 64, 64, 64, 64, 64, 64, 64, 64, 64, 64, -64, 64, 64, 64, -64, -64, -64, 64, 64, -64, -64, 64, 64, 64, -64, -64, -64, -64, -64, 64, 64, 64, 64, 64, 64, 64, -64, -64, -64, 64, -64, -64, -64, 64, 64, 64, 64, -64, -64, 64, -64, 64, 64, -64, -64, -64, 64, 64, 64, 64, -64, 64, 64, 64, -64, -64, -64, 64, -64, -64, -64, 64, -64, 64, 64, -64, -64, 64, -64, 64, 64, 64, -64, -64, -64, 64, -64, -64, -64, -64, 64, -64, -64, -64, -64, 64, -64, -64, -64, -64, -64, -64, 64, -64, -64, 64, 64, 64, 64, -64, -64, -64, -64, -64, -64, -64, 64, -64, 64, 64, -64, -64, 64, -64, -64, -64, 64, 64, -64, 64, 64, -64, 64, -64, -64, -64, 64, 64, 64, 64, -64, -64, -64, -64, 64, 64, 64, 64, -64, 64, 64, -64, -64, 64, 64, 64, 64, 64, 64, -64, 64, 64, -64, -64, 64, 64, 64, -64, -64, -64, -64, -64, 64, 64, -64, -64, 64, 64, -64, -64, -64, 64, -64, 64, 64, -64, -64, 64, 64, -64, -64, -64, 64, -64, -64, -64, -64, -64, 64, -64, 64, -64, -64, 64, -64, 64, -64, -64, -64, -64, -64, 64, 64, -64, -64, 64, 64, 64, 64, 64, -64, 64, -64, -64, 64, 64, 64, -64, 64, -64, -64, -64, -64, 64, -64, -64, 64, -64, -64, 64, -64, -64, 64, -64, -64, 64, 64, -64, 64, -64, -64, 64, 64, -64, 64, -64, -64, 64, -64, -64, -64, 64, 64, -64, -64, -64, 64, -64, 64, 64, -64, 64, -64, -64, -64, -64, -64, 64, 64, -64, 64, -64, 64, 64, -64, -64, -64, -64, -64, 64, -64, -64, -64, 64, -64, -64, -64, -64, -64, -64, -64, -64, 64, -64, -64, -64, -64, 64, 64, 64, 64, -64, 64, -64, 64, 64, 64, -64, 64, 64, 64, -64, 64, 64, 64, 64, -64, -64, -64, 64, -64, -64, 64, -64, -64, -64, -64, 64, -64, 64, 64, 64, 64, 64, 64, 64, 64, 64, 64, -64, 64, 64, 64, 64, 64, 64, -64, -64, 64, 64, 64, 64, 64, 64, -64, 64, 64, 64, 64, 64, 64, 64, 64, 64, 64, 64, -64, -64, -64, -64, 64, -64, 64, 64, -64, 64, 64, -64, -64, 64, -64, 64, 64, 64, 64, 64, 64, 64, 64, 64, 64, 64, 64, 64, 64, 64, 64, 64, -64, -64, -64, -64, -64, 64, 64, 64, -64, -64, -64, 64, -64, -64, -64, -64, 64, 64, 64, -64, 64, 64, -64, 64, 64, 64, 64, 64, 64, -64, -64, -64, -64, -64, 64, 64, -64, -64, 64, -64, 64, 64, 64, -64, 64, 64, 64, 64, 64, 64, 64, 64, 64, 64, 64, 64, 64, 64, -64, -64, -64, -64, -64, -64, -64, 64, -64, -64, -64, 64, 64, -64, -64, -64, 64, 64, 64, 64, -64, 64, 64, 64, 64, 64, 64, 64, 64, -64, -64, -64, 64, -64, 64, 64, 64, 64, 64, -64, 64, -64, 64, 64, 64, 64, 64, 64, 64, 64, 64, -64, -64, 64, 64, 64, -64, -64, -64, -64, 64, 64, 64, 64, 64, 64, 64, -64, 64, 64, 64, 64, 64, 64, 64, 64, 64, 64, 64, 64, 64, 64, -64, -64, 64, -64, -64, 64, -64, -64, 64, 64, 64, -64, -64, -64, -64, -64, -64, 64, 64, 64, 64, 64, 64, 64, 64, -64, -64, -64, -64, 64, 64, -64, -64, -64, -64, 64, 64, -64, -64, -64, -64, -64, -64, -64, -64, -64, -64, -64, 64, 64, 64, -64, -64, -64, -64, -64, -64, 64, 64, -64, -64, -64, 64, -64, -64, -64, 64, -64, -64, -64, -64, -64, -64, -64, -64, 64, -64, 64, -64, -64, -64, -64, 64, 64, -64, 64, 64, 64, -64, 64, -64, -64, -64, 64, -64, -64, -64, -64, -64, -64, -64, -64, -64, -64, -64, -64, -64, -64, 64, 64, 64, 64, 64, -64, 64, 64, -64, 64, 64, -64, -64, 64, -64, 64, -64, -64, -64, -64, -64, -64, -64, -64, -64, -64, 64, 64, -64, 64, 64, 64, 64, -64, -64, 64, 64, 64, 64, -64, -64, 64, 64, 64, -64, -64, -64, -64, -64, -64, -64, -64, -64, -64, -64, -64, -64, 64, 64, 64, 64, -64, -64, 64, -64, -64, -64, 64, 64, 64, 64, 64, 64, 64, -64, -64, -64, -64, -64, -64, -64, -64, -64, -64, 64, 64, -64, 64, -64, 64, -64, -64, 64, 64, 64, -64, 64, 64, 64, 64, 64, -64, -64, -64, -64, -64, -64, -64, -64, -64, 64, -64, -64, -64, -64, -64, 64, 64, 64, -64, 64, 64, -64, 64, 64, -64, 64, 64, 64, 64, 64, 64, -64, -64, -64, 64, -64, -64, 64, 64, -64, -64, 64, 64, 64, 64, -64, 64, 64, 64, -64, 64, 64, 64, 64, 64, 64, 64, 64, 64, 64, 64, 64, 64, -64, 64, -64, 64, 64, -64, 64, -64, 64, 64, 64, 64, 64, -64, -64, -64, -64, 64, 64, 64, 64, 64, 64, 64, 64, 64, 64, 64, 64, 64, 64, -64, 64, 64, -64, 64, 64, 64, -64, -64, -64, -64, 64, 64, 64, 64, 64, 64, 64, 64, 64, 64, 64, 64, 64, 64, 64, 64, 64, -64, 64, 64, -64, -64, -64, -64, -64, -64, -64, 64, 64, 64, 64, 64, 64, 64, 64, 64, 64, 64, 64, 64, 64, 64, 64, 64, -64, 64, 64, -64, 64, -64, 64, -64, -64, -64, 64, -64, -64, 64, -64, -64, 64, 64, 64, 64, 64, 64, 64, -64, 64, 64, 64, 64, -64, 64, 64, -64, -64, -64, 64, -64, -64, -64, 64, -64, -64, 64, -64, -64, 64, -64, 64, 64, 64, 64, -64, -64, 64, -64, 64, 64, 64, 64, 64, 64, -64, -64, -64, -64, -64, -64, -64, -64, -64, -64, 64, -64, -64, -64, 64, 64, 64, 64, 64, 64, -64, 64, 64, 64, 64, -64, -64, -64, -64, -64, -64, -64, -64, -64, -64, -64, 64, -64, -64, 64, 64, -64, -64, 64, 64, 64, -64, 64, -64, 64, -64, 64, 64, -64, -64, 64, -64, -64, -64, 64, -64, 64, 64, -64, 64, 64, 64, 64, -64, 64, -64, 64, -64, 64, -64, -64, -64, -64, -64, -64, -64, -64, 64, 64, -64, 64, 64, -64, -64, -64, -64, 64, -64, 64, -64, 64, 64, -64, -64, -64, 64, 64, -64, -64, -64, -64, -64, -64, 64, 64, -64, 64, -64, -64, -64, -64, 64, -64, -64, 64, 64, -64, -64, 64, 64, 64, -64, 64, 64, -64, -64, 64, 64, -64, -64, 64, 64, 64, -64, 64, 64, 64, 64, 64, 64, 64, 64, -64, -64, 64, -64, -64, 64, -64, 64, 64, 64, 64, -64, -64, 64, 64, 64, 64, 64, 64, 64, 64, -64, 64, 64, -64, -64, 64, -64, 64, 64, -64, -64, 64, 64, -64, 64, 64, 64, 64, 64, 64, 64, 64, 64, 64, 64, 64, 64, 64, 64, 64, 64, -64, -64, -64, -64, -64, 64, -64, -64, -64, 64, -64, 64, -64, -64, -64, 64, 64, 64, 64, 64, 64, 64, 64, 64, 64, 64, 64, -64, -64, -64, 64, 64, 64, -64, 64, -64, -64, -64, 64, 64, 64, 64, -64, -64, 64, -64, -64, -64, 64, 64, 64, 64, 64, 64, 64, 64, 64, -64, 64, -64, 64, -64, 64, 64, -64, -64, 64, 64, 64, 64, -64, 64, -64, -64, -64, -64, -64, -64, 64, 64, 64, 64, 64, 64, 64, -64, -64, 64, 64, 64, -64, 64, 64, 64, 64, 64, 64, 64, 64, -64, -64, -64, -64, -64, -64, -64, -64, -64, 64, 64, 64, 64, 64, 64, 64, 64, -64, -64, 64, -64, 64, 64, 64, 64, -64, 64, 64, -64, -64, -64, -64, -64, -64, -64, -64, -64, 64, 64, 64, 64, 64, 64, 64, 64, -64, -64, -64, -64, 64, 64, 64, 64, 64, -64, 64, -64, -64, -64, -64, -64, -64, -64, -64, -64, 64, 64, 64, 64, 64, 64, 64, 64, -64, -64, 64, -64, -64, 64, 64, 64, 64, 64, -64, 64, -64, 64, -64, -64, -64, -64, -64, -64, -64, 64, 64, 64, 64, 64, 64, 64, -64, -64, 64, 64, 64, 64, -64, -64, 64, -64, 64, -64, -64, 64, 64, -64, -64, -64, -64, -64, -64, 64, 64, 64, 64, 64, 64, 64, 64, -64, -64, 64, 64, -64, 64, -64, -64, 64, 64, 64, -64, 64, -64, -64, -64, -64, -64, -64, 64, 64, 64, 64, 64, -64, 64, -64, 64, -64, -64, 64, 64, 64, -64, 64, -64, 64, 64, 64, 64, 64, 64, -64, -64, -64, -64, -64, -64, 64, 64, 64, -64, -64, 64, -64, 64, 64, -64, -64, 64, -64, 64, 64, 64, 64, 64, 64, 64, 64, 64, 64, -64, -64, 64, -64, -64, 64, 64, 64, -64, -64, 64, 64, -64, 64, 64, 64, -64, 64, 64, 64, 64, 64, 64, 64, 64, -64, 64, -64, 64, 64, 64, -64, 64, 64, 64, 64, -64, 64, 64, 64, -64, 64, 64, -64, 64, 64, -64, -64, 64, 64, 64, 64, 64, 64, -64, -64, 64, 64, -64, -64, -64, 64, 64, 64, -64, -64, 64, 64, -64, 64, 64, -64, -64, -64, 64, -64, -64, -64, -64, -64, 64, -64, -64, -64, -64, -64, 64, 64, 64, -64, 64, -64, 64, -64, 64, 64, -64, -64, 64, -64, 64, 64, -64, 64, 64, 64, -64, -64, -64, -64, -64, -64, -64, 64, 64, 64, 64, 64, 64, 64, 64, 64, 64, 64, 64, -64, -64, 64, 64, 64, 64, 64, 64, 64, 64, -64, 64, 64, 64, -64, 64, 64, 64, 64, -64, 64, 64, -64, 64, 64, 64, 64, 64, 64, 64, 64, 64, 64, 64, 64, 64, 64, 64, 64, 64, 64, 64, -64, 64, 64, 64, 64, 64, -64, 64, 64, 64, 64, 64, 64, -64, 64, 64, -64, 64, 64, 64, 64, 64, 64, 64, 64, 64, 64, -64, 64, -64, 64, 64, -64, -64, 64, 64, 64, 64, 64, 64, 64, 64, -64, 64, 64, -64, -64, 64, -64, 64, 64, 64, 64, 64, 64, 64, -64, -64, 64, -64, -64, 64, 64, 64, 64, 64, 64, 64, 64, 64, 64, -64, -64, -64, 64, -64, -64, -64, -64, 64, 64, 64, 64, -64, -64, 64, -64, 64, -64, -64, -64, 64, -64, 64, 64, 64, 64, 64, -64, 64, 64, -64, 64, -64, -64, -64, -64, 64, 64, -64, -64, -64, -64, -64, -64, 64, -64, -64, -64, 64, -64, -64, -64, -64, 64, 64, 64, -64, -64, -64, -64, -64, -64, 64, -64, -64, -64, -64, -64, -64, -64, -64, 64, -64, 64, -64, 64, 64, 64, -64, 64, 64, 64, -64, 64, -64, 64, 64, -64, -64, -64, -64, 64, 64, 64, 64, 64, -64, -64, -64, -64, -64, 64, -64, 64, -64, -64, -64, -64, -64, 64, -64, 64, -64, -64, 64, -64, 64, -64, 64, -64, 64, 64, 64, -64, -64, -64, -64, -64, -64, 64, -64, -64, 64, -64, -64, 64, 64, -64, 64, 64, -64, -64, -64, -64, -64, 64, -64, -64, -64, 64, 64, 64, 64, -64, -64, -64, -64, 64, 64, -64, -64, -64, -64, -64, 64, 64, -64, -64, -64, 64, -64, 64, -64, -64, 64, 64, -64, -64, -64, -64, 64, 64, 64, 64, 64, -64, -64, -64, 64, 64, -64, 64, -64, -64, 64, 64, -64, -64, -64, 64, -64, 64, 64, 64, 64, -64, -64, -64, 64, -64, 64, -64, -64, 64, -64, -64, 64, 64, -64, -64, -64, -64, -64, -64, 64, -64, -64, -64, 64, 64, -64, -64, -64, -64, -64, -64, 64, 64, 64, 64, -64, 64, -64, -64, -64, 64, 64, -64, -64, 64, -64, 64, 64, 64, -64, 64, -64, 64, 64, -64, 64, -64, 64, -64, -64, -64, 64, 64, -64, 64, -64, 64, -64, 64, -64, -64, -64, -64, 64, -64, -64, 64, -64, 64, 64, 64, 64, 64, 64, 64, 64, 64, 64, 64, -64, -64, -64, -64, -64, -64, -64, -64, 64, -64, -64, -64, -64, -64, -64, -64, 64, 64, 64, 64, 64, -64, 64, -64, -64, -64, 64, 64, -64, -64, -64, -64, -64, -64, -64, -64, -64, -64, 64, 64, 64, -64, 64, 64, 64, 64, 64, 64, 64, 64, 64, -64, -64, 64, 64, 64, -64, -64, -64, -64, -64, -64, -64, -64, -64, -64, 64, -64, 64, -64, -64, -64, -64, -64, 64, 64, 64, -64, 64, 64, -64, 64, 64, -64, 64, -64, -64, 64, -64, -64, -64, -64, -64, -64, -64, -64, 64, 64, -64, -64, 64, -64, -64, 64, 64, -64, 64, -64, 64, -64, -64, -64, 64, 64, 64, -64, -64, -64, -64, -64, -64, -64, -64, -64, 64, -64, -64, 64, 64, 64, -64, 64, 64, -64, -64, -64, -64, -64, -64, -64, 64, -64, -64, -64, -64, -64, -64, -64, -64, 64, -64, -64, -64, -64, -64, 64, 64, -64, 64, 64, 64, 64, -64, -64, -64, 64, -64, -64, 64, 64, 64, 64, 64, -64, -64, -64, -64, -64, -64, -64, -64, 64, -64, -64, 64, 64, 64, 64, 64, -64, -64, -64, -64, -64, 64, 64, 64, 64, 64, 64, 64, 64, -64, -64, -64, -64, -64, -64, 64, -64, 64, -64, 64, 64, 64, 64, 64, 64, 64, 64, -64, 64, 64, 64, 64, 64, -64, 64, 64, 64, -64, 64, -64, -64, -64, -64, 64, 64, 64, 64, -64, 64, 64, -64, 64, 64, -64, -64, -64, 64, 64, 64, 64, 64, 64, 64, 64, 64, 64, 64, 64, -64, -64, -64, 64, 64, 64, -64, 64, -64, 64, -64, -64, -64, 64, -64, -64, -64, -64, 64, 64, -64, -64, 64, 64, 64, 64, 64, 64, 64, -64, -64, -64, 64, 64, -64, 64, -64, 64, -64, -64, -64, -64, -64, -64, -64, -64, -64, -64, 64, 64, -64, 64, 64, -64, -64, -64, 64, 64, -64, 64, -64, 64, -64, 64, -64, -64, -64, -64, -64, -64, -64, 64, -64, 64, 64, -64, 64, 64, 64, 64, -64, -64, -64, -64, -64, 64, 64, 64, -64, -64, 64, -64, -64, 64, -64, -64, -64, -64, -64, -64, -64, -64, -64, -64, -64, 64, 64, 64, 64, 64, -64, 64, 64, -64, 64, 64, -64, -64, -64, 64, -64, -64, -64, -64, -64, -64, -64, -64, -64, 64, -64, 64, -64, 64, 64, 64, 64, 64, -64, 64, 64, 64, -64, 64, 64, 64, -64, -64, -64, -64, -64, -64, -64, -64, -64, -64, -64, -64, -64, -64, -64, 64, -64, -64, -64, -64, -64, -64, 64, 64, -64, -64, -64, -64, 64, -64, -64, -64, -64, 64, -64, 64, -64, -64, -64, -64, -64, -64, 64, 64, 64, 64, 64, -64, -64, 64, 64, 64, -64, -64, 64, 64, -64, -64, -64, 64, 64, -64, -64, -64, -64, -64, -64, -64, -64, -64, -64, 64, 64, 64, 64, 64, 64, 64, 64, 64, -64, 64, -64, 64, 64, -64, 64, -64, -64, -64, -64, -64, -64, -64, -64, -64, -64, -64, -64, 64, 64, 64, 64, 64, 64, 64, 64, 64, -64, -64, -64, 64, 64, 64, 64, 64, 64, -64, -64, 64, 64, 64, -64, -64, -64, -64, -64, -64, 64, 64, 64, 64, 64, 64, -64, -64, 64, 64, -64, -64, -64, 64, -64, -64, -64, -64, -64, -64, -64, -64, -64, -64, -64, -64, -64, 64, 64, 64, -64, 64, 64, 64, -64, 64, 64, 64, -64, 64, -64, -64, -64, 64, -64, -64, 64, -64, -64, 64, -64, -64, -64, 64, -64, 64, 64, 64, -64, -64, 64, 64, 64, 64, -64, 64, -64, 64, -64, -64, -64, -64, -64, -64, -64, -64, 64, -64, 64, 64, -64, -64, 64, -64, 64, 64, -64, -64, 64, 64, -64, -64, -64, 64, 64, -64, -64, 64, -64, -64, -64, -64, -64, 64, -64, 64, 64, 64, -64, -64, -64, 64, 64, 64, 64, -64, 64, 64, 64, -64, -64, 64, -64, 64, -64, 64, 64, -64, 64, 64, -64, -64, -64, 64, 64, -64, 64, -64, -64, -64, 64, -64, 64, 64, -64, -64, -64, -64, 64, 64, 64, 64, -64, 64, -64, -64, -64, -64, 64, -64, 64, 64, 64, 64, -64, 64, 64, 64, 64, 64, 64, 64, -64, 64, 64, 64, -64, 64, -64, 64, 64, -64, 64, 64, 64, 64, 64, 64, 64, 64, 64, 64, 64, 64, 64, 64, 64, 64, 64, 64, 64, 64, 64, 64, 64, -64, 64, 64, 64, -64, -64, -64, 64, 64, 64, 64, 64, 64, 64, 64, 64, 64, 64, 64, 64, 64, 64, 64, 64, 64, 64, 64, 64, 64, 64, -64, 64, -64, -64, -64, 64, 64, 64, 64, 64, 64, 64, -64, 64, 64, 64, 64, 64, 64, 64, 64, 64, 64, 64, 64, 64, 64, 64, 64, 64, -64, -64, 64, 64, 64, 64, 64, 64, 64, -64, -64, -64, 64, 64, -64, -64, -64, -64, 64, 64, 64, 64, 64, 64, -64, -64, 64, -64, 64, -64, 64, 64, 64, 64, 64, -64, -64, -64, -64, -64, 64, -64, -64, -64, -64, -64, -64, 64, 64, 64, 64, -64, -64, 64, -64, -64, 64, -64, -64, 64, -64, -64, -64, -64, -64, 64, -64, -64, 64, -64, -64, -64, -64, -64, 64, 64, 64, 64, -64, 64, 64, 64, -64, 64, 64, -64, -64, 64, -64, -64, -64, -64, -64, -64, -64, -64, -64, -64, -64, -64, -64, -64, -64, -64, 64, -64, 64, 64, -64, 64, 64, -64, -64, -64, -64, -64, -64, -64, -64, -64, -64, 64, -64, 64, -64, -64, -64, -64, -64, -64, -64, -64, -64, -64, -64, 64, 64, -64, 64, 64, 64, -64, -64, -64, -64, -64, -64, -64, 64, 64, -64, 64, -64, 64, 64, -64, -64, -64, -64, -64, -64, -64, 64, 64, -64, -64, -64, -64, -64, -64, -64, -64, -64, -64, 64, 64, 64, 64, 64, -64, -64, 64, -64, -64, -64, -64, -64, -64, -64, -64, -64, 64, -64, 64, -64, -64, -64, 64, -64, -64, -64, -64, 64, 64, 64, 64, 64, -64, -64, 64, -64, 64, -64, -64, 64, 64, 64, -64, 64, 64, 64, 64, 64, 64, 64, -64, -64, 64, 64, -64, 64, 64, 64, 64, -64, -64, -64, -64, 64, 64, 64, 64, 64, 64, -64, 64, 64, -64, -64, 64, -64, 64, 64, 64, 64, 64, -64, 64, 64, -64, 64, 64, 64, 64, 64, -64, 64, -64, -64, 64, 64, 64, 64, 64, 64, -64, 64, -64, -64, -64, 64, 64, -64, 64, 64, -64, 64, 64, 64, 64, -64, 64, 64, 64, 64, -64, 64, 64, 64, 64, -64, -64, 64, -64, 64, 64, -64, 64, -64, 64, 64, 64, 64, -64, 64, -64, -64, 64, 64, 64, 64, 64, 64, 64, 64, 64, 64, 64, 64, -64, -64, -64, 64, 64, 64, 64, -64, -64, 64, 64, 64, 64, -64, -64, -64, 64, 64, 64, 64, -64, 64, 64, -64, 64, 64, 64, 64, 64, -64, -64, -64, -64, 64, 64, 64, 64, 64, 64, 64, 64, 64, -64, -64, 64, 64, 64, 64, -64, -64, 64, 64, 64, 64, 64, 64, -64, -64, -64, -64, -64, 64, 64, -64, 64, 64, 64, 64, 64, 64, -64, -64, 64, 64, -64, 64, -64, 64, 64, 64, 64, 64, 64, -64, -64, 64, -64, -64, 64, 64, -64, -64, 64, 64, 64, 64, 64, 64, 64, 64, 64, 64, -64, -64, -64, 64, 64, 64, 64, 64, 64, 64, -64, -64, -64, -64, 64, -64, 64, -64, 64, 64, 64, 64, 64, -64, -64, 64, 64, 64, -64, -64, -64, 64, -64, 64, 64, 64, -64, -64, 64, 64, 64, -64, 64, -64, -64, 64, -64, 64, -64, -64, -64, -64, -64, -64, -64, -64, -64, -64, -64, -64, -64, 64, 64, 64, 64, 64, 64, 64, 64, -64, 64, -64, -64, 64, 64, 64, -64, 64, -64, -64, -64, -64, -64, -64, -64, -64, -64, -64, -64, -64, -64, -64, 64, 64, 64, -64, -64, 64, -64, -64, 64, -64, -64, -64, -64, -64, -64, -64, -64, 64, 64, 64, 64, -64, -64, 64, -64, -64, -64, 64, 64, -64, 64, -64, -64, 64, 64, 64, -64, -64, -64, -64, -64, -64, -64, -64, -64, 64, -64, -64, 64, 64, -64, -64, 64, -64, 64, 64, -64, -64, 64, 64, 64, 64, 64, -64, 64, 64, -64, 64, 64, -64, 64, 64, -64, 64, 64, -64, -64, -64, -64, -64, -64, -64, 64, -64, 64, 64, -64, -64, 64, -64, -64, -64, -64, 64, -64, 64, 64, 64, -64, 64, 64, 64, 64, 64, 64, -64, -64, -64, -64, 64, -64, -64, -64, 64, -64, 64, 64, 64, 64, 64, 64, 64, -64, -64, -64, 64, -64, -64, -64, -64, 64, -64, 64, 64, 64, 64, -64, 64, 64, 64, 64, 64, 64, 64, 64, -64, 64, -64, 64, -64, 64, 64, 64, 64, -64, -64, -64, -64, -64, -64, -64, -64, -64, -64, -64, -64, -64, -64, 64, 64, -64, 64, 64, -64, 64, 64, 64, -64, -64, -64, 64, 64, 64, -64, -64, -64, -64, 64, 64, 64, -64, -64, 64, -64, 64, 64, 64, -64, 64, -64, 64, 64, -64, -64, 64, 64, -64, 64, 64, 64, 64, -64, 64, 64, 64, 64, 64, 64, -64, -64, 64, 64, 64, 64, 64, 64, 64, 64, -64, -64, 64, 64, 64, -64, 64, -64, -64, -64, -64, 64, -64, -64, 64, 64, 64, 64, 64, -64, 64, 64, 64, 64, 64, 64, 64, -64, -64, -64, -64, -64, -64, -64, 64, -64, -64, -64, -64, 64, 64, -64, -64, 64, 64, 64, 64, 64, 64, 64, 64, 64, 64, -64, 64, 64, -64, -64, 64, -64, 64, -64, 64, -64, -64, -64, -64, -64, -64, 64, 64, 64, 64, 64, 64, 64, 64, 64, 64, 64, 64, 64, -64, 64, 64, -64, -64, -64, -64, -64, -64, -64, -64, -64, -64, -64, -64, -64, 64, 64, 64, 64, 64, 64, 64, 64, 64, 64, -64, -64, 64, 64, 64, 64, 64, 64, 64, -64, -64, -64, -64, -64, -64, -64, -64, -64, -64, 64, 64, 64, 64, -64, -64, 64, -64, 64, 64, -64, -64, 64, 64, 64, -64, -64, 64, 64, 64, -64, -64, -64, -64, -64, 64, -64, -64, -64, 64, 64, -64, -64, 64, -64, 64, 64, 64, -64, -64, -64, 64, 64, -64, -64, 64, -64, 64, -64, -64, 64, -64, 64, 64, -64, -64, -64, 64, 64, 64, -64, 64, -64, 64, 64, -64, 64, -64, 64, 64, 64, 64, -64, 64, -64, -64, -64, 64, 64, 64, 64, -64, -64, -64, -64, 64, 64, -64, 64, 64, 64, -64, -64, 64, -64, 64, 64, -64, 64, 64, 64, 64, -64, 64, 64, -64, -64, -64, 64, -64, -64, -64, -64, 64, 64, 64, 64, -64, 64, -64, 64, -64, -64, -64, 64, 64, 64, -64, -64, -64, -64, -64, -64, -64, -64, -64, -64, -64, 64, 64, 64, 64, 64, -64, -64, -64, -64, 64, -64, -64, -64, -64, 64, 64, -64, -64, 64, 64, -64, -64, 64, -64, -64, -64, 64, 64, 64, 64, 64, -64, 64, 64, -64, 64, -64, -64, -64, -64, -64, -64, 64, -64, -64, 64, 64, 64, -64, -64, -64, -64, -64, 64, -64, 64, -64, 64, -64, -64, -64, -64, -64, -64, -64, 64, -64, -64, -64, -64, 64, -64, -64, 64, 64, -64, -64, 64, -64, -64, -64, 64, 64, 64, 64, 64, 64, -64, -64, -64, -64, -64, -64, -64, -64, -64, -64, 64, -64, -64, -64, 64, -64, 64, 64, 64, 64, -64, 64, 64, 64, 64, 64, 64, 64, -64, -64, -64, -64, 64, -64, 64, 64, 64, 64, 64, -64, -64, -64, 64, -64, 64, 64, 64, 64, -64, 64, 64, 64, 64, 64, 64, -64, -64, -64, -64, -64, -64, -64, 64, 64, 64, 64, 64, -64, -64, 64, 64, -64, -64, 64, 64, -64, 64, 64, 64, 64, 64, 64, 64, -64, -64, -64, -64, -64, 64, 64, 64, 64, 64, 64, -64, 64, -64, 64, 64, 64, 64, 64, 64, 64, 64, 64, 64, 64, 64, 64, 64, 64, -64, -64, -64, 64, -64, -64, 64, 64, 64, 64, -64, 64, -64, 64, 64, -64, -64, -64, 64, 64, 64, 64, 64, 64, 64, 64, 64, 64, -64, -64, 64, -64, -64, -64, 64, -64, 64, -64, -64, 64, 64, 64, -64, -64, 64, 64, -64, -64, 64, 64, -64, 64, 64, 64, 64, 64, 64, 64, -64, -64, -64, -64, 64, 64, 64, 64, 64, 64, -64, 64, 64, -64, 64, 64, 64, 64, 64, 64, 64, -64, 64, 64, 64, 64, -64, 64, -64, -64, -64, 64, 64, 64, -64, 64, -64, 64, -64, 64, 64, -64, 64, 64, 64, 64, -64, -64, 64, -64, -64, 64, 64, 64, 64, 64, -64, -64, -64, -64, 64, 64, 64, 64, 64, 64, 64, -64, 64, 64, 64, -64, 64, 64, -64, 64, 64, -64, 64, 64, 64, 64, 64, 64, -64, -64, 64, 64, 64, 64, -64, -64, 64, -64, -64, 64, 64, 64, 64, 64, 64, 64, -64, 64, -64, 64, 64, 64, 64, 64, 64, 64, -64, -64, 64, -64, 64, 64, 64, 64, 64, 64, -64, -64, 64, -64, 64, -64, 64, -64, -64, -64, -64, -64, 64, -64, 64, -64, -64, -64, -64, -64, 64, 64, -64, 64, -64, -64, -64, 64, 64, 64, 64, -64, 64, -64, 64, 64, 64, 64, 64, -64, 64, -64, 64, -64, -64, 64, 64, 64, 64, 64, 64, -64, 64, -64, -64, 64, 64, -64, -64, -64, -64, -64, -64, -64, 64, -64, -64, -64, -64, -64, -64, -64, -64, 64, -64, -64, -64, -64, -64, -64, -64, 64, -64, -64, -64, -64, 64, -64, 64, 64, 64, 64, 64, -64, 64, 64, -64, -64, 64, 64, 64, 64, -64, -64, -64, -64, -64, -64, -64, -64, -64, -64, 64, -64, -64, 64, 64, 64, -64, 64, -64, 64, -64, -64, 64, 64, -64, 64, 64, -64, 64, -64, -64, -64, -64, -64, -64, -64, 64, -64, 64, 64, -64, -64, 64, 64, 64, -64, 64, -64, 64, -64, 64, 64, 64, 64, 64, -64, -64, -64, -64, -64, -64, -64, 64, -64, 64, 64, -64, -64, -64, 64, 64, 64, -64, 64, -64, -64, 64, -64, -64, 64, 64, 64, -64, -64, -64, -64, -64, -64, -64, -64, -64, -64, 64, 64, 64, -64, 64, -64, 64, -64, 64, -64, 64, -64, -64, -64, 64, 64, 64, -64, -64, -64, 64, -64, -64, -64, 64, 64, 64, 64, 64, 64, 64, -64, 64, 64, -64, 64, -64, 64, 64, 64, -64, 64, -64, 64, 64, 64, -64, 64, 64, 64, 64, 64, 64, 64, 64, 64, 64, 64, 64, 64, 64, 64, 64, 64, 64, -64, 64, 64, -64, -64, -64, 64, 64, 64, 64, 64, 64, 64, 64, 64, 64, 64, 64, 64, 64, 64, 64, 64, -64, 64, -64, -64, -64, -64, -64, 64, 64, -64, 64, 64, 64, 64, 64, 64, 64, 64, 64, 64, 64, 64, 64, 64, 64, 64, 64, 64, -64, 64, 64, 64, -64, -64, -64, 64, 64, 64, 64, 64, 64, 64, -64, 64, 64, 64, 64, 64, 64, 64, 64, 64, -64, 64, 64, -64, -64, 64, 64, -64, -64, 64, -64, 64, 64, 64, 64, 64, 64, 64, -64, 64, 64, 64, -64, 64, 64, 64, -64, -64, -64, -64, 64, -64, 64, 64, 64, -64, -64, -64, -64, 64, 64, 64, 64, 64, 64, 64, 64, 64, 64, 64, 64, 64, -64, -64, -64, -64, -64, -64, 64, 64, -64, -64, 64, 64, -64, -64, 64, 64, 64, 64, 64, 64, 64, 64, 64, 64, 64, 64, 64, 64, -64, -64, 64, -64, -64, -64, -64, -64, -64, 64, 64, 64, -64, 64, -64, 64, 64, 64, 64, 64, 64, 64, 64, 64, 64, 64, 64, -64, 64, -64, 64, 64, 64, -64, -64, -64, 64, -64, -64, 64, 64, -64, -64, 64, 64, 64, -64, 64, 64, 64, -64, 64, 64, 64, 64, 64, -64, 64, 64, -64, 64, -64, 64, 64, -64, 64, -64, 64, 64, -64, 64, 64, 64, 64, 64, -64, 64, 64, 64, 64, 64, 64, 64, 64, -64, 64, -64, -64, 64, 64, 64, 64, 64, -64, -64, -64, 64, -64, -64, 64, 64, 64, 64, 64, 64, -64, 64, 64, 64, 64, 64, 64, -64, 64, -64, 64, 64, -64, 64, 64, 64, 64, 64, -64, 64, 64, 64, 64, 64, -64, 64, 64, 64, 64, 64, 64, 64, 64, 64, -64, -64, 64, 64, -64, -64, 64, 64, -64, -64, -64, 64, 64, 64, -64, 64, 64, 64, 64, -64, -64, 64, -64, -64, -64, -64, -64, 64, -64, 64, 64, 64, -64, -64, 64, 64, 64, 64, -64, -64, -64, -64, 64, -64, 64, 64, -64, -64, 64, -64, 64, -64, 64, -64, 64, 64, -64, 64, 64, -64, -64, 64, 64, 64, 64, 64, 64, -64, -64, 64, 64, -64, -64, -64, 64, 64, 64, 64, -64, -64, -64, 64, 64, 64, 64, 64, -64, -64, -64, -64, 64, 64, 64, -64, -64, 64, -64, 64, -64, 64, 64, -64, -64, -64, 64, 64, -64, -64, -64, -64, 64, 64, 64, 64, -64, 64, -64, 64, 64, 64, -64, -64, -64, 64, -64, -64, -64, -64, -64, 64, 64, 64, 64, 64, -64, -64, -64, -64, -64, 64, 64, -64, 64, -64, -64, -64, -64, 64, 64, -64, 64, 64, 64, 64, -64, 64, 64, 64, 64, 64, 64, 64, 64, 64, -64, -64, 64, 64, 64, 64, 64, 64, -64, 64, -64, -64, -64, 64, -64, 64, -64, -64, 64, -64, 64, 64, 64, -64, 64, 64, 64, 64, 64, 64, 64, -64, 64, -64, -64, -64, -64, -64, 64, -64, 64, 64, -64, -64, 64, 64, -64, 64, 64, -64, 64, 64, 64, 64, 64, -64, 64, 64, 64, -64, -64, 64, 64, -64, -64, -64, -64, 64, -64, 64, -64, 64, -64, -64, 64, 64, 64, 64, -64, -64, -64, -64, 64, 64, -64, 64, -64, 64, -64, 64, 64, -64, -64, -64, -64, 64, -64, -64, 64, 64, -64, 64, 64, -64, -64, 64, -64, 64, -64, 64, -64, 64, 64, 64, -64, 64, -64, -64, -64, 64, 64, -64, 64, -64, -64, -64, 64, 64, 64, -64, -64, 64, -64, -64, 64, 64, 64, -64, -64, 64, 64, 64, 64, 64, 64, -64, -64, -64, 64, 64, -64, -64, -64, 64, -64, -64, -64, 64, -64, 64, -64, -64, 64, -64, 64, -64, -64, -64, 64, 64, 64, -64, -64, -64, 64, 64, -64, -64, -64, 64, 64, -64, 64, -64, 64, 64, -64, 64, 64, 64, -64, -64, -64, 64, 64, 64, -64, -64, -64, 64, -64, 64, -64, 64, 64, 64, -64, -64, -64, -64, -64, -64, 64, -64, 64, -64, 64, -64, -64, 64, -64, 64, 64, 64, 64, 64, 64, -64, -64, -64, -64, 64, -64, -64, 64, -64, -64, 64, -64, -64, 64, 64, 64, 64, -64, 64, 64, 64, -64, -64, 64, 64, 64, -64, 64, 64, -64, 64, -64, 64, 64, 64, -64, 64, -64, -64, -64, -64, -64, 64, 64, -64, 64, -64, 64, 64, 64, -64, 64, 64, 64, 64, 64, 64, -64, 64, 64, -64, -64, 64, -64, -64, 64, 64, 64, -64, 64, 64, 64, -64, -64, 64, 64, 64, -64, -64, 64, 64, -64, -64, 64, 64, 64, 64, -64, -64, -64, -64, -64, 64, 64, -64, -64, 64, -64, -64, -64, 64, -64, 64, -64, 64, 64, 64, 64, -64, 64, 64, -64, -64, 64, -64, -64, 64, 64, 64, 64, 64, -64, 64, 64, -64, 64, 64, 64, -64, 64, 64, -64, 64, 64, -64, -64, 64, 64, 64, 64, 64, -64, 64, -64, 64, 64, 64, -64, 64, -64, 64, -64, -64, -64, 64, 64, -64, -64, 64, 64, 64, -64, 64, 64, 64, 64, 64, 64, 64, 64, 64, 64, 64, 64, -64, 64, -64, -64, -64, -64, -64, -64, -64, 64, -64, -64, 64, 64, 64, 64, 64, -64, -64, 64, 64, 64, -64, 64, -64, 64, 64, -64, 64, 64, -64, -64, -64, -64, -64, -64, -64, 64, 64, 64, 64, 64, -64, 64, 64, 64, -64, -64, 64, 64, 64, 64, -64, 64, 64, 64, -64, 64, 64, -64, 64, -64, -64, 64, 64, -64, 64, 64, -64, 64, 64, -64, 64, -64, -64, 64, 64, 64, 64, -64, 64, -64, 64, 64, -64, -64, -64, -64, -64, -64, 64, -64, -64, 64, -64, 64, 64, -64, -64, -64, 64, 64, 64, -64, 64, -64, -64, 64, 64, -64, -64, 64, 64, -64, 64, 64, 64, 64, -64, 64, -64, 64, -64, 64, 64, 64, 64, -64, 64, 64, -64, 64, 64, 64, -64, -64, 64, 64, 64, 64, 64, -64, 64, -64, 64, 64, -64, 64, -64, 64, -64, -64, 64, 64, -64, 64, -64, -64, -64, -64, 64, 64, 64, -64, -64, 64, 64, -64, 64, 64, 64, -64, -64, -64, 64, -64, 64, -64, 64, 64, 64, 64, -64, 64, 64, 64, -64, -64, 64, 64, 64, 64, 64, 64, 64, 64, 64, 64, 64, 64, -64, -64, 64, -64, -64, -64, 64, 64, -64, 64, 64, 64, 64, -64, 64, -64, -64, 64, -64, 64, 64, 64, 64, 64, 64, -64, -64, 64, -64, 64, -64, 64, 64, 64, 64, -64, -64, -64, -64, 64, 64, 64, 64, 64, 64, -64, 64, 64, -64, 64, 64, 64, 64, -64, 64, -64, -64, 64, -64, -64, -64, 64, -64, -64, -64, -64, -64, 64, -64, -64, 64, 64, 64, 64, -64, -64, 64, 64, 64, 64, -64, 64, -64, 64, 64, 64, -64, 64, 64, -64, 64, 64, -64, -64, 64, -64, 64, 64, -64, 64, 64, -64, 64, 64, 64, 64, 64, 64, 64, 64, 64, -64, 64, 64, -64, 64, -64, 64, -64, 64, -64, 64, 64, -64, 64, 64, 64, 64, -64, 64, 64, -64, 64, 64, -64, 64, 64, -64, -64, -64, -64, -64, -64, 64, -64, -64, 64, -64, 64, 64, 64, -64, -64, -64, 64, 64, -64, 64, 64, -64, 64, 64, 64, 64, 64, -64, 64, -64, 64, 64, -64, -64, 64, 64, 64, -64, 64, -64, 64, 64, 64, -64, -64, 64, 64, 64, 64, 64, -64, 64, -64, -64, 64, 64, -64, -64, -64, 64, 64, -64, 64, -64, -64, -64, 64, 64, 64, -64, -64, 64, -64, -64, -64, 64, -64, 64, 64, 64, -64, 64, 64, -64, 64, -64, -64, -64, -64, -64, -64, 64, 64, -64, -64, 64, -64, -64, -64, 64, -64, -64, -64, -64, -64, -64, -64, -64, 64, -64, 64, 64, 64, -64, 64, -64, -64, 64, 64, -64, 64, -64, 64, -64, 64, -64, 64, 64, 64, -64, 64, -64, 64, 64, -64, -64, 64, -64, -64, 64, -64, -64, 64, 64, 64, 64, 64, -64, -64, 64, 64, 64, -64, -64, 64, -64, 64, 64, -64, 64, 64, 64, -64, -64, 64, -64, -64, 64, -64, -64, -64, 64, 64, 64, 64, 64, -64, 64, -64, 64, 64, -64, -64, -64, 64, 64, -64, -64, -64, -64, -64, -64, -64, -64, 64, 64, -64, -64, 64, -64, -64, -64, 64, -64, -64, -64, 64, 64, 64, -64, -64, -64, 64, -64, -64, -64, -64, -64, 64, -64, 64, -64, -64, -64, 64, -64, 64, 64, -64, 64, 64, -64, -64, -64, -64, -64, -64, -64, 64, 64, -64, -64, -64, 64, -64, 64, 64, -64, -64, -64, 64, 64, 64, 64, -64, 64, -64, -64, -64, 64, -64, 64, 64, 64, -64, -64, -64, 64, 64, -64, -64, -64, -64, -64, -64, -64, 64, -64, -64, -64, 64, -64, -64, -64, -64, -64, -64, 64, 64, 64, 64, -64, 64, 64, -64, -64, -64, -64, -64, 64, -64, -64, -64, -64, 64, -64, -64, -64, -64, 64, 64, 64, -64, -64, 64, -64, 64, 64, -64, -64, -64, -64, -64, 64, -64, -64, 64, -64, 64, -64, -64, 64, 64, -64, -64, -64, 64, -64, -64, 64, -64, -64, -64, -64, -64, -64, -64, -64, -64, -64, 64, -64, 64, -64, 64, -64, -64, -64, -64, -64, -64, 64, 64, -64, 64, -64, -64, 64, -64, 64, 64, -64, -64, 64, 64, 64, -64, -64, -64, 64, 64, -64, -64, -64, -64, -64, -64, 64, -64, -64, -64, 64, 64, -64, -64, 64, 64, -64, 64, -64, 64, 64, 64, -64, -64, 64, -64, -64, 64, -64, -64, -64, -64, 64, 64, 64, -64, -64, 64, -64, -64, -64, -64, 64, -64, 64, -64, -64, 64, 64, 64, -64, -64, -64, 64, -64, -64, -64, -64, 64, -64, -64, -64, -64, -64, 64, -64, 64, -64, 64, -64, 64, 64, -64, 64, 64, 64, -64, -64, 64, 64, -64, 64, -64, 64, -64, -64, -64, -64, -64, -64, -64, -64, -64, -64, 64, -64, -64, -64, -64, 64, -64, -64, -64, 64, -64, -64, -64, 64, -64, 64, 64, -64, 64, -64, -64, 64, -64, -64, -64, -64, 64, 64, -64, 64, 64, -64, -64, -64, -64, 64, 64, -64, -64, 64, -64, -64, 64, 64, 64, -64, -64, -64, -64, -64, -64, -64, -64, 64, 64, 64, -64, 64, -64, 64, 64, 64, 64, 64, 64, -64, -64, -64, -64, -64, 64, -64, -64, 64, -64, 64, -64, -64, -64, -64, 64, -64, 64, 64, -64, 64, -64, 64, 64, 64, -64, 64, 64, 64, -64, -64, 64, 64, -64, -64, -64, 64, -64, -64, -64, 64, 64, -64, -64, -64, 64, -64, -64, -64, -64, 64, -64, -64, -64, 64, 64, -64, -64, -64, -64, 64, 64, -64, 64, 64, -64, -64, -64, -64, -64, 64, -64, -64, 64, 64, -64, -64, 64, -64, -64, 64, 64, -64, -64, -64, 64, 64, -64, 64, -64, -64, 64, -64, 64, 64, -64, -64, 64, -64, 64, -64, 64, 64, -64, -64, 64, -64, -64, -64, 64, -64, 64, -64, -64, -64, 64, -64, -64, -64, -64, -64, 64, -64, -64, -64, -64, 64, 64, -64, 64, 64, -64, -64, -64, 64, 64, -64, -64, 64, -64, -64, 64, 64, -64, 64, 64, -64, -64, -64, -64, -64, -64, 64, -64, 64, -64, 64, 64, -64, 64, 64, -64, 64, 64, 64, -64, 64, 64, -64, -64, -64, -64, -64, -64, 64, 64, -64, -64, -64, 64, -64, 64, -64, -64, 64, 64, -64, -64, -64, -64, 64, 64, -64, -64, -64, -64, -64, 64, 64, 64, -64, -64, -64, 64, -64, -64, 64, 64, -64, 64, 64, -64, 64, 64, 64, -64, -64, 64, 64, -64, -64, -64, -64, 64, -64, -64, -64, -64, -64, -64, -64, 64, 64, -64, 64, -64, -64, -64, -64, 64, -64, 64, -64, 64, -64, -64, 64, 64, 64, -64, -64, -64, -64, 64, 64, -64, -64, 64, 64, -64, 64, -64, -64, -64, -64, 64, -64, 64, -64, 64, -64, -64, -64, 64, 64, -64, -64, -64, -64, 64, 64, -64, -64, 64, 64, 64, -64, 64, 64, 64, 64, 64, -64, -64, 64, -64, -64, -64, 64, -64, 64, -64, -64, -64, 64, 64, -64, -64, 64, -64, -64, 64, -64, -64, 64, 64, 64, 64, -64, 64, -64, -64, -64, -64, -64, -64, 64, 64, -64, -64, 64, 64, -64, -64, -64, -64, 64, 64, 64, -64, -64, 64, 64, -64, -64, -64, 64, 64, -64, -64, 64, -64, 64, 64, 64, 64, 64, 64, -64, -64, 64, 64, 64, -64, -64, -64, -64, 64, 64, -64, 64, -64, 64, 64, -64, 64, 64, -64, 64, -64, 64, -64, -64, 64, 64, 64, -64, 64, -64, -64, -64, -64, 64, 64, 64, 64, -64, -64, -64, -64, 64, 64, -64, -64, 64, -64, -64, 64, -64, -64, -64, -64, 64, -64, -64, 64, 64, -64, 64, 64, -64, 64, -64, 64, -64, -64, -64, -64, 64, 64, -64, -64, 64, -64, -64, -64, 64, 64, 64, 64, 64, -64, 64, -64, 64, 64, -64, -64, 64, 64, 64, 64, 64, 64, 64, -64, 64, -64, -64, -64, -64, -64, -64, 64, 64, 64, 64, 64, -64, 64, 64, -64, -64, 64, 64, 64, 64, 64, -64, -64, -64, -64, 64, 64, -64, -64, -64, -64, -64, -64, -64, -64, 64, -64, -64, -64, -64, 64, 64, -64, 64, -64, 64, -64, 64, -64, 64, 64, -64, -64, 64, -64, -64, -64, -64, -64, -64, -64, -64, 64, -64, -64, -64, -64, -64, -64, 64, 64, -64, -64, -64, 64, 64, -64, 64, -64, -64, 64, -64, -64, -64, -64, 64, -64, -64, -64, -64, 64, -64, -64, -64, 64, -64, 64, 64, 64, 64, -64, 64, 64, 64, -64, 64, -64, 64, -64, -64, -64, 64, -64, -64, 64, -64, -64, -64, -64, 64, -64, -64, -64, -64, -64, -64, 64, -64, 64, 64, 64, 64, 64, -64, -64, -64, -64, -64, 64, 64, 64, 64, -64, -64, -64, 64, 64, 64, 64, 64, -64, -64, -64, -64, 64, 64, 64, -64, 64, 64, 64, -64, -64, -64, -64, 64, 64, 64, -64, -64, -64, -64, -64, -64, 64, 64, 64, 64, -64, -64, -64, 64, -64, 64, -64, -64, 64, 64, -64, -64, -64, 64, -64, -64, -64, -64, -64, -64, -64, -64, -64, -64, 64, 64, 64, -64, -64, 64, -64, 64, 64, -64, 64, 64, 64, 64, -64, -64, 64, -64, -64, -64, -64, -64, -64, -64, -64, -64, -64, -64, 64, 64, 64, -64, -64, 64, 64, 64, 64, 64, -64, -64, -64, 64, -64, -64, -64, -64, -64, -64, -64, 64, 64, 64, -64, -64, -64, 64, 64, 64, 64, 64, -64, -64, -64, 64, 64, -64, -64, -64, -64, 64, 64, -64, -64, -64, -64, -64, -64, -64, -64, 64, -64, -64, -64, -64, -64, -64, 64, 64, 64, 64, 64, -64, 64, 64, -64, -64, 64, -64, 64, -64, -64, -64, -64, -64, -64, -64, -64, 64, -64, -64, -64, -64, -64, -64, 64, -64, 64, 64, -64, 64, -64, -64, -64, -64, 64, 64, 64, 64, -64, -64, 64, 64, 64, -64, 64, -64, -64, -64, -64, -64, -64, -64, -64, 64, 64, -64, 64, 64, 64, -64, -64, -64, -64, 64, -64, -64, -64, -64, 64, -64, -64, -64, -64, -64, -64, -64, -64, -64, -64, -64, 64, 64, -64, -64, -64, 64, -64, -64, 64, -64, 64, 64, -64, -64, -64, 64, 64, -64, -64, -64, -64, -64, -64, -64, -64, -64, -64, -64, 64, 64, 64, -64, 64, -64, 64, 64, -64, -64, 64, 64, 64, -64, -64, 64, -64, 64, -64, -64, -64, 64, 64, 64, -64, -64, -64, 64, 64, 64, -64, -64, -64, 64, -64, -64, 64, 64, -64, 64, 64, -64, 64, -64, 64, -64, -64, -64, 64, -64, 64, -64, -64, 64, -64, -64, 64, 64, 64, -64, -64, 64, 64, 64, 64, -64, 64, 64, 64, -64, -64, -64, -64, -64, -64, -64, -64, -64, -64, -64, -64, -64, -64, -64, -64, 64, 64, -64, 64, 64, 64, 64, -64, 64, 64, -64, -64, -64, -64, -64, -64, -64, 64, 64, 64, -64, -64, 64, -64, 64, -64, -64, -64, -64, 64, -64, 64, 64, 64, -64, 64, -64, 64, -64, -64, -64, -64, -64, 64, -64, -64, -64, -64, -64, -64, 64, -64, 64, -64, -64, -64, 64, -64, 64, 64, -64, 64, 64, -64, 64, -64, -64, -64, -64, -64, -64, -64, -64, 64, 64, -64, -64, -64, -64, -64, -64, -64, -64, -64, 64, 64, -64, -64, -64, -64, 64, -64, 64, -64, -64, 64, -64, -64, -64, -64, 64, 64, 64, -64, -64, -64, -64, -64, 64, -64, -64, -64, 64, -64, -64, -64, -64, 64, 64, 64, 64, 64, 64, 64, 64, -64, -64, -64, 64, 64, 64, 64, -64, -64, -64, -64, 64, -64, -64, 64, 64, 64, 64, 64, 64, 64, -64, -64, 64, -64, 64, -64, -64, -64, 64, 64, -64, 64, 64, -64, -64, -64, 64, -64, -64, -64, -64, 64, -64, -64, -64, 64, -64, 64, 64, 64, 64, -64, 64, 64, 64, -64, -64, 64, 64, -64, -64, 64, -64, -64, -64, 64, 64, 64, 64, -64, 64, 64, 64, -64, -64, 64, -64, -64, -64, 64, 64, 64, -64, 64, -64, -64, 64, 64, -64, 64, -64, 64, 64, -64, 64, -64, -64, 64, -64, -64, 64, 64, 64, 64, 64, -64, 64, 64, -64, -64, 64, 64, -64, -64, 64, 64, -64, 64, -64, 64, -64, -64, 64, 64, -64, -64, -64, -64, 64, 64, 64, -64, -64, 64, 64, 64, 64, 64, -64, -64, -64, -64, -64, -64, 64, -64, -64, 64, 64, 64, 64, 64, -64, 64, -64, 64, -64, -64, -64, 64, -64, -64, 64, 64, 64, 64, -64, -64, -64, -64, -64, 64, -64, 64, 64, -64, 64, -64, 64, -64, -64, -64, -64, -64, 64, -64, 64, 64, 64, 64, 64, -64, -64, -64, 64, -64, -64, -64, -64, -64, -64, -64, -64, -64, -64, -64, -64, -64, -64, -64, -64, -64, -64, -64, 64, -64, 64, -64, -64, 64, -64, -64, -64, -64, -64, -64, -64, -64, -64, -64, -64, -64, -64, 64, -64, 64, 64, -64, 64, 64, 64, -64, -64, 64, 64, -64, 64, -64, -64, -64, -64, -64, -64, -64, -64, -64, -64, -64, -64, -64, 64, -64, -64, -64, -64, 64, 64, 64, 64, -64, 64, 64, 64, -64, 64, -64, -64, -64, -64, -64, -64, -64, -64, -64, -64, -64, 64, 64, -64, -64, -64, -64, -64, 64, 64, 64, 64, -64, 64, -64, 64, -64, -64, -64, -64, -64, -64, -64, -64, -64, -64, 64, -64, 64, -64, -64, -64, -64, -64, 64, -64, 64, -64, 64, 64, -64, 64, 64, -64, -64, -64, 64, -64, -64, -64, -64, 64, -64, -64, -64, -64, 64, -64, -64, 64, 64, 64, 64, 64, 64, 64, 64, 64, 64, 64, -64, 64, -64, 64, -64, -64, -64, -64, -64, -64, -64, -64, -64, -64, 64, 64, 64, -64, -64, 64, 64, 64, 64, 64, 64, 64, 64, 64, -64, 64, 64, 64, -64, 64, -64, -64, -64, -64, -64, -64, -64, -64, 64, 64, 64, 64, -64, 64, 64, 64, 64, 64, 64, 64, 64, 64, -64, -64, 64, 64, -64, 64, -64, -64, 64, 64, -64, 64, 64, 64, 64, 64, -64, -64, -64, -64, -64, -64, 64, 64, 64, -64, -64, -64, -64, 64, -64, -64, -64, 64, -64, -64, -64, -64, -64, -64, 64, 64, -64, 64, -64, -64, -64, -64, -64, -64, -64, 64, 64, -64, 64, -64, 64, -64, 64, -64, -64, -64, 64, 64, 64, 64, -64, -64, 64, 64, -64, 64, -64, 64, -64, -64, -64, -64, -64, -64, -64, 64, 64, 64, -64, -64, -64, -64, 64, 64, -64, 64, -64, 64, 64, -64, -64, 64, -64, -64, -64, -64, -64, -64, -64, -64, -64, -64, 64, -64, 64, 64, -64, 64, -64, -64, -64, -64, -64, 64, -64, 64, -64, -64, -64, -64, -64, -64, -64, -64, 64, -64, -64, -64, -64, -64, -64, -64, -64, -64, -64, 64, -64, 64, 64, 64, 64, 64, 64, 64, 64, -64, -64, 64, -64, 64, -64, 64, -64, -64, -64, -64, -64, -64, -64, -64, 64, 64, -64, 64, 64, -64, 64, 64, 64, 64, 64, 64, 64, -64, -64, 64, 64, 64, 64, -64, -64, -64, -64, -64, -64, -64, -64, -64, -64, 64, 64, 64, 64, -64, -64, -64, 64, 64, 64, 64, -64, -64, 64, -64, -64, 64, -64, -64, -64, -64, -64, -64, -64, 64, -64, 64, 64, 64, -64, 64, -64, 64, -64, 64, 64, 64, 64, -64, -64, 64, 64, -64, -64, -64, 64, 64, -64, -64, -64, -64, -64, -64, -64, -64, -64, 64, 64, 64, 64, 64, -64, -64, 64, -64, 64, 64, -64, 64, -64, -64, -64, -64, -64, -64, -64, -64, -64, -64, 64, -64, -64, -64, 64, 64, 64, 64, 64, -64, -64, -64, 64, 64, -64, -64, -64, -64, -64, -64, -64, 64, 64, -64, -64, -64, -64, -64, -64, -64, -64, 64, 64, -64, 64, 64, 64, 64, 64, -64, -64, -64, -64, -64, 64, -64, -64, 64, -64, 64, -64, -64, -64, -64, -64, -64, -64, 64, -64, -64, -64, -64, 64, -64, -64, 64, -64, -64, -64, 64, 64, -64, 64, 64, 64, -64, 64, -64, -64, -64, -64, -64, -64, -64, -64, -64, 64, -64, -64, 64, 64, 64, 64, 64, 64, 64, 64, -64, -64, 64, -64, -64, -64, 64, -64, -64, -64, 64, -64, -64, 64, 64, 64, -64, 64, -64, -64, 64, 64, -64, 64, -64, 64, -64, -64, -64, -64, -64, -64, 64, 64, 64, -64, -64, -64, 64, -64, -64, -64, -64, -64, -64, 64, -64, -64, -64, -64, 64, 64, -64, 64, 64, 64, 64, 64, 64, -64, 64, 64, 64, 64, 64, 64, -64, 64, 64, 64, -64, -64, -64, 64, -64, 64, 64, 64, -64, -64, -64, 64, 64, -64, 64, 64, -64, -64, 64, 64, 64, -64, 64, 64, 64, -64, -64, 64, 64, -64, 64, -64, 64, -64, -64, -64, 64, 64, 64, 64, -64, -64, -64, -64, -64, -64, -64, 64, 64, -64, 64, 64, -64, 64, -64, -64, -64, 64, 64, 64, 64, 64, 64, 64, 64, 64, -64, 64, -64, -64, 64, 64, -64, 64, 64, 64, 64, 64, -64, 64, 64, 64, 64, -64, 64, -64, 64, -64, -64, 64, -64, -64, -64, 64, 64, -64, 64, -64, 64, 64, 64, 64, -64, -64, -64, -64, -64, -64, -64, -64, 64, -64, -64, -64, 64, 64, -64, 64, 64, -64, -64, -64, 64, -64, 64, 64, -64, 64, 64, 64, 64, -64, -64, -64, -64, -64, -64, -64, 64, 64, -64, 64, 64, -64, -64, -64, 64, -64, 64, -64, 64, 64, 64, 64, -64, 64, 64, -64, -64, -64, -64, -64, -64, -64, -64, -64, -64, -64, -64, -64, -64, -64, -64, -64, -64, 64, 64, 64, -64, 64, 64, 64, -64, 64, 64, 64, -64, -64, -64, 64, -64, -64, -64, -64, -64, -64, -64, -64, 64, -64, -64, -64, -64, 64, -64, 64, -64, -64, 64, 64, 64, 64, 64, 64, -64, -64, 64, -64, 64, 64, -64, -64, -64, -64, -64, -64, -64, -64, -64, -64, 64, -64, -64, 64, 64, -64, -64, 64, 64, -64, -64, -64, -64, -64, -64, 64, 64, 64, -64, -64, -64, -64, -64, -64, -64, -64, -64, 64, 64, 64, -64, 64, -64, -64, -64, -64, -64, -64, -64, 64, -64, -64, -64, -64, 64, -64, -64, -64, -64, -64, -64, -64, -64, -64, -64, -64, 64, -64, 64, -64, 64, 64, 64, -64, -64, -64, -64, -64, -64, -64, -64, -64, 64, -64, 64, -64, -64, -64, -64, -64, -64, 64, -64, 64, -64, -64, -64, -64, 64, -64, -64, -64, -64, -64, -64, -64, -64, -64, 64, 64, 64, 64, -64, 64, 64, -64, 64, 64, 64, 64, 64, -64, 64, -64, -64, 64, 64, 64, -64, -64, -64, 64, -64, -64, -64, -64, -64, 64, -64, -64, -64, -64, -64, -64, -64, 64, 64, 64, 64, -64, 64, 64, 64, -64, 64, 64, -64, -64, -64, -64, -64, -64, -64, -64, -64, -64, -64, -64, -64, -64, -64, 64, 64, 64, 64, 64, 64, 64, 64, 64, 64, -64, 64, 64, 64, 64, 64, 64, 64, 64, -64, -64, -64, -64, -64, -64, -64, -64, -64, 64, 64, 64, -64, 64, 64, 64, -64, 64, 64, 64, -64, -64, 64, 64, 64, -64, 64, -64, 64, -64, -64, -64, -64, -64, -64, -64, -64, 64, 64, -64, 64, 64, 64, 64, 64, -64, -64, -64, 64, -64, 64, 64, -64, -64, 64, 64, 64, 64, -64, -64, 64, -64, -64, -64, -64, 64, 64, 64, 64, 64, 64, 64, 64, -64, 64, 64, 64, -64, -64, 64, -64, 64, -64, -64, 64, -64, -64, -64, -64, 64, -64, -64, 64, 64, 64, 64, 64, 64, 64, 64, 64, -64, 64, -64, 64, -64, 64, -64, -64, -64, 64, -64, 64, -64, 64, -64, -64, -64, -64, 64, 64, 64, 64, 64, 64, 64, 64, -64, -64, 64, 64, 64, 64, -64, -64, -64, -64, -64, -64, 64, 64, 64, 64, -64, -64, -64, 64, 64, 64, 64, 64, 64, -64, -64, 64, 64, 64, 64, 64, 64, 64, 64, -64, -64, -64, -64, -64, -64, 64, -64, 64, -64, 64, -64, -64, -64, 64, 64, -64, -64, -64, -64, -64, 64, 64, 64, 64, 64, 64, -64, 64, -64, -64, -64, -64, 64, -64, -64, -64, 64, -64, -64, -64, 64, 64, -64, -64, -64, -64, -64, 64, 64, -64, -64, -64, 64, 64, -64, 64, 64, 64, 64, -64, -64, -64, -64, 64, -64, -64, -64, -64, -64, -64, -64, -64, -64, -64, 64, 64, -64, 64, 64, 64, -64, 64, -64, -64, 64, 64, -64, 64, -64, -64, -64, -64, -64, -64, -64, -64, -64, -64, 64, -64, -64, -64, 64, -64, -64, -64, 64, 64, -64, 64, 64, -64, -64, -64, -64, -64, 64, -64, 64, -64, -64, -64, -64, -64, -64, -64, 64, -64, -64, -64, -64, 64, -64, 64, -64, -64, 64, -64, -64, -64, -64, -64, 64, -64, -64, 64, 64, 64, -64, -64, -64, 64, -64, -64, 64, -64, 64, -64, 64, -64, 64, 64, -64, -64, 64, -64, -64, 64, -64, 64, 64, 64, 64, -64, 64, 64, -64, -64, -64, -64, 64, -64, -64, -64, 64, 64, -64, -64, 64, 64, 64, -64, -64, 64, 64, -64, 64, 64, -64, -64, 64, 64, 64, 64, -64, -64, 64, -64, 64, 64, -64, 64, 64, -64, -64, -64, 64, -64, -64, -64, -64, 64, -64, 64, 64, 64, -64, 64, 64, -64, 64, 64, 64, -64, -64, 64, 64, -64, 64, -64, 64, 64, 64, 64, 64, 64, -64, -64, 64, 64, -64, 64, 64, -64, -64, 64, 64, 64, 64, 64, -64, -64, -64, -64, -64, 64, -64, 64, -64, -64, 64, 64, 64, -64, -64, 64, -64, -64, -64, -64, -64, -64, 64, 64, 64, -64, -64, -64, 64, 64, 64, 64, -64, -64, -64, -64, 64, -64, -64, 64, 64, -64, 64, -64, -64, 64, -64, 64, -64, -64, 64, 64, 64, 64, 64, 64, 64, -64, -64, 64, 64, -64, 64, 64, -64, 64, 64, -64, -64, -64, -64, 64, 64, 64, -64, 64, 64, -64, -64, 64, 64, -64, -64, -64, -64, 64, 64, -64, 64, -64, 64, 64, 64, -64, 64, -64, 64, -64, -64, -64, 64, 64, -64, -64, 64, -64, -64, -64, -64, -64, -64, 64, 64, -64, -64, -64, 64, 64, -64, 64, -64, -64, 64, -64, -64, -64, -64, 64, 64, 64, -64, 64, -64, -64, -64, 64, -64, -64, -64, -64, 64, -64, 64, 64, -64, -64, 64, 64, -64, -64, -64, -64, -64, -64, -64, -64, -64, 64, 64, 64, 64, -64, -64, -64, 64, -64, -64, -64, 64, -64, -64, -64, -64, -64, -64, -64, -64, -64, -64, 64, 64, -64, 64, -64, 64, 64, -64, 64, 64, 64, 64, -64, -64, 64, -64, 64, -64, 64, 64, -64, 64, 64, 64, -64, 64, 64, 64, 64, -64, 64, -64, 64, -64, -64, -64, -64, -64, -64, -64, -64, 64, -64, -64, 64, 64, 64, -64, -64, 64, -64, -64, -64, -64, -64, -64, -64, 64, -64, 64, 64, -64, 64, 64, -64, -64, -64, 64, 64, -64, -64, -64, -64, -64, -64, -64, -64, 64, -64, -64, -64, -64, -64, -64, 64, -64, 64, -64, -64, 64, -64, -64, 64, -64, -64, 64, -64, -64, -64, -64, 64, -64, -64, 64, -64, 64, 64, -64, -64, -64, -64, 64, -64, 64, -64, 64, -64, -64, -64, 64, -64, -64, -64, -64, -64, -64, -64, 64, -64, -64, -64, -64, 64, 64, -64, -64, -64, -64, -64, 64, -64, -64, -64, 64, -64, -64, 64, 64, -64, 64, -64, -64, 64, -64, -64, 64, 64, 64, 64, -64, -64, -64, -64, -64, -64, -64, -64, -64, 64, -64, -64, -64, -64, 64, 64, -64, -64, -64, -64, -64, -64, -64, 64, 64, -64, -64, -64, -64, -64, -64, -64, -64, 64, -64, -64, -64, 64, -64, -64, 64, -64, 64, -64, 64, -64, -64, 64, -64, -64, -64, 64, 64, -64, -64, -64, -64, -64, 64, -64, 64, -64, -64, -64, -64, -64, 64, 64, -64, -64, 64, 64, 64, -64, -64, -64, 64, -64, -64, -64, -64, -64, 64, 64, -64, -64, -64, -64, -64, 64, -64, -64, -64, -64, 64, -64, -64, -64, -64, -64, -64, 64, 64, -64, 64, -64, -64, -64, -64, -64, -64, -64, -64, -64, -64, -64, 64, -64, 64, -64, -64, -64, 64, -64, -64, -64, -64, 64, 64, -64, -64, 64, -64, 64, 64, -64, -64, 64, -64, -64, -64, -64, 64, -64, 64, 64, 64, 64, -64, 64, 64, 64, 64, -64, 64, -64, -64, 64, -64, 64, 64, 64, -64, -64, 64, 64, -64, -64, -64, -64, -64, -64, 64, -64, 64, -64, -64, 64, -64, -64, 64, -64, -64, -64, 64, 64, 64, -64, -64, 64, -64, -64, -64, 64, -64, -64, -64, -64, -64, 64, -64, -64, 64, -64, -64, -64, -64, -64, 64, -64, -64, -64, 64, -64, -64, -64, 64, 64, -64, -64, -64, -64, -64, 64, -64, 64, -64, 64, 64, -64, 64, 64, -64, -64, -64, 64, -64, 64, -64, -64, 64, -64, 64, -64, -64, 64, -64, 64, -64, -64, 64, -64, -64, -64, -64, 64, 64, -64, -64, -64, -64, 64, 64, 64, 64, -64, 64, -64, -64, 64, 64, -64, -64, 64, 64, -64, -64, 64, 64, 64, 64, 64, 64, 64, -64, 64, 64, 64, -64, 64, 64, -64, 64, 64, 64, -64, 64, -64, -64, -64, -64, 64, 64, -64, 64, -64, -64, 64, 64, 64, 64, 64, 64, 64, 64, 64, 64, 64, -64, 64, 64, -64, 64, 64, 64, -64, 64, -64, -64, -64, 64, 64, -64, 64, -64, 64, 64, 64, -64, 64, -64, 64, -64, 64, -64, 64, -64, 64, -64, 64, -64, -64, 64, 64, -64, 64, 64, -64, 64, -64, -64, 64, 64, 64, -64, -64, -64, -64, -64, -64, 64, 64, -64, -64, 64, 64, 64, 64, 64, -64, -64, 64, -64, -64, -64, 64, 64, -64, -64, -64, 64, 64, -64, -64, -64, 64, -64, -64, -64, -64, -64, 64, -64, 64, -64, -64, -64, -64, 64, -64, 64, -64, -64, -64, -64, -64, 64, -64, -64, 64, -64, -64, 64, -64, -64, 64, -64, -64, 64, -64, -64, 64, -64, 64, 64, 64, 64, 64, -64, 64, -64, 64, -64, 64, -64, -64, 64, -64, -64, -64, -64, 64, -64, 64, -64, 64, 64, -64, -64, -64, 64, 64, 64, -64, -64, 64, 64, 64, 64, 64, 64, -64, 64, 64, -64, 64, -64, -64, 64, 64, 64, 64, -64, -64, -64, -64, 64, -64, 64, -64, -64, -64, -64, 64, 64, 64, 64, 64, 64, 64, 64, -64, -64, 64, -64, 64, 64, 64, -64, -64, 64, 64, 64, 64, -64, 64, 64, -64, -64, -64, 64, 64, -64, 64, -64, 64, 64, 64, 64, 64, 64, 64, -64, -64, 64, 64, 64, -64, 64, 64, 64, 64, 64, 64, -64, -64, 64, 64, 64, 64, -64, 64, 64, 64, 64, 64, 64, 64, 64, 64, 64, 64, 64, 64, 64, 64, 64, -64, -64, 64, 64, -64, -64, -64, -64, -64, 64, 64, 64, 64, 64, 64, 64, 64, 64, 64, 64, 64, 64, 64, 64, 64, 64, 64, 64, 64, 64, 64, -64, 64, -64, -64, -64, -64, 64, 64, 64, 64, 64, 64, 64, 64, 64, 64, 64, 64, 64, 64, 64, 64, -64, 64, -64, 64, 64, 64, 64, -64, -64, -64, -64, -64, -64, 64, 64, 64, -64, 64, -64, 64, 64, 64, 64, 64, 64, 64, 64, -64, -64, -64, -64, -64, 64, 64, -64, -64, -64, 64, 64, -64, -64, -64, 64, -64, 64, 64, 64, 64, 64, 64, -64, 64, -64, 64, -64, -64, -64, -64, -64, -64, 64, -64, 64, -64, 64, 64, 64, 64, -64, -64, -64, -64, -64, -64, -64, -64, -64, -64, -64, -64, -64, -64, -64, -64, -64, -64, -64, -64, -64, -64, -64, 64, 64, 64, -64, -64, -64, -64, -64, -64, -64, 64, 64, -64, -64, -64, -64, -64, -64, 64, -64, -64, -64, 64, -64, -64, -64, -64, -64, -64, 64, 64, -64, -64, -64, -64, 64, 64, 64, 64, 64, 64, 64, -64, 64, -64, -64, -64, 64, 64, -64, 64, 64, 64, 64, -64, -64, -64, -64, 64, 64, 64, -64, -64, 64, -64, 64, 64, 64, -64, 64, 64, -64, 64, 64, -64, 64, 64, 64, 64, 64, 64, -64, -64, -64, 64, 64, 64, 64, -64, 64, 64, 64, -64, 64, 64, -64, 64, -64, -64, -64, 64, -64, 64, 64, 64, -64, -64, 64, -64, -64, -64, -64, -64, -64, 64, 64, -64, 64, 64, 64, 64, 64, 64, -64, 64, 64, 64, 64, -64, -64, 64, 64, 64, -64, -64, 64, 64, -64, -64, -64, 64, -64, -64, 64, -64, -64, 64, -64, 64, 64, 64, 64, 64, 64, 64, 64, -64, 64, -64, -64, -64, -64, -64, -64, -64, -64, -64, -64, -64, 64, -64, 64, 64, -64, 64, 64, -64, 64, 64, 64, 64, -64, 64, -64, 64, -64, -64, -64, -64, -64, -64, -64, -64, -64, -64, -64, -64, -64, -64, 64, 64, -64, 64, 64, 64, -64, -64, 64, -64, -64, -64, -64, 64, 64, -64, 64, -64, -64, 64, 64, 64, 64, -64, 64, 64, 64, 64, -64, -64, -64, -64, -64, -64, -64, -64, -64, -64, -64, 64, 64, 64, 64, 64, -64, 64, -64, 64, 64, 64, 64, -64, -64, -64, -64, -64, -64, -64, -64, -64, -64, -64, -64, -64, -64, 64, 64, 64, 64, 64, 64, 64, 64, 64, 64, 64, 64, 64, -64, -64, 64, -64, 64, -64, 64, -64, -64, -64, 64, -64, 64, 64, 64, 64, 64, 64, 64, 64, 64, 64, 64, 64, 64, 64, 64, -64, -64, -64, -64, 64, -64, 64, 64, -64, 64, 64, -64, 64, 64, 64, 64, 64, 64, 64, 64, 64, 64, 64, 64, 64, 64, 64, 64, -64, 64, 64, -64, 64, -64, 64, -64, 64, -64, 64, -64, 64, 64, 64, 64, 64, 64, 64, 64, 64, 64, 64, 64, 64, 64, -64, 64, 64, 64, -64, -64, 64, -64, 64, 64, 64, -64, -64, -64, -64, 64, 64, 64, 64, 64, 64, 64, -64, 64, -64, 64, 64, -64, -64, -64, 64, -64, 64, 64, 64, -64, 64, 64, -64, -64, -64, -64, -64, 64, 64, 64, 64, 64, 64, 64, 64, -64, -64, -64, -64, -64, -64, -64, -64, 64, 64, -64, 64, -64, 64, 64, -64, 64, -64, -64, -64, -64, -64, -64, -64, -64, -64, 64, 64, -64, -64, -64, -64, -64, -64, -64, 64, -64, -64, -64, -64, 64, -64, -64, 64, -64, -64, -64, 64, -64, 64, -64, -64, -64, -64, -64, 64, -64, -64, -64, 64, -64, 64, -64, 64, 64, -64, 64, 64, 64, 64, -64, -64, -64, 64, 64, -64, 64, 64, -64, 64, 64, 64, 64, -64, 64, 64, -64, 64, -64, -64, 64, 64, 64, -64, 64, -64, 64, 64, 64, 64, -64, 64, -64, -64, -64, -64, -64, 64, 64, -64, 64, -64, -64, -64, -64, -64, -64, -64, -64, 64, -64, 64, 64, -64, 64, -64, -64, -64, -64, -64, -64, -64, -64, -64, 64, 64, 64, 64, -64, 64, -64, 64, -64, -64, -64, 64, 64, -64, -64, 64, 64, 64, 64, 64, 64, 64, -64, -64, -64, -64, 64, 64, -64, -64, -64, -64, -64, -64, -64, -64, -64, -64, -64, -64, -64, -64, -64, 64, -64, -64, 64, -64, -64, -64, -64, -64, -64, -64, -64, -64, 64, -64, 64, -64, -64, -64, -64, -64, -64, -64, 64, -64, 64, 64, 64, 64, -64, 64, -64, -64, -64, -64, 64, 64, -64, -64, -64, 64, -64, -64, -64, -64, -64, -64, -64, -64, -64, -64, -64, 64, -64, 64, 64, 64, -64, 64, 64, 64, -64, 64, -64, -64, 64, 64, -64, -64, -64, -64, -64, -64, -64, -64, -64, -64, -64, -64, 64, 64, 64, 64, 64, 64, 64, 64, -64, -64, 64, 64, 64, 64, -64, 64, 64, -64, -64, -64, -64, -64, -64, 64, 64, -64, -64, -64, -64, 64, 64, 64, -64, 64, 64, -64, -64, 64, -64, -64, -64, 64, -64, -64, -64, -64, -64, -64, -64, 64, -64, -64, 64, 64, 64, -64, -64, 64, 64, 64, 64, 64, 64, -64, -64, -64, -64, -64, -64, -64, -64, -64, -64, -64, -64, -64, 64, 64, 64, -64, 64, 64, 64, -64, -64, 64, 64, 64, -64, 64, 64, 64, -64, 64, -64, 64, -64, -64, 64, -64, -64, -64, -64, 64, 64, 64, 64, -64, -64, -64, -64, 64, -64, 64, 64, -64, -64, 64, 64, -64, -64, 64, -64, 64, 64, 64, -64, -64, -64, -64, -64, -64, 64, 64, 64, -64, 64, 64, -64, -64, 64, -64, -64, -64, -64, 64, 64, 64, -64, -64, -64, -64, 64, -64, -64, -64, -64, -64, 64, -64, 64, 64, 64, 64, -64, -64, -64, -64, -64, -64, -64, -64, -64, 64, -64, -64, -64, -64, -64, -64, 64, -64, -64, -64, -64, -64, -64, 64, 64, 64, -64, 64, -64, -64, -64, -64, -64, -64, 64, -64, 64, -64, 64, 64, -64, 64, -64, -64, 64, -64, -64, -64, -64, 64, -64, 64, 64, 64, 64, -64, 64, -64, -64, 64, -64, -64, -64, -64, -64, 64, 64, -64, -64, -64, -64, 64, 64, 64, -64, -64, -64, -64, -64, -64, 64, -64, -64, -64, 64, 64, 64, -64, 64, -64, -64, -64, 64, 64, -64, -64, -64, 64, 64, -64, 64, 64, -64, 64, -64, 64, -64, -64, 64, 64, 64, 64, 64, 64, -64, -64, -64, 64, -64, 64, -64, -64, 64, 64, -64, 64, -64, 64, 64, 64, 64, -64, -64, -64, -64, -64, -64, -64, -64, 64, 64, -64, -64, -64, 64, -64, -64, 64, -64, -64, 64, 64, -64, -64, 64, 64, 64, 64, 64, 64, -64, -64, -64, -64, -64, 64, 64, 64, 64, 64, 64, -64, 64, -64, -64, -64, -64, -64, -64, -64, -64, 64, -64, 64, 64, 64, 64, 64, -64, -64, -64, -64, -64, 64, 64, 64, 64, -64, -64, -64, -64, -64, -64, -64, 64, -64, 64, -64, -64, 64, -64, 64, 64, 64, 64, 64, 64, -64, -64, 64, -64, -64, -64, 64, -64, -64, -64, -64, 64, 64, 64, 64, 64, -64, 64, 64, -64, 64, -64, 64, 64, 64, 64, 64, 64, -64, -64, -64, -64, -64, -64, -64, -64, -64, -64, 64, -64, 64, 64, -64, -64, -64, 64, 64, -64, -64, -64, 64, 64, -64, 64, -64, -64, -64, -64, -64, -64, -64, -64, -64, -64, -64, -64, 64, -64, 64, -64, 64, -64, -64, -64, -64, 64, -64, -64, 64, 64, -64, -64, -64, -64, -64, -64, -64, 64, 64, 64, -64, -64, 64, 64, -64, 64, 64, 64, -64, 64, -64, 64, -64, 64, -64, 64, -64, -64, -64, -64, -64, -64, 64, 64, 64, 64, -64, 64, 64, -64, -64, -64, -64, -64, 64, 64, -64, -64, 64, -64, 64, 64, -64, 64, 64, -64, 64, -64, -64, -64, 64, -64, -64, -64, -64, -64, -64, -64, -64, -64, -64, -64, -64, 64, -64, -64, 64, 64, -64, 64, -64, 64, 64, 64, 64, -64, -64, -64, -64, 64, -64, -64, -64, -64, -64, -64, -64, -64, -64, -64, 64, 64, -64, -64, -64, -64, -64, 64, -64, -64, 64, 64, -64, 64, 64, -64, 64, 64, -64, -64, 64, -64, -64, -64, -64, 64, -64, 64, -64, 64, 64, -64, -64, 64, -64, -64, -64, -64, 64, 64, 64, 64, 64, 64, 64, 64, 64, -64, -64, 64, -64, -64, -64, -64, -64, 64, -64, -64, 64, 64, -64, 64, 64, 64, -64, 64, -64, -64, 64, 64, -64, -64, -64, 64, 64, -64, -64, -64, -64, -64, -64, 64, -64, -64, -64, -64, 64, -64, -64, -64, -64, 64, -64, -64, 64, -64, 64, -64, 64, -64, 64, -64, -64, -64, 64, -64, 64, -64, -64, -64, 64, -64, 64, 64, 64, 64, 64, 64, 64, 64, -64, -64, -64, 64, 64, -64, 64, -64, 64, 64, -64, -64, -64, -64, -64, 64, -64, -64, -64, 64, 64, -64, 64, -64, -64, -64, 64, 64, 64, -64, -64, -64, -64, 64, 64, 64, 64, 64, 64, 64, -64, -64, -64, -64, -64, -64, 64, 64, -64, -64, 64, 64, -64, 64, -64, 64, 64, 64, -64, -64, -64, -64, -64, -64, 64, 64, 64, 64, 64, 64, -64, 64, 64, 64, 64, -64, 64, -64, -64, -64, -64, 64, 64, -64, -64, -64, 64, -64, 64, -64, -64, -64, -64, 64, 64, 64, 64, -64, 64, 64, 64, 64, 64, -64, 64, 64, 64, 64, -64, -64, -64, -64, -64, -64, -64, -64, -64, -64, -64, 64, -64, 64, 64, -64, -64, -64, -64, -64, -64, 64, 64, 64, 64, -64, -64, -64, -64, 64, -64, 64, -64, -64, 64, -64, -64, -64, -64, -64, 64, 64, -64, 64, -64, -64, -64, 64, 64, -64, -64, 64, 64, 64, -64, 64, 64, 64, 64, 64, 64, -64, -64, -64, -64, -64, -64, 64, 64, -64, -64, 64, -64, -64, -64, -64, -64, -64, -64, -64, -64, 64, 64, -64, 64, 64, -64, 64, 64, 64, -64, -64, -64, -64, -64, -64, 64, -64, -64, -64, 64, -64, -64, -64, 64, -64, -64, -64, 64, 64, -64, -64, -64, 64, -64, 64, -64, 64, 64, -64, -64, -64, -64, 64, -64, 64, -64, 64, -64, -64, -64, -64, -64, -64, -64, -64, -64, -64, 64, 64, -64, 64, -64, 64, -64, 64, -64, -64, -64, -64, -64, -64, -64, -64, -64, -64, -64, -64, -64, -64, -64, -64, -64, 64, -64, -64, -64, 64, -64, -64, -64, -64, -64, 64, 64, -64, -64, -64, -64, -64, 64, -64, -64, -64, -64, -64, -64, 64, -64, -64, -64, -64, -64, -64, 64, 64, 64, -64, -64, 64, -64, -64, -64, 64, -64, -64, -64, 64, -64, -64, -64, 64, -64, 64, 64, -64, -64, -64, -64, -64, -64, -64, -64, 64, -64, 64, 64, -64, 64, -64, 64, -64, -64, -64, -64, -64, -64, 64, -64, -64, 64, 64, 64, -64, -64, -64, -64, -64, -64, 64, -64, 64, 64, 64, 64, -64, -64, -64, 64, -64, -64, -64, -64, 64, -64, -64, -64, 64, -64, -64, -64, -64, 64, -64, 64, -64, -64, -64, 64, 64, -64, 64, -64, 64, -64, 64, 64, 64, 64, -64, 64, 64, -64, -64, -64, -64, -64, -64, -64, 64, 64, -64, 64, -64, -64, 64, -64, 64, 64, -64, -64, 64, -64, -64, -64, -64, -64, 64, 64, -64, -64, -64, -64, -64, -64, -64, -64, -64, -64, 64, 64, 64, 64, 64, 64, -64, 64, 64, -64, 64, -64, 64, 64, 64, 64, -64, 64, -64, -64, -64, -64, -64, -64, -64, -64, -64, -64, 64, 64, 64, -64, -64, 64, -64, -64, -64, -64, -64, 64, 64, 64, -64, 64, 64, 64, -64, -64, -64, -64, -64, -64, -64, -64, -64, 64, 64, 64, 64, -64, 64, 64, -64, -64, 64, -64, -64, -64, -64, -64, -64, 64, 64, 64, 64, -64, -64, -64, -64, -64, -64, -64, -64, 64, 64, 64, 64, 64, 64, 64, -64, -64, 64, 64, -64, 64, 64, -64, -64, 64, 64, 64, 64, -64, 64, -64, -64, -64, 64, 64, 64, 64, 64, 64, 64, 64, 64, -64, -64, 64, -64, 64, 64, 64, -64, 64, 64, 64, 64, -64, 64, 64, -64, 64, 64, 64, 64, 64, 64, -64, 64, 64, 64, 64, -64, 64, -64, 64, -64, -64, 64, 64, 64, 64, 64, -64, 64, 64, 64, 64, 64, 64, 64, 64, 64, 64, -64, -64, -64, 64, 64, 64, -64, -64, 64, 64, 64, -64, 64, 64, -64, -64, -64, -64, 64, 64, 64, 64, -64, 64, -64, -64, -64, -64, -64, -64, 64, 64, 64, -64, -64, -64, 64, 64, -64, 64, 64, -64, 64, -64, -64, -64, 64, 64, -64, -64, 64, -64, -64, -64, -64, -64, 64, -64, -64, 64, 64, -64, 64, 64, 64, -64, -64, 64, 64, -64, -64, 64, 64, 64, -64, 64, 64, -64, -64, -64, -64, 64, -64, 64, -64, -64, 64, -64, -64, -64, -64, -64, 64, -64, -64, -64, -64, -64, 64, 64, -64, -64, 64, 64, -64, 64, 64, -64, 64, -64, -64, -64, 64, 64, -64, 64, -64, -64, -64, -64, -64, -64, -64, 64, -64, -64, 64, 64, 64, 64, 64, 64, -64, -64, 64, 64, -64, 64, -64, 64, 64, 64, 64, 64, 64, 64, 64, 64, -64, -64, -64, 64, 64, 64, 64, -64, -64, -64, 64, -64, -64, 64, -64, -64, 64, 64, 64, 64, 64, 64, 64, 64, 64, 64, -64, 64, 64, -64, -64, -64, 64, -64, -64, -64, -64, 64, -64, 64, -64, -64, -64, 64, 64, 64, 64, 64, -64, 64, 64, 64, 64, 64, -64, -64, 64, -64, -64, 64, -64, 64, -64, -64, -64, 64, -64, -64, -64, -64, -64, 64, 64, 64, 64, 64, 64, 64, 64, 64, 64, 64, 64, -64, -64, -64, -64, 64, -64, 64, 64, 64, 64, -64, -64, -64, -64, -64, 64, 64, -64, -64, -64, -64, 64, 64, 64, 64, 64, 64, -64, 64, -64, -64, 64, -64, 64, 64, -64, 64, -64, -64, -64, -64, -64, -64, 64, -64, 64, -64, -64, 64, 64, 64, 64, -64, 64, 64, 64, -64, 64, 64, 64, 64, 64, -64, -64, -64, -64, -64, -64, -64, -64, -64, 64, 64, -64, -64, -64, 64, 64, 64, 64, 64, 64, 64, 64, 64, 64, 64, 64, 64, -64, 64, 64, -64, -64, -64, -64, -64, -64, -64, -64, 64, 64, -64, -64, -64, 64, -64, -64, 64, 64, -64, 64, 64, 64, 64, 64, -64, 64, 64, -64, -64, 64, -64, -64, -64, -64, 64, 64, 64, 64, -64, 64, 64, -64, -64, -64, -64, -64, 64, 64, -64, 64, 64, 64, 64, 64, -64, -64, -64, -64, -64, -64, -64, 64, -64, 64, 64, -64, 64, -64, -64, -64, -64, -64, -64, -64, -64, -64, -64, -64, 64, -64, -64, -64, 64, 64, 64, 64, -64, -64, -64, -64, 64, 64, -64, 64, 64, -64, -64, -64, -64, -64, -64, -64, -64, -64, -64, -64, -64, -64, -64, -64, 64, -64, 64, -64, -64, 64, 64, -64, 64, 64, 64, 64, 64, -64, -64, -64, -64, -64, -64, -64, -64, 64, 64, -64, -64, -64, -64, 64, 64, -64, 64, 64, 64, 64, 64, -64, 64, 64, 64, 64, -64, -64, -64, -64, -64, -64, 64, -64, -64, 64, 64, 64, -64, -64, 64, -64, -64, -64, -64, 64, 64, 64, 64, 64, -64, 64, 64, 64, -64, -64, -64, -64, -64, -64, -64, 64, 64, 64, 64, 64, 64, 64, -64, 64, 64, 64, -64, 64, -64, 64, -64, 64, 64, 64, -64, -64, -64, -64, -64, -64, -64, -64, 64, 64, 64, 64, 64, -64, -64, -64, 64, 64, -64, -64, -64, -64, 64, -64, -64, 64, -64, -64, -64, -64, -64, -64, -64, -64, -64, 64, 64, 64, 64, 64, 64, -64, 64, -64, 64, -64, 64, -64, -64, 64, 64, -64, -64, -64, -64, -64, -64, -64, -64, -64, -64, -64, -64, -64, 64, 64, 64, 64, -64, -64, -64, 64, -64, -64, 64, -64, -64, 64, 64, -64, -64, -64, -64, -64, -64, -64, -64, -64, -64, -64, -64, 64, 64, 64, 64, 64, -64, 64, 64, -64, 64, 64, -64, 64, 64, 64, 64, 64, 64, 64, 64, -64, -64, -64, -64, 64, -64, -64, -64, 64, 64, 64, 64, -64, -64, 64, -64, -64, -64, -64, -64, -64, 64, -64, 64, 64, 64, -64, -64, 64, 64, 64, -64, -64, -64, 64, 64, 64, 64, 64, 64, -64, 64, -64, -64, 64, 64, -64, 64, 64, 64, 64, 64, 64, 64, 64, 64, -64, -64, 64, -64, 64, 64, 64, 64, -64, 64, 64, -64, -64, -64, -64, -64, -64, 64, -64, 64, 64, 64, -64, 64, 64, 64, 64, 64, -64, 64, 64, 64, 64, -64, 64, -64, -64, -64, -64, 64, -64, -64, -64, -64, 64, -64, -64, -64, 64, 64, 64, 64, 64, 64, -64, 64, 64, 64, 64, -64, -64, -64, 64, -64, -64, 64, 64, -64, -64, -64, 64, -64, -64, -64, -64, 64, 64, 64, 64, 64, 64, 64, -64, 64, 64, 64, 64, -64, -64, -64, -64, -64, -64, 64, 64, -64, -64, -64, -64, -64, 64, -64, -64, 64, 64, -64, -64, 64, -64, -64, 64, -64, -64, -64, -64, -64, 64, 64, -64, 64, -64, 64, -64, -64, -64, 64, -64, 64, 64, 64, 64, 64, 64, 64, -64, -64, -64, 64, 64, -64, -64, -64, -64, 64, -64, -64, -64, -64, -64, -64, -64, -64, -64, 64, -64, 64, 64, 64, -64, -64, 64, 64, 64, 64, -64, 64, -64, 64, 64, 64, -64, -64, 64, 64, 64, -64, -64, -64, -64, -64, -64, 64, 64, 64, 64, -64, 64, -64, 64, -64, 64, -64, 64, 64, 64, 64, -64, 64, 64, 64, 64, 64, -64, -64, -64, -64, -64, -64, -64, -64, -64, -64, 64, -64, -64, -64, 64, 64, -64, -64, -64, 64, -64, -64, -64, 64, -64, -64, -64, -64, 64, -64, -64, -64, 64, 64, 64, -64, -64, -64, 64, 64, 64, -64, -64, 64, -64, -64, -64, 64, 64, 64, 64, 64, -64, 64, 64, -64, 64, -64, -64, 64, -64, -64, 64, -64, 64, -64, -64, -64, -64, -64, 64, -64, -64, 64, -64, 64, 64, 64, -64, 64, 64, 64, 64, 64, 64, 64, 64, 64, 64, 64, -64, 64, 64, 64, 64, -64, 64, 64, -64, 64, 64, 64, 64, 64, -64, -64, -64, 64, -64, -64, 64, 64, -64, 64, 64, 64, 64, 64, 64, 64, 64, 64, 64, 64, 64, 64, 64, 64, 64, 64, 64, 64, 64, -64, 64, -64, 64, 64, -64, 64, -64, 64, 64, 64, 64, 64, 64, 64, -64, -64, 64, 64, 64, 64, 64, 64, 64, 64, 64, -64, -64, -64, 64, -64, 64, 64, 64, 64, -64, -64, -64, 64, 64, 64, 64, 64, -64, 64, -64, 64, 64, 64, -64, -64, 64, 64, 64, -64, -64, 64, 64, -64, 64, 64, 64, -64, -64, 64, 64, -64, 64, -64, 64, 64, -64, -64, -64, 64, -64, -64, -64, 64, -64, 64, -64, -64, -64, 64, 64, 64, 64, 64, 64, -64, -64, 64, 64, 64, 64, -64, 64, 64, -64, -64, -64, -64, -64, -64, -64, 64, 64, -64, -64, -64, 64, -64, -64, 64, -64, -64, -64, -64, -64, 64, -64, 64, 64, 64, -64, -64, -64, 64, -64, 64, -64, -64, -64, 64, -64, -64, -64, 64, -64, -64, 64, -64, -64, 64, 64, -64, 64, 64, 64, 64, -64, -64, 64, -64, 64, -64, 64, 64, -64, 64, 64, -64, -64, -64, -64, -64, -64, -64, -64, 64, 64, -64, 64, 64, -64, -64, -64, 64, 64, -64, 64, 64, -64, 64, 64, 64, 64, -64, -64, -64, 64, 64, 64, 64, 64, 64, 64, 64, 64, 64, 64, 64, 64, -64, 64, -64, -64, 64, 64, 64, -64, -64, 64, 64, 64, -64, -64, 64, 64, 64, -64, 64, 64, 64, 64, 64, 64, 64, -64, 64, 64, 64, -64, -64, -64, 64, 64, 64, -64, 64, 64, 64, -64, -64, 64, 64, 64, -64, 64, 64, 64, 64, 64, 64, 64, -64, 64, -64, -64, 64, 64, 64, 64, 64, -64, 64, 64, -64, -64, -64, 64, 64, 64, 64, 64, 64, 64, 64, 64, 64, -64, -64, 64, -64, -64, 64, 64, 64, -64, -64, 64, 64, 64, -64, 64, 64, -64, 64, 64, 64, -64, 64, 64, 64, 64, 64, 64, 64, -64, 64, 64, 64, 64, 64, 64, 64, 64, 64, 64, 64, -64, -64, 64, 64, 64, 64, -64, 64, -64, 64, -64, -64, 64, 64, 64, 64, 64, 64, 64, 64, 64, -64, 64, 64, -64, 64, 64, 64, -64, -64, -64, 64, -64, 64, 64, 64, 64, -64, 64, 64, 64, 64, 64, 64, 64, -64, 64, 64, 64, 64, 64, 64, 64, 64, -64, 64, 64, -64, 64, -64, -64, 64, -64, -64, 64, 64, -64, 64, 64, 64, -64, -64, 64, 64, -64, -64, 64, 64, 64, 64, 64, 64, -64, 64, 64, 64, 64, -64, -64, 64, 64, -64, 64, -64, -64, -64, 64, -64, 64, 64, 64, 64, 64, 64, 64, 64, 64, -64, 64, 64, -64, 64, -64, 64, -64, -64, -64, 64, -64, -64, 64, 64, 64, 64, -64, 64, -64, 64, -64, 64, 64, 64, 64, -64, -64, -64, -64, 64, 64, 64, -64, -64, 64, -64, 64, 64, -64, 64, 64, -64, -64, -64, 64, 64, 64, -64, 64, -64, -64, 64, -64, 64, 64, -64, -64, 64, 64, 64, 64, 64, -64, -64, 64, 64, 64, -64, -64, 64, 64, -64, -64, 64, 64, -64, 64, 64, 64, 64, 64, -64, 64, -64, -64, 64, -64, -64, 64, 64, -64, 64, -64, -64, -64, -64, 64, 64, 64, 64, 64, 64, 64, 64, -64, -64, -64, -64, 64, 64, -64, 64, -64, -64, 64, -64, 64, 64, -64, -64, -64, 64, 64, 64, -64, 64, -64, 64, 64, 64, -64, 64, 64, 64, 64, 64, 64, 64, 64, -64, 64, -64, 64, -64, -64, -64, -64, 64, 64, -64, 64, 64, -64, 64, 64, -64, 64, -64, -64, 64, -64, -64, 64, -64, -64, -64, 64, 64, -64, 64, 64, -64, -64, -64, 64, 64, -64, -64, 64, -64, -64, -64, -64, 64, 64, -64, 64, 64, -64, 64, -64, -64, -64, -64, 64, -64, 64, -64, -64, -64, 64, 64, -64, -64, -64, 64, -64, -64, 64, -64, 64, 64, -64, -64, -64, -64, 64, -64, 64, -64, -64, -64, 64, 64, -64, -64, -64, -64, 64, -64, -64, -64, 64, 64, 64, -64, 64, 64, -64, -64, -64, 64, -64, -64, 64, -64, -64, -64, 64, -64, 64, -64, -64, 64, -64, 64, -64, -64, -64, -64, 64, 64, -64, 64, 64, -64, -64, 64, -64, -64, 64, 64, -64, 64, -64, -64, -64, -64, 64, -64, -64, 64, 64, -64, -64, -64, 64, 64, -64, -64, -64, 64, 64, -64, -64, 64, 64, 64, -64, -64, 64, -64, 64, -64, -64, 64, -64, -64, 64, -64, -64, -64, 64, -64, -64, 64, -64, -64, 64, -64, -64, -64, -64, 64, -64, 64, 64, 64, 64, 64, -64, 64, 64, 64, -64, -64, 64, 64, 64, -64, 64, 64, 64, 64, -64, -64, 64, -64, -64, 64, 64, -64, 64, -64, 64, 64, 64, 64, -64, 64, -64, -64, 64, 64, 64, -64, 64, 64, 64, 64, 64, -64, 64, -64, -64, -64, 64, 64, 64, -64, 64, -64, 64, 64, 64, 64, 64, 64, 64, 64, 64, 64, 64, 64, -64, -64, 64, -64, -64, 64, -64, -64, 64, -64, -64, -64, -64, 64, -64, 64, -64, 64, 64, -64, 64, 64, 64, 64, 64, -64, 64, 64, 64, 64, 64, 64, 64, 64, 64, 64, -64, 64, -64, -64, 64, 64, 64, 64, 64, 64, 64, 64, -64, -64, 64, 64, 64, 64, -64, -64, 64, -64, 64, 64, 64, 64, 64, 64, -64, -64, 64, 64, 64, -64, 64, -64, -64, 64, 64, 64, 64, 64, 64, -64, -64, 64, 64, -64, -64, 64, 64, -64, -64, 64, 64, 64, -64, -64, -64, -64, -64, 64, 64, -64, -64, 64, 64, 64, 64, -64, -64, -64, 64, 64, -64, -64, 64, 64, 64, -64, -64, 64, 64, -64, -64, 64, 64, 64, 64, 64, 64, 64, 64, 64, 64, 64, -64, 64, 64, 64, 64, 64, 64, -64, 64, -64, -64, 64, 64, 64, -64, -64, -64, 64, 64, 64, 64, -64, -64, 64, -64, -64, 64, 64, -64, 64, -64, 64, 64, 64, 64, 64, 64, -64, 64, -64, -64, 64, -64, 64, -64, 64, 64, -64, -64, 64, 64, 64, 64, 64, 64, 64, 64, 64, 64, 64, -64, -64, 64, -64, 64, 64, -64, 64, -64, 64, 64, -64, -64, -64, -64, 64, 64, 64, -64, 64, -64, 64, -64, 64, -64, 64, 64, -64, -64, 64, 64, 64, 64, -64, 64, -64, 64, 64, 64, 64, 64, -64, -64, 64, 64, 64, 64, 64, -64, 64, 64, 64, 64, 64, 64, -64, -64, 64, 64, 64, 64, 64, -64, 64, 64, 64, 64, -64, -64, 64, -64, -64, 64, 64, -64, -64, 64, 64, 64, -64, 64, -64, 64, 64, -64, 64, 64, 64, -64, -64, -64, -64, -64, 64, -64, 64, 64, -64, -64, -64, 64, 64, 64, -64, 64, 64, 64, 64, 64, -64, -64, 64, 64, 64, 64, -64, 64, 64, -64, 64, 64, -64, 64, -64, 64, 64, -64, -64, 64, -64, 64, 64, 64, 64, 64, -64, -64, -64, 64, 64, 64, 64, 64, -64, -64, 64, -64, -64, -64, 64, -64, 64, 64, -64, -64, -64, 64, 64, 64, 64, 64, 64, -64, 64, 64, 64, 64, 64, 64, 64, 64, 64, -64, 64, 64, 64, 64, 64, 64, 64, 64, -64, 64, 64, 64, -64, 64, 64, 64, 64, 64, -64, 64, 64, 64, 64, -64, 64, 64, 64, -64, -64, -64, 64, 64, -64, 64, 64, -64, 64, -64, -64, -64, 64, 64, 64, 64, -64, 64, -64, 64, 64, 64, 64, 64, 64, 64, 64, 64, 64, 64, -64, -64, 64, -64, -64, 64, 64, -64, 64, -64, 64, 64, 64, -64, 64, 64, 64, 64, 64, 64, 64, 64, 64, -64, 64, 64, 64, 64, -64, -64, 64, -64, 64, -64, -64, 64, -64, 64, 64, -64, -64, -64, 64, 64, 64, -64, 64, -64, 64, 64, -64, 64, 64, 64, 64, 64, 64, -64, 64, 64, -64, 64, 64, 64, 64, 64, -64, -64, -64, 64, 64, 64, -64, 64, -64, 64, -64, -64, -64, -64, 64, 64, 64, -64, 64, -64, 64, -64, -64, 64, -64, -64, -64, 64, -64, -64, -64, 64, 64, -64, -64, -64, -64, -64, 64, -64, -64, 64, 64, -64, -64, 64, -64, -64, -64, 64, 64, 64, 64, 64, -64, 64, 64, -64, -64, 64, -64, 64, -64, 64, 64, 64, 64, -64, -64, 64, 64, 64, -64, -64, 64, 64, 64, -64, -64, -64, 64, 64, -64, 64, -64, 64, 64, 64, 64, 64, -64, 64, 64, 64, -64, 64, -64, -64, 64, 64, 64, -64, -64, -64, 64, -64, -64, 64, -64, -64, -64, -64, 64, 64, 64, 64, -64, 64, -64, 64, 64, -64, -64, 64, 64, -64, -64, 64, -64, -64, 64, -64, -64, -64, 64, -64, 64, 64, 64, 64, -64, -64, 64, 64, 64, 64, -64, -64, 64, -64, 64, 64, -64, -64, -64, -64, -64, -64, -64, 64, -64, -64, -64, -64, 64, -64, 64, -64, -64, 64, -64, -64, -64, -64, -64, -64, -64, 64, 64, 64, -64, -64, 64, 64, -64, 64, -64, 64, -64, -64, -64, -64, -64, 64, 64, 64, 64, 64, 64, 64, -64, 64, -64, 64, 64, 64, -64, 64, 64, 64, 64, 64, 64, 64, -64, 64, -64, -64, 64, 64, -64, -64, -64, 64, -64, -64, 64, -64, -64, -64, -64, -64, -64, -64, -64, -64, -64, 64, 64, 64, 64, 64, 64, 64, -64, -64, -64, -64, 64, -64, 64, -64, -64, -64, 64, -64, -64, -64, -64, -64, -64, -64, -64, -64, -64, 64, -64, 64, 64, 64, 64, 64, -64, -64, 64, -64, 64, -64, 64, 64, -64, 64, 64, 64, -64, 64, 64, -64, -64, 64, -64, -64, -64, 64, 64, 64, 64, 64, -64, -64, -64, 64, -64, 64, 64, 64, -64, -64, 64, 64, 64, -64, -64, 64, 64, -64, 64, -64, -64, -64, 64, 64, 64, 64, 64, -64, 64, -64, 64, -64, -64, -64, 64, 64, -64, -64, 64, -64, -64, 64, 64, 64, -64, 64, 64, 64, 64, -64, 64, 64, 64, 64, -64, 64, 64, -64, 64, 64, -64, -64, 64, -64, 64, -64, 64, 64, 64, 64, 64, 64, -64, 64, 64, -64, 64, -64, -64, 64, 64, 64, 64, 64, -64, 64, -64, -64, -64, -64, 64, 64, 64, 64, 64, -64, 64, 64, 64, -64, -64, 64, 64, 64, 64, -64, -64, 64, 64, 64, 64, -64, -64, -64, 64, -64, 64, 64, 64, -64, -64, 64, 64, 64, 64, 64, 64, 64, 64, 64, 64, 64, 64, 64, -64, 64, 64, 64, -64, 64, 64, 64, 64, 64, 64, 64, 64, -64, -64, 64, 64, -64, 64, -64, 64, 64, 64, 64, 64, -64, 64, -64, 64, 64, 64, -64, -64, 64, 64, 64, 64, -64, -64, -64, 64, -64, 64, 64, 64, 64, 64, 64, -64, -64, 64, -64, -64, -64, 64, -64, 64, 64, 64, 64, 64, 64, 64, -64, 64, -64, 64, 64, 64, 64, 64, 64, 64, 64, 64, 64, -64, -64, 64, 64, 64, 64, 64, -64, 64, 64, 64, 64, 64, 64, -64, 64, 64, -64, 64, 64, 64, 64, 64, 64, 64, 64, 64, 64, 64, -64, 64, 64, 64, 64, 64, 64, 64, 64, 64, -64, 64, 64, 64, -64, -64, -64, 64, -64, 64, -64, -64, -64, -64, 64, 64, 64, 64, -64, -64, 64, -64, 64, 64, 64, 64, 64, 64, 64, 64, 64, -64, -64, -64, 64, 64, 64, -64, 64, 64, 64, 64, 64, 64, 64, 64, -64, -64, -64, 64, 64, -64, 64, 64, 64, 64, 64, 64, -64, -64, -64, -64, 64, -64, 64, -64, -64, -64, -64, 64, 64, 64, 64, -64, -64, -64, -64, 64, 64, 64, -64, 64, 64, 64, 64, 64, -64, -64, -64, -64, -64, 64, -64, -64, -64, 64, 64, 64, 64, 64, 64, -64, -64, -64, 64, 64, 64, 64, 64, 64, 64, -64, 64, 64, 64, -64, -64, 64, -64, 64, -64, 64, -64, 64, -64, 64, 64, 64, 64, -64, -64, -64, 64, 64, 64, -64, -64, -64, -64, 64, 64, 64, -64, -64, -64, 64, -64, -64, 64, 64, -64, -64, 64, 64, 64, 64, 64, -64, 64, -64, -64, 64, -64, -64, -64, 64, -64, 64, 64, 64, 64, -64, 64, 64, -64, 64, 64, 64, -64, -64, 64, -64, 64, 64, -64, -64, -64, -64, -64, -64, -64, 64, -64, 64, -64, 64, -64, 64, 64, -64, 64, -64, 64, 64, 64, -64, -64, -64, 64, -64, 64, 64, -64, 64, -64, 64, -64, 64, 64, -64, -64, -64, 64, 64, 64, -64, -64, 64, 64, 64, -64, -64, 64, 64, -64, -64, 64, 64, 64, 64, 64, 64, -64, -64, -64, 64, 64, 64, -64, -64, -64, 64, -64, -64, 64, 64, -64, 64, 64, 64, 64, -64, -64, -64, -64, -64, 64, 64, 64, 64, 64, 64, 64, 64, 64, 64, 64, -64, -64, 64, -64, -64, -64, 64, -64, -64, -64, -64, 64, -64, 64, 64, 64, -64, -64, -64, -64, -64, 64, 64, -64, 64, 64, 64, -64, -64, -64, -64, -64, -64, 64, -64, 64, -64, -64, -64, -64, 64, -64, 64, 64, -64, 64, 64, -64, 64, 64, 64, 64, -64, -64, 64, -64, 64, -64, -64, -64, 64, -64, -64, -64, 64, -64, 64, 64, -64, 64, 64, 64, 64, 64, 64, 64, -64, 64, -64, -64, -64, 64, -64, 64, 64, 64, 64, 64, 64, 64, -64, 64, 64, 64, -64, 64, -64, -64, 64, -64, -64, -64, 64, 64, -64, -64, 64, -64, -64, 64, -64, -64, -64, 64, -64, 64, 64, -64, -64, -64, 64, 64, 64, -64, 64, -64, -64, -64, 64, -64, 64, -64, 64, -64, -64, -64, -64, 64, 64, 64, 64, -64, -64, -64, 64, 64, -64, 64, 64, -64, 64, 64, -64, 64, -64, 64, 64, 64, 64, 64, 64, 64, 64, -64, -64, 64, 64, 64, 64, 64, -64, -64, -64, 64, 64, -64, -64, 64, 64, 64, -64, -64, 64, -64, 64, 64, 64, 64, 64, -64, 64, 64, 64, -64, -64, 64, 64, 64, 64, -64, -64, 64, -64, 64, -64, -64, -64, -64, -64, -64, -64, 64, 64, -64, 64, -64, 64, -64, -64, 64, -64, 64, -64, -64, 64, -64, 64, -64, -64, -64, 64, 64, -64, -64, 64, 64, -64, 64, -64, 64, 64, 64, -64, 64, 64, 64, 64, 64, 64, 64, -64, 64, -64, -64, 64, -64, 64, -64, -64, -64, 64, 64, 64, 64, 64, -64, -64, -64, -64, 64, -64, -64, -64, -64, -64, 64, -64, 64, -64, 64, -64, 64, 64, -64, -64, 64, -64, 64, -64, -64, -64, -64, 64, -64, 64, 64, 64, 64, 64, 64, 64, 64, 64, 64, 64, 64, 64, -64, 64, 64, 64, -64, -64, -64, -64, -64, -64, -64, -64, 64, 64, -64, 64, 64, -64, 64, -64, 64, 64, 64, 64, -64, -64, -64, 64, 64, 64, -64, 64, 64, 64, 64, -64, -64, -64, -64, 64, 64, 64, -64, -64, -64, 64, -64, -64, -64, -64, 64, 64, -64, -64, 64, 64, 64, -64, 64, 64, -64, -64, 64, 64, -64, -64, 64, -64, 64, 64, -64, -64, -64, -64, -64, 64, -64, 64, -64, -64, -64, -64, 64, 64, 64, 64, 64, 64, -64, 64, -64, -64, 64, 64, 64, -64, 64, 64, 64, -64, -64, -64, -64, -64, 64, -64, -64, -64, 64, 64, 64, 64, -64, 64, -64, 64, 64, -64, -64, 64, -64, -64, 64, -64, 64, 64, -64, 64, -64, -64, 64, -64, 64, -64, 64, -64, 64, 64, -64, 64, -64, 64, 64, 64, -64, 64, -64, -64, 64, 64, 64, 64, 64, -64, -64, -64, -64, 64, 64, -64, 64, 64, 64, 64, 64, 64, 64, 64, 64, 64, 64, -64, -64, 64, 64, 64, -64, -64, 64, -64, -64, -64, 64, -64, -64, -64, -64, 64, 64, -64, 64, 64, -64, 64, 64, -64, -64, -64, 64, 64, 64, -64, -64, 64, 64, -64, -64, 64, 64, 64, 64, -64, 64, -64, 64, 64, -64, -64, -64, -64, 64, 64, 64, 64, -64, 64, 64, 64, -64, 64, 64, -64, -64, 64, 64, 64, -64, 64, 64, 64, -64, 64, 64, 64, 64, -64, -64, -64, -64, 64, 64, 64, 64, 64, -64, -64, -64, 64, -64, 64, -64, 64, -64, -64, 64, 64, -64, 64, 64, -64, 64, 64, -64, 64, -64, 64, 64, -64, 64, 64, 64, -64, 64, -64, -64, -64, -64, 64, 64, 64, -64, -64, -64, -64, 64, 64, 64, -64, 64, 64, 64, 64, 64, -64, 64, 64, -64, 64, 64, 64, 64, -64, 64, 64, 64, 64, 64, -64, 64, 64, -64, -64, 64, 64, -64, -64, 64, 64, -64, 64, 64, -64, 64, -64, 64, -64, 64, -64, -64, 64, 64, 64, 64, 64, 64, 64, -64, -64, -64, -64, -64, -64, -64, 64, 64, -64, -64, 64, 64, -64, 64, 64, -64, 64, -64, 64, -64, 64, 64, 64, 64, -64, 64, -64, 64, -64, 64, 64, 64, 64, -64, -64, 64, -64, -64, 64, -64, 64, -64, 64, 64, 64, -64, 64, 64, 64, 64, -64, 64, -64, 64, 64, 64, -64, 64, -64, 64, 64, -64, 64, 64, 64, -64, 64, -64, -64, 64, 64, -64, -64, -64, -64, -64, -64, -64, -64, 64, 64, 64, -64, 64, -64, 64, 64, -64, 64, 64, -64, -64, -64, 64, -64, 64, 64, 64, -64, 64, 64, -64, -64, -64, -64, 64, 64, -64, -64, 64, 64, -64, 64, -64, -64, -64, -64, -64, -64, -64, 64, -64, -64, 64, -64, -64, 64, 64, 64, 64, -64, -64, 64, -64, -64, -64, -64, -64, -64, -64, -64, -64, 64, -64, 64, -64, -64, 64, -64, -64, -64, -64, 64, 64, -64, -64, 64, -64, -64, -64, 64, 64, 64, -64, 64, -64, 64, 64, -64, 64, 64, 64, -64, 64, -64, -64, 64, -64, 64, 64, -64, -64, -64, -64, -64, -64, 64, -64, -64, -64, 64, -64, -64, -64, -64, 64, -64, -64, -64, 64, -64, 64, 64, 64, -64, -64, 64, 64, -64, 64, -64, -64, -64, -64, -64, -64, -64, -64, -64, 64, 64, 64, 64, 64, 64, -64, 64, -64, -64, -64, 64, -64, -64, 64, 64, 64, -64, -64, 64, 64, -64, -64, 64, 64, -64, -64, 64, 64, -64, -64, -64, -64, -64, 64, -64, -64, 64, -64, -64, 64, 64, -64, 64, -64, -64, -64, 64, 64, 64, 64, 64, 64, 64, -64, -64, 64, -64, -64, -64, -64, 64, 64, -64, -64, 64, -64, 64, 64, -64, 64, -64, -64, 64, 64, 64, -64, -64, 64, -64, 64, -64, 64, -64, -64, 64, -64, -64, -64, 64, 64, -64, -64, 64, -64, -64, 64, 64, 64, -64, -64, -64, -64, -64, -64, 64, 64, 64, 64, 64, -64, 64, 64, 64, -64, 64, 64, -64, 64, -64, 64, -64, 64, -64, 64, 64, -64, 64, -64, 64, 64, -64, 64, 64, 64, 64, 64, 64, 64, -64, 64, 64, -64, 64, -64, 64, -64, 64, -64, 64, 64, -64, 64, 64, -64, 64, 64, 64, -64, 64, 64, 64, 64, 64, 64, 64, 64, 64, -64, 64, 64, 64, 64, -64, -64, 64, -64, -64, 64, 64, 64, 64, 64, 64, 64, -64, -64, 64, 64, 64, 64, 64, 64, 64, 64, 64, 64, -64, 64, -64, 64, 64, 64, 64, 64, -64, 64, -64, 64, 64, -64, -64, 64, -64, 64, 64, 64, 64, 64, 64, 64, 64, 64, 64, 64, 64, 64, -64, -64, 64, -64, -64, -64, 64, 64, 64, 64, 64, 64, 64, -64, 64, 64, 64, 64, 64, 64, -64, -64, -64, 64, 64, 64, 64, -64, 64, -64, -64, -64, 64, 64, -64, 64, 64, -64, 64, 64, 64, 64, 64, -64, 64, 64, 64, 64, 64, 64, 64, -64, -64, 64, -64, 64, 64, 64, -64, -64, 64, 64, 64, -64, 64, 64, 64, 64, 64, -64, 64, -64, -64, -64, 64, 64, 64, 64, -64, 64, 64, -64, 64, 64, 64, 64, -64, 64, -64, -64, 64, -64, 64, 64, 64, 64, 64, 64, 64, -64, -64, -64, 64, 64, 64, -64, 64, -64, -64, 64, 64, 64, 64, -64, 64, -64, 64, 64, 64, 64, -64, 64, 64, 64, 64, 64, 64, -64, -64, -64, -64, 64, 64, 64, 64, 64, 64, 64, -64, -64, 64, -64, 64, 64, 64, -64, 64, 64, -64, -64, -64, 64, 64, 64, 64, 64, 64, -64, 64, 64, 64, 64, 64, 64, 64, -64, -64, -64, 64, 64, 64, 64, 64, -64, -64, -64, -64, 64, 64, -64, 64, 64, 64, 64, -64, -64, 64, 64, 64, 64, 64, -64, 64, 64, 64, -64, 64, 64, 64, -64, 64, 64, -64, 64, 64, -64, 64, 64, 64, 64, 64, 64, -64, -64, 64, 64, 64, -64, 64, 64, 64, -64, -64, 64, -64, 64, 64, 64, -64, -64, -64, 64, -64, -64, 64, 64, 64, 64, 64, 64, 64, -64, -64, -64, 64, 64, 64, 64, 64, 64, -64, 64, -64, 64, 64, 64, 64, 64, -64, -64, 64, 64, 64, 64, -64, 64, 64, 64, 64, -64, 64, 64, 64, 64, 64, -64, -64, 64, 64, 64, -64, 64, 64, 64, -64, 64, -64, -64, 64, 64, -64, -64, 64, 64, 64, 64, 64, -64, -64, -64, -64, 64, 64, 64, 64, 64, -64, -64, -64, 64, -64, -64, 64, 64, 64, 64, -64, 64, 64, 64, 64, 64, 64, 64, 64, 64, -64, -64, -64, -64, -64, -64, -64, 64, -64, 64, 64, -64, 64, 64, -64, 64, 64, 64, 64, 64, -64, 64, -64, 64, 64, 64, -64, -64, 64, 64, 64, -64, -64, -64, -64, -64, -64, 64, -64, -64, -64, -64, -64, 64, 64, 64, -64, 64, -64, 64, -64, -64, 64, 64, 64, 64, -64, -64, -64, -64, -64, -64, -64, 64, -64, 64, -64, -64, 64, -64, -64, 64, -64, -64, 64, 64, 64, -64, -64, 64, 64, 64, 64, 64, -64, -64, -64, 64, -64, 64, 64, 64, 64, -64, 64, 64, 64, -64, -64, 64, -64, -64, 64, 64, 64, 64, -64, -64, 64, 64, 64, 64, 64, 64, 64, 64, 64, -64, -64, 64, 64, -64, 64, -64, -64, -64, 64, -64, -64, -64, 64, -64, 64, 64, 64, 64, 64, -64, 64, 64, 64, 64, 64, 64, -64, 64, -64, 64, -64, -64, 64, 64, 64, 64, 64, 64, 64, 64, 64, -64, 64, -64, 64, 64, -64, 64, 64, 64, 64, 64, 64, 64, -64, -64, 64, 64, 64, 64, 64, -64, -64, 64, -64, 64, -64, -64, -64, -64, 64, -64, -64, -64, -64, -64, -64, -64, -64, -64, -64, -64, -64, -64, -64, 64, -64, 64, 64, 64, -64, 64, 64, 64, -64, -64, -64, 64, 64, -64, 64, 64, -64, -64, -64, 64, 64, -64, -64, -64, 64, -64, 64, 64, 64, -64, -64, -64, 64, -64, 64, 64, -64, 64, -64, -64, 64, 64, 64, -64, 64, 64, 64, -64, 64, 64, -64, -64, -64, -64, 64, -64, -64, -64, -64, -64, 64, 64, 64, 64, 64, -64, -64, 64, 64, -64, -64, -64, -64, -64, 64, 64, -64, -64, -64, 64, -64, -64, -64, -64, 64, 64, 64, -64, 64, -64, -64, -64, 64, -64, 64, -64, -64, 64, 64, 64, 64, -64, -64, -64, -64, -64, -64, -64, -64, -64, -64, -64, -64, 64, 64, -64, -64, 64, -64, -64, -64, -64, -64, -64, 64, -64, 64, 64, -64, 64, -64, -64, 64, -64, -64, -64, -64, -64, -64, 64, 64, 64, -64, 64, -64, -64, 64, 64, -64, -64, -64, -64, -64, -64, -64, -64, -64, -64, 64, -64, -64, -64, -64, -64, -64, -64, -64, -64, 64, -64, -64, 64, 64, -64, 64, 64, 64, -64, 64, 64, -64, -64, -64, -64, 64, 64, 64, 64, 64, 64, 64, 64, 64, -64, 64, 64, 64, -64, 64, -64, -64, 64, 64, -64, -64, -64, 64, -64, -64, -64, -64, 64, -64, -64, -64, 64, 64, 64, 64, 64, 64, 64, 64, -64, -64, -64, -64, 64, 64, 64, -64, 64, -64, -64, -64, -64, -64, -64, -64, -64, 64, -64, 64, 64, 64, 64, 64, 64, 64, -64, 64, -64, -64, -64, -64, -64, -64, -64, -64, -64, -64, -64, 64, -64, -64, -64, -64, 64, -64, -64, -64, -64, 64, 64, -64, -64, -64, 64, -64, -64, -64, -64, -64, -64, -64, 64, 64, 64, 64, -64, 64, 64, 64, -64, -64, -64, -64, -64, -64, 64, -64, -64, 64, -64, -64, 64, -64, -64, -64, 64, -64, -64, -64, 64, -64, 64, 64, 64, 64, -64, 64, 64, 64, -64, -64, -64, -64, -64, -64, -64, -64, -64, 64, -64, 64, 64, 64, 64, -64, 64, 64, -64, 64, 64, 64, 64, 64, 64, 64, -64, -64, 64, -64, -64, -64, -64, -64, -64, -64, -64, 64, 64, 64, 64, -64, -64, -64, 64, 64, -64, -64, -64, 64, 64, 64, 64, 64, -64, 64, -64, -64, 64, -64, -64, -64, -64, -64, -64, -64, 64, 64, 64, -64, 64, -64, -64, 64, -64, -64, 64, 64, 64, 64, 64, 64, 64, -64, -64, -64, -64, -64, -64, -64, -64, -64, -64, 64, -64, 64, 64, -64, 64, -64, -64, 64, -64, -64, -64, -64, -64, 64, 64, -64, -64, -64, -64, -64, -64, -64, -64, -64, -64, -64, -64, -64, -64, 64, -64, -64, 64, -64, 64, 64, -64, -64, -64, -64, -64, -64, 64, 64, 64, 64, -64, -64, -64, -64, -64, -64, -64, -64, 64, -64, -64, 64, 64, -64, 64, -64, -64, -64, 64, -64, -64, -64, -64, -64, -64, -64, 64, 64, 64, 64, -64, -64, -64, -64, -64, 64, -64, -64, -64, 64, 64, -64, -64, -64, 64, -64, 64, -64, -64, -64, -64, -64, 64, 64, 64, -64, -64, -64, -64, -64, -64, -64, -64, -64, -64, -64, -64, -64, -64, -64, -64, -64, 64, 64, 64, 64, -64, -64, 64, 64, -64, -64, -64, -64, -64, -64, -64, -64, -64, -64, -64, -64, -64, -64, -64, -64, 64, -64, -64, 64, 64, -64, 64, 64, 64, -64, -64, 64, -64, -64, -64, 64, 64, 64, 64, -64, -64, -64, -64, -64, -64, -64, -64, -64, 64, 64, -64, 64, -64, -64, 64, 64, -64, -64, 64, -64, 64, 64, -64, -64, -64, -64, -64, -64, -64, -64, 64, -64, -64, -64, -64, -64, 64, -64, 64, 64, -64, 64, 64, 64, -64, -64, -64, 64, -64, 64, 64, -64, -64, 64, -64, -64, -64, -64, -64, -64, -64, -64, -64, -64, 64, 64, 64, 64, -64, -64, 64, 64, -64, -64, -64, -64, 64, 64, 64, 64, -64, -64, 64, -64, -64, -64, -64, -64, -64, -64, -64, -64, -64, 64, 64, 64, -64, -64, 64, -64, -64, 64, -64, 64, -64, -64, 64, -64, 64, -64, -64, -64, -64, -64, -64, 64, 64, 64, -64, -64, -64, -64, 64, 64, -64, 64, -64, -64, 64, -64, 64, 64, 64, 64, 64, 64, 64, 64, -64, -64, -64, -64, -64, 64, 64, 64, 64, 64, 64, -64, 64, -64, 64, -64, -64, 64, -64, 64, 64, 64, 64, -64, 64, -64, 64, 64, 64, 64, -64, -64, -64, 64, 64, -64, 64, 64, -64, -64, 64, -64, -64, 64, 64, 64, -64, 64, -64, -64, -64, -64, 64, 64, 64, -64, -64, 64, 64, 64, 64, 64, 64, -64, 64, -64, 64, 64, 64, -64, -64, -64, 64, 64, -64, -64, 64, -64, -64, -64, -64, 64, -64, 64, 64, -64, 64, 64, 64, 64, 64, -64, -64, -64, 64, -64, -64, 64, -64, -64, -64, -64, 64, 64, -64, 64, 64, -64, -64, -64, -64, 64, 64, -64, -64, 64, 64, 64, -64, -64, 64, 64, 64, -64, 64, -64, -64, 64, -64, 64, -64, 64, -64, 64, 64, -64, -64, -64, -64, -64, 64, 64, -64, -64, -64, -64, 64, -64, -64, 64, -64, -64, 64, -64, -64, 64, -64, -64, -64, 64, 64, 64, 64, 64, -64, -64, 64, 64, 64, -64, 64, 64, 64, 64, 64, -64, -64, 64, -64, -64, -64, -64, -64, 64, -64, -64, -64, 64, 64, 64, 64, 64, 64, -64, 64, 64, 64, 64, 64, 64, 64, 64, -64, -64, 64, 64, -64, -64, 64, -64, -64, 64, 64, -64, 64, -64, 64, 64, 64, 64, 64, 64, 64, 64, 64, 64, 64, 64, 64, 64, 64, 64, 64, 64, 64, 64, 64, 64, -64, 64, 64, -64, -64, 64, 64, 64, 64, 64, 64, 64, 64, -64, 64, 64, -64, 64, 64, 64, -64, -64, 64, 64, 64, 64, 64, 64, -64, 64, 64, -64, -64, 64, 64, 64, -64, 64, 64, 64, -64, -64, -64, 64, 64, 64, 64, 64, 64, -64, 64, 64, 64, 64, 64, -64, -64, 64, 64, 64, 64, -64, 64, -64, 64, -64, 64, 64, -64, -64, 64, 64, -64, -64, 64, 64, 64, -64, 64, 64, 64, 64, 64, -64, -64, 64, -64, -64, 64, -64, 64, 64, -64, 64, -64, 64, 64, 64, 64, -64, 64, 64, 64, 64, -64, 64, -64, 64, 64, 64, -64, -64, 64, 64, 64, 64, -64, -64, 64, -64, 64, 64, 64, 64, 64, 64, 64, 64, 64, 64, -64, -64, 64, 64, 64, 64, -64, 64, 64, -64, 64, 64, 64, 64, -64, 64, -64, -64, 64, 64, 64, 64, 64, 64, -64, 64, 64, 64, 64, 64, 64, 64, -64, 64, 64, 64, 64, 64, 64, 64, 64, 64, 64, -64, 64, -64, 64, 64, 64, -64, -64, 64, 64, 64, -64, 64, 64, 64, 64, 64, -64, 64, 64, 64, 64, 64, 64, -64, 64, -64, 64, 64, -64, -64, 64, 64, 64, 64, 64, 64, 64, 64, -64, -64, 64, 64, 64, -64, 64, 64, 64, 64, 64, 64, -64, 64, 64, 64, -64, 64, -64, -64, 64, 64, 64, 64, -64, -64, 64, 64, -64, 64, 64, 64, -64, 64, 64, 64, 64, 64, 64, 64, -64, 64, -64, 64, -64, 64, 64, -64, 64, 64, 64, -64, -64, -64, 64, -64, 64, 64, 64, 64, 64, -64, -64, 64, 64, 64, -64, 64, -64, -64, 64, -64, 64, 64, 64, 64, 64, 64, -64, -64, -64, -64, -64, 64, 64, 64, -64, 64, 64, 64, 64, 64, 64, 64, 64, 64, 64, -64, 64, -64, -64, 64, 64, -64, 64, 64, 64, 64, -64, -64, -64, 64, 64, -64, -64, 64, 64, 64, 64, 64, 64, 64, -64, 64, 64, 64, -64, 64, -64, -64, 64, -64, 64, 64, 64, -64, 64, 64, -64, -64, 64, 64, -64, 64, 64, 64, 64, 64, 64, 64, 64, -64, -64, -64, 64, 64, 64, -64, 64, 64, -64, 64, 64, 64, -64, -64, 64, -64, 64, -64, 64, 64, 64, 64, -64, -64, -64, 64, -64, 64, -64, -64, -64, 64, 64, -64, 64, 64, 64, 64, 64, 64, 64, 64, 64, 64, 64, 64, 64, 64, 64, 64, -64, -64, -64, 64, 64, 64, 64, 64, -64, -64, -64, -64, -64, 64, 64, 64, 64, 64, 64, 64, 64, 64, 64, 64, 64, 64, 64, 64, 64, 64, -64, -64, -64, -64, 64, -64, -64, -64, -64, 64, 64, 64, 64, 64, 64, 64, 64, 64, 64, 64, 64, 64, 64, 64, 64, 64, 64, 64, -64, -64, -64, -64, -64, 64, -64, -64, 64, -64, 64, -64, 64, 64, -64, 64, 64, 64, -64, 64, 64, 64, 64, 64, 64, 64, 64, -64, -64, -64, -64, 64, 64, 64, 64, 64, -64, 64, 64, -64, -64, -64, -64, -64, 64, -64, -64, 64, 64, 64, 64, 64, 64, 64, 64, 64, -64, -64, -64, 64, -64, -64, -64, -64, 64, 64, -64, -64, -64, -64, -64, -64, -64, -64, -64, -64, -64, -64, 64, -64, 64, -64, 64, 64, -64, -64, -64, -64, 64, 64, 64, -64, 64, -64, -64, 64, -64, 64, -64, 64, -64, 64, -64, 64, 64, 64, -64, 64, 64, -64, -64, -64, 64, 64, -64, -64, 64, -64, -64, 64, -64, 64, -64, 64, -64, -64, -64, -64, -64, -64, 64, 64, -64, -64, -64, -64, -64, 64, 64, -64, -64, -64, 64, 64, 64, 64, 64, -64, -64, 64, -64, 64, 64, 64, 64, 64, 64, 64, 64, -64, 64, -64, 64, -64, 64, -64, -64, 64, 64, -64, 64, 64, 64, 64, 64, 64, 64, -64, 64, -64, -64, 64, -64, -64, -64, -64, 64, -64, 64, -64, -64, -64, -64, -64, -64, -64, -64, 64, 64, -64, 64, 64, -64, 64, 64, 64, -64, -64, 64, -64, -64, -64, -64, -64, -64, -64, -64, -64, -64, -64, -64, -64, 64, 64, 64, 64, 64, 64, 64, -64, 64, -64, 64, -64, 64, -64, -64, 64, 64, -64, 64, -64, -64, -64, -64, -64, -64, -64, -64, -64, -64, 64, 64, 64, 64, 64, 64, -64, -64, 64, -64, 64, 64, 64, -64, 64, 64, 64, 64, -64, -64, 64, -64, -64, -64, -64, -64, 64, 64, -64, 64, 64, 64, 64, -64, -64, -64, 64, 64, -64, -64, -64, 64, 64, 64, 64, 64, 64, 64, -64, -64, 64, 64, 64, 64, -64, -64, -64, -64, 64, 64, 64, 64, -64, 64, -64, 64, 64, 64, 64, 64, 64, 64, 64, -64, -64, -64, -64, -64, 64, -64, 64, -64, -64, -64, -64, -64, -64, 64, 64, 64, 64, 64, 64, -64, 64, 64, 64, 64, 64, 64, -64, -64, 64, -64, 64, -64, -64, 64, -64, -64, -64, -64, -64, -64, 64, 64, 64, 64, 64, 64, 64, -64, 64, 64, 64, 64, 64, 64, -64, 64, -64, 64, -64, -64, -64, -64, 64, -64, -64, -64, -64, -64, 64, -64, 64, 64, 64, 64, 64, -64, 64, -64, 64, 64, 64, 64, 64, 64, 64, -64, -64, -64, -64, 64, 64, -64, -64, -64, -64, -64, -64, 64, 64, 64, -64, 64, -64, -64, -64, -64, 64, 64, 64, 64, 64, 64, -64, -64, -64, -64, -64, -64, -64, -64, -64, -64, -64, -64, 64, -64, 64, 64, -64, 64, 64, -64, 64, -64, 64, 64, 64, 64, 64, 64, -64, 64, 64, -64, 64, 64, -64, 64, -64, -64, -64, 64, -64, -64, 64, 64, -64, 64, -64, 64, -64, 64, -64, 64, 64, 64, 64, 64, 64, 64, 64, 64, 64, 64, 64, 64, -64, 64, 64, -64, 64, -64, -64, -64, -64, -64, 64, -64, -64, -64, 64, -64, -64, 64, 64, 64, 64, 64, 64, 64, 64, -64, 64, 64, -64, 64, 64, -64, 64, -64, -64, -64, 64, -64, 64, -64, -64, -64, -64, -64, -64, -64, -64, 64, 64, 64, 64, 64, 64, 64, 64, -64, 64, -64, 64, -64, -64, -64, -64, -64, 64, -64, 64, 64, -64, -64, -64, -64, -64, -64, -64, -64, 64, 64, 64, -64, -64, -64, 64, -64, -64, -64, -64, -64, -64, -64, -64, 64, 64, -64, -64, 64, -64, -64, -64, -64, -64, -64, -64, -64, -64, 64, -64, -64, 64, -64, 64, 64, 64, -64, -64, -64, -64, -64, -64, -64, -64, 64, 64, 64, -64, -64, -64, -64, -64, -64, -64, -64, -64, -64, -64, -64, -64, 64, 64, 64, -64, 64, 64, -64, -64, -64, -64, 64, -64, 64, -64, -64, 64, -64, -64, -64, -64, -64, -64, -64, -64, -64, -64, -64, -64, -64, -64, -64, -64, 64, 64, 64, -64, -64, -64, -64, 64, 64, -64, 64, 64, -64, -64, -64, -64, -64, -64, -64, -64, -64, -64, -64, -64, -64, -64, 64, -64, -64, 64, -64, -64, -64, -64, -64, -64, 64, 64, 64, 64, 64, -64, -64, -64, -64, -64, -64, -64, -64, -64, -64, -64, -64, 64, 64, -64, 64, 64, 64, 64, -64, -64, 64, 64, 64, -64, 64, 64, -64, -64, -64, 64, 64, -64, 64, 64, -64, -64, -64, -64, -64, 64, -64, 64, -64, 64, 64, 64, 64, -64, 64, 64, -64, 64, 64, 64, -64, -64, -64, -64, 64, -64, 64, 64, -64, 64, -64, 64, -64, 64, 64, -64, -64, -64, 64, 64, 64, -64, -64, -64, 64, -64, 64, -64, -64, 64, -64, 64, -64, 64, 64, 64, 64, -64, 64, -64, 64, 64, 64, -64, 64, 64, 64, 64, 64, 64, 64, 64, -64, 64, 64, 64, 64, 64, 64, 64, 64, 64, 64, -64, 64, -64, -64, -64, 64, 64, 64, 64, 64, 64, 64, -64, 64, 64, 64, 64, 64, 64, 64, 64, 64, 64, 64, 64, 64, 64, 64, 64, 64, 64, 64, 64, 64, 64, 64, 64, 64, 64, 64, 64, 64, -64, -64, 64, -64, -64, 64, 64, -64, 64, 64, 64, 64, 64, 64, 64, 64, 64, 64, 64, 64, 64, 64, 64, -64, 64, 64, 64, 64, 64, 64, -64, -64, -64, -64, -64, 64, -64, 64, -64, 64, 64, -64, -64, -64, 64, -64, 64, 64, -64, -64, 64, 64, 64, -64, 64, 64, 64, -64, -64, 64, -64, -64, 64, 64, -64, 64, -64, -64, -64, -64, 64, 64, -64, -64, 64, 64, 64, -64, 64, -64, -64, 64, 64, -64, -64, -64, -64, -64, -64, -64, -64, 64, 64, 64, 64, 64, 64, 64, -64, -64, -64, 64, 64, 64, 64, 64, -64, 64, 64, 64, -64, 64, 64, -64, 64, 64, 64, -64, 64, 64, -64, 64, 64, -64, -64, 64, -64, 64, 64, -64, 64, 64, -64, -64, -64, 64, -64, -64, -64, -64, 64, -64, 64, -64, 64, -64, -64, -64, -64, -64, -64, -64, -64, -64, -64, 64, -64, 64, 64, 64, -64, -64, 64, 64, -64, 64, 64, 64, 64, -64, -64, -64, 64, -64, -64, -64, 64, 64, 64, -64, 64, 64, 64, 64, -64, 64, 64, -64, -64, -64, -64, 64, 64, 64, 64, 64, -64, 64, -64, 64, 64, -64, 64, -64, 64, -64, -64, -64, -64, 64, 64, 64, 64, 64, -64, 64, -64, -64, -64, 64, 64, 64, -64, 64, -64, -64, 64, 64, -64, -64, 64, 64, 64, -64, 64, -64, 64, 64, 64, 64, -64, -64, 64, 64, 64, 64, -64, 64, 64, 64, 64, -64, -64, -64, 64, 64, -64, -64, 64, 64, 64, -64, -64, 64, 64, 64, 64, -64, -64, -64, -64, 64, 64, 64, 64, -64, -64, 64, -64, 64, -64, 64, 64, -64, 64, 64, 64, 64, 64, 64, 64, 64, 64, 64, 64, -64, -64, -64, -64, 64, 64, 64, -64, 64, 64, 64, 64, 64, 64, -64, -64, -64, 64, 64, 64, 64, 64, 64, 64, 64, 64, -64, 64, -64, -64, 64, 64, 64, 64, -64, -64, 64, 64, 64, 64, 64, 64, 64, -64, -64, 64, -64, 64, 64, 64, 64, 64, -64, -64, -64, -64, -64, -64, -64, -64, -64, 64, -64, -64, 64, 64, 64, 64, 64, 64, 64, -64, -64, -64, 64, 64, -64, 64, 64, -64, -64, -64, -64, -64, -64, -64, -64, -64, -64, -64, -64, -64, -64, 64, 64, 64, 64, 64, -64, -64, -64, -64, 64, -64, -64, 64, 64, -64, -64, -64, -64, -64, -64, -64, -64, -64, -64, -64, -64, -64, -64, -64, 64, -64, 64, 64, 64, 64, 64, -64, 64, -64, -64, 64, 64, 64, -64, -64, -64, -64, -64, -64, -64, -64, -64, -64, -64, -64, 64, 64, -64, 64, 64, 64, 64, -64, 64, 64, 64, 64, 64, 64, 64, 64, -64, -64, -64, -64, -64, -64, -64, -64, -64, -64, 64, 64, 64, 64, -64, 64, -64, -64, -64, 64, -64, -64, 64, -64, 64, 64, 64, 64, 64, 64, 64, 64, -64, -64, -64, -64, -64, 64, 64, 64, 64, 64, 64, 64, 64, 64, -64, -64, 64, 64, 64, 64, 64, 64, 64, 64, 64, 64, 64, 64, -64, -64, -64, -64, -64, 64, 64, 64, 64, 64, 64, 64, 64, -64, 64, 64, -64, 64, -64, 64, 64, 64, 64, 64, 64, 64, -64, -64, -64, -64, -64, -64, 64, 64, 64, 64, 64, 64, 64, 64, 64, 64, 64, 64, 64, -64, 64, 64, 64, 64, 64, 64, 64, 64, -64, -64, -64, -64, -64, 64, 64, 64, 64, 64, -64, 64, 64, 64, 64, 64, 64, -64, 64, -64, 64, 64, 64, 64, 64, 64, 64, -64, -64, -64, -64, 64, -64, -64, -64, 64, -64, -64, 64, 64, 64, 64, 64, 64, 64, -64, 64, 64, 64, 64, 64, 64, 64, 64, 64, 64, 64, -64, 64, 64, 64, -64, -64, -64, 64, 64, 64, 64, 64, 64, 64, 64, 64, -64, -64, 64, 64, 64, 64, 64, 64, 64, 64, 64, -64, -64, -64, 64, -64, -64, -64, -64, -64, 64, 64, -64, 64, 64, 64, 64, 64, -64, 64, -64, -64, 64, 64, 64, 64, 64, 64, 64, 64, 64, -64, 64, -64, -64, -64, -64, -64, -64, -64, 64, 64, 64, 64, -64, -64, 64, -64, -64, -64, 64, 64, 64, 64, 64, 64, 64, 64, 64, -64, 64, -64, -64, -64, -64, -64, -64, -64, -64, 64, -64, -64, -64, -64, 64, -64, -64, 64, 64, 64, 64, 64, 64, -64, 64, -64, -64, 64, 64, 64, 64, -64, -64, -64, -64, -64, -64, -64, -64, 64, -64, 64, -64, -64, -64, 64, 64, -64, 64, -64, -64, -64, -64, 64, 64, -64, -64, -64, 64, -64, -64, -64, -64, -64, -64, -64, 64, 64, -64, 64, -64, 64, 64, 64, -64, -64, 64, -64, -64, -64, -64, -64, 64, -64, 64, -64, 64, -64, 64, 64, -64, -64, 64, -64, 64, 64, 64, -64, -64, -64, -64, 64, 64, 64, -64, -64, 64, -64, 64, 64, -64, 64, -64, -64, 64, -64, -64, -64, 64, -64, -64, 64, -64, 64, -64, -64, -64, -64, -64, -64, -64, -64, 64, 64, 64, -64, -64, 64, 64, -64, 64, 64, 64, -64, -64, 64, 64, -64, -64, 64, 64, 64, 64, -64, 64, -64, -64, 64, 64, -64, 64, 64, -64, 64, -64, 64, 64, -64, 64, 64, 64, 64, 64, -64, 64, 64, -64, 64, -64, -64, -64, -64, -64, 64, 64, 64, -64, 64, -64, -64, 64, 64, 64, -64, 64, 64, 64, 64, 64, 64, 64, 64, -64, -64, 64, 64, 64, -64, 64, 64, 64, 64, 64, 64, 64, 64, 64, -64, 64, -64, 64, 64, 64, 64, 64, 64, 64, 64, -64, -64, -64, -64, -64, -64, 64, -64, 64, -64, -64, 64, 64, -64, -64, -64, 64, 64, 64, 64, -64, 64, 64, 64, 64, 64, 64, 64, -64, 64, -64, -64, 64, -64, -64, -64, 64, -64, 64, 64, 64, -64, 64, 64, 64, 64, -64, 64, -64, -64, -64, -64, 64, -64, 64, -64, -64, 64, 64, -64, -64, -64, -64, 64, 64, -64, 64, 64, -64, -64, -64, -64, -64, -64, -64, 64, -64, 64, -64, -64, 64, -64, -64, -64, -64, 64, -64, -64, 64, -64, -64, -64, -64, -64, 64, -64, 64, 64, -64, 64, -64, -64, -64, -64, -64, -64, -64, -64, -64, -64, -64, 64, 64, -64, -64, -64, -64, -64, -64, -64, -64, -64, 64, 64, 64, 64, -64, 64, 64, 64, 64, -64, 64, 64, -64, 64, -64, -64, -64, 64, -64, 64, 64, -64, -64, -64, -64, 64, -64, 64, 64, 64, -64, 64, 64, 64, -64, -64, 64, -64, -64, -64, 64, 64, -64, -64, -64, -64, -64, -64, -64, 64, 64, 64, 64, 64, 64, -64, 64, -64, 64, -64, 64, 64, 64, -64, -64, 64, -64, -64, 64, 64, -64, -64, 64, -64, -64, -64, -64, -64, -64, -64, 64, 64, -64, 64, 64, -64, -64, 64, 64, -64, -64, 64, -64, -64, 64, -64, 64, -64, 64, -64, -64, -64, -64, 64, 64, 64, -64, 64, -64, 64, -64, -64, 64, 64, 64, -64, 64, -64, 64, -64, -64, -64, -64, 64, -64, 64, -64, 64, -64, -64, -64, -64, -64, -64, -64, 64, 64, 64, 64, 64, -64, 64, -64, 64, -64, -64, -64, -64, -64, -64, 64, -64, 64, -64, -64, 64, -64, -64, -64, 64, -64, -64, -64, 64, -64, 64, 64, -64, -64, -64, -64, 64, 64, -64, -64, -64, 64, -64, -64, -64, -64, -64, -64, -64, -64, 64, -64, -64, -64, -64, -64, -64, 64, 64, 64, 64, -64, 64, 64, -64, 64, -64, -64, -64, -64, 64, 64, -64, -64, -64, 64, 64, 64, -64, -64, -64, -64, 64, -64, -64, -64, -64, 64, 64, -64, 64, -64, 64, -64, -64, -64, -64, -64, -64, 64, -64, 64, 64, 64, -64, -64, -64, -64, 64, -64, -64, -64, -64, -64, 64, 64, -64, -64, -64, 64, 64, 64, -64, -64, -64, -64, -64, -64, -64, -64, -64, 64, -64, -64, -64, -64, 64, -64, 64, -64, 64, -64, -64, 64, -64, -64, 64, -64, -64, -64, -64, -64, -64, -64, -64, -64, -64, -64, 64, 64, -64, 64, -64, -64, 64, -64, 64, -64, -64, -64, 64, -64, 64, -64, 64, -64, -64, 64, 64, -64, -64, -64, -64, -64, -64, 64, -64, -64, -64, 64, -64, 64, 64, -64, -64, -64, -64, -64, -64, -64, 64, 64, -64, -64, -64, -64, 64, 64, 64, 64, 64, -64, 64, 64, -64, -64, -64, -64, -64, -64, 64, -64, -64, -64, 64, -64, -64, -64, 64, 64, 64, -64, 64, 64, 64, 64, -64, 64, 64, 64, -64, -64, -64, 64, 64, -64, -64, -64, 64, 64, -64, -64, -64, 64, -64, -64, 64, 64, 64, -64, 64, -64, 64, 64, -64, 64, 64, 64, -64, -64, 64, 64, -64, -64, -64, -64, 64, 64, -64, -64, 64, -64, 64, 64, 64, -64, 64, 64, 64, 64, 64, 64, -64, -64, 64, 64, 64, 64, -64, 64, 64, 64, -64, -64, -64, 64, -64, -64, -64, -64, 64, -64, 64, 64, 64, 64, 64, -64, 64, -64, -64, 64, 64, -64, -64, 64, -64, 64, -64, -64, -64, 64, 64, 64, -64, -64, -64, -64, -64, -64, -64, -64, -64, -64, 64, -64, -64, -64, -64, -64, -64, -64, -64, -64, -64, 64, 64, -64, -64, -64, 64, -64, 64, -64, 64, 64, 64, 64, 64, 64, -64, -64, 64, -64, 64, -64, -64, -64, -64, -64, -64, 64, -64, -64, 64, -64, -64, -64, -64, -64, -64, -64, -64, 64, -64, 64, 64, -64, 64, 64, -64, 64, 64, 64, -64, -64, 64, 64, 64, -64, -64, -64, -64, 64, 64, 64, 64, -64, 64, -64, -64, -64, -64, 64, 64, 64, -64, 64, 64, 64, -64, 64, 64, -64, 64, -64, -64, 64, -64, -64, -64, -64, 64, 64, 64, 64, -64, -64, -64, 64, 64, 64, 64, 64, -64, -64, 64, -64, -64, 64, 64, -64, -64, 64, -64, -64, -64, 64, -64, 64, -64, -64, 64, 64, 64, -64, 64, 64, 64, 64, -64, 64, 64, -64, 64, 64, 64, -64, 64, -64, -64, -64, 64, -64, -64, 64, -64, -64, 64, -64, 64, 64, -64, -64, -64, 64, 64, 64, 64, 64, 64, 64, 64, -64, -64, -64, -64, -64, 64, 64, 64, -64, 64, -64, -64, -64, 64, 64, 64, -64, -64, 64, -64, 64, 64, -64, -64, 64, -64, 64, 64, -64, -64, -64, 64, 64, -64, 64, 64, 64, 64, -64, 64, 64, 64, -64, 64, -64, 64, -64, -64, -64, 64, -64, 64, 64, -64, -64, 64, -64, -64, 64, -64, -64, -64, 64, 64, 64, 64, 64, 64, 64, -64, -64, -64, -64, -64, -64, -64, -64, 64, 64, 64, 64, -64, -64, -64, -64, -64, -64, -64, -64, 64, 64, 64, -64, 64, -64, -64, 64, 64, -64, -64, -64, -64, -64, -64, -64, 64, 64, -64, 64, 64, 64, -64, -64, -64, 64, -64, 64, 64, 64, 64, -64, -64, -64, -64, -64, 64, -64, -64, -64, -64, -64, -64, -64, 64, 64, 64, -64, 64, -64, 64, -64, -64, -64, 64, 64, 64, 64, 64, -64, -64, -64, -64, -64, -64, -64, -64, -64, -64, -64, -64, -64, -64, -64, 64, -64, 64, 64, 64, -64, -64, 64, 64, 64, 64, 64, -64, -64, -64, 64, -64, -64, -64, -64, -64, -64, 64, -64, -64, -64, -64, -64, 64, -64, -64, -64, 64, 64, 64, 64, 64, 64, -64, 64, -64, 64, -64, -64, -64, 64, -64, 64, -64, 64, -64, -64, -64, -64, -64, -64, -64, -64, -64, 64, 64, -64, 64, 64, -64, -64, -64, -64, -64, -64, -64, 64, 64, 64, 64, 64, -64, 64, -64, -64, -64, -64, -64, -64, -64, -64, 64, -64, -64, -64, 64, 64, 64, -64, -64, 64, 64, 64, 64, 64, 64, 64, 64, 64, -64, 64, 64, -64, -64, -64, -64, -64, -64, -64, 64, 64, -64, 64, 64, 64, 64, -64, 64, 64, -64, -64, 64, 64, 64, -64, -64, 64, 64, 64, 64, 64, -64, -64, -64, -64, -64, -64, 64, -64, -64, -64, 64, 64, -64, -64, 64, 64, -64, 64, -64, -64, -64, -64, -64, -64, 64, 64, 64, -64, 64, -64, -64, -64, -64, 64, 64, -64, 64, -64, -64, -64, -64, -64, -64, 64, -64, -64, -64, -64, -64, -64, -64, -64, -64, -64, 64, 64, 64, -64, 64, -64, 64, 64, 64, 64, 64, -64, 64, 64, 64, -64, -64, -64, -64, -64, -64, -64, -64, -64, -64, -64, -64, -64, 64, 64, 64, -64, -64, -64, -64, -64, -64, 64, -64, -64, 64, 64, -64, -64, 64, -64, -64, 64, -64, 64, -64, -64, -64, -64, -64, 64, 64, 64, 64, -64, -64, -64, 64, 64, -64, -64, 64, -64, 64, 64, -64, -64, 64, 64, 64, -64, -64, -64, -64, -64, -64, -64, -64, -64, 64, -64, -64, -64, 64, -64, 64, 64, -64, 64, 64, -64, 64, 64, 64, 64, -64, -64, -64, -64, -64, -64, -64, -64, -64, -64, -64, -64, 64, 64, 64, 64, -64, -64, -64, -64, 64, 64, 64, 64, 64, 64, 64, 64, 64, 64, 64, 64, -64, -64, -64, -64, -64, -64, -64, -64, 64, 64, 64, 64, -64, 64, 64, -64, -64, 64, 64, -64, -64, -64, 64, 64, 64, -64, 64, 64, -64, -64, -64, -64, -64, -64, -64, -64, -64, 64, 64, 64, -64, -64, 64, -64, -64, 64, 64, 64, -64, -64, -64, 64, 64, -64, -64, -64, -64, -64, -64, -64, -64, 64, -64, 64, 64, 64, 64, 64, -64, -64, -64, 64, 64, -64, 64, -64, -64, -64, -64, -64, -64, -64, -64, -64, -64, -64, -64, -64, -64, 64, 64, 64, 64, 64, 64, -64, 64, 64, 64, -64, -64, 64, -64, 64, 64, 64, -64, -64, -64, 64, 64, -64, -64, -64, 64, -64, 64, -64, 64, -64, 64, 64, 64, -64, -64, 64, -64, 64, -64, -64, -64, 64, -64, 64, 64, 64, -64, -64, 64, 64, -64, -64, 64, 64, -64, -64, -64, -64, 64, -64, 64, -64, -64, 64, 64, -64, -64, -64, -64, 64, 64, 64, 64, -64, -64, 64, -64, 64, 64, -64, -64, -64, 64, 64, -64, 64, -64, -64, -64, 64, 64, -64, 64, -64, -64, -64, -64, -64, 64, 64, 64, -64, 64, 64, 64, 64, 64, 64, -64, -64, -64, 64, -64, 64, -64, 64, 64, -64, 64, -64, -64, -64, -64, -64, 64, -64, -64, -64, -64, -64, 64, -64, 64, -64, -64, 64, -64, -64, -64, -64, 64, 64, 64, -64, -64, -64, 64, 64, -64, 64, -64, -64, -64, 64, -64, -64, 64, 64, 64, 64, -64, 64, -64, -64, 64, -64, -64, 64, 64, -64, 64, -64, -64, -64, -64, 64, 64, 64, -64, 64, -64, -64, 64, 64, -64, 64, 64, 64, 64, 64, -64, -64, -64, -64, -64, 64, -64, -64, -64, -64, -64, 64, 64, 64, -64, 64, -64, -64, 64, 64, 64, -64, -64, 64, 64, 64, 64, 64, -64, 64, 64, -64, -64, 64, 64, 64, 64, 64, -64, 64, -64, -64, 64, 64, -64, 64, 64, 64, 64, 64, 64, 64, 64, 64, 64, 64, 64, 64, 64, 64, -64, -64, -64, 64, -64, -64, 64, -64, 64, -64, -64, -64, -64, -64, -64, 64, -64, 64, 64, 64, 64, 64, 64, 64, 64, 64, 64, 64, 64, 64, -64, -64, 64, 64, 64, 64, 64, -64, -64, -64, -64, 64, -64, 64, 64, 64, 64, 64, 64, 64, -64, 64, 64, 64, -64, 64, 64, 64, -64, -64, -64, 64, 64, 64, -64, 64, 64, -64, -64, 64, 64, -64, 64, 64, 64, 64, 64, 64, 64, 64, 64, 64, 64, -64, -64, 64, 64, 64, 64, 64, 64, 64, 64, 64, 64, -64, 64, 64, -64, 64, 64, 64, 64, 64, 64, -64, 64, 64, 64, 64, 64, -64, 64, 64, 64, 64, 64, 64, 64, 64, 64, 64, 64, 64, 64, -64, -64, -64, 64, 64, 64, 64, 64, 64, 64, 64, 64, 64, 64, -64, 64, 64, 64, -64, -64, 64, 64, 64, 64, 64, 64, -64, -64, -64, -64, 64, 64, 64, 64, 64, -64, 64, 64, -64, -64, -64, 64, -64, -64, 64, -64, -64, -64, 64, 64, 64, 64, 64, 64, 64, 64, 64, 64, 64, 64, 64, 64, 64, -64, -64, -64, -64, -64, -64, -64, -64, 64, 64, -64, -64, 64, -64, 64, -64, 64, 64, 64, 64, 64, 64, -64, 64, 64, -64, 64, 64, 64, -64, -64, 64, -64, 64, 64, -64, -64, -64, -64, 64, 64, -64, -64, 64, 64, -64, -64, 64, -64, 64, 64, -64, 64, 64, 64, 64, -64, -64, -64, 64, 64, 64, 64, 64, -64, 64, -64, 64, -64, -64, 64, -64, 64, -64, 64, -64, -64, 64, 64, 64, -64, -64, -64, 64, 64, -64, 64, 64, 64, 64, 64, 64, 64, 64, 64, 64, 64, 64, 64, 64, 64, 64, -64, 64, -64, 64, 64, -64, -64, -64, 64, 64, -64, 64, 64, 64, 64, 64, 64, -64, 64, 64, 64, 64, 64, -64, 64, 64, 64, -64, -64, 64, 64, 64, 64, -64, 64, 64, 64, -64, 64, 64, 64, 64, 64, 64, 64, 64, 64, 64, 64, 64, 64, -64, -64, -64, 64, 64, -64, -64, 64, 64, 64, 64, 64, 64, 64, 64, 64, 64, 64, 64, 64, 64, -64, -64, 64, 64, 64, 64, -64, 64, 64, 64, -64, 64, -64, -64, -64, -64, -64, -64, 64, 64, 64, 64, 64, 64, 64, 64, -64, -64, 64, -64, 64, 64, 64, 64, 64, 64, 64, 64, 64, 64, -64, 64, -64, 64, 64, -64, 64, 64, 64, 64, 64, 64, 64, 64, 64, 64, 64, 64, 64, 64, 64, 64, 64, 64, 64, 64, 64, 64, 64, -64, 64, -64, 64, -64, 64, 64, 64, 64, 64, 64, 64, -64, -64, 64, 64, 64, 64, 64, 64, 64, 64, 64, 64, 64, 64, -64, -64, 64, -64, -64, 64, 64, 64, 64, 64, 64, 64, 64, 64, -64, 64, 64, 64, 64, 64, 64, -64, 64, 64, 64, 64, 64, 64, -64, -64, -64, -64, -64, 64, -64, 64, 64, 64, 64, 64, -64, -64, 64, -64, 64, 64, -64, -64, 64, 64, -64, 64, 64, 64, 64, 64, 64, 64, 64, 64, 64, -64, -64, -64, -64, -64, -64, -64, -64, -64, -64, 64, -64, -64, 64, 64, -64, -64, -64, 64, 64, 64, 64, -64, 64, 64, -64, -64, 64, -64, -64, -64, -64, -64, -64, -64, -64, -64, -64, -64, -64, -64, 64, 64, 64, -64, -64, -64, -64, 64, 64, 64, -64, -64, 64, -64, -64, 64, 64, -64, -64, -64, -64, -64, -64, -64, -64, -64, -64, -64, -64, -64, -64, 64, 64, -64, 64, -64, 64, 64, 64, -64, 64, 64, -64, 64, 64, 64, 64, -64, -64, -64, -64, -64, -64, -64, 64, -64, -64, -64, -64, 64, -64, -64, 64, 64, 64, 64, 64, 64, -64, -64, 64, -64, 64, 64, -64, 64, 64, 64, 64, -64, -64, -64, -64, -64, -64, -64, 64, 64, -64, -64, 64, -64, 64, -64, -64, -64, -64, 64, -64, -64, -64, -64, -64, 64, 64, -64, -64, -64, 64, 64, -64, 64, -64, -64, 64, 64, -64, -64, 64, -64, 64, 64, -64, -64, -64, -64, 64, -64, 64, 64, 64, 64, 64, 64, -64, 64, 64, -64, 64, 64, -64, 64, -64, 64, 64, 64, 64, -64, 64, 64, 64, -64, 64, 64, -64, 64, -64, -64, -64, 64, 64, 64, 64, 64, 64, 64, 64, -64, -64, 64, -64, 64, -64, 64, -64, 64, -64, 64, 64, -64, 64, 64, -64, -64, 64, -64, -64, 64, 64, -64, -64, 64, 64, 64, 64, 64, -64, 64, 64, 64, 64, -64, -64, -64, 64, 64, 64, 64, 64, 64, -64, -64, -64, -64, 64, 64, 64, -64, -64, -64, 64, 64, -64, 64, 64, 64, 64, -64, -64, -64, 64, 64, 64, 64, 64, -64, -64, 64, -64, -64, 64, 64, 64, -64, 64, 64, 64, -64, 64, 64, -64, 64, 64, 64, 64, 64, 64, 64, -64, 64, 64, 64, 64, 64, -64, 64, -64, 64, 64, 64, -64, 64, -64, -64, -64, 64, 64, 64, 64, 64, 64, 64, 64, -64, 64, -64, -64, 64, 64, 64, 64, 64, -64, 64, 64, 64, 64, 64, 64, 64, -64, -64, -64, -64, 64, 64, 64, 64, 64, 64, 64, 64, 64, -64, -64, -64, -64, -64, 64, 64, -64, 64, -64, 64, -64, -64, 64, 64, 64, -64, -64, 64, 64, 64, 64, 64, 64, 64, -64, -64, -64, 64, -64, 64, -64, -64, 64, -64, -64, -64, 64, 64, -64, -64, -64, -64, -64, -64, -64, -64, 64, 64, 64, 64, 64, -64, -64, -64, -64, 64, -64, 64, 64, 64, -64, -64, -64, -64, -64, -64, 64, -64, -64, -64, -64, -64, -64, -64, -64, 64, -64, 64, -64, -64, -64, -64, -64, 64, 64, 64, -64, -64, -64, -64, 64, 64, -64, 64, 64, -64, -64, -64, -64, -64, 64, 64, 64, 64, 64, 64, -64, 64, -64, -64, -64, 64, 64, -64, -64, -64, -64, 64, 64, 64, -64, -64, -64, -64, -64, -64, -64, 64, 64, 64, 64, 64, 64, 64, 64, -64, 64, 64, -64, 64, 64, 64, -64, -64, -64, 64, 64, 64, -64, -64, -64, -64, -64, -64, -64, -64, 64, 64, -64, -64, 64, 64, -64, 64, -64, 64, 64, 64, 64, 64, 64, -64, -64, -64, -64, 64, -64, 64, -64, 64, -64, 64, -64, 64, -64, -64, -64, 64, 64, -64, 64, 64, -64, 64, 64, -64, -64, 64, 64, 64, 64, -64, 64, -64, -64, 64, -64, 64, 64, 64, -64, 64, 64, 64, 64, -64, 64, 64, 64, -64, 64, 64, 64, -64, 64, -64, 64, 64, 64, 64, -64, 64, 64, -64, -64, -64, -64, -64, 64, -64, 64, 64, 64, 64, 64, 64, 64, 64, 64, 64, 64, -64, -64, -64, -64, -64, 64, -64, -64, -64, 64, -64, -64, 64, -64, -64, 64, 64, -64, 64, -64, -64, 64, 64, 64, 64, -64, -64, -64, -64, -64, -64, 64, 64, -64, -64, 64, 64, 64, -64, 64, -64, -64, -64, -64, -64, -64, -64, -64, -64, -64, 64, 64, 64, 64, 64, 64, -64, -64, -64, 64, 64, 64, -64, -64, 64, -64, -64, 64, 64, 64, 64, -64, -64, -64, -64, -64, -64, -64, 64, 64, 64, 64, 64, 64, -64, -64, -64, 64, -64, 64, -64, -64, -64, 64, -64, 64, 64, 64, -64, -64, 64, -64, 64, 64, -64, 64, 64, 64, 64, 64, 64, 64, 64, -64, -64, -64, 64, 64, -64, -64, -64, 64, -64, 64, 64, 64, 64, -64, 64, -64, -64, 64, -64, 64, 64, 64, 64, 64, 64, 64, -64, -64, -64, -64, 64, 64, -64, 64, 64, 64, -64, 64, 64, 64, 64, 64, -64, 64, -64, -64, 64, 64, 64, 64, 64, 64, 64, -64, -64, -64, -64, -64, -64, -64, -64, -64, -64, 64, 64, 64, 64, 64, 64, 64, 64, -64, 64, 64, 64, 64, 64, 64, 64, 64, 64, 64, -64, -64, -64, -64, -64, -64, -64, 64, -64, 64, -64, 64, 64, 64, 64, 64, 64, -64, 64, 64, 64, 64, 64, 64, 64, 64, -64, 64, 64, -64, -64, -64, -64, 64, -64, 64, -64, 64, -64, -64, -64, 64, 64, 64, -64, 64, -64, 64, -64, -64, -64, -64, -64, -64, -64, -64, -64, -64, -64, -64, 64, -64, -64, -64, -64, 64, -64, 64, -64, 64, 64, -64, -64, 64, 64, -64, -64, 64, 64, -64, 64, 64, 64, 64, 64, -64, -64, -64, 64, 64, 64, 64, -64, -64, -64, 64, 64, -64, 64, 64, 64, 64, -64, -64, -64, -64, 64, -64, -64, -64, -64, 64, -64, -64, -64, -64, 64, 64, -64, 64, 64, -64, -64, 64, -64, 64, -64, -64, -64, -64, -64, -64, -64, -64, 64, -64, 64, 64, -64, -64, 64, -64, 64, 64, -64, -64, 64, 64, -64, 64, 64, -64, 64, 64, 64, 64, 64, 64, 64, 64, -64, 64, 64, 64, 64, -64, -64, 64, -64, 64, 64, -64, -64, 64, -64, -64, -64, -64, 64, 64, -64, -64, -64, 64, 64, 64, 64, 64, 64, 64, 64, -64, 64, 64, 64, 64, 64, 64, 64, 64, 64, 64, -64, 64, 64, 64, -64, 64, 64, 64, -64, 64, -64, -64, 64, 64, 64, 64, 64, -64, 64, -64, -64, 64, 64, 64, 64, 64, 64, 64, -64, 64, -64, 64, -64, 64, 64, 64, 64, -64, -64, 64, -64, -64, -64, 64, -64, -64, 64, -64, 64, -64, -64, 64, 64, 64, 64, -64, -64, 64, 64, -64, -64, -64, 64, 64, 64, 64, 64, -64, -64, 64, -64, -64, -64, -64, -64, -64, -64, 64, -64, -64, -64, -64, 64, 64, 64, 64, -64, 64, -64, 64, -64, 64, 64, 64, 64, 64, -64, 64, 64, -64, -64, -64, -64, -64, 64, -64, -64, -64, -64, 64, 64, 64, 64, 64, -64, -64, -64, 64, -64, 64, 64, -64, 64, 64, 64, 64, 64, -64, -64, -64, 64, 64, -64, 64, -64, 64, 64, 64, 64, 64, 64, 64, -64, 64, 64, 64, -64, 64, 64, 64, 64, -64, -64, 64, 64, -64, -64, -64, 64, -64, 64, 64, -64, 64, 64, 64, 64, 64, 64, 64, -64, -64, 64, -64, -64, -64, -64, -64, 64, -64, 64, 64, -64, -64, -64, -64, -64, -64, -64, -64, -64, -64, -64, -64, 64, -64, 64, -64, 64, -64, 64, -64, -64, -64, 64, 64, 64, 64, 64, 64, -64, -64, -64, -64, -64, -64, -64, -64, -64, -64, -64, -64, -64, -64, -64, 64, 64, -64, 64, 64, -64, 64, 64, 64, 64, 64, 64, -64, -64, -64, -64, -64, -64, -64, 64, -64, -64, -64, -64, -64, -64, -64, -64, -64, -64, -64, 64, 64, 64, 64, 64, 64, 64, 64, 64, -64, -64, -64, -64, -64, -64, -64, 64, -64, -64, -64, -64, 64, 64, -64, 64, -64, 64, -64, 64, 64, 64, 64, 64, 64, 64, 64, 64, 64, -64, -64, -64, -64, -64, 64, -64, -64, -64, 64, -64, -64, -64, -64, 64, -64, 64, 64, -64, -64, 64, 64, 64, 64, 64, 64, -64, -64, -64, -64, -64, -64, 64, -64, -64, -64, 64, 64, 64, -64, -64, -64, -64, -64, 64, 64, -64, -64, 64, 64, 64, 64, 64, 64, -64, -64, -64, -64, -64, -64, 64, 64, 64, -64, 64, 64, 64, 64, -64, -64, 64, 64, -64, 64, -64, -64, -64, 64, -64, 64, 64, 64, 64, -64, -64, -64, -64, -64, -64, 64, 64, -64, 64, 64, 64, 64, -64, 64, 64, -64, 64, 64, -64, -64, -64, -64, -64, -64, 64, 64, 64, 64, -64, -64, -64, 64, 64, 64, 64, 64, 64, 64, -64, -64, -64, -64, -64, -64, 64, 64, -64, -64, -64, -64, -64, 64, -64, 64, 64, -64, -64, -64, -64, -64, 64, 64, 64, 64, 64, 64, -64, -64, -64, -64, -64, -64, -64, 64, -64, 64, -64, -64, -64, -64, -64, -64, 64, -64, -64, -64, -64, 64, 64, 64, 64, 64, -64, 64, -64, -64, -64, 64, -64, 64, 64, -64, 64, 64, 64, 64, 64, -64, -64, 64, -64, -64, -64, -64, -64, 64, 64, 64, -64, 64, 64, 64, -64, 64, 64, 64, -64, -64, 64, 64, 64, -64, -64, -64, 64, -64, -64, 64, -64, -64, -64, -64, 64, 64, 64, 64, 64, -64, -64, -64, -64, -64, 64, 64, -64, 64, -64, 64, -64, -64, -64, -64, -64, -64, -64, -64, -64, -64, -64, -64, 64, 64, 64, 64, -64, 64, -64, 64, 64, 64, 64, -64, -64, -64, -64, 64, -64, -64, -64, -64, -64, -64, -64, -64, -64, -64, -64, -64, 64, 64, 64, -64, -64, 64, 64, 64, 64, 64, 64, 64, 64, 64, 64, 64, -64, 64, 64, -64, -64, -64, -64, -64, -64, -64, 64, -64, 64, -64, 64, 64, -64, -64, 64, 64, -64, 64, -64, 64, 64, -64, -64, 64, -64, 64, -64, 64, -64, -64, -64, -64, -64, -64, 64, -64, -64, -64, -64, 64, 64, 64, 64, 64, 64, -64, 64, 64, 64, -64, 64, -64, -64, 64, 64, -64, 64, 64, -64, 64, -64, -64, -64, -64, -64, 64, -64, 64, 64, 64, -64, -64, 64, -64, -64, -64, -64, -64, -64, -64, -64, -64, -64, -64, -64, 64, -64, 64, 64, 64, 64, 64, 64, 64, 64, -64, 64, 64, 64, 64, 64, -64, -64, -64, 64, -64, -64, -64, 64, -64, -64, -64, 64, -64, 64, 64, 64, -64, -64, 64, -64, 64, -64, -64, -64, 64, -64, 64, -64, 64, 64, 64, 64, -64, 64, 64, -64, 64, 64, -64, 64, -64, 64, 64, 64, -64, 64, -64, 64, 64, 64, -64, -64, 64, 64, 64, -64, -64, -64, -64, 64, -64, -64, 64, 64, 64, -64, 64, -64, -64, -64, -64, 64, -64, -64, -64, 64, 64, 64, -64, 64, -64, -64, -64, 64, 64, 64, 64, -64, -64, 64, 64, 64, -64, 64, 64, -64, -64, 64, -64, -64, 64, -64, 64, 64, 64, 64, -64, -64, -64, 64, 64, 64, -64, -64, 64, -64, -64, -64, 64, -64, 64, 64, 64, -64, 64, 64, -64, 64, 64, 64, 64, 64, -64, -64, -64, -64, -64, -64, 64, -64, -64, -64, -64, 64, -64, -64, -64, 64, 64, 64, 64, -64, -64, 64, 64, -64, 64, 64, 64, 64, 64, 64, -64, -64, -64, -64, 64, 64, 64, 64, 64, -64, 64, 64, 64, 64, -64, 64, -64, 64, 64, 64, 64, 64, 64, 64, 64, 64, -64, -64, -64, -64, -64, 64, -64, 64, 64, 64, 64, 64, -64, 64, -64, -64, 64, 64, 64, 64, 64, 64, 64, -64, -64, 64, 64, -64, 64, -64, 64, -64, 64, -64, 64, 64, 64, 64, 64, 64, 64, 64, -64, -64, -64, 64, 64, 64, -64, 64, 64, -64, 64, 64, 64, 64, -64, -64, 64, 64, -64, -64, -64, -64, -64, 64, 64, -64, 64, 64, 64, 64, 64, 64, -64, 64, 64, -64, 64, 64, 64, 64, 64, 64, 64, -64, -64, -64, -64, -64, 64, 64, 64, 64, -64, 64, 64, -64, 64, -64, -64, 64, -64, 64, 64, -64, -64, 64, 64, 64, 64, 64, 64, -64, -64, 64, 64, 64, -64, -64, 64, 64, -64, 64, -64, -64, -64, 64, -64, -64, 64, -64, -64, -64, 64, 64, 64, -64, 64, -64, -64, 64, -64, -64, -64, 64, 64, -64, 64, 64, 64, 64, -64, 64, -64, -64, 64, -64, 64, -64, -64, -64, 64, 64, 64, 64, 64, 64, 64, -64, 64, 64, -64, -64, -64, 64, 64, -64, -64, 64, -64, 64, -64, 64, -64, -64, 64, 64, 64, 64, 64, 64, 64, 64, 64, 64, 64, 64, 64, 64, -64, -64, 64, 64, -64, -64, -64, -64, 64, 64, -64, 64, -64, 64, 64, 64, 64, 64, 64, 64, 64, 64, 64, 64, 64, 64, 64, 64, -64, 64, -64, -64, -64, -64, 64, -64, -64, 64, 64, 64, 64, 64, 64, 64, -64, -64, -64, -64, -64, -64, 64, 64, -64, 64, 64, 64, 64, 64, 64, -64, 64, 64, -64, -64, 64, 64, 64, 64, 64, 64, 64, 64, -64, -64, -64, -64, -64, 64, 64, 64, 64, -64, -64, -64, -64, 64, 64, 64, 64, -64, 64, -64, -64, -64, -64, 64, -64, 64, 64, 64, -64, 64, 64, -64, -64, -64, 64, 64, 64, -64, -64, 64, 64, -64, -64, 64, 64, -64, -64, -64, -64, -64, 64, 64, 64, 64, -64, 64, 64, 64, 64, 64, 64, 64, 64, 64, 64, 64, 64, 64, -64, 64, 64, 64, -64, -64, 64, 64, -64, 64, -64, -64, 64, 64, 64, -64, 64, -64, -64, -64, 64, 64, 64, 64, 64, 64, 64, 64, 64, 64, 64, 64, 64, 64, -64, -64, -64, -64, -64, -64, 64, -64, 64, 64, 64, -64, 64, -64, 64, -64, 64, 64, 64, -64, 64, 64, 64, 64, 64, 64, 64, 64, 64, -64, -64, 64, -64, 64, 64, 64, 64, 64, -64, 64, 64, 64, 64, 64, -64, 64, 64, 64, 64, 64, 64, 64, 64, 64, 64, 64, 64, 64, -64, 64, 64, -64, 64, -64, 64, 64, 64, 64, 64, -64, -64, -64, 64, 64, 64, 64, 64, -64, 64, 64, 64, 64, 64, 64, 64, -64, -64, 64, 64, 64, 64, 64, 64, 64, -64, 64, -64, -64, 64, 64, -64, 64, 64, 64, 64, 64, 64, -64, 64, 64, 64, 64, -64, -64, 64, -64, 64, 64, 64, 64, -64, 64, -64, 64, 64, 64, 64, 64, 64, -64, 64, 64, -64, -64, -64, -64, 64, 64, -64, 64, 64, 64, 64, -64, -64, -64, -64, -64, -64, -64, 64, -64, -64, -64, -64, -64, 64, 64, -64, 64, 64, -64, -64, -64, -64, -64, 64, -64, 64, -64, -64, -64, 64, 64, 64, -64, 64, -64, 64, -64, 64, 64, -64, 64, -64, -64, 64, 64, -64, -64, 64, -64, -64, 64, 64, -64, 64, -64, -64, -64, -64, -64, 64, -64, -64, 64, 64, 64, 64, -64, -64, 64, 64, -64, 64, -64, 64, -64, 64, -64, 64, -64, 64, 64, -64, 64, 64, 64, -64, 64, -64, -64, 64, 64, -64, 64, 64, 64, -64, -64, -64, 64, -64, 64, 64, -64, 64, 64, 64, 64, -64, -64, 64, 64, -64, 64, 64, -64, 64, 64, -64, -64, -64, -64, 64, -64, -64, -64, -64, 64, -64, -64, -64, 64, -64, 64, -64, 64, -64, 64, -64, 64, 64, 64, -64, 64, -64, -64, 64, 64, 64, 64, -64, -64, 64, -64, 64, 64, 64, -64, 64, -64, 64, -64, 64, 64, -64, -64, -64, 64, 64, -64, 64, -64, -64, -64, 64, 64, 64, 64, -64, 64, 64, -64, 64, -64, 64, 64, -64, -64, 64, 64, -64, 64, 64, -64, 64, 64, -64, -64, -64, -64, 64, 64, 64, -64, -64, 64, -64, -64, -64, -64, 64, -64, -64, -64, -64, -64, -64, -64, -64, -64, -64, 64, -64, 64, -64, -64, 64, 64, 64, -64, 64, -64, -64, 64, -64, 64, 64, -64, 64, 64, -64, -64, 64, 64, -64, -64, 64, 64, 64, -64, 64, -64, 64, -64, 64, -64, -64, -64, 64, -64, -64, -64, 64, -64, -64, -64, -64, 64, 64, -64, -64, 64, 64, 64, -64, -64, -64, 64, 64, 64, 64, -64, 64, -64, -64, 64, 64, 64, -64, -64, -64, 64, -64, -64, -64, 64, -64, -64, -64, -64, 64, -64, -64, -64, 64, 64, -64, 64, -64, -64, -64, 64, -64, 64, -64, -64, -64, 64, 64, 64, -64, -64, -64, 64, -64, 64, -64, -64, 64, -64, -64, -64, -64, -64, -64, -64, -64, 64, -64, 64, -64, -64, 64, 64, 64, -64, 64, -64, 64, -64, 64, -64, 64, -64, 64, -64, -64, -64, 64, -64, 64, 64, 64, 64, -64, 64, 64, -64, 64, -64, 64, -64, 64, -64, -64, -64, -64, -64, -64, -64, -64, -64, -64, -64, 64, -64, 64, -64, 64, -64, 64, 64, -64, -64, -64, -64, -64, -64, -64, -64, -64, 64, -64, -64, -64, -64, -64, 64, -64, 64, 64, -64, 64, 64, 64, -64, 64, -64, -64, -64, -64, 64, 64, -64, 64, 64, -64, 64, -64, 64, 64, 64, 64, 64, -64, -64, 64, -64, 64, -64, 64, 64, -64, 64, 64, 64, -64, -64, -64, 64, 64, 64, -64, 64, -64, -64, 64, -64, 64, -64, -64, -64, 64, 64, 64, -64, -64, 64, -64, -64, -64, -64, -64, -64, -64, 64, -64, 64, 64, -64, 64, -64, 64, -64, 64, 64, -64, -64, -64, 64, -64, -64, -64, -64, -64, 64, -64, -64, -64, 64, -64, -64, -64, 64, -64, -64, 64, 64, 64, -64, -64, -64, 64, -64, -64, 64, 64, 64, -64, -64, 64, 64, -64, -64, 64, -64, -64, 64, -64, -64, -64, 64, 64, 64, -64, 64, 64, -64, -64, -64, 64, -64, -64, 64, -64, 64, -64, -64, -64, -64, -64, -64, -64, -64, -64, 64, -64, 64, 64, 64, -64, 64, -64, -64, -64, 64, -64, -64, 64, -64, -64, -64, -64, -64, -64, 64, -64, 64, -64, -64, 64, -64, -64, -64, -64, -64, -64, 64, -64, -64, 64, -64, 64, 64, -64, -64, -64, -64, -64, -64, -64, 64, -64, -64, 64, 64, -64, -64, -64, 64, 64, -64, -64, -64, -64, 64, -64, 64, 64, 64, 64, 64, 64, -64, -64, -64, -64, -64, 64, -64, -64, -64, 64, -64, -64, -64, -64, -64, 64, -64, 64, -64, 64, -64, 64, 64, -64, 64, -64, 64, 64, -64, -64, 64, 64, -64, -64, -64, -64, -64, -64, 64, -64, -64, -64, 64, 64, -64, -64, 64, -64, 64, -64, -64, -64, 64, 64, 64, 64, -64, -64, -64, 64, 64, -64, -64, 64, -64, -64, 64, -64, -64, 64, 64, 64, -64, 64, -64, 64, 64, -64, -64, 64, -64, 64, -64, -64, 64, 64, -64, -64, -64, 64, -64, -64, -64, -64, -64, 64, -64, -64, -64, 64, -64, 64, -64, 64, 64, -64, 64, -64, 64, 64, -64, -64, -64, 64, -64, -64, -64, -64, 64, -64, -64, 64, 64, -64, 64, -64, 64, 64, 64, 64, 64, -64, -64, 64, -64, 64, 64, -64, -64, -64, -64, 64, 64, -64, -64, -64, 64, -64, -64, 64, -64, -64, -64, -64, 64, -64, -64, -64, -64, 64, 64, 64, -64, -64, -64, -64, 64, -64, 64, -64, -64, -64, -64, 64, -64, 64, -64, -64, 64, 64, 64, 64, 64, -64, -64, -64, 64, 64, -64, 64, 64, 64, 64, -64, -64, -64, 64, 64, -64, -64, 64, -64, 64, -64, -64, 64, -64, 64, 64, 64, 64, -64, 64, 64, 64, 64, -64, 64, -64, 64, -64, -64, -64, -64, 64, 64, 64, -64, -64, 64, -64, 64, -64, 64, -64, -64, -64, -64, 64, 64, 64, -64, -64, 64, -64, 64, -64, 64, 64, -64, 64, -64, 64, 64, -64, -64, -64, -64, -64, -64, 64, -64, 64, -64, -64, -64, -64, 64, -64, 64, 64, 64, -64, 64, 64, -64, -64, 64, 64, 64, 64, -64, -64, 64, -64, -64, -64, -64, 64, 64, -64, 64, -64, 64, 64, -64, -64, -64, 64, -64, -64, 64, 64, 64, -64, -64, -64, -64, -64, -64, -64, -64, 64, 64, 64, 64, 64, 64, -64, -64, -64, -64, -64, -64, -64, -64, -64, 64, 64, 64, 64, 64, 64, -64, -64, -64, 64, 64, 64, 64, 64, 64, 64, 64, 64, 64, -64, -64, -64, -64, -64, -64, -64, -64, 64, 64, 64, 64, -64, 64, -64, 64, 64, -64, -64, 64, 64, 64, 64, 64, 64, 64, 64, 64, -64, -64, 64, 64, 64, -64, 64, 64, 64, 64, 64, -64, -64, -64, 64, -64, 64, 64, 64, 64, 64, 64, 64, 64, 64, 64, 64, 64, 64, 64, -64, -64, 64, -64, 64, -64, 64, 64, -64, -64, -64, -64, 64, -64, 64, -64, -64, 64, 64, 64, 64, 64, 64, 64, 64, 64, 64, 64, 64, 64, 64, -64, -64, -64, 64, -64, -64, -64, 64, 64, 64, -64, 64, 64, 64, 64, 64, 64, 64, 64, 64, 64, 64, -64, 64, -64, -64, 64, 64, 64, -64, -64, -64, -64, 64, -64, -64, -64, -64, -64, 64, 64, 64, 64, 64, 64, 64, 64, 64, 64, 64, 64, -64, -64, 64, 64, 64, 64, -64, -64, -64, 64, 64, 64, 64, 64, 64, 64, 64, 64, 64, 64, 64, 64, -64, -64, 64, -64, 64, 64, -64, 64, 64, 64, 64, 64, -64, -64, -64, -64, -64, -64, -64, 64, -64, -64, 64, 64, 64, 64, 64, -64, 64, 64, 64, -64, -64, -64, 64, 64, 64, 64, 64, -64, -64, -64, -64, -64, -64, -64, 64, 64, 64, -64, 64, 64, -64, 64, -64, -64, 64, 64, 64, -64, -64, 64, -64, 64, 64, 64, 64, 64, -64, -64, -64, -64, -64, 64, -64, -64, -64, 64, -64, -64, 64, -64, 64, -64, -64, -64, 64, 64, -64, 64, 64, 64, 64, 64, 64, 64, 64, -64, -64, -64, 64, -64, -64, 64, -64, 64, 64, 64, -64, 64, 64, 64, -64, 64, 64, -64, 64, 64, 64, 64, -64, 64, 64, 64, 64, 64, 64, -64, 64, 64, 64, 64, -64, 64, 64, 64, -64, 64, 64, -64, 64, 64, 64, 64, 64, 64, 64, 64, -64, -64, 64, -64, 64, 64, 64, 64, 64, -64, -64, 64, 64, 64, 64, 64, -64, 64, -64, -64, 64, 64, 64, 64, 64, 64, 64, 64, -64, -64, -64, 64, 64, 64, 64, 64, -64, 64, 64, 64, -64, 64, 64, 64, -64, 64, 64, 64, -64, 64, 64, 64, 64, 64, 64, 64, -64, -64, 64, 64, 64, 64, -64, 64, -64, -64, 64, -64, 64, 64, -64, 64, -64, -64, 64, -64, 64, 64, 64, 64, 64, 64, -64, -64, 64, 64, 64, 64, 64, 64, 64, 64, -64, -64, 64, 64, -64, 64, -64, -64, -64, 64, -64, -64, -64, 64, 64, 64, -64, -64, -64, 64, 64, 64, 64, 64, -64, 64, 64, -64, -64, -64, 64, 64, -64, -64, 64, -64, -64, -64, -64, -64, -64, -64, -64, -64, -64, -64, -64, 64, 64, 64, 64, 64, 64, -64, 64, 64, -64, 64, -64, -64, -64, 64, 64, 64, -64, -64, -64, -64, -64, -64, -64, -64, 64, 64, 64, 64, 64, 64, 64, 64, 64, 64, 64, 64, 64, 64, 64, -64, -64, 64, 64, -64, -64, 64, 64, 64, -64, -64, -64, -64, -64, 64, 64, 64, 64, 64, 64, 64, 64, -64, -64, -64, 64, 64, 64, -64, 64, 64, 64, 64, 64, -64, 64, 64, 64, 64, 64, 64, 64, 64, 64, 64, 64, 64, 64, 64, 64, 64, -64, 64, -64, -64, 64, -64, 64, 64, 64, 64, 64, -64, -64, -64, 64, 64, 64, 64, 64, 64, 64, 64, 64, 64, 64, 64, 64, 64, -64, -64, 64, -64, 64, 64, 64, 64, 64, 64, 64, 64, -64, -64, 64, 64, 64, 64, -64, 64, 64, 64, 64, 64, 64, 64, -64, -64, -64, -64, 64, 64, -64, 64, 64, -64, 64, 64, -64, -64, 64, 64, -64, -64, -64, -64, -64, -64, -64, 64, 64, 64, -64, 64, -64, 64, -64, 64, 64, -64, -64, -64, 64, -64, 64, 64, 64, 64, -64, -64, -64, -64, -64, -64, 64, 64, 64, 64, -64, 64, -64, -64, -64, 64, -64, 64, -64, -64, -64, -64, 64, 64, 64, -64, 64, 64, -64, -64, -64, -64, -64, 64, 64, 64, 64, 64, 64, 64, 64, 64, -64, 64, -64, -64, 64, 64, 64, 64, -64, -64, -64, 64, -64, -64, 64, 64, -64, -64, 64, -64, 64, -64, 64, -64, -64, 64, 64, 64, -64, -64, 64, 64, -64, -64, 64, 64, 64, 64, -64, 64, -64, -64, -64, -64, -64, 64, -64, -64, -64, -64, -64, 64, 64, 64, 64, 64, 64, 64, 64, 64, 64, -64, 64, -64, 64, 64, 64, -64, -64, -64, 64, 64, -64, -64, -64, -64, -64, -64, -64, -64, -64, -64, -64, -64, -64, 64, 64, -64, -64, -64, -64, 64, -64, -64, -64, -64, -64, -64, -64, -64, 64, -64, -64, -64, -64, -64, -64, -64, -64, -64, -64, 64, 64, -64, -64, -64, -64, 64, -64, -64, 64, -64, -64, 64, -64, -64, -64, 64, -64, -64, -64, -64, -64, -64, -64, -64, -64, -64, 64, 64, -64, 64, -64, -64, -64, -64, 64, -64, 64, -64, 64, 64, -64, -64, -64, -64, -64, -64, -64, -64, -64, -64, -64, -64, -64, -64, 64, 64, 64, 64, 64, -64, -64, -64, -64, 64, -64, -64, -64, 64, -64, 64, 64, 64, -64, -64, -64, -64, -64, -64, -64, -64, -64, -64, -64, 64, 64, -64, 64, -64, -64, 64, 64, 64, 64, 64, -64, 64, 64, 64, 64, 64, 64, 64, -64, -64, -64, -64, -64, 64, -64, 64, -64, 64, 64, 64, 64, 64, -64, 64, -64, 64, 64, 64, 64, 64, 64, 64, -64, 64, -64, -64, -64, 64, 64, 64, 64, 64, 64, 64, 64, 64, -64, 64, 64, -64, -64, -64, -64, 64, 64, 64, 64, 64, 64, 64, 64, -64, -64, 64, -64, -64, -64, -64, -64, -64, -64, 64, -64, 64, 64, -64, -64, 64, 64, -64, 64, -64, 64, -64, 64, 64, 64, 64, 64, 64, -64, 64, -64, -64, 64, 64, -64, -64, -64, -64, 64, -64, -64, -64, -64, 64, -64, -64, 64, 64, 64, 64, 64, 64, 64, 64, -64, 64, -64, 64, -64, -64, -64, -64, -64, -64, -64, -64, -64, -64, 64, -64, -64, -64, -64, -64, -64, -64, 64, 64, 64, 64, 64, 64, 64, 64, -64, -64, -64, -64, 64, -64, 64, -64, -64, -64, -64, 64, -64, -64, -64, -64, -64, 64, 64, -64, 64, 64, 64, -64, 64, 64, 64, -64, -64, -64, -64, 64, 64, -64, -64, 64, -64, 64, -64, -64, -64, -64, -64, 64, -64, -64, 64, -64, 64, -64, 64, 64, 64, -64, 64, 64, 64, -64, 64, 64, -64, -64, -64, 64, 64, 64, -64, -64, -64, -64, -64, -64, -64, 64, 64, 64, 64, -64, -64, -64, -64, 64, -64, -64, -64, -64, -64, -64, -64, -64, -64, 64, 64, 64, -64, -64, -64, -64, -64, -64, -64, 64, -64, -64, 64, 64, -64, -64, -64, -64, -64, -64, -64, -64, -64, -64, -64, -64, -64, 64, 64, -64, 64, -64, -64, 64, -64, 64, 64, 64, -64, 64, -64, 64, -64, -64, -64, -64, -64, -64, -64, -64, -64, 64, 64, -64, -64, -64, 64, 64, -64, -64, 64, -64, -64, -64, 64, 64, -64, -64, -64, 64, -64, -64, -64, -64, -64, -64, -64, -64, -64, 64, -64, -64, -64, 64, -64, -64, -64, 64, -64, -64, -64, -64, -64, -64, 64, 64, -64, -64, 64, -64, -64, -64, -64, -64, -64, -64, -64, -64, -64, -64, -64, -64, -64, -64, 64, -64, -64, -64, -64, -64, -64, -64, 64, -64, 64, -64, 64, 64, 64, -64, -64, -64, -64, -64, -64, -64, -64, -64, 64, -64, -64, -64, -64, 64, -64, -64, -64, 64, 64, -64, 64, 64, 64, -64, -64, 64, 64, -64, -64, -64, -64, -64, -64, -64, -64, -64, -64, -64, -64, -64, -64, -64, 64, 64, 64, 64, 64, -64, 64, 64, 64, -64, 64, -64, 64, 64, 64, -64, -64, -64, -64, -64, -64, 64, -64, -64, -64, -64, -64, -64, 64, 64, -64, 64, 64, -64, 64, 64, -64, -64, -64, 64, 64, 64, 64, -64, -64, -64, -64, -64, 64, -64, 64, 64, -64, -64, 64, 64, 64, -64, -64, 64, 64, -64, -64, 64, 64, -64, 64, -64, 64, 64, 64, 64, 64, 64, 64, 64, 64, -64, 64, 64, -64, -64, 64, -64, -64, -64, -64, -64, -64, -64, -64, -64, 64, 64, 64, -64, -64, -64, -64, -64, -64, 64, 64, 64, -64, -64, 64, 64, 64, 64, 64, 64, 64, -64, -64, -64, -64, 64, 64, 64, -64, -64, -64, -64, 64, -64, -64, 64, 64, 64, -64, -64, -64, -64, 64, 64, 64, 64, 64, 64, -64, 64, 64, 64, -64, -64, 64, -64, 64, -64, -64, 64, -64, 64, 64, -64, 64, -64, 64, -64, 64, -64, 64, 64, -64, 64, -64, -64, 64, 64, -64, -64, -64, 64, 64, 64, -64, -64, 64, -64, -64, 64, -64, -64, -64, -64, 64, -64, -64, -64, 64, -64, -64, -64, 64, 64, 64, -64, -64, -64, -64, -64, -64, -64, -64, -64, -64, 64, 64, -64, 64, -64, 64, -64, -64, 64, -64, 64, 64, -64, -64, 64, 64, 64, -64, -64, 64, 64, -64, 64, 64, -64, -64, -64, 64, 64, 64, 64, 64, -64, -64, 64, 64, 64, 64, 64, -64, 64, 64, 64, -64, -64, -64, -64, 64, -64, 64, 64, -64, -64, -64, -64, -64, 64, -64, -64, -64, -64, 64, -64, -64, -64, 64, 64, 64, 64, 64, -64, 64, 64, -64, 64, 64, -64, -64, -64, 64, -64, -64, -64, -64, 64, 64, 64, -64, 64, -64, -64, 64, -64, 64, 64, 64, -64, 64, -64, -64, 64, -64, 64, 64, 64, 64, 64, 64, -64, 64, 64, 64, 64, 64, 64, 64, -64, 64, -64, 64, 64, 64, 64, -64, -64, -64, -64, 64, -64, 64, -64, 64, -64, 64, 64, -64, 64, -64, -64, 64, -64, -64, -64, -64, 64, 64, 64, 64, 64, 64, 64, 64, -64, -64, -64, 64, 64, -64, -64, 64, 64, 64, -64, -64, 64, 64, -64, 64, 64, 64, -64, 64, -64, -64, -64, 64, 64, 64, 64, 64, 64, -64, -64, 64, 64, 64, 64, -64, 64, -64, -64, -64, -64, 64, -64, 64, 64, -64, -64, -64, -64, 64, 64, 64, 64, 64, 64, 64, -64, 64, -64, -64, -64, 64, 64, 64, 64, 64, 64, -64, -64, -64, 64, 64, 64, -64, -64, 64, -64, -64, 64, 64, 64, 64, 64, -64, -64, -64, -64, -64, -64, -64, -64, -64, 64, 64, -64, -64, -64, -64, -64, -64, -64, -64, -64, 64, -64, 64, 64, 64, 64, -64, 64, 64, -64, -64, -64, -64, -64, -64, 64, 64, 64, 64, 64, 64, -64, -64, -64, 64, 64, -64, 64, -64, -64, 64, 64, 64, -64, -64, 64, 64, 64, 64, -64, -64, -64, 64, 64, -64, -64, -64, 64, 64, -64, -64, -64, -64, -64, -64, 64, -64, -64, 64, 64, 64, 64, 64, 64, 64, 64, 64, -64, -64, -64, -64, -64, -64, 64, -64, -64, 64, 64, -64, -64, -64, -64, -64, -64, -64, 64, 64, 64, 64, 64, 64, 64, 64, 64, -64, -64, 64, -64, -64, -64, 64, -64, -64, 64, 64, -64, -64, 64, -64, -64, -64, -64, -64, -64, 64, 64, 64, 64, 64, 64, 64, 64, -64, -64, -64, -64, -64, -64, 64, 64, -64, 64, -64, 64, -64, -64, -64, -64, -64, -64, -64, -64, 64, 64, 64, 64, 64, 64, 64, 64, 64, -64, -64, -64, -64, 64, -64, -64, 64, -64, -64, -64, 64, -64, -64, -64, -64, -64, 64, -64, -64, -64, 64, 64, 64, 64, 64, 64, -64, -64, -64, -64, 64, 64, -64, -64, -64, 64, 64, 64, 64, -64, 64, -64, -64, -64, -64, -64, -64, -64, -64, 64, 64, 64, 64, -64, -64, -64, -64, -64, -64, 64, -64, 64, -64, 64, -64, 64, 64, -64, 64, 64, 64, -64, -64, -64, -64, -64, 64, 64, 64, 64, 64, -64, -64, -64, 64, -64, -64, -64, -64, 64, -64, 64, -64, -64, 64, -64, 64, 64, 64, -64, -64, -64, -64, -64, -64, 64, -64, 64, 64, 64, 64, -64, 64, 64, 64, -64, 64, -64, -64, 64, 64, -64, -64, 64, -64, 64, 64, -64, -64, -64, -64, -64, -64, 64, 64, -64, 64, 64, 64, 64, -64, 64, -64, 64, 64, 64, 64, 64, -64, -64, -64, 64, -64, 64, 64, 64, -64, -64, 64, 64, 64, 64, 64, 64, -64, 64, 64, 64, 64, 64, 64, 64, 64, -64, 64, 64, -64, 64, 64, 64, 64, -64, 64, 64, 64, 64, 64, -64, 64, 64, -64, 64, -64, 64, 64, -64, 64, 64, 64, 64, 64, 64, 64, 64, -64, -64, -64, -64, 64, 64, 64, 64, 64, 64, 64, 64, -64, 64, -64, -64, 64, 64, 64, 64, 64, 64, 64, -64, -64, -64, -64, 64, -64, 64, 64, -64, -64, 64, 64, 64, 64, 64, 64, 64, 64, -64, -64, -64, 64, 64, 64, 64, 64, -64, -64, 64, 64, -64, -64, -64, -64, -64, -64, -64, -64, -64, 64, 64, 64, 64, 64, 64, 64, 64, -64, 64, 64, 64, 64, -64, 64, 64, -64, 64, 64, -64, -64, -64, -64, -64, -64, -64, -64, -64, 64, 64, 64, 64, 64, 64, 64, 64, 64, -64, 64, -64, -64, -64, -64, -64, 64, -64, 64, 64, -64, 64, 64, 64, -64, 64, 64, 64, 64, -64, -64, -64, -64, -64, -64, 64, 64, -64, -64, -64, -64, -64, -64, -64, -64, 64, 64, 64, 64, -64, 64, -64, 64, 64, 64, -64, 64, 64, 64, -64, -64, -64, -64, 64, -64, -64, 64, -64, 64, 64, 64, 64, 64, 64, -64, -64, 64, -64, -64, 64, 64, -64, 64, -64, 64, -64, -64, -64, 64, -64, 64, -64, -64, 64, -64, -64, -64, 64, 64, 64, 64, -64, -64, -64, 64, -64, -64, 64, 64, -64, 64, -64, 64, 64, -64, -64, -64, 64, -64, 64, 64, -64, -64, -64, -64, -64, -64, 64, 64, 64, -64, -64, -64, 64, -64, 64, -64, -64, 64, 64, 64, -64, -64, -64, -64, -64, -64, 64, 64, 64, 64, 64, -64, -64, 64, 64, 64, 64, -64, 64, -64, -64, -64, -64, 64, -64, -64, 64, 64, 64, -64, 64, 64, -64, 64, 64, 64, 64, 64, 64, -64, -64, 64, 64, -64, 64, -64, -64, 64, -64, 64, -64, 64, -64, 64, -64, 64, 64, -64, 64, 64, -64, -64, -64, -64, -64, -64, -64, -64, 64, -64, 64, 64, 64, 64, 64, 64, 64, -64, 64, 64, 64, -64, -64, -64, 64, 64, -64, -64, 64, 64, -64, 64, 64, -64, 64, 64, 64, -64, 64, -64, -64, 64, 64, -64, -64, 64, -64, 64, -64, 64, -64, -64, 64, -64, -64, -64, -64, -64, 64, -64, -64, 64, -64, 64, -64, 64, 64, 64, -64, 64, 64, 64, 64, 64, 64, 64, 64, -64, -64, -64, -64, -64, -64, -64, -64, -64, -64, -64, 64, -64, 64, -64, -64, -64, -64, 64, 64, 64, 64, -64, -64, -64, 64, 64, -64, 64, -64, -64, 64, 64, -64, -64, -64, 64, -64, -64, -64, 64, -64, 64, -64, 64, 64, -64, -64, -64, -64, -64, -64, -64, -64, 64, 64, -64, -64, 64, 64, -64, 64, -64, 64, -64, -64, 64, -64, -64, 64, 64, 64, -64, -64, -64, -64, 64, -64, 64, 64, 64, 64, 64, -64, 64, -64, -64, 64, 64, 64, 64, -64, -64, 64, -64, -64, -64, -64, 64, -64, -64, -64, 64, 64, 64, -64, 64, -64, -64, 64, -64, 64, -64, 64, -64, -64, 64, -64, -64, -64, 64, 64, 64, 64, -64, -64, -64, 64, -64, -64, -64, -64, -64, 64, -64, 64, 64, 64, -64, -64, -64, 64, -64, -64, 64, -64, 64, -64, -64, -64, -64, -64, -64, -64, -64, -64, -64, -64, 64, 64, 64, 64, 64, 64, 64, -64, -64, -64, -64, -64, -64, -64, 64, -64, 64, -64, 64, 64, -64, 64, 64, -64, 64, -64, 64, -64, -64, -64, 64, -64, -64, -64, 64, -64, -64, -64, -64, -64, -64, 64, -64, 64, -64, 64, 64, -64, -64, -64, -64, 64, -64, -64, -64, -64, 64, -64, -64, 64, -64, 64, 64, -64, 64, 64, 64, 64, -64, 64, -64, -64, -64, -64, -64, -64, -64, 64, -64, -64, 64, -64, 64, -64, 64, 64, -64, -64, -64, -64, 64, -64, 64, -64, 64, 64, -64, -64, 64, 64, -64, -64, -64, -64, 64, -64, 64, -64, -64, -64, -64, -64, -64, -64, 64, -64, -64, -64, 64, -64, -64, -64, -64, -64, 64, 64, 64, -64, -64, -64, 64, 64, 64, 64, -64, -64, -64, -64, -64, -64, -64, -64, -64, -64, -64, -64, 64, 64, -64, -64, -64, -64, -64, 64, -64, -64, -64, -64, -64, -64, -64, -64, -64, -64, -64, 64, 64, 64, 64, 64, -64, 64, 64, -64, 64, -64, -64, -64, 64, 64, -64, -64, -64, -64, -64, 64, -64, -64, 64, -64, -64, 64, 64, -64, -64, 64, -64, 64, 64, -64, 64, 64, 64, -64, -64, -64, 64, -64, 64, -64, -64, 64, 64, 64, -64, -64, 64, -64, -64, 64, -64, 64, -64, 64, -64, -64, -64, 64, -64, -64, -64, 64, -64, 64, -64, 64, 64, 64, -64, -64, -64, 64, -64, 64, 64, -64, 64, -64, 64, -64, -64, 64, 64, -64, 64, -64, 64, -64, -64, 64, 64, -64, -64, -64, -64, -64, -64, 64, 64, -64, 64, 64, -64, -64, -64, -64, 64, 64, -64, 64, -64, -64, 64, 64, 64, -64, 64, 64, -64, -64, 64, -64, 64, 64, -64, 64, -64, -64, 64, -64, -64, 64, -64, 64, -64, 64, -64, -64, -64, 64, -64, -64, 64, -64, -64, 64, 64, 64, -64, -64, -64, 64, -64, 64, 64, 64, -64, -64, 64, -64, -64, 64, -64, -64, 64, -64, 64, 64, -64, 64, 64, -64, -64, 64, -64, 64, 64, -64, 64, 64, -64, 64, -64, -64, 64, -64, -64, -64, -64, -64, -64, 64, 64, 64, 64, -64, -64, -64, -64, 64, 64, -64, 64, -64, 64, 64, 64, 64, -64, -64, 64, -64, -64, 64, -64, 64, 64, 64, -64, 64, -64, 64, -64, 64, -64, -64, -64, -64, 64, 64, 64, 64, 64, 64, -64, 64, -64, -64, 64, 64, -64, -64, 64, -64, -64, -64, 64, -64, 64, -64, 64, 64, -64, -64, 64, 64, -64, 64, -64, 64, -64, -64, -64, -64, 64, -64, -64, -64, 64, 64, 64, -64, -64, 64, -64, 64, -64, 64, -64, 64, -64, 64, 64, 64, 64, -64, -64, 64, 64, -64, -64, -64, 64, 64, -64, 64, -64, 64, 64, 64, 64, -64, -64, 64, 64, 64, 64, 64, 64, 64, -64, 64, 64, 64, -64, 64, 64, -64, -64, -64, -64, -64, -64, -64, 64, -64, 64, -64, -64, 64, -64, 64, 64, 64, 64, 64, 64, -64, 64, -64, -64, -64, 64, -64, -64, -64, 64, -64, -64, -64, -64, -64, -64, -64, -64, -64, -64, -64, 64, 64, 64, 64, -64, -64, 64, 64, -64, -64, -64, -64, -64, 64, 64, 64, 64, 64, -64, -64, -64, -64, -64, -64, -64, -64, 64, 64, 64, 64, 64, 64, -64, -64, -64, -64, 64, -64, 64, -64, -64, 64, 64, 64, 64, 64, -64, -64, 64, -64, 64, -64, 64, 64, 64, 64, 64, 64, 64, 64, 64, -64, -64, -64, -64, 64, -64, -64, 64, 64, 64, -64, -64, -64, -64, -64, 64, 64, 64, 64, 64, 64, 64, 64, 64, 64, 64, 64, 64, 64, 64, -64, -64, 64, -64, -64, -64, -64, 64, 64, -64, 64, 64, -64, -64, -64, 64, 64, 64, 64, 64, 64, 64, 64, -64, 64, 64, 64, -64, -64, 64, -64, 64, 64, -64, 64, -64, -64, 64, -64, -64, -64, -64, -64, 64, 64, 64, 64, 64, 64, 64, -64, 64, 64, 64, 64, -64, -64, -64, -64, -64, -64, 64, -64, 64, -64, 64, 64, -64, -64, -64, 64, 64, 64, 64, -64, 64, 64, -64, 64, 64, 64, 64, 64, -64, -64, 64, -64, 64, -64, -64, 64, 64, 64, 64, 64, 64, 64, 64, -64, 64, 64, -64, -64, -64, -64, 64, 64, 64, 64, 64, 64, -64, 64, -64, 64, 64, -64, -64, -64, 64, 64, 64, 64, 64, 64, 64, 64, 64, 64, 64, 64, 64, -64, 64, 64, 64, 64, 64, 64, 64, -64, -64, -64, -64, -64, 64, -64, 64, 64, 64, 64, 64, 64, 64, 64, -64, 64, 64, 64, -64, -64, 64, 64, -64, 64, 64, -64, 64, -64, -64, -64, -64, -64, -64, 64, -64, 64, 64, 64, 64, 64, 64, 64, -64, -64, -64, 64, 64, 64, 64, 64, 64, 64, -64, -64, -64, -64, -64, 64, -64, 64, -64, -64, -64, -64, 64, 64, 64, 64, 64, 64, -64, 64, 64, 64, 64, 64, 64, 64, 64, 64, -64, 64, 64, 64, -64, -64, -64, -64, 64, -64, 64, 64, 64, 64, 64, 64, 64, 64, 64, 64, 64, -64, 64, 64, 64, 64, 64, 64, -64, 64, 64, 64, -64, 64, -64, -64, -64, 64, 64, 64, 64, -64, 64, 64, 64, 64, 64, 64, 64, 64, 64, 64, 64, 64, 64, -64, -64, 64, 64, 64, 64, 64, -64, 64, 64, 64, 64, 64, -64, -64, 64, 64, 64, 64, 64, 64, -64, 64, 64, 64, 64, 64, -64, -64, 64, 64, -64, -64, 64, 64, 64, -64, 64, -64, 64, -64, -64, -64, 64, 64, 64, 64, 64, 64, 64, -64, 64, 64, -64, -64, -64, -64, 64, -64, -64, 64, -64, -64, -64, -64, -64, -64, -64, -64, -64, 64, -64, 64, 64, -64, 64, -64, 64, 64, -64, 64, -64, -64, 64, -64, 64, 64, -64, -64, -64, 64, 64, 64, 64, -64, -64, -64, -64, -64, 64, -64, -64, 64, -64, 64, -64, -64, 64, -64, -64, -64, -64, -64, 64, 64, -64, 64, -64, 64, -64, -64, -64, 64, -64, 64, -64, -64, 64, 64, 64, -64, 64, 64, -64, -64, -64, -64, -64, -64, -64, 64, 64, 64, -64, 64, -64, 64, -64, -64, 64, -64, 64, 64, 64, 64, -64, 64, -64, -64, 64, 64, -64, -64, 64, -64, -64, -64, 64, 64, 64, 64, -64, -64, -64, -64, -64, -64, 64, 64, 64, 64, 64, 64, 64, 64, 64, 64, 64, 64, 64, 64, 64, 64, 64, -64, -64, 64, -64, 64, -64, -64, -64, -64, 64, -64, 64, -64, 64, 64, 64, 64, 64, 64, 64, 64, 64, 64, -64, -64, 64, 64, 64, 64, 64, 64, 64, -64, -64, -64, -64, -64, -64, -64, 64, -64, -64, 64, -64, 64, 64, 64, -64, 64, -64, 64, 64, -64, 64, 64, 64, 64, -64, -64, 64, 64, 64, -64, -64, 64, 64, 64, 64, 64, 64, 64, -64, 64, -64, -64, 64, -64, -64, 64, -64, -64, 64, 64, 64, 64, -64, 64, -64, 64, -64, -64, -64, 64, -64, -64, -64, 64, -64, -64, 64, -64, 64, -64, -64, -64, -64, -64, -64, -64, -64, -64, 64, -64, -64, -64, -64, 64, 64, 64, 64, 64, 64, -64, -64, -64, 64, 64, 64, 64, -64, -64, 64, 64, 64, 64, 64, -64, 64, 64, 64, -64, 64, 64, 64, 64, -64, -64, 64, -64, -64, -64, 64, 64, 64, 64, -64, -64, 64, -64, -64, 64, -64, 64, 64, -64, -64, -64, -64, -64, 64, -64, 64, -64, 64, -64, 64, 64, -64, -64, 64, 64, 64, 64, -64, 64, -64, -64, -64, 64, -64, 64, -64, 64, -64, -64, -64, -64, -64, -64, 64, 64, 64, -64, 64, -64, -64, -64, 64, -64, 64, 64, 64, -64, -64, 64, 64, -64, 64, 64, 64, 64, -64, 64, -64, 64, 64, -64, -64, 64, -64, 64, -64, 64, 64, -64, -64, 64, -64, 64, 64, 64, 64, -64, -64, 64, -64, -64, 64, 64, 64, 64, -64, 64, 64, 64, -64, 64, -64, 64, -64, 64, 64, -64, 64, 64, -64, 64, 64, 64, 64, 64, -64, 64, -64, -64, -64, 64, -64, 64, 64, 64, 64, -64, 64, 64, 64, 64, 64, -64, -64, 64, 64, 64, -64, 64, 64, 64, 64, -64, 64, -64, 64, 64, 64, 64, 64, -64, 64, 64, 64, 64, -64, 64, 64, 64, 64, -64, 64, -64, 64, -64, -64, 64, -64, -64, -64, -64, 64, 64, 64, -64, -64, 64, 64, -64, 64, 64, 64, 64, 64, -64, 64, -64, -64, 64, 64, -64, 64, -64, -64, 64, 64, 64, 64, -64, 64, 64, -64, 64, -64, 64, -64, 64, 64, 64, 64, -64, 64, 64, -64, 64, -64, 64, -64, 64, -64, 64, 64, -64, -64, 64, -64, 64, 64, 64, -64, -64, -64, 64, 64, 64, 64, 64, 64, 64, -64, 64, 64, 64, 64, -64, -64, -64, -64, 64, -64, 64, 64, 64, 64, 64, 64, -64, 64, -64, -64, -64, 64, 64, 64, 64, 64, -64, -64, 64, -64, 64, -64, 64, 64, -64, -64, -64, -64, 64, 64, 64, 64, 64, 64, -64, 64, 64, -64, -64, 64, 64, 64, 64, 64, 64, 64, 64, -64, 64, 64, 64, -64, -64, 64, 64, -64, -64, -64, -64, 64, -64, 64, -64, 64, 64, 64, 64, 64, 64, 64, 64, 64, 64, 64, 64, 64, 64, 64, -64, 64, 64, -64, -64, -64, -64, 64, 64, 64, -64, -64, -64, -64, 64, -64, 64, 64, 64, 64, 64, 64, 64, 64, 64, 64, 64, -64, 64, 64, 64, -64, -64, 64, 64, -64, -64, -64, -64, -64, -64, -64, 64, 64, 64, 64, 64, 64, 64, 64, 64, -64, -64, -64, -64, -64, 64, -64, 64, -64, 64, -64, 64, -64, -64, -64, -64, -64, -64, -64, 64, 64, 64, -64, -64, 64, -64, 64, -64, -64, 64, -64, -64, -64, -64, 64, 64, 64, -64, -64, 64, -64, -64, 64, -64, 64, 64, -64, 64, -64, 64, -64, -64, -64, -64, 64, -64, -64, -64, -64, -64, -64, -64, -64, 64, 64, -64, 64, 64, -64, 64, 64, -64, -64, -64, 64, 64, -64, 64, -64, 64, -64, -64, 64, 64, -64, -64, -64, -64, 64, -64, 64, -64, 64, -64, -64, -64, 64, 64, -64, -64, 64, 64, -64, 64, 64, 64, 64, 64, -64, -64, -64, -64, -64, -64, -64, -64, -64, -64, 64, 64, -64, -64, 64, -64, -64, -64, 64, -64, 64, 64, 64, 64, 64, 64, 64, -64, 64, -64, -64, -64, 64, -64, -64, -64, 64, -64, 64, -64, -64, -64, -64, 64, 64, -64, 64, 64, 64, 64, 64, -64, 64, 64, 64, 64, 64, 64, -64, 64, 64, -64, 64, 64, 64, -64, -64, 64, -64, -64, -64, -64, 64, 64, 64, 64, 64, -64, -64, 64, 64, 64, 64, 64, 64, 64, 64, 64, -64, 64, 64, 64, -64, 64, -64, -64, 64, -64, 64, 64, 64, 64, 64, 64, 64, 64, 64, 64, 64, 64, 64, 64, 64, 64, 64, -64, -64, 64, -64, 64, 64, -64, -64, 64, -64, 64, 64, 64, 64, 64, 64, -64, 64, 64, 64, -64, 64, 64, 64, 64, 64, -64, 64, -64, 64, 64, -64, -64, 64, -64, -64, -64, -64, 64, -64, 64, 64, 64, 64, -64, 64, -64, 64, 64, 64, 64, -64, 64, -64, 64, -64, -64, 64, 64, -64, 64, -64, 64, -64, -64, -64, 64, -64, 64, 64, 64, 64, 64, -64, -64, 64, 64, 64, 64, -64, 64, 64, 64, -64, 64, 64, -64, -64, -64, 64, -64, -64, -64, 64, -64, -64, -64, -64, -64, -64, -64, -64, 64, -64, -64, -64, -64, -64, -64, -64, 64, -64, 64, 64, 64, -64, 64, -64, -64, -64, 64, -64, 64, 64, 64, -64, -64, -64, -64, 64, 64, 64, -64, -64, 64, 64, -64, -64, -64, -64, 64, 64, 64, -64, 64, 64, 64, 64, -64, 64, -64, 64, 64, -64, 64, 64, -64, 64, -64, -64, -64, 64, 64, 64, 64, -64, 64, -64, -64, 64, 64, 64, 64, 64, 64, -64, -64, 64, -64, -64, 64, -64, -64, 64, -64, -64, -64, -64, 64, 64, -64, 64, 64, 64, 64, 64, 64, -64, -64, 64, -64, -64, 64, -64, -64, 64, 64, 64, 64, 64, -64, 64, 64, 64, 64, -64, 64, 64, -64, 64, -64, 64, 64, 64, 64, 64, 64, 64, -64, -64, 64, 64, -64, -64, 64, 64, 64, 64, 64, 64, 64, -64, 64, 64, 64, 64, 64, 64, 64, 64, -64, 64, -64, -64, -64, 64, 64, -64, -64, 64, -64, -64, -64, 64, -64, 64, 64, 64, 64, -64, -64, 64, 64, -64, -64, 64, -64, 64, -64, 64, -64, -64, 64, 64, -64, 64, -64, 64, -64, -64, 64, -64, 64, 64, -64, 64, 64, 64, 64, 64, 64, 64, 64, -64, -64, 64, 64, 64, 64, 64, 64, 64, 64, 64, -64, -64, 64, -64, 64, 64, -64, -64, -64, 64, 64, 64, 64, 64, -64, -64, -64, -64, 64, 64, -64, 64, 64, 64, 64, -64, 64, -64, 64, 64, -64, -64, -64, 64, -64, -64, 64, 64, 64, -64, -64, -64, 64, 64, -64, 64, 64, -64, 64, 64, 64, 64, 64, 64, 64, 64, 64, -64, 64, 64, 64, -64, 64, 64, 64, 64, 64, 64, 64, 64, 64, 64, 64, -64, -64, -64, -64, 64, 64, 64, 64, 64, 64, 64, -64, 64, -64, -64, 64, 64, -64, 64, 64, 64, 64, 64, 64, 64, 64, 64, 64, -64, -64, 64, -64, 64, 64, 64, -64, -64, -64, -64, 64, -64, 64, 64, 64, 64, 64, 64, 64, 64, 64, -64, 64, -64, -64, -64, 64, -64, 64, 64, -64, 64, 64, 64, 64, -64, -64, -64, -64, 64, -64, 64, 64, 64, 64, 64, 64, -64, -64, 64, 64, 64, 64, -64, -64, 64, 64, 64, 64, 64, -64, 64, 64, -64, 64, -64, -64, 64, -64, 64, -64, 64, 64, -64, -64, 64, -64, 64, 64, 64, 64, -64, -64, 64, 64, 64, 64, 64, 64, -64, -64, 64, -64, 64, -64, 64, -64, -64, 64, 64, 64, -64, -64, 64, -64, 64, 64, 64, -64, -64, 64, -64, 64, 64, 64, 64, 64, 64, 64, 64, 64, -64, 64, -64, 64, 64, -64, 64, 64, 64, -64, 64, 64, 64, 64, -64, 64, 64, 64, -64, 64, 64, 64, 64, 64, 64, 64, 64, 64, -64, -64, 64, -64, -64, -64, 64, 64, 64, 64, -64, 64, -64, 64, 64, 64, 64, -64, 64, 64, -64, -64, 64, -64, 64, -64, 64, -64, -64, 64, -64, -64, -64, 64, 64, 64, 64, 64, 64, 64, 64, 64, 64, 64, -64, -64, -64, -64, 64, -64, 64, 64, 64, 64, -64, 64, 64, -64, -64, 64, -64, 64, 64, 64, 64, 64, 64, -64, 64, 64, 64, -64, -64, -64, 64, 64, 64, 64, 64, 64, 64, 64, 64, 64, -64, -64, 64, 64, -64, -64, -64, 64, -64, 64, 64, 64, 64, -64, 64, 64, 64, 64, 64, -64, 64, 64, 64, 64, 64, 64, 64, -64, 64, -64, -64, 64, 64, -64, 64, -64, -64, 64, -64, -64, 64, 64, 64, -64, 64, 64, 64, 64, 64, 64, 64, 64, -64, -64, -64, -64, -64, -64, 64, -64, 64, -64, 64, 64, -64, 64, 64, 64, 64, 64, 64, 64, 64, 64, 64, 64, 64, 64, 64, 64, -64, 64, 64, 64, -64, 64, -64, -64, -64, -64, -64, 64, -64, 64, 64, 64, 64, 64, -64, 64, 64, 64, 64, 64, 64, 64, 64, 64, 64, 64, 64, -64, 64, 64, 64, 64, -64, -64, 64, -64, 64, -64, 64, -64, 64, -64, -64, -64, 64, 64, 64, 64, 64, 64, 64, 64, -64, 64, 64, -64, 64, -64, -64, 64, -64, -64, 64, 64, -64, 64, -64, -64, -64, 64, -64, 64, 64, 64, 64, 64, 64, 64, 64, 64, -64, -64, -64, -64, 64, -64, 64, 64, 64, -64, 64, -64, 64, -64, 64, 64, -64, -64, -64, -64, -64, 64, 64, 64, 64, 64, 64, -64, 64, -64, -64, -64, -64, 64, -64, -64, 64, 64, 64, -64, -64, -64, 64, -64, -64, -64, 64, -64, 64, -64, -64, -64, -64, -64, 64, -64, 64, -64, 64, -64, -64, -64, -64, -64, 64, -64, 64, 64, 64, -64, 64, 64, 64, -64, 64, 64, 64, -64, -64, -64, -64, 64, 64, 64, 64, 64, -64, 64, -64, -64, -64, -64, -64, 64, 64, 64, -64, -64, -64, -64, 64, 64, 64, -64, 64, -64, 64, 64, -64, -64, -64, -64, 64, -64, 64, 64, -64, -64, 64, -64, 64, 64, -64, 64, -64, -64, 64, -64, 64, -64, 64, -64, 64, -64, 64, -64, 64, -64, -64, 64, 64, 64, 64, -64, 64, -64, 64, 64, -64, -64, -64, -64, -64, 64, -64, -64, -64, 64, 64, 64, -64, 64, 64, -64, -64, -64, -64, 64, -64, 64, 64, 64, -64, -64, -64, -64, -64, -64, -64, -64, 64, -64, -64, -64, 64, -64, -64, -64, -64, -64, -64, 64, -64, -64, -64, -64, 64, -64, 64, 64, -64, 64, 64, 64, 64, -64, -64, -64, 64, -64, -64, -64, -64, -64, -64, -64, -64, -64, -64, -64, 64, -64, 64, 64, 64, -64, 64, 64, 64, 64, -64, -64, -64, -64, 64, 64, 64, 64, 64, -64, 64, -64, 64, -64, -64, -64, 64, 64, -64, -64, -64, -64, -64, -64, -64, 64, 64, -64, 64, 64, 64, -64, 64, -64, -64, -64, -64, -64, -64, -64, -64, 64, -64, -64, -64, -64, -64, 64, -64, -64, -64, -64, 64, -64, 64, 64, -64, 64, 64, 64, -64, 64, -64, 64, -64, -64, 64, 64, -64, -64, 64, -64, -64, 64, -64, 64, -64, -64, -64, 64, -64, -64, -64, -64, -64, -64, 64, 64, 64, 64, -64, 64, -64, -64, -64, -64, 64, 64, -64, -64, 64, -64, 64, -64, -64, -64, -64, -64, -64, -64, 64, -64, 64, 64, -64, 64, 64, 64, -64, -64, 64, -64, -64, -64, -64, -64, 64, -64, 64, 64, 64, -64, -64, -64, -64, -64, -64, 64, -64, 64, -64, 64, 64, 64, 64, -64, 64, -64, -64, -64, 64, -64, 64, -64, -64, -64, 64, 64, 64, 64, -64, -64, -64, -64, -64, -64, 64, -64, -64, 64, 64, -64, 64, -64, -64, 64, 64, 64, -64, -64, -64, -64, 64, 64, -64, -64, 64, -64, -64, 64, -64, -64, 64, -64, 64, 64, -64, -64, 64, 64, -64, -64, -64, -64, 64, 64, -64, -64, -64, -64, 64, 64, 64, -64, -64, 64, 64, -64, -64, 64, -64, 64, 64, -64, 64, -64, -64, -64, 64, -64, 64, -64, -64, 64, -64, -64, -64, 64, 64, 64, 64, -64, -64, -64, -64, -64, 64, -64, 64, -64, -64, 64, -64, -64, -64, -64, -64, -64, -64, -64, -64, -64, -64, -64, 64, 64, -64, 64, 64, -64, -64, -64, -64, -64, -64, -64, -64, -64, -64, 64, -64, -64, -64, -64, -64, -64, 64, 64, -64, -64, -64, -64, -64, -64, -64, 64, -64, -64, -64, -64, -64, 64, -64, 64, 64, 64, 64, -64, -64, 64, 64, 64, -64, -64, 64, 64, -64, -64, -64, -64, -64, -64, -64, -64, -64, -64, -64, -64, -64, -64, -64, -64, -64, -64, 64, 64, 64, 64, 64, 64, -64, -64, -64, -64, 64, 64, -64, -64, -64, -64, -64, 64, 64, 64, -64, -64, 64, 64, 64, -64, -64, 64, 64, -64, 64, 64, -64, -64, 64, -64, -64, -64, -64, -64, 64, 64, -64, -64, -64, -64, -64, -64, -64, -64, -64, 64, -64, -64, -64, -64, 64, 64, 64, 64, -64, 64, 64, -64, -64, 64, 64, -64, -64, -64, -64, -64, 64, -64, -64, -64, -64, -64, -64, 64, 64, 64, -64, 64, 64, 64, -64, 64, 64, 64, -64, 64, 64, -64, -64, -64, -64, -64, -64, -64, -64, -64, -64, -64, 64, 64, 64, 64, -64, -64, -64, 64, -64, -64, 64, -64, 64, 64, -64, -64, -64, -64, -64, -64, -64, -64, -64, 64, -64, -64, -64, -64, 64, 64, 64, -64, -64, -64, 64, 64, -64, -64, 64, -64, 64, -64, -64, 64, -64, 64, 64, -64, -64, -64, -64, -64, -64, -64, -64, -64, 64, -64, 64, -64, -64, -64, -64, -64, -64, 64, 64, -64, 64, 64, -64, 64, -64, 64, -64, 64, 64, 64, -64, -64, -64, -64, -64, 64, -64, 64, 64, 64, -64, 64, 64, -64, -64, -64, 64, 64, 64, 64, 64, 64, 64, 64, 64, -64, -64, 64, 64, 64, -64, -64, -64, 64, 64, -64, 64, 64, 64, 64, 64, 64, 64, -64, -64, -64, 64, -64, -64, -64, 64, -64, 64, 64, 64, 64, -64, 64, 64, 64, 64, -64, -64, 64, 64, 64, 64, -64, 64, -64, 64, 64, 64, -64, -64, -64, 64, 64, -64, -64, -64, 64, 64, 64, 64, -64, 64, -64, -64, -64, -64, -64, -64, -64, 64, -64, 64, 64, -64, 64, 64, 64, 64, -64, -64, -64, -64, -64, 64, -64, 64, 64, -64, 64, 64, -64, 64, 64, 64, -64, -64, -64, 64, -64, -64, 64, -64, 64, 64, 64, 64, -64, -64, 64, -64, 64, -64, -64, -64, -64, -64, 64, 64, -64, 64, 64, 64, 64, -64, -64, -64, 64, -64, -64, -64, -64, 64, 64, -64, -64, -64, -64, 64, 64, 64, 64, -64, -64, -64, 64, -64, 64, 64, 64, -64, -64, 64, 64, -64, -64, 64, 64, -64, 64, -64, 64, -64, -64, -64, -64, -64, -64, 64, -64, -64, -64, 64, 64, -64, 64, -64, -64, 64, -64, 64, -64, 64, 64, -64, 64, -64, -64, 64, -64, -64, 64, -64, -64, 64, 64, 64, 64, -64, -64, 64, 64, -64, -64, -64, -64, 64, 64, 64, 64, 64, -64, -64, -64, 64, -64, -64, -64, -64, 64, 64, 64, 64, 64, 64, 64, -64, -64, -64, -64, -64, -64, -64, -64, -64, -64, -64, -64, 64, -64, -64, -64, 64, 64, 64, 64, 64, -64, 64, -64, 64, 64, 64, -64, -64, -64, 64, -64, -64, -64, -64, 64, 64, -64, 64, -64, -64, 64, 64, 64, -64, -64, -64, 64, 64, -64, -64, -64, 64, -64, -64, -64, 64, -64, -64, -64, 64, 64, -64, 64, 64, 64, 64, 64, 64, 64, 64, 64, 64, 64, -64, 64, -64, -64, -64, -64, 64, -64, -64, -64, -64, 64, 64, 64, 64, 64, 64, 64, 64, 64, 64, 64, -64, -64, 64, -64, -64, 64, 64, -64, 64, 64, -64, -64, -64, -64, -64, 64, -64, 64, 64, 64, 64, 64, 64, 64, -64, 64, -64, -64, -64, -64, 64, 64, 64, 64, -64, 64, -64, 64, -64, -64, -64, -64, -64, 64, -64, -64, 64, 64, 64, -64, -64, -64, -64, -64, -64, -64, 64, -64, 64, 64, 64, -64, 64, 64, 64, 64, -64, -64, -64, -64, -64, 64, 64, 64, 64, 64, 64, -64, -64, -64, -64, -64, 64, -64, -64, 64, 64, 64, 64, -64, -64, -64, -64, 64, -64, -64, -64, -64, -64, -64, 64, 64, 64, -64, -64, -64, -64, -64, -64, -64, -64, -64, -64, 64, -64, -64, 64, -64, -64, 64, 64, 64, -64, -64, -64, -64, -64, 64, -64, 64, 64, 64, -64, -64, -64, -64, -64, -64, -64, -64, -64, -64, -64, -64, 64, 64, 64, 64, 64, 64, -64, -64, -64, -64, -64, 64, -64, -64, -64, 64, -64, -64, -64, -64, -64, -64, -64, -64, -64, -64, 64, 64, 64, 64, 64, -64, 64, -64, -64, -64, 64, -64, -64, 64, 64, -64, 64, -64, -64, -64, -64, -64, -64, -64, -64, -64, -64, -64, -64, 64, 64, -64, 64, -64, 64, -64, -64, 64, 64, 64, 64, 64, 64, 64, 64, -64, -64, -64, -64, -64, -64, -64, 64, 64, 64, -64, 64, 64, 64, 64, 64, 64, 64, -64, -64, 64, 64, 64, -64, 64, 64, 64, -64, -64, -64, -64, -64, -64, -64, -64, -64, 64, 64, 64, -64, 64, 64, -64, -64, -64, -64, 64, -64, -64, -64, -64, 64, -64, -64, -64, -64, -64, -64, -64, -64, 64, -64, 64, 64, 64, -64, 64, 64, 64, -64, -64, -64, -64, -64, -64, -64, -64, -64, -64, -64, -64, -64, -64, -64, -64, -64, -64, 64, 64, -64, 64, 64, -64, 64, 64, -64, 64, -64, 64, -64, -64, -64, 64, -64, 64, -64, 64, -64, -64, -64, -64, -64, -64, -64, -64, 64, 64, -64, 64, 64, -64, -64, 64, -64, 64, -64, 64, -64, 64, 64, 64, -64, -64, -64, -64, -64, -64, -64, -64, -64, -64, 64, 64, 64, 64, 64, 64, 64, 64, 64, 64, -64, 64, 64, -64, -64, -64, -64, 64, 64, 64, -64, -64, -64, 64, -64, -64, 64, -64, 64, -64, 64, -64, 64, 64, -64, 64, 64, 64, 64, 64, -64, 64, 64, 64, -64, -64, -64, 64, -64, 64, -64, 64, 64, -64, 64, 64, -64, 64, -64, 64, 64, 64, -64, -64, 64, 64, -64, 64, -64, -64, 64, -64, 64, 64, -64, 64, 64, 64, 64, 64, -64, -64, 64, -64, 64, -64, -64, 64, 64, 64, -64, -64, -64, -64, -64, 64, 64, 64, 64, -64, 64, 64, 64, 64, 64, 64, 64, 64, 64, 64, 64, 64, 64, 64, 64, 64, 64, -64, -64, -64, 64, 64, 64, -64, 64, 64, -64, 64, 64, 64, -64, -64, 64, -64, -64, -64, -64, 64, 64, 64, 64, 64, 64, 64, 64, 64, -64, 64, 64, 64, 64, 64, 64, -64, 64, 64, 64, -64, -64, -64, 64, -64, -64, -64, -64, 64, -64, 64, -64, 64, -64, 64, 64, 64, 64, 64, 64, 64, 64, 64, 64, -64, -64, 64, -64, -64, -64, -64, 64, 64, 64, -64, -64, -64, 64, 64, -64, 64, -64, -64, 64, -64, -64, -64, -64, 64, -64, -64, -64, -64, 64, 64, -64, 64, -64, 64, 64, 64, 64, -64, -64, 64, 64, -64, 64, -64, -64, 64, 64, 64, -64, -64, -64, 64, -64, 64, 64, -64, 64, 64, 64, 64, -64, 64, 64, -64, 64, 64, 64, 64, -64, 64, 64, -64, 64, 64, -64, 64, 64, -64, 64, -64, -64, 64, -64, -64, 64, -64, -64, -64, -64, -64, 64, -64, 64, -64, -64, 64, -64, -64, 64, 64, 64, -64, 64, -64, 64, 64, 64, -64, 64, -64, 64, 64, 64, 64, -64, 64, 64, 64, 64, 64, 64, -64, 64, 64, -64, 64, 64, 64, 64, 64, -64, -64, -64, -64, 64, 64, -64, 64, -64, 64, 64, -64, -64, -64, 64, -64, -64, -64, 64, -64, -64, -64, -64, -64, -64, -64, -64, -64, -64, -64, 64, 64, 64, -64, 64, 64, 64, 64, -64, 64, -64, -64, -64, 64, -64, -64, 64, 64, 64, 64, 64, 64, 64, -64, -64, -64, -64, -64, -64, 64, -64, 64, 64, 64, 64, -64, -64, 64, 64, -64, 64, -64, 64, 64, 64, 64, 64, 64, 64, 64, 64, 64, -64, -64, -64, -64, -64, -64, -64, 64, 64, 64, 64, 64, 64, -64, -64, -64, 64, 64, 64, 64, -64, 64, 64, 64, 64, -64, 64, 64, -64, 64, 64, 64, -64, -64, 64, 64, 64, 64, 64, 64, -64, -64, -64, 64, -64, 64, 64, 64, 64, 64, 64, 64, 64, 64, 64, 64, 64, 64, 64, 64, 64, 64, 64, 64, 64, 64, 64, -64, -64, 64, 64, 64, 64, -64, 64, 64, 64, 64, -64, 64, 64, 64, 64, 64, 64, -64, -64, -64, -64, 64, 64, -64, -64, 64, -64, -64, -64, -64, -64, 64, 64, 64, 64, 64, 64, 64, 64, 64, 64, 64, 64, 64, 64, -64, -64, -64, 64, -64, 64, 64, 64, -64, -64, -64, -64, -64, 64, -64, 64, 64, 64, 64, 64, 64, 64, 64, 64, 64, 64, -64, -64, -64, 64, 64, 64, -64, -64, 64, -64, 64, 64, -64, -64, -64, -64, -64, 64, 64, 64, -64, 64, 64, 64, 64, 64, 64, 64, -64, 64, -64, 64, 64, 64, 64, -64, -64, 64, 64, 64, -64, -64, -64, -64, -64, -64, 64, 64, -64, 64, 64, -64, -64, 64, -64, 64, -64, -64, 64, 64, 64, 64, -64, 64, -64, 64, 64, 64, 64, -64, -64, -64, -64, -64, 64, -64, 64, -64, 64, -64, 64, 64, -64, -64, 64, 64, 64, -64, 64, 64, 64, 64, -64, 64, 64, -64, 64, 64, -64, 64, -64, 64, -64, -64, 64, 64, 64, 64, -64, -64, 64, -64, -64, -64, -64, 64, 64, 64, 64, 64, 64, 64, -64, -64, -64, 64, -64, 64, -64, -64, -64, 64, 64, 64, 64, 64, 64, 64, 64, 64, 64, -64, -64, 64, 64, 64, 64, 64, 64, -64, 64, -64, 64, -64, -64, -64, 64, -64, 64, 64, 64, 64, 64, 64, 64, 64, 64, 64, 64, -64, -64, -64, 64, 64, -64, 64, -64, -64, -64, -64, -64, -64, 64, -64, 64, -64, -64, 64, 64, 64, 64, 64, 64, 64, 64, 64, 64, 64, -64, 64, 64, 64, -64, -64, -64, -64, -64, -64, 64, 64, -64, -64, -64, -64, -64, -64, -64, 64, 64, 64, -64, 64, 64, -64, -64, 64, 64, 64, -64, -64, -64, -64, -64, -64, -64, 64, 64, -64, 64, -64, -64, -64, -64, -64, -64, -64, -64, -64, -64, -64, -64, 64, -64, 64, 64, 64, 64, 64, -64, -64, -64, 64, -64, -64, 64, 64, -64, 64, -64, -64, -64, -64, -64, -64, -64, -64, -64, 64, 64, 64, 64, 64, 64, -64, 64, 64, -64, 64, 64, -64, -64, 64, -64, 64, -64, 64, 64, -64, -64, -64, 64, 64, -64, -64, 64, 64, 64, 64, 64, 64, 64, 64, 64, 64, 64, 64, 64, 64, -64, -64, 64, 64, -64, -64, 64, 64, 64, 64, 64, 64, 64, -64, -64, 64, -64, 64, 64, 64, 64, 64, 64, 64, 64, 64, 64, -64, -64, 64, -64, 64, 64, -64, 64, 64, -64, 64, 64, 64, 64, 64, -64, 64, 64, -64, 64, 64, 64, 64, 64, 64, 64, 64, -64, 64, 64, 64, 64, -64, -64, -64, 64, 64, 64, 64, 64, 64, 64, -64, -64, 64, 64, -64, 64, 64, 64, 64, 64, 64, 64, 64, 64, 64, 64, -64, 64, 64, 64, 64, -64, -64, 64, -64, 64, -64, -64, -64, 64, 64, 64, 64, 64, 64, 64, -64, 64, 64, 64, 64, 64, -64, 64, -64, 64, -64, -64, -64, 64, -64, -64, 64, -64, -64, 64, 64, -64, -64, -64, 64, -64, 64, 64, -64, 64, 64, -64, 64, -64, 64, 64, 64, -64, 64, 64, 64, -64, 64, -64, -64, 64, 64, -64, 64, -64, -64, 64, 64, -64, 64, 64, 64, 64, 64, -64, -64, -64, -64, -64, 64, 64, 64, -64, -64, -64, 64, 64, 64, -64, -64, -64, 64, 64, -64, 64, 64, 64, 64, -64, 64, 64, 64, -64, 64, -64, -64, -64, 64, 64, -64, 64, 64, 64, -64, -64, -64, 64, 64, -64, 64, 64, -64, -64, -64, -64, 64, 64, -64, 64, 64, 64, -64, 64, -64, 64, -64, -64, 64, 64, -64, 64, 64, -64, -64, -64, -64, -64, -64, -64, 64, -64, -64, -64, -64, -64, -64, -64, -64, 64, -64, -64, 64, 64, -64, -64, 64, -64, -64, -64, 64, 64, -64, -64, -64, -64, -64, -64, 64, -64, -64, -64, -64, -64, -64, -64, -64, -64, -64, 64, -64, 64, 64, -64, -64, 64, -64, -64, 64, -64, -64, 64, -64, -64, -64, 64, -64, -64, -64, -64, -64, -64, -64, -64, -64, 64, 64, -64, -64, -64, 64, 64, 64, -64, 64, 64, 64, -64, 64, -64, -64, 64, 64, 64, -64, -64, -64, -64, -64, -64, -64, -64, 64, -64, -64, -64, 64, 64, -64, 64, 64, 64, 64, 64, -64, 64, -64, 64, 64, -64, -64, 64, -64, 64, 64, 64, 64, -64, 64, 64, 64, -64, 64, -64, 64, -64, -64, -64, 64, -64, -64, 64, 64, 64, 64, 64, 64, 64, -64, 64, 64, 64, 64, 64, 64, 64, 64, 64, -64, -64, -64, 64, 64, -64, -64, -64, 64, 64, 64, -64, -64, 64, 64, 64, 64, -64, -64, 64, 64, 64, 64, 64, 64, 64, 64, 64, 64, -64, -64, -64, -64, 64, 64, -64, 64, 64, 64, 64, -64, -64, -64, 64, 64, 64, -64, -64, -64, -64, -64, -64, 64, -64, 64, 64, -64, -64, -64, -64, -64, -64, 64, -64, 64, -64, 64, -64, -64, -64, -64, 64, 64, -64, -64, 64, -64, -64, -64, -64, -64, 64, 64, 64, -64, -64, 64, -64, -64, -64, 64, 64, 64, -64, -64, 64, -64, -64, 64, -64, -64, -64, -64, -64, -64, -64, -64, -64, -64, 64, 64, -64, -64, -64, 64, -64, -64, -64, -64, -64, -64, 64, 64, 64, -64, 64, -64, 64, 64, 64, -64, -64, -64, -64, -64, -64, -64, 64, -64, -64, -64, -64, 64, -64, -64, -64, 64, 64, 64, -64, 64, 64, 64, 64, -64, 64, -64, -64, -64, -64, -64, -64, -64, -64, 64, 64, -64, 64, -64, 64, -64, -64, -64, -64, 64, 64, -64, -64, 64, 64, -64, -64, -64, -64, -64, -64, -64, -64, -64, -64, -64, -64, 64, -64, -64, -64, -64, -64, -64, -64, -64, -64, -64, -64, 64, 64, -64, -64, -64, -64, 64, -64, -64, -64, -64, -64, -64, -64, -64, -64, 64, -64, -64, -64, -64, -64, -64, -64, -64, -64, 64, 64, -64, -64, -64, -64, -64, -64, 64, -64, -64, -64, -64, -64, -64, -64, -64, -64, -64, -64, -64, -64, -64, -64, -64, -64, 64, 64, 64, -64, 64, -64, 64, -64, -64, -64, -64, -64, -64, -64, -64, -64, -64, 64, -64, 64, -64, -64, -64, 64, -64, -64, -64, -64, -64, -64, 64, -64, 64, 64, -64, -64, 64, 64, -64, -64, -64, -64, -64, 64, -64, 64, -64, 64, -64, -64, -64, -64, -64, -64, -64, -64, 64, -64, 64, 64, -64, 64, 64, -64, 64, -64, 64, -64, -64, -64, 64, 64, -64, 64, 64, 64, -64, -64, -64, 64, -64, -64, -64, -64, -64, 64, -64, -64, -64, -64, -64, -64, -64, -64, -64, 64, -64, 64, -64, 64, 64, -64, 64, 64, -64, -64, -64, -64, -64, 64, -64, -64, 64, -64, -64, -64, 64, 64, -64, -64, -64, -64, -64, -64, -64, 64, 64, 64, -64, -64, 64, 64, -64, -64, -64, -64, -64, -64, -64, -64, 64, -64, 64, -64, -64, 64, -64, -64, 64, 64, 64, -64, 64, 64, 64, -64, -64, -64, 64, 64, -64, -64, 64, -64, 64, -64, -64, 64, 64, -64, 64, -64, -64, -64, -64, -64, 64, 64, 64, 64, 64, 64, 64, 64, 64, 64, 64, 64, -64, 64, -64, 64, 64, -64, -64, -64, 64, -64, 64, -64, -64, 64, 64, -64, 64, -64, 64, 64, 64, 64, 64, 64, 64, 64, 64, 64, 64, 64, -64, 64, -64, -64, -64, -64, -64, -64, -64, -64, -64, -64, -64, -64, -64, -64, 64, 64, 64, 64, 64, 64, 64, 64, -64, 64, 64, -64, 64, 64, -64, -64, 64, -64, 64, 64, -64, -64, -64, -64, 64, -64, -64, -64, -64, 64, 64, -64, -64, 64, 64, 64, 64, -64, -64, 64, 64, -64, -64, 64, 64, -64, 64, -64, 64, -64, -64, 64, 64, -64, -64, 64, 64, 64, 64, -64, -64, 64, -64, -64, -64, 64, 64, -64, -64, 64, -64, -64, 64, 64, 64, -64, 64, 64, -64, 64, -64, 64, 64, 64, -64, 64, 64, 64, -64, 64, 64, 64, 64, -64, -64, -64, -64, -64, 64, 64, -64, -64, 64, -64, 64, 64, 64, 64, -64, 64, -64, 64, -64, -64, -64, -64, -64, -64, -64, -64, -64, -64, -64, 64, 64, 64, -64, -64, -64, 64, -64, 64, 64, -64, 64, 64, -64, -64, -64, -64, 64, -64, -64, -64, -64, -64, -64, -64, -64, -64, -64, 64, 64, 64, 64, -64, -64, 64, 64, -64, -64, 64, 64, 64, -64, 64, 64, -64, -64, -64, -64, -64, -64, -64, -64, -64, -64, -64, 64, -64, 64, -64, 64, 64, 64, -64, 64, 64, 64, 64, 64, -64, -64, 64, 64, -64, -64, -64, -64, -64, -64, -64, -64, -64, 64, 64, 64, 64, -64, -64, -64, 64, 64, 64, 64, 64, 64, 64, -64, 64, 64, 64, 64, 64, 64, 64, 64, -64, 64, -64, -64, 64, 64, 64, 64, -64, 64, 64, 64, 64, 64, 64, 64, -64, 64, 64, -64, 64, -64, 64, 64, 64, 64, -64, -64, -64, 64, 64, 64, 64, 64, 64, 64, -64, -64, 64, 64, 64, 64, 64, -64, 64, 64, 64, 64, -64, 64, 64, 64, 64, 64, -64, -64, 64, 64, 64, 64, 64, 64, 64, 64, 64, -64, 64, 64, 64, 64, 64, -64, -64, 64, 64, 64, -64, 64, 64, 64, 64, 64, -64, 64, 64, 64, 64, 64, 64, 64, 64, 64, -64, 64, 64, 64, 64, -64, -64, 64, -64, 64, 64, -64, -64, -64, -64, 64, -64, -64, 64, -64, 64, 64, 64, 64, 64, 64, 64, -64, -64, 64, 64, 64, 64, -64, -64, 64, -64, -64, 64, 64, 64, 64, -64, 64, 64, 64, 64, 64, 64, 64, 64, 64, 64, 64, 64, 64, 64, 64, 64, 64, 64, -64, -64, -64, 64, 64, -64, 64, 64, 64, -64, 64, 64, 64, 64, 64, 64, 64, 64, 64, 64, 64, 64, 64, 64, 64, 64, 64, 64, 64, -64, 64, -64, 64, -64, -64, -64, -64, 64, 64, 64, 64, 64, 64, 64, 64, 64, 64, -64, 64, 64, 64, 64, 64, -64, 64, 64, 64, -64, 64, 64, 64, -64, -64, -64, -64, -64, -64, -64, 64, 64, -64, 64, 64, -64, -64, -64, -64, 64, -64, 64, 64, 64, 64, 64, 64, -64, -64, 64, -64, -64, -64, -64, -64, 64, 64, 64, -64, 64, 64, 64, -64, -64, -64, -64, 64, 64, -64, 64, -64, 64, 64, 64, 64, -64, 64, 64, 64, -64, -64, 64, -64, -64, -64, -64, 64, 64, -64, -64, 64, -64, 64, -64, -64, -64, 64, -64, 64, 64, 64, 64, -64, 64, 64, 64, -64, -64, 64, -64, 64, 64, 64, 64, -64, 64, -64, 64, -64, -64, -64, 64, -64, 64, 64, 64, 64, 64, 64, 64, -64, 64, 64, 64, -64, -64, 64, -64, 64, 64, -64, -64, -64, 64, 64, 64, -64, -64, -64, -64, 64, 64, 64, -64, -64, 64, 64, -64, 64, -64, -64, -64, 64, -64, -64, 64, 64, 64, -64, 64, 64, 64, 64, -64, -64, -64, -64, -64, 64, 64, -64, -64, -64, -64, -64, -64, -64, -64, -64, 64, -64, -64, -64, 64, 64, -64, -64, 64, 64, 64, 64, 64, -64, -64, -64, -64, 64, -64, -64, -64, -64, -64, -64, -64, -64, -64, -64, -64, 64, 64, -64, 64, -64, 64, 64, 64, -64, 64, 64, 64, 64, -64, 64, 64, -64, 64, -64, -64, -64, -64, -64, -64, -64, -64, -64, 64, -64, 64, -64, 64, 64, 64, -64, -64, 64, -64, 64, 64, 64, -64, 64, 64, -64, -64, -64, 64, -64, 64, -64, 64, 64, 64, -64, -64, -64, 64, -64, -64, -64, 64, -64, 64, 64, 64, 64, 64, 64, 64, 64, 64, 64, 64, 64, 64, 64, 64, 64, -64, -64, -64, -64, -64, 64, 64, -64, -64, 64, 64, 64, 64, 64, 64, 64, 64, 64, 64, 64, 64, 64, 64, 64, 64, 64, 64, 64, -64, -64, 64, -64, -64, 64, -64, -64, -64, -64, 64, 64, 64, 64, 64, 64, 64, 64, 64, -64, 64, -64, 64, -64, -64, 64, -64, 64, -64, -64, -64, 64, -64, 64, 64, -64, -64, -64, 64, -64, 64, 64, -64, -64, 64, -64, 64, 64, 64, -64, 64, 64, 64, 64, -64, 64, 64, 64, -64, -64, 64, 64, -64, 64, 64, -64, 64, 64, 64, -64, -64, 64, 64, 64, -64, 64, -64, -64, 64, 64, 64, 64, 64, -64, -64, -64, 64, -64, 64, 64, 64, -64, -64, 64, -64, 64, 64, 64, 64, 64, 64, 64, -64, 64, -64, 64, -64, 64, 64, -64, -64, 64, 64, 64, 64, 64, 64, 64, 64, 64, -64, -64, 64, -64, -64, 64, -64, -64, 64, 64, 64, 64, 64, 64, 64, -64, -64, 64, -64, 64, 64, 64, 64, 64, -64, 64, 64, 64, 64, -64, 64, 64, -64, -64, -64, -64, -64, 64, -64, 64, -64, 64, 64, -64, 64, -64, -64, 64, -64, 64, 64, -64, 64, -64, -64, 64, 64, -64, 64, 64, -64, -64, 64, 64, -64, -64, -64, -64, 64, -64, -64, 64, -64, -64, 64, -64, -64, 64, 64, 64, -64, -64, -64, 64, 64, -64, 64, 64, 64, -64, 64, -64, 64, 64, -64, -64, 64, 64, -64, 64, -64, -64, -64, 64, -64, -64, -64, 64, -64, 64, 64, 64, 64, -64, 64, 64, 64, 64, 64, -64, 64, 64, -64, -64, 64, -64, 64, -64, -64, -64, -64, 64, 64, -64, 64, -64, -64, -64, -64, 64, 64, 64, -64, -64, 64, 64, 64, 64, -64, 64, 64, -64, -64, -64, -64, -64, -64, -64, -64, -64, -64, 64, -64, 64, -64, 64, 64, -64, 64, 64, 64, 64, 64, 64, 64, -64, -64, 64, 64, -64, 64, 64, -64, -64, -64, 64, 64, -64, -64, -64, 64, 64, 64, -64, -64, 64, -64, -64, -64, 64, -64, -64, -64, -64, 64, -64, -64, -64, -64, -64, -64, -64, -64, -64, 64, -64, -64, -64, -64, -64, -64, -64, 64, -64, 64, -64, -64, -64, -64, -64, -64, -64, -64, 64, -64, 64, -64, -64, 64, -64, 64, -64, -64, -64, 64, 64, 64, -64, -64, -64, -64, 64, -64, 64, -64, -64, -64, -64, -64, 64, 64, 64, -64, 64, -64, -64, -64, -64, -64, -64, -64, 64, 64, 64, -64, -64, -64, 64, 64, -64, -64, 64, 64, -64, -64, -64, -64, -64, 64, 64, -64, -64, 64, -64, -64, -64, 64, -64, -64, 64, 64, 64, 64, -64, -64, -64, -64, -64, 64, 64, -64, 64, -64, -64, 64, -64, 64, -64, -64, 64, -64, -64, 64, 64, -64, -64, 64, -64, -64, 64, 64, 64, -64, -64, -64, 64, 64, -64, 64, 64, -64, -64, -64, -64, -64, -64, -64, -64, 64, -64, -64, -64, 64, -64, -64, -64, -64, -64, -64, 64, -64, -64, -64, 64, -64, -64, 64, -64, 64, -64, -64, -64, -64, -64, -64, -64, 64, 64, -64, 64, -64, 64, 64, -64, 64, -64, -64, -64, 64, 64, 64, 64, -64, -64, 64, 64, -64, -64, -64, -64, -64, -64, -64, -64, -64, 64, -64, -64, 64, -64, -64, 64, -64, 64, -64, -64, -64, 64, -64, -64, 64, 64, -64, -64, -64, -64, 64, 64, -64, -64, -64, 64, -64, -64, -64, -64, -64, -64, -64, 64, 64, 64, -64, -64, -64, 64, 64, 64, 64, -64, -64, -64, -64, -64, -64, 64, -64, -64, 64, -64, -64, -64, 64, -64, 64, 64, -64, 64, -64, -64, -64, -64, -64, -64, 64, -64, 64, 64, -64, -64, -64, -64, -64, -64, 64, -64, -64, -64, -64, -64, -64, -64, -64, -64, -64, -64, -64, -64, -64, -64, 64, -64, 64, 64, -64, 64, -64, -64, -64, -64, -64, -64, -64, -64, -64, -64, -64, -64, -64, -64, -64, -64, 64, 64, -64, -64, -64, -64, -64, 64, 64, 64, 64, 64, -64, -64, 64, -64, 64, -64, -64, -64, -64, -64, -64, -64, 64, -64, -64, -64, -64, -64, -64, -64, -64, 64, 64, -64, -64, -64, 64, -64, -64, -64, 64, -64, -64, -64, 64, -64, -64, -64, 64, -64, 64, 64, 64, -64, -64, 64, -64, -64, -64, -64, -64, -64, 64, 64, -64, -64, 64, -64, 64, -64, -64, 64, 64, 64, -64, 64, 64, -64, 64, 64, 64, 64, -64, -64, -64, -64, -64, 64, -64, -64, 64, 64, -64, -64, 64, 64, 64, 64, 64, -64, -64, -64, 64, -64, -64, 64, -64, 64, -64, -64, -64, -64, -64, -64, -64, -64, -64, -64, 64, 64, -64, 64, 64, -64, -64, 64, 64, -64, -64, 64, 64, 64, 64, 64, 64, -64, -64, -64, -64, -64, 64, -64, -64, -64, 64, -64, 64, -64, -64, 64, 64, 64, -64, 64, 64, 64, -64, 64, 64, 64, 64, 64, 64, -64, -64, -64, -64, -64, -64, -64, -64, -64, -64, -64, -64, -64, 64, 64, 64, -64, 64, -64, 64, -64, -64, -64, 64, 64, -64, 64, -64, -64, -64, -64, 64, -64, -64, 64, -64, 64, -64, -64, 64, -64, -64, -64, -64, -64, -64, -64, -64, 64, -64, 64, 64, 64, -64, -64, 64, -64, 64, 64, 64, 64, 64, 64, 64, 64, 64, 64, -64, -64, -64, -64, -64, -64, 64, -64, -64, 64, -64, -64, 64, -64, 64, -64, -64, 64, 64, 64, -64, 64, 64, 64, 64, -64, -64, -64, 64, -64, -64, -64, 64, -64, 64, -64, -64, 64, 64, 64, -64, 64, 64, -64, 64, 64, -64, -64, -64, 64, -64, -64, 64, 64, 64, -64, -64, -64, 64, 64, -64, 64, -64, 64, 64, 64, 64, -64, -64, 64, -64, 64, 64, 64, -64, 64, 64, 64, 64, 64, 64, 64, 64, 64, -64, -64, -64, -64, 64, -64, -64, 64, -64, -64, 64, 64, 64, 64, 64, 64, 64, 64, 64, -64, 64, 64, -64, 64, 64, 64, 64, 64, -64, -64, 64, 64, 64, 64, 64, 64, -64, -64, 64, -64, 64, -64, -64, 64, -64, 64, 64, -64, -64, -64, 64, 64, 64, 64, 64, -64, -64, 64, 64, 64, -64, -64, -64, 64, 64, 64, 64, -64, -64, -64, 64, 64, -64, 64, 64, -64, -64, 64, 64, 64, 64, 64, -64, -64, 64, 64, 64, -64, -64, 64, 64, 64, -64, 64, 64, 64, 64, -64, -64, 64, 64, 64, 64, 64, -64, -64, 64, 64, 64, 64, -64, -64, -64, 64, -64, -64, 64, -64, -64, -64, -64, 64, 64, 64, 64, -64, -64, 64, 64, 64, 64, 64, 64, 64, 64, 64, 64, 64, 64, 64, 64, -64, 64, -64, -64, -64, -64, -64, 64, 64, 64, 64, 64, 64, 64, 64, 64, 64, 64, -64, -64, 64, 64, 64, 64, 64, 64, 64, -64, -64, 64, 64, -64, -64, -64, -64, 64, 64, 64, 64, 64, -64, 64, -64, 64, -64, -64, -64, -64, 64, 64, 64, 64, 64, 64, -64, -64, 64, -64, 64, -64, -64, -64, 64, 64, 64, 64, 64, 64, 64, -64, -64, 64, -64, -64, -64, 64, 64, 64, 64, 64, -64, 64, -64, 64, 64, -64, -64, -64, -64, 64, 64, 64, 64, 64, 64, -64, -64, -64, -64, -64, 64, 64, -64, 64, 64, 64, 64, 64, -64, 64, -64, 64, -64, -64, -64, -64, -64, 64, 64, 64, 64, 64, 64, -64, -64, -64, 64, 64, 64, 64, 64, 64, 64, -64, 64, -64, 64, -64, 64, -64, 64, 64, 64, -64, -64, 64, 64, 64, 64, -64, -64, -64, -64, -64, 64, 64, 64, 64, 64, 64, 64, 64, 64, 64, 64, -64, 64, 64, -64, 64, 64, -64, -64, 64, 64, 64, 64, 64, -64, -64, 64, 64, 64, 64, 64, 64, 64, 64, 64, 64, 64, 64, 64, -64, 64, -64, 64, 64, -64, -64, -64, -64, 64, 64, 64, 64, 64, 64, 64, 64, 64, 64, -64, 64, 64, 64, -64, -64, -64, 64, -64, -64, 64, -64, -64, -64, -64, -64, -64, 64, -64, 64, 64, -64, 64, -64, 64, 64, 64, 64, 64, 64, 64, 64, -64, -64, -64, -64, -64, 64, 64, 64, 64, -64, -64, -64, -64, -64, -64, 64, -64, 64, 64, 64, 64, -64, 64, -64, -64, 64, 64, -64, -64, -64, -64, -64, -64, 64, 64, -64, 64, -64, -64, -64, -64, -64, -64, 64, -64, 64, -64, -64, 64, -64, 64, -64, -64, 64, 64, -64, -64, -64, -64, -64, 64, 64, -64, -64, 64, 64, -64, 64, -64, 64, 64, 64, 64, 64, 64, 64, 64, 64, 64, -64, -64, -64, 64, 64, 64, -64, -64, -64, -64, -64, 64, -64, 64, -64, 64, -64, 64, 64, 64, -64, -64, 64, -64, 64, 64, 64, 64, 64, 64, 64, 64, 64, -64, -64, -64, 64, -64, -64, -64, -64, 64, 64, -64, 64, 64, -64, -64, 64, 64, 64, 64, 64, -64, 64, 64, -64, -64, 64, -64, -64, -64, -64, -64, 64, 64, -64, 64, 64, -64, 64, -64, -64, -64, -64, 64, 64, 64, 64, 64, 64, 64, 64, 64, 64, -64, 64, -64, -64, -64, -64, 64, 64, -64, 64, 64, -64, 64, -64, -64, 64, -64, 64, 64, -64, 64, 64, 64, 64, 64, 64, 64, 64, 64, -64, -64, -64, -64, -64, 64, -64, 64, 64, -64, -64, -64, 64, 64, -64, -64, -64, -64, -64, -64, 64, -64, 64, 64, 64, 64, 64, 64, 64, -64, -64, -64, 64, 64, 64, -64, -64, 64, -64, 64, -64, 64, 64, -64, 64, 64, -64, 64, 64, 64, 64, 64, -64, -64, 64, 64, 64, -64, -64, 64, 64, 64, -64, 64, 64, -64, -64, 64, 64, 64, 64, -64, -64, -64, 64, 64, 64, 64, 64, 64, 64, 64, 64, -64, -64, 64, 64, 64, 64, 64, -64, 64, 64, 64, -64, 64, 64, -64, -64, 64, 64, 64, 64, 64, 64, 64, -64, 64, -64, 64, -64, 64, 64, 64, 64, -64, -64, 64, 64, -64, -64, 64, -64, -64, -64, -64, 64, -64, 64, 64, -64, -64, 64, 64, -64, -64, 64, -64, -64, -64, -64, -64, -64, -64, 64, -64, -64, -64, 64, 64, -64, 64, -64, 64, 64, 64, 64, 64, 64, 64, -64, 64, 64, 64, -64, -64, 64, 64, 64, -64, -64, 64, 64, 64, -64, -64, -64, 64, 64, -64, 64, -64, 64, -64, 64, -64, 64, -64, -64, 64, 64, 64, -64, 64, -64, 64, -64, -64, -64, 64, 64, 64, 64, 64, 64, -64, 64, -64, 64, 64, 64, 64, 64, 64, 64, 64, 64, 64, 64, 64, 64, 64, 64, 64, -64, 64, -64, -64, -64, -64, 64, 64, -64, 64, -64, -64, 64, 64, 64, 64, -64, 64, 64, 64, 64, 64, 64, 64, 64, 64, 64, 64, 64, 64, 64, -64, -64, -64, 64, 64, -64, -64, -64, -64, -64, 64, 64, 64, 64, 64, 64, 64, 64, -64, -64, -64, -64, -64, 64, 64, 64, -64, -64, -64, -64, 64, 64, 64, 64, 64, 64, -64, -64, 64, 64, -64, 64, 64, 64, 64, -64, -64, -64, -64, -64, -64, -64, -64, 64, 64, 64, -64, 64, 64, 64, -64, -64, 64, -64, -64, 64, 64, -64, -64, 64, 64, -64, 64, 64, 64, 64, -64, -64, -64, -64, -64, -64, 64, 64, -64, -64, -64, -64, -64, -64, -64, -64, 64, -64, -64, -64, -64, 64, -64, 64, 64, 64, 64, 64, -64, -64, -64, -64, -64, -64, -64, -64, -64, -64, -64, -64, -64, -64, 64, 64, -64, -64, -64, -64, -64, 64, -64, 64, 64, 64, 64, -64, -64, -64, -64, -64, -64, -64, -64, -64, -64, -64, -64, -64, -64, -64, 64, -64, -64, 64, -64, 64, -64, -64, 64, 64, 64, -64, -64, -64, -64, -64, -64, 64, -64, -64, -64, -64, -64, -64, -64, -64, -64, 64, -64, -64, 64, 64, -64, 64, -64, 64, 64, -64, -64, -64, -64, -64, -64, -64, -64, 64, 64, 64, -64, -64, -64, -64, -64, -64, 64, 64, -64, -64, 64, 64, 64, 64, -64, -64, -64, -64, -64, -64, -64, -64, -64, 64, 64, 64, 64, 64, 64, 64, -64, -64, 64, 64, 64, 64, 64, 64, 64, 64, -64, -64, -64, -64, -64, -64, -64, -64, -64, -64, -64, 64, 64, 64, -64, 64, 64, -64, -64, 64, 64, -64, 64, 64, 64, 64, 64, 64, -64, -64, -64, -64, -64, -64, -64, -64, -64, -64, -64, 64, 64, 64, -64, 64, -64, -64, 64, 64, 64, -64, 64, 64, 64, 64, 64, 64, 64, 64, 64, 64, -64, -64, -64, -64, -64, -64, 64, 64, -64, -64, -64, -64, 64, 64, -64, 64, 64, 64, 64, -64, 64, 64, -64, 64, -64, -64, -64, -64, -64, -64, -64, -64, -64, 64, 64, 64, -64, -64, -64, -64, 64, 64, 64, 64, 64, 64, 64, -64, 64, 64, 64, 64, 64, 64, -64, -64, -64, -64, -64, -64, -64, -64, 64, -64, 64, -64, -64, -64, -64, -64, -64, -64, 64, 64, 64, 64, 64, 64, 64, 64, 64, 64, 64, -64, 64, -64, -64, 64, 64, -64, -64, -64, -64, -64, -64, 64, 64, 64, 64, 64, 64, 64, 64, -64, 64, 64, -64, 64, 64, 64, 64, -64, -64, -64, 64, 64, 64, 64, -64, 64, -64, -64, -64, 64, 64, 64, 64, 64, 64, 64, -64, 64, -64, -64, 64, -64, 64, -64, 64, 64, 64, 64, -64, 64, 64, 64, 64, 64, 64, -64, 64, 64, 64, 64, 64, 64, 64, 64, 64, -64, -64, -64, 64, -64, 64, 64, 64, 64, 64, 64, 64, 64, 64, 64, 64, -64, -64, 64, 64, 64, 64, 64, 64, 64, -64, -64, 64, -64, 64, 64, 64, 64, 64, -64, 64, 64, -64, -64, -64, 64, -64, 64, -64, -64, 64, 64, 64, 64, 64, -64, -64, -64, -64, -64, -64, 64, 64, -64, 64, 64, 64, -64, 64, 64, -64, -64, 64, 64, -64, -64, 64, -64, 64, -64, -64, 64, -64, -64, 64, -64, -64, -64, -64, 64, 64, 64, 64, -64, -64, 64, -64, -64, 64, -64, -64, 64, -64, -64, -64, -64, -64, -64, -64, -64, -64, -64, 64, 64, -64, -64, -64, 64, -64, 64, 64, 64, -64, 64, -64, -64, -64, -64, 64, -64, -64, -64, 64, -64, -64, -64, -64, 64, 64, -64, 64, 64, 64, -64, -64, 64, 64, 64, -64, 64, -64, 64, 64, -64, 64, 64, -64, 64, -64, -64, 64, 64, -64, 64, 64, 64, 64, 64, 64, -64, -64, 64, -64, 64, 64, -64, -64, -64, -64, -64, 64, -64, -64, -64, 64, 64, 64, 64, -64, -64, 64, 64, -64, 64, 64, -64, 64, 64, 64, -64, 64, -64, -64, -64, -64, -64, -64, -64, -64, 64, -64, -64, 64, -64, 64, 64, 64, -64, 64, 64, -64, 64, -64, 64, 64, -64, -64, 64, 64, -64, -64, -64, -64, -64, 64, 64, 64, -64, -64, 64, -64, 64, -64, -64, 64, 64, -64, 64, -64, 64, 64, 64, -64, 64, 64, 64, -64, 64, 64, 64, -64, -64, -64, -64, -64, -64, 64, 64, 64, -64, -64, -64, -64, -64, -64, -64, 64, 64, -64, -64, -64, 64, 64, -64, 64, 64, -64, -64, -64, -64, -64, -64, -64, -64, -64, -64, 64, -64, -64, -64, -64, -64, 64, -64, -64, -64, 64, -64, 64, -64, -64, 64, -64, 64, -64, -64, 64, -64, -64, -64, -64, -64, -64, 64, -64, -64, 64, -64, 64, -64, 64, -64, -64, -64, 64, -64, 64, 64, -64, -64, -64, 64, -64, 64, -64, 64, 64, -64, -64, 64, 64, -64, 64, 64, -64, -64, -64, -64, 64, -64, -64, 64, -64, 64, 64, -64, 64, -64, 64, -64, -64, 64, -64, -64, 64, 64, 64, -64, 64, -64, -64, -64, -64, -64, -64, -64, -64, -64, -64, 64, 64, -64, 64, -64, 64, 64, -64, -64, 64, -64, 64, -64, -64, -64, 64, -64, -64, -64, -64, 64, 64, -64, -64, -64, -64, -64, -64, -64, 64, -64, 64, -64, -64, -64, 64, -64, 64, 64, -64, 64, -64, -64, -64, -64, -64, -64, -64, 64, -64, -64, -64, -64, -64, -64, -64, -64, 64, -64, -64, -64, -64, -64, -64, -64, 64, 64, 64, 64, -64, -64, 64, 64, -64, -64, -64, 64, -64, -64, -64, -64, -64, -64, -64, -64, -64, 64, 64, -64, -64, -64, -64, -64, -64, -64, -64, -64, -64, 64, -64, 64, 64, -64, -64, 64, -64, -64, -64, -64, -64, -64, -64, -64, 64, -64, -64, 64, -64, -64, -64, -64, -64, -64, 64, 64, -64, 64, 64, 64, -64, -64, 64, -64, -64, -64, -64, -64, -64, -64, -64, -64, 64, -64, 64, -64, -64, -64, -64, -64, -64, -64, 64, 64, -64, 64, -64, -64, 64, -64, 64, -64, 64, 64, -64, 64, -64, -64, 64, -64, 64, 64, 64, -64, -64, -64, -64, -64, 64, 64, 64, 64, -64, 64, -64, -64, 64, 64, -64, -64, -64, -64, 64, -64, -64, -64, -64, -64, 64, 64, -64, 64, -64, -64, -64, -64, 64, 64, -64, 64, 64, -64, 64, -64, -64, 64, -64, 64, 64, -64, 64, 64, 64, -64, -64, 64, 64, -64, -64, -64, -64, -64, -64, 64, 64, 64, 64, 64, -64, -64, -64, 64, -64, -64, 64, -64, 64, 64, 64, 64, 64, 64, -64, -64, 64, 64, -64, -64, -64, -64, 64, 64, -64, -64, -64, 64, 64, -64, 64, -64, -64, 64, 64, -64, -64, 64, -64, -64, 64, 64, -64, -64, 64, -64, 64, -64, -64, -64, 64, -64, -64, 64, -64, -64, 64, -64, 64, 64, -64, 64, 64, 64, 64, -64, -64, -64, -64, -64, -64, 64, 64, -64, -64, -64, -64, -64, -64, -64, 64, 64, -64, 64, -64, -64, -64, 64, -64, -64, 64, -64, -64, -64, 64, -64, 64, -64, 64, -64, 64, -64, -64, -64, -64, 64, 64, 64, -64, 64, -64, -64, -64, -64, 64, -64, -64, -64, 64, 64, 64, 64, -64, 64, 64, -64, -64, 64, -64, -64, -64, -64, -64, -64, -64, 64, 64, 64, 64, 64, 64, -64, 64, 64, 64, 64, -64, -64, 64, 64, -64, -64, -64, -64, -64, 64, 64, -64, 64, 64, -64, -64, 64, -64, -64, 64, 64, -64, -64, -64, 64, 64, 64, -64, -64, -64, -64, -64, -64, -64, -64, -64, 64, 64, 64, -64, 64, 64, -64, 64, 64, -64, -64, 64, -64, 64, 64, -64, -64, 64, -64, 64, -64, -64, 64, 64, -64, -64, -64, 64, -64, 64, -64, -64, -64, 64, 64, -64, 64, -64, 64, -64, 64, -64, 64, 64, -64, 64, -64, 64, -64, -64, -64, -64, -64, -64, -64, 64, -64, -64, -64, -64, -64, -64, -64, 64, -64, 64, -64, -64, 64, 64, -64, 64, -64, -64, -64, -64, -64, 64, -64, -64, -64, -64, -64, -64, 64, 64, 64, 64, 64, 64, 64, -64, 64, -64, 64, -64, 64, 64, 64, -64, -64, -64, -64, -64, -64, -64, 64, -64, 64, -64, -64, -64, -64, -64, -64, 64, 64, 64, 64, 64, 64, 64, -64, -64, 64, -64, 64, -64, -64, 64, -64, 64, -64, -64, 64, 64, 64, -64, -64, -64, 64, 64, -64, 64, 64, -64, -64, -64, -64, -64, -64, 64, -64, 64, -64, -64, -64, -64, -64, 64, 64, 64, -64, 64, -64, -64, -64, -64, -64, -64, -64, 64, 64, 64, -64, -64, -64, 64, 64, -64, -64, 64, -64, -64, 64, 64, 64, -64, 64, 64, -64, -64, 64, -64, -64, -64, 64, 64, -64, -64, -64, 64, -64, -64, 64, -64, 64, 64, 64, -64, -64, -64, 64, 64, -64, -64, 64, 64, -64, -64, 64, 64, -64, -64, -64, -64, -64, -64, 64, -64, 64, -64, 64, -64, 64, -64, -64, 64, 64, -64, 64, 64, -64, 64, -64, -64, -64, -64, 64, -64, -64, 64, -64, 64, -64, -64, 64, -64, 64, 64, -64, 64, 64, -64, -64, -64, -64, 64, 64, -64, -64, -64, -64, -64, -64, 64, -64, -64, -64, -64, -64, 64, 64, -64, -64, -64, -64, -64, -64, 64, 64, -64, -64, 64, -64, 64, 64, 64, 64, -64, -64, 64, 64, -64, 64, 64, -64, -64, -64, -64, -64, 64, -64, -64, -64, -64, -64, 64, -64, 64, -64, -64, -64, 64, -64, -64, 64, 64, -64, -64, -64, -64, -64, -64, 64, 64, 64, 64, -64, 64, -64, 64, -64, -64, -64, -64, -64, -64, -64, -64, 64, 64, -64, -64, -64, 64, -64, -64, 64, -64, -64, -64, -64, -64, -64, -64, -64, 64, -64, -64, -64, -64, -64, 64, 64, -64, 64, -64, 64, -64, 64, 64, 64, -64, 64, -64, 64, -64, -64, -64, -64, -64, -64, -64, 64, 64, -64, -64, -64, 64, 64, -64, 64, -64, -64, 64, 64, 64, 64, 64, 64, -64, -64, -64, -64, -64, -64, -64, 64, -64, -64, -64, 64, 64, 64, 64, 64, -64, -64, 64, 64, 64, -64, 64, -64, 64, 64, 64, 64, -64, -64, -64, -64, -64, 64, 64, -64, 64, -64, 64, -64, 64, 64, 64, 64, 64, -64, -64, 64, 64, 64, -64, -64, 64, -64, -64, -64, -64, -64, -64, 64, -64, -64, -64, 64, 64, 64, 64, -64, -64, -64, -64, -64, -64, -64, -64, 64, 64, 64, 64, 64, 64, 64, -64, -64, -64, -64, -64, -64, -64, 64, 64, 64, 64, -64, 64, -64, -64, -64, -64, -64, -64, -64, -64, 64, -64, 64, 64, 64, 64, -64, -64, -64, -64, -64, 64, -64, 64, 64, -64, -64, 64, -64, -64, -64, -64, -64, -64, -64, -64, -64, 64, 64, -64, -64, 64, -64, 64, -64, -64, -64, -64, -64, 64, -64, 64, -64, -64, -64, 64, -64, -64, -64, -64, -64, -64, -64, -64, 64, -64, 64, 64, 64, -64, 64, -64, 64, -64, -64, -64, -64, -64, -64, -64, -64, -64, -64, -64, 64, -64, -64, -64, 64, -64, -64, -64, -64, 64, -64, 64, 64, -64, -64, -64, -64, 64, -64, -64, -64, 64, -64, 64, -64, -64, 64, -64, -64, 64, -64, 64, 64, -64, -64, 64, -64, 64, 64, 64, 64, 64, -64, 64, -64, 64, -64, -64, -64, -64, -64, -64, -64, -64, -64, 64, -64, 64, 64, 64, -64, -64, 64, 64, -64, 64, 64, -64, 64, 64, -64, 64, 64, 64, -64, 64, -64, 64, -64, -64, -64, 64, 64, 64, 64, -64, -64, 64, -64, 64, 64, 64, 64, -64, -64, -64, 64, -64, 64, -64, 64, 64, -64, 64, 64, 64, 64, 64, 64, 64, -64, -64, -64, -64, 64, -64, -64, -64, -64, -64, 64, -64, 64, 64, -64, -64, -64, 64, 64, 64, -64, -64, -64, 64, 64, -64, -64, 64, -64, -64, -64, -64, 64, 64, 64, -64, -64, 64, 64, -64, 64, 64, -64, 64, -64, 64, -64, 64, -64, -64, -64, -64, -64, -64, 64, -64, -64, -64, -64, -64, 64, 64, -64, -64, -64, -64, 64, -64, 64, 64, -64, -64, 64, 64, -64, -64, -64, -64, -64, 64, -64, -64, -64, -64, -64, -64, -64, -64, 64, -64, -64, -64, 64, -64, 64, -64, -64, -64, -64, 64, -64, -64, -64, -64, -64, 64, 64, -64, 64, -64, -64, -64, 64, -64, 64, 64, 64, -64, -64, 64, -64, -64, -64, -64, 64, 64, 64, -64, 64, -64, -64, -64, -64, -64, -64, 64, 64, -64, 64, -64, 64, 64, -64, -64, -64, -64, -64, -64, 64, -64, 64, 64, -64, 64, 64, 64, 64, 64, 64, 64, 64, 64, 64, -64, -64, -64, -64, -64, 64, 64, 64, 64, -64, -64, -64, 64, 64, -64, 64, 64, 64, 64, 64, 64, -64, 64, 64, -64, -64, -64, -64, 64, 64, -64, -64, 64, 64, -64, 64, 64, -64, -64, -64, 64, 64, -64, 64, 64, 64, -64, 64, -64, -64, 64, 64, -64, 64, 64, 64, 64, -64, -64, -64, -64, -64, -64, -64, -64, -64, -64, -64, -64, -64, -64, 64, -64, -64, 64, -64, 64, -64, -64, -64, 64, -64, -64, -64, -64, -64, 64, -64, 64, -64, -64, -64, -64, 64, 64, -64, -64, -64, 64, 64, -64, -64, 64, -64, 64, 64, 64, 64, 64, 64, -64, -64, -64, 64, -64, 64, 64, 64, -64, -64, 64, 64, 64, 64, -64, 64, 64, -64, 64, -64, -64, 64, 64, -64, -64, -64, -64, -64, -64, 64, -64, 64, -64, 64, 64, -64, -64, 64, 64, 64, -64, -64, 64, -64, -64, -64, 64, 64, -64, -64, -64, 64, 64, -64, -64, 64, -64, 64, -64, 64, 64, 64, 64, -64, 64, 64, 64, 64, 64, -64, 64, -64, 64, 64, 64, 64, -64, -64, -64, -64, 64, -64, 64, 64, 64, 64, 64, 64, -64, 64, 64, 64, 64, 64, 64, 64, 64, -64, -64, 64, 64, 64, 64, -64, -64, 64, -64, -64, 64, -64, 64, 64, 64, 64, 64, 64, 64, 64, 64, 64, 64, 64, 64, 64, 64, -64, -64, 64, -64, 64, -64, 64, 64, -64, 64, 64, 64, 64, 64, 64, 64, 64, 64, 64, 64, 64, 64, 64, -64, 64, -64, 64, 64, 64, -64, 64, 64, -64, -64, -64, -64, -64, 64, -64, -64, 64, 64, 64, -64, 64, 64, 64, 64, 64, 64, 64, 64, -64, -64, -64, -64, 64, -64, -64, -64, -64, -64, -64, 64, 64, 64, -64, -64, 64, 64, 64, 64, 64, 64, 64, 64, 64, 64, 64, 64, -64, -64, -64, -64, 64, 64, -64, -64, -64, -64, -64, 64, 64, -64, 64, -64, 64, 64, 64, -64, 64, -64, -64, 64, 64, 64, 64, 64, -64, -64, -64, 64, -64, 64, -64, -64, -64, -64, -64, -64, 64, 64, 64, 64, 64, 64, 64, 64, 64, -64, 64, -64, -64, 64, 64, 64, 64, 64, 64, -64, -64, -64, -64, 64, -64, -64, -64, -64, -64, -64, -64, 64, 64, -64, -64, 64, 64, -64, -64, 64, -64, 64, 64, 64, -64, 64, 64, -64, -64, 64, -64, -64, -64, -64, -64, -64, -64, -64, -64, -64, 64, 64, 64, 64, -64, -64, -64, -64, -64, 64, 64, 64, 64, -64, -64, 64, -64, -64, -64, 64, 64, -64, -64, -64, -64, -64, 64, -64, -64, -64, 64, -64, -64, -64, -64, -64, -64, -64, 64, -64, -64, 64, 64, -64, 64, 64, 64, 64, 64, 64, -64, 64, -64, -64, -64, -64, 64, -64, 64, -64, -64, -64, -64, -64, -64, -64, 64, 64, 64, 64, -64, 64, 64, 64, 64, 64, 64, -64, 64, 64, 64, -64, 64, -64, 64, 64, 64, -64, -64, 64, 64, -64, 64, 64, 64, 64, 64, 64, 64, 64, 64, 64, 64, 64, 64, 64, -64, 64, 64, 64, 64, 64, 64, 64, -64, -64, -64, 64, 64, 64, 64, 64, 64, 64, 64, 64, 64, -64, 64, 64, 64, 64, -64, 64, -64, -64, 64, -64, -64, 64, 64, 64, -64, 64, 64, 64, 64, 64, -64, 64, 64, -64, 64, 64, -64, -64, 64, 64, -64, 64, -64, 64, -64, 64, 64, 64, -64, -64, 64, -64, -64, 64, 64, 64, 64, -64, 64, 64, -64, -64, 64, -64, 64, 64, 64, 64, 64, 64, 64, 64, -64, -64, -64, 64, -64, 64, 64, -64, 64, 64, -64, -64, -64, 64, -64, 64, -64, -64, -64, 64, 64, 64, 64, 64, 64, 64, 64, 64, 64, 64, 64, -64, -64, 64, -64, 64, 64, 64, -64, 64, 64, 64, 64, 64, 64, -64, -64, 64, 64, 64, 64, 64, 64, 64, 64, 64, 64, -64, -64, 64, 64, -64, 64, 64, 64, 64, 64, 64, 64, 64, 64, 64, -64, -64, -64, 64, 64, 64, 64, 64, 64, -64, 64, -64, 64, -64, -64, -64, 64, 64, 64, 64, 64, 64, 64, 64, 64, 64, 64, -64, -64, -64, 64, 64, 64, 64, -64, 64, -64, -64, 64, -64, 64, -64, -64, 64, 64, 64, 64, 64, 64, 64, 64, -64, 64, 64, -64, 64, -64, -64, -64, 64, 64, 64, 64, 64, 64, 64, 64, 64, -64, 64, -64, -64, 64, -64, 64, 64, 64, -64, 64, 64, -64, -64, 64, -64, -64, 64, 64, 64, 64, 64, 64, 64, 64, -64, -64, 64, 64, 64, 64, 64, 64, -64, 64, 64, 64, 64, -64, 64, -64, -64, -64, -64, -64, 64, 64, 64, 64, 64, 64, -64, -64, -64, -64, 64, -64, 64, 64, -64, 64, 64, -64, 64, -64, 64, -64, 64, -64, -64, -64, -64, -64, -64, 64, 64, -64, -64, -64, -64, -64, -64, -64, 64, 64, 64, 64, 64, 64, -64, 64, -64, -64, 64, -64, -64, -64, -64, -64, -64, -64, -64, 64, 64, 64, 64, 64, -64, -64, -64, -64, -64, 64, -64, -64, -64, 64, -64, -64, -64, -64, 64, 64, 64, 64, 64, 64, 64, 64, -64, 64, -64, 64, -64, -64, -64, -64, -64, 64, 64, 64, 64, 64, 64, 64, 64, -64, -64, 64, -64, 64, -64, 64, -64, -64, -64, 64, -64, 64, 64, 64, -64, -64, 64, -64, 64, -64, -64, -64, 64, 64, -64, -64, 64, 64, 64, 64, -64, -64, 64, 64, 64, 64, -64, -64, 64, 64, 64, 64, -64, -64, 64, 64, 64, -64, 64, 64, 64, 64, 64, -64, -64, -64, -64, 64, 64, -64, -64, -64, -64, 64, 64, -64, 64, 64, -64, -64, -64, -64, 64, 64, -64, -64, 64, 64, -64, 64, 64, 64, 64, -64, -64, -64, 64, -64, -64, 64, -64, -64, 64, -64, -64, -64, -64, -64, -64, -64, -64, 64, 64, 64, 64, -64, -64, -64, -64, 64, -64, 64, -64, 64, 64, -64, -64, -64, 64, -64, 64, -64, -64, 64, -64, -64, -64, -64, 64, 64, -64, 64, 64, 64, -64, -64, -64, -64, -64, -64, -64, -64, -64, 64, 64, 64, 64, 64, -64, 64, 64, 64, -64, 64, 64, -64, 64, -64, -64, 64, 64, -64, -64, 64, -64, -64, 64, -64, -64, -64, -64, -64, 64, 64, 64, 64, -64, 64, 64, 64, 64, 64, 64, 64, -64, 64, 64, -64, 64, 64, -64, 64, 64, -64, -64, 64, -64, -64, -64, 64, 64, 64, -64, 64, -64, 64, 64, 64, 64, 64, 64, 64, 64, 64, 64, 64, 64, -64, -64, -64, 64, 64, -64, -64, 64, 64, -64, -64, -64, 64, 64, -64, 64, 64, 64, 64, 64, 64, 64, 64, 64, 64, 64, 64, -64, -64, 64, 64, -64, 64, 64, -64, 64, 64, -64, -64, 64, 64, 64, 64, 64, 64, 64, 64, 64, 64, 64, 64, 64, 64, -64, 64, -64, -64, -64, -64, 64, 64, -64, 64, 64, 64, 64, -64, -64, 64, 64, 64, 64, 64, 64, 64, 64, 64, 64, 64, 64, 64, 64, 64, -64, 64, -64, 64, -64, 64, -64, 64, -64, -64, -64, -64, 64, -64, -64, 64, 64, 64, 64, -64, 64, 64, 64, 64, 64, 64, 64, 64, 64, -64, 64, 64, 64, 64, -64, 64, -64, 64, -64, 64, -64, -64, 64, 64, 64, 64, 64, 64, 64, 64, 64, 64, -64, 64, 64, -64, -64, -64, 64, 64, 64, -64, 64, -64, 64, -64, 64, -64, -64, 64, 64, 64, 64, 64, 64, 64, -64, 64, 64, 64, -64, 64, 64, 64, -64, 64, -64, 64, -64, -64, -64, -64, 64, 64, -64, 64, -64, 64, 64, 64, 64, 64, 64, 64, 64, -64, 64, 64, 64, 64, 64, 64, -64, 64, -64, 64, 64, -64, 64, -64, 64, 64, 64, 64, 64, 64, 64, 64, 64, 64, 64, 64, 64, -64, -64, 64, -64, 64, 64, 64, 64, 64, -64, -64, -64, -64, 64, -64, 64, -64, -64, -64, 64, 64, 64, 64, 64, -64, -64, 64, -64, 64, -64, -64, 64, 64, 64, 64, 64, 64, -64, -64, -64, 64, 64, 64, 64, 64, 64, -64, 64, 64, 64, 64, 64, 64, -64, 64, -64, 64, 64, -64, 64, 64, 64, 64, 64, 64, 64, 64, -64, 64, 64, 64, 64, 64, 64, 64, 64, 64, 64, 64, 64, 64, -64, -64, 64, -64, -64, -64, -64, 64, -64, 64, 64, -64, -64, 64, -64, -64, 64, 64, 64, 64, 64, 64, 64, 64, 64, 64, -64, 64, 64, 64, 64, 64, 64, -64, -64, 64, -64, 64, -64, 64, 64, 64, 64, 64, 64, -64, 64, 64, 64, 64, 64, 64, 64, 64, 64, 64, -64, 64, -64, 64, -64, -64, -64, 64, -64, 64, -64, 64, -64, -64, 64, 64, -64, 64, 64, 64, 64, -64, -64, 64, 64, 64, -64, 64, -64, -64, -64, 64, 64, 64, 64, 64, 64, 64, -64, -64, 64, -64, -64, -64, 64, 64, 64, 64, -64, -64, 64, 64, 64, 64, 64, -64, -64, -64, -64, 64, 64, -64, -64, -64, 64, 64, -64, 64, 64, 64, -64, -64, 64, 64, 64, -64, 64, -64, 64, 64, 64, 64, 64, -64, -64, -64, 64, -64, 64, 64, 64, 64, -64, 64, 64, -64, 64, -64, -64, -64, 64, 64, 64, -64, 64, 64, 64, 64, 64, -64, 64, 64, 64, -64, 64, 64, 64, 64, 64, -64, 64, 64, -64, -64, -64, -64, 64, 64, 64, -64, 64, -64, 64, 64, 64, -64, 64, 64, -64, 64, -64, 64, -64, 64, 64, -64, 64, -64, -64, 64, 64, -64, 64, -64, -64, 64, 64, -64, 64, -64, 64, 64, 64, -64, -64, 64, -64, -64, -64, -64, -64, -64, 64, 64, -64, 64, -64, 64, -64, -64, 64, 64, -64, 64, 64, 64, -64, -64, -64, 64, 64, 64, -64, -64, -64, -64, 64, -64, -64, -64, 64, 64, -64, 64, -64, 64, -64, 64, -64, 64, 64, -64, 64, -64, 64, -64, -64, 64, -64, 64, -64, -64, 64, -64, -64, -64, -64, 64, -64, 64, -64, -64, -64, -64, -64, 64, -64, -64, -64, 64, -64, -64, 64, 64, -64, 64, 64, 64, 64, -64, -64, 64, -64, -64, -64, -64, 64, 64, -64, 64, -64, -64, 64, 64, -64, 64, -64, -64, -64, 64, -64, 64, -64, -64, 64, -64, -64, -64, -64, -64, -64, 64, 64, -64, -64, 64, 64, 64, 64, 64, -64, -64, 64, 64, -64, -64, 64, -64, 64, -64, -64, -64, -64, -64, -64, -64, -64, -64, -64, -64, -64, -64, -64, -64, 64, -64, 64, 64, 64, -64, -64, -64, 64, -64, -64, 64, 64, 64, -64, -64, -64, -64, -64, -64, -64, -64, -64, 64, -64, -64, -64, 64, 64, -64, 64, 64, -64, -64, -64, 64, 64, 64, -64, -64, -64, -64, 64, -64, -64, -64, -64, 64, -64, -64, -64, -64, 64, 64, -64, 64, -64, -64, 64, 64, -64, -64, -64, 64, 64, -64, 64, -64, -64, -64, 64, -64, -64, -64, -64, -64, -64, -64, -64, 64, -64, -64, -64, -64, -64, 64, -64, -64, -64, -64, 64, -64, 64, 64, -64, -64, -64, -64, 64, -64, -64, -64, -64, -64, -64, -64, -64, -64, -64, -64, -64, -64, -64, -64, 64, -64, -64, -64, -64, 64, -64, 64, -64, 64, -64, 64, 64, 64, 64, -64, 64, 64, -64, -64, -64, -64, -64, -64, -64, 64, 64, -64, 64, -64, 64, -64, -64, 64, -64, -64, 64, 64, -64, 64, 64, 64, 64, 64, 64, -64, 64, 64, -64, 64, 64, 64, 64, 64, 64, 64, 64, 64, 64, 64, -64, 64, -64, 64, 64, 64, -64, 64, 64, 64, 64, 64, 64, 64, 64, 64, 64, -64, 64, 64, 64, 64, 64, 64, 64, 64, 64, -64, 64, -64, -64, -64, 64, -64, 64, 64, 64, 64, 64, 64, 64, -64, 64, 64, 64, -64, 64, 64, 64, 64, 64, 64, 64, 64, 64, -64, 64, -64, -64, -64, 64, 64, -64, 64, 64, 64, 64, -64, -64, -64, 64, 64, -64, 64, 64, 64, 64, 64, 64, 64, 64, 64, 64, -64, 64, -64, 64, 64, 64, 64, 64, 64, -64, -64, -64, -64, 64, -64, -64, -64, 64, 64, 64, 64, 64, -64, 64, 64, 64, 64, 64, -64, -64, -64, -64, 64, 64, 64, 64, -64, -64, -64, -64, -64, -64, 64, -64, -64, 64, 64, 64, 64, 64, 64, 64, 64, 64, 64, 64, -64, 64, -64, 64, 64, 64, 64, 64, -64, 64, 64, 64, 64, 64, 64, 64, -64, 64, 64, -64, 64, 64, -64, -64, 64, 64, 64, 64, -64, 64, -64, -64, 64, 64, -64, 64, 64, 64, 64, 64, 64, 64, 64, 64, 64, 64, 64, 64, -64, -64, -64, -64, 64, 64, -64, 64, -64, -64, 64, -64, 64, 64, -64, 64, 64, 64, 64, 64, 64, 64, 64, 64, 64, 64, 64, -64, -64, -64, -64, -64, -64, 64, -64, -64, -64, -64, -64, 64, 64, -64, 64, 64, 64, 64, 64, 64, 64, 64, 64, 64, -64, 64, 64, 64, -64, -64, -64, -64, -64, -64, -64, -64, -64, 64, -64, -64, -64, -64, -64, -64, -64, 64, 64, 64, 64, 64, 64, -64, -64, -64, 64, 64, -64, -64, -64, -64, -64, -64, -64, -64, -64, -64, 64, 64, 64, -64, -64, -64, -64, -64, -64, 64, 64, -64, -64, -64, -64, -64, -64, -64, -64, -64, -64, -64, -64, -64, -64, -64, -64, 64, 64, -64, -64, -64, -64, -64, -64, -64, -64, -64, -64, -64, 64, -64, 64, -64, -64, -64, -64, -64, -64, -64, -64, -64, 64, 64, -64, 64, 64, 64, -64, -64, -64, -64, -64, -64, -64, -64, -64, -64, 64, -64, 64, -64, -64, -64, 64, -64, -64, -64, -64, -64, -64, 64, -64, 64, -64, 64, 64, -64, -64, -64, -64, -64, -64, -64, -64, -64, -64, -64, -64, 64, 64, -64, -64, -64, -64, -64, -64, -64, -64, -64, 64, 64, 64, 64, 64, -64, 64, 64, -64, -64, -64, -64, -64, -64, -64, -64, -64, 64, 64, -64, 64, -64, -64, -64, -64, -64, -64, -64, 64, -64, -64, -64, -64, 64, -64, 64, 64, -64, 64, -64, -64, -64, -64, -64, -64, -64, 64, 64, 64, -64, 64, -64, -64, -64, -64, 64, 64, -64, -64, 64, -64, 64, -64, -64, -64, 64, 64, 64, -64, 64, -64, -64, -64, -64, 64, 64, 64, -64, 64, -64, -64, -64, 64, 64, 64, -64, 64, -64, -64, -64, -64, 64, -64, 64, -64, -64, -64, 64, 64, 64, 64, -64, -64, 64, -64, -64, -64, 64, -64, -64, -64, -64, 64, 64, 64, -64, -64, -64, -64, 64, -64, -64, -64, -64, 64, -64, -64, 64, 64, 64, 64, 64, -64, 64, 64, -64, 64, -64, -64, -64, 64, 64, -64, -64, -64, -64, 64, 64, 64, -64, -64, 64, 64, -64, -64, -64, -64, -64, 64, 64, 64, 64, -64, 64, 64, 64, -64, 64, 64, -64, 64, 64, -64, -64, -64, 64, 64, -64, -64, -64, 64, 64, 64, 64, -64, -64, -64, 64, 64, 64, -64, -64, -64, -64, 64, 64, -64, 64, 64, -64, 64, -64, -64, -64, 64, 64, 64, 64, 64, 64, 64, 64, 64, 64, 64, 64, -64, -64, 64, -64, 64, 64, -64, 64, -64, 64, -64, -64, 64, -64, -64, -64, -64, -64, -64, 64, -64, -64, -64, -64, 64, -64, 64, 64, 64, -64, 64, -64, -64, -64, 64, -64, -64, -64, 64, 64, -64, -64, -64, -64, 64, -64, -64, -64, 64, -64, 64, -64, 64, 64, 64, 64, -64, -64, 64, -64, -64, 64, 64, -64, -64, -64, -64, -64, -64, -64, -64, 64, -64, -64, -64, 64, -64, -64, -64, -64, 64, -64, -64, 64, -64, 64, 64, -64, -64, -64, 64, 64, -64, 64, -64, -64, -64, -64, -64, -64, -64, 64, -64, 64, -64, 64, -64, 64, 64, 64, 64, -64, -64, -64, 64, -64, -64, 64, -64, 64, 64, -64, 64, 64, 64, -64, -64, -64, -64, 64, 64, -64, -64, -64, -64, -64, 64, 64, -64, -64, 64, -64, 64, -64, -64, 64, 64, 64, 64, -64, 64, -64, -64, -64, -64, -64, -64, -64, -64, -64, 64, 64, -64, -64, 64, 64, -64, -64, -64, -64, 64, -64, -64, -64, 64, 64, 64, -64, 64, 64, -64, -64, 64, -64, -64, -64, -64, -64, -64, -64, -64, 64, 64, -64, -64, -64, -64, 64, -64, -64, 64, 64, -64, 64, 64, 64, -64, -64, 64, 64, -64, 64, -64, -64, -64, -64, 64, -64, -64, -64, -64, -64, -64, -64, -64, 64, -64, 64, -64, 64, 64, 64, -64, 64, -64, 64, -64, -64, 64, 64, -64, 64, -64, -64, 64, -64, -64, 64, -64, -64, -64, -64, -64, -64, -64, -64, -64, 64, 64, 64, -64, -64, 64, 64, 64, 64, 64, 64, -64, 64, -64, 64, -64, 64, -64, 64, -64, -64, -64, -64, 64, 64, -64, -64, -64, 64, -64, 64, 64, 64, -64, 64, -64, -64, -64, 64, -64, 64, 64, -64, -64, 64, 64, -64, -64, -64, -64, 64, -64, -64, -64, -64, 64, -64, -64, -64, -64, 64, -64, -64, 64, -64, 64, -64, 64, -64, 64, -64, -64, 64, 64, -64, -64, -64, -64, 64, -64, -64, 64, -64, -64, 64, -64, -64, 64, -64, -64, -64, -64, 64, 64, 64, -64, -64, -64, -64, 64, 64, 64, -64, -64, -64, -64, -64, -64, -64, -64, -64, 64, 64, -64, 64, 64, 64, 64, -64, -64, 64, -64, -64, 64, -64, 64, -64, -64, 64, 64, -64, -64, -64, 64, -64, 64, 64, 64, -64, 64, 64, 64, 64, -64, -64, -64, -64, -64, -64, 64, -64, 64, 64, -64, 64, -64, -64, 64, -64, -64, 64, -64, -64, 64, 64, -64, -64, -64, 64, -64, 64, 64, -64, -64, 64, -64, 64, -64, 64, 64, 64, 64, 64, -64, -64, -64, -64, -64, -64, -64, -64, -64, 64, 64, 64, 64, -64, 64, -64, 64, -64, -64, 64, -64, 64, 64, 64, 64, -64, -64, 64, -64, -64, -64, -64, 64, 64, -64, 64, 64, -64, 64, 64, -64, -64, 64, 64, 64, -64, -64, -64, 64, -64, 64, 64, 64, 64, -64, -64, 64, -64, -64, -64, -64, -64, -64, -64, 64, 64, 64, 64, -64, -64, 64, -64, -64, -64, -64, -64, 64, 64, 64, 64, -64, 64, -64, 64, -64, -64, -64, -64, -64, -64, -64, 64, -64, -64, -64, 64, 64, 64, 64, 64, -64, 64, -64, -64, 64, 64, 64, -64, 64, -64, 64, -64, 64, -64, -64, -64, -64, -64, 64, -64, -64, -64, -64, 64, 64, 64, 64, -64, 64, 64, -64, 64, 64, -64, -64, -64, -64, -64, 64, -64, -64, -64, -64, -64, 64, 64, -64, -64, 64, -64, 64, 64, 64, 64, -64, 64, 64, -64, -64, 64, -64, -64, 64, -64, -64, -64, 64, 64, -64, -64, -64, 64, 64, -64, 64, 64, 64, -64, -64, 64, 64, -64, -64, 64, -64, -64, 64, -64, -64, 64, -64, -64, -64, -64, -64, 64, -64, -64, -64, -64, -64, 64, 64, 64, -64, 64, -64, 64, -64, 64, 64, 64, 64, -64, -64, -64, 64, 64, 64, 64, -64, 64, -64, -64, 64, -64, -64, -64, 64, 64, 64, 64, -64, -64, -64, 64, -64, 64, -64, 64, 64, 64, 64, 64, -64, 64, -64, -64, -64, 64, -64, 64, 64, -64, 64, 64, -64, -64, -64, 64, -64, 64, -64, 64, -64, 64, -64, -64, -64, 64, -64, 64, 64, -64, 64, -64, -64, -64, 64, 64, -64, -64, 64, 64, 64, 64, -64, 64, 64, -64, 64, -64, -64, 64, 64, 64, -64, -64, 64, -64, -64, 64, -64, -64, -64, -64, 64, 64, 64, 64, 64, 64, 64, 64, -64, -64, -64, 64, 64, -64, 64, -64, 64, -64, -64, 64, 64, -64, 64, 64, 64, 64, -64, -64, 64, -64, 64, -64, -64, -64, 64, 64, 64, 64, 64, 64, 64, 64, 64, 64, 64, -64, 64, 64, 64, 64, -64, -64, -64, -64, -64, -64, -64, -64, -64, -64, 64, -64, -64, 64, 64, -64, 64, 64, -64, 64, 64, 64, 64, 64, 64, -64, -64, 64, 64, 64, -64, -64, -64, -64, 64, -64, -64, -64, 64, 64, 64, 64, 64, -64, -64, -64, 64, 64, 64, 64, 64, 64, -64, 64, 64, 64, -64, 64, -64, -64, -64, -64, 64, -64, -64, -64, 64, 64, -64, -64, 64, 64, 64, -64, 64, 64, 64, 64, 64, 64, 64, 64, -64, 64, 64, -64, -64, -64, -64, -64, 64, 64, 64, -64, -64, 64, -64, 64, 64, 64, 64, 64, 64, 64, 64, 64, 64, 64, 64, -64, 64, -64, -64, -64, -64, -64, -64, -64, -64, 64, -64, 64, 64, 64, -64, 64, 64, 64, 64, 64, 64, 64, 64, 64, 64, -64, -64, -64, -64, -64, -64, -64, -64, -64, -64, -64, 64, -64, 64, 64, 64, 64, 64, -64, 64, 64, -64, -64, -64, -64, 64, 64, 64, 64, -64, -64, 64, 64, 64, 64, -64, 64, -64, 64, -64, 64, -64, 64, 64, 64, 64, 64, -64, 64, -64, -64, 64, -64, 64, 64, 64, 64, 64, -64, -64, -64, -64, -64, -64, -64, 64, 64, 64, 64, 64, -64, 64, 64, -64, 64, 64, 64, -64, 64, 64, -64, 64, 64, 64, -64, 64, -64, -64, -64, 64, 64, -64, -64, 64, 64, 64, 64, 64, 64, 64, 64, 64, 64, 64, 64, 64, -64, -64, -64, -64, 64, -64, -64, -64, -64, 64, -64, -64, 64, 64, 64, 64, 64, 64, 64, -64, 64, 64, -64, 64, -64, 64, 64, -64, 64, -64, 64, -64, -64, 64, -64, -64, -64, 64, -64, -64, 64, 64, 64, 64, 64, 64, -64, 64, 64, 64, 64, 64, -64, 64, -64, -64, -64, -64, -64, 64, 64, -64, 64, -64, 64, -64, -64, -64, 64, 64, -64, 64, 64, 64, 64, 64, 64, 64, 64, 64, 64, -64, -64, -64, 64, -64, -64, 64, 64, 64, 64, -64, -64, 64, -64, -64, 64, -64, -64, -64, -64, 64, 64, 64, 64, 64, -64, 64, 64, 64, 64, -64, 64, -64, 64, -64, -64, -64, -64, -64, -64, -64, 64, -64, -64, 64, -64, -64, -64, 64, 64, -64, 64, 64, 64, 64, -64, 64, 64, 64, 64, 64, -64, 64, -64, -64, -64, -64, 64, -64, -64, -64, -64, -64, -64, -64, 64, 64, 64, 64, 64, -64, 64, 64, 64, 64, 64, 64, -64, -64, -64, 64, 64, -64, -64, -64, -64, -64, 64, 64, 64, -64, 64, 64, 64, 64, 64, 64, 64, 64, 64, 64, 64, 64, 64, 64, -64, 64, 64, -64, 64, 64, 64, -64, -64, 64, -64, 64, -64, -64, 64, 64, 64, 64, 64, 64, 64, 64, 64, 64, 64, 64, 64, 64, -64, 64, -64, 64, 64, -64, -64, 64, 64, -64, -64, -64, 64, -64, 64, 64, 64, -64, 64, -64, 64, 64, 64, -64, 64, 64, 64, 64, -64, 64, 64, 64, 64, 64, -64, -64, -64, 64, 64, 64, 64, -64, -64, 64, 64, 64, 64, 64, 64, 64, 64, 64, 64, 64, 64, 64, 64, 64, 64, 64, 64, -64, 64, -64, 64, 64, -64, 64, -64, 64, 64, -64, 64, 64, -64, -64, 64, 64, -64, -64, 64, 64, 64, -64, -64, 64, -64, 64, 64, 64, -64, -64, 64, 64, 64, -64, -64, 64, -64, 64, 64, -64, -64, 64, -64, -64, -64, -64, -64, 64, 64, 64, -64, -64, 64, 64, 64, 64, -64, 64, 64, 64, -64, 64, 64, -64, -64, 64, 64, 64, -64, 64, 64, -64, 64, 64, 64, 64, 64, 64, -64, -64, -64, 64, 64, 64, -64, 64, -64, -64, 64, 64, 64, 64, -64, -64, -64, -64, -64, -64, 64, 64, -64, -64, -64, 64, 64, -64, 64, 64, 64, -64, 64, -64, -64, 64, 64, 64, -64, 64, 64, -64, 64, 64, 64, 64, -64, 64, -64, -64, -64, -64, -64, -64, 64, -64, 64, 64, 64, -64, -64, 64, 64, -64, -64, -64, 64, -64, 64, 64, 64, 64, 64, -64, -64, 64, -64, -64, -64, 64, -64, -64, 64, 64, -64, -64, 64, -64, -64, -64, 64, 64, 64, -64, -64, 64, 64, 64, -64, 64, 64, 64, -64, -64, 64, -64, 64, -64, 64, 64, -64, -64, 64, 64, -64, -64, 64, -64, -64, 64, -64, 64, -64, 64, -64, -64, 64, -64, 64, 64, 64, 64, -64, 64, 64, 64, -64, 64, 64, 64, 64, 64, -64, 64, 64, 64, 64, -64, -64, -64, -64, -64, -64, 64, 64, -64, 64, 64, -64, 64, -64, 64, 64, 64, -64, -64, -64, -64, 64, 64, 64, 64, 64, -64, -64, -64, 64, -64, -64, -64, 64, -64, 64, -64, 64, -64, 64, -64, 64, -64, -64, -64, -64, -64, 64, -64, -64, -64, 64, 64, -64, -64, -64, 64, -64, -64, -64, 64, 64, 64, 64, -64, -64, -64, -64, 64, -64, -64, -64, -64, -64, -64, -64, 64, -64, -64, 64, -64, 64, 64, 64, -64, -64, 64, 64, -64, -64, 64, -64, 64, -64, -64, 64, -64, -64, 64, -64, -64, -64, -64, -64, -64, -64, 64, -64, 64, -64, -64, -64, -64, -64, 64, 64, 64, -64, 64, 64, -64, -64, -64, -64, -64, -64, -64, -64, 64, -64, -64, -64, 64, -64, -64, -64, 64, -64, 64, -64, 64, 64, 64, 64, -64, -64, -64, -64, 64, -64, -64, -64, -64, -64, -64, 64, -64, 64, -64, 64, -64, -64, -64, 64, -64, -64, -64, -64, -64, -64, -64, 64, 64, 64, 64, 64, -64, -64, -64, -64, -64, -64, -64, -64, 64, -64, -64, -64, -64, -64, 64, 64, -64, 64, -64, -64, -64, 64, 64, 64, 64, 64, -64, -64, -64, -64, -64, 64, -64, 64, -64, 64, 64, 64, -64, 64, -64, -64, 64, -64, -64, 64, -64, -64, 64, -64, 64, -64, 64, -64, 64, -64, -64, -64, -64, -64, -64, -64, -64, 64, -64, -64, -64, 64, -64, -64, -64, -64, -64, -64, -64, -64, 64, 64, -64, -64, 64, 64, -64, -64, -64, -64, -64, -64, -64, -64, -64, 64, -64, 64, 64, -64, -64, 64, 64, 64, -64, 64, -64, 64, 64, -64, 64, 64, 64, 64, -64, -64, -64, -64, -64, -64, 64, -64, -64, -64, 64, 64, -64, -64, -64, 64, -64, -64, -64, -64, -64, 64, -64, -64, -64, -64, 64, 64, -64, -64, -64, -64, -64, 64, 64, 64, -64, 64, 64, -64, 64, -64, -64, 64, -64, 64, 64, -64, -64, 64, -64, -64, -64, 64, -64, -64, 64, -64, -64, 64, -64, 64, -64, 64, -64, 64, 64, 64, -64, -64, -64, -64, -64, -64, -64, -64, -64, -64, -64, -64, -64, -64, 64, -64, -64, -64, -64, -64, -64, 64, 64, -64, 64, -64, -64, -64, -64, 64, -64, -64, -64, -64, -64, 64, 64, -64, -64, 64, 64, 64, -64, 64, 64, 64, 64, -64, -64, -64, -64, 64, 64, -64, -64, -64, -64, 64, -64, -64, -64, -64, -64, -64, -64, -64, 64, 64, -64, 64, -64, 64, 64, 64, -64, 64, -64, 64, -64, 64, -64, -64, -64, 64, -64, -64, -64, -64, 64, 64, -64, -64, -64, -64, 64, -64, -64, -64, -64, 64, -64, 64, 64, -64, -64, 64, -64, -64, -64, -64, -64, 64, -64, 64, 64, 64, 64, -64, -64, -64, -64, -64, 64, 64, 64, -64, 64, -64, -64, -64, 64, -64, -64, -64, 64, -64, 64, -64, -64, -64, 64, -64, 64, -64, -64, 64, -64, -64, -64, -64, 64, 64, -64, -64, 64, 64, 64, 64, -64, -64, 64, -64, -64, 64, 64, -64, -64, -64, 64, 64, -64, -64, -64, 64, -64, 64, 64, -64, 64, -64, 64, 64, 64, 64, -64, 64, 64, -64, 64, -64, -64, -64, 64, -64, -64, -64, 64, -64, 64, -64, 64, -64, -64, -64, 64, -64, -64, 64, -64, -64, 64, -64, 64, -64, 64, -64, -64, -64, -64, -64, -64, -64, -64, 64, -64, 64, -64, -64, 64, 64, 64, -64, 64, 64, 64, -64, -64, 64, 64, 64, 64, -64, 64, 64, -64, -64, -64, -64, 64, -64, -64, -64, -64, -64, -64, -64, -64, -64, 64, 64, -64, -64, -64, 64, 64, 64, -64, -64, 64, 64, 64, 64, -64, -64, -64, -64, 64, 64, 64, -64, 64, -64, -64, -64, -64, -64, -64, -64, 64, 64, -64, -64, 64, 64, -64, -64, 64, 64, 64, 64, 64, -64, -64, -64, 64, -64, 64, 64, 64, -64, 64, 64, -64, 64, -64, -64, 64, -64, 64, 64, -64, -64, 64, -64, -64, 64, -64, 64, -64, 64, 64, -64, 64, 64, -64, 64, -64, 64, 64, -64, -64, 64, -64, -64, -64, -64, -64, -64, 64, -64, 64, 64, 64, -64, 64, -64, 64, 64, 64, 64, -64, -64, 64, 64, 64, -64, -64, -64, -64, -64, -64, -64, 64, -64, 64, 64, -64, -64, 64, 64, -64, 64, -64, 64, -64, -64, -64, -64, -64, -64, 64, 64, 64, -64, 64, -64, 64, 64, 64, -64, -64, 64, -64, -64, -64, -64, 64, 64, 64, 64, 64, 64, 64, 64, 64, 64, 64, 64, 64, -64, 64, -64, 64, 64, -64, -64, 64, 64, -64, -64, 64, -64, -64, -64, 64, -64, -64, 64, -64, -64, -64, 64, -64, 64, -64, 64, 64, -64, 64, -64, 64, -64, 64, -64, 64, 64, -64, 64, -64, -64, -64, -64, -64, 64, 64, 64, -64, 64, -64, 64, -64, -64, -64, 64, -64, -64, 64, 64, 64, 64, 64, 64, -64, 64, -64, -64, -64, 64, 64, -64, 64, 64, -64, -64, -64, 64, 64, 64, -64, 64, 64, 64, 64, 64, -64, 64, 64, 64, 64, 64, 64, -64, -64, -64, -64, -64, 64, -64, -64, 64, -64, -64, 64, 64, -64, -64, 64, 64, -64, 64, 64, -64, 64, -64, 64, 64, -64, -64, 64, 64, 64, -64, -64, 64, 64, -64, -64, 64, -64, -64, 64, 64, 64, -64, -64, 64, 64, -64, 64, 64, -64, 64, -64, -64, -64, 64, 64, -64, 64, -64, -64, 64, -64, 64, 64, -64, 64, 64, 64, -64, -64, 64, 64, 64, 64, 64, 64, -64, 64, 64, 64, 64, 64, 64, 64, -64, -64, 64, 64, -64, 64, -64, -64, 64, 64, 64, 64, 64, 64, -64, 64, 64, 64, -64, 64, 64, 64, 64, -64, -64, 64, 64, -64, -64, 64, 64, -64, 64, -64, -64, 64, 64, -64, -64, 64, 64, -64, 64, -64, 64, 64, 64, 64, 64, 64, 64, -64, -64, -64, 64, 64, 64, 64, 64, -64, 64, 64, -64, 64, 64, -64, 64, -64, 64, -64, 64, 64, 64, 64, 64, 64, 64, 64, -64, 64, 64, 64, -64, 64, -64, -64, -64, -64, 64, 64, 64, 64, -64, 64, 64, 64, 64, -64, 64, 64, 64, 64, -64, 64, 64, 64, 64, 64, 64, 64, -64, 64, 64, 64, -64, -64, 64, -64, 64, -64, 64, 64, 64, 64, 64, 64, 64, 64, 64, 64, 64, -64, 64, -64, -64, 64, 64, 64, 64, 64, 64, -64, 64, 64, -64, 64, 64, 64, 64, 64, 64, 64, 64, -64, 64, 64, 64, 64, 64, -64, 64, 64, -64, 64, 64, 64, -64, -64, -64, 64, 64, 64, -64, -64, -64, 64, 64, 64, 64, 64, 64, 64, 64, -64, 64, -64, 64, 64, 64, -64, -64, 64, -64, -64, 64, 64, -64, 64, -64, -64, -64, -64, 64, 64, 64, 64, -64, 64, -64, 64, 64, 64, -64, -64, 64, 64, -64, -64, -64, 64, 64, 64, 64, 64, 64, 64, 64, -64, 64, -64, 64, 64, -64, -64, -64, -64, 64, 64, 64, 64, 64, 64, 64, -64, 64, 64, 64, 64, 64, 64, -64, 64, -64, -64, 64, -64, -64, -64, -64, -64, 64, -64, 64, -64, 64, 64, 64, 64, 64, 64, -64, 64, 64, 64, 64, 64, 64, 64, 64, -64, -64, -64, 64, 64, 64, -64, 64, -64, 64, 64, 64, -64, 64, 64, 64, 64, 64, -64, 64, 64, 64, -64, -64, 64, -64, 64, -64, -64, -64, -64, 64, 64, -64, 64, -64, 64, 64, -64, 64, 64, 64, 64, -64, -64, 64, 64, 64, 64, -64, -64, 64, -64, 64, -64, 64, -64, 64, -64, -64, -64, -64, -64, 64, 64, -64, -64, -64, 64, 64, 64, -64, 64, -64, 64, 64, -64, 64, -64, 64, -64, -64, 64, -64, -64, -64, 64, -64, 64, -64, -64, 64, 64, 64, -64, -64, 64, 64, 64, 64, -64, 64, 64, 64, -64, -64, 64, 64, 64, -64, 64, -64, 64, 64, 64, 64, 64, 64, -64, 64, 64, -64, -64, 64, -64, -64, -64, 64, 64, 64, -64, -64, 64, 64, -64, 64, 64, 64, -64, 64, -64, -64, -64, -64, 64, -64, 64, -64, 64, 64, 64, 64, -64, -64, 64, -64, 64, 64, 64, 64, 64, -64, -64, 64, -64, -64, -64, 64, -64, 64, -64, 64, -64, -64, -64, 64, 64, -64, 64, 64, 64, -64, 64, 64, -64, 64, 64, 64, 64, 64, -64, 64, -64, 64, 64, -64, 64, -64, -64, 64, 64, 64, 64, 64, 64, -64, -64, -64, -64, 64, 64, -64, 64, 64, 64, 64, -64, 64, 64, -64, -64, 64, 64, -64, 64, -64, 64, -64, -64, 64, -64, -64, 64, 64, -64, 64, 64, 64, 64, 64, -64, -64, 64, 64, 64, 64, -64, -64, 64, -64, 64, 64, 64, -64, 64, 64, 64, -64, -64, -64, -64, -64, 64, 64, 64, 64, 64, 64, 64, -64, -64, -64, -64, 64, -64, 64, -64, 64, -64, 64, -64, 64, 64, -64, -64, 64, -64, -64, 64, -64, -64, 64, -64, -64, -64, -64, -64, 64, -64, -64, -64, 64, 64, 64, 64, 64, 64, -64, -64, 64, 64, 64, -64, -64, -64, -64, 64, 64, 64, -64, 64, -64, 64, 64, -64, -64, -64, 64, 64, -64, -64, -64, 64, -64, -64, -64, -64, -64, -64, -64, 64, -64, 64, 64, 64, 64, -64, 64, -64, 64, -64, -64, -64, -64, -64, -64, -64, 64, -64, -64, -64, -64, -64, 64, 64, 64, 64, 64, 64, -64, 64, -64, -64, 64, -64, -64, 64, 64, 64, -64, -64, -64, -64, 64, 64, 64, 64, 64, -64, 64, 64, 64, 64, 64, 64, 64, -64, 64, 64, 64, -64, -64, 64, 64, -64, -64, 64, -64, -64, -64, 64, 64, -64, -64, -64, -64, -64, -64, 64, -64, 64, 64, 64, 64, 64, -64, 64, -64, 64, 64, 64, 64, 64, -64, -64, -64, -64, -64, -64, 64, -64, 64, -64, -64, -64, -64, 64, -64, 64, 64, 64, -64, 64, 64, 64, -64, -64, 64, 64, 64, 64, 64, -64, -64, -64, -64, -64, -64, 64, 64, 64, -64, -64, -64, 64, -64, 64, 64, 64, 64, 64, -64, 64, -64, -64, -64, 64, 64, -64, -64, -64, -64, -64, -64, -64, 64, 64, 64, 64, 64, 64, 64, 64, -64, 64, 64, 64, 64, -64, -64, 64, 64, 64, 64, 64, -64, -64, -64, -64, -64, -64, -64, -64, 64, -64, 64, 64, 64, 64, 64, 64, 64, -64, 64, 64, -64, -64, -64, -64, 64, 64, 64, -64, -64, -64, -64, -64, -64, -64, 64, 64, 64, 64, 64, 64, 64, 64, 64, -64, 64, -64, -64, 64, -64, -64, 64, 64, -64, -64, -64, 64, -64, -64, -64, -64, -64, 64, 64, 64, 64, -64, -64, 64, -64, 64, -64, -64, -64, -64, -64, -64, -64, 64, 64, -64, -64, 64, 64, -64, -64, -64, -64, 64, -64, -64, 64, 64, 64, -64, -64, -64, -64, -64, 64, -64, -64, -64, -64, -64, -64, -64, 64, 64, 64, 64, 64, -64, -64, -64, 64, -64, 64, 64, -64, 64, 64, 64, 64, 64, -64, -64, 64, -64, -64, -64, -64, -64, -64, 64, 64, 64, 64, -64, -64, -64, -64, -64, -64, -64, -64, 64, 64, 64, 64, 64, 64, 64, 64, 64, 64, -64, -64, -64, -64, -64, -64, 64, -64, 64, 64, -64, -64, -64, -64, -64, -64, -64, 64, 64, 64, 64, 64, 64, 64, 64, 64, -64, 64, 64, -64, -64, -64, -64, 64, 64, -64, -64, -64, -64, 64, -64, -64, 64, -64, -64, 64, 64, 64, 64, 64, 64, -64, 64, 64, 64, -64, -64, -64, -64, -64, -64, -64, 64, -64, -64, 64, 64, -64, -64, -64, -64, 64, 64, 64, 64, 64, 64, 64, 64, 64, 64, 64, 64, -64, -64, -64, -64, -64, -64, -64, -64, 64, 64, -64, 64, -64, -64, -64, 64, -64, 64, 64, -64, -64, 64, -64, -64, 64, 64, 64, -64, -64, -64, -64, -64, -64, -64, -64, -64, 64, -64, 64, 64, -64, -64, -64, 64, -64, -64, -64, -64, -64, -64, -64, -64, 64, 64, -64, -64, -64, -64, -64, -64, -64, 64, 64, -64, 64, 64, 64, -64, -64, -64, -64, 64, 64, -64, -64, -64, -64, 64, 64, -64, 64, 64, -64, -64, -64, 64, -64, -64, -64, -64, 64, 64, -64, -64, -64, 64, 64, -64, -64, 64, 64, 64, 64, -64, 64, -64, -64, -64, 64, -64, 64, -64, -64, 64, -64, -64, -64, -64, -64, 64, 64, 64, 64, -64, -64, 64, 64, 64, -64, 64, 64, 64, 64, 64, -64, 64, -64, -64, -64, 64, -64, -64, -64, -64, -64, 64, -64, -64, -64, 64, 64, -64, 64, 64, 64, 64, -64, 64, -64, 64, 64, 64, 64, 64, -64, -64, -64, -64, -64, -64, -64, -64, -64, -64, -64, 64, -64, -64, 64, 64, -64, 64, -64, 64, 64, 64, -64, -64, 64, 64, 64, -64, -64, -64, -64, -64, -64, -64, 64, -64, -64, -64, -64, 64, -64, -64, -64, 64, 64, 64, 64, -64, 64, 64, 64, 64, 64, 64, 64, 64, -64, -64, -64, -64, -64, -64, -64, -64, -64, -64, -64, -64, -64, -64, -64, 64, -64, -64, -64, 64, 64, 64, -64, 64, -64, 64, -64, 64, -64, -64, 64, -64, -64, -64, -64, -64, 64, -64, 64, -64, -64, 64, -64, 64, -64, 64, 64, -64, 64, 64, -64, 64, 64, -64, -64, 64, 64, -64, -64, -64, 64, 64, 64, -64, -64, 64, -64, 64, 64, -64, 64, 64, -64, -64, 64, -64, -64, 64, -64, 64, 64, 64, -64, -64, 64, 64, 64, 64, -64, -64, 64, -64, -64, 64, 64, -64, 64, 64, 64, -64, 64, -64, 64, -64, 64, -64, 64, 64, 64, -64, -64, 64, -64, -64, 64, 64, 64, 64, 64, -64, 64, -64, 64, -64, -64, -64, 64, 64, -64, -64, -64, -64, -64, 64, 64, 64, 64, 64, 64, 64, 64, 64, 64, 64, 64, 64, 64, 64, -64, 64, -64, 64, 64, -64, -64, -64, 64, 64, -64, 64, 64, -64, -64, -64, 64, 64, 64, 64, 64, 64, 64, 64, -64, -64, -64, 64, -64, -64, 64, -64, 64, 64, 64, -64, -64, 64, -64, 64, 64, -64, -64, 64, 64, 64, -64, 64, 64, 64, 64, 64, -64, -64, -64, -64, -64, -64, -64, -64, -64, 64, -64, -64, 64, 64, 64, -64, -64, -64, -64, 64, -64, 64, -64, 64, -64, -64, 64, 64, 64, -64, -64, -64, -64, -64, -64, -64, -64, 64, -64, -64, 64, 64, 64, 64, -64, -64, -64, -64, -64, 64, -64, -64, 64, 64, -64, 64, -64, -64, -64, -64, -64, -64, -64, -64, 64, -64, 64, 64, 64, 64, 64, 64, 64, 64, 64, -64, 64, -64, -64, 64, -64, -64, 64, -64, -64, -64, -64, -64, -64, -64, -64, -64, -64, -64, -64, 64, 64, 64, 64, 64, 64, 64, 64, -64, -64, 64, -64, 64, 64, -64, -64, -64, 64, 64, 64, 64, -64, -64, 64, -64, -64, 64, -64, -64, 64, 64, 64, 64, 64, 64, -64, -64, -64, -64, 64, 64, 64, -64, -64, -64, 64, 64, 64, -64, 64, -64, -64, 64, 64, -64, 64, -64, -64, -64, 64, 64, 64, -64, -64, -64, -64, -64, 64, 64, 64, -64, -64, -64, 64, 64, 64, -64, -64, -64, -64, -64, -64, -64, -64, -64, 64, 64, 64, 64, -64, -64, -64, -64, -64, -64, 64, 64, -64, -64, 64, -64, 64, 64, 64, -64, -64, -64, -64, -64, -64, -64, -64, 64, -64, 64, 64, -64, -64, -64, -64, -64, -64, -64, -64, 64, 64, 64, 64, 64, 64, 64, 64, -64, -64, -64, 64, -64, -64, 64, 64, 64, 64, 64, -64, -64, -64, -64, -64, -64, -64, -64, -64, 64, -64, 64, 64, 64, 64, 64, -64, 64, 64, -64, -64, 64, -64, 64, -64, -64, 64, 64, 64, -64, -64, -64, -64, -64, -64, -64, 64, -64, -64, 64, 64, 64, 64, 64, -64, -64, 64, -64, 64, 64, 64, -64, 64, -64, -64, -64, -64, 64, -64, -64, -64, -64, -64, 64, 64, 64, 64, 64, -64, -64, 64, 64, -64, 64, -64, 64, -64, 64, 64, 64, -64, 64, 64, 64, -64, 64, -64, -64, -64, -64, -64, -64, 64, 64, 64, 64, -64, -64, -64, -64, 64, -64, 64, 64, 64, 64, 64, 64, -64, 64, -64, -64, -64, 64, 64, -64, -64, -64, -64, -64, 64, 64, 64, -64, 64, 64, 64, -64, 64, -64, 64, 64, 64, 64, -64, -64, 64, 64, 64, -64, -64, 64, 64, -64, -64, -64, 64, -64, 64, 64, 64, 64, -64, 64, -64, -64, 64, 64, -64, 64, 64, -64, -64, -64, 64, 64, -64, 64, 64, -64, 64, 64, 64, 64, -64, -64, 64, 64, 64, 64, -64, -64, -64, -64, 64, 64, 64, 64, -64, 64, -64, -64, 64, 64, -64, 64, 64, -64, 64, 64, 64, 64, 64, 64, 64, 64, -64, -64, -64, 64, -64, -64, 64, 64, 64, 64, -64, -64, 64, -64, -64, 64, 64, 64, 64, -64, 64, 64, 64, 64, 64, 64, 64, -64, -64, -64, -64, -64, -64, -64, -64, 64, 64, 64, -64, 64, 64, -64, -64, 64, 64, 64, 64, 64, 64, 64, 64, 64, -64, -64, -64, -64, -64, -64, -64, 64, -64, -64, 64, 64, 64, 64, -64, 64, 64, 64, -64, 64, -64, 64, 64, 64, 64, 64, 64, 64, -64, -64, -64, -64, -64, -64, -64, -64, 64, -64, 64, 64, 64, -64, 64, -64, -64, -64, 64, -64, 64, -64, -64, 64, 64, 64, 64, 64, -64, -64, -64, -64, -64, -64, -64, -64, -64, -64, 64, 64, -64, 64, -64, 64, -64, -64, 64, -64, 64, 64, 64, 64, 64, 64, 64, 64, 64, -64, -64, -64, -64, -64, -64, -64, -64, -64, -64, 64, -64, 64, -64, -64, 64, 64, 64, -64, -64, 64, 64, 64, 64, 64, 64, -64, 64, 64, -64, -64, -64, -64, -64, 64, -64, -64, -64, -64, -64, 64, 64, 64, 64, -64, -64, -64, -64, -64, -64, 64, 64, -64, 64, -64, -64, 64, 64, 64, -64, -64, -64, 64, -64, 64, 64, -64, -64, -64, 64, -64, -64, 64, 64, -64, 64, 64, -64, 64, -64, 64, -64, -64, 64, -64, 64, -64, -64, -64, 64, 64, -64, 64, 64, 64, -64, -64, -64, 64, 64, -64, -64, -64, 64, -64, -64, -64, 64, -64, -64, 64, -64, -64, -64, -64, -64, 64, 64, 64, 64, -64, 64, -64, 64, -64, 64, 64, 64, 64, 64, -64, -64, -64, -64, 64, 64, 64, 64, 64, 64, -64, 64, 64, 64, 64, 64, 64, 64, 64, 64, 64, -64, 64, -64, -64, 64, -64, -64, -64, 64, -64, 64, -64, 64, -64, -64, -64, -64, -64, -64, -64, 64, 64, -64, 64, 64, 64, 64, 64, 64, 64, -64, 64, 64, -64, 64, 64, -64, -64, 64, -64, -64, -64, -64, -64, -64, 64, 64, 64, -64, -64, -64, -64, -64, -64, 64, 64, 64, 64, 64, 64, 64, -64, -64, 64, -64, 64, -64, -64, -64, 64, -64, -64, -64, 64, -64, -64, -64, -64, -64, -64, -64, -64, -64, -64, 64, 64, -64, 64, -64, -64, 64, 64, 64, 64, 64, 64, 64, 64, 64, 64, 64, -64, 64, 64, 64, -64, -64, -64, -64, -64, -64, -64, 64, 64, 64, 64, 64, 64, 64, 64, -64, 64, 64, 64, 64, 64, 64, -64, -64, -64, -64, 64, -64, 64, -64, -64, -64, -64, -64, -64, -64, -64, -64, 64, -64, 64, 64, -64, 64, 64, 64, 64, 64, 64, -64, 64, -64, -64, 64, 64, 64, -64, 64, -64, -64, -64, -64, -64, -64, -64, -64, -64, 64, -64, -64, -64, -64, 64, 64, 64, 64, 64, 64, -64, 64, 64, 64, 64, 64, -64, -64, -64, -64, -64, -64, -64, -64, 64, 64, 64, -64, -64, -64, -64, -64, 64, 64, 64, 64, 64, -64, -64, 64, 64, 64, 64, 64, 64, -64, -64, -64, -64, -64, -64, 64, 64, 64, 64, 64, -64, 64, -64, -64, 64, 64, 64, -64, -64, -64, 64, -64, 64, 64, 64, -64, 64, -64, -64, -64, -64, -64, -64, 64, 64, 64, 64, -64, 64, -64, 64, 64, -64, 64, -64, -64, -64, -64, -64, 64, 64, -64, 64, 64, -64, -64, -64, -64, -64, -64, -64, 64, -64, -64, -64, 64, -64, -64, -64, 64, -64, -64, -64, -64, -64, -64, 64, 64, -64, -64, -64, 64, -64, -64, 64, 64, -64, -64, 64, -64, 64, -64, -64, -64, -64, -64, 64, 64, -64, -64, -64, -64, -64, -64, 64, -64, -64, -64, -64, -64, 64, -64, 64, -64, -64, 64, 64, 64, 64, -64, 64, 64, -64, -64, 64, -64, -64, -64, -64, -64, -64, -64, -64, -64, -64, -64, -64, 64, -64, -64, -64, -64, -64, -64, 64, 64, 64, -64, -64, 64, -64, -64, -64, -64, -64, -64, -64, -64, -64, -64, -64, 64, -64, 64, 64, 64, -64, -64, 64, -64, 64, -64, 64, 64, 64, -64, -64, 64, 64, 64, -64, -64, -64, -64, -64, -64, -64, -64, -64, -64, -64, 64, 64, -64, -64, -64, -64, -64, -64, 64, 64, 64, 64, 64, -64, 64, -64, -64, 64, -64, -64, -64, -64, -64, -64, -64, -64, -64, 64, -64, -64, -64, 64, 64, 64, -64, 64, 64, 64, 64, 64, -64, -64, 64, 64, -64, 64, -64, -64, -64, -64, -64, -64, -64, -64, -64, 64, -64, -64, -64, 64, 64, 64, 64, -64, 64, 64, 64, 64, -64, -64, -64, 64, -64, -64, -64, -64, -64, -64, -64, -64, 64, -64, -64, 64, -64, -64, -64, 64, 64, -64, -64, 64, 64, 64, 64, 64, -64, -64, -64, -64, 64, 64, -64, -64, -64, -64, -64, -64, 64, -64, -64, -64, -64, -64, -64, 64, 64, -64, 64, 64, 64, 64, 64, 64, 64, -64, 64, -64, -64, 64, -64, -64, -64, -64, -64, -64, 64, -64, -64, -64, 64, 64, 64, 64, -64, -64, 64, 64, -64, -64, -64, 64, 64, -64, -64, -64, -64, 64, 64, -64, -64, -64, 64, -64, 64, -64, -64, 64, 64, 64, 64, 64, -64, 64, 64, 64, 64, -64, 64, -64, -64, -64, -64, -64, 64, -64, -64, 64, -64, 64, -64, -64, -64, -64, -64, 64, 64, 64, -64, -64, 64, -64, -64, -64, 64, -64, 64, -64, 64, 64, 64, -64, 64, 64, -64, -64, -64, 64, 64, -64, -64, 64, 64, 64, -64, -64, -64, -64, 64, -64, -64, -64, -64, -64, -64, -64, -64, 64, -64, 64, 64, 64, 64, 64, -64, -64, -64, -64, -64, 64, 64, -64, -64, -64, -64, 64, 64, -64, -64, 64, 64, 64, 64, -64, -64, 64, -64, -64, -64, 64, -64, -64, 64, -64, -64, -64, -64, 64, 64, -64, 64, 64, 64, 64, 64, 64, 64, 64, 64, -64, 64, -64, 64, -64, -64, 64, -64, 64, -64, -64, 64, 64, -64, 64, -64, 64, 64, -64, -64, 64, -64, 64, -64, -64, 64, 64, 64, 64, -64, 64, 64, -64, -64, -64, 64, -64, 64, 64, -64, -64, 64, 64, 64, 64, -64, -64, -64, -64, 64, 64, 64, 64, -64, -64, 64, 64, 64, 64, 64, -64, 64, 64, 64, -64, -64, -64, -64, 64, 64, 64, 64, 64, 64, 64, 64, 64, -64, 64, -64, 64, 64, 64, 64, 64, 64, -64, 64, 64, 64, 64, -64, 64, -64, -64, -64, 64, -64, 64, 64, -64, 64, -64, 64, -64, -64, -64, -64, 64, 64, 64, 64, 64, 64, 64, 64, -64, 64, 64, 64, 64, 64, -64, -64, 64, 64, -64, 64, -64, -64, 64, -64, -64, 64, -64, -64, -64, 64, -64, 64, 64, 64, 64, 64, 64, -64, 64, -64, 64, 64, 64, -64, 64, 64, 64, -64, -64, 64, -64, -64, 64, -64, 64, -64, -64, -64, -64, -64, 64, 64, 64, 64, 64, 64, 64, 64, 64, -64, -64, 64, 64, 64, 64, 64, -64, 64, 64, 64, 64, 64, -64, 64, -64, -64, -64, -64, -64, 64, -64, -64, -64, -64, 64, -64, -64, -64, 64, -64, 64, -64, 64, -64, 64, 64, 64, 64, 64, -64, -64, -64, -64, -64, -64, -64, 64, 64, 64, -64, -64, -64, 64, 64, -64, -64, -64, -64, 64, 64, -64, -64, -64, -64, 64, 64, 64, 64, -64, 64, 64, -64, -64, -64, -64, 64, 64, 64, 64, 64, -64, -64, -64, -64, 64, 64, 64, -64, 64, -64, 64, -64, -64, -64, 64, -64, 64, 64, 64, -64, -64, -64, -64, 64, -64, -64, -64, -64, 64, -64, -64, -64, 64, -64, -64, -64, 64, 64, 64, 64, 64, -64, 64, -64, -64, 64, 64, -64, -64, -64, -64, -64, -64, -64, -64, -64, -64, -64, -64, -64, 64, 64, -64, -64, -64, 64, 64, 64, 64, 64, 64, -64, 64, -64, 64, 64, -64, -64, -64, -64, -64, -64, 64, 64, 64, -64, -64, -64, 64, 64, 64, 64, 64, -64, 64, 64, 64, 64, 64, 64, 64, 64, 64, -64, -64, -64, -64, -64, -64, -64, -64, 64, 64, -64, -64, -64, 64, 64, 64, 64, 64, 64, 64, 64, -64, -64, 64, 64, 64, 64, 64, -64, -64, -64, -64, -64, -64, -64, -64, -64, 64, -64, -64, -64, 64, 64, 64, -64, 64, 64, 64, -64, -64, 64, 64, 64, 64, 64, -64, 64, -64, -64, -64, 64, -64, -64, -64, 64, 64, 64, 64, 64, -64, 64, 64, -64, -64, 64, 64, 64, 64, 64, 64, 64, 64, 64, 64, -64, -64, -64, -64, 64, -64, -64, -64, 64, 64, -64, 64, 64, 64, 64, -64, -64, -64, 64, 64, 64, 64, 64, -64, -64, 64, 64, 64, 64, -64, -64, 64, 64, -64, -64, -64, 64, -64, -64, 64, -64, -64, -64, -64, -64, -64, 64, 64, 64, 64, 64, 64, -64, 64, 64, 64, 64, 64, -64, -64, -64, -64, -64, -64, -64, 64, 64, 64, -64, -64, -64, -64, 64, -64, 64, 64, 64, 64, 64, 64, -64, 64, 64, 64, -64, -64, 64, -64, -64, -64, -64, 64, 64, -64, -64, -64, -64, -64, -64, -64, -64, -64, 64, 64, 64, -64, -64, -64, 64, 64, 64, 64, -64, -64, 64, 64, -64, -64, -64, 64, 64, 64, -64, 64, -64, -64, -64, -64, -64, -64, 64, 64, 64, 64, -64, 64, 64, 64, 64, 64, -64, 64, -64, 64, 64, -64, -64, -64, -64, -64, 64, -64, -64, -64, -64, -64, -64, -64, -64, -64, 64, 64, 64, 64, 64, 64, 64, -64, -64, -64, 64, 64, 64, -64, 64, -64, 64, 64, 64, 64, -64, -64, -64, -64, -64, -64, -64, -64, 64, 64, 64, 64, 64, 64, 64, -64, -64, -64, -64, -64, 64, -64, 64, 64, 64, 64, 64, -64, -64, -64, 64, -64, -64, -64, -64, -64, 64, 64, 64, 64, 64, 64, -64, -64, -64, 64, 64, 64, -64, -64, 64, 64, 64, -64, -64, -64, 64, -64, 64, 64, -64, -64, -64, 64, -64, 64, -64, -64, -64, -64, 64, -64, -64, -64, -64, 64, 64, -64, 64, 64, 64, 64, -64, 64, -64, 64, -64, 64, -64, -64, -64, -64, 64, 64, 64, -64, 64, 64, 64, 64, 64, 64, 64, 64, 64, -64, -64, -64, 64, -64, -64, 64, 64, -64, -64, 64, -64, -64, -64, 64, 64, -64, 64, 64, -64, 64, 64, 64, 64, 64, 64, 64, 64, 64, -64, 64, 64, -64, 64, -64, 64, -64, -64, 64, -64, 64, 64, -64, 64, -64, -64, -64, 64, -64, -64, -64, -64, -64, 64, 64, 64, -64, 64, -64, 64, 64, -64, -64, 64, -64, -64, -64, -64, 64, -64, 64, 64, -64, 64, -64, -64, -64, 64, -64, 64, -64, 64, 64, 64, -64, -64, -64, 64, -64, 64, -64, 64, -64, 64, 64, 64, 64, 64, -64, 64, 64, -64, -64, 64, 64, 64, -64, 64, 64, 64, 64, 64, 64, -64, -64, -64, -64, -64, 64, -64, 64, 64, 64, 64, 64, 64, 64, 64, -64, 64, 64, 64, 64, 64, 64, 64, 64, 64, -64, -64, -64, -64, -64, -64, 64, -64, -64, 64, 64, 64, 64, 64, 64, 64, 64, 64, 64, 64, 64, 64, 64, 64, 64, -64, -64, -64, -64, -64, -64, 64, 64, -64, -64, 64, -64, 64, -64, -64, 64, 64, 64, 64, 64, 64, 64, 64, 64, 64, -64, -64, -64, -64, -64, -64, -64, -64, -64, -64, 64, -64, -64, 64, 64, 64, 64, -64, 64, -64, -64, -64, -64, -64, -64, 64, 64, 64, 64, -64, -64, 64, -64, -64, -64, -64, -64, -64, -64, -64, 64, -64, 64, -64, 64, -64, -64, -64, -64, -64, -64, -64, -64, -64, 64, -64, -64, 64, -64, -64, 64, -64, -64, -64, -64, 64, -64, 64, 64, 64, -64, 64, 64, -64, -64, -64, -64, -64, -64, -64, 64, 64, -64, -64, 64, 64, 64, 64, -64, -64, -64, -64, -64, -64, -64, 64, -64, 64, -64, -64, -64, 64, -64, 64, -64, 64, -64, 64, -64, -64, -64, -64, 64, -64, -64, 64, 64, -64, -64, -64, -64, -64, -64, -64, -64, -64, 64, 64, 64, 64, 64, 64, 64, -64, 64, 64, -64, -64, -64, -64, 64, 64, 64, -64, 64, 64, -64, -64, -64, -64, -64, -64, 64, -64, 64, 64, -64, 64, 64, 64, 64, 64, -64, -64, -64, -64, -64, -64, 64, 64, 64, 64, 64, -64, -64, -64, -64, -64, -64, 64, -64, 64, -64, -64, -64, -64, 64, 64, -64, -64, -64, -64, -64, -64, -64, 64, 64, 64, -64, -64, 64, 64, -64, -64, -64, -64, -64, -64, -64, 64, 64, -64, -64, -64, -64, -64, -64, -64, -64, -64, -64, -64, 64, 64, 64, -64, -64, -64, 64, -64, -64, 64, -64, -64, -64, 64, 64, -64, -64, -64, -64, -64, -64, -64, -64, -64, -64, -64, -64, 64, 64, -64, -64, -64, -64, -64, 64, 64, 64, 64, -64, -64, 64, 64, 64, -64, 64, -64, -64, -64, -64, -64, -64, -64, -64, -64, 64, 64, 64, 64, -64, -64, -64, -64, -64, 64, -64, 64, 64, 64, 64, 64, 64, -64, 64, -64, -64, -64, -64, -64, -64, -64, 64, 64, 64, 64, 64, 64, -64, -64, -64, -64, -64, -64, 64, 64, 64, 64, 64, 64, 64, 64, -64, 64, 64, -64, -64, -64, 64, 64, 64, 64, 64, 64, 64, -64, -64, -64, -64, -64, -64, -64, 64, 64, -64, 64, 64, -64, -64, 64, -64, 64, -64, -64, -64, -64, 64, 64, 64, 64, 64, 64, 64, 64, -64, -64, 64, 64, -64, -64, -64, 64, 64, 64, 64, 64, 64, -64, -64, -64, -64, -64, -64, -64, 64, 64, 64, 64, 64, 64, -64, 64, 64, 64, 64, 64, 64, -64, -64, 64, 64, 64, 64, 64, 64, 64, -64, -64, -64, -64, -64, -64, -64, 64, 64, 64, 64, 64, 64, 64, 64, -64, -64, 64, 64, -64, 64, 64, 64, 64, -64, -64, 64, -64, 64, 64, -64, -64, 64, -64, -64, -64, 64, 64, 64, 64, 64, 64, 64, -64, -64, -64, -64, -64, -64, 64, 64, -64, 64, 64, -64, 64, 64, -64, -64, 64, 64, 64, -64, -64, 64, -64, -64, 64, 64, -64, 64, -64, -64, -64, -64, 64, -64, 64, 64, -64, 64, 64, 64, -64, 64, 64, 64, 64, 64, 64, 64, 64, -64, -64, -64, 64, 64, -64, -64, -64, -64, 64, -64, 64, -64, -64, -64, -64, 64, 64, 64, 64, 64, 64, 64, 64, 64, 64, -64, -64, -64, -64, -64, -64, -64, -64, 64, -64, -64, -64, -64, -64, -64, 64, -64, 64, -64, 64, 64, -64, -64, 64, 64, 64, -64, 64, -64, -64, -64, -64, -64, -64, -64, -64, 64, -64, -64, -64, -64, -64, 64, -64, 64, 64, -64, -64, -64, 64, -64, 64, -64, -64, 64, -64, -64, -64, -64, -64, -64, -64, -64, -64, -64, 64, -64, -64, 64, -64, -64, -64, -64, -64, -64, -64, -64, -64, 64, -64, -64, -64, -64, -64, -64, -64, -64, 64, -64, -64, -64, -64, -64, -64, -64, -64, 64, 64, 64, 64, -64, -64, -64, 64, 64, -64, -64, -64, -64, 64, 64, -64, -64, -64, 64, 64, -64, -64, 64, -64, -64, 64, 64, 64, 64, 64, 64, -64, -64, 64, -64, -64, 64, -64, -64, -64, -64, -64, 64, -64, 64, -64, 64, 64, -64, 64, 64, 64, 64, 64, -64, -64, 64, 64, 64, -64, 64, -64, 64, -64, 64, 64, -64, -64, -64, -64, 64, 64, 64, -64, -64, -64, 64, 64, 64, 64, 64, -64, 64, 64, 64, -64, -64, -64, 64, -64, -64, -64, -64, 64, -64, -64, -64, 64, 64, 64, 64, 64, -64, 64, 64, -64, 64, 64, 64, 64, -64, 64, -64, -64, 64, 64, -64, 64, -64, -64, 64, -64, -64, -64, -64, 64, -64, 64, -64, 64, 64, 64, -64, 64, 64, -64, -64, -64, 64, -64, -64, -64, -64, -64, 64, -64, -64, -64, 64, -64, -64, -64, 64, 64, 64, -64, -64, -64, -64, -64, -64, -64, 64, -64, -64, -64, 64, 64, 64, -64, -64, 64, -64, -64, 64, 64, 64, 64, 64, 64, -64, -64, -64, -64, -64, -64, -64, -64, 64, 64, 64, -64, -64, -64, -64, -64, -64, 64, -64, -64, -64, 64, 64, 64, -64, 64, 64, 64, -64, -64, 64, 64, 64, 64, 64, 64, 64, 64, 64, 64, 64, -64, -64, -64, -64, 64, -64, -64, 64, 64, 64, 64, 64, -64, -64, 64, -64, 64, 64, -64, -64, 64, -64, -64, -64, 64, 64, 64, -64, -64, -64, -64, -64, -64, -64, 64, 64, 64, -64, -64, 64, 64, -64, -64, -64, 64, 64, -64, -64, -64, 64, 64, -64, -64, 64, 64, -64, -64, -64, -64, 64, -64, -64, 64, 64, -64, -64, 64, 64, -64, -64, -64, -64, 64, 64, -64, 64, -64, -64, -64, -64, 64, 64, 64, -64, -64, -64, -64, -64, 64, -64, -64, -64, -64, -64, -64, -64, 64, -64, -64, -64, 64, 64, 64, 64, 64, 64, 64, -64, 64, 64, 64, 64, -64, -64, 64, -64, 64, -64, 64, 64, -64, -64, 64, -64, 64, 64, 64, -64, 64, 64, 64, 64, 64, -64, -64, 64, 64, 64, 64, 64, -64, -64, -64, 64, 64, 64, 64, 64, -64, 64, -64, -64, -64, -64, -64, -64, 64, 64, 64, 64, 64, 64, 64, 64, 64, 64, 64, 64, -64, -64, 64, 64, 64, 64, 64, 64, 64, -64, -64, -64, -64, -64, 64, 64, 64, 64, -64, 64, -64, -64, 64, 64, 64, 64, 64, 64, -64, 64, 64, 64, -64, 64, 64, 64, 64, 64, 64, 64, -64, 64, -64, 64, -64, -64, -64, -64, -64, -64, 64, 64, 64, 64, 64, -64, 64, 64, 64, 64, -64, 64, 64, 64, 64, 64, -64, 64, 64, -64, 64, -64, 64, 64, -64, 64, 64, 64, 64, 64, -64, 64, 64, 64, 64, -64, -64, -64, 64, 64, 64, 64, 64, -64, -64, 64, 64, -64, 64, -64, 64, 64, 64, 64, 64, 64, 64, 64, 64, 64, 64, 64, -64, -64, -64, -64, -64, 64, 64, 64, -64, -64, 64, 64, -64, 64, -64, 64, 64, -64, 64, -64, 64, 64, 64, 64, 64, 64, 64, 64, -64, -64, -64, 64, -64, -64, 64, 64, 64, 64, -64, -64, -64, -64, 64, 64, 64, 64, 64, 64, 64, 64, 64, 64, 64, 64, 64, 64, -64, 64, 64, -64, -64, -64, 64, -64, -64, 64, -64, -64, -64, -64, -64, 64, 64, 64, 64, 64, -64, -64, 64, 64, 64, 64, 64, -64, -64, -64, 64, 64, -64, -64, -64, -64, 64, 64, 64, 64, -64, -64, 64, 64, 64, -64, -64, -64, -64, -64, 64, -64, -64, -64, -64, -64, -64, -64, -64, -64, 64, 64, 64, 64, 64, 64, 64, -64, 64, -64, 64, -64, 64, -64, -64, -64, -64, -64, -64, -64, -64, -64, -64, -64, -64, -64, -64, -64, 64, -64, -64, -64, -64, 64, -64, 64, 64, -64, 64, -64, -64, -64, -64, -64, -64, -64, -64, -64, -64, -64, -64, 64, -64, -64, -64, -64, -64, -64, -64, 64, 64, -64, 64, -64, 64, -64, -64, -64, -64, -64, -64, -64, -64, -64, -64, -64, -64, 64, 64, -64, -64, -64, -64, 64, 64, 64, 64, 64, 64, 64, 64, -64, -64, -64, -64, -64, -64, -64, -64, -64, 64, 64, 64, 64, -64, -64, 64, -64, -64, -64, 64, 64, 64, -64, 64, 64, 64, 64, -64, -64, 64, -64, 64, -64, -64, -64, -64, -64, 64, 64, 64, 64, 64, 64, 64, 64, 64, 64, 64, 64, 64, 64, -64, -64, -64, -64, 64, -64, -64, 64, 64, -64, -64, 64, 64, 64, 64, 64, 64, 64, 64, -64, -64, -64, 64, -64, -64, 64, -64, 64, 64, 64, 64, -64, -64, 64, 64, 64, -64, -64, 64, 64, 64, 64, 64, -64, -64, 64, -64, -64, 64, -64, -64, -64, 64, -64, 64, -64, 64, 64, 64, -64, -64, -64, 64, 64, -64, -64, -64, -64, 64, -64, 64, -64, 64, -64, -64, 64, 64, -64, 64, 64, 64, 64, -64, 64, 64, -64, 64, -64, -64, 64, 64, -64, -64, 64, -64, 64, -64, -64, -64, 64, 64, 64, 64, 64, -64, 64, 64, -64, 64, 64, 64, -64, -64, 64, 64, -64, -64, 64, -64, -64, -64, -64, -64, -64, 64, -64, 64, -64, -64, -64, 64, 64, 64, -64, -64, 64, 64, 64, -64, -64, -64, -64, 64, 64, 64, -64, -64, 64, 64, -64, 64, -64, -64, 64, 64, 64, 64, -64, -64, 64, 64, 64, 64, 64, 64, -64, 64, 64, 64, 64, -64, 64, 64, 64, -64, -64, 64, -64, 64, -64, 64, -64, -64, -64, -64, 64, -64, -64, -64, -64, -64, -64, -64, -64, 64, 64, 64, -64, 64, 64, 64, -64, -64, -64, 64, 64, -64, -64, 64, 64, -64, -64, 64, -64, 64, -64, -64, -64, -64, -64, 64, 64, -64, 64, 64, 64, -64, 64, 64, 64, 64, -64, -64, 64, 64, 64, -64, 64, 64, 64, 64, 64, 64, 64, 64, 64, -64, -64, -64, -64, -64, 64, 64, -64, 64, -64, 64, 64, 64, 64, -64, -64, -64, -64, -64, -64, -64, 64, 64, 64, 64, 64, -64, -64, -64, -64, -64, -64, -64, 64, -64, 64, -64, 64, 64, 64, 64, 64, -64, -64, -64, -64, -64, 64, -64, -64, -64, -64, 64, 64, 64, -64, -64, -64, -64, 64, -64, 64, 64, 64, 64, 64, -64, -64, -64, 64, 64, -64, -64, -64, 64, -64, 64, 64, -64, 64, -64, -64, 64, -64, -64, -64, -64, -64, 64, 64, -64, 64, 64, 64, -64, -64, 64, -64, 64, -64, -64, 64, -64, -64, -64, 64, -64, -64, -64, 64, 64, 64, -64, -64, 64, -64, -64, 64, 64, -64, 64, -64, -64, -64, -64, 64, 64, 64, 64, -64, 64, -64, -64, -64, -64, 64, 64, -64, -64, -64, -64, -64, 64, 64, 64, -64, -64, -64, -64, -64, 64, -64, -64, -64, -64, -64, 64, 64, 64, -64, -64, -64, -64, 64, 64, 64, 64, 64, 64, -64, -64, -64, -64, -64, -64, -64, 64, 64, -64, -64, 64, 64, 64, 64, -64, -64, -64, -64, -64, -64, -64, -64, 64, 64, -64, -64, 64, -64, -64, -64, -64, 64, -64, 64, -64, 64, -64, 64, -64, 64, 64, -64, -64, -64, -64, -64, -64, 64, -64, -64, -64, -64, -64, -64, -64, -64, -64, -64, -64, -64, -64, -64, -64, -64, 64, -64, 64, 64, 64, -64, -64, -64, -64, -64, -64, -64, 64, -64, -64, -64, -64, -64, -64, -64, -64, 64, -64, -64, 64, -64, -64, 64, 64, 64, 64, 64, -64, 64, -64, -64, -64, -64, -64, -64, 64, -64, -64, -64, -64, -64, -64, 64, -64, -64, -64, -64, 64, 64, -64, 64, 64, 64, 64, 64, 64, 64, -64, -64, 64, -64, -64, -64, -64, -64, -64, -64, -64, -64, -64, 64, -64, -64, -64, 64, -64, -64, -64, 64, -64, 64, -64, -64, 64, 64, 64, -64, -64, 64, -64, -64, -64, -64, -64, -64, -64, -64, 64, -64, -64, -64, -64, 64, -64, 64, -64, -64, 64, -64, -64, -64, 64, 64, -64, 64, -64, 64, 64, -64, -64, -64, -64, -64, -64, -64, 64, 64, -64, -64, -64, 64, 64, 64, -64, -64, 64, -64, -64, 64, 64, 64, 64, -64, -64, -64, -64, -64, -64, -64, 64, -64, -64, 64, -64, -64, -64, -64, -64, -64, -64, -64, 64, -64, -64, 64, -64, 64, 64, 64, -64, -64, -64, -64, -64, 64, -64, -64, 64, -64, 64, 64, -64, -64, -64, -64, -64, -64, 64, -64, -64, -64, 64, 64, -64, 64, 64, -64, -64, 64, 64, -64, -64, -64, 64, -64, -64, -64, -64, 64, -64, -64, 64, -64, -64, -64, -64, 64, 64, -64, -64, -64, 64, -64, -64, -64, -64, 64, -64, -64, 64, -64, 64, -64, -64, 64, -64, -64, -64, -64, -64, -64, 64, 64, 64, 64, 64, 64, 64, -64, 64, -64, 64, -64, 64, -64, 64, 64, -64, -64, 64, 64, 64, -64, -64, 64, 64, 64, -64, -64, 64, 64, -64, 64, -64, -64, 64, 64, -64, -64, 64, -64, 64, 64, 64, 64, 64, 64, 64, 64, -64, -64, 64, 64, 64, 64, 64, 64, 64, 64, 64, 64, -64, -64, 64, 64, -64, 64, -64, -64, 64, -64, 64, 64, 64, 64, 64, 64, 64, 64, 64, 64, 64, 64, 64, 64, 64, 64, -64, 64, 64, 64, -64, 64, -64, -64, 64, 64, 64, -64, -64, -64, 64, -64, 64, 64, -64, 64, -64, -64, 64, 64, -64, -64, 64, -64, -64, -64, -64, -64, 64, -64, -64, -64, 64, 64, 64, -64, 64, 64, 64, -64, -64, 64, -64, 64, 64, 64, -64, -64, -64, -64, 64, 64, 64, 64, 64, -64, 64, 64, -64, -64, 64, -64, 64, 64, -64, -64, -64, 64, 64, -64, -64, 64, -64, -64, 64, -64, 64, -64, 64, 64, -64, 64, -64, -64, -64, 64, -64, -64, -64, -64, -64, -64, 64, -64, -64, 64, -64, 64, -64, 64, -64, -64, 64, -64, 64, -64, -64, -64, -64, 64, 64, -64, -64, -64, 64, 64, -64, -64, 64, -64, -64, 64, 64, -64, -64, 64, 64, 64, -64, -64, -64, -64, 64, 64, -64, 64, -64, -64, -64, -64, -64, -64, 64, 64, -64, 64, 64, -64, -64, 64, 64, 64, 64, -64, 64, -64, -64, -64, -64, -64, -64, 64, -64, -64, 64, -64, 64, 64, -64, -64, -64, -64, 64, -64, 64, -64, 64, -64, -64, 64, -64, -64, -64, -64, -64, -64, 64, 64, 64, -64, -64, -64, 64, -64, -64, 64, 64, -64, -64, -64, -64, -64, -64, 64, -64, 64, -64, -64, -64, -64, -64, -64, 64, 64, 64, 64, -64, 64, -64, 64, -64, 64, -64, 64, -64, -64, 64, 64, -64, -64, -64, 64, -64, 64, -64, -64, -64, -64, -64, -64, 64, -64, -64, -64, -64, -64, -64, 64, 64, 64, 64, 64, -64, 64, 64, -64, 64, 64, 64, 64, 64, -64, 64, -64, -64, 64, 64, -64, -64, -64, -64, -64, -64, -64, 64, 64, -64, 64, 64, 64, -64, 64, 64, 64, -64, -64, -64, -64, -64, -64, -64, -64, 64, 64, -64, -64, 64, 64, -64, -64, -64, -64, -64, -64, -64, -64, -64, 64, -64, -64, -64, 64, 64, -64, -64, -64, -64, -64, 64, -64, -64, -64, -64, -64, 64, 64, -64, -64, 64, -64, -64, -64, 64, 64, -64, 64, -64, -64, 64, 64, -64, -64, 64, 64, 64, -64, 64, -64, -64, -64, -64, -64, -64, -64, 64, 64, -64, 64, -64, -64, 64, -64, -64, -64, 64, 64, -64, 64, -64, -64, 64, -64, 64, -64, -64, 64, -64, 64, -64, -64, 64, -64, 64, 64, -64, -64, -64, 64, -64, 64, -64, 64, -64, 64, -64, -64, -64, 64, -64, -64, -64, 64, -64, -64, 64, -64, -64, -64, -64, 64, -64, 64, 64, -64, -64, 64, -64, 64, 64, 64, 64, -64, 64, -64, -64, 64, -64, 64, -64, -64, -64, 64, -64, -64, 64, -64, 64, -64, -64, -64, -64, 64, 64, -64, -64, 64, 64, -64, 64, -64, 64, 64, 64, -64, -64, -64, 64, -64, -64, 64, 64, -64, -64, 64, -64, -64, 64, -64, -64, 64, -64, 64, -64, -64, -64, -64, -64, 64, 64, 64, -64, -64, -64, -64, -64, -64, -64, 64, 64, -64, -64, -64, -64, -64, -64, 64, -64, -64, -64, 64, -64, 64, -64, 64, -64, -64, 64, -64, -64, 64, 64, -64, -64, 64, -64, -64, -64, -64, -64, -64, -64, 64, -64, -64, -64, 64, -64, -64, 64, -64, 64, 64, -64, -64, -64, 64, 64, 64, 64, 64, -64, -64, 64, -64, 64, -64, -64, -64, 64, -64, -64, 64, -64, 64, -64, -64, -64, -64, -64, -64, 64, -64, -64, -64, -64, -64, -64, -64, -64, -64, -64, -64, 64, -64, -64, -64, 64, -64, -64, -64, 64, -64, -64, -64, -64, 64, -64, -64, 64, -64, 64, -64, -64, 64, 64, -64, 64, -64, -64, -64, -64, 64, -64, -64, -64, -64, -64, 64, -64, 64, -64, -64, 64, -64, 64, 64, -64, -64, -64, 64, 64, -64, 64, -64, 64, 64, -64, 64, -64, -64, 64, 64, -64, -64, -64, 64, 64, -64, 64, -64, -64, 64, 64, 64, -64, 64, 64, 64, -64, 64, 64, -64, 64, 64, -64, 64, -64, -64, -64, -64, -64, -64, -64, 64, 64, -64, -64, -64, -64, -64, 64, -64, 64, -64, 64, 64, -64, -64, -64, -64, 64, -64, -64, -64, 64, 64, 64, -64, -64, -64, -64, 64, -64, -64, 64, 64, -64, -64, -64, 64, -64, 64, -64, 64, -64, 64, 64, 64, -64, 64, 64, -64, -64, -64, -64, 64, 64, -64, 64, 64, 64, 64, -64, 64, -64, 64, 64, -64, -64, 64, -64, -64, 64, 64, 64, -64, -64, 64, 64, -64, 64, -64, -64, -64, -64, -64, 64, 64, -64, 64, -64, 64, -64, 64, 64, -64, -64, -64, 64, 64, -64, -64, 64, -64, 64, -64, 64, -64, -64, 64, 64, 64, -64, -64, -64, 64, -64, -64, -64, -64, 64, -64, 64, 64, -64, 64, -64, -64, 64, 64, -64, -64, -64, -64, -64, 64, 64, -64, 64, 64, -64, 64, 64, -64, 64, 64, 64, -64, -64, 64, -64, -64, 64, 64, -64, -64, 64, -64, 64, 64, 64, 64, 64, 64, -64, 64, -64, -64, 64, 64, 64, -64, -64, -64, -64, -64, 64, -64, -64, -64, 64, 64, -64, 64, -64, 64, -64, 64, 64, 64, -64, 64, 64, 64, -64, 64, 64, 64, 64, 64, 64, -64, -64, -64, 64, 64, 64, 64, 64, -64, 64, -64, 64, -64, 64, 64, -64, -64, -64, 64, 64, 64, -64, -64, 64, -64, 64, -64, 64, -64, -64, -64, -64, 64, -64, 64, -64, -64, 64, 64, 64, 64, 64, 64, 64, 64, -64, 64, -64, -64, -64, 64, 64, 64, -64, 64, -64, 64, 64, 64, 64, -64, 64, -64, -64, -64, 64, 64, -64, 64, -64, -64, 64, -64, -64, -64, -64, -64, 64, 64, 64, 64, 64, 64, -64, 64, 64, -64, 64, -64, 64, -64, -64, 64, 64, -64, -64, 64, -64, 64, 64, 64, 64, -64, -64, 64, 64, -64, 64, 64, -64, 64, -64, 64, -64, 64, -64, -64, 64, -64, 64, 64, 64, -64, -64, 64, 64, 64, 64, -64, -64, 64, 64, 64, 64, 64, 64, -64, -64, -64, 64, 64, 64, 64, 64, 64, -64, -64, 64, 64, -64, -64, 64, -64, -64, -64, -64, 64, -64, 64, -64, 64, 64, -64, -64, 64, -64, -64, 64, 64, 64, -64, -64, 64, 64, -64, 64, 64, -64, 64, 64, -64, 64, 64, -64, -64, 64, 64, 64, -64, 64, 64, 64, -64, -64, 64, 64, 64, 64, -64, -64, -64, 64, -64, 64, 64, 64, 64, 64, 64, -64, 64, -64, -64, 64, 64, 64, 64, -64, -64, 64, -64, 64, 64, -64, -64, -64, -64, 64, 64, -64, 64, 64, 64, 64, 64, 64, -64, -64, -64, 64, -64, 64, 64, 64, -64, -64, 64, 64, 64, -64, -64, 64, -64, -64, 64, -64, 64, -64, -64, 64, 64, 64, 64, -64, 64, -64, -64, 64, -64, 64, -64, 64, -64, 64, 64, 64, 64, -64, -64, 64, 64, 64, 64, 64, 64, 64, 64, -64, 64, 64, 64, 64, -64, 64, 64, -64, 64, 64, 64, 64, 64, 64, 64, 64, -64, 64, 64, 64, 64, 64, 64, 64, -64, -64, -64, -64, 64, 64, 64, -64, -64, -64, 64, 64, 64, 64, 64, 64, -64, -64, 64, 64, 64, 64, -64, 64, 64, 64, 64, -64, -64, -64, -64, -64, -64, 64, -64, -64, -64, 64, -64, -64, -64, -64, 64, 64, 64, -64, 64, 64, -64, 64, 64, 64, 64, -64, 64, -64, 64, 64, 64, 64, 64, -64, 64, 64, -64, 64, -64, -64, 64, -64, 64, 64, 64, 64, -64, 64, 64, -64, 64, 64, 64, 64, 64, -64, -64, -64, -64, 64, 64, -64, -64, 64, 64, 64, 64, 64, -64, 64, 64, 64, -64, 64, 64, 64, -64, 64, 64, 64, 64, 64, -64, 64, -64, 64, 64, -64, 64, 64, -64, 64, -64, -64, -64, -64, 64, -64, 64, -64, -64, -64, -64, -64, -64, 64, 64, 64, -64, 64, -64, -64, 64, -64, 64, 64, 64, -64, -64, -64, 64, 64, -64, -64, -64, -64, 64, -64, 64, 64, -64, 64, 64, 64, 64, 64, 64, 64, 64, 64, -64, -64, -64, -64, 64, 64, -64, 64, -64, 64, 64, 64, 64, 64, 64, 64, -64, 64, -64, 64, 64, 64, 64, 64, 64, -64, -64, 64, -64, -64, -64, 64, -64, 64, 64, 64, 64, 64, 64, 64, 64, 64, -64, -64, 64, 64, -64, 64, 64, 64, 64, 64, 64, -64, 64, -64, -64, 64, -64, -64, 64, -64, -64, 64, 64, 64, -64, 64, -64, -64, 64, 64, 64, -64, 64, 64, 64, 64, 64, 64, 64, -64, -64, -64, -64, 64, 64, 64, -64, 64, -64, 64, 64, -64, 64, -64, 64, 64, 64, -64, 64, -64, 64, 64, -64, -64, 64, 64, 64, 64, 64, 64, -64, 64, 64, -64, 64, -64, -64, 64, -64, -64, -64, 64, -64, 64, 64, 64, 64, -64, -64, 64, 64, -64, -64, 64, 64, 64, 64, 64, -64, 64, 64, -64, -64, -64, -64, -64, 64, 64, 64, 64, -64, -64, 64, -64, 64, 64, -64, -64, -64, -64, -64, -64, -64, -64, -64, -64, -64, -64, -64, -64, -64, 64, -64, -64, -64, 64, 64, 64, 64, 64, 64, 64, 64, -64, -64, -64, -64, -64, -64, -64, -64, -64, 64, -64, -64, -64, -64, -64, -64, 64, 64, 64, 64, -64, 64, 64, -64, -64, 64, -64, 64, -64, 64, 64, 64, 64, -64, -64, -64, 64, 64, -64, -64, -64, 64, 64, 64, -64, -64, 64, -64, 64, -64, 64, 64, -64, -64, -64, 64, -64, -64, -64, 64, -64, -64, 64, -64, 64, -64, 64, -64, 64, 64, -64, -64, -64, 64, -64, 64, 64, 64, -64, 64, -64, 64, 64, -64, -64, -64, -64, -64, -64, 64, 64, 64, 64, -64, 64, -64, -64, -64, 64, 64, 64, -64, -64, 64, -64, 64, 64, 64, 64, 64, 64, -64, 64, 64, 64, -64, 64, 64, -64, 64, 64, -64, -64, 64, 64, -64, 64, -64, 64, -64, 64, -64, 64, 64, 64, -64, 64, 64, 64, -64, 64, 64, 64, 64, -64, 64, 64, 64, 64, 64, 64, 64, -64, -64, -64, 64, -64, 64, 64, -64, 64, 64, -64, 64, 64, -64, 64, 64, 64, 64, 64, 64, 64, 64, 64, -64, 64, -64, 64, -64, -64, 64, 64, -64, -64, -64, -64, 64, -64, -64, -64, -64, 64, 64, 64, 64, -64, 64, -64, 64, 64, 64, 64, 64, 64, -64, 64, -64, 64, -64, -64, 64, 64, -64, 64, -64, -64, -64, -64, 64, 64, 64, -64, -64, 64, 64, 64, 64, 64, 64, 64, -64, -64, 64, 64, 64, 64, 64, -64, 64, 64, -64, -64, 64, -64, -64, -64, 64, 64, -64, -64, 64, -64, 64, 64, 64, 64, 64, 64, 64, 64, -64, 64, -64, 64, 64, -64, 64, 64, 64, -64, -64, -64, -64, -64, 64, 64, -64, 64, 64, -64, 64, 64, 64, 64, -64, 64, -64, 64, -64, -64, 64, -64, 64, -64, -64, -64, 64, -64, -64, -64, 64, 64, 64, 64, 64, 64, 64, 64, 64, 64, 64, 64, -64, -64, -64, 64, -64, 64, 64, -64, 64, -64, 64, 64, -64, -64, -64, -64, 64, -64, -64, 64, -64, 64, -64, 64, 64, 64, 64, 64, -64, -64, -64, -64, -64, 64, 64, 64, 64, 64, -64, 64, -64, 64, 64, 64, 64, 64, 64, -64, -64, 64, 64, 64, 64, -64, -64, 64, -64, -64, -64, 64, 64, 64, 64, 64, 64, 64, 64, -64, -64, 64, -64, 64, -64, -64, -64, -64, -64, -64, 64, 64, 64, 64, 64, -64, -64, -64, -64, 64, 64, 64, 64, 64, 64, 64, 64, 64, 64, -64, 64, 64, -64, -64, -64, 64, -64, -64, -64, -64, 64, -64, -64, -64, -64, -64, -64, -64, 64, 64, 64, 64, 64, -64, -64, -64, -64, -64, -64, 64, -64, -64, -64, -64, -64, -64, -64, 64, 64, 64, 64, -64, -64, 64, 64, -64, -64, 64, 64, 64, 64, 64, 64, -64, 64, -64, 64, 64, -64, -64, -64, 64, -64, -64, 64, 64, 64, 64, -64, -64, -64, -64, 64, -64, 64, 64, 64, 64, 64, -64, -64, -64, 64, -64, 64, 64, 64, 64, 64, 64, -64, -64, 64, 64, 64, 64, 64, 64, -64, -64, -64, 64, -64, -64, 64, -64, 64, -64, -64, -64, -64, -64, 64, 64, 64, 64, 64, 64, -64, 64, 64, 64, 64, 64, 64, 64, 64, 64, 64, 64, -64, -64, 64, 64, -64, -64, -64, 64, 64, -64, 64, 64, 64, 64, 64, 64, 64, 64, 64, 64, 64, -64, 64, 64, 64, -64, 64, 64, -64, -64, -64, 64, -64, 64, -64, 64, -64, 64, -64, 64, 64, -64, 64, 64, 64, 64, 64, 64, 64, -64, -64, -64, 64, -64, 64, 64, -64, 64, -64, 64, -64, 64, -64, 64, -64, -64, 64, 64, -64, 64, 64, 64, 64, 64, 64, 64, 64, -64, -64, 64, 64, 64, -64, 64, 64, -64, 64, 64, 64, -64, -64, 64, -64, -64, -64, 64, -64, -64, 64, 64, 64, 64, 64, 64, 64, 64, -64, 64, 64, 64, 64, 64, 64, 64, 64, 64, -64, 64, 64, -64, -64, -64, -64, 64, -64, 64, 64, 64, 64, 64, 64, 64, 64, 64, 64, 64, 64, 64, 64, 64, 64, 64, 64, 64, -64, -64, 64, 64, -64, -64, 64, -64, 64, -64, 64, -64, 64, -64, -64, -64, 64, 64, 64, 64, -64, 64, -64, -64, -64, 64, 64, 64, -64, 64, -64, 64, -64, 64, 64, -64, 64, -64, -64, 64, 64, -64, 64, 64, 64, 64, -64, -64, -64, -64, -64, 64, -64, 64, 64, 64, -64, 64, -64, -64, 64, 64, -64, 64, -64, -64, -64, -64, 64, 64, 64, 64, 64, -64, -64, -64, -64, -64, -64, 64, -64, -64, -64, 64, 64, 64, -64, 64, -64, 64, -64, -64, -64, 64, -64, -64, -64, -64, -64, -64, -64, -64, -64, -64, -64, -64, -64, 64, 64, -64, -64, 64, 64, -64, -64, -64, -64, 64, 64, 64, 64, -64, -64, -64, -64, -64, -64, -64, -64, -64, -64, 64, 64, -64, 64, -64, 64, 64, 64, 64, 64, 64, 64, 64, 64, 64, 64, 64, 64, 64, 64, -64, 64, 64, -64, -64, -64, -64, -64, 64, 64, -64, -64, 64, 64, 64, -64, -64, -64, -64, -64, -64, 64, 64, -64, -64, 64, -64, -64, 64, -64, -64, 64, -64, 64, 64, -64, -64, -64, -64, 64, -64, 64, 64, -64, -64, -64, -64, -64, -64, 64, -64, 64, 64, -64, -64, -64, -64, -64, -64, 64, 64, 64, 64, 64, 64, -64, -64, -64, 64, -64, -64, -64, 64, 64, -64, -64, -64, -64, 64, -64, -64, -64, -64, -64, -64, 64, -64, 64, 64, 64, 64, 64, 64, 64, 64, 64, -64, 64, -64, -64, 64, 64, -64, 64, -64, -64, -64, 64, -64, -64, 64, -64, 64, 64, -64, 64, 64, -64, -64, -64, -64, 64, -64, 64, 64, 64, 64, 64, -64, -64, 64, 64, -64, -64, -64, 64, 64, -64, 64, 64, 64, -64, -64, -64, -64, -64, 64, 64, 64, 64, 64, -64, 64, -64, 64, 64, -64, 64, -64, -64, 64, 64, -64, -64, 64, -64, -64, -64, 64, -64, 64, -64, 64, -64, -64, -64, 64, 64, 64, 64, -64, -64, 64, -64, -64, 64, 64, 64, 64, 64, 64, -64, 64, -64, 64, -64, 64, -64, -64, -64, 64, 64, -64, -64, -64, 64, -64, 64, -64, -64, -64, -64, -64, -64, 64, 64, -64, -64, 64, -64, -64, 64, -64, 64, -64, -64, -64, -64, -64, -64, -64, 64, -64, -64, 64, 64, -64, -64, -64, -64, -64, 64, -64, -64, 64, -64, -64, -64, -64, -64, -64, 64, 64, -64, -64, -64, -64, -64, -64, -64, -64, 64, -64, -64, 64, -64, 64, 64, 64, 64, 64, 64, -64, 64, -64, -64, -64, -64, -64, -64, 64, -64, -64, 64, -64, 64, -64, -64, -64, -64, -64, 64, -64, -64, 64, -64, -64, -64, -64, 64, 64, 64, 64, 64, -64, -64, -64, -64, 64, -64, -64, 64, -64, 64, -64, 64, -64, -64, 64, -64, -64, 64, 64, -64, -64, -64, -64, 64, 64, -64, 64, -64, -64, -64, -64, 64, -64, -64, -64, -64, 64, 64, 64, -64, -64, -64, -64, 64, -64, 64, 64, 64, 64, -64, -64, -64, -64, 64, -64, -64, -64, 64, 64, -64, -64, 64, 64, -64, 64, -64, -64, -64, -64, 64, -64, -64, -64, -64, -64, 64, 64, -64, 64, -64, -64, 64, -64, -64, 64, -64, 64, -64, -64, -64, 64, 64, -64, -64, -64, -64, -64, -64, -64, 64, -64, 64, 64, 64, 64, -64, -64, 64, -64, 64, 64, 64, 64, -64, -64, 64, -64, -64, -64, -64, -64, -64, 64, -64, 64, 64, 64, -64, 64, 64, 64, -64, 64, 64, -64, -64, 64, 64, -64, -64, 64, -64, -64, -64, -64, -64, -64, -64, -64, -64, -64, -64, -64, -64, 64, -64, -64, 64, -64, -64, -64, -64, -64, -64, -64, 64, 64, 64, 64, -64, -64, -64, -64, -64, 64, -64, -64, -64, 64, -64, -64, -64, 64, -64, -64, 64, 64, -64, 64, -64, -64, -64, -64, -64, -64, 64, 64, -64, -64, 64, -64, 64, 64, -64, 64, -64, 64, -64, 64, -64, -64, 64, -64, -64, 64, 64, 64, -64, -64, 64, -64, 64, 64, -64, 64, -64, 64, -64, 64, -64, 64, -64, -64, -64, -64, -64, 64, 64, 64, -64, -64, -64, 64, -64, 64, -64, 64, 64, -64, 64, 64, -64, 64, 64, 64, -64, -64, 64, 64, -64, 64, 64, 64, -64, -64, 64, 64, 64, 64, -64, -64, -64, -64, -64, 64, 64, 64, -64, -64, -64, 64, -64, -64, 64, -64, -64, 64, -64, -64, -64, -64, 64, -64, -64, 64, -64, -64, -64, 64, 64, 64, -64, -64, -64, 64, 64, 64, -64, -64, 64, -64, -64, -64, 64, -64, -64, -64, 64, -64, -64, -64, -64, -64, -64, -64, -64, 64, 64, 64, -64, -64, -64, -64, 64, -64, 64, 64, -64, 64, -64, 64, 64, 64, -64, -64, -64, 64, 64, -64, 64, -64, -64, -64, -64, 64, -64, -64, 64, 64, -64, 64, 64, 64, -64, -64, -64, 64, -64, -64, -64, -64, 64, -64, -64, 64, -64, -64, -64, 64, -64, 64, -64, -64, -64, -64, 64, 64, 64, 64, -64, -64, -64, -64, -64, -64, -64, 64, -64, -64, 64, -64, -64, 64, 64, -64, 64, 64, -64, 64, -64, -64, -64, 64, 64, -64, 64, -64, -64, 64, -64, 64, -64, -64, -64, -64, 64, 64, 64, 64, 64, -64, -64, 64, 64, -64, -64, -64, 64, -64, 64, -64, -64, 64, 64, -64, 64, -64, -64, 64, -64, 64, 64, -64, -64, 64, 64, -64, -64, -64, -64, -64, -64, 64, 64, -64, 64, -64, 64, -64, -64, 64, 64, 64, 64, -64, -64, -64, 64, -64, -64, -64, 64, -64, -64, -64, 64, -64, 64, -64, 64, -64, 64, -64, 64, 64, 64, 64, 64, -64, -64, 64, -64, -64, -64, 64, 64, -64, -64, 64, 64, -64, -64, 64, 64, 64, 64, -64, 64, -64, -64, 64, -64, 64, -64, 64, 64, 64, -64, -64, 64, 64, -64, -64, -64, -64, 64, 64, 64, -64, -64, -64, 64, 64, -64, -64, 64, -64, -64, -64, -64, 64, -64, -64, -64, 64, -64, 64, -64, 64, 64, -64, 64, 64, 64, 64, -64, -64, 64, -64, -64, -64, -64, 64, -64, 64, -64, -64, 64, -64, 64, -64, -64, 64, -64, 64, -64, 64, -64, 64, 64, 64, 64, 64, -64, 64, -64, 64, 64, 64, 64, 64, 64, 64, 64, -64, 64, 64, -64, 64, 64, -64, -64, 64, -64, 64, -64, -64, 64, 64, -64, 64, -64, 64, 64, 64, -64, 64, 64, -64, 64, 64, 64, -64, -64, 64, 64, -64, 64, 64, -64, -64, -64, 64, -64, 64, 64, 64, -64, 64, 64, 64, 64, -64, 64, 64, 64, 64, -64, -64, -64, -64, 64, 64, -64, -64, -64, 64, 64, -64, 64, -64, 64, 64, 64, 64, -64, -64, 64, -64, 64, 64, 64, -64, 64, 64, -64, 64, 64, -64, -64, -64, -64, -64, -64, 64, 64, -64, -64, -64, 64, 64, -64, -64, 64, 64, -64, 64, 64, -64, 64, 64, 64, -64, 64, -64, -64, 64, -64, -64, -64, 64, 64, 64, 64, 64, -64, -64, -64, 64, 64, -64, 64, 64, -64, 64, 64, 64, -64, -64, 64, 64, 64, 64, 64, 64, 64, 64, 64, 64, 64, 64, 64, -64, -64, -64, -64, 64, -64, 64, 64, 64, 64, 64, 64, 64, 64, 64, 64, 64, -64, -64, 64, -64, -64, 64, 64, -64, -64, 64, 64, 64, 64, 64, -64, -64, 64, 64, 64, 64, 64, -64, 64, -64, 64, -64, -64, -64, -64, 64, -64, -64, 64, 64, 64, -64, -64, 64, 64, -64, 64, -64, -64, -64, 64, -64, 64, 64, 64, 64, 64, 64, 64, -64, 64, -64, 64, 64, -64, -64, 64, 64, 64, -64, -64, -64, -64, 64, 64, 64, -64, 64, 64, 64, 64, -64, 64, 64, 64, 64, -64, -64, 64, 64, 64, -64, -64, -64, -64, -64, -64, -64, 64, -64, -64, 64, 64, -64, -64, 64, 64, 64, -64, 64, 64, 64, -64, 64, 64, 64, -64, 64, -64, 64, 64, 64, -64, -64, 64, -64, 64, 64, -64, -64, -64, 64, -64, 64, 64, 64, 64, 64, 64, 64, -64, -64, 64, 64, 64, -64, 64, 64, 64, 64, 64, -64, 64, -64, 64, 64, -64, 64, -64, 64, 64, 64, -64, -64, 64, -64, 64, 64, 64, 64, 64, 64, 64, -64, 64, 64, 64, 64, -64, -64, 64, 64, 64, 64, -64, -64, -64, -64, -64, 64, -64, -64, -64, 64, 64, 64, -64, 64, 64, 64, 64, -64, -64, 64, 64, -64, -64, -64, -64, 64, 64, -64, 64, -64, 64, 64, -64, -64, 64, -64, 64, -64, 64, 64, 64, -64, 64, 64, -64, 64, 64, 64, 64, 64, 64, 64, 64, -64, 64, 64, -64, -64, 64, -64, 64, 64, 64, 64, -64, 64, 64, 64, 64, -64, 64, 64, 64, 64, 64, -64, 64, -64, 64, 64, 64, 64, 64, 64, -64, 64, 64, -64, -64, 64, -64, 64, 64, 64, 64, -64, 64, -64, 64, 64, 64, 64, 64, 64, 64, -64, 64, -64, 64, 64, 64, -64, -64, -64, -64, -64, 64, -64, 64, 64, -64, -64, 64, -64, 64, 64, -64, -64, -64, 64, -64, 64, 64, -64, 64, 64, 64, 64, -64, 64, 64, 64, -64, 64, -64, 64, -64, 64, 64, 64, -64, 64, -64, -64, 64, 64, -64, 64, -64, -64, -64, -64, 64, -64, -64, -64, -64, -64, 64, -64, 64, 64, -64, 64, 64, 64, 64, 64, 64, -64, -64, -64, 64, 64, 64, 64, -64, 64, 64, 64, 64, 64, 64, 64, 64, -64, -64, 64, 64, 64, -64, -64, -64, 64, -64, 64, -64, 64, 64, -64, -64, -64, 64, 64, 64, -64, 64, 64, 64, 64, 64, 64, -64, -64, 64, 64, 64, -64, 64, 64, -64, -64, -64, 64, -64, -64, -64, 64, 64, -64, 64, -64, 64, -64, 64, -64, 64, -64, 64, -64, -64, 64, -64, 64, -64, 64, -64, 64, 64, -64, 64, -64, 64, 64, 64, -64, 64, -64, -64, 64, 64, 64, 64, 64, -64, 64, -64, 64, 64, -64, 64, 64, -64, 64, -64, 64, -64, -64, 64, 64, -64, -64, 64, 64, 64, 64, -64, 64, 64, 64, -64, -64, 64, 64, 64, -64, 64, -64, 64, -64, -64, 64, 64, 64, 64, -64, 64, 64, 64, 64, 64, -64, 64, 64, -64, -64, 64, -64, -64, 64, 64, 64, 64, -64, 64, -64, 64, -64, 64, -64, 64, -64, 64, 64, 64, 64, -64, -64, 64, 64, 64, 64, 64, 64, 64, -64, 64, -64, -64, 64, -64, -64, -64, -64, -64, 64, 64, -64, 64, -64, -64, -64, -64, 64, -64, -64, 64, 64, -64, 64, 64, 64, -64, -64, -64, -64, -64, -64, -64, -64, 64, 64, -64, -64, 64, -64, 64, 64, -64, 64, 64, -64, -64, 64, -64, -64, -64, 64, -64, -64, 64, 64, 64, -64, 64, 64, -64, 64, 64, 64, 64, -64, 64, -64, 64, -64, 64, -64, -64, 64, -64, -64, 64, -64, -64, -64, -64, -64, -64, -64, 64, 64, -64, -64, -64, -64, -64, 64, 64, 64, -64, -64, -64, 64, 64, -64, -64, -64, -64, -64, -64, 64, -64, 64, 64, -64, -64, -64, -64, 64, -64, 64, -64, 64, -64, -64, 64, 64, -64, -64, 64, -64, -64, 64, 64, -64, 64, -64, -64, -64, -64, -64, -64, -64, -64, -64, -64, -64, -64, -64, -64, -64, 64, 64, -64, 64, 64, -64, -64, -64, -64, 64, 64, -64, -64, -64, -64, -64, -64, -64, -64, -64, -64, -64, -64, -64, -64, -64, -64, -64, -64, 64, 64, 64, -64, -64, -64, -64, -64, -64, -64, -64, -64, -64, -64, -64, 64, 64, -64, 64, -64, 64, -64, -64, -64, -64, 64, -64, 64, 64, -64, -64, -64, -64, -64, -64, 64, 64, -64, -64, -64, -64, -64, -64, -64, -64, -64, 64, -64, 64, -64, -64, -64, -64, -64, -64, -64, 64, 64, 64, -64, -64, -64, -64, -64, 64, -64, -64, -64, -64, -64, 64, 64, -64, -64, -64, 64, 64, -64, 64, 64, -64, -64, -64, -64, -64, 64, -64, -64, 64, 64, -64, 64, 64, -64, -64, -64, 64, 64, -64, 64, -64, -64, -64, 64, 64, -64, -64, -64, 64, -64, -64, 64, 64, -64, -64, -64, 64, -64, -64, -64, -64, -64, -64, -64, 64, -64, -64, 64, 64, -64, 64, -64, 64, -64, 64, 64, -64, -64, -64, 64, -64, -64, -64, -64, 64, -64, -64, 64, -64, -64, 64, -64, 64, 64, 64, -64, 64, 64, -64, -64, -64, 64, -64, 64, -64, 64, -64, 64, 64, 64, -64, 64, -64, 64, -64, -64, -64, -64, -64, 64, 64, -64, 64, 64, -64, 64, -64, -64, 64, -64, 64, 64, 64, 64, -64, -64, 64, -64, 64, -64, 64, 64, -64, 64, 64, -64, -64, 64, 64, -64, 64, -64, -64, 64, -64, -64, -64, 64, -64, 64, -64, -64, -64, 64, 64, -64, 64, 64, 64, 64, -64, 64, -64, -64, -64, -64, -64, 64, 64, -64, 64, -64, -64, -64, -64, 64, -64, -64, -64, -64, -64, -64, -64, -64, -64, -64, -64, -64, -64, 64, -64, -64, -64, 64, 64, -64, -64, 64, -64, -64, -64, -64, 64, -64, 64, -64, 64, -64, 64, -64, -64, 64, 64, -64, 64, -64, -64, -64, -64, -64, -64, -64, -64, -64, -64, 64, 64, -64, -64, -64, -64, 64, -64, -64, -64, -64, -64, 64, -64, -64, -64, -64, -64, -64, -64, -64, -64, -64, 64, -64, -64, -64, -64, -64, -64, -64, -64, -64, -64, -64, 64, 64, -64, -64, 64, 64, -64, -64, -64, -64, -64, 64, -64, -64, -64, -64, -64, 64, -64, 64, -64, -64, -64, -64, -64, 64, 64, 64, -64, -64, -64, -64, 64, -64, -64, 64, 64, -64, 64, -64, 64, 64, -64, 64, -64, -64, -64, -64, -64, -64, -64, -64, 64, -64, -64, -64, 64, 64, -64, -64, -64, 64, 64, -64, 64, 64, -64, -64, 64, -64, -64, -64, -64, -64, -64, -64, -64, -64, -64, -64, -64, -64, -64, -64, -64, 64, -64, -64, 64, -64, 64, 64, -64, 64, -64, -64, -64, -64, 64, -64, 64, 64, -64, 64, 64, -64, -64, -64, -64, 64, -64, -64, -64, 64, 64, -64, -64, 64, 64, 64, 64, -64, -64, 64, 64, -64, 64, 64, -64, -64, -64, -64, -64, -64, 64, -64, -64, -64, -64, 64, 64, 64, -64, -64, 64, -64, -64, -64, 64, 64, -64, -64, -64, -64, 64, 64, 64, -64, 64, -64, 64, -64, 64, -64, -64, -64, -64, -64, -64, -64, -64, 64, -64, -64, -64, 64, -64, -64, -64, 64, 64, -64, 64, 64, 64, -64, -64, 64, -64, 64, 64, -64, -64, -64, -64, 64, 64, 64, -64, 64, -64, -64, 64, -64, 64, -64, -64, 64, -64, -64, -64, 64, 64, 64, -64, 64, 64, 64, 64, 64, -64, -64, 64, 64, 64, 64, -64, -64, -64, -64, -64, 64, -64, 64, -64, 64, 64, -64, 64, 64, -64, -64, 64, 64, -64, -64, -64, -64, -64, -64, -64, 64, -64, -64, 64, -64, 64, 64, -64, -64, 64, 64, -64, 64, -64, -64, 64, -64, -64, 64, -64, 64, -64, 64, 64, 64, 64, 64, 64, -64, -64, 64, -64, -64, 64, 64, 64, -64, 64, 64, 64, 64, 64, 64, -64, -64, 64, -64, -64, 64, 64, -64, -64, 64, 64, 64, 64, -64, -64, -64, -64, 64, 64, -64, 64, -64, -64, 64, 64, -64, -64, -64, 64, -64, -64, -64, -64, -64, -64, -64, -64, -64, 64, 64, -64, 64, -64, -64, -64, -64, -64, 64, 64, 64, 64, -64, -64, -64, 64, 64, 64, 64, -64, -64, -64, -64, -64, 64, -64, -64, -64, -64, -64, 64, 64, 64, 64, 64, 64, 64, -64, 64, 64, -64, -64, 64, 64, -64, 64, -64, -64, -64, -64, -64, -64, -64, -64, -64, -64, -64, -64, -64, 64, -64, -64, 64, 64, 64, 64, 64, -64, 64, 64, 64, 64, -64, -64, -64, -64, -64, -64, -64, 64, 64, -64, -64, 64, 64, 64, 64, -64, 64, -64, -64, 64, 64, 64, -64, 64, -64, 64, 64, -64, 64, -64, -64, -64, -64, 64, -64, 64, 64, 64, 64, 64, 64, 64, 64, 64, 64, -64, -64, -64, -64, -64, -64, -64, 64, 64, 64, 64, -64, -64, -64, -64, -64, -64, 64, 64, 64, 64, -64, 64, 64, 64, 64, 64, -64, -64, -64, -64, -64, -64, -64, 64, -64, 64, 64, 64, 64, -64, 64, 64, -64, -64, -64, 64, -64, -64, 64, -64, -64, -64, 64, -64, -64, -64, -64, -64, -64, -64, 64, -64, -64, 64, 64, 64, -64, 64, -64, -64, -64, -64, 64, -64, -64, -64, 64, -64, -64, -64, -64, -64, -64, -64, -64, -64, 64, 64, -64, 64, 64, 64, 64, 64, -64, -64, -64, -64, -64, -64, 64, 64, -64, -64, 64, -64, 64, 64, 64, -64, -64, -64, -64, -64, 64, 64, 64, 64, -64, -64, -64, 64, 64, -64, -64, -64, 64, 64, -64, 64, -64, 64, -64, -64, 64, 64, -64, -64, -64, -64, -64, -64, -64, -64, 64, -64, -64, -64, -64, -64, -64, -64, -64, -64, -64, 64, 64, 64, 64, 64, 64, 64, 64, 64, -64, -64, -64, -64, -64, 64, 64, 64, -64, -64, -64, -64, -64, -64, -64, -64, -64, -64, 64, 64, 64, 64, 64, 64, 64, 64, 64, -64, 64, -64, -64, -64, -64, -64, 64, -64, 64, -64, -64, -64, -64, -64, -64, -64, -64, -64, 64, -64, 64, 64, 64, 64, -64, 64, -64, 64, -64, -64, -64, -64, -64, -64, 64, -64, 64, -64, -64, 64, 64, -64, -64, -64, -64, -64, 64, -64, 64, 64, -64, 64, -64, -64, -64, 64, -64, -64, -64, -64, -64, -64, 64, -64, 64, -64, -64, 64, 64, 64, -64, -64, -64, -64, 64, 64, -64, 64, -64, 64, 64, 64, 64, -64, 64, -64, -64, -64, -64, -64, -64, 64, -64, 64, -64, 64, 64, -64, -64, -64, 64, -64, -64, -64, -64, -64, -64, 64, -64, 64, 64, 64, -64, -64, -64, -64, -64, -64, -64, 64, 64, 64, 64, 64, 64, -64, -64, -64, -64, -64, -64, -64, -64, 64, -64, 64, -64, 64, -64, -64, -64, -64, -64, -64, -64, -64, -64, 64, -64, 64, 64, 64, -64, -64, -64, -64, -64, -64, -64, -64, -64, 64, -64, -64, -64, 64, 64, -64, -64, -64, -64, -64, -64, -64, 64, -64, -64, -64, -64, -64, 64, -64, -64, -64, 64, 64, -64, -64, -64, -64, -64, -64, -64, 64, -64, 64, -64, -64, -64, -64, -64, -64, 64, -64, -64, 64, 64, 64, -64, 64, -64, -64, 64, 64, -64, -64, -64, -64, -64, -64, -64, -64, -64, -64, -64, -64, -64, -64, 64, 64, -64, 64, 64, 64, 64, 64, -64, -64, -64, -64, -64, -64, -64, 64, -64, -64, -64, -64, -64, -64, -64, -64, -64, -64, -64, -64, 64, -64, -64, -64, 64, -64, 64, 64, -64, -64, -64, -64, 64, 64, 64, 64, 64, 64, 64, -64, -64, -64, 64, -64, -64, -64, -64, 64, 64, -64, 64, -64, 64, -64, 64, 64, 64, -64, -64, -64, 64, 64, 64, 64, 64, 64, 64, -64, 64, -64, 64, 64, 64, 64, -64, 64, 64, 64, -64, 64, 64, -64, -64, -64, -64, -64, 64, -64, 64, 64, 64, -64, -64, 64, 64, -64, -64, -64, 64, -64, 64, 64, 64, 64, 64, -64, -64, 64, 64, 64, 64, 64, -64, -64, -64, -64, -64, -64, -64, -64, -64, 64, -64, -64, -64, -64, 64, -64, 64, -64, 64, 64, 64, -64, 64, 64, -64, 64, 64, -64, -64, 64, 64, -64, -64, -64, 64, 64, 64, -64, -64, 64, 64, 64, -64, 64, 64, -64, 64, -64, -64, 64, -64, -64, 64, 64, 64, 64, -64, 64, 64, -64, 64, -64, -64, 64, 64, 64, 64, 64, -64, -64, 64, -64, -64, -64, 64, -64, -64, -64, -64, 64, -64, -64, -64, -64, 64, 64, 64, 64, -64, 64, 64, 64, -64, 64, -64, -64, 64, 64, -64, -64, -64, 64, -64, 64, -64, -64, -64, -64, -64, 64, 64, 64, 64, -64, 64, 64, -64, -64, -64, -64, -64, -64, -64, -64, 64, -64, -64, -64, 64, -64, 64, 64, 64, -64, 64, -64, 64, -64, -64, -64, -64, 64, 64, -64, -64, -64, 64, -64, -64, -64, -64, -64, -64, -64, -64, -64, -64, -64, -64, -64, -64, -64, -64, 64, -64, -64, -64, -64, 64, -64, -64, -64, -64, -64, -64, -64, -64, -64, -64, -64, 64, -64, 64, -64, -64, -64, 64, -64, 64, 64, -64, 64, 64, 64, -64, 64, -64, -64, -64, -64, -64, -64, -64, -64, -64, -64, 64, -64, 64, -64, -64, -64, -64, 64, -64, -64, 64, -64, -64, -64, -64, 64, -64, -64, 64, -64, -64, -64, -64, -64, -64, -64, -64, -64, -64, -64, -64, -64, -64, 64, -64, -64, 64, -64, 64, 64, 64, 64, -64, 64, 64, -64, 64, 64, -64, -64, -64, 64, 64, -64, -64, -64, -64, -64, -64, 64, 64, 64, -64, 64, 64, -64, 64, 64, 64, 64, 64, 64, 64, 64, 64, 64, 64, -64, 64, 64, -64, 64, -64, 64, -64, -64, -64, -64, -64, 64, 64, 64, -64, 64, 64, 64, -64, 64, 64, 64, 64, 64, 64, 64, 64, 64, 64, 64, 64, 64, 64, 64, 64, 64, 64, 64, -64, -64, 64, 64, 64, 64, 64, 64, -64, -64, -64, 64, 64, 64, 64, 64, 64, 64, 64, 64, 64, 64, 64, 64, 64, 64, 64, -64, 64, -64, 64, 64, -64, 64, 64, 64, 64, -64, -64, 64, 64, 64, 64, 64, -64, 64, 64, 64, 64, 64, 64, 64, 64, 64, 64, -64, -64, 64, -64, 64, -64, 64, 64, 64, -64, -64, 64, 64, -64, -64, -64, -64, -64, 64, 64, 64, 64, 64, 64, -64, -64, -64, -64, -64, 64, -64, -64, -64, -64, 64, 64, 64, 64, 64, 64, -64, 64, 64, 64, 64, 64, 64, 64, 64, 64, -64, -64, -64, -64, -64, -64, -64, -64, -64, -64, -64, 64, 64, 64, -64, 64, 64, -64, 64, -64, -64, -64, -64, 64, 64, 64, 64, -64, -64, -64, -64, -64, -64, -64, -64, -64, -64, -64, -64, -64, 64, 64, 64, 64, 64, 64, 64, 64, -64, -64, 64, 64, 64, -64, -64, -64, -64, -64, -64, -64, -64, -64, -64, -64, 64, -64, 64, 64, 64, 64, 64, -64, -64, 64, 64, -64, -64, -64, -64, 64, 64, 64, 64, -64, -64, -64, -64, -64, -64, -64, 64, -64, -64, 64, -64, 64, 64, -64, 64, 64, 64, -64, 64, -64, -64, 64, -64, -64, -64, -64, -64, -64, -64, -64, -64, -64, -64, -64, -64, 64, 64, 64, -64, 64, 64, 64, 64, -64, 64, 64, 64, -64, -64, -64, -64, -64, -64, -64, -64, -64, -64, -64, -64, -64, -64, -64, 64, 64, 64, 64, 64, 64, -64, 64, 64, 64, -64, 64, 64, 64, -64, -64, -64, -64, -64, 64, -64, -64, -64, -64, -64, -64, -64, 64, -64, -64, 64, -64, 64, 64, 64, -64, 64, 64, 64, -64, 64, -64, 64, -64, 64, -64, -64, -64, -64, -64, -64, -64, -64, -64, 64, -64, -64, -64, -64, 64, 64, 64, -64, -64, 64, 64, -64, -64, -64, 64, 64, 64, -64, -64, 64, -64, -64, -64, -64, 64, 64, 64, -64, 64, 64, 64, 64, 64, -64, 64, 64, -64, -64, 64, -64, -64, 64, -64, 64, 64, 64, -64, 64, 64, 64, 64, -64, -64, -64, 64, 64, 64, -64, 64, 64, 64, 64, 64, -64, -64, -64, 64, 64, 64, 64, -64, -64, 64, 64, 64, 64, 64, 64, 64, 64, 64, 64, 64, 64, 64, 64, 64, 64, 64, -64, 64, -64, -64, 64, 64, -64, -64, -64, -64, -64, -64, -64, 64, 64, 64, 64, -64, -64, 64, -64, 64, 64, 64, 64, 64, 64, 64, 64, 64, 64, 64, -64, -64, 64, 64, -64, 64, 64, -64, -64, 64, -64, -64, 64, -64, -64, 64, -64, 64, 64, -64, 64, 64, -64, -64, -64, 64, -64, 64, -64, 64, 64, 64, 64, -64, 64, 64, 64, 64, -64, 64, -64, -64, -64, -64, -64, 64, 64, 64, -64, -64, -64, 64, -64, -64, 64, 64, 64, 64, 64, -64, -64, 64, -64, -64, -64, -64, -64, -64, -64, -64, -64, -64, 64, 64, 64, -64, -64, 64, -64, -64, -64, 64, -64, -64, 64, 64, 64, -64, -64, -64, 64, 64, 64, 64, -64, 64, -64, 64, -64, -64, -64, -64, -64, 64, 64, -64, 64, 64, 64, -64, -64, 64, -64, 64, -64, -64, 64, -64, -64, 64, -64, 64, 64, -64, 64, -64, -64, -64, 64, -64, 64, -64, 64, 64, 64, 64, -64, 64, -64, 64, -64, 64, 64, 64, -64, -64, 64, -64, -64, -64, -64, 64, -64, -64, -64, -64, -64, -64, -64, -64, -64, 64, 64, -64, 64, 64, 64, 64, -64, 64, -64, 64, -64, 64, -64, -64, 64, -64, -64, -64, -64, -64, -64, -64, 64, 64, -64, -64, -64, 64, 64, 64, 64, 64, -64, 64, 64, 64, -64, -64, 64, -64, -64, 64, 64, 64, 64, 64, -64, -64, 64, 64, 64, 64, 64, -64, -64, 64, 64, 64, 64, 64, 64, 64, 64, 64, -64, -64, 64, -64, 64, -64, 64, 64, 64, 64, 64, 64, 64, 64, 64, -64, 64, -64, 64, 64, 64, 64, -64, 64, 64, 64, 64, -64, 64, -64, 64, -64, -64, -64, 64, 64, 64, 64, 64, 64, 64, 64, 64, 64, 64, 64, 64, 64, 64, -64, 64, 64, 64, 64, 64, 64, -64, -64, -64, -64, -64, -64, 64, 64, 64, 64, 64, 64, 64, 64, 64, 64, 64, 64, 64, 64, 64, 64, 64, 64, 64, 64, -64, -64, 64, 64, 64, -64, 64, -64, 64, 64, 64, 64, 64, 64, 64, 64, 64, 64, 64, 64, 64, 64, 64, 64, 64, 64, 64, 64, -64, 64, -64, 64, 64, -64, -64, -64, -64, -64, -64, -64, 64, 64, 64, 64, 64, 64, 64, 64, 64, 64, 64, -64, -64, -64, -64, 64, -64, -64, -64, 64, -64, -64, -64, -64, -64, -64, -64, -64, -64, -64, -64, -64, -64, -64, -64, -64, 64, 64, -64, 64, 64, -64, 64, -64, -64, -64, 64, 64, -64, -64, -64, -64, 64, -64, -64, -64, -64, -64, -64, -64, -64, -64, -64, -64, -64, -64, 64, 64, -64, -64, -64, 64, 64, -64, -64, 64, -64, -64, -64, -64, 64, -64, 64, -64, -64, -64, 64, 64, 64, -64, -64, -64, -64, 64, 64, -64, 64, -64, -64, -64, -64, -64, -64, -64, -64, 64, -64, -64, -64, -64, -64, 64, -64, -64, -64, -64, 64, 64, -64, -64, 64, -64, -64, -64, 64, -64, -64, -64, -64, -64, 64, 64, 64, -64, -64, -64, -64, 64, 64, 64, -64, 64, 64, 64, 64, 64, 64, 64, 64, -64, 64, -64, 64, -64, -64, -64, -64, -64, -64, 64, 64, -64, 64, 64, -64, 64, 64, 64, 64, 64, 64, 64, -64, 64, -64, -64, -64, -64, -64, 64, 64, 64, -64, -64, -64, -64, 64, -64, -64, -64, -64, 64, -64, 64, 64, 64, -64, -64, 64, -64, 64, 64, -64, 64, -64, -64, -64, -64, -64, -64, -64, -64, -64, -64, -64, -64, -64, 64, -64, -64, 64, 64, -64, 64, 64, 64, 64, 64, 64, -64, 64, 64, -64, -64, -64, 64, -64, -64, -64, -64, -64, -64, 64, -64, 64, 64, -64, 64, -64, -64, -64, 64, 64, -64, 64, 64, -64, -64, 64, 64, 64, 64, 64, 64, 64, 64, 64, -64, -64, -64, -64, 64, -64, -64, 64, -64, -64, 64, 64, 64, 64, 64, 64, -64, -64, 64, 64, 64, 64, 64, 64, 64, 64, 64, 64, -64, 64, -64, 64, -64, 64, -64, 64, -64, 64, -64, -64, -64, 64, 64, 64, 64, 64, -64, -64, -64, -64, 64, 64, 64, 64, 64, 64, 64, -64, 64, -64, 64, -64, 64, 64, 64, -64, -64, 64, 64, 64, 64, 64, -64, 64, 64, 64, -64, 64, 64, 64, 64, 64, 64, 64, 64, 64, -64, -64, 64, -64, -64, -64, 64, -64, 64, 64, -64, 64, 64, 64, 64, 64, -64, -64, 64, 64, 64, -64, -64, 64, 64, 64, 64, -64, -64, 64, 64, -64, 64, 64, 64, -64, 64, 64, 64, 64, 64, 64, 64, 64, 64, 64, 64, -64, 64, -64, 64, 64, 64, 64, 64, -64, 64, 64, -64, 64, -64, -64, 64, 64, 64, 64, 64, -64, -64, 64, 64, 64, 64, 64, 64, -64, 64, 64, 64, 64, 64, 64, 64, -64, 64, -64, -64, 64, 64, -64, -64, -64, -64, -64, -64, 64, 64, 64, 64, 64, -64, 64, -64, -64, -64, -64, -64, -64, -64, -64, 64, -64, -64, 64, -64, -64, 64, -64, 64, 64, 64, 64, -64, 64, 64, 64, -64, -64, -64, 64, 64, 64, -64, -64, -64, -64, -64, -64, -64, 64, -64, 64, 64, 64, 64, -64, 64, -64, 64, 64, -64, -64, -64, -64, -64, -64, -64, 64, 64, -64, -64, 64, -64, 64, 64, 64, 64, 64, 64, 64, 64, 64, 64, 64, -64, 64, -64, -64, 64, 64, 64, 64, -64, -64, 64, -64, -64, -64, -64, -64, 64, -64, -64, -64, 64, -64, 64, -64, 64, 64, -64, 64, 64, 64, 64, -64, 64, 64, 64, -64, -64, 64, 64, -64, 64, 64, -64, -64, 64, 64, 64, -64, -64, 64, 64, 64, 64, 64, -64, 64, -64, -64, 64, -64, 64, -64, 64, 64, 64, -64, -64, 64, -64, -64, 64, -64, 64, -64, 64, 64, 64, -64, 64, -64, 64, -64, -64, -64, 64, -64, -64, -64, -64, -64, -64, -64, 64, 64, 64, 64, 64, 64, -64, -64, -64, -64, -64, -64, 64, -64, -64, 64, 64, 64, -64, -64, 64, 64, -64, -64, 64, -64, -64, -64, -64, -64, 64, 64, -64, 64, 64, 64, 64, -64, -64, -64, 64, 64, 64, 64, -64, -64, -64, -64, -64, 64, 64, 64, 64, 64, 64, 64, -64, 64, 64, -64, 64, -64, 64, -64, -64, 64, -64, -64, -64, 64, 64, 64, 64, -64, -64, 64, 64, -64, -64, -64, -64, 64, 64, 64, 64, 64, -64, -64, 64, 64, 64, -64, 64, 64, 64, -64, -64, 64, -64, 64, 64, -64, 64, 64, 64, 64, 64, 64, 64, 64, 64, 64, 64, 64, -64, -64, -64, -64, 64, 64, -64, -64, -64, -64, -64, -64, 64, -64, -64, -64, 64, 64, 64, 64, 64, 64, 64, 64, 64, 64, 64, -64, 64, 64, -64, -64, 64, -64, -64, 64, -64, -64, -64, 64, 64, 64, -64, 64, 64, -64, 64, 64, 64, 64, 64, 64, 64, 64, 64, 64, 64, 64, 64, 64, 64, -64, -64, -64, -64, 64, 64, -64, 64, 64, 64, 64, 64, 64, -64, 64, 64, 64, 64, 64, 64, 64, 64, 64, 64, 64, -64, 64, 64, -64, 64, -64, -64, 64, -64, -64, 64, 64, 64, 64, -64, -64, 64, 64, 64, 64, 64, 64, -64, 64, 64, -64, -64, -64, 64, 64, 64, -64, -64, 64, 64, -64, -64, -64, 64, -64, -64, -64, -64, 64, 64, 64, 64, 64, -64, -64, -64, 64, 64, 64, 64, -64, 64, 64, -64, -64, -64, 64, 64, 64, -64, 64, -64, 64, -64, -64, -64, -64, 64, 64, 64, 64, -64, -64, 64, 64, -64, 64, 64, -64, 64, -64, -64, -64, 64, 64, 64, 64, -64, -64, 64, 64, -64, 64, -64, -64, 64, 64, 64, -64, -64, -64, 64, -64, -64, 64, 64, 64, 64, 64, 64, 64, 64, -64, 64, -64, -64, -64, 64, -64, 64, -64, -64, 64, 64, 64, -64, -64, -64, -64, -64, 64, -64, -64, 64, 64, -64, 64, 64, 64, 64, 64, 64, -64, -64, -64, 64, -64, -64, 64, -64, 64, 64, -64, -64, -64, -64, -64, -64, -64, 64, -64, -64, 64, 64, 64, 64, 64, 64, 64, -64, -64, 64, -64, -64, -64, 64, 64, 64, -64, 64, 64, 64, -64, -64, -64, -64, -64, -64, 64, 64, 64, 64, 64, 64, -64, 64, 64, -64, 64, 64, 64, 64, 64, 64, -64, -64, 64, -64, 64, 64, 64, -64, -64, -64, -64, 64, 64, 64, 64, 64, 64, 64, 64, 64, 64, 64, -64, 64, 64, 64, -64, 64, 64, -64, -64, 64, 64, 64, 64, -64, -64, -64, -64, -64, 64, -64, 64, 64, 64, -64, 64, 64, -64, -64, -64, -64, -64, 64, 64, 64, 64, -64, 64, -64, 64, 64, 64, -64, -64, -64, -64, 64, 64, 64, 64, 64, 64, 64, 64, -64, -64, -64, 64, 64, 64, 64, -64, -64, -64, -64, 64, 64, 64, 64, 64, 64, -64, -64, 64, 64, 64, 64, 64, 64, 64, 64, 64, 64, -64, 64, 64, 64, 64, -64, 64, 64, 64, 64, -64, 64, -64, -64, -64, -64, -64, -64, -64, 64, 64, 64, 64, 64, 64, 64, 64, -64, 64, 64, -64, -64, -64, 64, 64, 64, -64, -64, -64, -64, 64, -64, -64, -64, -64, -64, 64, 64, 64, 64, 64, 64, 64, 64, 64, -64, 64, -64, 64, 64, -64, 64, -64, -64, -64, -64, 64, 64, 64, 64, -64, -64, 64, -64, -64, 64, 64, -64, 64, 64, 64, 64, 64, -64, -64, 64, -64, 64, 64, 64, -64, -64, -64, 64, 64, -64, -64, 64, 64, -64, -64, 64, -64, 64, 64, 64, 64, 64, 64, 64, 64, -64, -64, -64, -64, -64, 64, 64, -64, -64, 64, 64, 64, 64, -64, 64, 64, -64, -64, -64, 64, 64, -64, 64, 64, 64, -64, 64, 64, 64, -64, -64, 64, 64, -64, -64, -64, 64, 64, 64, 64, -64, -64, -64, 64, -64, 64, -64, -64, -64, 64, -64, -64, -64, 64, 64, -64, -64, -64, 64, 64, 64, -64, -64, 64, -64, -64, -64, 64, 64, 64, 64, 64, -64, 64, -64, 64, 64, -64, 64, -64, -64, -64, -64, 64, -64, -64, -64, 64, -64, -64, 64, -64, 64, 64, -64, 64, 64, 64, -64, -64, -64, 64, 64, -64, 64, -64, 64, -64, 64, -64, -64, -64, -64, 64, 64, -64, 64, 64, 64, -64, 64, 64, -64, 64, -64, 64, 64, 64, -64, -64, -64, 64, 64, -64, 64, 64, 64, 64, 64, -64, 64, 64, 64, -64, -64, 64, -64, -64, -64, -64, 64, 64, -64, 64, 64, -64, 64, -64, -64, 64, 64, -64, -64, -64, 64, 64, -64, -64, -64, 64, 64, 64, -64, 64, -64, 64, -64, -64, 64, 64, -64, -64, -64, -64, -64, -64, -64, -64, 64, -64, 64, -64, -64, -64, -64, -64, -64, 64, 64, -64, -64, -64, 64, -64, -64, -64, 64, 64, -64, -64, -64, -64, -64, -64, -64, 64, -64, -64, -64, 64, -64, -64, -64, -64, -64, -64, 64, -64, -64, -64, 64, 64, -64, -64, 64, -64, -64, -64, -64, -64, -64, 64, 64, 64, 64, 64, 64, 64, 64, 64, 64, 64, 64, 64, -64, -64, -64, -64, 64, 64, -64, -64, -64, -64, -64, -64, -64, -64, 64, 64, 64, 64, 64, 64, 64, 64, 64, 64, 64, 64, 64, -64, -64, -64, -64, -64, 64, 64, 64, -64, 64, 64, -64, -64, 64, -64, 64, 64, 64, -64, 64, 64, 64, 64, 64, 64, 64, 64, 64, -64, 64, 64, 64, 64, 64, -64, 64, 64, -64, 64, 64, -64, 64, -64, 64, -64, 64, 64, 64, 64, 64, 64, 64, 64, 64, 64, 64, 64, 64, 64, 64, 64, 64, -64, -64, 64, 64, 64, 64, -64, -64, -64, -64, 64, 64, -64, 64, 64, 64, 64, 64, 64, 64, -64, 64, 64, 64, 64, -64, 64, 64, -64, 64, 64, 64, -64, -64, -64, -64, -64, 64, -64, 64, -64, -64, 64, 64, 64, -64, 64, -64, -64, 64, 64, 64, 64, -64, 64, 64, 64, 64, -64, 64, 64, 64, -64, -64, 64, -64, 64, 64, -64, -64, 64, 64, 64, 64, 64, 64, -64, 64, 64, 64, 64, -64, -64, 64, 64, -64, 64, 64, 64, -64, -64, -64, 64, -64, -64, -64, -64, -64, 64, 64, -64, -64, -64, -64, -64, -64, 64, -64, 64, -64, -64, -64, -64, 64, 64, 64, 64, 64, -64, -64, -64, -64, -64, 64, -64, -64, -64, 64, 64, -64, -64, 64, -64, -64, 64, 64, -64, -64, -64, -64, 64, 64, -64, 64, -64, 64, 64, -64, 64, -64, -64, 64, -64, -64, -64, -64, -64, -64, 64, -64, 64, 64, -64, 64, -64, 64, -64, -64, -64, 64, 64, -64, 64, 64, 64, 64, 64, -64, -64, 64, -64, -64, -64, -64, -64, -64, -64, 64, 64, 64, 64, -64, 64, 64, -64, 64, -64, -64, 64, 64, 64, 64, 64, 64, 64, 64, -64, 64, -64, -64, -64, -64, -64, -64, 64, 64, 64, 64, -64, -64, -64, 64, -64, 64, 64, 64, 64, 64, 64, 64, 64, 64, 64, 64, -64, 64, -64, -64, -64, -64, -64, 64, 64, 64, 64, -64, -64, -64, 64, -64, 64, 64, 64, 64, 64, 64, 64, 64, 64, 64, 64, 64, -64, -64, -64, -64, -64, -64, 64, -64, 64, 64, -64, -64, -64, -64, 64, -64, -64, 64, -64, -64, -64, -64, 64, 64, 64, 64, -64, -64, -64, -64, -64, -64, 64, 64, -64, 64, -64, -64, -64, -64, -64, -64, 64, 64, 64, -64, -64, 64, -64, 64, 64, 64, 64, 64, 64, -64, -64, 64, 64, -64, -64, 64, -64, -64, 64, -64, -64, -64, -64, 64, 64, 64, 64, 64, -64, 64, 64, 64, 64, 64, 64, -64, 64, 64, 64, 64, -64, -64, -64, -64, 64, 64, -64, -64, -64, -64, -64, -64, 64, 64, -64, 64, -64, -64, 64, 64, 64, 64, 64, 64, -64, 64, 64, 64, 64, -64, -64, -64, -64, -64, -64, -64, -64, -64, -64, 64, 64, 64, -64, 64, 64, -64, -64, -64, -64, 64, 64, 64, 64, 64, 64, 64, 64, 64, 64, 64, 64, 64, 64, -64, -64, -64, 64, 64, 64, -64, 64, 64, 64, -64, 64, 64, -64, -64, 64, 64, 64, 64, 64, 64, 64, 64, 64, 64, 64, 64, 64, 64, 64, 64, 64, 64, -64, 64, 64, 64, -64, 64, 64, 64, 64, 64, -64, 64, 64, 64, 64, 64, 64, 64, 64, 64, 64, 64, 64, 64, 64, 64, 64, 64, 64, -64, -64, 64, 64, -64, -64, -64, 64, 64, -64, 64, -64, 64, -64, -64, -64, -64, 64, -64, -64, 64, 64, 64, -64, 64, 64, 64, 64, 64, -64, -64, 64, 64, -64, 64, -64, -64, 64, 64, -64, 64, -64, 64, -64, -64, -64, -64, -64, -64, -64, 64, 64, -64, -64, 64, -64, -64, -64, 64, 64, 64, 64, -64, -64, -64, 64, 64, 64, 64, -64, 64, 64, 64, -64, 64, 64, 64, -64, 64, -64, 64, 64, -64, 64, 64, -64, 64, 64, 64, -64, -64, 64, 64, 64, 64, 64, -64, 64, -64, 64, 64, 64, 64, 64, 64, 64, 64, 64, 64, 64, -64, 64, 64, -64, 64, 64, 64, 64, 64, -64, -64, 64, 64, 64, -64, 64, 64, 64, 64, 64, -64, 64, 64, -64, -64, 64, -64, -64, 64, 64, -64, -64, 64, 64, 64, -64, -64, -64, 64, 64, 64, -64, -64, -64, -64, 64, 64, -64, -64, 64, -64, -64, -64, -64, 64, 64, 64, 64, 64, -64, -64, -64, 64, 64, 64, -64, 64, -64, 64, 64, 64, 64, 64, 64, -64, -64, 64, 64, 64, -64, -64, -64, -64, 64, -64, 64, -64, 64, 64, 64, -64, -64, -64, -64, 64, 64, 64, 64, 64, 64, 64, -64, 64, -64, -64, -64, 64, -64, -64, -64, -64, 64, 64, 64, -64, 64, 64, 64, 64, 64, -64, -64, 64, -64, 64, 64, 64, -64, -64, -64, -64, 64, 64, -64, -64, -64, -64, -64, -64, 64, 64, 64, 64, 64, 64, 64, 64, -64, -64, -64, -64, 64, -64, 64, -64, -64, -64, -64, 64, 64, 64, 64, 64, -64, -64, -64, 64, -64, 64, -64, 64, 64, 64, -64, 64, 64, -64, -64, 64, -64, -64, -64, -64, -64, -64, -64, -64, 64, 64, 64, -64, -64, -64, -64, -64, -64, -64, 64, 64, 64, 64, 64, 64, 64, -64, -64, -64, -64, -64, -64, -64, 64, -64, 64, -64, 64, 64, 64, -64, -64, -64, -64, -64, -64, -64, 64, 64, 64, 64, -64, 64, -64, -64, 64, -64, -64, -64, 64, -64, 64, 64, 64, 64, 64, 64, -64, -64, -64, -64, -64, -64, -64, -64, -64, -64, 64, 64, -64, -64, -64, -64, 64, -64, -64, -64, 64, 64, 64, 64, 64, 64, 64, -64, -64, -64, 64, -64, -64, -64, -64, -64, 64, -64, -64, 64, 64, 64, 64, 64, -64, 64, 64, 64, 64, 64, 64, 64, 64, 64, -64, -64, -64, -64, -64, -64, -64, -64, -64, 64, -64, -64, -64, 64, 64, -64, -64, -64, -64, -64, -64, 64, 64, 64, 64, 64, 64, -64, -64, -64, -64, -64, 64, -64, 64, -64, 64, 64, -64, -64, -64, 64, 64, -64, -64, 64, -64, -64, -64, 64, -64, -64, 64, -64, 64, 64, -64, -64, -64, -64, 64, -64, 64, 64, 64, 64, -64, -64, -64, -64, 64, 64, -64, 64, -64, -64, 64, -64, 64, -64, 64, 64, -64, -64, -64, -64, -64, 64, 64, 64, 64, 64, 64, 64, 64, -64, -64, -64, -64, -64, -64, -64, -64, -64, -64, 64, -64, 64, -64, 64, -64, -64, -64, -64, 64, 64, 64, 64, 64, 64, 64, 64, 64, 64, -64, -64, -64, -64, 64, -64, -64, -64, 64, -64, 64, -64, -64, -64, -64, -64, 64, 64, -64, 64, 64, 64, -64, 64, -64, 64, 64, 64, -64, -64, -64, -64, -64, -64, -64, 64, 64, 64, 64, -64, -64, 64, -64, -64, -64, 64, -64, 64, 64, -64, -64, 64, -64, 64, 64, 64, 64, -64, 64, 64, 64, -64, 64, -64, -64, 64, -64, -64, 64, 64, -64, 64, 64, 64, 64, 64, 64, -64, -64, 64, 64, 64, 64, 64, 64, -64, 64, -64, -64, -64, 64, 64, -64, -64, -64, 64, -64, -64, 64, 64, 64, 64, 64, 64, -64, -64, -64, -64, -64, 64, 64, 64, 64, -64, -64, 64, 64, 64, 64, 64, -64, -64, -64, -64, 64, -64, -64, -64, -64, 64, 64, 64, 64, -64, 64, -64, 64, 64, -64, 64, 64, 64, -64, -64, 64, -64, -64, -64, -64, -64, -64, -64, 64, 64, -64, 64, 64, 64, 64, 64, 64, -64, -64, 64, -64, -64, -64, -64, 64, 64, 64, 64, 64, -64, -64, 64, -64, -64, -64, 64, 64, -64, -64, -64, -64, 64, 64, 64, -64, -64, -64, -64, -64, -64, -64, -64, 64, -64, -64, 64, 64, -64, -64, 64, -64, -64, -64, -64, -64, -64, -64, -64, -64, 64, 64, -64, -64, -64, -64, -64, 64, 64, 64, -64, 64, -64, 64, 64, -64, -64, -64, 64, -64, 64, -64, -64, -64, -64, -64, -64, -64, -64, -64, -64, -64, -64, -64, -64, -64, -64, -64, 64, -64, -64, -64, 64, -64, -64, -64, 64, -64, 64, -64, -64, -64, -64, -64, -64, -64, 64, -64, -64, 64, -64, -64, -64, 64, -64, 64, -64, 64, -64, 64, 64, 64, -64, 64, -64, 64, -64, 64, 64, 64, -64, 64, 64, 64, -64, -64, -64, -64, -64, -64, -64, -64, 64, 64, 64, -64, 64, -64, -64, 64, 64, 64, 64, 64, -64, 64, -64, -64, -64, 64, 64, 64, -64, -64, -64, 64, 64, -64, -64, -64, -64, 64, -64, -64, 64, -64, -64, 64, 64, 64, 64, 64, 64, 64, -64, -64, 64, 64, 64, -64, -64, -64, 64, 64, 64, -64, -64, -64, -64, -64, 64, 64, -64, -64, -64, 64, 64, -64, -64, 64, -64, -64, -64, -64, -64, 64, 64, 64, 64, -64, 64, 64, 64, -64, -64, -64, -64, 64, -64, -64, -64, 64, -64, -64, 64, 64, -64, -64, -64, -64, -64, 64, 64, 64, -64, 64, 64, 64, -64, -64, -64, -64, 64, 64, -64, -64, 64, -64, -64, 64, -64, 64, -64, -64, -64, -64, -64, -64, 64, 64, -64, -64, -64, -64, -64, -64, -64, -64, -64, 64, -64, 64, 64, 64, -64, 64, 64, -64, -64, -64, -64, 64, 64, -64, -64, -64, -64, -64, -64, -64, 64, 64, 64, 64, -64, -64, -64, -64, 64, 64, 64, 64, -64, 64, -64, -64, 64, 64, 64, -64, -64, -64, 64, 64, -64, -64, -64, -64, 64, -64, 64, -64, -64, -64, -64, -64, -64, -64, 64, -64, -64, 64, 64, -64, 64, -64, -64, -64, 64, 64, -64, -64, 64, -64, -64, -64, -64, -64, -64, -64, -64, -64, -64, -64, -64, 64, 64, 64, 64, 64, 64, 64, -64, -64, -64, -64, 64, 64, 64, -64, -64, -64, 64, -64, -64, -64, 64, -64, -64, -64, -64, -64, 64, -64, -64, 64, 64, 64, 64, -64, 64, -64, 64, -64, -64, 64, -64, -64, -64, -64, -64, 64, -64, -64, -64, 64, -64, -64, -64, 64, -64, -64, -64, -64, 64, 64, 64, 64, -64, 64, -64, -64, 64, -64, -64, -64, -64, -64, 64, -64, -64, -64, 64, -64, -64, -64, -64, -64, -64, -64, -64, 64, -64, 64, 64, -64, 64, -64, -64, 64, 64, 64, 64, 64, -64, -64, -64, 64, 64, -64, -64, 64, -64, 64, -64, -64, -64, -64, -64, -64, -64, 64, -64, 64, 64, 64, 64, -64, 64, 64, -64, -64, -64, 64, 64, 64, 64, -64, -64, -64, 64, -64, 64, -64, -64, -64, -64, -64, -64, 64, 64, 64, 64, 64, 64, -64, -64, -64, -64, -64, -64, 64, 64, -64, 64, -64, 64, -64, -64, 64, 64, 64, -64, -64, -64, -64, -64, -64, -64, -64, 64, -64, -64, 64, -64, 64, -64, -64, -64, 64, 64, 64, 64, -64, -64, 64, 64, 64, 64, -64, -64, -64, -64, 64, -64, 64, -64, -64, -64, -64, 64, -64, -64, -64, -64, -64, -64, 64, -64, -64, 64, -64, -64, 64, 64, -64, -64, -64, 64, -64, -64, -64, 64, 64, 64, -64, 64, 64, -64, 64, -64, -64, -64, -64, -64, -64, -64, -64, -64, -64, 64, 64, -64, -64, -64, -64, -64, -64, -64, 64, 64, -64, -64, -64, 64, -64, -64, 64, -64, -64, -64, -64, -64, -64, -64, -64, -64, -64, -64, -64, -64, -64, -64, -64, -64, -64, 64, -64, -64, -64, 64, 64, -64, 64, -64, 64, -64, -64, -64, 64, -64, -64, 64, 64, -64, -64, -64, -64, 64, -64, -64, -64, -64, 64, -64, 64, 64, -64, 64, -64, 64, -64, -64, 64, 64, 64, 64, -64, -64, -64, -64, -64, -64, 64, -64, -64, -64, -64, -64, -64, -64, -64, 64, 64, -64, -64, 64, 64, 64, 64, 64, 64, 64, 64, -64, -64, -64, 64, 64, -64, -64, -64, -64, -64, -64, -64, -64, -64, -64, -64, 64, -64, 64, 64, -64, -64, 64, -64, 64, -64, -64, 64, -64, -64, -64, -64, -64, 64, 64, 64, 64, 64, -64, 64, -64, -64, -64, -64, -64, -64, -64, 64, -64, 64, -64, -64, 64, 64, -64, -64, -64, -64, -64, 64, -64, -64, -64, -64, -64, -64, -64, 64, 64, 64, -64, 64, -64, -64, -64, -64, -64, 64, 64, 64, -64, 64, -64, -64, -64, -64, -64, 64, 64, 64, -64, 64, -64, -64, 64, 64, -64, 64, -64, -64, 64, -64, -64, -64, 64, -64, -64, -64, 64, -64, 64, -64, -64, -64, 64, 64, -64, -64, 64, -64, 64, -64, -64, 64, -64, 64, -64, -64, 64, 64, -64, -64, -64, 64, -64, -64, 64, 64, 64, -64, -64, -64, 64, -64, -64, 64, 64, -64, 64, -64, -64, -64, 64, -64, -64, -64, 64, 64, 64, 64, -64, -64, 64, -64, -64, -64, -64, 64, -64, 64, -64, -64, 64, 64, -64, -64, -64, -64, -64, 64, 64, 64, -64, 64, -64, 64, 64, -64, -64, -64, 64, 64, 64, 64, 64, 64, 64, 64, -64, 64, -64, 64, 64, 64, -64, -64, -64, -64, 64, 64, -64, 64, 64, 64, 64, -64, -64, -64, 64, 64, 64, -64, 64, -64, -64, -64, -64, -64, 64, 64, -64, 64, 64, -64, -64, 64, 64, -64, 64, -64, -64, 64, -64, -64, 64, 64, 64, 64, 64, 64, -64, -64, -64, -64, 64, 64, 64, -64, 64, 64, 64, 64, 64, -64, -64, -64, -64, 64, 64, -64, -64, 64, 64, 64, -64, 64, 64, 64, -64, -64, -64, 64, 64, -64, 64, 64, 64, 64, 64, -64, -64, 64, -64, 64, -64, 64, -64, -64, -64, 64, -64, 64, 64, 64, -64, 64, -64, 64, 64, 64, 64, 64, -64, -64, -64, -64, -64, -64, 64, -64, 64, 64, 64, -64, 64, -64, 64, 64, -64, 64, 64, 64, -64, -64, 64, 64, 64, 64, 64, -64, -64, -64, 64, -64, -64, 64, -64, -64, -64, -64, -64, -64, -64, -64, -64, -64, 64, -64, -64, -64, 64, -64, 64, 64, 64, 64, 64, -64, -64, -64, 64, -64, -64, -64, -64, -64, -64, -64, -64, 64, 64, -64, -64, -64, -64, -64, -64, -64, -64, 64, -64, -64, 64, 64, 64, -64, -64, -64, -64, -64, -64, -64, -64, -64, -64, -64, -64, -64, -64, -64, 64, 64, 64, 64, -64, -64, 64, 64, -64, 64, 64, -64, 64, -64, -64, -64, -64, -64, 64, -64, -64, -64, -64, -64, 64, 64, -64, -64, 64, -64, -64, -64, -64, 64, 64, -64, -64, -64, -64, 64, -64, -64, -64, -64, 64, 64, 64, 64, -64, -64, -64, 64, 64, -64, -64, 64, -64, -64, -64, -64, 64, -64, -64, -64, -64, -64, -64, -64, -64, -64, -64, -64, -64, -64, -64, -64, -64, -64, -64, -64, -64, -64, -64, -64, 64, 64, -64, -64, -64, -64, 64, -64, -64, 64, -64, -64, -64, 64, -64, 64, 64, -64, -64, -64, -64, -64, 64, 64, -64, 64, -64, -64, 64, -64, -64, -64, -64, -64, 64, -64, -64, -64, 64, 64, 64, -64, 64, 64, -64, -64, -64, -64, -64, -64, -64, -64, 64, -64, 64, 64, 64, 64, -64, -64, -64, -64, 64, -64, 64, 64, -64, -64, -64, -64, 64, -64, -64, -64, -64, -64, -64, -64, -64, -64, -64, -64, 64, -64, 64, 64, 64, -64, -64, -64, 64, 64, -64, 64, 64, -64, 64, 64, -64, -64, -64, -64, -64, -64, -64, 64, -64, 64, 64, 64, 64, 64, 64, 64, 64, -64, -64, -64, -64, -64, 64, -64, 64, 64, -64, -64, -64, -64, -64, -64, -64, 64, -64, 64, 64, 64, 64, 64, 64, 64, 64, -64, -64, 64, -64, 64, -64, 64, 64, 64, 64, -64, -64, -64, -64, -64, -64, -64, -64, -64, 64, 64, 64, 64, 64, 64, -64, 64, -64, 64, -64, 64, -64, 64, -64, -64, 64, 64, 64, 64, 64, -64, -64, -64, -64, -64, 64, 64, -64, -64, 64, 64, 64, -64, -64, -64, -64, 64, -64, -64, 64, 64, 64, -64, 64, -64, 64, 64, 64, -64, -64, -64, 64, -64, -64, 64, 64, -64, 64, 64, 64, -64, -64, -64, -64, -64, 64, 64, -64, -64, 64, 64, -64, -64, 64, 64, -64, 64, -64, -64, -64, -64, -64, -64, 64, -64, -64, -64, 64, -64, 64, -64, -64, -64, -64, -64, -64, 64, 64, 64, 64, 64, 64, 64, 64, -64, 64, 64, -64, -64, -64, -64, -64, -64, -64, -64, -64, 64, -64, 64, 64, 64, -64, -64, -64, -64, 64, 64, 64, -64, 64, 64, -64, 64, -64, -64, -64, -64, -64, -64, -64, -64, -64, -64, -64, 64, -64, 64, 64, -64, 64, -64, 64, 64, 64, 64, 64, 64, -64, -64, -64, -64, 64, -64, -64, -64, -64, -64, -64, -64, -64, -64, -64, -64, -64, 64, -64, 64, -64, 64, -64, 64, 64, -64, 64, 64, 64, -64, -64, -64, -64, -64, -64, -64, -64, -64, -64, 64, -64, -64, 64, -64, 64, -64, 64, -64, -64, 64, -64, -64, -64, 64, 64, -64, -64, 64, -64, -64, -64, -64, 64, -64, -64, -64, 64, -64, -64, 64, -64, -64, 64, 64, -64, -64, -64, 64, 64, 64, -64, -64, 64, -64, 64, -64, -64, -64, 64, -64, -64, -64, -64, -64, -64, -64, -64, -64, -64, -64, 64, -64, 64, 64, -64, 64, 64, -64, 64, 64, -64, -64, 64, -64, 64, 64, 64, -64, -64, -64, -64, -64, 64, -64, -64, -64, 64, 64, -64, 64, 64, 64, -64, 64, 64, 64, -64, 64, -64, 64, 64, -64, 64, 64, 64, -64, -64, 64, -64, -64, -64, 64, 64, 64, -64, -64, 64, -64, 64, 64, 64, -64, 64, 64, -64, -64, 64, 64, 64, -64, -64, -64, -64, 64, -64, -64, 64, -64, -64, 64, -64, -64, -64, -64, 64, -64, -64, 64, -64, -64, 64, 64, 64, -64, -64, 64, -64, -64, 64, -64, 64, 64, -64, 64, -64, 64, 64, -64, 64, -64, 64, 64, 64, 64, -64, -64, -64, -64, -64, -64, -64, -64, -64, -64, -64, 64, 64, 64, 64, 64, 64, -64, -64, 64, 64, 64, -64, -64, -64, 64, 64, 64, -64, 64, -64, -64, 64, 64, 64, 64, -64, -64, -64, 64, -64, -64, -64, -64, -64, 64, -64, 64, 64, -64, 64, -64, -64, -64, -64, 64, 64, -64, -64, -64, -64, 64, -64, -64, 64, 64, -64, -64, -64, -64, -64, -64, -64, -64, -64, -64, -64, 64, 64, -64, -64, -64, -64, -64, -64, -64, -64, -64, -64, 64, 64, 64, 64, -64, -64, -64, -64, -64, -64, 64, -64, -64, -64, 64, 64, -64, 64, -64, -64, -64, 64, -64, 64, -64, -64, -64, 64, 64, 64, 64, 64, 64, -64, -64, -64, -64, -64, -64, -64, -64, -64, -64, -64, -64, -64, 64, 64, -64, -64, -64, 64, 64, 64, -64, -64, -64, 64, 64, 64, 64, -64, -64, -64, -64, -64, -64, -64, -64, -64, -64, -64, -64, -64, -64, -64, -64, 64, 64, 64, -64, 64, 64, -64, 64, -64, -64, 64, 64, -64, 64, -64, 64, -64, -64, -64, 64, -64, 64, -64, -64, -64, -64, -64, -64, 64, 64, 64, 64, 64, 64, 64, 64, 64, -64, 64, 64, 64, 64, -64, 64, 64, 64, 64, 64, 64, 64, -64, -64, -64, -64, -64, -64, -64, -64, -64, 64, 64, 64, 64, -64, 64, -64, 64, 64, -64, -64, -64, 64, -64, 64, -64, 64, -64, 64, 64, 64, -64, -64, 64, -64, -64, -64, -64, 64, -64, -64, 64, -64, 64, 64, 64, 64, 64, 64, 64, -64, -64, 64, 64, 64, -64, -64, -64, 64, -64, 64, 64, -64, -64, 64, -64, -64, 64, -64, 64, -64, 64, 64, 64, 64, -64, 64, 64, -64, 64, 64, 64, 64, 64, 64, -64, -64, 64, -64, -64, 64, 64, 64, 64, 64, -64, -64, -64, -64, -64, 64, 64, 64, 64, 64, 64, 64, 64, 64, 64, 64, -64, -64, -64, -64, 64, -64, -64, -64, -64, 64, 64, -64, 64, -64, -64, 64, -64, 64, 64, 64, 64, 64, -64, 64, 64, 64, -64, -64, -64, -64, -64, -64, 64, -64, -64, -64, 64, 64, 64, 64, -64, 64, -64, 64, -64, -64, -64, -64, 64, 64, -64, -64, -64, -64, -64, -64, -64, -64, -64, -64, 64, 64, 64, 64, 64, 64, 64, -64, -64, 64, 64, 64, 64, 64, -64, 64, 64, -64, -64, -64, -64, -64, -64, -64, -64, -64, -64, 64, -64, -64, -64, 64, 64, 64, -64, -64, -64, 64, -64, -64, -64, 64, -64, 64, -64, -64, -64, 64, 64, -64, -64, -64, -64, -64, -64, -64, -64, -64, -64, -64, 64, 64, -64, -64, -64, -64, 64, 64, 64, -64, 64, -64, -64, -64, -64, 64, -64, -64, -64, -64, -64, -64, -64, 64, -64, -64, -64, 64, 64, -64, -64, -64, 64, 64, -64, -64, 64, -64, 64, 64, -64, -64, 64, 64, -64, -64, -64, -64, -64, -64, 64, -64, -64, -64, -64, 64, 64, 64, 64, -64, 64, -64, 64, -64, -64, -64, -64, -64, -64, -64, -64, -64, -64, -64, -64, -64, 64, 64, -64, 64, 64, 64, -64, 64, 64, -64, -64, -64, 64, 64, -64, 64, -64, -64, 64, -64, -64, 64, -64, -64, -64, -64, -64, -64, -64, 64, 64, -64, 64, 64, 64, 64, 64, -64, 64, 64, 64, -64, -64, 64, -64, 64, 64, -64, -64, -64, -64, -64, -64, -64, -64, 64, -64, 64, 64, 64, 64, -64, -64, 64, -64, 64, -64, 64, -64, 64, 64, -64, -64, -64, -64, -64, -64, 64, -64, -64, 64, -64, -64, 64, -64, -64, -64, -64, 64, -64, -64, -64, -64, 64, -64, 64, -64, 64, 64, -64, 64, 64, -64, 64, -64, -64, -64, -64, -64, -64, 64, -64, 64, 64, -64, 64, -64, -64, 64, -64, -64, 64, -64, -64, 64, -64, -64, -64, -64, -64, 64, 64, -64, -64, 64, -64, 64, 64, 64, 64, 64, -64, -64, 64, -64, 64, 64, -64, -64, 64, -64, 64, 64, -64, -64, 64, 64, 64, 64, -64, -64, -64, 64, -64, 64, 64, 64, 64, -64, 64, -64, 64, 64, 64, -64, 64, -64, -64, -64, -64, 64, -64, -64, 64, -64, -64, 64, 64, -64, -64, -64, 64, 64, 64, 64, 64, -64, -64, 64, 64, 64, 64, -64, 64, 64, -64, -64, 64, -64, 64, -64, -64, 64, -64, 64, -64, -64, 64, -64, -64, 64, -64, -64, 64, -64, 64, -64, -64, 64, -64, -64, -64, -64, -64, 64, -64, 64, 64, 64, 64, 64, -64, 64, -64, 64, 64, -64, 64, 64, -64, -64, -64, -64, -64, 64, 64, 64, 64, 64, -64, 64, 64, 64, -64, 64, -64, 64, 64, 64, -64, -64, 64, 64, 64, -64, 64, -64, -64, 64, 64, 64, -64, -64, -64, 64, -64, -64, 64, 64, 64, 64, -64, 64, -64, 64, -64, -64, 64, -64, 64, 64, -64, -64, 64, -64, -64, -64, 64, -64, -64, 64, -64, 64, 64, 64, 64, -64, 64, -64, -64, -64, 64, 64, 64, 64, -64, -64, -64, 64, -64, -64, 64, -64, 64, -64, 64, 64, 64, -64, -64, -64, -64, 64, 64, -64, -64, -64, 64, 64, 64, 64, 64, 64, 64, 64, 64, -64, 64, -64, 64, -64, 64, -64, -64, 64, -64, -64, 64, -64, -64, 64, 64, 64, -64, -64, 64, 64, -64, -64, -64, -64, 64, -64, 64, 64, 64, -64, -64, -64, -64, 64, -64, -64, 64, -64, -64, -64, -64, -64, -64, -64, -64, -64, 64, 64, 64, 64, -64, -64, -64, 64, -64, 64, -64, 64, -64, 64, 64, -64, 64, -64, 64, -64, -64, -64, -64, -64, -64, -64, -64, 64, 64, 64, 64, 64, -64, -64, 64, -64, 64, 64, -64, 64, -64, 64, 64, -64, 64, 64, -64, -64, 64, -64, -64, 64, 64, -64, 64, 64, -64, -64, 64, 64, -64, 64, -64, -64, -64, 64, -64, -64, -64, -64, 64, -64, -64, -64, -64, 64, -64, -64, -64, -64, -64, 64, -64, -64, -64, -64, -64, 64, -64, 64, -64, 64, -64, -64, -64, -64, -64, 64, -64, -64, 64, -64, -64, -64, -64, -64, -64, -64, 64, 64, -64, -64, 64, -64, -64, -64, -64, 64, -64, -64, -64, -64, -64, -64, 64, -64, -64, -64, -64, -64, -64, 64, -64, -64, -64, 64, -64, -64, 64, -64, -64, 64, 64, -64, 64, 64, 64, -64, 64, -64, 64, 64, 64, -64, -64, -64, 64, -64, 64, 64, -64, -64, 64, -64, -64, -64, -64, -64, -64, -64, 64, 64, 64, -64, -64, -64, 64, -64, 64, -64, 64, -64, 64, -64, -64, -64, 64, 64, -64, -64, -64, -64, 64, 64, -64, -64, 64, 64, -64, 64, 64, -64, 64, -64, 64, -64, -64, 64, -64, -64, -64, 64, 64, -64, -64, -64, -64, -64, 64, 64, 64, 64, 64, 64, 64, 64, -64, 64, 64, 64, 64, -64, -64, 64, -64, -64, 64, -64, 64, -64, -64, 64, -64, -64, -64, -64, -64, -64, -64, 64, -64, -64, -64, 64, -64, -64, 64, -64, 64, -64, 64, 64, -64, 64, -64, -64, -64, 64, -64, 64, -64, -64, -64, -64, -64, 64, 64, -64, -64, -64, -64, -64, -64, -64, 64, 64, 64, -64, -64, -64, -64, 64, -64, -64, 64, 64, -64, -64, 64, -64, 64, -64, -64, -64, 64, -64, 64, -64, -64, -64, 64, -64, 64, 64, -64, -64, -64, -64, 64, -64, 64, 64, -64, -64, -64, -64, 64, 64, -64, 64, 64, 64, -64, -64, 64, 64, 64, -64, 64, -64, 64, -64, 64, -64, -64, 64, 64, -64, -64, -64, 64, -64, 64, -64, -64, -64, 64, 64, 64, -64, -64, 64, -64, 64, -64, -64, 64, -64, 64, 64, -64, -64, 64, -64, 64, -64, -64, -64, -64, 64, -64, -64, -64, -64, -64, -64, -64, -64, 64, -64, -64, 64, 64, -64, 64, -64, -64, -64, 64, -64, -64, 64, 64, -64, -64, -64, -64, -64, 64, -64, -64, -64, -64, 64, -64, 64, -64, -64, 64, -64, 64, 64, -64, -64, 64, -64, 64, -64, 64, 64, 64, 64, -64, -64, -64, 64, 64, -64, 64, 64, 64, -64, -64, -64, -64, -64, -64, -64, -64, 64, -64, -64, -64, -64, -64, 64, -64, 64, -64, -64, 64, -64, -64, 64, 64, -64, -64, -64, 64, 64, -64, 64, -64, -64, -64, -64, -64, 64, -64, 64, 64, -64, -64, 64, 64, -64, 64, 64, 64, -64, -64, -64, -64, 64, -64, -64, -64, -64, 64, -64, -64, 64, 64, -64, -64, 64, -64, -64, 64, -64, -64, -64, -64, -64, 64, -64, 64, -64, 64, 64, -64, -64, -64, -64, -64, -64, -64, 64, 64, 64, -64, -64, -64, -64, -64, -64, 64, -64, -64, 64, -64, 64, 64, 64, 64, 64, -64, 64, -64, -64, 64, -64, 64, -64, -64, -64, 64, 64, -64, -64, 64, -64, -64, 64, 64, -64, -64, 64, -64, -64, 64, -64, 64, -64, 64, -64, 64, -64, 64, 64, -64, 64, -64, -64, 64, 64, -64, -64, -64, -64, 64, -64, -64, 64, -64, -64, 64, -64, -64, 64, -64, -64, -64, 64, 64, -64, 64, 64, 64, -64, -64, -64, 64, -64, 64, -64, -64, -64, 64, -64, -64, -64, 64, 64, -64, -64, 64, 64, -64, 64, 64, -64, 64, 64, 64, 64, -64, 64, 64, 64, -64, -64, 64, 64, 64, 64, -64, 64, -64, 64, 64, -64, -64, -64, 64, 64, 64, 64, -64, -64, -64, -64, 64, -64, 64, 64, 64, -64, -64, -64, -64, 64, -64, -64, 64, -64, -64, -64, 64, 64, 64, 64, 64, -64, -64, -64, -64, -64, 64, 64, -64, -64, 64, 64, 64, 64, 64, 64, -64, 64, 64, -64, 64, 64, -64, 64, 64, 64, 64, 64, 64, 64, -64, 64, -64, 64, -64, 64, -64, -64, -64, -64, 64, 64, 64, 64, 64, 64, 64, 64, -64, -64, -64, -64, 64, -64, 64, -64, -64, 64, -64, -64, 64, 64, -64, -64, -64, -64, -64, -64, -64, 64, 64, 64, 64, 64, 64, 64, 64, -64, -64, 64, 64, 64, 64, 64, 64, 64, 64, 64, 64, 64, 64, 64, 64, -64, 64, -64, -64, 64, 64, 64, 64, 64, 64, -64, 64, 64, 64, -64, 64, -64, -64, 64, -64, -64, 64, 64, 64, 64, 64, 64, 64, 64, 64, 64, -64, -64, 64, 64, -64, 64, 64, 64, -64, -64, 64, -64, -64, -64, -64, 64, -64, 64, 64, 64, 64, -64, 64, 64, 64, 64, 64, -64, 64, -64, -64, -64, -64, 64, 64, 64, -64, 64, -64, -64, -64, 64, 64, -64, 64, 64, 64, 64, -64, 64, 64, 64, 64, -64, 64, 64, 64, -64, -64, -64, -64, 64, 64, -64, 64, 64, -64, -64, -64, -64, -64, -64, -64, 64, 64, 64, 64, 64, -64, -64, 64, 64, 64, 64, 64, -64, -64, -64, -64, 64, 64, 64, -64, -64, -64, 64, 64, -64, 64, -64, 64, 64, 64, 64, -64, 64, 64, 64, 64, 64, 64, 64, 64, -64, -64, -64, 64, 64, 64, 64, 64, -64, -64, 64, -64, -64, 64, -64, -64, 64, 64, -64, -64, -64, 64, 64, 64, 64, 64, 64, -64, -64, -64, -64, -64, 64, 64, -64, 64, -64, -64, -64, 64, -64, -64, -64, -64, 64, -64, -64, 64, 64, 64, 64, 64, 64, 64, 64, -64, -64, -64, -64, -64, 64, 64, 64, -64, 64, 64, 64, 64, -64, 64, -64, -64, 64, -64, -64, 64, 64, 64, 64, 64, 64, 64, 64, -64, -64, -64, -64, -64, -64, 64, 64, 64, -64, -64, 64, -64, -64, 64, 64, -64, -64, 64, -64, -64, 64, 64, 64, 64, 64, 64, -64, -64, -64, 64, 64, 64, 64, 64, 64, 64, 64, -64, -64, 64, 64, -64, -64, 64, -64, 64, 64, -64, 64, 64, 64, 64, 64, -64, -64, -64, 64, 64, -64, 64, 64, -64, 64, -64, -64, -64, 64, 64, -64, -64, -64, 64, -64, -64, 64, 64, 64, 64, 64, 64, -64, -64, -64, -64, 64, -64, 64, 64, 64, 64, -64, -64, 64, 64, 64, 64, 64, 64, 64, -64, -64, 64, 64, 64, 64, 64, -64, 64, 64, 64, 64, 64, -64, 64, 64, 64, 64, 64, -64, -64, 64, -64, -64, 64, 64, -64, -64, -64, 64, 64, 64, 64, 64, 64, -64, 64, 64, 64, -64, -64, 64, 64, 64, 64, 64, -64, -64, 64, 64, -64, 64, -64, -64, -64, -64, 64, -64, -64, 64, 64, 64, -64, 64, -64, -64, -64, -64, -64, -64, 64, 64, -64, 64, 64, 64, 64, 64, -64, 64, -64, -64, -64, -64, -64, 64, 64, 64, 64, -64, -64, 64, -64, 64, -64, 64, -64, -64, -64, -64, -64, 64, -64, 64, -64, -64, 64, 64, 64, 64, -64, -64, -64, -64, -64, 64, 64, 64, -64, -64, 64, 64, 64, 64, -64, -64, -64, -64, 64, -64, -64, -64, -64, -64, 64, 64, 64, 64, 64, -64, -64, -64, -64, -64, 64, 64, 64, -64, 64, 64, 64, 64, 64, -64, -64, -64, -64, -64, -64, -64, 64, 64, -64, -64, -64, 64, 64, 64, 64, -64, 64, -64, 64, -64, 64, -64, -64, 64, 64, 64, 64, 64, -64, -64, 64, 64, 64, 64, -64, 64, -64, 64, 64, 64, -64, -64, -64, -64, -64, -64, -64, -64, 64, -64, 64, 64, 64, 64, -64, -64, 64, 64, 64, 64, -64, 64, 64, -64, -64, -64, 64, -64, -64, -64, -64, -64, -64, -64, 64, 64, 64, 64, 64, 64, 64, -64, -64, 64, 64, 64, 64, -64, 64, 64, -64, 64, -64, -64, -64, -64, 64, 64, 64, -64, 64, 64, -64, -64, -64, -64, -64, 64, -64, 64, -64, -64, -64, -64, -64, 64, -64, 64, 64, 64, -64, 64, -64, -64, 64, 64, 64, 64, -64, 64, 64, -64, -64, -64, -64, 64, 64, -64, -64, -64, 64, -64, -64, 64, 64, -64, 64, 64, 64, -64, 64, -64, -64, 64, 64, 64, -64, 64, 64, 64, -64, 64, 64, -64, 64, 64, 64, -64, -64, 64, 64, -64, 64, 64, 64, -64, 64, 64, -64, -64, 64, -64, 64, 64, 64, 64, 64, -64, -64, -64, 64, -64, 64, 64, 64, -64, -64, 64, -64, -64, -64, -64, 64, -64, -64, -64, 64, -64, 64, -64, 64, 64, -64, 64, 64, 64, 64, 64, -64, -64, 64, 64, 64, 64, -64, 64, 64, 64, -64, 64, 64, -64, 64, 64, 64, -64, 64, 64, -64, -64, -64, 64, -64, -64, -64, -64, -64, -64, -64, 64, 64, -64, -64, -64, 64, 64, 64, -64, 64, 64, 64, -64, -64, 64, -64, -64, -64, -64, 64, 64, -64, 64, 64, -64, -64, -64, -64, 64, -64, 64, 64, 64, 64, 64, -64, 64, 64, -64, -64, 64, -64, 64, -64, -64, -64, -64, 64, -64, 64, 64, -64, -64, 64, 64, -64, 64, -64, -64, -64, -64, 64, 64, -64, -64, 64, -64, -64, -64, 64, -64, 64, -64, -64, 64, -64, 64, 64, 64, 64, -64, -64, -64, -64, -64, 64, -64, -64, 64, -64, 64, -64, -64, 64, 64, -64, -64, -64, 64, -64, 64, 64, -64, -64, 64, 64, 64, 64, 64, -64, -64, -64, -64, 64, -64, -64, -64, -64, 64, 64, -64, 64, -64, 64, 64, -64, 64, 64, -64, 64, -64, -64, -64, -64, 64, 64, -64, -64, -64, -64, -64, -64, 64, -64, -64, 64, 64, 64, 64, 64, -64, 64, 64, -64, -64, -64, -64, 64, -64, 64, -64, 64, 64, 64, -64, -64, -64, 64, -64, -64, -64, -64, -64, 64, 64, 64, -64, -64, -64, -64, -64, -64, 64, 64, 64, -64, 64, -64, 64, 64, 64, -64, -64, -64, -64, -64, 64, -64, 64, -64, -64, -64, 64, -64, -64, 64, 64, -64, 64, 64, 64, -64, -64, 64, 64, 64, 64, 64, 64, 64, -64, -64, 64, -64, -64, 64, -64, 64, -64, -64, -64, -64, 64, -64, -64, -64, -64, -64, -64, -64, -64, 64, -64, -64, 64, -64, 64, -64, 64, -64, 64, -64, -64, -64, -64, -64, -64, -64, 64, -64, -64, 64, 64, 64, -64, 64, 64, 64, 64, -64, -64, -64, -64, 64, 64, 64, -64, -64, 64, 64, -64, -64, 64, 64, 64, -64, 64, -64, 64, 64, 64, -64, -64, -64, 64, -64, -64, -64, -64, -64, 64, 64, -64, -64, -64, -64, 64, -64, -64, -64, -64, 64, 64, -64, -64, -64, -64, 64, 64, 64, 64, -64, 64, -64, -64, -64, -64, -64, 64, 64, -64, 64, -64, -64, -64, 64, 64, -64, -64, -64, -64, -64, -64, -64, -64, -64, 64, -64, -64, 64, -64, -64, -64, -64, 64, -64, 64, -64, -64, -64, -64, -64, -64, -64, -64, -64, -64, -64, -64, -64, -64, -64, -64, -64, 64, 64, 64, -64, -64, -64, -64, -64, -64, -64, -64, -64, -64, -64, -64, -64, -64, 64, -64, 64, -64, -64, -64, -64, -64, -64, 64, 64, -64, 64, -64, -64, -64, -64, -64, -64, 64, -64, 64, -64, -64, -64, -64, -64, -64, -64, 64, 64, 64, -64, -64, -64, -64, -64, 64, -64, 64, 64, -64, 64, 64, -64, -64, -64, -64, -64, -64, -64, -64, -64, -64, -64, -64, -64, -64, -64, 64, -64, -64, -64, -64, -64, -64, 64, 64, 64, 64, -64, -64, -64, -64, -64, -64, -64, -64, -64, 64, -64, -64, 64, 64, 64, 64, -64, -64, 64, 64, -64, -64, -64, -64, -64, 64, -64, 64, -64, -64, 64, -64, -64, -64, -64, -64, 64, -64, -64, -64, -64, 64, 64, 64, 64, -64, 64, -64, 64, -64, 64, -64, 64, -64, -64, 64, 64, -64, -64, -64, -64, -64, -64, -64, -64, 64, 64, 64, 64, 64, 64, 64, 64, -64, -64, 64, -64, 64, 64, 64, 64, -64, 64, 64, 64, -64, 64, 64, 64, -64, 64, -64, 64, 64, 64, -64, -64, 64, 64, 64, -64, 64, -64, -64, -64, 64, -64, -64, -64, 64, 64, 64, 64, 64, 64, 64, 64, 64, 64, 64, -64, 64, -64, 64, -64, 64, -64, 64, -64, -64, 64, -64, -64, 64, 64, -64, 64, -64, 64, 64, 64, 64, 64, -64, -64, -64, 64, -64, -64, -64, -64, 64, -64, 64, 64, 64, -64, -64, -64, 64, 64, 64, -64, -64, 64, 64, -64, -64, -64, -64, 64, -64, -64, -64, 64, -64, -64, -64, -64, -64, 64, -64, 64, 64, 64, 64, -64, 64, -64, 64, -64, 64, -64, -64, -64, 64, 64, -64, 64, -64, -64, 64, 64, 64, 64, 64, -64, -64, -64, -64, -64, -64, 64, 64, -64, 64, -64, -64, 64, 64, 64, -64, 64, 64, -64, -64, -64, 64, 64, 64, -64, -64, -64, 64, 64, -64, 64, 64, -64, 64, 64, -64, -64, -64, -64, 64, 64, -64, 64, 64, -64, -64, 64, -64, -64, -64, -64, -64, 64, -64, -64, -64, 64, 64, 64, -64, -64, 64, 64, -64, -64, 64, -64, -64, 64, -64, -64, 64, -64, 64, 64, -64, 64, -64, 64, 64, -64, -64, -64, -64, -64, -64, -64, 64, -64, -64, 64, 64, -64, -64, -64, -64, 64, -64, -64, -64, 64, 64, 64, 64, 64, -64, -64, -64, 64, -64, -64, -64, -64, 64, -64, 64, 64, -64, -64, -64, -64, -64, 64, 64, -64, -64, -64, -64, -64, -64, -64, 64, 64, 64, 64, -64, -64, 64, -64, -64, 64, 64, -64, -64, 64, -64, -64, -64, 64, 64, 64, 64, 64, -64, -64, -64, -64, 64, -64, 64, -64, 64, -64, -64, 64, -64, 64, -64, -64, 64, -64, -64, -64, -64, -64, -64, -64, 64, 64, 64, 64, -64, -64, -64, -64, -64, 64, 64, 64, -64, 64, 64, -64, -64, -64, 64, -64, -64, 64, -64, -64, -64, -64, 64, 64, -64, 64, -64, 64, -64, -64, -64, -64, 64, -64, 64, 64, 64, 64, -64, -64, 64, -64, -64, 64, 64, 64, -64, -64, -64, -64, 64, -64, -64, -64, 64, -64, -64, 64, -64, -64, 64, -64, 64, 64, -64, -64, -64, -64, -64, 64, -64, 64, -64, -64, -64, -64, -64, -64, -64, -64, 64, -64, -64, -64, 64, 64, -64, 64, -64, -64, -64, 64, -64, -64, -64, -64, -64, -64, 64, -64, -64, -64, -64, -64, -64, -64, -64, -64, -64, -64, -64, -64, -64, -64, 64, -64, -64, 64, 64, 64, -64, -64, -64, 64, -64, -64, 64, -64, -64, -64, -64, -64, 64, -64, -64, -64, -64, -64, -64, -64, -64, -64, 64, 64, 64, -64, 64, 64, 64, -64, -64, -64, -64, -64, -64, -64, -64, -64, 64, -64, -64, -64, 64, -64, 64, 64, -64, -64, -64, -64, 64, -64, -64, -64, 64, -64, 64, 64, 64, -64, -64, -64, -64, -64, -64, -64, -64, -64, -64, -64, -64, -64, -64, 64, 64, -64, 64, -64, 64, -64, -64, 64, 64, 64, -64, -64, -64, -64, -64, -64, -64, -64, -64, -64, -64, -64, -64, 64, 64, 64, -64, 64, -64, 64, -64, 64, -64, 64, 64, 64, -64, -64, 64, -64, -64, 64, -64, -64, -64, -64, -64, -64, -64, 64, -64, -64, 64, -64, -64, -64, -64, -64, -64, 64, -64, -64, 64, -64, 64, -64, -64, -64, -64, -64, -64, -64, 64, -64, 64, -64, -64, -64, 64, -64, 64, -64, -64, -64, 64, -64, 64, -64, -64, 64, 64, -64, 64, -64, -64, -64, -64, -64, -64, -64, -64, 64, -64, -64, -64, 64, 64, -64, -64, 64, 64, -64, 64, -64, 64, -64, 64, -64, -64, 64, 64, 64, 64, 64, -64, -64, -64, -64, 64, -64, -64, -64, -64, 64, 64, 64, -64, -64, -64, -64, -64, 64, 64, 64, -64, -64, -64, 64, -64, 64, -64, 64, -64, -64, -64, -64, -64, -64, -64, -64, 64, 64, 64, -64, -64, 64, -64, -64, -64, 64, -64, 64, -64, 64, -64, 64, 64, 64, -64, 64, -64, -64, -64, -64, -64, -64, -64, -64, 64, -64, 64, 64, -64, 64, 64, 64, 64, -64, 64, -64, -64, -64, -64, 64, 64, 64, 64, -64, 64, -64, -64, 64, 64, 64, -64, -64, -64, -64, -64, -64, 64, -64, -64, -64, -64, 64, -64, 64, 64, 64, 64, 64, 64, 64, 64, 64, 64, 64, -64, -64, 64, -64, -64, -64, -64, -64, -64, 64, 64, -64, 64, 64, 64, 64, 64, 64, 64, 64, 64, 64, -64, -64, 64, 64, -64, 64, -64, -64, 64, 64, -64, -64, -64, -64, -64, 64, 64, 64, 64, 64, 64, -64, -64, -64, 64, -64, 64, -64, 64, -64, -64, -64, -64, 64, 64, -64, 64, -64, 64, -64, -64, 64, -64, -64, 64, -64, -64, 64, 64, -64, -64, 64, -64, 64, -64, -64, -64, 64, 64, -64, 64, 64, 64, -64, 64, -64, -64, 64, -64, 64, 64, 64, 64, -64, 64, 64, 64, -64, 64, -64, 64, -64, 64, 64, 64, 64, 64, -64, 64, -64, -64, -64, -64, 64, 64, -64, -64, -64, 64, -64, -64, 64, 64, -64, 64, -64, -64, 64, 64, 64, -64, 64, 64, 64, -64, 64, -64, 64, 64, 64, 64, 64, -64, 64, 64, -64, 64, -64, 64, 64, 64, 64, -64, 64, -64, -64, 64, -64, 64, -64, 64, -64, 64, 64, -64, 64, 64, -64, -64, 64, -64, 64, -64, 64, 64, -64, 64, -64, 64, -64, 64, -64, -64, -64, -64, 64, 64, -64, 64, 64, 64, 64, 64, -64, 64, 64, -64, 64, 64, -64, 64, -64, 64, 64, -64, 64, 64, 64, 64, 64, 64, 64, -64, 64, -64, -64, 64, 64, 64, -64, -64, -64, -64, 64, 64, 64, -64, -64, -64, -64, 64, -64, -64, 64, 64, -64, 64, -64, 64, -64, 64, 64, 64, 64, 64, 64, -64, 64, -64, 64, -64, 64, -64, -64, -64, -64, -64, -64, -64, -64, -64, -64, -64, 64, 64, -64, -64, 64, -64, 64, -64, 64, 64, -64, -64, -64, -64, 64, -64, -64, -64, -64, -64, -64, 64, -64, -64, -64, 64, -64, 64, 64, -64, 64, 64, -64, -64, 64, -64, -64, -64, -64, -64, -64, 64, -64, -64, -64, -64, -64, 64, -64, 64, -64, -64, -64, -64, -64, 64, -64, 64, 64, -64, -64, -64, 64, -64, 64, -64, -64, 64, -64, -64, 64, 64, 64, 64, 64, -64, -64, 64, 64, -64, -64, -64, -64, -64, -64, -64, 64, 64, 64, -64, 64, 64, 64, -64, -64, -64, -64, 64, 64, -64, 64, 64, 64, 64, 64, 64, -64, -64, -64, -64, -64, -64, -64, -64, -64, -64, 64, 64, -64, -64, -64, -64, -64, -64, 64, 64, 64, -64, -64, 64, 64, 64, 64, -64, -64, -64, 64, 64, -64, 64, -64, -64, -64, 64, -64, 64, 64, -64, 64, -64, 64, 64, -64, 64, -64, -64, 64, -64, 64, 64, 64, -64, -64, -64, -64, -64, -64, -64, -64, 64, 64, 64, 64, -64, -64, -64, -64, 64, -64, -64, 64, -64, -64, -64, -64, -64, 64, 64, -64, -64, -64, -64, -64, -64, -64, 64, 64, 64, -64, 64, -64, -64, 64, -64, 64, -64, 64, -64, -64, -64, -64, -64, 64, 64, -64, -64, -64, -64, -64, -64, -64, -64, 64, 64, 64, -64, 64, 64, -64, 64, 64, 64, -64, -64, 64, -64, 64, -64, -64, 64, -64, -64, -64, 64, -64, -64, -64, -64, 64, -64, -64, -64, -64, 64, 64, 64, 64, 64, -64, 64, 64, 64, -64, -64, -64, -64, -64, 64, -64, 64, -64, 64, -64, 64, 64, 64, -64, 64, 64, -64, 64, 64, 64, 64, 64, 64, 64, 64, 64, 64, -64, -64, -64, -64, -64, -64, 64, -64, -64, -64, 64, 64, -64, -64, 64, 64, -64, 64, 64, 64, 64, 64, -64, 64, 64, 64, -64, -64, -64, -64, -64, -64, -64, -64, -64, -64, -64, -64, -64, -64, -64, -64, 64, -64, -64, 64, 64, 64, -64, -64, -64, 64, 64, -64, 64, 64, 64, -64, -64, -64, -64, -64, -64, -64, 64, -64, -64, -64, 64, -64, -64, -64, -64, -64, 64, -64, -64, 64, -64, -64, -64, 64, -64, -64, 64, -64, -64, -64, -64, -64, -64, -64, -64, -64, -64, -64, -64, -64, -64, -64, -64, 64, -64, 64, -64, -64, 64, -64, -64, 64, 64, 64, -64, -64, -64, -64, -64, -64, -64, 64, 64, -64, 64, -64, -64, -64, -64, -64, 64, 64, 64, 64, 64, 64, -64, 64, -64, 64, 64, 64, -64, -64, -64, -64, -64, -64, -64, -64, -64, -64, 64, -64, -64, -64, -64, -64, -64, 64, -64, 64, -64, 64, -64, -64, 64, 64, 64, -64, 64, 64, -64, -64, 64, -64, -64, -64, -64, -64, 64, -64, -64, -64, -64, -64, 64, -64, 64, 64, 64, 64, -64, 64, 64, 64, 64, -64, 64, -64, -64, -64, -64, -64, -64, -64, 64, -64, -64, -64, -64, -64, -64, 64, 64, 64, -64, 64, 64, -64, -64, 64, -64, -64, 64, 64, -64, 64, -64, -64, -64, 64, -64, -64, -64, -64, 64, -64, -64, -64, -64, 64, 64, -64, -64, 64, -64, -64, -64, 64, 64, 64, -64, 64, 64, -64, 64, 64, 64, -64, 64, -64, -64, -64, 64, -64, 64, 64, 64, -64, -64, -64, -64, -64, 64, -64, -64, -64, 64, -64, 64, -64, 64, -64, 64, 64, 64, 64, 64, -64, 64, -64, 64, 64, 64, -64, -64, -64, 64, 64, -64, -64, 64, -64, -64, 64, -64, 64, 64, 64, -64, 64, 64, 64, 64, -64, 64, 64, -64, -64, 64, 64, 64, 64, 64, 64, -64, -64, -64, 64, 64, 64, -64, 64, -64, -64, 64, 64, 64, 64, 64, -64, 64, -64, 64, -64, 64, -64, -64, 64, 64, -64, 64, 64, 64, -64, 64, -64, 64, 64, 64, -64, 64, 64, -64, -64, -64, -64, -64, 64, 64, -64, 64, -64, 64, -64, 64, -64, 64, 64, -64, 64, 64, -64, 64, 64, -64, -64, 64, -64, -64, -64, -64, -64, 64, -64, 64, 64, 64, 64, 64, 64, -64, 64, -64, -64, 64, -64, -64, -64, 64, -64, 64, -64, 64, -64, -64, 64, -64, 64, -64, 64, -64, -64, 64, 64, 64, -64, 64, -64, -64, -64, -64, -64, 64, 64, 64, 64, 64, 64, -64, 64, -64, -64, -64, 64, -64, 64, 64, -64, 64, 64, -64, 64, -64, -64, -64, 64, -64, -64, 64, -64, 64, 64, 64, 64, 64, 64, -64, 64, 64, 64, -64, 64, 64, -64, 64, 64, -64, -64, -64, 64, -64, -64, -64, 64, -64, 64, -64, -64, 64, 64, 64, 64, -64, 64, 64, 64, 64, -64, 64, 64, -64, 64, -64, 64, 64, -64, 64, -64, -64, -64, 64, 64, 64, -64, -64, -64, 64, -64, 64, -64, 64, 64, 64, 64, 64, 64, 64, 64, -64, 64, 64, -64, -64, -64, -64, -64, -64, -64, 64, -64, 64, 64, 64, -64, -64, -64, -64, -64, -64, 64, -64, -64, -64, -64, -64, -64, -64, 64, -64, -64, -64, -64, -64, -64, -64, -64, -64, -64, 64, 64, 64, 64, -64, 64, 64, -64, 64, -64, -64, -64, 64, -64, 64, -64, 64, 64, -64, 64, -64, -64, -64, 64, -64, 64, 64, 64, 64, 64, -64, 64, 64, -64, -64, 64, -64, -64, -64, -64, -64, -64, 64, -64, -64, -64, -64, -64, -64, 64, -64, 64, 64, -64, 64, -64, 64, 64, -64, -64, 64, -64, -64, -64, 64, -64, -64, 64, 64, 64, -64, 64, 64, 64, -64, -64, -64, 64, 64, 64, 64, 64, -64, -64, -64, -64, -64, -64, -64, -64, -64, -64, -64, -64, -64, -64, -64, -64, -64, -64, -64, -64, -64, -64, -64, 64, 64, 64, -64, -64, -64, -64, -64, -64, -64, -64, -64, -64, -64, -64, -64, -64, -64, -64, 64, -64, -64, 64, -64, -64, 64, -64, 64, 64, 64, 64, 64, -64, -64, -64, 64, 64, -64, -64, -64, -64, -64, 64, 64, -64, 64, -64, 64, -64, -64, 64, 64, -64, 64, -64, -64, 64, 64, 64, 64, 64, -64, 64, 64, -64, -64, -64, -64, 64, 64, 64, 64, 64, 64, -64, 64, -64, 64, -64, 64, -64, -64, -64, -64, 64, 64, 64, 64, 64, -64, -64, 64, 64, -64, 64, 64, 64, 64, 64, 64, 64, 64, -64, -64, -64, -64, -64, -64, -64, 64, 64, -64, -64, 64, 64, 64, 64, -64, -64, -64, -64, 64, 64, 64, 64, -64, 64, 64, 64, -64, -64, -64, -64, -64, -64, 64, 64, -64, 64, -64, -64, 64, 64, 64, 64, 64, 64, -64, 64, 64, 64, 64, -64, -64, 64, 64, 64, 64, 64, -64, -64, -64, -64, 64, -64, 64, -64, -64, -64, 64, 64, 64, -64, 64, 64, -64, -64, -64, 64, -64, -64, -64, -64, -64, -64, 64, 64, 64, -64, -64, 64, 64, -64, 64, 64, -64, -64, -64, 64, 64, 64, 64, 64, -64, -64, -64, -64, -64, -64, -64, -64, -64, -64, 64, 64, 64, 64, -64, -64, -64, -64, 64, -64, -64, -64, 64, -64, -64, 64, 64, -64, -64, -64, -64, -64, 64, 64, -64, -64, -64, 64, 64, 64, 64, -64, -64, -64, 64, 64, -64, 64, -64, 64, 64, -64, 64, 64, 64, -64, 64, -64, -64, -64, 64, -64, -64, -64, -64, 64, 64, 64, -64, -64, 64, -64, -64, -64, 64, -64, -64, 64, 64, -64, -64, 64, 64, 64, -64, -64, -64, -64, -64, -64, -64, -64, 64, 64, 64, 64, 64, 64, -64, 64, 64, -64, 64, -64, -64, 64, -64, 64, -64, 64, 64, -64, -64, -64, -64, -64, 64, 64, 64, 64, 64, 64, 64, -64, 64, -64, 64, -64, -64, -64, 64, -64, -64, -64, -64, -64, -64, -64, -64, 64, -64, -64, 64, 64, 64, -64, 64, 64, 64, 64, -64, -64, 64, 64, 64, -64, -64, -64, 64, -64, -64, -64, -64, -64, 64, -64, -64, -64, -64, -64, -64, 64, 64, 64, -64, -64, -64, 64, 64, -64, 64, -64, -64, -64, -64, 64, -64, -64, -64, -64, 64, 64, 64, -64, -64, -64, -64, -64, 64, 64, 64, 64, 64, 64, 64, 64, -64, 64, 64, 64, -64, -64, -64, -64, -64, 64, 64, 64, -64, 64, 64, -64, -64, -64, -64, 64, 64, -64, 64, 64, 64, 64, 64, 64, -64, -64, 64, 64, -64, 64, 64, -64, -64, -64, 64, -64, -64, -64, 64, 64, -64, -64, -64, 64, 64, -64, 64, 64, 64, 64, 64, -64, 64, -64, 64, 64, 64, 64, -64, -64, 64, -64, 64, -64, 64, 64, -64, -64, -64, -64, 64, 64, -64, 64, 64, 64, 64, 64, -64, -64, 64, 64, 64, -64, -64, 64, 64, -64, 64, 64, -64, 64, -64, -64, -64, -64, -64, -64, -64, 64, -64, -64, -64, 64, 64, -64, 64, 64, -64, 64, -64, 64, -64, -64, -64, 64, 64, 64, -64, 64, 64, -64, -64, -64, -64, -64, 64, 64, -64, -64, 64, -64, 64, -64, -64, -64, 64, -64, 64, -64, -64, 64, 64, 64, 64, 64, 64, -64, -64, -64, -64, 64, -64, 64, 64, -64, -64, -64, -64, -64, -64, 64, 64, -64, 64, 64, -64, -64, 64, 64, 64, -64, -64, -64, 64, -64, -64, -64, 64, 64, -64, -64, 64, -64, -64, -64, -64, -64, -64, 64, -64, -64, -64, 64, -64, -64, -64, -64, -64, -64, 64, -64, 64, -64, -64, -64, -64, -64, 64, -64, 64, 64, -64, -64, -64, -64, -64, -64, 64, 64, 64, 64, 64, -64, -64, 64, -64, 64, -64, 64, 64, -64, 64, 64, 64, -64, 64, 64, -64, 64, 64, 64, -64, -64, -64, -64, 64, -64, 64, 64, 64, 64, -64, -64, 64, -64, -64, -64, -64, 64, 64, 64, 64, 64, 64, 64, -64, 64, 64, -64, 64, 64, -64, -64, -64, 64, 64, 64, -64, -64, 64, 64, 64, -64, 64, -64, 64, 64, 64, 64, 64, 64, 64, 64, -64, 64, -64, -64, -64, -64, -64, -64, -64, -64, 64, 64, 64, 64, -64, 64, -64, -64, -64, -64, 64, 64, 64, -64, -64, -64, 64, -64, -64, -64, -64, -64, -64, -64, -64, -64, -64, -64, 64, -64, 64, 64, 64, 64, -64, -64, -64, -64, 64, 64, -64, -64, -64, -64, -64, -64, -64, -64, -64, -64, -64, -64, -64, -64, -64, -64, -64, 64, 64, 64, -64, 64, -64, -64, -64, 64, -64, -64, -64, -64, 64, -64, -64, -64, -64, -64, -64, -64, -64, -64, -64, -64, -64, -64, -64, 64, 64, 64, 64, -64, 64, -64, -64, 64, 64, 64, -64, 64, 64, -64, -64, -64, -64, -64, 64, -64, -64, -64, -64, -64, -64, -64, -64, -64, 64, 64, 64, 64, 64, -64, -64, 64, 64, 64, -64, 64, 64, -64, -64, -64, 64, 64, -64, -64, -64, -64, -64, 64, 64, -64, -64, -64, 64, 64, 64, -64, 64, 64, 64, 64, 64, 64, 64, 64, 64, 64, 64, -64, -64, -64, -64, -64, -64, -64, -64, 64, 64, -64, -64, -64, -64, -64, 64, 64, -64, 64, 64, 64, 64, -64, 64, 64, 64, -64, -64, -64, -64, -64, -64, -64, -64, -64, -64, 64, 64, 64, -64, -64, 64, -64, -64, -64, 64, -64, 64, -64, 64, -64, -64, 64, -64, -64, -64, -64, -64, -64, -64, -64, -64, 64, 64, -64, -64, 64, 64, -64, -64, -64, -64, 64, -64, -64, 64, 64, 64, -64, -64, 64, -64, 64, -64, -64, -64, -64, -64, -64, -64, 64, 64, 64, -64, 64, 64, -64, -64, -64, 64, 64, 64, 64, 64, -64, -64, 64, -64, 64, 64, -64, 64, 64, -64, -64, -64, -64, -64, 64, -64, 64, -64, -64, 64, -64, -64, -64, -64, -64, -64, -64, -64, -64, -64, 64, 64, 64, 64, 64, 64, 64, 64, -64, -64, -64, -64, 64, 64, -64, -64, 64, 64, -64, -64, 64, 64, 64, -64, -64, -64, -64, -64, 64, -64, -64, 64, 64, 64, -64, -64, -64, -64, -64, -64, -64, -64, -64, -64, 64, 64, 64, 64, -64, -64, 64, 64, 64, 64, -64, -64, 64, -64, -64, -64, -64, -64, -64, -64, -64, -64, 64, 64, -64, -64, 64, 64, 64, 64, -64, 64, 64, 64, 64, -64, 64, 64, -64, 64, -64, -64, -64, -64, -64, -64, -64, -64, -64, 64, 64, 64, 64, 64, -64, -64, -64, 64, 64, 64, -64, 64, -64, -64, 64, -64, 64, 64, 64, 64, -64, -64, -64, -64, -64, -64, 64, 64, -64, 64, 64, 64, 64, -64, -64, -64, 64, 64, 64, 64, 64, 64, 64, -64, -64, -64, 64, 64, -64, -64, -64, -64, -64, -64, -64, -64, -64, -64, -64, -64, 64, 64, 64, 64, 64, 64, -64, 64, 64, -64, 64, -64, 64, -64, -64, -64, -64, -64, -64, -64, -64, -64, -64, -64, 64, -64, -64, 64, 64, 64, 64, 64, 64, 64, -64, 64, -64, 64, -64, 64, -64, -64, -64, -64, -64, -64, -64, -64, 64, 64, 64, -64, -64, -64, 64, 64, 64, -64, 64, -64, -64, 64, -64, -64, 64, 64, 64, -64, -64, 64, 64, -64, -64, -64, -64, -64, -64, -64, 64, 64, 64, -64, -64, 64, 64, 64, -64, -64, 64, -64, -64, 64, 64, 64, 64, 64, 64, -64, 64, 64, -64, 64, -64, -64, -64, -64, -64, 64, -64, 64, 64, 64, -64, -64, 64, 64, 64, 64, -64, -64, 64, -64, 64, 64, -64, -64, -64, 64, 64, -64, 64, -64, -64, -64, -64, 64, -64, 64, 64, -64, -64, -64, -64, 64, 64, 64, -64, -64, 64, -64, -64, -64, 64, -64, -64, -64, 64, 64, 64, 64, 64, -64, 64, -64, -64, -64, 64, 64, 64, -64, 64, -64, 64, -64, 64, -64, -64, 64, 64, 64, 64, 64, 64, 64, -64, -64, 64, 64, 64, -64, 64, -64, 64, -64, -64, -64, -64, -64, 64, -64, 64, -64, -64, -64, 64, -64, -64, -64, -64, 64, -64, -64, -64, -64, 64, -64, 64, 64, 64, 64, 64, 64, 64, 64, 64, -64, -64, 64, -64, 64, -64, 64, -64, 64, -64, 64, -64, -64, -64, -64, -64, -64, 64, -64, 64, -64, 64, -64, -64, 64, 64, 64, 64, -64, -64, -64, 64, 64, 64, -64, 64, -64, 64, -64, -64, -64, -64, 64, 64, 64, 64, 64, -64, 64, -64, -64, 64, 64, 64, 64, -64, 64, 64, 64, 64, -64, 64, -64, -64, -64, -64, -64, 64, 64, -64, 64, 64, -64, 64, -64, -64, 64, -64, 64, 64, -64, 64, 64, -64, 64, -64, -64, 64, 64, 64, 64, -64, -64, -64, -64, 64, -64, -64, 64, 64, 64, -64, 64, 64, 64, 64, -64, 64, -64, 64, -64, -64, 64, 64, -64, -64, -64, -64, 64, -64, 64, -64, 64, -64, 64, -64, -64, -64, 64, -64, -64, 64, -64, -64, 64, 64, -64, 64, 64, -64, 64, -64, -64, 64, -64, -64, -64, 64, 64, -64, 64, 64, 64, 64, 64, 64, 64, 64, 64, 64, 64, -64, -64, 64, 64, -64, 64, -64, 64, 64, 64, -64, 64, 64, 64, 64, -64, 64, 64, -64, 64, -64, -64, -64, -64, -64, 64, 64, 64, 64, 64, -64, -64, 64, -64, 64, -64, 64, 64, 64, -64, 64, 64, -64, 64, 64, 64, 64, 64, -64, 64, -64, 64, -64, -64, -64, -64, -64, 64, -64, -64, 64, 64, -64, -64, -64, 64, 64, 64, -64, -64, -64, 64, 64, 64, 64, -64, 64, 64, 64, 64, 64, -64, 64, -64, -64, 64, -64, 64, 64, -64, 64, 64, 64, -64, -64, -64, -64, -64, 64, 64, -64, 64, -64, 64, 64, -64, 64, 64, 64, 64, 64, 64, 64, 64, 64, 64, 64, 64, 64, 64, 64, -64, 64, -64, 64, 64, -64, 64, 64, -64, -64, 64, 64, 64, 64, 64, 64, 64, 64, 64, 64, 64, 64, 64, 64, 64, 64, 64, 64, 64, 64, -64, 64, 64, -64, 64, -64, 64, -64, 64, -64, 64, 64, -64, -64, -64, -64, -64, -64, 64, 64, -64, -64, -64, -64, -64, 64, -64, 64, -64, 64, -64, 64, -64, -64, 64, -64, -64, 64, -64, -64, 64, -64, 64, -64, 64, -64, 64, -64, 64, 64, 64, 64, -64, 64, 64, -64, 64, -64, 64, 64, 64, 64, 64, 64, -64, 64, -64, -64, 64, 64, 64, 64, 64, 64, -64, 64, 64, 64, 64, 64, 64, -64, -64, 64, -64, 64, -64, 64, -64, 64, -64, -64, 64, 64, 64, 64, -64, 64, 64, -64, 64, 64, 64, 64, 64, -64, 64, -64, 64, 64, 64, 64, -64, -64, 64, 64, 64, -64, 64, 64, 64, 64, 64, -64, 64, -64, 64, 64, 64, 64, -64, 64, -64, 64, 64, 64, -64, -64, 64, 64, -64, -64, -64, 64, -64, 64, -64, 64, 64, 64, 64, 64, -64, -64, 64, 64, 64, 64, 64, 64, 64, 64, -64, -64, 64, 64, 64, 64, 64, 64, -64, 64, -64, -64, -64, -64, -64, 64, -64, -64, -64, 64, 64, 64, -64, -64, -64, -64, -64, -64, -64, -64, 64, 64, 64, -64, 64, 64, -64, -64, -64, 64, -64, -64, 64, 64, 64, 64, -64, 64, -64, -64, 64, 64, 64, 64, 64, 64, 64, -64, -64, 64, -64, -64, 64, -64, 64, 64, 64, -64, 64, -64, -64, 64, 64, -64, 64, -64, 64, 64, 64, 64, 64, 64, -64, 64, -64, -64, -64, 64, -64, 64, -64, -64, -64, -64, 64, 64, 64, 64, -64, 64, 64, 64, 64, 64, 64, 64, 64, 64, -64, 64, -64, 64, 64, -64, -64, -64, 64, -64, -64, 64, -64, 64, 64, -64, 64, 64, -64, -64, -64, 64, 64, -64, -64, -64, -64, -64, -64, 64, -64, 64, -64, -64, -64, 64, 64, 64, -64, -64, -64, 64, 64, 64, -64, 64, 64, 64, 64, -64, -64, 64, 64, 64, 64, -64, -64, -64, -64, -64, -64, -64, 64, -64, 64, -64, -64, 64, -64, -64, -64, -64, -64, 64, 64, 64, -64, -64, -64, 64, -64, -64, 64, -64, 64, 64, -64, 64, -64, 64, -64, 64, 64, -64, 64, -64, 64, 64, 64, 64, -64, 64, 64, 64, 64, 64, -64, 64, -64, 64, 64, -64, 64, -64, -64, 64, 64, 64, -64, -64, -64, -64, -64, 64, -64, -64, -64, -64, 64, -64, 64, -64, 64, -64, -64, -64, -64, 64, -64, -64, 64, -64, 64, 64, -64, 64, -64, -64, -64, 64, -64, -64, 64, 64, 64, -64, -64, 64, 64, -64, -64, -64, 64, -64, 64, -64, 64, -64, -64, -64, -64, 64, -64, -64, -64, 64, 64, -64, 64, 64, -64, -64, 64, 64, 64, 64, -64, -64, -64, -64, -64, 64, 64, 64, 64, 64, 64, 64, 64, -64, -64, 64, -64, 64, 64, -64, 64, 64, -64, -64, -64, 64, 64, 64, 64, -64, -64, -64, -64, 64, 64, 64, -64, -64, -64, -64, -64, 64, 64, -64, 64, 64, 64, 64, -64, 64, -64, 64, -64, 64, 64, -64, 64, 64, -64, 64, 64, -64, 64, 64, -64, 64, -64, -64, -64, -64, 64, 64, 64, 64, 64, 64, 64, 64, 64, 64, -64, 64, 64, 64, 64, 64, 64, -64, -64, 64, 64, 64, 64, 64, 64, 64, 64, 64, 64, 64, 64, -64, 64, 64, -64, 64, -64, 64, -64, -64, 64, -64, 64, 64, 64, 64, 64, 64, 64, 64, 64, 64, 64, 64, 64, 64, -64, -64, 64, 64, 64, 64, 64, 64, -64, 64, 64, 64, -64, -64, 64, 64, 64, 64, 64, 64, 64, 64, 64, 64, 64, 64, -64, 64, -64, -64, 64, -64, 64, -64, 64, 64, -64, 64, -64, -64, 64, 64, 64, 64, 64, 64, -64, 64, 64, -64, -64, 64, 64, -64, -64, -64, -64, 64, -64, -64, -64, -64, 64, 64, -64, -64, 64, -64, 64, -64, -64, 64, -64, -64, -64, -64, -64, -64, -64, -64, -64, -64, -64, -64, -64, -64, -64, -64, -64, -64, -64, -64, -64, 64, 64, 64, 64, -64, -64, -64, -64, -64, -64, -64, -64, -64, -64, -64, -64, -64, -64, -64, -64, -64, -64, -64, -64, -64, 64, 64, -64, 64, 64, 64, 64, 64, -64, -64, -64, -64, -64, -64, -64, -64, -64, -64, -64, -64, -64, 64, -64, -64, -64, -64, -64, -64, 64, 64, 64, -64, 64, -64, 64, 64, -64, -64, -64, -64, -64, -64, -64, -64, -64, 64, -64, 64, 64, 64, 64, -64, -64, -64, -64, -64, 64, 64, -64, 64, -64, 64, 64, -64, -64, -64, -64, -64, -64, -64, -64, -64, -64, 64, -64, -64, 64, 64, 64, -64, -64, -64, -64, -64, 64, 64, 64, 64, 64, 64, 64, -64, -64, -64, -64, -64, -64, -64, 64, -64, 64, 64, -64, 64, 64, 64, 64, 64, -64, -64, -64, 64, -64, -64, -64, -64, 64, 64, 64, -64, -64, -64, -64, -64, -64, -64, -64, -64, 64, -64, -64, -64, -64, 64, 64, 64, -64, -64, -64, 64, -64, -64, -64, -64, -64, -64, 64, 64, 64, -64, 64, -64, -64, -64, -64, -64, -64, -64, -64, 64, 64, -64, -64, -64, -64, -64, -64, -64, 64, -64, 64, -64, 64, -64, 64, -64, -64, 64, 64, -64, -64, -64, -64, -64, -64, -64, -64, 64, 64, 64, 64, -64, -64, -64, -64, 64, 64, 64, -64, -64, -64, 64, 64, -64, -64, -64, 64, -64, -64, -64, -64, -64, -64, 64, 64, 64, 64, 64, 64, -64, 64, -64, 64, 64, 64, 64, 64, -64, -64, -64, 64, 64, 64, 64, 64, 64, 64, -64, 64, 64, 64, 64, 64, 64, 64, -64, 64, -64, 64, 64, 64, 64, 64, 64, 64, 64, -64, -64, 64, 64, 64, 64, 64, 64, 64, 64, -64, -64, 64, -64, -64, -64, 64, -64, 64, -64, 64, -64, 64, 64, 64, -64, 64, 64, -64, 64, 64, 64, -64, 64, 64, 64, 64, 64, 64, 64, 64, -64, -64, 64, -64, 64, -64, -64, -64, 64, 64, 64, 64, 64, 64, 64, -64, -64, 64, 64, 64, 64, 64, -64, -64, 64, -64, -64, -64, -64, -64, -64, -64, -64, -64, -64, -64, -64, 64, 64, -64, -64, -64, 64, 64, 64, -64, 64, 64, 64, 64, 64, 64, 64, 64, -64, 64, -64, 64, -64, 64, -64, -64, -64, -64, -64, -64, 64, -64, 64, -64, 64, 64, -64, 64, 64, 64, 64, 64, 64, 64, 64, -64, -64, 64, 64, 64, 64, 64, 64, 64, 64, 64, 64, 64, -64, 64, 64, -64, -64, -64, -64, 64, -64, -64, -64, 64, 64, 64, -64, -64, -64, 64, 64, 64, 64, 64, 64, 64, 64, 64, 64, -64, 64, 64, -64, 64, 64, -64, 64, 64, -64, 64, -64, -64, -64, -64, 64, 64, -64, 64, -64, 64, -64, 64, 64, 64, 64, 64, 64, 64, -64, -64, -64, 64, -64, -64, -64, 64, -64, 64, 64, 64, -64, 64, -64, 64, -64, 64, 64, 64, -64, 64, 64, 64, 64, 64, 64, -64, -64, -64, -64, -64, -64, 64, 64, -64, 64, -64, 64, -64, 64, 64, 64, 64, -64, 64, -64, 64, 64, -64, 64, 64, -64, -64, -64, -64, 64, 64, -64, 64, 64, 64, 64, 64, 64, -64, 64, 64, 64, 64, -64, 64, -64, 64, 64, -64, 64, -64, 64, -64, 64, 64, 64, 64, 64, -64, 64, 64, -64, -64, 64, -64, 64, -64, -64, -64, -64, 64, -64, 64, 64, 64, 64, 64, 64, -64, -64, 64, 64, 64, 64, -64, 64, 64, -64, -64, 64, 64, -64, -64, 64, -64, 64, -64, -64, -64, -64, -64, 64, 64, 64, -64, 64, -64, -64, -64, -64, 64, 64, 64, -64, 64, 64, -64, -64, -64, 64, 64, -64, -64, 64, 64, -64, -64, 64, -64, 64, 64, 64, 64, 64, -64, -64, -64, -64, 64, 64, 64, 64, -64, -64, -64, -64, 64, 64, 64, -64, 64, 64, -64, 64, -64, 64, 64, -64, 64, 64, 64, 64, 64, -64, 64, 64, 64, -64, 64, 64, -64, -64, -64, -64, -64, 64, 64, 64, -64, -64, 64, -64, 64, 64, -64, -64, 64, 64, 64, 64, -64, 64, 64, 64, 64, 64, 64, -64, -64, 64, 64, -64, 64, 64, 64, 64, -64, -64, 64, 64, 64, 64, -64, 64, 64, 64, -64, -64, 64, 64, 64, 64, -64, 64, 64, -64, 64, -64, -64, 64, -64, -64, 64, -64, -64, 64, -64, -64, 64, 64, -64, 64, 64, 64, 64, 64, 64, -64, 64, 64, 64, 64, -64, 64, 64, 64, 64, 64, 64, 64, -64, 64, -64, 64, 64, -64, 64, 64, 64, 64, 64, 64, -64, -64, 64, 64, 64, 64, 64, 64, 64, -64, 64, -64, -64, -64, -64, 64, -64, -64, -64, 64, 64, 64, 64, -64, 64, 64, 64, -64, -64, 64, 64, 64, 64, -64, 64, 64, -64, -64, 64, 64, 64, 64, -64, -64, -64, -64, -64, 64, 64, -64, -64, 64, 64, -64, 64, -64, -64, 64, 64, 64, 64, 64, 64, 64, 64, 64, -64, 64, 64, 64, -64, -64, -64, 64, 64, 64, -64, -64, 64, 64, 64, 64, 64, -64, 64, 64, -64, 64, 64, 64, -64, 64, -64, 64, -64, -64, -64, 64, 64, -64, -64, -64, 64, 64, 64, 64, 64, 64, 64, 64, -64, -64, -64, 64, 64, 64, -64, 64, 64, 64, 64, 64, -64, -64, -64, -64, 64, -64, 64, 64, 64, 64, 64, 64, 64, 64, 64, -64, -64, 64, -64, 64, 64, 64, -64, 64, 64, -64, 64, -64, -64, -64, -64, 64, 64, -64, 64, -64, 64, -64, 64, -64, 64, 64, 64, 64, -64, 64, 64, 64, 64, -64, 64, 64, 64, -64, -64, 64, -64, -64, -64, -64, -64, 64, -64, 64, 64, 64, 64, 64, 64, 64, 64, -64, 64, -64, 64, 64, 64, 64, 64, 64, 64, -64, 64, -64, 64, -64, -64, -64, 64, 64, -64, -64, 64, 64, -64, 64, 64, -64, 64, -64, 64, 64, 64, 64, 64, 64, 64, -64, 64, 64, -64, 64, 64, 64, 64, -64, 64, -64, 64, 64, 64, 64, -64, -64, 64, 64, -64, -64, 64, 64, -64, 64, -64, 64, 64, 64, -64, 64, -64, 64, -64, 64, 64, 64, -64, -64, -64, 64, 64, 64, 64, 64, 64, 64, 64, -64, 64, -64, 64, 64, 64, 64, 64, -64, 64, 64, 64, -64, 64, -64, -64, 64, -64, -64, 64, 64, 64, 64, 64, 64, 64, -64, 64, 64, 64, 64, -64, -64, 64, -64, 64, 64, -64, -64, 64, -64, 64, -64, -64, 64, 64, 64, -64, 64, 64, 64, 64, 64, 64, -64, -64, 64, -64, -64, 64, 64, -64, -64, 64, 64, 64, 64, -64, 64, -64, 64, 64, 64, 64, 64, 64, -64, 64, 64, -64, 64, -64, -64, -64, 64, 64, 64, 64, -64, -64, 64, 64, 64, -64, 64, 64, 64, -64, -64, -64, 64, -64, 64, 64, 64, -64, 64, 64, 64, 64, 64, 64, 64, -64, 64, 64, -64, -64, 64, 64, 64, 64, 64, 64, -64, 64, 64, -64, 64, 64, 64, 64, 64, 64, -64, 64, 64, 64, -64, 64, -64, 64, 64, 64, -64, 64, -64, 64, 64, -64, 64, 64, 64, 64, -64, 64, -64, -64, -64, 64, 64, -64, 64, 64, 64, 64, 64, 64, 64, -64, 64, 64, 64, -64, 64, -64, 64, -64, -64, 64, -64, -64, 64, -64, -64, 64, 64, -64, 64, -64, 64, -64, -64, -64, 64, -64, -64, 64, 64, -64, -64, 64, -64, 64, -64, 64, 64, 64, -64, 64, 64, 64, 64, -64, 64, -64, -64, 64, -64, 64, 64, -64, -64, 64, -64, -64, -64, -64, -64, 64, -64, 64, -64, -64, -64, -64, 64, -64, 64, -64, -64, -64, 64, 64, -64, 64, 64, 64, -64, -64, -64, -64, -64, -64, 64, 64, -64, -64, 64, 64, 64, -64, 64, -64, 64, -64, 64, 64, -64, -64, -64, 64, 64, -64, -64, 64, -64, -64, 64, 64, -64, -64, -64, -64, -64, 64, 64, -64, -64, 64, 64, -64, 64, 64, 64, 64, -64, -64, 64, 64, -64, -64, -64, 64, 64, 64, -64, -64, -64, -64, 64, -64, -64, -64, 64, 64, 64, -64, 64, 64, -64, -64, -64, 64, 64, 64, 64, 64, -64, 64, -64, 64, -64, -64, -64, 64, 64, 64, -64, -64, -64, -64, -64, -64, -64, 64, 64, 64, 64, 64, 64, 64, 64, -64, -64, 64, -64, -64, 64, -64, -64, -64, -64, -64, 64, 64, -64, 64, 64, 64, 64, 64, -64, -64, -64, -64, -64, 64, -64, -64, 64, 64, 64, 64, -64, 64, 64, 64, -64, -64, 64, 64, 64, -64, 64, -64, 64, 64, 64, 64, -64, 64, -64, -64, -64, -64, -64, 64, 64, 64, 64, 64, -64, 64, 64, -64, -64, 64, 64, 64, -64, -64, -64, -64, -64, -64, 64, -64, -64, -64, -64, -64, 64, -64, -64, -64, -64, 64, 64, 64, -64, 64, -64, 64, -64, 64, -64, -64, -64, -64, -64, 64, 64, 64, -64, -64, -64, -64, -64, -64, -64, -64, -64, 64, -64, -64, 64, -64, 64, -64, -64, -64, 64, -64, -64, -64, -64, -64, 64, 64, -64, -64, -64, -64, 64, 64, 64, -64, -64, 64, -64, 64, -64, -64, 64, 64, -64, -64, -64, -64, -64, -64, -64, 64, -64, 64, 64, -64, -64, 64, -64, -64, -64, 64, -64, -64, -64, -64, 64, 64, -64, 64, -64, -64, -64, -64, -64, -64, -64, -64, -64, 64, 64, -64, -64, -64, 64, -64, -64, -64, -64, -64, -64, -64, 64, -64, -64, -64, 64, 64, -64, -64, -64, -64, -64, 64, 64, 64, 64, 64, -64, -64, -64, -64, -64, -64, -64, -64, -64, -64, -64, 64, -64, -64, -64, -64, -64, -64, -64, 64, -64, -64, -64, -64, 64, -64, 64, -64, 64, -64, 64, -64, 64, -64, -64, -64, -64, -64, -64, -64, -64, -64, 64, -64, 64, -64, 64, 64, -64, -64, -64, -64, -64, -64, -64, 64, -64, 64, -64, -64, 64, -64, -64, -64, 64, 64, -64, -64, -64, 64, -64, -64, 64, -64, 64, -64, -64, -64, -64, 64, -64, -64, -64, -64, -64, -64, -64, -64, -64, -64, -64, -64, -64, -64, 64, -64, -64, 64, 64, 64, 64, 64, 64, 64, 64, 64, -64, -64, -64, 64, 64, 64, -64, -64, -64, -64, 64, -64, 64, -64, -64, -64, 64, -64, 64, -64, -64, 64, -64, -64, -64, -64, -64, 64, -64, -64, -64, 64, -64, -64, -64, -64, -64, -64, -64, 64, -64, -64, -64, -64, -64, 64, -64, 64, 64, -64, -64, -64, -64, -64, -64, -64, -64, -64, -64, 64, -64, -64, -64, -64, -64, -64, -64, -64, -64, -64, -64, -64, 64, -64, -64, -64, 64, 64, 64, 64, -64, -64, 64, 64, -64, -64, -64, -64, 64, -64, -64, -64, -64, -64, -64, -64, -64, -64, -64, 64, -64, 64, 64, 64, 64, 64, -64, -64, 64, -64, -64, -64, -64, -64, -64, -64, -64, -64, -64, -64, -64, 64, -64, -64, -64, -64, -64, 64, 64, -64, 64, 64, -64, -64, -64, 64, 64, -64, 64, -64, -64, -64, -64, -64, -64, -64, 64, -64, 64, -64, -64, -64, -64, 64, -64, 64, 64, -64, -64, 64, 64, 64, -64, 64, 64, 64, 64, -64, -64, -64, -64, -64, 64, 64, -64, 64, -64, -64, -64, -64, -64, 64, -64, -64, -64, -64, -64, -64, -64, -64, 64, -64, 64, -64, 64, -64, -64, -64, -64, 64, 64, 64, 64, -64, -64, -64, -64, 64, 64, -64, -64, -64, -64, -64, 64, -64, -64, 64, 64, -64, -64, -64, 64, -64, -64, -64, -64, 64, 64, 64, 64, 64, -64, 64, 64, -64, -64, 64, -64, -64, -64, 64, -64, -64, 64, 64, 64, -64, 64, -64, -64, -64, -64, -64, 64, -64, -64, -64, -64, -64, -64, 64, 64, 64, -64, -64, -64, -64, -64, 64, -64, 64, -64, -64, -64, -64, 64, -64, 64, -64, -64, 64, -64, -64, -64, 64, 64, -64, -64, -64, 64, -64, -64, -64, -64, -64, 64, 64, 64, 64, -64, 64, 64, 64, 64, -64, -64, -64, 64, -64, -64, -64, -64, 64, -64, 64, -64, -64, 64, 64, 64, 64, -64, 64, 64, -64, -64, 64, -64, -64, 64, 64, -64, -64, -64, 64, 64, 64, 64, 64, 64, 64, 64, -64, -64, 64, -64, 64, 64, 64, 64, 64, 64, -64, -64, 64, 64, -64, -64, 64, 64, -64, 64, -64, 64, -64, 64, -64, 64, -64, -64, -64, -64, 64, 64, 64, -64, -64, 64, -64, 64, 64, -64, -64, 64, -64, -64, 64, 64, 64, 64, -64, -64, -64, -64, -64, -64, 64, -64, 64, 64, 64, 64, 64, 64, -64, -64, 64, -64, 64, 64, 64, 64, -64, 64, -64, -64, -64, -64, -64, 64, 64, 64, 64, -64, 64, 64, 64, 64, 64, 64, -64, -64, -64, -64, -64, 64, -64, -64, 64, 64, -64, -64, -64, 64, 64, 64, -64, 64, 64, 64, 64, 64, 64, 64, 64, 64, 64, -64, -64, -64, -64, 64, 64, 64, -64, -64, 64, -64, -64, -64, 64, -64, -64, 64, 64, 64, 64, 64, 64, 64, 64, 64, 64, 64, 64, 64, -64, 64, 64, 64, 64, -64, -64, -64, -64, 64, 64, 64, 64, -64, -64, -64, 64, 64, 64, 64, 64, 64, 64, 64, 64, -64, -64, -64, -64, -64, 64, 64, 64, 64, 64, 64, 64, -64, 64, -64, 64, 64, 64, 64, 64, 64, 64, 64, 64, 64, 64, 64, 64, -64, -64, -64, -64, -64, 64, -64, -64, -64, -64, -64, 64, -64, -64, 64, -64, -64, -64, -64, 64, 64, 64, 64, 64, 64, 64, -64, -64, -64, -64, -64, -64, 64, 64, -64, 64, -64, -64, -64, -64, 64, 64, -64, 64, 64, -64, 64, 64, 64, 64, 64, 64, 64, -64, -64, -64, -64, -64, 64, -64, -64, -64, -64, -64, -64, -64, -64, -64, 64, 64, -64, -64, -64, 64, -64, 64, 64, 64, 64, 64, -64, -64, -64, -64, -64, -64, 64, -64, -64, -64, -64, 64, -64, -64, -64, -64, 64, -64, -64, 64, -64, 64, -64, 64, 64, -64, 64, -64, -64, -64, -64, -64, -64, 64, -64, 64, 64, 64, 64, 64, 64, 64, -64, -64, 64, 64, 64, 64, 64, 64, 64, 64, 64, -64, -64, -64, 64, -64, -64, -64, 64, 64, 64, 64, 64, 64, 64, 64, 64, 64, -64, 64, 64, 64, 64, 64, 64, 64, 64, 64, 64, 64, 64, 64, -64, -64, -64, -64, -64, -64, 64, 64, 64, 64, 64, 64, 64, 64, 64, 64, 64, 64, -64, 64, 64, 64, -64, 64, 64, -64, 64, 64, 64, -64, -64, -64, 64, 64, 64, -64, 64, 64, 64, 64, 64, 64, 64, -64, -64, -64, -64, 64, 64, 64, -64, 64, 64, -64, 64, 64, -64, -64, -64, 64, 64, 64, 64, 64, 64, -64, -64, 64, 64, 64, 64, 64, 64, 64, -64, 64, 64, 64, 64, -64, -64, 64, 64, -64, -64, -64, -64, 64, 64, 64, -64, -64, 64, -64, 64, 64, 64, 64, 64, 64, 64, 64, -64, -64, 64, 64, 64, -64, -64, -64, -64, 64, -64, 64, 64, 64, 64, -64, 64, -64, 64, -64, -64, 64, 64, 64, 64, 64, 64, 64, 64, -64, -64, 64, 64, -64, -64, 64, -64, 64, 64, 64, 64, 64, 64, -64, -64, -64, 64, 64, 64, 64, 64, 64, 64, -64, 64, -64, 64, -64, 64, 64, -64, -64, 64, 64, 64, -64, -64, 64, 64, 64, -64, -64, 64, 64, -64, 64, 64, 64, 64, -64, 64, 64, -64, -64, 64, -64, -64, 64, 64, -64, -64, 64, 64, 64, -64, -64, -64, -64, -64, 64, 64, -64, -64, 64, 64, 64, 64, -64, -64, -64, -64, 64, 64, -64, -64, 64, 64, 64, 64, -64, -64, -64, 64, -64, -64, -64, -64, -64, 64, 64, 64, 64, 64, 64, 64, 64, -64, 64, 64, 64, -64, -64, 64, 64, 64, 64, 64, -64, 64, -64, -64, -64, -64, -64, -64, -64, -64, 64, 64, 64, 64, 64, 64, -64, -64, -64, -64, -64, -64, 64, 64, 64, 64, 64, 64, -64, 64, 64, 64, -64, -64, -64, -64, -64, 64, 64, 64, 64, 64, -64, -64, -64, 64, 64, 64, 64, 64, -64, 64, 64, 64, 64, 64, 64, 64, 64, 64, -64, -64, -64, -64, -64, 64, 64, 64, 64, 64, 64, 64, -64, -64, -64, 64, 64, -64, 64, 64, -64, 64, 64, 64, 64, 64, 64, -64, -64, -64, -64, -64, 64, 64, 64, 64, 64, 64, 64, 64, -64, 64, -64, -64, -64, -64, -64, -64, 64, -64, -64, 64, 64, 64, 64, -64, -64, -64, -64, -64, -64, 64, -64, 64, 64, 64, 64, 64, -64, -64, 64, -64, 64, -64, -64, -64, 64, -64, -64, 64, 64, -64, 64, -64, -64, -64, -64, 64, -64, -64, -64, 64, 64, -64, 64, 64, 64, -64, -64, 64, -64, 64, 64, 64, 64, 64, -64, 64, -64, -64, -64, 64, 64, 64, 64, 64, -64, -64, -64, 64, 64, -64, 64, -64, 64, 64, 64, -64, 64, -64, -64, -64, -64, -64, 64, 64, 64, -64, -64, -64, -64, 64, -64, -64, 64, 64, -64, -64, -64, 64, -64, 64, 64, 64, -64, 64, -64, 64, 64, 64, -64, -64, 64, 64, -64, 64, 64, -64, 64, 64, -64, -64, 64, 64, -64, 64, -64, 64, -64, 64, 64, -64, -64, -64, -64, -64, 64, -64, 64, 64, -64, 64, -64, 64, 64, -64, 64, -64, -64, -64, -64, -64, -64, -64, 64, 64, -64, -64, 64, 64, -64, 64, -64, -64, -64, -64, 64, 64, -64, -64, 64, 64, 64, 64, 64, 64, -64, -64, -64, -64, -64, -64, -64, 64, 64, 64, 64, -64, -64, 64, -64, -64, -64, -64, -64, 64, 64, 64, 64, 64, 64, 64, 64, 64, -64, -64, -64, 64, -64, 64, -64, -64, -64, -64, 64, -64, -64, 64, 64, 64, -64, 64, -64, -64, -64, -64, 64, 64, 64, 64, 64, -64, -64, 64, 64, 64, 64, 64, -64, -64, 64, -64, -64, 64, -64, 64, -64, 64, -64, -64, 64, -64, -64, -64, 64, 64, 64, 64, -64, 64, 64, 64, 64, 64, 64, 64, 64, 64, 64, 64, 64, -64, -64, 64, 64, -64, -64, 64, 64, -64, -64, 64, -64, 64, 64, 64, -64, 64, -64, 64, 64, 64, 64, 64, 64, 64, 64, 64, 64, -64, -64, -64, 64, -64, -64, 64, 64, -64, -64, 64, -64, 64, 64, 64, -64, -64, 64, 64, -64, 64, 64, 64, -64, -64, 64, 64, 64, 64, -64, 64, -64, -64, 64, -64, 64, -64, 64, 64, 64, 64, 64, 64, 64, 64, 64, -64, -64, 64, 64, -64, 64, 64, 64, -64, -64, -64, -64, 64, -64, 64, -64, 64, -64, 64, -64, 64, 64, 64, 64, 64, 64, 64, 64, -64, -64, 64, -64, 64, 64, 64, -64, 64, -64, 64, -64, 64, 64, 64, -64, 64, 64, 64, -64, -64, 64, 64, 64, 64, 64, -64, -64, 64, 64, 64, 64, -64, 64, 64, 64, 64, 64, 64, 64, 64, 64, -64, -64, 64, 64, 64, -64, 64, 64, 64, 64, 64, 64, 64, -64, -64, -64, -64, 64, 64, 64, 64, -64, 64, 64, 64, 64, 64, 64, 64, -64, -64, 64, -64, -64, 64, 64, 64, 64, 64, -64, 64, 64, 64, 64, 64, 64, -64, 64, -64, 64, 64, 64, -64, 64, 64, 64, 64, 64, -64, 64, 64, 64, 64, 64, 64, 64, 64, 64, 64, 64, -64, 64, 64, 64, 64, 64, -64, 64, 64, 64, 64, -64, -64, -64, -64, 64, 64, -64, -64, 64, 64, 64, 64, 64, 64, 64, 64, 64, 64, 64, 64, 64, 64, 64, 64, 64, 64, 64, 64, 64, 64, -64, 64, -64, -64, -64, 64, -64, 64, -64, 64, 64, 64, 64, 64, 64, 64, -64, 64, 64, 64, 64, -64, 64, 64, -64, -64, -64, -64, -64, -64, 64, -64, 64, -64, -64, 64, 64, -64, -64, 64, 64, 64, 64, 64, 64, -64, -64, 64, -64, 64, -64, -64, 64, -64, -64, -64, 64, 64, -64, -64, 64, 64, -64, -64, -64, 64, -64, 64, -64, 64, 64, -64, -64, -64, -64, -64, -64, -64, 64, 64, 64, 64, 64, -64, 64, 64, 64, -64, -64, 64, -64, -64, 64, 64, -64, -64, 64, 64, -64, -64, 64, -64, -64, -64, 64, 64, -64, -64, -64, 64, 64, -64, 64, 64, 64, -64, -64, -64, 64, -64, -64, 64, -64, -64, -64, 64, 64, 64, -64, -64, 64, -64, -64, -64, -64, -64, 64, -64, -64, -64, 64, 64, 64, -64, 64, -64, 64, -64, -64, 64, -64, -64, 64, 64, -64, -64, 64, -64, -64, -64, -64, -64, 64, 64, 64, -64, 64, -64, 64, 64, -64, -64, -64, 64, -64, 64, 64, -64, -64, 64, 64, 64, 64, 64, 64, -64, -64, -64, -64, -64, -64, 64, -64, 64, 64, 64, -64, -64, 64, 64, 64, 64, 64, 64, -64, 64, -64, -64, -64, 64, 64, 64, -64, -64, 64, -64, -64, -64, -64, -64, -64, -64, -64, 64, 64, 64, 64, -64, -64, -64, 64, -64, 64, 64, 64, 64, 64, 64, 64, 64, 64, 64, -64, -64, 64, 64, 64, -64, 64, 64, -64, 64, 64, -64, 64, 64, 64, -64, -64, 64, 64, 64, 64, 64, 64, 64, 64, 64, 64, -64, -64, -64, -64, 64, 64, 64, -64, 64, 64, -64, -64, 64, 64, 64, 64, -64, -64, 64, 64, -64, 64, 64, -64, -64, 64, 64, 64, 64, -64, -64, 64, 64, 64, 64, -64, -64, -64, -64, 64, 64, -64, 64, 64, 64, -64, 64, 64, -64, 64, -64, -64, -64, -64, 64, -64, -64, -64, 64, 64, 64, 64, -64, -64, 64, 64, -64, -64, -64, -64, -64, -64, -64, -64, -64, -64, -64, 64, -64, -64, -64, -64, 64, 64, -64, -64, -64, -64, -64, -64, -64, 64, 64, -64, -64, -64, 64, 64, -64, -64, -64, 64, -64, -64, 64, -64, 64, 64, -64, -64, -64, -64, -64, -64, -64, -64, -64, 64, 64, 64, -64, 64, 64, 64, -64, 64, 64, -64, 64, -64, 64, 64, -64, 64, -64, -64, 64, 64, 64, -64, 64, 64, -64, -64, 64, 64, -64, 64, -64, 64, -64, -64, 64, 64, 64, 64, -64, 64, 64, -64, 64, -64, 64, 64, 64, -64, -64, -64, -64, -64, -64, -64, -64, -64, -64, -64, -64, 64, 64, 64, -64, 64, -64, -64, -64, 64, 64, 64, 64, 64, -64, -64, -64, -64, -64, -64, 64, -64, -64, -64, -64, -64, -64, -64, -64, -64, 64, 64, 64, -64, -64, 64, 64, 64, -64, -64, -64, 64, -64, -64, -64, -64, -64, -64, -64, -64, -64, -64, -64, 64, -64, 64, 64, -64, -64, -64, 64, -64, -64, 64, 64, 64, 64, -64, -64, -64, -64, -64, -64, -64, -64, -64, 64, -64, -64, -64, -64, -64, -64, -64, -64, -64, 64, -64, 64, 64, -64, -64, 64, 64, 64, 64, 64, -64, -64, -64, -64, -64, -64, 64, -64, -64, -64, 64, -64, -64, -64, -64, -64, -64, 64, -64, -64, -64, -64, -64, -64, 64, 64, -64, 64, -64, -64, -64, -64, -64, -64, 64, -64, -64, 64, -64, -64, -64, -64, -64, -64, -64, -64, 64, 64, 64, -64, 64, 64, 64, -64, -64, -64, -64, -64, -64, -64, -64, 64, 64, 64, 64, 64, -64, 64, -64, 64, -64, -64, -64, 64, 64, 64, -64, 64, -64, 64, 64, -64, -64, -64, -64, -64, -64, -64, 64, 64, 64, 64, 64, 64, -64, -64, -64, -64, -64, -64, -64, -64, 64, -64, -64, 64, -64, -64, 64, -64, -64, -64, -64, -64, -64, -64, -64, 64, 64, 64, 64, -64, 64, -64, -64, -64, -64, -64, -64, 64, -64, 64, -64, -64, -64, 64, 64, -64, -64, -64, -64, 64, -64, -64, -64, 64, 64, -64, -64, 64, 64, -64, -64, -64, -64, -64, -64, -64, -64, -64, 64, 64, -64, 64, -64, -64, -64, -64, -64, -64, 64, -64, -64, -64, -64, 64, -64, -64, -64, -64, -64, -64, -64, -64, 64, -64, 64, 64, 64, -64, -64, 64, -64, 64, -64, -64, -64, -64, -64, -64, 64, -64, -64, -64, -64, -64, -64, 64, 64, 64, -64, -64, -64, 64, -64, 64, 64, 64, 64, -64, 64, -64, -64, 64, -64, -64, -64, -64, -64, -64, 64, -64, 64, 64, 64, 64, 64, -64, -64, 64, -64, 64, 64, 64, -64, 64, -64, 64, 64, -64, -64, -64, -64, -64, -64, 64, 64, 64, -64, 64, 64, 64, -64, -64, -64, -64, -64, 64, -64, 64, -64, 64, 64, 64, 64, 64, 64, 64, -64, -64, -64, -64, -64, -64, 64, 64, -64, 64, -64, 64, 64, 64, -64, -64, -64, -64, 64, 64, 64, 64, -64, 64, 64, 64, 64, -64, -64, -64, -64, -64, -64, 64, 64, -64, -64, 64, -64, 64, -64, 64, -64, -64, -64, -64, -64, 64, -64, -64, 64, -64, 64, 64, 64, -64, -64, -64, -64, -64, -64, -64, 64, -64, -64, 64, -64, 64, -64, -64, -64, -64, 64, -64, -64, -64, -64, 64, -64, 64, 64, 64, 64, 64, -64, -64, -64, -64, -64, -64, -64, 64, -64, -64, 64, -64, -64, -64, -64, -64, -64, 64, 64, 64, 64, 64, -64, -64, 64, 64, 64, -64, -64, -64, -64, -64, -64, 64, -64, -64, -64, -64, -64, -64, -64, -64, -64, -64, -64, 64, -64, -64, -64, -64, 64, 64, 64, 64, 64, -64, -64, -64, -64, -64, -64, -64, -64, -64, 64, -64, 64, 64, -64, -64, 64, -64, -64, -64, -64, 64, 64, -64, -64, 64, -64, -64, 64, -64, -64, -64, -64, 64, -64, -64, -64, -64, 64, -64, 64, 64, -64, -64, 64, -64, 64, 64, -64, 64, 64, -64, 64, -64, 64, 64, 64, -64, -64, -64, 64, -64, -64, -64, -64, -64, -64, -64, 64, -64, -64, -64, -64, 64, 64, 64, -64, -64, -64, 64, -64, -64, -64, 64, 64, -64, 64, 64, 64, 64, -64, 64, -64, 64, 64, -64, -64, 64, 64, 64, 64, -64, 64, -64, 64, -64, 64, 64, 64, -64, 64, -64, 64, 64, 64, -64, -64, -64, -64, -64, -64, 64, -64, -64, 64, -64, -64, -64, -64, 64, 64, -64, -64, 64, 64, -64, -64, -64, 64, -64, 64, -64, 64, 64, -64, -64, 64, 64, -64, 64, 64, 64, -64, 64, -64, -64, -64, 64, -64, -64, 64, -64, 64, -64, 64, -64, 64, 64, 64, 64, -64, -64, -64, 64, 64, 64, -64, 64, 64, 64, -64, 64, 64, -64, -64, 64, -64, -64, 64, 64, -64, -64, 64, 64, -64, -64, -64, 64, -64, -64, -64, 64, 64, 64, 64, -64, 64, -64, -64, 64, 64, 64, -64, 64, -64, -64, -64, 64, -64, 64, -64, 64, -64, -64, -64, -64, -64, -64, -64, -64, 64, 64, 64, 64, 64, -64, 64, -64, 64, 64, 64, 64, -64, -64, -64, -64, 64, 64, -64, -64, 64, 64, -64, -64, -64, -64, -64, 64, -64, 64, -64, 64, 64, 64, 64, 64, 64, 64, 64, 64, 64, -64, 64, -64, 64, -64, 64, -64, 64, 64, 64, -64, -64, 64, 64, 64, 64, 64, -64, 64, -64, 64, 64, 64, -64, 64, 64, 64, 64, 64, -64, -64, 64, 64, 64, 64, -64, 64, 64, -64, 64, 64, 64, 64, 64, -64, -64, -64, -64, -64, 64, 64, -64, -64, -64, -64, 64, 64, 64, -64, 64, -64, 64, 64, 64, 64, 64, 64, 64, 64, 64, 64, -64, -64, -64, -64, -64, -64, -64, 64, 64, 64, -64, 64, 64, 64, 64, -64, 64, -64, 64, 64, 64, 64, 64, 64, 64, 64, 64, -64, -64, -64, 64, -64, -64, -64, -64, -64, -64, 64, -64, 64, -64, 64, 64, 64, -64, -64, 64, -64, 64, 64, 64, 64, -64, 64, -64, -64, -64, -64, 64, -64, -64, -64, -64, -64, -64, -64, 64, 64, -64, 64, -64, -64, -64, 64, -64, 64, 64, 64, 64, 64, 64, -64, -64, -64, 64, 64, 64, 64, -64, 64, -64, -64, -64, 64, -64, -64, -64, 64, -64, 64, -64, -64, -64, 64, 64, 64, -64, 64, 64, 64, 64, 64, 64, -64, -64, 64, -64, 64, -64, -64, 64, -64, 64, 64, -64, -64, 64, 64, 64, -64, -64, -64, 64, 64, -64, -64, 64, -64, 64, 64, -64, -64, 64, -64, 64, 64, -64, 64, 64, 64, -64, 64, -64, 64, 64, 64, 64, 64, 64, -64, -64, 64, -64, -64, 64, -64, 64, 64, -64, -64, -64, -64, -64, -64, 64, 64, 64, 64, 64, 64, -64, 64, 64, -64, -64, -64, -64, -64, 64, 64, -64, -64, 64, 64, -64, -64, -64, -64, -64, -64, -64, -64, -64, 64, 64, 64, 64, 64, -64, -64, 64, 64, -64, 64, 64, 64, 64, 64, -64, -64, 64, 64, -64, -64, -64, -64, -64, -64, -64, -64, -64, 64, 64, 64, 64, 64, -64, -64, 64, -64, -64, -64, -64, 64, 64, 64, -64, 64, 64, 64, 64, 64, 64, -64, -64, -64, -64, -64, -64, 64, 64, 64, 64, -64, -64, -64, 64, 64, 64, -64, -64, 64, 64, 64, -64, -64, 64, 64, 64, 64, 64, 64, 64, -64, -64, -64, -64, -64, 64, 64, 64, 64, -64, -64, -64, 64, 64, -64, 64, -64, -64, 64, -64, -64, 64, 64, 64, 64, 64, 64, -64, -64, 64, 64, -64, -64, 64, 64, 64, 64, 64, -64, -64, 64, 64, -64, -64, -64, 64, -64, -64, -64, 64, 64, -64, 64, 64, 64, -64, 64, 64, -64, -64, -64, -64, 64, 64, 64, 64, -64, 64, -64, 64, -64, -64, 64, 64, 64, 64, -64, -64, -64, -64, -64, 64, 64, 64, 64, 64, -64, -64, -64, -64, 64, 64, 64, 64, 64, -64, -64, 64, -64, -64, -64, -64, -64, -64, 64, 64, 64, -64, -64, -64, 64, 64, 64, -64, -64, 64, 64, 64, 64, 64, 64, 64, -64, 64, -64, -64, -64, -64, 64, -64, -64, -64, 64, 64, -64, 64, -64, -64, -64, 64, -64, -64, -64, -64, 64, 64, 64, 64, 64, 64, 64, -64, 64, 64, -64, 64, -64, -64, 64, 64, 64, 64, -64, -64, -64, 64, -64, -64, -64, -64, -64, -64, -64, -64, 64, -64, 64, 64, 64, 64, 64, -64, 64, -64, 64, 64, -64, 64, -64, -64, -64, -64, -64, -64, 64, -64, -64, -64, -64, 64, -64, 64, 64, 64, 64, 64, -64, 64, -64, -64, 64, 64, -64, 64, -64, -64, -64, -64, 64, 64, -64, -64, 64, -64, -64, -64, 64, -64, 64, 64, 64, 64, -64, 64, -64, 64, 64, -64, -64, -64, -64, -64, 64, -64, 64, -64, 64, 64, -64, -64, -64, -64, -64, -64, -64, -64, -64, -64, 64, 64, 64, -64, 64, 64, -64, 64, -64, -64, -64, -64, -64, -64, -64, -64, -64, -64, -64, -64, -64, -64, -64, -64, -64, 64, 64, 64, -64, 64, 64, -64, -64, 64, -64, 64, -64, -64, -64, 64, 64, 64, 64, -64, -64, 64, -64, -64, 64, -64, 64, -64, -64, 64, -64, 64, -64, -64, 64, 64, 64, 64, -64, 64, 64, 64, -64, 64, -64, 64, 64, -64, 64, 64, 64, -64, -64, -64, 64, 64, -64, -64, -64, -64, -64, -64, -64, 64, -64, 64, -64, -64, -64, 64, -64, -64, 64, 64, -64, -64, -64, -64, -64, -64, 64, 64, 64, -64, 64, 64, -64, -64, -64, 64, 64, -64, -64, -64, 64, 64, -64, 64, 64, 64, 64, 64, -64, 64, 64, -64, -64, -64, -64, -64, 64, 64, 64, 64, -64, -64, 64, 64, 64, -64, 64, 64, -64, 64, -64, -64, 64, 64, -64, -64, 64, 64, 64, 64, -64, -64, -64, 64, 64, 64, 64, 64, 64, -64, -64, -64, 64, 64, 64, 64, -64, 64, -64, -64, 64, 64, -64, -64, 64, 64, 64, 64, 64, 64, 64, 64, -64, 64, 64, 64, 64, 64, 64, -64, 64, 64, 64, 64, 64, 64, -64, -64, -64, -64, -64, -64, -64, -64, -64, 64, 64, 64, 64, -64, -64, -64, 64, 64, -64, -64, -64, 64, 64, 64, 64, 64, 64, -64, -64, -64, -64, -64, -64, -64, -64, 64, 64, 64, 64, -64, -64, -64, -64, -64, 64, 64, 64, -64, 64, 64, 64, 64, 64, 64, 64, -64, 64, 64, -64, -64, 64, -64, 64, 64, 64, 64, 64, 64, -64, -64, -64, -64, 64, -64, 64, -64, -64, 64, 64, 64, 64, 64, 64, -64, -64, 64, -64, 64, 64, 64, -64, 64, 64, 64, 64, 64, -64, -64, -64, -64, -64, -64, 64, 64, 64, 64, 64, 64, 64, 64, 64, -64, 64, 64, 64, 64, -64, -64, -64, 64, 64, 64, 64, 64, 64, -64, -64, -64, -64, 64, -64, -64, -64, -64, 64, 64, 64, 64, -64, -64, -64, 64, -64, -64, -64, -64, -64, 64, 64, 64, 64, 64, 64, -64, -64, -64, -64, 64, -64, -64, -64, -64, -64, 64, 64, 64, -64, 64, 64, -64, 64, -64, -64, -64, 64, 64, 64, 64, 64, 64, 64, -64, -64, -64, -64, 64, 64, -64, -64, -64, -64, 64, -64, -64, -64, -64, 64, 64, 64, -64, -64, -64, 64, 64, 64, 64, 64, 64, -64, -64, -64, -64, 64, 64, 64, -64, 64, 64, 64, 64, 64, -64, -64, 64, -64, -64, 64, 64, -64, 64, -64, 64, 64, 64, 64, 64, -64, -64, -64, 64, -64, 64, -64, 64, -64, -64, 64, 64, 64, 64, -64, 64, -64, -64, 64, -64, -64, -64, -64, -64, 64, 64, 64, -64, -64, -64, -64, 64, -64, 64, 64, 64, -64, 64, 64, -64, 64, -64, -64, -64, -64, -64, 64, 64, -64, -64, 64, 64, 64, 64, -64, -64, 64, -64, -64, 64, 64, 64, 64, 64, -64, 64, 64, -64, -64, -64, -64, 64, -64, 64, -64, 64, -64, -64, -64, 64, 64, -64, -64, -64, -64, -64, 64, 64, 64, 64, -64, -64, -64, 64, -64, -64, -64, -64, -64, -64, 64, -64, 64, -64, -64, -64, -64, 64, 64, -64, -64, -64, -64, -64, 64, 64, 64, -64, 64, 64, -64, -64, -64, -64, -64, -64, 64, 64, -64, -64, -64, -64, -64, -64, -64, 64, -64, 64, -64, -64, -64, -64, 64, 64, -64, 64, -64, -64, -64, -64, 64, -64, -64, -64, -64, -64, 64, 64, -64, -64, -64, -64, 64, 64, 64, -64, -64, -64, 64, 64, 64, -64, 64, -64, 64, 64, 64, 64, -64, 64, 64, -64, -64, -64, -64, -64, 64, -64, -64, -64, -64, -64, -64, -64, -64, 64, 64, 64, 64, 64, -64, -64, 64, 64, 64, 64, 64, 64, 64, -64, -64, -64, 64, 64, 64, 64, -64, -64, -64, -64, -64, -64, -64, -64, -64, -64, 64, 64, -64, 64, 64, 64, 64, 64, 64, -64, 64, 64, -64, -64, 64, 64, -64, -64, -64, -64, -64, -64, -64, -64, -64, -64, -64, -64, 64, 64, 64, 64, -64, 64, 64, -64, -64, -64, 64, 64, 64, -64, -64, 64, 64, 64, 64, 64, -64, -64, -64, -64, -64, -64, 64, 64, 64, -64, -64, -64, 64, 64, -64, -64, 64, -64, -64, 64, -64, 64, 64, -64, -64, 64, 64, -64, -64, -64, -64, 64, -64, -64, -64, -64, -64, 64, -64, -64, -64, -64, -64, -64, 64, 64, 64, -64, 64, -64, 64, 64, -64, 64, 64, 64, -64, -64, 64, 64, -64, -64, -64, 64, -64, 64, -64, 64, 64, 64, -64, 64, 64, -64, -64, -64, 64, 64, 64, 64, -64, -64, 64, -64, -64, 64, 64, 64, -64, 64, -64, -64, 64, -64, 64, 64, 64, -64, 64, -64, -64, -64, 64, 64, -64, 64, 64, -64, -64, 64, 64, 64, 64, 64, -64, 64, -64, -64, 64, -64, -64, -64, 64, 64, 64, -64, 64, -64, -64, 64, 64, 64, -64, -64, 64, -64, 64, 64, -64, -64, -64, -64, 64, -64, -64, -64, -64, 64, 64, -64, 64, -64, -64, 64, 64, 64, 64, -64, 64, 64, -64, -64, -64, 64, -64, -64, -64, -64, 64, -64, -64, 64, 64, -64, 64, -64, -64, 64, 64, 64, 64, -64, 64, -64, 64, -64, -64, -64, -64, 64, 64, -64, 64, 64, 64, -64, 64, 64, 64, 64, -64, 64, -64, 64, -64, -64, -64, -64, 64, -64, 64, -64, 64, -64, 64, 64, -64, -64, -64, 64, 64, 64, 64, 64, -64, 64, 64, -64, 64, -64, 64, -64, 64, -64, 64, 64, -64, 64, 64, -64, 64, -64, 64, -64, 64, 64, 64, -64, 64, -64, -64, -64, -64, -64, -64, 64, 64, 64, -64, 64, -64, 64, 64, 64, -64, 64, -64, 64, 64, 64, -64, 64, 64, 64, -64, 64, 64, -64, 64, 64, 64, -64, -64, 64, -64, 64, -64, 64, -64, 64, -64, 64, 64, -64, 64, -64, 64, -64, 64, -64, 64, 64, -64, 64, -64, 64, 64, 64, 64, 64, 64, 64, 64, 64, -64, -64, -64, 64, 64, 64, 64, 64, 64, 64, 64, -64, 64, 64, 64, 64, 64, -64, 64, 64, 64, 64, 64, 64, 64, 64, 64, -64, 64, -64, -64, 64, -64, 64, 64, 64, 64, 64, 64, 64, 64, 64, 64, 64, -64, 64, -64, -64, 64, 64, 64, 64, 64, 64, 64, -64, 64, -64, 64, 64, -64, 64, 64, 64, -64, -64, -64, 64, 64, 64, 64, -64, -64, -64, 64, 64, 64, -64, 64, -64, -64, 64, -64, 64, 64, 64, 64, 64, 64, 64, 64, -64, -64, 64, 64, -64, -64, -64, 64, -64, 64, -64, 64, -64, -64, -64, 64, 64, 64, -64, 64, 64, 64, 64, 64, 64, 64, 64, -64, -64, -64, 64, 64, -64, -64, -64, 64, 64, 64, 64, 64, 64, -64, -64, -64, -64, 64, 64, 64, 64, -64, 64, 64, 64, 64, -64, 64, 64, -64, 64, 64, 64, -64, 64, 64, 64, 64, -64, 64, -64, 64, 64, 64, 64, -64, -64, 64, 64, -64, 64, 64, -64, -64, 64, 64, 64, -64, -64, 64, -64, 64, 64, 64, -64, 64, 64, 64, 64, 64, -64, 64, 64, -64, 64, -64, 64, 64, 64, -64, -64, 64, -64, -64, 64, 64, -64, 64, -64, -64, -64, 64, -64, 64, 64, 64, -64, 64, -64, 64, -64, -64, 64, -64, 64, 64, 64, 64, -64, 64, 64, 64, 64, 64, -64, 64, -64, -64, 64, -64, -64, 64, 64, 64, -64, -64, 64, -64, 64, 64, 64, 64, 64, -64, -64, 64, 64, 64, -64, 64, -64, -64, 64, 64, 64, -64, -64, -64, -64, 64, 64, 64, 64, -64, -64, 64, 64, -64, 64, 64, -64, -64, 64, -64, 64, -64, -64, -64, 64, -64, -64, 64, 64, 64, -64, -64, -64, 64, 64, 64, 64, 64, 64, -64, 64, 64, 64, -64, -64, -64, 64, 64, 64, 64, -64, 64, 64, 64, 64, -64, -64, -64, -64, 64, 64, -64, 64, -64, 64, -64, 64, 64, 64, 64, 64, 64, 64, 64, 64, 64, 64, 64, -64, -64, 64, -64, 64, -64, 64, 64, -64, -64, 64, -64, 64, -64, 64, 64, 64, -64, -64, -64, 64, 64, -64, 64, 64, -64, 64, 64, 64, 64, 64, 64, -64, -64, -64, -64, -64, 64, -64, -64, -64, -64, -64, -64, 64, 64, 64, -64, 64, 64, 64, 64, 64, -64, 64, -64, -64, -64, -64, 64, 64, -64, 64, 64, -64, -64, -64, 64, 64, 64, 64, 64, 64, 64, -64, -64, 64, 64, 64, 64, 64, 64, 64, 64, 64, 64, 64, 64, -64, -64, 64, -64, 64, 64, -64, 64, -64, 64, 64, -64, -64, 64, -64, 64, 64, -64, 64, 64, 64, -64, 64, 64, -64, 64, -64, 64, 64, 64, 64, -64, -64, 64, -64, -64, 64, 64, 64, 64, -64, -64, -64, -64, 64, 64, -64, -64, 64, -64, 64, -64, 64, 64, 64, -64, 64, -64, -64, 64, 64, -64, -64, 64, 64, -64, 64, -64, -64, 64, -64, -64, 64, -64, 64, -64, 64, 64, 64, 64, -64, 64, -64, -64, 64, 64, -64, 64, 64, -64, -64, 64, -64, 64, 64, -64, 64, 64, 64, 64, -64, -64, 64, 64, -64, -64, 64, 64, 64, 64, 64, 64, 64, 64, -64, -64, 64, -64, 64, -64, 64, 64, 64, 64, -64, 64, -64, -64, -64, -64, 64, 64, 64, -64, 64, -64, -64, 64, 64, -64, 64, -64, 64, -64, 64, 64, 64, -64, -64, -64, 64, 64, -64, -64, 64, 64, 64, 64, 64, 64, 64, 64, 64, 64, 64, -64, -64, -64, 64, 64, 64, -64, -64, -64, 64, -64, 64, 64, -64, -64, -64, 64, -64, -64, -64, -64, 64, -64, -64, 64, -64, -64, -64, 64, 64, 64, -64, 64, 64, -64, -64, 64, 64, 64, -64, -64, 64, -64, -64, -64, -64, 64, -64, -64, -64, -64, 64, 64, 64, 64, -64, -64, 64, 64, -64, -64, 64, -64, 64, 64, -64, 64, 64, -64, -64, 64, 64, -64, -64, -64, -64, -64, -64, -64, -64, -64, 64, 64, 64, 64, -64, 64, -64, -64, -64, -64, -64, -64, 64, -64, -64, -64, 64, 64, -64, -64, -64, -64, -64, -64, -64, -64, 64, 64, 64, 64, 64, 64, 64, 64, -64, 64, 64, 64, -64, -64, 64, 64, -64, 64, 64, 64, 64, -64, -64, 64, -64, 64, -64, -64, -64, 64, 64, -64, 64, 64, 64, 64, 64, 64, 64, -64, -64, -64, 64, 64, -64, 64, -64, 64, 64, 64, 64, 64, 64, 64, 64, -64, -64, -64, 64, 64, 64, 64, 64, 64, 64, -64, -64, -64, 64, -64, -64, -64, 64, -64, 64, 64, 64, 64, 64, 64, 64, 64, 64, -64, 64, -64, 64, 64, 64, 64, 64, 64, 64, 64, 64, 64, 64, 64, -64, -64, -64, -64, -64, -64, 64, 64, 64, -64, 64, 64, -64, 64, 64, 64, 64, 64, 64, 64, 64, 64, 64, 64, 64, 64, 64, 64, 64, 64, -64, 64, -64, 64, 64, -64, 64, 64, 64, 64, 64, -64, 64, 64, -64, -64, -64, 64, 64, 64, 64, 64, 64, 64, 64, 64, 64, -64, 64, 64, 64, 64, 64, 64, 64, 64, -64, 64, 64, -64, -64, -64, -64, 64, 64, 64, -64, -64, 64, 64, 64, 64, -64, -64, 64, 64, 64, -64, -64, 64, -64, -64, -64, -64, 64, -64, 64, -64, -64, -64, 64, 64, 64, 64, 64, 64, 64, 64, 64, 64, -64, 64, 64, 64, -64, 64, 64, -64, 64, 64, -64, 64, 64, 64, 64, -64, -64, 64, 64, 64, 64, 64, 64, -64, 64, 64, -64, 64, 64, 64, 64, -64, -64, 64, 64, -64, -64, -64, -64, 64, 64, 64, -64, -64, -64, 64, 64, 64, 64, 64, 64, -64, 64, 64, -64, 64, -64, -64, -64, -64, -64, 64, -64, 64, 64, 64, -64, 64, 64, 64, -64, 64, 64, 64, 64, 64, 64, 64, 64, -64, 64, 64, 64, 64, 64, -64, -64, 64, -64, 64, -64, -64, -64, -64, -64, -64, -64, 64, -64, -64, -64, 64, 64, 64, 64, 64, 64, -64, -64, -64, 64, -64, -64, -64, 64, 64, -64, 64, 64, -64, -64, 64, 64, -64, -64, 64, -64, -64, -64, 64, 64, -64, -64, -64, -64, -64, -64, -64, -64, -64, -64, 64, 64, 64, -64, -64, 64, -64, -64, -64, -64, -64, -64, -64, -64, -64, -64, -64, -64, 64, 64, 64, -64, -64, -64, -64, -64, -64, -64, -64, 64, -64, -64, -64, -64, 64, -64, -64, -64, -64, -64, -64, -64, 64, -64, -64, 64, 64, -64, 64, -64, -64, -64, -64, -64, -64, -64, -64, -64, -64, -64, 64, -64, -64, 64, 64, 64, -64, -64, 64, 64, 64, 64, 64, 64, 64, 64, -64, -64, -64, -64, -64, -64, -64, -64, -64, -64, 64, -64, 64, -64, -64, -64, 64, 64, 64, -64, 64, 64, 64, 64, 64, 64, 64, 64, 64, 64, -64, -64, -64, -64, -64, -64, -64, 64, 64, 64, 64, -64, 64, 64, 64, 64, 64, 64, 64, 64, 64, 64, 64, 64, 64, 64, 64, 64, 64, -64, -64, -64, -64, -64, 64, 64, 64, -64, 64, 64, 64, 64, -64, -64, 64, 64, 64, 64, 64, 64, 64, 64, 64, 64, 64, 64, 64, -64, -64, -64, 64, 64, -64, -64, 64, -64, 64, -64, 64, -64, -64, 64, 64, -64, -64, 64, 64, 64, 64, 64, 64, 64, 64, 64, -64, 64, -64, -64, -64, -64, -64, 64, -64, 64, -64, 64, -64, -64, 64, 64, 64, 64, -64, 64, 64, 64, 64, 64, 64, 64, 64, 64, -64, 64, -64, -64, 64, -64, -64, -64, 64, 64, -64, 64, -64, 64, -64, 64, 64, -64, 64, 64, 64, 64, -64, 64, 64, 64, 64, 64, -64, -64, 64, -64, 64, 64, -64, 64, 64, -64, 64, -64, 64, -64, 64, -64, -64, 64, 64, -64, -64, 64, -64, 64, -64, 64, -64, 64, -64, -64, -64, -64, 64, 64, -64, 64, -64, 64, -64, 64, -64, 64, 64, 64, 64, 64, 64, -64, 64, 64, 64, 64, 64, 64, -64, 64, 64, -64, -64, -64, -64, -64, -64, 64, -64, 64, 64, -64, 64, -64, 64, 64, -64, -64, -64, -64, 64, 64, -64, 64, -64, 64, -64, 64, -64, 64, 64, 64, 64, 64, 64, 64, -64, -64, -64, -64, 64, -64, 64, 64, 64, -64, 64, -64, 64, 64, 64, 64, 64, -64, 64, -64, 64, 64, 64, -64, 64, 64, 64, 64, -64, 64, -64, -64, -64, -64, 64, 64, 64, 64, -64, -64, 64, 64, -64, -64, -64, 64, 64, 64, -64, 64, 64, 64, -64, 64, -64, -64, -64, -64, 64, 64, -64, 64, -64, 64, 64, -64, -64, -64, 64, 64, -64, 64, -64, -64, -64, 64, 64, 64, -64, 64, -64, 64, 64, -64, -64, 64, -64, 64, 64, 64, 64, 64, 64, 64, 64, 64, -64, -64, -64, -64, 64, 64, 64, 64, 64, 64, -64, -64, -64, 64, -64, 64, -64, -64, -64, -64, -64, 64, -64, 64, 64, 64, 64, -64, -64, -64, -64, 64, -64, -64, 64, 64, 64, 64, 64, 64, 64, 64, -64, 64, -64, -64, 64, -64, -64, 64, 64, 64, 64, 64, 64, 64, -64, -64, 64, -64, -64, 64, 64, 64, 64, 64, 64, 64, 64, 64, 64, -64, -64, -64, 64, -64, -64, 64, -64, 64, 64, 64, -64, 64, -64, 64, -64, 64, 64, 64, 64, 64, 64, 64, 64, 64, 64, -64, -64, -64, 64, 64, -64, -64, -64, -64, -64, -64, 64, 64, -64, 64, -64, 64, 64, 64, 64, 64, 64, 64, 64, -64, -64, -64, 64, -64, 64, 64, -64, -64, 64, 64, -64, -64, -64, 64, -64, 64, 64, 64, -64, -64, 64, 64, -64, 64, 64, 64, -64, -64, -64, -64, 64, 64, 64, 64, 64, 64, 64, -64, 64, 64, -64, 64, 64, 64, 64, -64, 64, 64, -64, -64, -64, 64, -64, -64, -64, -64, -64, -64, 64, 64, -64, 64, 64, -64, 64, 64, 64, -64, 64, -64, 64, 64, 64, 64, -64, -64, -64, -64, -64, -64, -64, -64, -64, -64, -64, -64, 64, 64, -64, 64, -64, 64, 64, 64, -64, 64, 64, 64, 64, 64, 64, -64, -64, -64, -64, -64, -64, -64, -64, -64, -64, -64, -64, 64, 64, 64, -64, 64, -64, 64, 64, 64, -64, 64, 64, 64, 64, 64, -64, -64, 64, -64, -64, -64, -64, 64, -64, -64, -64, -64, 64, 64, 64, 64, -64, -64, -64, 64, 64, -64, -64, -64, 64, -64, 64, 64, -64, -64, -64, -64, -64, -64, -64, -64, -64, -64, -64, -64, -64, 64, 64, 64, 64, -64, 64, 64, -64, -64, -64, 64, 64, -64, -64, -64, -64, -64, -64, -64, -64, -64, 64, -64, 64, 64, -64, -64, 64, 64, 64, 64, -64, -64, 64, 64, 64, -64, -64, 64, 64, 64, -64, -64, -64, -64, -64, -64, -64, 64, 64, 64, 64, 64, 64, -64, 64, 64, -64, -64, -64, 64, 64, 64, 64, -64, -64, 64, 64, -64, 64, -64, -64, -64, -64, -64, -64, 64, -64, -64, -64, 64, 64, -64, -64, 64, 64, -64, -64, 64, -64, -64, -64, -64, 64, 64, -64, -64, -64, -64, -64, -64, -64, -64, 64, 64, 64, -64, -64, -64, 64, -64, 64, 64, 64, -64, -64, -64, 64, -64, 64, -64, 64, 64, -64, 64, -64, 64, -64, -64, -64, -64, -64, -64, -64, -64, -64, -64, 64, -64, 64, 64, 64, 64, 64, 64, 64, 64, 64, -64, 64, -64, 64, -64, 64, -64, -64, -64, -64, -64, -64, 64, -64, -64, -64, 64, 64, 64, 64, -64, 64, 64, -64, -64, -64, 64, 64, -64, -64, -64, -64, -64, 64, 64, 64, 64, 64, 64, 64, -64, -64, -64, 64, 64, 64, 64, -64, -64, -64, -64, -64, 64, 64, 64, -64, -64, -64, -64, -64, -64, -64, -64, 64, 64, 64, 64, 64, 64, 64, 64, 64, 64, 64, -64, -64, -64, -64, -64, 64, 64, 64, -64, -64, -64, -64, -64, -64, -64, -64, -64, 64, 64, 64, 64, 64, 64, 64, -64, 64, -64, -64, -64, -64, -64, -64, 64, 64, -64, 64, 64, 64, 64, -64, 64, 64, -64, -64, 64, 64, 64, -64, 64, 64, -64, -64, -64, -64, -64, -64, -64, -64, -64, -64, -64, -64, -64, 64, 64, -64, -64, 64, 64, -64, 64, 64, 64, 64, 64, 64, 64, 64, 64, -64, 64, 64, 64, 64, 64, -64, 64, 64, -64, 64, 64, -64, 64, 64, -64, -64, -64, 64, 64, -64, -64, 64, -64, -64, 64, 64, 64, 64, 64, 64, 64, 64, 64, 64, -64, 64, -64, -64, -64, -64, -64, 64, 64, -64, -64, -64, 64, -64, 64, 64, 64, 64, 64, 64, 64, 64, 64, 64, 64, -64, 64, -64, -64, 64, 64, 64, -64, 
};

fixed_point_t fc1_bias_fp[512]=
{
-2, -2, 3, -3, 1, -3, -1, 2, 2, -2, -1, 3, -4, 0, -3, 1, 0, -3, -2, 0, -3, -2, 4, 0, 1, -1, -2, -2, 1, 3, 0, -2, 1, -3, 0, 2, -2, 3, -3, -1, -1, -3, 3, 0, 1, 0, -2, -2, -2, 0, 2, 5, 0, 4, 1, -1, 3, -4, -3, -3, 0, 0, 0, 0, -5, 0, 1, 1, -3, 3, -4, 1, 2, 0, -1, 0, -1, -3, 0, -2, -3, 2, -2, -3, 1, 1, 0, 0, -3, -8, 4, 2, -1, -1, 1, -2, 2, 2, 5, 1, 1, -1, -1, 0, 2, 0, 0, -2, 1, -2, -1, -1, -1, -2, -5, 0, 3, 3, 0, 0, 2, 1, -1, -3, -3, 0, 3, 0, 2, -4, 2, 0, -2, -2, -2, -3, 0, -1, 4, -2, 1, 2, 1, 3, 2, 0, 1, 0, -2, 1, 0, 0, -1, -1, -1, 2, 3, -3, 1, -2, -2, 3, 0, 3, 0, 2, 3, -1, -1, -1, -2, 0, -3, 1, -1, -1, 0, 1, 3, -4, 0, -7, 0, -1, -1, 0, 1, 1, 2, 2, 1, 1, -2, 0, 1, 1, -3, -3, 3, 3, 2, 0, 0, -2, -2, 3, 2, -1, -2, 2, -1, 0, -1, 3, 2, 1, 0, -1, -1, 4, 4, 1, 3, 2, 1, 0, 3, -3, 0, -2, 1, -3, 2, -3, 2, 0, -4, -2, 1, 1, 0, 4, -2, 2, -2, -2, -1, -1, 3, 1, -1, -1, 1, -1, 1, -1, 1, 2, 4, -2, 1, 2, 1, 0, -4, -1, 1, -4, 0, -2, 1, 0, 1, 3, 1, 2, 0, -1, 3, 2, -2, 3, 0, -4, -4, 0, 2, 2, 4, 0, -1, -3, 0, -4, -2, 1, -2, 3, 0, -1, 0, 3, 1, -3, 1, -1, -2, -3, 1, -1, -1, 0, 2, 1, 0, -2, -3, 3, -2, -1, -1, -4, 1, -2, -2, -2, -1, -1, 2, 1, 1, -5, 4, 0, 0, -1, 2, -2, 1, 2, 1, -2, 2, -1, 2, -2, 2, 4, 3, -3, 0, -1, 0, -1, -1, 1, -2, 0, -1, 4, 3, 3, -3, -1, -2, 3, 0, 0, -3, 1, 1, -4, 3, -2, -2, 2, 3, 0, -3, -2, -4, 0, 0, 1, 1, -2, -1, 2, 2, 0, -1, 2, -2, -3, 1, 2, -3, 0, -1, 2, 0, -2, -5, 0, -1, 2, -2, -1, -2, 1, 2, -2, 1, 0, 2, 0, 0, 0, 3, 0, 5, 1, -3, -4, 0, -2, -2, 0, 0, -1, -4, 1, 1, 2, 1, 3, -3, 3, -3, -2, -3, -1, 6, 0, -2, 1, 0, 1, -4, 3, -1, 0, 3, 2, -3, -1, 1, -4, 0, -4, 3, -2, -2, -1, 3, 2, 0, -2, 4, -3, 3, 2, -1, 1, 1, -4, -1, -1, -2, 2, 2, -2, 2, 0, -3, -1, -1, 2, 0, 2, -1, -2, 0, -2, 2, -3, -3, -3, -2, -3, 1, -1, 2, 0, 0, 2, -3, -1, 1, 2, 2, 0, 
};

fixed_point_t fc2_weight_fp[512*10]=
{
-64, -64, -64, -64, -64, -64, -64, 64, 64, 64, 64, -64, -64, 64, -64, 64, -64, -64, 64, -64, -64, -64, -64, 64, 64, 64, 64, 64, -64, 64, 64, -64, -64, 64, -64, 64, -64, -64, -64, -64, 64, 64, 64, -64, -64, 64, -64, -64, 64, 64, 64, 64, 64, 64, -64, -64, 64, -64, -64, -64, 64, 64, -64, -64, -64, -64, -64, -64, -64, 64, -64, -64, 64, -64, -64, 64, -64, -64, 64, 64, -64, -64, 64, 64, -64, 64, -64, 64, -64, 64, 64, -64, 64, 64, 64, 64, -64, -64, 64, 64, 64, 64, 64, -64, -64, -64, 64, 64, 64, -64, 64, 64, -64, 64, 64, 64, 64, 64, 64, -64, 64, -64, -64, 64, 64, 64, -64, 64, 64, -64, -64, 64, -64, 64, 64, -64, -64, -64, -64, -64, -64, 64, -64, -64, 64, -64, 64, -64, -64, 64, 64, 64, -64, 64, -64, 64, -64, -64, -64, 64, -64, -64, -64, -64, 64, -64, 64, -64, -64, 64, 64, -64, -64, 64, -64, -64, 64, -64, -64, 64, 64, 64, -64, 64, 64, -64, -64, 64, 64, 64, -64, -64, 64, 64, -64, -64, 64, -64, 64, 64, 64, 64, 64, -64, 64, 64, 64, -64, -64, 64, 64, 64, -64, -64, -64, -64, 64, -64, -64, 64, 64, -64, 64, 64, 64, -64, -64, 64, 64, -64, 64, 64, -64, 64, 64, -64, -64, 64, 64, 64, -64, -64, 64, 64, 64, -64, -64, -64, -64, -64, -64, 64, -64, 64, -64, -64, 64, 64, 64, -64, -64, -64, 64, 64, -64, -64, -64, 64, 64, 64, -64, -64, -64, -64, 64, 64, 64, 64, 64, -64, -64, -64, -64, 64, -64, -64, 64, -64, -64, -64, -64, -64, 64, 64, 64, -64, 64, -64, 64, 64, 64, -64, -64, 64, 64, 64, 64, 64, -64, 64, 64, -64, 64, -64, 64, 64, -64, -64, -64, -64, 64, -64, 64, -64, -64, 64, -64, 64, 64, 64, -64, 64, -64, -64, 64, 64, 64, 64, 64, -64, -64, -64, -64, 64, 64, -64, 64, -64, -64, -64, 64, -64, -64, -64, -64, -64, -64, 64, 64, 64, 64, -64, 64, -64, -64, -64, -64, 64, -64, 64, -64, 64, 64, 64, -64, -64, -64, -64, -64, 64, 64, -64, 64, 64, -64, 64, 64, -64, 64, 64, -64, -64, -64, 64, -64, -64, 64, 64, 64, -64, -64, 64, -64, 64, 64, -64, 64, 64, -64, -64, 64, -64, -64, -64, 64, 64, -64, -64, -64, 64, 64, 64, -64, 64, 64, 64, -64, -64, -64, 64, 64, 64, -64, -64, -64, -64, 64, 64, -64, 64, 64, -64, 64, 64, 64, -64, 64, -64, -64, -64, -64, 64, 64, -64, -64, 64, -64, 64, 64, -64, 64, -64, -64, -64, 64, 64, 64, 64, 64, 64, 64, -64, -64, -64, -64, 64, -64, 64, -64, -64, -64, -64, -64, -64, 64, 64, 64, -64, -64, 64, -64, 64, 64, 64, -64, 64, -64, -64, -64, -64, 64, -64, 64, -64, -64, -64, -64, -64, 64, 64, 64, 64, 64, 64, -64, -64, 64, -64, 64, -64, -64, -64, 64, -64, 64, 64, 64, 64, -64, -64, 64, 64, -64, 64, 64, 64, -64, 64, -64, -64, 64, -64, 64, -64, 64, -64, 64, -64, 64, 64, 64, -64, -64, -64, 64, 64, -64, -64, 64, -64, -64, -64, -64, 64, 64, 64, -64, 64, -64, -64, -64, -64, -64, -64, 64, 64, -64, -64, 64, -64, 64, -64, -64, -64, 64, 64, 64, 64, -64, 64, -64, -64, 64, 64, -64, -64, 64, -64, 64, 64, -64, -64, 64, 64, -64, 64, -64, 64, 64, 64, -64, -64, 64, 64, 64, 64, -64, -64, -64, -64, -64, 64, 64, -64, -64, -64, -64, -64, -64, 64, 64, -64, 64, -64, 64, -64, 64, -64, 64, 64, -64, 64, 64, 64, 64, -64, 64, -64, 64, -64, -64, 64, -64, -64, 64, -64, 64, 64, 64, 64, -64, -64, -64, 64, 64, 64, 64, -64, 64, 64, -64, -64, -64, 64, 64, 64, 64, -64, -64, -64, -64, -64, -64, -64, 64, 64, 64, 64, -64, 64, 64, -64, 64, 64, 64, 64, -64, 64, -64, -64, 64, 64, 64, 64, 64, -64, -64, -64, -64, 64, -64, -64, -64, 64, -64, -64, -64, 64, -64, 64, 64, -64, -64, -64, 64, 64, -64, 64, 64, 64, 64, -64, -64, 64, -64, -64, 64, 64, 64, 64, 64, 64, 64, 64, -64, -64, -64, -64, 64, -64, -64, 64, 64, 64, 64, -64, 64, -64, 64, -64, 64, -64, -64, -64, -64, 64, 64, 64, 64, -64, -64, 64, -64, 64, 64, 64, 64, 64, 64, -64, -64, 64, 64, 64, -64, -64, -64, -64, -64, -64, -64, 64, -64, 64, -64, -64, -64, 64, 64, -64, 64, 64, -64, -64, -64, -64, -64, -64, -64, 64, 64, -64, -64, 64, -64, -64, 64, 64, 64, -64, 64, 64, -64, 64, -64, 64, 64, -64, -64, -64, -64, 64, -64, -64, 64, -64, -64, -64, 64, -64, 64, 64, 64, -64, 64, 64, -64, -64, -64, -64, -64, 64, 64, 64, -64, -64, 64, 64, 64, 64, -64, -64, -64, -64, 64, 64, 64, 64, 64, 64, -64, -64, -64, -64, 64, 64, -64, 64, -64, -64, 64, -64, 64, -64, 64, -64, -64, 64, -64, -64, -64, 64, -64, 64, -64, 64, -64, -64, -64, -64, -64, 64, -64, 64, 64, -64, 64, -64, -64, 64, -64, 64, 64, 64, 64, -64, 64, -64, -64, -64, 64, 64, 64, -64, -64, 64, -64, 64, -64, 64, -64, 64, 64, 64, -64, 64, 64, -64, -64, -64, 64, 64, 64, 64, 64, 64, -64, -64, -64, -64, -64, -64, 64, -64, -64, -64, 64, 64, 64, 64, -64, 64, -64, 64, -64, -64, 64, 64, -64, -64, 64, -64, -64, 64, 64, -64, 64, -64, 64, 64, -64, -64, 64, -64, 64, 64, -64, 64, -64, -64, -64, 64, 64, -64, 64, -64, 64, -64, 64, -64, -64, 64, -64, -64, 64, -64, -64, 64, 64, -64, 64, -64, 64, -64, -64, -64, 64, -64, 64, -64, 64, 64, 64, 64, 64, 64, -64, 64, 64, -64, -64, -64, -64, -64, 64, -64, -64, -64, 64, -64, 64, 64, -64, 64, -64, -64, 64, -64, -64, -64, -64, 64, 64, 64, 64, -64, 64, 64, -64, -64, 64, 64, -64, 64, 64, 64, -64, -64, 64, -64, -64, -64, 64, 64, 64, 64, 64, -64, -64, 64, 64, 64, -64, -64, -64, 64, -64, 64, 64, 64, 64, -64, -64, -64, 64, 64, 64, 64, 64, 64, 64, -64, 64, -64, 64, 64, -64, 64, -64, 64, -64, 64, -64, 64, 64, 64, 64, -64, -64, 64, 64, -64, 64, -64, 64, 64, -64, 64, 64, 64, -64, -64, 64, 64, 64, -64, 64, -64, -64, -64, -64, -64, -64, -64, -64, 64, 64, 64, -64, 64, -64, -64, 64, -64, 64, 64, 64, -64, -64, -64, -64, -64, 64, -64, 64, -64, 64, 64, -64, 64, -64, -64, -64, -64, -64, -64, -64, 64, 64, 64, 64, -64, 64, 64, -64, -64, -64, -64, 64, 64, 64, 64, 64, -64, -64, -64, 64, 64, 64, -64, 64, 64, -64, -64, -64, 64, 64, -64, 64, 64, -64, 64, 64, 64, -64, -64, -64, -64, -64, 64, -64, 64, -64, 64, -64, 64, 64, -64, 64, -64, 64, 64, 64, 64, 64, -64, -64, -64, -64, -64, 64, 64, 64, -64, -64, -64, -64, -64, 64, -64, 64, 64, 64, 64, 64, 64, -64, -64, -64, 64, -64, 64, 64, 64, 64, 64, 64, 64, 64, 64, -64, -64, 64, 64, 64, 64, 64, -64, 64, -64, 64, 64, 64, -64, -64, -64, 64, 64, 64, 64, -64, 64, -64, 64, 64, 64, -64, 64, 64, 64, 64, -64, -64, 64, 64, -64, -64, 64, 64, 64, -64, 64, -64, -64, -64, -64, 64, -64, -64, 64, -64, 64, 64, -64, 64, -64, -64, 64, -64, 64, 64, -64, -64, 64, -64, -64, 64, -64, 64, 64, -64, 64, 64, 64, 64, -64, 64, -64, 64, -64, 64, 64, -64, 64, 64, -64, 64, 64, 64, 64, -64, 64, 64, -64, 64, 64, -64, -64, -64, -64, -64, 64, 64, 64, 64, 64, 64, -64, 64, 64, 64, 64, 64, 64, 64, -64, -64, -64, 64, -64, -64, 64, -64, 64, -64, 64, 64, -64, -64, 64, -64, 64, -64, -64, -64, -64, -64, -64, 64, 64, 64, -64, -64, 64, 64, 64, 64, -64, -64, -64, -64, 64, 64, 64, 64, -64, -64, -64, -64, -64, -64, 64, -64, 64, 64, -64, -64, -64, 64, 64, -64, 64, 64, 64, 64, 64, 64, -64, -64, 64, -64, -64, 64, 64, -64, 64, 64, -64, -64, 64, -64, 64, -64, 64, 64, -64, 64, 64, -64, -64, 64, 64, -64, 64, 64, 64, -64, 64, -64, 64, -64, 64, -64, -64, 64, 64, 64, 64, 64, 64, -64, 64, -64, -64, -64, 64, 64, -64, -64, 64, -64, -64, 64, -64, 64, -64, 64, -64, -64, 64, -64, 64, -64, -64, -64, 64, -64, -64, -64, -64, 64, -64, -64, -64, 64, 64, -64, -64, 64, 64, -64, -64, -64, 64, -64, -64, 64, 64, -64, -64, 64, -64, -64, -64, -64, 64, 64, 64, 64, 64, -64, 64, -64, -64, 64, 64, -64, 64, -64, -64, -64, -64, -64, 64, -64, -64, 64, -64, 64, -64, -64, 64, 64, 64, -64, -64, -64, 64, 64, 64, -64, -64, 64, -64, 64, -64, -64, 64, -64, -64, -64, 64, -64, -64, -64, 64, -64, 64, -64, 64, -64, 64, 64, 64, -64, 64, -64, 64, -64, 64, -64, 64, 64, -64, 64, -64, 64, 64, -64, -64, 64, 64, -64, 64, -64, -64, 64, -64, 64, 64, -64, -64, -64, 64, -64, 64, 64, 64, -64, 64, 64, 64, -64, 64, 64, -64, 64, 64, 64, -64, 64, 64, -64, 64, 64, 64, -64, -64, 64, 64, 64, 64, -64, 64, -64, -64, 64, -64, 64, -64, -64, 64, -64, -64, -64, -64, 64, -64, 64, 64, 64, 64, 64, 64, 64, -64, -64, 64, 64, 64, -64, -64, 64, 64, 64, 64, -64, 64, 64, -64, 64, 64, -64, -64, -64, -64, -64, -64, -64, -64, 64, 64, -64, -64, -64, -64, 64, -64, -64, -64, 64, -64, 64, -64, -64, 64, 64, -64, -64, -64, -64, -64, -64, -64, -64, 64, -64, 64, 64, -64, 64, -64, -64, 64, 64, -64, 64, -64, 64, -64, 64, -64, -64, 64, -64, -64, 64, -64, -64, -64, 64, 64, -64, 64, -64, 64, 64, -64, -64, 64, -64, -64, -64, -64, 64, 64, 64, -64, -64, -64, -64, 64, 64, 64, -64, -64, -64, -64, -64, -64, -64, -64, 64, -64, 64, 64, 64, 64, 64, 64, 64, -64, 64, 64, -64, 64, 64, 64, -64, 64, -64, 64, 64, -64, -64, 64, 64, 64, -64, -64, -64, 64, -64, 64, -64, 64, -64, -64, -64, -64, 64, 64, 64, 64, -64, 64, -64, 64, -64, 64, -64, -64, -64, 64, -64, -64, 64, 64, -64, -64, 64, -64, -64, -64, -64, -64, 64, -64, 64, -64, 64, -64, -64, -64, -64, -64, 64, -64, -64, -64, 64, 64, -64, -64, 64, 64, -64, 64, 64, -64, -64, -64, 64, 64, 64, -64, 64, 64, 64, -64, -64, 64, -64, -64, 64, -64, -64, 64, -64, 64, 64, -64, 64, 64, 64, -64, 64, -64, -64, 64, 64, -64, -64, 64, -64, -64, -64, 64, 64, -64, -64, -64, 64, 64, 64, -64, -64, -64, -64, -64, 64, -64, 64, 64, -64, 64, -64, -64, 64, 64, 64, 64, 64, -64, -64, 64, -64, -64, -64, 64, 64, 64, -64, 64, 64, 64, 64, 64, -64, -64, 64, -64, 64, -64, -64, 64, 64, 64, -64, 64, -64, 64, -64, -64, 64, 64, 64, -64, 64, 64, -64, 64, -64, -64, -64, 64, -64, 64, -64, -64, 64, 64, -64, 64, 64, 64, -64, 64, -64, 64, -64, 64, -64, 64, -64, -64, -64, 64, 64, -64, -64, 64, -64, 64, -64, -64, -64, 64, -64, -64, 64, 64, 64, -64, 64, -64, -64, 64, 64, 64, 64, 64, 64, 64, -64, -64, -64, 64, 64, 64, 64, -64, 64, 64, -64, -64, 64, -64, -64, 64, 64, -64, -64, -64, 64, 64, -64, 64, -64, 64, 64, 64, -64, -64, -64, 64, -64, 64, 64, 64, 64, 64, -64, 64, -64, -64, 64, -64, -64, 64, -64, -64, 64, -64, 64, -64, -64, -64, -64, -64, 64, -64, 64, 64, -64, 64, -64, -64, -64, -64, 64, 64, -64, -64, -64, -64, -64, 64, -64, -64, 64, -64, 64, -64, -64, -64, 64, 64, -64, -64, 64, 64, 64, -64, 64, -64, -64, 64, -64, -64, -64, 64, 64, 64, 64, 64, 64, -64, 64, -64, 64, 64, -64, 64, 64, -64, 64, -64, -64, 64, -64, 64, -64, -64, 64, 64, -64, 64, 64, -64, -64, 64, 64, 64, 64, -64, -64, -64, -64, -64, 64, -64, -64, 64, 64, -64, 64, 64, -64, 64, 64, 64, 64, -64, 64, -64, 64, 64, 64, -64, -64, -64, 64, -64, 64, 64, 64, -64, -64, 64, -64, -64, -64, 64, 64, -64, 64, 64, 64, 64, 64, -64, 64, 64, -64, -64, -64, 64, 64, 64, 64, 64, 64, 64, 64, -64, 64, -64, -64, 64, -64, -64, 64, 64, 64, 64, 64, 64, 64, 64, -64, 64, -64, 64, -64, -64, 64, -64, 64, 64, -64, -64, 64, 64, 64, -64, -64, -64, 64, 64, 64, -64, 64, 64, 64, -64, 64, 64, 64, -64, 64, 64, 64, 64, -64, -64, -64, -64, -64, 64, 64, -64, 64, -64, -64, -64, 64, 64, 64, 64, -64, -64, -64, -64, 64, 64, 64, 64, 64, 64, -64, -64, 64, -64, 64, 64, -64, 64, -64, 64, 64, 64, -64, 64, -64, -64, 64, 64, 64, 64, 64, 64, 64, -64, -64, 64, 64, -64, -64, -64, -64, -64, -64, -64, 64, -64, 64, -64, 64, -64, -64, -64, 64, 64, 64, -64, -64, 64, -64, -64, -64, 64, 64, -64, 64, 64, 64, -64, -64, 64, -64, 64, -64, 64, 64, -64, -64, -64, 64, 64, 64, -64, -64, 64, -64, -64, -64, 64, -64, 64, -64, -64, 64, -64, -64, -64, -64, 64, 64, -64, -64, 64, -64, -64, 64, 64, -64, 64, -64, -64, 64, 64, 64, 64, 64, -64, 64, -64, -64, -64, 64, -64, 64, -64, 64, -64, 64, -64, -64, 64, 64, -64, 64, 64, -64, -64, 64, 64, 64, 64, -64, 64, -64, -64, 64, 64, 64, -64, 64, 64, -64, 64, -64, -64, -64, 64, 64, 64, -64, 64, -64, 64, -64, -64, -64, 64, 64, 64, 64, -64, 64, 64, 64, -64, -64, 64, 64, -64, 64, 64, 64, -64, -64, -64, 64, 64, -64, -64, -64, 64, 64, 64, -64, 64, -64, 64, 64, -64, -64, -64, -64, -64, 64, 64, -64, 64, 64, -64, 64, -64, 64, 64, 64, -64, -64, -64, 64, 64, -64, -64, 64, -64, -64, -64, 64, -64, -64, 64, -64, 64, -64, 64, -64, -64, -64, -64, -64, 64, -64, 64, 64, -64, 64, -64, 64, -64, -64, 64, -64, 64, -64, 64, -64, 64, 64, -64, -64, 64, 64, -64, -64, 64, 64, -64, 64, 64, 64, 64, 64, -64, 64, 64, -64, -64, -64, -64, 64, -64, 64, -64, -64, 64, -64, 64, -64, 64, -64, -64, -64, 64, -64, -64, 64, 64, 64, -64, 64, -64, -64, -64, 64, -64, -64, -64, -64, 64, -64, 64, 64, 64, 64, 64, 64, -64, 64, 64, -64, 64, -64, 64, 64, 64, -64, 64, -64, -64, 64, 64, -64, -64, -64, -64, 64, 64, -64, -64, -64, -64, -64, 64, -64, 64, -64, 64, 64, -64, 64, -64, 64, 64, 64, -64, -64, -64, 64, -64, -64, -64, -64, -64, -64, 64, 64, 64, -64, 64, 64, 64, -64, -64, 64, -64, 64, -64, 64, -64, -64, 64, -64, -64, 64, 64, -64, -64, -64, -64, 64, 64, 64, 64, -64, -64, -64, 64, -64, -64, 64, -64, -64, -64, 64, -64, 64, 64, -64, -64, -64, 64, -64, -64, 64, -64, 64, -64, 64, 64, -64, 64, 64, -64, -64, 64, 64, 64, 64, -64, 64, 64, 64, 64, -64, 64, 64, 64, 64, -64, 64, 64, -64, -64, -64, 64, 64, -64, 64, 64, -64, -64, -64, -64, -64, -64, 64, -64, -64, -64, -64, -64, -64, 64, 64, -64, -64, 64, -64, 64, -64, -64, 64, 64, 64, 64, 64, 64, 64, 64, -64, -64, 64, 64, 64, -64, -64, -64, 64, 64, -64, -64, -64, 64, 64, 64, 64, -64, 64, 64, 64, -64, 64, -64, 64, -64, 64, -64, 64, -64, 64, -64, 64, -64, -64, 64, 64, 64, -64, -64, 64, 64, -64, 64, -64, -64, -64, 64, 64, -64, -64, -64, 64, 64, -64, -64, 64, -64, 64, 64, 64, -64, -64, 64, 64, 64, -64, -64, 64, 64, 64, -64, 64, -64, -64, -64, 64, -64, -64, -64, 64, -64, 64, 64, 64, -64, 64, -64, -64, -64, -64, -64, 64, -64, -64, 64, -64, 64, -64, 64, -64, 64, 64, -64, 64, -64, 64, 64, 64, 64, -64, 64, -64, -64, 64, 64, 64, -64, 64, -64, 64, 64, -64, 64, 64, -64, -64, -64, 64, 64, -64, 64, -64, 64, 64, 64, 64, -64, 64, -64, 64, 64, 64, -64, -64, 64, -64, -64, -64, 64, -64, -64, 64, 64, -64, 64, -64, -64, -64, 64, 64, -64, 64, 64, 64, -64, -64, -64, -64, 64, 64, -64, -64, -64, -64, -64, 64, 64, -64, 64, 64, 64, -64, -64, -64, -64, -64, -64, 64, -64, -64, 64, 64, 64, -64, 64, -64, -64, 64, 64, 64, -64, -64, 64, -64, -64, -64, 64, -64, -64, 64, -64, 64, 64, 64, 64, -64, -64, 64, -64, -64, -64, 64, 64, 64, 64, -64, 64, -64, 64, -64, -64, 64, 64, -64, 64, 64, -64, 64, -64, 64, -64, -64, 64, 64, -64, 64, 64, -64, 64, 64, -64, 64, -64, 64, 64, -64, 64, -64, 64, -64, 64, 64, 64, 64, -64, -64, -64, 64, -64, -64, 64, 64, 64, -64, 64, 64, -64, -64, 64, -64, -64, -64, 64, 64, -64, 64, -64, 64, 64, -64, -64, 64, 64, 64, 64, 64, -64, -64, -64, -64, 64, 64, 64, 64, 64, -64, -64, -64, -64, 64, 64, 64, 64, 64, 64, 64, 64, -64, 64, 64, 64, -64, 64, 64, 64, 64, -64, 64, 64, 64, 64, -64, -64, 64, 64, -64, -64, 64, -64, -64, 64, 64, -64, 64, -64, -64, -64, -64, 64, 64, 64, 64, -64, 64, 64, 64, -64, 64, -64, -64, 64, 64, -64, 64, 64, -64, -64, -64, -64, -64, -64, -64, -64, -64, 64, -64, -64, 64, 64, 64, 64, 64, 64, 64, -64, -64, -64, 64, -64, -64, 64, -64, 64, -64, 64, 64, -64, -64, 64, -64, -64, -64, -64, 64, -64, -64, 64, -64, 64, 64, -64, 64, 64, -64, 64, 64, 64, 64, 64, 64, -64, 64, 64, -64, -64, -64, 64, 64, 64, 64, -64, 64, -64, 64, -64, 64, -64, 64, -64, -64, -64, -64, 64, -64, 64, -64, -64, -64, 64, -64, -64, -64, -64, -64, -64, 64, 64, 64, -64, -64, -64, -64, 64, -64, 64, -64, 64, -64, -64, 64, -64, 64, 64, -64, 64, -64, 64, 64, 64, 64, 64, 64, 64, -64, 64, 64, 64, -64, -64, 64, -64, -64, 64, -64, -64, -64, -64, 64, -64, -64, 64, 64, -64, -64, 64, 64, -64, -64, 64, 64, 64, 64, 64, 64, 64, 64, -64, -64, 64, -64, -64, -64, -64, 64, 64, 64, 64, -64, 64, 64, -64, 64, -64, -64, -64, 64, 64, 64, 64, -64, -64, 64, 64, 64, 64, -64, -64, 64, -64, 64, -64, 64, -64, -64, -64, 64, 64, 64, 64, -64, -64, 64, 64, -64, -64, -64, 64, 64, -64, -64, 64, -64, 64, -64, 64, 64, 64, -64, -64, 64, -64, -64, 64, 64, 64, -64, -64, 64, 64, -64, -64, 64, 64, 64, -64, 64, 64, -64, 64, -64, -64, -64, -64, 64, -64, 64, 64, 64, 64, 64, 64, 64, 64, 64, -64, -64, -64, -64, 64, 64, -64, -64, -64, 64, 64, 64, 64, 64, 64, -64, 64, 64, 64, -64, 64, -64, 64, 64, -64, 64, -64, 64, 64, 64, -64, -64, -64, -64, 64, -64, 64, 64, 64, -64, 64, -64, -64, -64, -64, 64, 64, -64, -64, -64, 64, -64, -64, -64, -64, -64, 64, -64, 64, -64, 64, 64, -64, -64, 64, 64, 64, 64, 64, 64, 64, -64, 64, -64, 64, 64, 64, -64, 64, 64, -64, 64, 64, -64, 64, 64, 64, 64, 64, -64, 64, 64, 64, -64, 64, 64, 64, -64, 64, 64, -64, 64, -64, 64, 64, 64, 64, 64, 64, 64, -64, -64, -64, -64, 64, -64, 64, -64, 64, -64, 64, 64, 64, -64, 64, -64, 64, -64, 64, -64, -64, 64, -64, 64, 64, 64, -64, 64, -64, -64, -64, -64, 64, 64, 64, -64, 64, 64, -64, -64, -64, 64, 64, -64, -64, 64, -64, 64, 64, 64, 64, 64, -64, 64, 64, 64, 64, 64, 64, 64, -64, 64, 64, 64, -64, 64, -64, -64, 64, -64, 64, -64, 64, 64, -64, 64, 64, 64, -64, 64, -64, -64, -64, 64, -64, -64, 64, -64, 64, 64, -64, 64, 64, 64, -64, 64, -64, -64, -64, -64, -64, 64, 64, 64, -64, -64, 64, -64, -64, 64, 64, 64, -64, -64, 64, -64, 64, 64, 64, -64, 64, 64, -64, -64, -64, -64, -64, 64, -64, -64, 64, 64, -64, 64, 64, 64, 64, 64, 64, 64, -64, 64, -64, -64, 64, -64, 64, 64, 64, -64, 64, -64, 64, 64, 64, -64, -64, 64, -64, 64, -64, -64, -64, 64, -64, 64, 64, -64, -64, -64, -64, 64, 64, -64, -64, 64, -64, 64, 64, -64, -64, -64, -64, 64, -64, 64, -64, -64, -64, 64, 64, 64, -64, 64, 64, -64, -64, -64, -64, 64, -64, 64, -64, 64, -64, -64, 64, -64, 64, -64, 64, -64, -64, -64, -64, 64, -64, -64, -64, 64, 64, -64, 64, 64, -64, -64, 64, 64, 64, 64, -64, -64, 64, 64, 64, -64, 64, -64, -64, 64, 64, 64, -64, -64, -64, -64, 64, -64, -64, 64, 64, 64, 64, 64, 64, -64, -64, 64, 64, -64, -64, 64, -64, -64, -64, -64, 64, -64, 64, -64, 64, 64, -64, 64, -64, 64, -64, 64, -64, 64, 64, 64, 64, 64, -64, 64, -64, 64, -64, 64, -64, 64, -64, -64, 64, 64, 64, 64, 64, -64, 64, 64, -64, -64, -64, 64, 64, 64, -64, 64, 64, -64, -64, -64, 64, 64, 64, 64, 64, -64, 64, -64, -64, -64, 64, 64, -64, -64, -64, -64, -64, 64, -64, 64, -64, -64, -64, -64, 64, -64, -64, 64, -64, -64, -64, -64, -64, -64, 64, 64, 64, 64, 64, 64, 64, 64, 64, 64, 64, 64, 64, -64, -64, -64, -64, -64, 64, 64, 64, 64, 64, -64, -64, -64, 64, -64, -64, 64, 64, -64, -64, 64, 64, -64, -64, -64, -64, -64, 64, 64, 64, 64, -64, -64, -64, -64, 64, 64, 64, 64, 64, -64, -64, 64, 64, -64, -64, 64, -64, 64, 64, -64, 64, -64, -64, -64, 64, 64, -64, -64, 64, -64, 64, 64, -64, 64, 64, -64, -64, -64, 64, 64, -64, 64, -64, 64, 64, -64, -64, -64, 64, 64, 64, -64, 64, 64, 64, -64, 64, -64, -64, -64, -64, -64, 64, 64, 64, 64, -64, 64, 64, -64, -64, -64, -64, 64, -64, -64, 64, -64, -64, -64, 64, 64, 64, -64, 64, -64, 64, 64, -64, 64, 64, -64, 64, 64, -64, 64, -64, -64, -64, 64, -64, 64, -64, 64, -64, -64, 64, 64, -64, 64, 64, 64, -64, 64, 64, 64, 64, -64, 64, -64, -64, 64, 64, -64, -64, -64, -64, -64, -64, -64, -64, -64, -64, -64, 64, -64, -64, 64, 64, -64, 64, -64, -64, -64, -64, 64, -64, -64, 64, 64, 64, -64, 64, 64, -64, -64, 64, 64, 64, 64, 64, 64, 64, -64, -64, -64, -64, 64, -64, -64, -64, 64, 64, 64, -64, -64, 64, -64, 64, -64, 64, -64, -64, 64, -64, -64, 64, -64, 64, 64, 64, -64, 64, 64, -64, -64, 64, 64, 64, -64, -64, 64, 64, 64, -64, 64, 64, 64, -64, 64, 64, 64, 64, 64, 64, -64, -64, 64, -64, 64, -64, 64, -64, 64, -64, -64, 64, -64, 64, -64, 64, 64, -64, 64, -64, -64, 64, -64, -64, 64, -64, 64, -64, 64, -64, 64, -64, -64, -64, 64, 64, -64, -64, 64, 64, -64, 64, -64, -64, 64, 64, 64, -64, 64, 64, -64, -64, -64, -64, -64, 64, -64, 64, -64, 64, -64, 64, -64, -64, -64, -64, 64, 64, -64, 64, 64, -64, 64, 64, -64, -64, 64, -64, 64, -64, 64, -64, -64, -64, 64, 64, -64, -64, 64, -64, 64, -64, -64, -64, -64, 64, 64, 64, -64, 64, 64, -64, -64, 64, -64, 64, 64, -64, 64, 64, -64, 64, 64, 64, 64, 64, -64, -64, -64, 64, -64, -64, 64, 64, 64, 64, 64, -64, 64, -64, -64, 64, -64, -64, 64, -64, 64, -64, 64, -64, 64, -64, 64, 64, 64, 64, 64, -64, 64, 64, -64, 64, 64, -64, -64, 64, -64, -64, -64, 64, -64, 64, 64, 64, -64, -64, -64, -64, -64, 64, 64, -64, -64, 64, -64, 64, 64, -64, 64, 64, 64, -64, 64, -64, 64, 64, -64, 64, 64, -64, -64, 64, 64, -64, -64, 64, 64, 64, 64, 64, -64, -64, 64, -64, 64, 64, -64, 64, -64, 64, -64, -64, 64, -64, -64, 64, 64, -64, 64, 64, 64, -64, -64, 64, -64, 64, -64, 64, 64, 64, -64, -64, 64, -64, -64, 64, 64, -64, -64, 64, 64, -64, 64, 64, -64, 64, -64, -64, -64, -64, -64, -64, -64, -64, -64, -64, 64, 64, -64, -64, -64, 64, -64, 64, 64, -64, -64, -64, -64, -64, 64, 64, 64, -64, -64, -64, -64, 64, 64, 64, -64, 64, 64, -64, 64, -64, 64, 64, 64, -64, -64, -64, -64, 64, -64, 64, 64, 64, -64, 64, -64, 64, -64, -64, 64, -64, 64, 64, -64, -64, 64, -64, 64, 64, 64, 64, -64, 64, 64, 64, 64, -64, -64, 64, 64, 64, -64, 64, 64, -64, -64, -64, 64, -64, 64, -64, -64, -64, -64, -64, 64, -64, -64, 64, -64, 64, -64, -64, 64, 64, -64, -64, 64, -64, 64, -64, -64, 64, 64, -64, -64, -64, -64, 64, -64, -64, -64, 64, 64, -64, 64, -64, 64, -64, 64, -64, -64, -64, 64, -64, 64, 64, -64, 64, 64, -64, -64, -64, 64, -64, -64, 64, -64, -64, 64, 64, 64, -64, 64, -64, -64, 64, -64, -64, 64, 64, 64, 64, 64, 64, -64, 64, 64, 64, 64, 64, -64, -64, -64, 64, 64, -64, 64, -64, 64, 64, 64, -64, -64, -64, 64, 64, -64, -64, -64, -64, 64, 64, 64, 64, 64, 64, -64, 64, -64, -64, 64, 64, 64, 64, -64, -64, -64, -64, 64, 64, 64, 64, 64, 64, 64, -64, -64, -64, 64, 64, -64, -64, -64, 64, -64, -64, -64, -64, 64, -64, 64, -64, 64, 64, 64, -64, -64, -64, 64, -64, -64, -64, 64, -64, -64, 64, 64, 64, 64, 64, 64, 64, 64, -64, 64, -64, -64, -64, -64, -64, -64, -64, -64, -64, -64, 64, 64, -64, -64, -64, 64, 64, 64, 64, -64, 64, 64, 64, -64, 64, -64, 64, -64, 64, 64, 64, -64, -64, -64, 64, 64, -64, -64, -64, -64, -64, -64, 64, -64, 64, 64, 64, -64, -64, -64, 64, -64, -64, 64, 64, -64, -64, -64, -64, 64, -64, -64, 64, 64, -64, -64, 64, -64, 64, 64, -64, -64, 64, 64, -64, 64, -64, -64, -64, -64, 64, -64, -64, 64, 64, 64, 64, 64, 64, -64, 64, 64, -64, 64, 64, 64, 64, 64, -64, 64, -64, 64, -64, -64, -64, -64, 64, -64, 64, -64, 64, -64, 64, -64, -64, 64, 64, 64, 64, -64, -64, -64, 64, -64, 64, 64, -64, 64, -64, 64, -64, 64, 64, 64, -64, -64, 64, -64, 64, 64, -64, -64, 64, 64, -64, 64, -64, -64, -64, 64, -64, -64, 64, -64, -64, 64, -64, 64, -64, -64, 64, 64, 64, -64, -64, 64, 64, 64, 64, 64, -64, 64, -64, -64, 64, 64, -64, -64, 64, -64, 64, 64, -64, 64, -64, -64, -64, 64, -64, -64, -64, 64, -64, 64, 64, 64, -64, 64, -64, -64, 64, 64, -64, 64, 64, 64, -64, 64, 64, 64, 64, 64, 64, -64, 64, 64, 64, -64, -64, -64, 64, 64, -64, -64, -64, 64, -64, 64, 64, -64, 64, 64, -64, -64, 64, -64, -64, -64, -64, 64, 64, -64, -64, -64, 64, -64, 64, -64, -64, 64, 64, -64, 64, -64, 64, -64, 64, -64, -64, 64, 64, -64, -64, -64, 64, 64, -64, -64, 64, 64, 64, 64, 64, 64, 64, 64, -64, 64, -64, -64, -64, 64, -64, -64, -64, -64, 64, -64, -64, 64, -64, -64, -64, 64, -64, -64, 64, 64, -64, 64, -64, -64, -64, 64, 64, 64, -64, -64, -64, -64, -64, -64, 64, 64, 64, 64, 64, -64, -64, -64, -64, -64, -64, -64, -64, -64, 64, -64, 64, -64, 64, -64, -64, -64, 64, -64, -64, 64, 64, 64, 64, -64, -64, 64, -64, 64, 64, 64, -64, 64, -64, -64, 64, 64, -64, 64, -64, 64, 64, 64, 64, -64, 64, 64, 64, 64, -64, 64, 64, 64, 64, 64, 64, 64, -64, -64, -64, 64, -64, 64, 64, 64, -64, 64, 64, -64, 64, -64, -64, -64, -64, 64, 64, -64, 64, 64, 64, 64, -64, -64, 64, -64, -64, -64, -64, -64, 64, 64, -64, -64, 64, 64, -64, 64, -64, -64, 64, -64, 64, -64, -64, 64, -64, 64, -64, -64, 64, -64, 64, 64, -64, 64, 64, -64, -64, -64, -64, -64, -64, -64, 64, -64, -64, -64, 64, 64, -64, 64, -64, -64, -64, -64, 64, 64, 64, -64, 64, -64, -64, 64, 64, 64, -64, 64, -64, -64, -64, 64, 64, 64, -64, -64, -64, -64, 64, 64, 64, -64, 64, 64, -64, -64, 64, -64, -64, 64, 64, 64, -64, -64, 64, -64, 64, 64, -64, 64, -64, 64, -64, -64, -64, -64, -64, -64, 64, 64, 64, 64, 64, 64, 64, 64, -64, -64, 64, -64, 64, -64, -64, -64, -64, 
};

fixed_point_t fc2_bias_fp[10]=
{
0, 0, 0, 0, 0, 1, 0, 0, -1, 0, 
};


fixed_point_t img_fp[IN_DIM];
fixed_point_t hl1_fp[HL1_DIM];
fixed_point_t out_fp[OUT_DIM];


int run_fbnn(unsigned long long *rt)
{


	for (int i =0; i < HL1_DIM; i++)
	{
		hl1_fp[i] = 0;
	}
	for (int i =0; i < OUT_DIM; i++)
	{
		out_fp[i] = 0;
	}
	
	unsigned long long t0, t1;
	t0 = get_cycles();


	TEMPLATE(dense, fixed_point_t)(img_fp, IN_DIM,
				       fc1_weight_fp, HL1_DIM, hl1_fp,
				       fc1_bias_fp, 1);
	
	TEMPLATE(dense, fixed_point_t)(hl1_fp, HL1_DIM,
				       fc2_weight_fp, OUT_DIM, out_fp,
				       fc2_bias_fp, 0);

	t1 = get_cycles();
	*rt=t1-t0;

	fixed_point_t max;
	fixed_point_t label;
	TEMPLATE(argmax, fixed_point_t)(out_fp, OUT_DIM, &max, &label);

	return label;

}



void run(int tests, double *acc, unsigned long long *avg_cycles)
{
	int label;
	double correct_guesses = 0;
	unsigned long long avg_rt = 0;
	unsigned long long rt;
	
	for (int i = 0; i < tests ; i++)
	{
		reset_PRNG();
		for (int j = 0; j < 28*28; j++)
		{
			img_fp[j]=float_to_fixed(test_image[i][j]);
		}
		rt = 0;
		label = run_fbnn(&rt);
		avg_rt += rt;
		if (label == test_label[i])
			correct_guesses++;
		
	}

	*avg_cycles = avg_rt/tests;
	*acc = (correct_guesses/tests)*100;
	return;
}

int main(int argc, char *argv[])
{
  	load_mnist();
	unsigned long long avg_rt;
	double acc;
	
	printf("nn:%s\t", argv[0]+3);
	run(NUM_TEST, &acc, &avg_rt);

	printf("type:UNSHARED\t");
	printf("accuracy:%.3f\t", acc);
	printf("avgcycles:%llu\t", avg_rt);
	
#ifdef PCNT
	reset_primop_cnt();
	run(1, &acc, &avg_rt);
	print_primop_cnt();
#endif
	
	printf("\n");

}
