#include "mnist.h"
#include "core/nn.h"

#define IN_DIM 784
#define HL1_DIM 512
#define OUT_DIM 10

#define RANDS_REUSE 13

ring_t fc1_weight_fp[784*512]=
{
64, -64, 64, 64, 64, 64, 64, 64, 64, -64, -64, -64, 64, 64, -64, -64, 64, 64, 64, 64, 64, 64, 64, -64, 64, 64, 64, 64, 64, 64, -64, -64, -64, -64, 64, -64, 64, -64, 64, -64, 64, 64, 64, 64, 64, 64, 64, 64, 64, -64, 64, -64, -64, -64, -64, -64, 64, 64, -64, 64, 64, -64, 64, 64, 64, 64, -64, 64, -64, -64, -64, -64, -64, -64, -64, 64, -64, -64, -64, -64, 64, -64, 64, 64, -64, -64, -64, 64, 64, -64, -64, -64, 64, -64, -64, -64, -64, 64, -64, -64, -64, -64, -64, -64, -64, -64, -64, -64, 64, -64, 64, 64, -64, 64, 64, 64, 64, 64, -64, -64, -64, -64, -64, -64, -64, -64, -64, -64, -64, -64, -64, -64, -64, -64, -64, 64, -64, 64, 64, -64, 64, 64, 64, -64, 64, -64, -64, 64, 64, -64, -64, -64, -64, -64, -64, -64, -64, -64, 64, -64, 64, 64, -64, -64, -64, -64, 64, 64, -64, -64, 64, -64, -64, 64, 64, 64, 64, 64, 64, 64, 64, -64, 64, 64, -64, 64, 64, 64, 64, 64, -64, -64, -64, 64, -64, -64, -64, 64, -64, 64, 64, 64, 64, 64, 64, 64, 64, 64, 64, 64, -64, 64, 64, 64, 64, 64, 64, 64, 64, 64, -64, 64, 64, 64, 64, 64, 64, 64, 64, 64, 64, 64, 64, 64, 64, -64, -64, 64, 64, 64, 64, 64, 64, 64, 64, 64, -64, 64, 64, 64, -64, 64, 64, 64, 64, 64, 64, 64, 64, 64, 64, 64, 64, 64, 64, 64, 64, 64, 64, 64, 64, 64, -64, 64, 64, 64, -64, 64, -64, -64, 64, -64, 64, -64, 64, 64, -64, 64, -64, -64, 64, 64, 64, 64, -64, -64, 64, 64, 64, -64, -64, 64, -64, 64, -64, -64, 64, -64, 64, -64, -64, 64, 64, 64, -64, -64, -64, -64, -64, -64, -64, -64, -64, -64, -64, 64, -64, 64, 64, -64, -64, -64, -64, -64, -64, -64, 64, 64, -64, -64, 64, -64, -64, -64, -64, -64, -64, -64, -64, -64, -64, -64, 64, -64, -64, -64, 64, -64, -64, -64, -64, 64, 64, -64, 64, -64, 64, -64, -64, -64, -64, -64, -64, -64, -64, -64, -64, -64, -64, -64, -64, 64, 64, -64, -64, -64, -64, 64, 64, 64, -64, -64, -64, 64, -64, -64, -64, -64, -64, -64, -64, -64, -64, -64, -64, -64, 64, -64, -64, -64, 64, -64, -64, -64, 64, 64, -64, 64, 64, -64, -64, -64, -64, -64, -64, -64, -64, -64, -64, -64, -64, -64, -64, 64, 64, -64, -64, -64, -64, -64, -64, -64, -64, -64, 64, -64, -64, -64, -64, -64, 64, -64, -64, -64, -64, -64, -64, 64, -64, -64, 64, -64, -64, -64, -64, -64, -64, 64, -64, -64, -64, -64, 64, 64, -64, -64, 64, -64, -64, -64, -64, -64, -64, -64, -64, -64, -64, -64, -64, 64, -64, -64, -64, -64, -64, -64, -64, 64, 64, 64, -64, 64, 64, -64, 64, -64, -64, -64, -64, -64, -64, -64, -64, 64, -64, 64, 64, -64, -64, -64, -64, -64, -64, 64, 64, 64, -64, 64, 64, 64, 64, 64, -64, 64, 64, -64, -64, -64, -64, -64, -64, -64, 64, 64, 64, -64, -64, -64, -64, -64, -64, -64, -64, 64, -64, 64, 64, 64, 64, -64, -64, 64, -64, -64, -64, -64, -64, -64, -64, -64, -64, 64, 64, -64, -64, -64, -64, -64, -64, -64, -64, 64, 64, 64, 64, 64, -64, -64, 64, -64, -64, -64, -64, 64, -64, -64, -64, -64, -64, -64, -64, -64, -64, -64, -64, -64, -64, -64, 64, 64, 64, 64, 64, 64, 64, 64, 64, 64, 64, -64, 64, 64, 64, 64, 64, -64, 64, 64, 64, -64, 64, 64, 64, -64, -64, -64, 64, 64, 64, 64, 64, -64, -64, -64, -64, 64, -64, -64, 64, 64, 64, 64, 64, 64, 64, 64, 64, -64, -64, -64, 64, -64, -64, 64, 64, 64, 64, 64, -64, 64, -64, 64, 64, -64, 64, 64, 64, 64, 64, 64, 64, 64, 64, 64, 64, 64, 64, 64, 64, 64, 64, 64, 64, 64, 64, 64, 64, -64, -64, -64, -64, -64, 64, 64, -64, -64, -64, -64, 64, 64, 64, 64, -64, -64, -64, 64, 64, -64, -64, 64, 64, 64, 64, 64, -64, 64, 64, -64, -64, -64, 64, 64, 64, -64, 64, -64, -64, 64, 64, 64, 64, 64, 64, -64, 64, 64, -64, 64, 64, 64, 64, 64, -64, 64, -64, 64, -64, -64, -64, -64, 64, 64, -64, -64, 64, 64, 64, 64, 64, -64, -64, -64, -64, -64, 64, -64, -64, 64, 64, -64, 64, 64, -64, 64, -64, -64, -64, -64, -64, 64, -64, 64, -64, 64, -64, -64, -64, 64, 64, -64, 64, 64, 64, -64, 64, -64, 64, 64, 64, -64, 64, 64, -64, -64, -64, -64, 64, 64, 64, 64, -64, 64, -64, 64, -64, -64, -64, 64, -64, -64, 64, 64, -64, 64, -64, -64, -64, 64, -64, 64, -64, 64, -64, -64, 64, -64, -64, -64, 64, -64, 64, -64, -64, -64, -64, -64, -64, -64, -64, -64, 64, -64, -64, -64, 64, 64, 64, -64, -64, 64, 64, 64, -64, -64, -64, 64, 64, -64, -64, -64, -64, -64, 64, 64, -64, -64, -64, -64, 64, -64, -64, 64, -64, 64, 64, -64, -64, 64, -64, 64, -64, -64, 64, -64, -64, -64, 64, 64, 64, 64, 64, -64, -64, -64, -64, 64, -64, 64, -64, -64, -64, 64, -64, -64, -64, -64, 64, 64, 64, -64, 64, 64, 64, 64, 64, -64, 64, -64, -64, 64, -64, -64, 64, 64, -64, 64, 64, 64, 64, 64, -64, -64, 64, -64, 64, 64, -64, 64, -64, -64, -64, -64, -64, -64, -64, -64, 64, -64, -64, 64, 64, -64, 64, 64, -64, -64, 64, 64, -64, -64, -64, -64, 64, -64, -64, -64, -64, -64, -64, -64, -64, -64, -64, 64, 64, -64, -64, -64, 64, -64, -64, 64, -64, -64, 64, 64, 64, 64, -64, -64, 64, -64, -64, -64, -64, -64, 64, -64, -64, 64, -64, -64, -64, 64, -64, -64, -64, 64, -64, -64, -64, -64, 64, -64, 64, -64, 64, -64, -64, -64, -64, -64, -64, -64, 64, -64, 64, 64, 64, -64, -64, -64, -64, -64, -64, -64, -64, -64, -64, 64, 64, 64, 64, -64, 64, -64, -64, -64, -64, -64, 64, 64, 64, 64, 64, 64, -64, -64, -64, -64, -64, -64, -64, -64, -64, -64, 64, -64, 64, 64, 64, -64, -64, 64, -64, -64, 64, 64, 64, 64, -64, 64, 64, -64, -64, -64, -64, -64, -64, 64, 64, -64, 64, 64, 64, -64, 64, 64, 64, 64, -64, 64, -64, -64, -64, 64, 64, 64, 64, -64, -64, -64, -64, 64, 64, -64, 64, -64, -64, 64, 64, 64, -64, -64, -64, 64, 64, -64, -64, -64, -64, 64, -64, 64, 64, 64, -64, -64, -64, -64, 64, 64, 64, 64, -64, -64, -64, -64, 64, -64, -64, -64, 64, 64, 64, -64, -64, -64, -64, 64, 64, 64, 64, 64, -64, -64, -64, 64, -64, 64, 64, -64, -64, -64, -64, -64, -64, -64, -64, -64, 64, -64, 64, 64, -64, 64, 64, 64, 64, -64, -64, -64, -64, -64, -64, -64, -64, 64, 64, -64, -64, -64, -64, -64, -64, -64, -64, -64, 64, 64, -64, -64, -64, 64, -64, 64, 64, -64, -64, -64, -64, -64, -64, -64, -64, 64, -64, 64, -64, -64, -64, -64, -64, -64, -64, -64, 64, -64, 64, -64, -64, 64, 64, 64, 64, -64, -64, 64, -64, -64, -64, -64, -64, 64, -64, -64, 64, -64, -64, -64, -64, -64, -64, 64, -64, -64, -64, 64, -64, 64, 64, 64, 64, 64, 64, -64, -64, -64, -64, -64, -64, -64, -64, -64, 64, -64, -64, -64, 64, 64, 64, 64, 64, -64, 64, -64, 64, 64, 64, -64, 64, 64, -64, -64, -64, -64, -64, -64, -64, -64, -64, 64, 64, -64, 64, -64, -64, 64, 64, 64, -64, 64, 64, 64, -64, 64, 64, 64, 64, 64, 64, -64, -64, 64, -64, -64, -64, -64, -64, -64, 64, 64, 64, 64, -64, -64, -64, 64, 64, 64, 64, -64, 64, 64, 64, 64, 64, 64, 64, -64, -64, -64, -64, -64, -64, -64, -64, 64, -64, 64, 64, 64, -64, -64, -64, 64, 64, 64, -64, -64, -64, -64, 64, 64, 64, -64, -64, -64, -64, -64, 64, -64, 64, -64, 64, -64, -64, -64, 64, 64, -64, 64, 64, 64, 64, 64, -64, 64, -64, 64, -64, 64, -64, -64, -64, -64, -64, 64, -64, -64, -64, -64, -64, -64, -64, 64, 64, -64, 64, 64, 64, 64, -64, -64, -64, -64, 64, 64, -64, -64, 64, -64, -64, -64, -64, 64, -64, -64, 64, 64, 64, 64, -64, 64, 64, 64, 64, 64, 64, 64, -64, -64, -64, 64, 64, -64, 64, -64, -64, -64, -64, 64, -64, -64, 64, -64, -64, -64, -64, -64, 64, 64, 64, 64, 64, -64, 64, 64, 64, -64, -64, 64, -64, -64, 64, -64, 64, -64, -64, 64, -64, -64, -64, 64, 64, -64, 64, 64, -64, -64, 64, -64, 64, 64, 64, -64, -64, -64, 64, -64, -64, 64, -64, 64, -64, 64, -64, 64, -64, -64, 64, 64, -64, -64, -64, 64, -64, -64, -64, 64, -64, -64, -64, -64, -64, -64, -64, -64, 64, 64, 64, 64, -64, 64, -64, 64, -64, 64, -64, 64, -64, -64, -64, 64, 64, 64, -64, 64, 64, -64, 64, -64, 64, -64, -64, -64, 64, 64, -64, -64, -64, 64, 64, -64, -64, 64, 64, -64, -64, 64, 64, -64, 64, 64, 64, -64, -64, -64, 64, -64, 64, -64, -64, -64, -64, 64, -64, 64, -64, -64, -64, -64, -64, -64, -64, -64, -64, -64, -64, -64, -64, -64, -64, -64, -64, -64, 64, 64, 64, -64, 64, 64, -64, -64, 64, -64, 64, 64, -64, -64, -64, -64, -64, -64, -64, -64, -64, 64, -64, -64, 64, 64, -64, -64, 64, -64, 64, 64, 64, -64, -64, 64, -64, -64, -64, 64, -64, -64, 64, 64, -64, -64, -64, -64, -64, -64, -64, 64, -64, 64, 64, 64, -64, -64, -64, -64, -64, -64, 64, 64, -64, -64, -64, -64, -64, -64, 64, -64, 64, 64, -64, -64, -64, -64, 64, 64, 64, 64, -64, -64, 64, -64, 64, 64, -64, 64, -64, -64, -64, -64, -64, -64, -64, 64, 64, 64, 64, 64, 64, 64, 64, -64, 64, 64, -64, 64, -64, 64, -64, 64, 64, -64, 64, 64, 64, 64, -64, -64, -64, -64, 64, -64, -64, 64, 64, 64, -64, 64, 64, 64, 64, 64, 64, -64, -64, -64, 64, -64, -64, -64, -64, 64, 64, 64, -64, -64, 64, -64, -64, 64, 64, -64, 64, -64, 64, 64, 64, 64, 64, 64, -64, -64, -64, 64, 64, -64, -64, -64, 64, 64, -64, 64, -64, 64, -64, -64, 64, 64, -64, -64, -64, 64, 64, 64, 64, -64, 64, 64, 64, -64, -64, -64, -64, -64, -64, -64, -64, -64, 64, 64, 64, 64, -64, -64, -64, -64, -64, -64, 64, -64, -64, 64, 64, -64, 64, 64, -64, -64, -64, -64, -64, -64, -64, -64, -64, 64, -64, 64, -64, -64, -64, -64, -64, 64, 64, -64, -64, 64, 64, -64, 64, 64, 64, 64, 64, -64, -64, -64, -64, -64, -64, -64, -64, 64, -64, 64, -64, 64, 64, -64, -64, 64, 64, -64, 64, 64, 64, -64, 64, 64, 64, -64, -64, -64, -64, -64, -64, -64, -64, 64, -64, 64, -64, 64, 64, -64, 64, -64, -64, 64, 64, 64, 64, 64, -64, -64, 64, 64, 64, 64, 64, -64, -64, -64, -64, -64, -64, 64, -64, -64, 64, -64, -64, 64, 64, -64, -64, 64, 64, 64, 64, 64, -64, -64, 64, 64, 64, 64, -64, 64, -64, 64, 64, -64, -64, -64, 64, -64, 64, 64, 64, 64, -64, -64, 64, -64, 64, -64, 64, -64, 64, -64, -64, 64, 64, 64, 64, 64, 64, 64, -64, -64, 64, -64, 64, -64, 64, -64, 64, -64, 64, 64, 64, -64, 64, 64, 64, -64, 64, 64, 64, 64, 64, 64, 64, 64, 64, -64, -64, -64, 64, -64, 64, -64, 64, -64, -64, -64, 64, -64, 64, -64, 64, -64, -64, -64, -64, -64, -64, 64, 64, 64, 64, 64, -64, -64, -64, -64, 64, 64, 64, 64, 64, -64, 64, 64, -64, -64, -64, 64, -64, -64, -64, -64, -64, -64, -64, 64, -64, 64, -64, -64, -64, -64, -64, -64, 64, -64, 64, -64, 64, -64, -64, -64, -64, -64, -64, -64, -64, -64, -64, -64, -64, -64, -64, -64, 64, 64, -64, -64, -64, -64, -64, -64, -64, -64, 64, 64, -64, 64, 64, -64, -64, -64, -64, -64, -64, -64, -64, -64, 64, -64, -64, -64, -64, 64, 64, -64, -64, -64, -64, 64, -64, -64, -64, 64, -64, -64, 64, 64, -64, -64, -64, -64, -64, -64, -64, -64, 64, -64, 64, -64, -64, 64, -64, -64, -64, -64, -64, 64, -64, -64, -64, 64, -64, -64, -64, 64, -64, -64, -64, -64, -64, -64, -64, 64, 64, 64, 64, 64, 64, 64, -64, -64, -64, 64, -64, -64, -64, -64, -64, 64, -64, 64, 64, 64, -64, -64, -64, -64, -64, -64, -64, 64, -64, -64, 64, 64, -64, -64, -64, -64, 64, -64, -64, -64, -64, -64, 64, 64, -64, 64, -64, -64, -64, -64, 64, -64, -64, 64, -64, -64, -64, -64, 64, 64, 64, -64, 64, 64, 64, -64, -64, -64, 64, 64, -64, 64, 64, 64, -64, -64, 64, 64, 64, 64, 64, 64, 64, -64, -64, 64, 64, 64, 64, 64, 64, 64, 64, 64, -64, -64, 64, 64, -64, 64, -64, 64, 64, 64, -64, -64, -64, 64, 64, 64, 64, 64, 64, -64, 64, -64, -64, 64, 64, -64, -64, -64, -64, -64, -64, -64, 64, 64, -64, 64, 64, -64, -64, 64, 64, 64, 64, 64, 64, 64, -64, -64, 64, 64, -64, 64, 64, -64, 64, -64, -64, 64, 64, 64, 64, -64, 64, 64, 64, -64, -64, -64, -64, -64, -64, -64, -64, 64, 64, -64, -64, 64, -64, -64, 64, -64, 64, 64, -64, 64, -64, 64, 64, -64, 64, -64, 64, -64, 64, 64, -64, 64, -64, 64, -64, -64, 64, -64, -64, -64, -64, -64, 64, -64, -64, 64, 64, -64, -64, 64, -64, 64, -64, 64, -64, -64, -64, -64, 64, 64, -64, 64, -64, 64, 64, -64, 64, -64, 64, -64, 64, 64, 64, 64, -64, -64, -64, 64, 64, 64, 64, -64, -64, -64, 64, -64, 64, -64, -64, -64, 64, -64, 64, -64, -64, -64, -64, 64, 64, -64, -64, 64, 64, 64, -64, 64, 64, -64, -64, -64, 64, 64, 64, -64, -64, -64, -64, 64, -64, -64, 64, -64, 64, -64, 64, 64, 64, -64, 64, -64, -64, 64, 64, -64, -64, 64, 64, 64, -64, 64, 64, 64, -64, -64, 64, -64, -64, -64, -64, -64, -64, 64, -64, -64, 64, 64, -64, 64, -64, -64, -64, 64, -64, 64, -64, 64, -64, 64, 64, 64, -64, -64, 64, -64, 64, 64, 64, -64, -64, -64, -64, -64, 64, 64, -64, -64, -64, 64, 64, -64, -64, -64, -64, 64, -64, -64, 64, -64, -64, -64, 64, -64, 64, 64, -64, -64, -64, -64, 64, 64, -64, -64, -64, -64, -64, 64, 64, -64, 64, 64, -64, -64, 64, 64, -64, -64, -64, -64, -64, -64, 64, -64, -64, 64, 64, -64, -64, 64, -64, 64, -64, 64, 64, -64, -64, -64, 64, 64, -64, 64, -64, -64, 64, -64, 64, 64, 64, -64, -64, 64, -64, -64, 64, -64, -64, -64, -64, -64, -64, -64, 64, -64, 64, 64, 64, 64, -64, -64, 64, -64, -64, 64, 64, -64, -64, -64, -64, -64, -64, 64, -64, -64, 64, 64, -64, -64, -64, -64, 64, 64, -64, -64, 64, 64, 64, -64, -64, 64, -64, -64, -64, -64, -64, 64, -64, 64, -64, 64, -64, -64, -64, -64, 64, 64, -64, 64, -64, -64, -64, -64, 64, -64, 64, -64, -64, -64, 64, -64, 64, 64, 64, 64, 64, 64, -64, -64, -64, -64, -64, -64, 64, -64, -64, 64, -64, -64, -64, -64, 64, -64, 64, -64, 64, -64, 64, 64, 64, 64, 64, 64, -64, -64, -64, -64, 64, -64, 64, 64, -64, -64, -64, -64, 64, 64, 64, 64, -64, -64, -64, -64, 64, -64, -64, 64, -64, -64, -64, 64, 64, -64, -64, -64, -64, -64, 64, -64, -64, -64, -64, -64, -64, -64, 64, -64, 64, -64, -64, 64, -64, -64, -64, -64, -64, -64, -64, -64, 64, 64, -64, -64, -64, -64, -64, -64, -64, 64, 64, 64, -64, 64, -64, -64, -64, 64, 64, -64, -64, 64, 64, -64, -64, 64, -64, -64, 64, -64, -64, 64, -64, -64, -64, -64, -64, 64, -64, -64, -64, -64, -64, -64, 64, 64, 64, -64, 64, 64, -64, -64, 64, 64, -64, -64, -64, -64, 64, 64, 64, -64, 64, -64, 64, -64, 64, 64, 64, 64, -64, 64, 64, -64, 64, 64, -64, -64, -64, -64, -64, -64, -64, -64, 64, 64, -64, -64, -64, -64, 64, -64, -64, -64, -64, -64, -64, 64, -64, 64, 64, 64, -64, -64, 64, 64, -64, -64, 64, -64, -64, -64, -64, -64, -64, -64, -64, 64, -64, 64, 64, -64, 64, -64, 64, 64, -64, -64, 64, 64, -64, 64, -64, -64, -64, 64, 64, -64, -64, 64, -64, -64, -64, -64, -64, -64, -64, 64, -64, -64, -64, 64, -64, -64, -64, -64, -64, -64, 64, 64, -64, 64, -64, -64, 64, 64, -64, 64, -64, -64, -64, 64, -64, -64, -64, -64, -64, -64, -64, -64, 64, -64, -64, 64, -64, 64, -64, 64, -64, -64, 64, 64, -64, 64, -64, -64, 64, -64, -64, -64, -64, 64, -64, -64, -64, -64, 64, -64, -64, -64, 64, 64, 64, -64, -64, -64, -64, 64, -64, -64, -64, 64, -64, 64, -64, 64, -64, -64, -64, -64, -64, -64, 64, 64, 64, -64, -64, 64, -64, -64, -64, 64, 64, -64, -64, 64, -64, 64, 64, -64, -64, -64, -64, -64, -64, -64, -64, 64, 64, -64, -64, -64, 64, -64, -64, -64, 64, -64, -64, 64, -64, -64, 64, 64, 64, -64, -64, -64, 64, 64, 64, 64, -64, -64, -64, -64, 64, 64, 64, 64, 64, 64, 64, -64, -64, -64, 64, 64, 64, -64, 64, 64, -64, 64, 64, -64, 64, -64, 64, 64, -64, 64, 64, -64, -64, -64, 64, 64, -64, 64, 64, 64, -64, -64, -64, 64, 64, -64, -64, 64, 64, -64, 64, -64, -64, -64, 64, 64, 64, -64, -64, -64, 64, 64, 64, -64, -64, -64, -64, 64, 64, 64, -64, -64, 64, 64, -64, 64, 64, -64, 64, 64, -64, 64, 64, 64, 64, -64, 64, -64, -64, 64, -64, 64, 64, -64, 64, 64, 64, 64, -64, -64, 64, -64, 64, -64, 64, 64, 64, 64, -64, 64, -64, -64, 64, 64, 64, -64, 64, -64, -64, -64, -64, 64, 64, 64, -64, -64, -64, -64, 64, 64, -64, -64, 64, -64, 64, -64, 64, 64, 64, 64, 64, 64, 64, 64, 64, -64, -64, 64, 64, 64, 64, 64, 64, 64, -64, 64, -64, 64, 64, 64, -64, 64, -64, -64, 64, -64, -64, 64, 64, 64, 64, 64, -64, 64, 64, 64, 64, 64, 64, 64, 64, 64, -64, -64, -64, -64, 64, -64, 64, 64, 64, -64, -64, -64, 64, -64, 64, 64, 64, 64, 64, 64, 64, 64, 64, 64, 64, 64, 64, -64, 64, -64, 64, 64, 64, 64, 64, 64, -64, -64, 64, 64, 64, 64, 64, 64, 64, -64, 64, 64, 64, 64, 64, 64, 64, -64, 64, 64, 64, 64, -64, -64, -64, -64, 64, -64, 64, 64, 64, 64, 64, 64, 64, 64, 64, 64, 64, 64, -64, 64, -64, -64, -64, -64, -64, -64, -64, 64, -64, 64, -64, 64, -64, -64, 64, 64, 64, 64, 64, 64, 64, -64, 64, -64, 64, -64, -64, -64, -64, -64, -64, -64, 64, -64, -64, 64, 64, 64, 64, -64, -64, 64, 64, 64, -64, -64, 64, 64, -64, -64, -64, 64, -64, -64, -64, -64, -64, -64, -64, -64, -64, 64, -64, 64, 64, -64, -64, 64, 64, 64, -64, 64, 64, 64, -64, -64, -64, -64, -64, -64, 64, -64, -64, -64, -64, 64, -64, -64, -64, 64, 64, -64, 64, 64, -64, 64, 64, 64, 64, 64, 64, 64, -64, -64, -64, -64, -64, 64, -64, -64, -64, -64, -64, -64, -64, -64, -64, -64, 64, 64, -64, 64, 64, 64, -64, -64, 64, 64, 64, 64, -64, -64, -64, -64, 64, 64, -64, -64, -64, -64, -64, -64, 64, -64, 64, 64, 64, 64, -64, 64, -64, 64, -64, 64, 64, 64, 64, 64, -64, -64, -64, -64, 64, 64, 64, 64, -64, -64, -64, -64, 64, -64, 64, 64, 64, 64, -64, 64, 64, -64, -64, 64, -64, 64, -64, -64, -64, -64, -64, 64, 64, 64, 64, -64, 64, -64, -64, 64, -64, 64, 64, 64, -64, -64, 64, -64, 64, -64, 64, -64, -64, -64, -64, -64, -64, -64, -64, 64, 64, 64, -64, -64, -64, -64, -64, 64, 64, 64, 64, 64, 64, 64, 64, 64, -64, -64, -64, -64, 64, -64, -64, -64, -64, -64, 64, 64, 64, 64, 64, 64, -64, -64, -64, -64, -64, -64, 64, 64, 64, -64, -64, 64, 64, 64, -64, 64, -64, 64, 64, -64, -64, 64, -64, 64, 64, -64, -64, -64, -64, -64, 64, 64, -64, -64, 64, 64, 64, 64, 64, -64, 64, 64, 64, -64, -64, 64, -64, -64, 64, 64, 64, 64, -64, -64, -64, -64, -64, -64, -64, 64, -64, 64, 64, 64, 64, 64, 64, 64, 64, 64, -64, -64, 64, 64, 64, -64, 64, 64, 64, 64, 64, 64, 64, 64, -64, -64, -64, 64, 64, 64, 64, 64, 64, -64, -64, -64, 64, -64, -64, -64, 64, 64, -64, 64, 64, 64, 64, 64, -64, 64, 64, 64, 64, -64, -64, 64, 64, 64, 64, 64, -64, -64, -64, 64, 64, 64, -64, -64, 64, 64, 64, 64, 64, 64, -64, 64, 64, 64, 64, -64, 64, 64, -64, 64, 64, 64, 64, -64, -64, -64, -64, 64, -64, 64, 64, -64, -64, 64, 64, 64, 64, 64, 64, 64, 64, 64, 64, 64, 64, -64, -64, 64, 64, 64, 64, 64, 64, -64, 64, -64, -64, 64, -64, -64, -64, 64, 64, -64, -64, -64, 64, -64, -64, 64, 64, 64, 64, 64, 64, 64, 64, 64, 64, -64, 64, -64, -64, -64, 64, 64, 64, 64, 64, -64, 64, -64, -64, -64, -64, 64, 64, 64, 64, 64, 64, 64, 64, 64, 64, 64, 64, 64, 64, -64, 64, -64, -64, 64, 64, 64, -64, -64, 64, -64, -64, -64, -64, -64, 64, 64, 64, 64, 64, 64, -64, 64, 64, 64, 64, 64, 64, -64, -64, -64, -64, -64, -64, -64, -64, -64, -64, -64, -64, -64, -64, 64, 64, 64, 64, 64, 64, 64, -64, 64, 64, 64, -64, 64, 64, -64, 64, -64, -64, -64, -64, -64, -64, -64, -64, 64, 64, -64, -64, -64, -64, -64, -64, 64, -64, -64, -64, 64, 64, -64, 64, -64, -64, -64, -64, 64, -64, 64, -64, -64, -64, 64, 64, 64, -64, -64, 64, -64, -64, -64, -64, 64, 64, -64, -64, 64, -64, -64, 64, 64, -64, -64, -64, -64, -64, -64, 64, -64, 64, -64, -64, -64, -64, 64, 64, 64, 64, 64, -64, -64, 64, -64, 64, 64, 64, 64, -64, -64, 64, 64, -64, 64, -64, -64, 64, -64, -64, -64, 64, -64, 64, -64, 64, 64, -64, 64, 64, -64, 64, -64, 64, -64, 64, 64, -64, 64, 64, -64, 64, -64, -64, -64, 64, -64, -64, 64, 64, 64, 64, 64, 64, 64, 64, 64, 64, 64, 64, -64, -64, 64, 64, -64, 64, 64, 64, 64, 64, 64, 64, 64, 64, -64, -64, 64, -64, 64, -64, 64, 64, 64, -64, 64, -64, -64, 64, 64, 64, 64, 64, 64, 64, -64, 64, -64, -64, -64, 64, -64, -64, 64, -64, 64, 64, 64, 64, 64, -64, 64, -64, -64, -64, -64, 64, 64, 64, -64, -64, -64, 64, 64, -64, -64, -64, 64, -64, -64, -64, -64, 64, -64, -64, 64, -64, 64, -64, -64, 64, 64, 64, -64, -64, -64, -64, -64, -64, -64, 64, -64, 64, -64, -64, 64, 64, -64, 64, 64, 64, 64, -64, -64, -64, -64, -64, 64, -64, -64, 64, -64, -64, -64, -64, -64, -64, -64, 64, -64, 64, 64, -64, 64, -64, 64, -64, 64, 64, -64, -64, -64, -64, -64, 64, -64, -64, -64, 64, -64, -64, -64, -64, -64, -64, -64, -64, -64, 64, 64, -64, 64, -64, 64, 64, -64, -64, -64, -64, -64, -64, 64, -64, -64, -64, -64, -64, -64, -64, -64, -64, -64, -64, -64, -64, -64, 64, 64, 64, 64, -64, 64, -64, -64, -64, -64, -64, -64, -64, -64, -64, -64, -64, -64, -64, -64, -64, -64, -64, -64, -64, -64, -64, -64, -64, -64, 64, -64, -64, -64, 64, -64, -64, -64, -64, -64, 64, -64, -64, 64, -64, 64, -64, -64, -64, -64, -64, -64, -64, -64, -64, -64, 64, -64, -64, -64, -64, -64, 64, 64, -64, -64, -64, 64, 64, 64, -64, -64, -64, -64, -64, -64, -64, -64, -64, 64, -64, 64, -64, -64, 64, 64, 64, 64, -64, 64, 64, -64, -64, -64, -64, -64, -64, -64, -64, -64, -64, -64, -64, -64, -64, -64, -64, 64, -64, -64, -64, -64, 64, 64, -64, 64, 64, 64, -64, -64, -64, -64, -64, -64, -64, 64, -64, 64, -64, -64, -64, -64, -64, 64, 64, -64, 64, 64, -64, 64, -64, -64, -64, -64, -64, -64, -64, -64, -64, -64, 64, -64, 64, 64, -64, -64, -64, -64, -64, -64, 64, -64, 64, 64, 64, 64, -64, -64, 64, -64, 64, -64, -64, -64, -64, -64, -64, -64, 64, -64, -64, -64, 64, -64, -64, -64, -64, -64, -64, 64, -64, -64, -64, -64, -64, -64, -64, -64, -64, -64, 64, -64, -64, -64, -64, 64, 64, -64, 64, -64, -64, 64, -64, -64, -64, -64, -64, 64, -64, -64, -64, -64, -64, -64, -64, 64, 64, -64, -64, -64, 64, -64, -64, -64, -64, -64, 64, 64, -64, -64, -64, -64, -64, -64, -64, -64, 64, -64, -64, -64, -64, -64, 64, -64, 64, -64, -64, 64, -64, 64, -64, -64, -64, 64, 64, 64, -64, 64, -64, -64, -64, -64, -64, -64, -64, -64, -64, -64, -64, -64, 64, -64, 64, -64, -64, 64, 64, 64, 64, -64, -64, 64, -64, -64, 64, 64, -64, 64, 64, -64, 64, -64, -64, -64, -64, -64, 64, -64, -64, -64, 64, -64, -64, 64, -64, -64, 64, -64, 64, -64, 64, 64, 64, 64, 64, -64, -64, 64, 64, 64, 64, -64, -64, -64, -64, -64, 64, 64, -64, -64, 64, 64, -64, -64, -64, -64, 64, 64, -64, 64, 64, -64, 64, -64, 64, 64, -64, -64, -64, 64, -64, -64, -64, -64, 64, -64, -64, 64, 64, 64, -64, 64, -64, -64, -64, -64, 64, 64, 64, -64, 64, 64, -64, -64, -64, -64, -64, -64, -64, -64, -64, -64, -64, -64, 64, -64, -64, 64, -64, -64, 64, -64, -64, -64, -64, -64, 64, -64, -64, -64, -64, 64, -64, -64, -64, -64, -64, -64, -64, -64, 64, -64, -64, 64, 64, 64, 64, -64, -64, -64, -64, -64, -64, -64, -64, -64, -64, 64, -64, -64, -64, -64, -64, -64, 64, -64, 64, -64, -64, 64, -64, -64, -64, 64, -64, -64, -64, 64, -64, -64, 64, 64, -64, 64, -64, 64, 64, -64, -64, -64, -64, 64, 64, -64, -64, -64, -64, 64, -64, -64, 64, -64, 64, -64, -64, -64, -64, 64, -64, -64, 64, -64, -64, 64, 64, -64, -64, 64, 64, 64, -64, -64, -64, 64, -64, 64, 64, -64, -64, 64, 64, -64, 64, 64, 64, 64, -64, -64, 64, 64, 64, -64, 64, 64, -64, 64, 64, 64, 64, -64, 64, 64, -64, -64, -64, 64, 64, -64, -64, -64, 64, 64, 64, -64, 64, -64, -64, 64, 64, -64, -64, 64, 64, 64, -64, 64, 64, -64, -64, 64, 64, -64, -64, 64, 64, 64, -64, 64, -64, 64, -64, 64, 64, 64, 64, 64, 64, -64, 64, -64, 64, -64, -64, -64, -64, -64, 64, -64, 64, -64, -64, -64, -64, 64, -64, 64, 64, -64, 64, -64, -64, -64, -64, 64, 64, -64, 64, 64, -64, -64, 64, -64, 64, -64, 64, 64, -64, -64, -64, -64, -64, -64, 64, 64, -64, 64, 64, -64, -64, -64, -64, -64, -64, 64, 64, 64, -64, -64, -64, -64, -64, -64, 64, -64, 64, -64, -64, -64, 64, -64, -64, -64, 64, 64, 64, -64, -64, -64, -64, -64, -64, -64, -64, 64, 64, 64, -64, -64, 64, -64, 64, -64, -64, 64, 64, -64, 64, 64, -64, -64, 64, 64, 64, 64, 64, 64, 64, 64, 64, -64, 64, 64, 64, 64, 64, -64, -64, -64, 64, 64, 64, -64, -64, 64, 64, 64, 64, -64, 64, 64, -64, 64, 64, 64, 64, 64, 64, -64, 64, -64, -64, 64, 64, 64, -64, 64, 64, -64, 64, -64, -64, 64, 64, -64, -64, 64, -64, -64, -64, 64, 64, 64, 64, -64, -64, -64, -64, -64, -64, 64, 64, 64, -64, -64, 64, -64, -64, 64, 64, -64, -64, -64, 64, -64, -64, 64, 64, -64, 64, 64, 64, -64, -64, -64, -64, -64, -64, -64, 64, 64, -64, -64, 64, 64, -64, 64, 64, 64, 64, 64, 64, -64, -64, -64, -64, 64, 64, 64, 64, -64, -64, -64, -64, -64, -64, -64, -64, -64, -64, -64, 64, 64, 64, 64, -64, 64, 64, -64, 64, -64, -64, 64, -64, -64, 64, 64, 64, -64, -64, -64, -64, 64, -64, -64, -64, 64, -64, 64, 64, 64, 64, 64, -64, -64, 64, -64, -64, -64, 64, -64, 64, -64, -64, 64, 64, 64, -64, 64, 64, 64, 64, -64, -64, -64, -64, -64, -64, -64, 64, 64, 64, -64, 64, -64, 64, 64, -64, 64, -64, -64, 64, 64, -64, 64, -64, -64, -64, -64, -64, 64, 64, -64, -64, -64, 64, 64, 64, -64, 64, -64, -64, 64, -64, -64, -64, -64, -64, -64, -64, -64, 64, -64, 64, -64, -64, -64, -64, 64, -64, 64, 64, -64, -64, 64, -64, 64, 64, 64, 64, 64, -64, -64, -64, 64, -64, -64, -64, 64, -64, 64, 64, 64, 64, 64, 64, -64, -64, -64, -64, -64, -64, -64, -64, -64, -64, 64, -64, 64, 64, 64, 64, -64, 64, -64, 64, 64, -64, 64, -64, -64, 64, -64, 64, 64, -64, 64, -64, -64, -64, 64, -64, -64, 64, -64, -64, -64, -64, -64, -64, -64, 64, -64, -64, -64, 64, -64, 64, -64, 64, -64, -64, 64, 64, -64, 64, 64, -64, -64, -64, 64, 64, 64, -64, -64, -64, 64, -64, -64, -64, -64, -64, -64, -64, -64, -64, -64, 64, -64, -64, 64, 64, -64, 64, -64, -64, -64, -64, 64, 64, 64, 64, -64, -64, 64, -64, -64, -64, -64, 64, 64, 64, -64, -64, -64, -64, -64, -64, 64, 64, 64, 64, 64, -64, 64, 64, 64, 64, 64, 64, 64, 64, -64, 64, -64, -64, -64, -64, -64, -64, -64, -64, -64, -64, -64, 64, 64, -64, -64, -64, -64, -64, 64, -64, 64, -64, -64, -64, 64, 64, 64, 64, -64, -64, -64, -64, -64, -64, -64, -64, 64, 64, 64, 64, 64, 64, -64, -64, -64, -64, 64, -64, -64, 64, -64, -64, 64, -64, 64, 64, 64, 64, -64, -64, -64, -64, -64, 64, 64, -64, -64, -64, -64, -64, -64, -64, 64, 64, -64, 64, 64, -64, 64, 64, 64, 64, -64, 64, 64, 64, 64, -64, -64, -64, -64, 64, 64, 64, 64, -64, -64, -64, -64, 64, -64, 64, 64, -64, -64, 64, -64, 64, 64, -64, 64, 64, 64, 64, 64, 64, 64, 64, 64, 64, -64, 64, -64, -64, -64, -64, -64, -64, 64, 64, -64, 64, -64, 64, -64, 64, -64, -64, -64, 64, 64, 64, 64, 64, -64, -64, 64, -64, -64, -64, -64, -64, 64, 64, -64, -64, -64, -64, 64, -64, -64, 64, 64, 64, -64, -64, -64, -64, -64, -64, 64, -64, -64, -64, -64, -64, -64, -64, -64, 64, 64, -64, -64, -64, -64, 64, -64, -64, 64, 64, -64, -64, 64, -64, 64, -64, -64, 64, -64, -64, -64, -64, -64, -64, 64, 64, 64, 64, 64, -64, 64, -64, -64, 64, 64, 64, 64, -64, 64, -64, -64, 64, -64, 64, 64, -64, -64, 64, -64, -64, -64, 64, -64, -64, -64, 64, 64, 64, 64, -64, 64, -64, -64, -64, -64, 64, 64, -64, -64, 64, -64, 64, -64, -64, -64, -64, 64, -64, 64, 64, -64, 64, -64, 64, 64, -64, 64, 64, -64, 64, -64, -64, 64, 64, -64, 64, 64, -64, 64, -64, -64, 64, 64, -64, 64, 64, 64, 64, 64, -64, -64, 64, -64, 64, -64, -64, -64, 64, -64, -64, -64, 64, -64, 64, -64, 64, 64, 64, 64, 64, -64, 64, 64, -64, 64, 64, 64, -64, -64, -64, -64, 64, 64, -64, -64, -64, -64, -64, 64, 64, -64, 64, -64, 64, -64, 64, 64, 64, 64, -64, 64, -64, -64, -64, -64, -64, -64, -64, 64, 64, -64, -64, 64, 64, -64, 64, 64, 64, 64, 64, -64, 64, -64, -64, -64, 64, 64, 64, 64, 64, 64, -64, 64, -64, 64, -64, 64, 64, 64, 64, -64, -64, 64, 64, 64, -64, 64, -64, 64, 64, 64, 64, 64, 64, 64, -64, 64, 64, 64, 64, 64, 64, 64, 64, -64, -64, 64, -64, -64, -64, 64, -64, 64, 64, -64, 64, -64, 64, -64, -64, -64, 64, 64, -64, -64, -64, 64, 64, 64, 64, -64, -64, 64, -64, 64, 64, 64, 64, 64, -64, -64, -64, -64, -64, -64, -64, 64, -64, 64, 64, 64, -64, 64, 64, 64, -64, 64, 64, 64, -64, 64, -64, -64, 64, 64, 64, -64, 64, 64, -64, 64, 64, 64, 64, -64, -64, 64, 64, 64, 64, -64, 64, 64, 64, 64, 64, -64, 64, 64, -64, 64, -64, 64, -64, 64, -64, 64, 64, -64, -64, 64, -64, -64, 64, 64, 64, 64, 64, -64, 64, 64, -64, 64, 64, 64, -64, -64, 64, 64, 64, 64, 64, 64, 64, 64, -64, -64, -64, -64, -64, -64, 64, -64, 64, -64, 64, 64, -64, 64, 64, 64, -64, 64, -64, 64, 64, -64, 64, -64, 64, -64, 64, 64, -64, -64, 64, 64, -64, 64, -64, -64, 64, 64, 64, 64, -64, 64, -64, -64, 64, -64, -64, -64, 64, 64, 64, -64, -64, -64, -64, 64, -64, 64, 64, 64, -64, -64, -64, 64, 64, 64, 64, -64, -64, 64, -64, 64, 64, 64, 64, 64, -64, -64, -64, -64, -64, -64, 64, 64, -64, -64, -64, 64, -64, -64, -64, -64, 64, 64, 64, -64, 64, 64, 64, 64, 64, 64, 64, -64, -64, 64, -64, -64, 64, -64, -64, 64, -64, 64, 64, -64, 64, -64, -64, -64, 64, 64, 64, -64, -64, -64, -64, -64, 64, 64, 64, 64, 64, 64, 64, 64, -64, -64, 64, 64, 64, 64, -64, -64, -64, 64, 64, -64, 64, 64, 64, -64, 64, 64, 64, 64, 64, 64, -64, 64, 64, -64, 64, 64, 64, 64, -64, -64, 64, 64, 64, 64, 64, -64, 64, 64, 64, 64, 64, -64, -64, 64, 64, 64, 64, -64, -64, -64, 64, 64, 64, 64, 64, 64, -64, -64, 64, 64, 64, -64, -64, -64, 64, 64, 64, -64, 64, 64, 64, 64, 64, 64, 64, 64, 64, -64, 64, -64, 64, -64, 64, 64, 64, -64, 64, 64, 64, -64, -64, 64, 64, 64, -64, 64, -64, 64, 64, 64, -64, 64, 64, 64, -64, 64, 64, 64, -64, 64, -64, -64, -64, 64, -64, 64, 64, 64, -64, -64, 64, 64, 64, 64, -64, 64, 64, 64, 64, 64, 64, 64, 64, 64, -64, 64, 64, -64, 64, 64, -64, 64, -64, 64, -64, -64, -64, -64, 64, -64, 64, -64, 64, 64, 64, -64, -64, 64, 64, 64, 64, -64, 64, 64, 64, 64, 64, 64, 64, -64, -64, 64, 64, -64, -64, 64, -64, 64, -64, -64, 64, -64, -64, -64, 64, 64, 64, 64, 64, 64, 64, 64, -64, 64, -64, -64, -64, -64, -64, -64, 64, 64, -64, 64, -64, -64, -64, 64, 64, 64, -64, -64, 64, 64, 64, 64, -64, 64, 64, -64, 64, 64, -64, 64, 64, -64, -64, -64, -64, 64, -64, -64, -64, -64, 64, -64, 64, 64, 64, 64, -64, -64, -64, -64, 64, -64, -64, 64, 64, 64, -64, -64, -64, 64, -64, 64, -64, -64, 64, 64, -64, 64, 64, 64, 64, 64, -64, -64, -64, -64, 64, -64, 64, 64, -64, -64, -64, 64, -64, -64, 64, -64, -64, -64, 64, -64, -64, 64, -64, 64, -64, 64, -64, 64, 64, 64, -64, -64, 64, 64, 64, 64, -64, -64, -64, -64, -64, -64, -64, -64, -64, 64, 64, 64, -64, -64, -64, -64, 64, 64, 64, -64, -64, 64, -64, -64, 64, -64, 64, -64, -64, -64, 64, 64, 64, -64, -64, -64, -64, 64, -64, 64, -64, 64, 64, -64, -64, 64, -64, 64, -64, 64, -64, -64, 64, -64, -64, -64, -64, -64, -64, -64, 64, -64, -64, -64, 64, -64, -64, 64, 64, -64, 64, 64, 64, 64, -64, 64, -64, 64, 64, 64, 64, -64, 64, -64, -64, 64, 64, -64, 64, -64, 64, -64, -64, 64, -64, -64, 64, 64, -64, 64, 64, -64, 64, -64, 64, -64, 64, 64, 64, 64, -64, 64, -64, -64, -64, 64, -64, -64, -64, 64, -64, 64, 64, -64, 64, 64, 64, 64, 64, -64, -64, -64, 64, 64, 64, 64, 64, 64, -64, 64, -64, -64, 64, -64, -64, 64, 64, 64, -64, 64, 64, 64, 64, 64, -64, 64, 64, -64, -64, 64, 64, 64, -64, 64, -64, 64, -64, -64, -64, -64, 64, 64, 64, -64, -64, -64, -64, 64, 64, 64, -64, -64, -64, -64, 64, 64, -64, 64, 64, 64, -64, 64, 64, 64, -64, -64, -64, -64, -64, -64, 64, 64, 64, 64, 64, 64, -64, -64, -64, 64, -64, -64, 64, 64, 64, 64, 64, 64, -64, 64, 64, -64, 64, -64, -64, -64, -64, 64, 64, 64, -64, -64, 64, -64, 64, 64, -64, 64, -64, 64, -64, -64, 64, 64, 64, 64, 64, 64, 64, 64, 64, -64, 64, 64, -64, 64, 64, 64, 64, -64, -64, -64, -64, 64, -64, -64, -64, -64, 64, 64, 64, 64, 64, 64, 64, 64, 64, 64, 64, 64, -64, 64, 64, -64, -64, -64, -64, 64, -64, -64, 64, 64, -64, -64, -64, -64, -64, 64, 64, 64, 64, 64, 64, 64, 64, 64, 64, 64, -64, -64, 64, -64, -64, -64, -64, 64, 64, -64, 64, -64, -64, 64, -64, -64, 64, 64, 64, -64, 64, 64, 64, 64, 64, -64, -64, -64, -64, -64, 64, 64, 64, 64, 64, 64, -64, -64, -64, 64, 64, 64, -64, 64, 64, 64, 64, 64, 64, 64, 64, 64, -64, -64, -64, 64, 64, 64, 64, -64, 64, -64, -64, -64, 64, -64, 64, 64, 64, -64, 64, 64, 64, 64, 64, 64, 64, 64, 64, 64, -64, -64, -64, -64, 64, 64, -64, -64, -64, -64, 64, 64, 64, 64, 64, -64, 64, 64, 64, 64, 64, 64, 64, 64, -64, 64, -64, -64, -64, -64, -64, -64, 64, -64, -64, -64, 64, 64, -64, 64, 64, 64, 64, -64, 64, 64, 64, 64, 64, 64, 64, -64, -64, -64, -64, -64, -64, -64, -64, 64, 64, -64, -64, -64, 64, -64, 64, -64, 64, -64, 64, -64, 64, -64, 64, 64, 64, 64, 64, -64, -64, -64, -64, 64, -64, -64, 64, 64, 64, -64, 64, 64, -64, -64, -64, -64, -64, 64, 64, -64, -64, -64, 64, 64, -64, 64, 64, -64, -64, -64, -64, -64, -64, 64, 64, 64, 64, -64, 64, 64, 64, -64, 64, 64, 64, 64, -64, -64, -64, -64, -64, -64, 64, -64, 64, -64, -64, -64, -64, 64, 64, 64, 64, 64, -64, -64, 64, 64, -64, 64, 64, 64, 64, 64, -64, 64, -64, 64, 64, 64, 64, 64, 64, 64, -64, -64, -64, -64, -64, 64, -64, 64, 64, 64, -64, 64, 64, 64, 64, 64, 64, -64, -64, 64, -64, 64, -64, 64, 64, 64, 64, 64, 64, 64, 64, 64, -64, -64, 64, 64, 64, 64, 64, 64, 64, 64, 64, 64, 64, 64, -64, -64, -64, -64, 64, -64, 64, 64, 64, 64, 64, 64, 64, 64, -64, 64, 64, 64, 64, -64, -64, 64, -64, 64, -64, 64, 64, -64, -64, -64, -64, 64, 64, 64, 64, -64, 64, 64, 64, 64, -64, 64, 64, 64, -64, 64, 64, -64, -64, 64, -64, -64, -64, -64, -64, -64, -64, -64, -64, -64, -64, 64, 64, 64, -64, 64, 64, 64, 64, -64, 64, 64, 64, 64, 64, -64, 64, -64, 64, 64, 64, -64, 64, -64, -64, -64, -64, -64, -64, 64, 64, 64, 64, 64, 64, -64, -64, -64, 64, -64, -64, 64, 64, 64, 64, 64, 64, 64, 64, -64, 64, 64, -64, -64, -64, -64, -64, -64, 64, -64, 64, 64, 64, -64, -64, -64, 64, 64, 64, 64, 64, 64, -64, 64, 64, 64, -64, -64, -64, -64, -64, -64, -64, -64, -64, 64, 64, 64, 64, -64, -64, 64, -64, 64, 64, 64, 64, 64, 64, 64, -64, -64, 64, 64, -64, 64, -64, 64, -64, -64, 64, -64, 64, 64, 64, 64, 64, 64, 64, 64, 64, 64, 64, 64, 64, -64, 64, 64, 64, -64, -64, 64, 64, -64, -64, -64, -64, -64, -64, 64, -64, 64, -64, -64, -64, 64, 64, 64, 64, -64, 64, -64, 64, -64, -64, 64, -64, -64, 64, 64, -64, 64, 64, 64, -64, -64, -64, 64, 64, 64, 64, 64, -64, 64, -64, 64, 64, -64, -64, -64, -64, -64, 64, -64, 64, -64, -64, 64, 64, 64, 64, 64, -64, -64, -64, -64, 64, 64, 64, 64, -64, 64, -64, 64, 64, -64, 64, 64, 64, 64, 64, -64, -64, 64, -64, -64, 64, 64, 64, 64, -64, 64, 64, -64, -64, 64, -64, -64, -64, 64, 64, 64, 64, -64, 64, -64, 64, -64, 64, 64, 64, -64, 64, 64, 64, 64, 64, -64, 64, 64, 64, 64, -64, 64, 64, -64, -64, -64, 64, 64, -64, -64, 64, 64, 64, -64, 64, 64, 64, 64, 64, -64, 64, 64, 64, -64, 64, 64, 64, 64, 64, -64, -64, 64, 64, -64, -64, 64, 64, -64, 64, 64, 64, -64, 64, 64, -64, 64, 64, -64, -64, 64, 64, 64, 64, -64, 64, 64, 64, 64, -64, 64, 64, 64, 64, 64, -64, -64, 64, -64, -64, -64, -64, 64, 64, 64, 64, 64, 64, 64, 64, -64, -64, -64, 64, 64, 64, -64, -64, 64, -64, 64, -64, 64, -64, 64, 64, -64, 64, 64, 64, -64, 64, -64, -64, -64, 64, -64, -64, -64, 64, -64, 64, -64, -64, -64, -64, -64, -64, 64, -64, -64, -64, -64, -64, -64, -64, -64, -64, -64, -64, -64, -64, 64, 64, 64, 64, 64, -64, 64, -64, 64, -64, -64, -64, -64, -64, -64, 64, -64, -64, -64, -64, -64, -64, -64, 64, -64, -64, 64, -64, -64, 64, 64, 64, 64, 64, 64, -64, -64, 64, -64, -64, -64, 64, 64, -64, -64, -64, -64, 64, 64, -64, -64, 64, 64, 64, -64, -64, 64, 64, 64, -64, -64, -64, -64, -64, 64, -64, -64, -64, -64, -64, -64, -64, -64, 64, -64, -64, 64, -64, -64, -64, -64, -64, 64, -64, 64, -64, -64, 64, -64, 64, 64, -64, -64, -64, -64, -64, -64, -64, 64, -64, 64, 64, -64, 64, -64, 64, -64, -64, -64, -64, -64, -64, -64, 64, 64, 64, 64, 64, 64, 64, -64, -64, 64, -64, -64, -64, -64, -64, -64, -64, -64, 64, -64, -64, -64, -64, -64, -64, -64, -64, -64, -64, -64, 64, -64, 64, -64, 64, 64, 64, 64, -64, -64, -64, -64, -64, -64, -64, -64, -64, 64, 64, -64, -64, 64, -64, -64, -64, 64, 64, 64, -64, 64, -64, -64, 64, 64, -64, -64, -64, -64, -64, -64, -64, -64, -64, -64, -64, -64, 64, -64, 64, 64, 64, 64, -64, 64, -64, 64, -64, -64, -64, -64, -64, -64, 64, 64, 64, -64, -64, -64, -64, -64, -64, -64, -64, -64, -64, 64, 64, -64, -64, -64, -64, 64, -64, -64, -64, -64, -64, -64, 64, 64, 64, -64, -64, -64, 64, -64, -64, -64, -64, -64, -64, -64, -64, 64, -64, -64, -64, 64, -64, -64, -64, 64, 64, -64, 64, -64, -64, -64, 64, 64, 64, -64, -64, 64, -64, -64, 64, -64, 64, -64, -64, -64, -64, 64, -64, -64, 64, -64, 64, 64, -64, -64, 64, -64, 64, -64, 64, 64, 64, -64, -64, 64, -64, -64, -64, -64, -64, -64, 64, 64, -64, 64, 64, 64, 64, 64, -64, -64, 64, -64, -64, 64, -64, -64, -64, 64, 64, -64, -64, -64, 64, 64, -64, -64, -64, -64, 64, -64, 64, -64, -64, 64, -64, 64, 64, 64, -64, -64, -64, 64, -64, -64, -64, -64, -64, -64, 64, 64, -64, -64, -64, -64, -64, -64, 64, -64, -64, -64, -64, 64, -64, 64, 64, 64, -64, -64, 64, -64, -64, -64, -64, -64, -64, 64, 64, -64, -64, -64, -64, -64, -64, 64, 64, -64, 64, 64, -64, -64, -64, -64, 64, -64, -64, 64, -64, -64, 64, 64, 64, 64, 64, -64, 64, 64, -64, 64, -64, -64, 64, 64, -64, 64, 64, -64, -64, -64, -64, 64, -64, 64, -64, -64, -64, 64, 64, -64, -64, -64, -64, 64, -64, 64, -64, -64, -64, 64, 64, 64, -64, -64, 64, -64, -64, 64, -64, -64, 64, 64, 64, -64, -64, 64, 64, -64, -64, -64, -64, 64, -64, -64, -64, -64, -64, 64, -64, -64, -64, -64, -64, -64, 64, -64, 64, -64, 64, -64, -64, 64, -64, 64, 64, 64, 64, -64, -64, -64, -64, -64, -64, -64, -64, -64, -64, -64, -64, -64, -64, 64, -64, 64, -64, -64, 64, -64, 64, 64, -64, 64, 64, -64, 64, 64, -64, -64, -64, -64, -64, -64, -64, -64, -64, 64, -64, -64, -64, -64, -64, 64, -64, -64, -64, 64, -64, -64, 64, 64, -64, 64, -64, -64, -64, 64, 64, -64, 64, 64, 64, 64, 64, 64, -64, -64, 64, 64, -64, -64, -64, -64, 64, 64, -64, 64, -64, -64, -64, -64, 64, 64, -64, -64, -64, -64, -64, -64, -64, -64, -64, 64, 64, 64, 64, -64, 64, -64, -64, 64, -64, -64, -64, -64, -64, -64, 64, -64, 64, 64, -64, 64, 64, 64, -64, 64, -64, -64, -64, 64, -64, -64, -64, -64, -64, 64, 64, 64, -64, -64, -64, -64, -64, -64, -64, 64, 64, -64, 64, 64, -64, -64, 64, 64, -64, 64, -64, 64, -64, 64, -64, -64, -64, 64, -64, -64, -64, 64, 64, -64, -64, -64, 64, 64, 64, -64, 64, 64, -64, 64, -64, 64, 64, 64, 64, -64, -64, -64, 64, 64, 64, 64, -64, -64, -64, -64, -64, -64, -64, -64, -64, -64, 64, 64, 64, 64, 64, 64, 64, 64, 64, 64, 64, 64, 64, -64, 64, -64, -64, -64, 64, 64, 64, 64, -64, -64, 64, 64, 64, 64, 64, 64, 64, 64, 64, 64, 64, 64, 64, 64, 64, 64, 64, 64, 64, 64, -64, -64, -64, -64, -64, -64, -64, 64, -64, 64, 64, 64, 64, 64, 64, 64, -64, 64, -64, 64, 64, 64, 64, 64, 64, -64, -64, -64, -64, -64, -64, -64, 64, -64, -64, 64, 64, 64, 64, -64, 64, 64, 64, 64, 64, -64, -64, 64, -64, 64, -64, -64, -64, -64, -64, -64, -64, -64, -64, -64, 64, -64, -64, -64, -64, 64, 64, 64, 64, 64, 64, 64, -64, -64, -64, -64, 64, -64, 64, -64, -64, -64, -64, 64, 64, 64, -64, -64, -64, -64, -64, 64, -64, 64, 64, 64, 64, 64, 64, 64, 64, -64, -64, -64, 64, 64, 64, -64, -64, 64, -64, 64, 64, 64, -64, -64, -64, -64, 64, 64, 64, 64, 64, 64, 64, 64, 64, 64, -64, -64, -64, -64, 64, 64, 64, 64, 64, -64, 64, 64, 64, 64, -64, -64, -64, 64, 64, 64, 64, 64, 64, 64, 64, 64, 64, 64, -64, -64, -64, 64, 64, 64, 64, -64, 64, 64, 64, 64, 64, 64, -64, 64, -64, 64, -64, 64, 64, 64, 64, 64, 64, 64, 64, 64, -64, -64, -64, 64, 64, 64, 64, 64, 64, 64, 64, 64, 64, 64, -64, -64, 64, -64, 64, 64, 64, 64, 64, 64, 64, 64, 64, -64, -64, -64, -64, 64, -64, 64, -64, 64, 64, 64, 64, 64, 64, 64, 64, 64, 64, -64, 64, 64, 64, -64, 64, 64, 64, 64, 64, -64, -64, -64, -64, -64, 64, -64, 64, 64, -64, 64, 64, 64, 64, 64, 64, 64, -64, -64, 64, 64, -64, -64, -64, 64, 64, -64, -64, 64, -64, -64, -64, -64, -64, -64, -64, -64, -64, 64, 64, 64, 64, 64, 64, 64, 64, -64, -64, 64, 64, -64, 64, 64, 64, 64, 64, 64, -64, -64, -64, -64, -64, 64, -64, 64, -64, 64, 64, 64, 64, 64, 64, 64, 64, 64, 64, -64, -64, -64, 64, 64, 64, 64, 64, 64, 64, -64, 64, 64, -64, -64, -64, 64, -64, 64, -64, 64, 64, 64, 64, 64, -64, -64, -64, -64, -64, -64, 64, -64, 64, 64, 64, 64, 64, 64, 64, -64, 64, -64, 64, -64, 64, 64, 64, 64, 64, 64, 64, 64, -64, -64, 64, -64, -64, 64, -64, -64, -64, -64, 64, 64, 64, 64, 64, 64, -64, -64, 64, -64, -64, -64, 64, 64, 64, 64, 64, 64, -64, -64, 64, 64, 64, -64, -64, -64, -64, -64, 64, 64, 64, 64, 64, 64, -64, -64, 64, 64, 64, 64, 64, -64, 64, 64, 64, 64, 64, 64, -64, -64, -64, -64, -64, -64, 64, 64, 64, 64, 64, 64, 64, 64, 64, 64, -64, -64, 64, 64, 64, 64, 64, 64, -64, -64, 64, 64, -64, -64, -64, -64, -64, 64, 64, 64, -64, -64, 64, 64, 64, 64, 64, -64, -64, -64, 64, 64, 64, 64, 64, -64, -64, -64, -64, -64, -64, -64, 64, 64, 64, -64, 64, 64, 64, 64, 64, 64, -64, -64, -64, 64, -64, 64, -64, 64, 64, 64, 64, 64, -64, 64, -64, -64, -64, -64, -64, 64, 64, 64, 64, 64, -64, -64, -64, 64, -64, -64, 64, -64, -64, -64, -64, 64, 64, 64, -64, 64, 64, 64, 64, 64, -64, -64, 64, 64, 64, -64, -64, -64, -64, -64, 64, 64, -64, 64, -64, -64, -64, -64, -64, 64, 64, -64, -64, -64, -64, 64, 64, 64, -64, 64, -64, 64, -64, 64, 64, 64, -64, -64, -64, 64, -64, 64, 64, 64, -64, -64, 64, -64, -64, 64, -64, 64, -64, 64, 64, 64, -64, -64, -64, 64, -64, -64, -64, -64, 64, -64, -64, -64, -64, 64, 64, 64, 64, 64, 64, 64, 64, 64, -64, -64, 64, -64, -64, -64, -64, -64, 64, 64, -64, -64, -64, -64, -64, 64, 64, 64, -64, -64, 64, -64, -64, -64, -64, 64, 64, 64, 64, -64, 64, 64, -64, -64, 64, -64, 64, -64, -64, -64, -64, 64, 64, -64, -64, 64, -64, -64, 64, -64, -64, -64, -64, -64, 64, -64, 64, 64, -64, 64, -64, -64, -64, 64, -64, 64, -64, -64, 64, -64, 64, 64, 64, 64, -64, 64, 64, -64, -64, 64, 64, 64, 64, -64, 64, -64, 64, 64, 64, 64, -64, 64, 64, 64, 64, -64, 64, 64, 64, -64, 64, -64, 64, 64, 64, -64, -64, 64, 64, 64, -64, -64, 64, 64, 64, -64, 64, -64, 64, -64, 64, -64, 64, -64, -64, -64, 64, 64, -64, 64, -64, -64, -64, -64, -64, 64, 64, -64, -64, 64, 64, 64, -64, -64, 64, 64, -64, -64, 64, 64, 64, -64, 64, 64, -64, 64, 64, 64, 64, -64, 64, -64, -64, 64, 64, 64, -64, 64, -64, 64, -64, -64, 64, -64, 64, 64, 64, -64, -64, 64, 64, 64, 64, 64, 64, 64, 64, -64, -64, -64, -64, 64, 64, -64, -64, 64, -64, 64, 64, -64, -64, 64, -64, -64, 64, 64, 64, -64, 64, 64, 64, -64, -64, 64, 64, -64, 64, 64, 64, 64, 64, 64, -64, 64, -64, 64, 64, 64, -64, 64, -64, -64, -64, -64, -64, 64, 64, 64, -64, 64, 64, 64, 64, -64, -64, -64, 64, 64, 64, 64, 64, 64, 64, -64, -64, -64, 64, -64, 64, -64, 64, 64, 64, 64, -64, 64, 64, 64, 64, 64, 64, 64, 64, 64, 64, -64, 64, -64, 64, -64, -64, 64, 64, 64, 64, -64, -64, -64, -64, -64, -64, 64, -64, -64, 64, 64, -64, 64, 64, 64, -64, -64, 64, 64, -64, 64, 64, -64, 64, 64, -64, 64, -64, 64, -64, 64, -64, -64, 64, 64, -64, 64, 64, 64, 64, -64, 64, 64, 64, -64, 64, 64, 64, -64, 64, -64, 64, 64, 64, 64, 64, 64, 64, 64, 64, -64, -64, 64, -64, 64, 64, 64, 64, 64, 64, -64, 64, -64, 64, 64, 64, 64, 64, -64, 64, 64, -64, 64, -64, 64, 64, 64, -64, 64, 64, 64, -64, 64, -64, -64, 64, 64, 64, 64, 64, -64, 64, 64, -64, -64, 64, -64, 64, 64, 64, -64, -64, 64, -64, 64, 64, -64, 64, 64, 64, -64, 64, -64, 64, 64, 64, 64, 64, 64, 64, 64, 64, 64, -64, -64, 64, -64, 64, -64, 64, 64, -64, -64, 64, -64, 64, 64, 64, 64, 64, 64, 64, 64, 64, 64, -64, -64, 64, 64, 64, 64, 64, 64, 64, 64, 64, 64, -64, 64, 64, 64, -64, -64, -64, 64, 64, 64, -64, 64, 64, 64, 64, 64, 64, 64, 64, 64, 64, 64, -64, -64, -64, -64, 64, 64, 64, -64, 64, -64, 64, -64, 64, 64, -64, -64, 64, 64, 64, 64, 64, -64, 64, 64, 64, 64, 64, 64, 64, 64, 64, -64, -64, -64, -64, 64, 64, 64, 64, -64, 64, 64, 64, 64, -64, 64, 64, 64, 64, -64, -64, -64, 64, 64, 64, 64, -64, 64, -64, 64, 64, -64, 64, 64, 64, -64, -64, 64, -64, -64, -64, -64, 64, 64, -64, 64, 64, 64, -64, 64, 64, -64, -64, 64, 64, 64, -64, 64, 64, 64, -64, -64, 64, -64, 64, -64, 64, 64, -64, 64, -64, 64, 64, 64, 64, 64, 64, -64, 64, 64, -64, 64, 64, 64, -64, 64, -64, 64, 64, 64, -64, 64, 64, -64, 64, -64, 64, 64, 64, 64, 64, 64, 64, 64, -64, 64, -64, -64, -64, 64, -64, 64, 64, 64, 64, -64, -64, -64, 64, -64, 64, 64, 64, 64, -64, -64, 64, 64, 64, 64, 64, 64, 64, -64, 64, 64, -64, 64, -64, 64, -64, -64, 64, 64, -64, -64, -64, 64, -64, -64, -64, 64, 64, -64, 64, -64, -64, 64, 64, -64, -64, -64, -64, 64, 64, 64, 64, 64, -64, -64, -64, 64, -64, 64, 64, 64, -64, 64, 64, 64, 64, -64, 64, 64, 64, 64, 64, 64, 64, -64, -64, -64, -64, -64, -64, 64, -64, -64, 64, 64, -64, -64, -64, 64, -64, -64, -64, 64, 64, 64, 64, 64, 64, -64, 64, 64, 64, 64, 64, 64, 64, -64, 64, -64, -64, -64, 64, 64, -64, 64, 64, -64, 64, -64, 64, -64, -64, 64, -64, 64, 64, 64, 64, 64, 64, 64, 64, 64, 64, 64, -64, -64, 64, -64, 64, -64, 64, 64, -64, 64, -64, -64, 64, 64, -64, -64, 64, -64, 64, -64, -64, -64, -64, 64, -64, -64, 64, -64, 64, 64, 64, -64, -64, 64, -64, -64, 64, -64, 64, -64, 64, -64, -64, 64, 64, -64, -64, 64, -64, 64, 64, -64, -64, -64, 64, 64, 64, 64, 64, -64, 64, -64, -64, -64, -64, -64, -64, 64, -64, -64, -64, -64, 64, 64, 64, 64, 64, 64, 64, -64, 64, 64, 64, -64, 64, 64, 64, -64, 64, 64, -64, -64, -64, 64, 64, -64, -64, 64, -64, 64, -64, -64, 64, 64, -64, 64, 64, 64, -64, -64, 64, 64, 64, 64, 64, -64, -64, 64, 64, -64, 64, -64, 64, -64, 64, 64, 64, -64, -64, -64, 64, 64, -64, 64, 64, 64, -64, 64, 64, -64, -64, -64, -64, 64, 64, 64, -64, 64, -64, -64, -64, -64, 64, -64, -64, -64, 64, 64, 64, 64, 64, 64, 64, 64, 64, 64, -64, -64, 64, -64, -64, -64, -64, -64, -64, -64, 64, 64, 64, -64, 64, 64, 64, 64, 64, 64, 64, 64, 64, 64, 64, -64, 64, -64, 64, 64, 64, 64, 64, -64, -64, -64, -64, 64, 64, 64, -64, 64, 64, 64, 64, 64, 64, 64, -64, -64, 64, 64, -64, 64, -64, -64, 64, 64, 64, 64, 64, 64, 64, 64, 64, -64, -64, -64, 64, -64, 64, -64, 64, 64, -64, -64, -64, 64, -64, -64, -64, -64, 64, 64, 64, -64, 64, 64, 64, -64, -64, 64, -64, 64, -64, -64, 64, 64, -64, 64, -64, 64, -64, -64, -64, -64, -64, -64, -64, -64, -64, -64, 64, 64, 64, -64, 64, -64, -64, -64, -64, -64, -64, 64, 64, -64, 64, -64, -64, -64, -64, -64, -64, -64, -64, -64, -64, -64, -64, 64, 64, 64, -64, -64, -64, -64, -64, -64, -64, -64, 64, 64, -64, -64, -64, -64, -64, -64, -64, -64, -64, -64, -64, -64, -64, -64, -64, 64, 64, 64, -64, -64, -64, -64, -64, -64, -64, -64, 64, -64, -64, -64, -64, -64, -64, -64, -64, -64, -64, -64, -64, -64, -64, 64, 64, 64, 64, 64, -64, -64, -64, -64, -64, 64, -64, 64, -64, 64, 64, -64, -64, -64, -64, -64, -64, -64, 64, -64, -64, -64, 64, 64, 64, 64, 64, -64, -64, -64, -64, -64, -64, -64, -64, 64, 64, 64, -64, -64, 64, 64, 64, 64, 64, -64, 64, -64, 64, 64, 64, 64, 64, 64, 64, -64, -64, -64, -64, -64, 64, -64, -64, -64, -64, -64, 64, -64, -64, 64, -64, -64, -64, -64, -64, -64, -64, -64, -64, 64, -64, -64, -64, 64, -64, 64, -64, -64, -64, 64, -64, -64, 64, 64, 64, 64, 64, 64, 64, -64, -64, -64, -64, -64, -64, -64, -64, -64, 64, -64, -64, -64, 64, 64, -64, -64, -64, -64, -64, 64, -64, 64, 64, -64, -64, 64, -64, -64, -64, -64, -64, -64, -64, -64, -64, -64, -64, -64, -64, 64, 64, -64, 64, -64, -64, 64, -64, 64, 64, 64, 64, 64, 64, 64, 64, 64, -64, -64, -64, -64, -64, -64, -64, -64, -64, -64, -64, -64, 64, -64, 64, 64, 64, -64, -64, 64, -64, -64, 64, -64, 64, 64, 64, 64, -64, -64, -64, -64, -64, -64, -64, -64, -64, -64, -64, -64, -64, 64, 64, 64, -64, -64, 64, 64, -64, -64, 64, 64, 64, 64, 64, 64, 64, -64, 64, -64, 64, -64, -64, -64, -64, -64, 64, 64, 64, -64, -64, 64, -64, -64, -64, 64, 64, 64, 64, -64, 64, 64, 64, 64, -64, 64, -64, -64, -64, 64, -64, -64, -64, 64, -64, 64, -64, -64, -64, -64, -64, 64, -64, 64, 64, 64, 64, 64, -64, -64, -64, 64, 64, 64, 64, -64, -64, -64, -64, -64, 64, -64, -64, -64, -64, -64, -64, 64, -64, 64, -64, 64, -64, 64, 64, 64, 64, -64, 64, 64, 64, -64, 64, 64, -64, -64, -64, -64, 64, 64, -64, -64, -64, -64, -64, 64, 64, -64, 64, 64, -64, 64, 64, -64, -64, -64, 64, -64, -64, 64, -64, -64, -64, -64, -64, 64, 64, 64, -64, -64, -64, 64, 64, -64, -64, -64, 64, -64, 64, 64, 64, 64, -64, 64, -64, 64, -64, -64, -64, 64, -64, 64, -64, 64, 64, -64, 64, -64, -64, -64, -64, 64, -64, 64, 64, 64, -64, -64, 64, 64, -64, 64, -64, -64, -64, -64, -64, 64, -64, -64, -64, -64, -64, -64, -64, 64, -64, 64, 64, 64, 64, -64, -64, 64, 64, 64, -64, 64, -64, 64, -64, -64, -64, 64, -64, 64, 64, -64, -64, 64, -64, -64, -64, -64, -64, 64, 64, -64, -64, 64, 64, -64, -64, -64, 64, -64, 64, 64, 64, 64, 64, 64, 64, -64, -64, -64, 64, -64, -64, -64, -64, -64, 64, -64, 64, -64, -64, 64, 64, 64, -64, -64, 64, 64, -64, 64, -64, -64, -64, -64, 64, 64, 64, -64, 64, -64, -64, 64, -64, -64, 64, -64, -64, 64, -64, 64, -64, -64, 64, -64, -64, -64, 64, -64, -64, -64, 64, -64, 64, 64, 64, -64, 64, -64, -64, -64, 64, -64, 64, -64, -64, -64, -64, -64, 64, -64, 64, 64, 64, 64, 64, 64, 64, -64, -64, -64, 64, 64, 64, -64, -64, 64, -64, 64, 64, -64, 64, -64, 64, 64, -64, 64, -64, 64, 64, 64, -64, 64, -64, -64, 64, -64, 64, 64, 64, -64, -64, -64, -64, -64, -64, -64, 64, 64, -64, 64, 64, -64, -64, 64, -64, 64, 64, 64, -64, -64, 64, -64, 64, 64, 64, 64, 64, 64, -64, -64, -64, -64, -64, -64, -64, 64, -64, -64, -64, -64, 64, -64, 64, -64, 64, 64, 64, -64, -64, -64, -64, -64, 64, -64, 64, -64, -64, -64, 64, 64, -64, -64, -64, 64, -64, -64, 64, -64, 64, 64, 64, 64, 64, 64, 64, 64, -64, -64, 64, 64, 64, 64, 64, -64, -64, -64, -64, -64, -64, -64, -64, 64, -64, -64, -64, -64, -64, -64, -64, -64, -64, 64, -64, -64, -64, -64, -64, 64, 64, 64, 64, -64, -64, -64, 64, 64, -64, -64, -64, -64, -64, -64, 64, -64, -64, 64, -64, -64, -64, -64, -64, -64, -64, -64, -64, -64, 64, -64, -64, -64, -64, 64, 64, -64, -64, -64, 64, 64, -64, -64, -64, -64, -64, 64, -64, -64, -64, -64, -64, -64, -64, -64, -64, 64, -64, -64, -64, -64, -64, -64, 64, -64, 64, 64, 64, -64, -64, -64, -64, -64, 64, -64, -64, -64, 64, -64, -64, -64, -64, -64, 64, -64, -64, -64, -64, -64, 64, 64, 64, 64, 64, 64, 64, -64, -64, -64, -64, -64, 64, -64, 64, 64, -64, -64, -64, -64, -64, -64, -64, -64, -64, -64, 64, 64, 64, 64, 64, 64, 64, 64, -64, -64, -64, -64, -64, -64, 64, 64, 64, -64, -64, -64, 64, 64, 64, 64, 64, -64, -64, -64, 64, 64, 64, 64, 64, 64, 64, -64, -64, -64, -64, -64, -64, -64, 64, -64, 64, 64, -64, -64, 64, 64, 64, 64, -64, -64, 64, 64, 64, 64, 64, 64, 64, 64, 64, 64, -64, -64, -64, -64, 64, -64, 64, -64, -64, -64, -64, -64, 64, 64, 64, 64, -64, -64, 64, -64, -64, 64, -64, -64, 64, 64, 64, -64, -64, -64, -64, -64, 64, 64, -64, -64, 64, -64, 64, -64, 64, 64, 64, -64, -64, -64, -64, -64, -64, -64, -64, -64, -64, -64, -64, 64, 64, -64, 64, -64, 64, 64, 64, 64, -64, 64, -64, 64, -64, 64, -64, -64, -64, -64, -64, -64, -64, -64, 64, -64, -64, 64, -64, 64, -64, -64, 64, 64, -64, 64, 64, -64, 64, 64, 64, -64, -64, 64, -64, 64, -64, -64, -64, 64, -64, -64, -64, -64, 64, -64, -64, -64, -64, -64, -64, -64, -64, -64, 64, -64, -64, 64, -64, -64, -64, -64, -64, 64, -64, -64, -64, 64, -64, -64, -64, -64, -64, 64, -64, -64, -64, -64, -64, -64, -64, -64, -64, -64, -64, 64, 64, -64, -64, -64, -64, -64, -64, -64, -64, -64, -64, 64, 64, -64, 64, -64, -64, -64, -64, -64, 64, 64, -64, -64, -64, -64, 64, -64, 64, 64, 64, -64, -64, -64, -64, -64, -64, -64, -64, -64, -64, 64, -64, -64, -64, -64, -64, -64, -64, -64, -64, -64, -64, -64, 64, 64, -64, 64, -64, -64, 64, -64, -64, -64, -64, -64, -64, -64, -64, -64, -64, -64, -64, -64, -64, -64, -64, -64, -64, -64, 64, -64, -64, 64, 64, 64, -64, -64, -64, -64, -64, 64, 64, -64, -64, -64, -64, -64, -64, 64, -64, -64, 64, -64, -64, 64, 64, -64, 64, -64, 64, 64, 64, 64, -64, -64, 64, 64, 64, -64, 64, -64, -64, -64, 64, 64, 64, -64, 64, 64, -64, 64, -64, -64, -64, 64, 64, 64, 64, -64, 64, 64, 64, -64, 64, 64, -64, -64, -64, 64, -64, 64, 64, 64, 64, -64, -64, 64, -64, 64, -64, 64, -64, -64, -64, -64, -64, 64, 64, -64, -64, 64, 64, -64, -64, -64, -64, 64, 64, 64, 64, 64, 64, 64, 64, 64, 64, 64, 64, -64, -64, -64, -64, -64, 64, -64, -64, -64, -64, 64, 64, 64, 64, 64, 64, -64, 64, 64, 64, 64, 64, 64, 64, 64, -64, 64, 64, 64, 64, -64, 64, -64, -64, -64, 64, 64, 64, 64, 64, 64, 64, 64, -64, 64, 64, 64, 64, 64, 64, 64, -64, 64, 64, 64, -64, 64, -64, 64, -64, -64, 64, 64, -64, 64, -64, 64, -64, -64, 64, -64, -64, -64, 64, 64, 64, 64, -64, -64, 64, 64, -64, 64, 64, -64, 64, 64, -64, 64, 64, -64, 64, 64, 64, -64, 64, -64, 64, -64, -64, 64, 64, -64, -64, 64, -64, 64, 64, -64, 64, -64, -64, 64, 64, 64, 64, 64, 64, -64, 64, -64, 64, -64, -64, 64, 64, 64, 64, 64, 64, 64, 64, 64, 64, 64, 64, 64, 64, 64, 64, 64, 64, -64, -64, 64, 64, -64, -64, -64, -64, -64, 64, 64, 64, 64, 64, 64, 64, 64, 64, 64, -64, -64, 64, 64, 64, 64, 64, 64, 64, 64, 64, -64, 64, 64, -64, 64, -64, 64, -64, -64, 64, 64, 64, 64, 64, 64, 64, 64, 64, -64, -64, 64, 64, 64, -64, -64, 64, -64, -64, 64, 64, -64, 64, 64, 64, 64, 64, -64, 64, -64, 64, 64, 64, 64, 64, 64, -64, -64, -64, -64, -64, -64, -64, -64, 64, -64, -64, 64, -64, 64, 64, -64, 64, -64, -64, 64, -64, -64, -64, 64, 64, 64, -64, -64, -64, -64, -64, 64, -64, -64, -64, -64, -64, 64, -64, -64, -64, -64, -64, -64, 64, -64, 64, -64, -64, -64, -64, 64, 64, -64, -64, -64, -64, -64, -64, -64, -64, -64, -64, -64, -64, -64, -64, -64, 64, -64, 64, 64, -64, -64, -64, -64, -64, -64, -64, -64, 64, 64, -64, -64, -64, -64, -64, -64, -64, -64, -64, -64, 64, 64, 64, 64, 64, 64, -64, 64, 64, -64, -64, 64, -64, -64, 64, -64, 64, -64, -64, -64, -64, -64, -64, -64, -64, -64, -64, -64, -64, -64, -64, 64, -64, 64, -64, -64, 64, -64, -64, -64, 64, -64, 64, 64, -64, -64, -64, -64, -64, -64, -64, -64, -64, -64, -64, -64, 64, -64, -64, -64, 64, -64, -64, -64, -64, -64, -64, 64, -64, -64, -64, 64, 64, -64, 64, -64, -64, -64, -64, -64, -64, -64, 64, -64, 64, -64, -64, -64, 64, 64, 64, 64, 64, -64, -64, -64, -64, -64, -64, 64, -64, -64, 64, -64, -64, -64, -64, -64, -64, 64, 64, 64, 64, 64, -64, -64, -64, -64, -64, -64, 64, -64, -64, -64, -64, -64, -64, 64, 64, 64, 64, -64, -64, -64, 64, -64, -64, 64, 64, 64, 64, 64, 64, -64, 64, 64, -64, -64, -64, -64, -64, -64, -64, -64, -64, -64, 64, -64, -64, 64, 64, -64, 64, -64, 64, -64, -64, -64, 64, 64, 64, 64, 64, -64, -64, 64, 64, 64, -64, -64, -64, -64, 64, -64, 64, -64, 64, 64, 64, -64, -64, 64, 64, -64, 64, -64, 64, 64, 64, 64, -64, -64, 64, 64, -64, -64, 64, -64, -64, -64, 64, 64, -64, 64, -64, -64, 64, 64, 64, -64, -64, -64, -64, -64, 64, 64, -64, 64, -64, -64, 64, -64, 64, -64, -64, -64, 64, 64, -64, -64, 64, -64, -64, -64, 64, 64, -64, -64, -64, 64, 64, -64, -64, 64, 64, 64, -64, -64, -64, -64, -64, -64, 64, -64, -64, -64, -64, 64, 64, 64, 64, 64, 64, 64, -64, -64, -64, 64, -64, -64, 64, -64, 64, 64, 64, 64, -64, 64, -64, -64, 64, 64, 64, 64, 64, -64, 64, -64, -64, 64, 64, -64, 64, -64, 64, 64, 64, -64, 64, 64, 64, 64, 64, 64, -64, -64, -64, -64, 64, 64, 64, 64, -64, -64, 64, -64, -64, 64, 64, -64, 64, -64, -64, -64, -64, -64, -64, 64, -64, 64, 64, -64, -64, -64, -64, -64, 64, 64, 64, -64, -64, -64, -64, -64, -64, 64, -64, -64, 64, 64, -64, -64, 64, -64, -64, -64, 64, 64, -64, 64, 64, -64, 64, -64, 64, 64, 64, 64, -64, -64, -64, -64, -64, -64, 64, -64, -64, -64, 64, -64, -64, -64, -64, -64, 64, -64, 64, 64, 64, 64, -64, 64, 64, 64, 64, 64, 64, -64, -64, -64, -64, -64, -64, -64, -64, -64, -64, -64, 64, -64, -64, -64, -64, -64, 64, -64, 64, -64, 64, -64, 64, 64, -64, -64, -64, -64, -64, -64, -64, -64, -64, -64, -64, -64, -64, -64, 64, -64, -64, 64, -64, -64, -64, 64, 64, 64, -64, -64, -64, -64, -64, -64, -64, -64, -64, -64, -64, -64, -64, 64, 64, -64, -64, 64, -64, -64, -64, -64, 64, -64, 64, 64, 64, -64, -64, -64, -64, -64, -64, 64, -64, -64, -64, -64, -64, -64, 64, -64, -64, -64, -64, -64, -64, 64, 64, -64, 64, 64, -64, -64, 64, 64, 64, 64, 64, 64, 64, 64, -64, 64, -64, -64, 64, -64, -64, -64, -64, -64, -64, 64, 64, -64, -64, 64, 64, 64, -64, -64, 64, -64, -64, -64, -64, 64, 64, 64, -64, 64, -64, 64, -64, 64, 64, -64, 64, -64, -64, 64, -64, -64, 64, 64, 64, 64, -64, 64, 64, -64, 64, 64, -64, -64, 64, -64, 64, -64, 64, 64, 64, 64, -64, 64, 64, -64, -64, -64, -64, 64, -64, -64, -64, -64, -64, -64, 64, 64, 64, -64, -64, -64, 64, 64, 64, 64, 64, 64, 64, 64, -64, -64, 64, 64, -64, 64, -64, -64, 64, -64, -64, 64, -64, 64, -64, -64, 64, 64, 64, -64, 64, 64, 64, 64, 64, 64, 64, 64, 64, 64, 64, 64, 64, 64, 64, 64, 64, -64, -64, 64, -64, -64, 64, -64, -64, 64, 64, -64, -64, 64, -64, 64, 64, 64, 64, 64, 64, -64, -64, 64, 64, 64, 64, 64, 64, -64, -64, 64, 64, 64, 64, -64, -64, 64, -64, -64, -64, -64, -64, 64, -64, 64, 64, 64, 64, 64, 64, 64, 64, 64, 64, 64, -64, -64, -64, -64, 64, 64, 64, -64, 64, 64, -64, -64, -64, 64, 64, -64, 64, 64, 64, 64, 64, -64, -64, 64, 64, 64, 64, 64, -64, 64, -64, -64, 64, -64, 64, 64, 64, -64, -64, -64, -64, -64, -64, 64, 64, 64, 64, 64, -64, -64, -64, 64, 64, 64, 64, 64, 64, 64, -64, -64, -64, 64, -64, 64, 64, 64, -64, -64, -64, -64, 64, 64, 64, 64, 64, 64, 64, -64, -64, -64, -64, 64, 64, 64, 64, -64, 64, 64, 64, 64, 64, 64, -64, -64, -64, -64, -64, 64, 64, 64, 64, -64, 64, -64, -64, -64, -64, -64, -64, -64, 64, 64, -64, -64, 64, 64, 64, -64, -64, -64, -64, -64, -64, -64, -64, 64, 64, 64, 64, -64, 64, -64, -64, -64, -64, -64, 64, 64, 64, 64, 64, 64, 64, 64, 64, -64, 64, -64, -64, -64, -64, -64, -64, -64, 64, 64, 64, -64, 64, -64, -64, -64, -64, -64, -64, -64, 64, -64, -64, 64, 64, 64, 64, -64, -64, -64, 64, 64, -64, -64, -64, 64, 64, 64, 64, 64, 64, -64, -64, -64, -64, 64, 64, 64, -64, -64, -64, 64, 64, 64, 64, -64, -64, -64, 64, -64, -64, 64, 64, -64, 64, 64, 64, 64, 64, 64, -64, -64, 64, 64, -64, 64, 64, -64, -64, 64, 64, 64, -64, 64, 64, -64, 64, -64, -64, -64, -64, -64, 64, 64, 64, 64, 64, 64, 64, 64, 64, 64, 64, 64, -64, 64, 64, 64, 64, -64, -64, -64, 64, 64, -64, -64, -64, -64, -64, -64, -64, 64, 64, -64, 64, 64, 64, 64, 64, 64, 64, -64, -64, 64, -64, 64, 64, -64, -64, -64, 64, -64, -64, -64, -64, -64, -64, -64, -64, 64, 64, -64, 64, 64, 64, 64, 64, 64, -64, 64, -64, 64, 64, 64, 64, -64, -64, -64, 64, 64, -64, -64, -64, -64, -64, -64, -64, -64, -64, -64, 64, 64, 64, 64, -64, -64, -64, -64, -64, -64, -64, 64, -64, 64, 64, -64, 64, -64, -64, -64, -64, -64, -64, -64, -64, -64, 64, 64, 64, -64, 64, -64, -64, 64, 64, 64, 64, -64, -64, -64, -64, -64, -64, -64, 64, 64, -64, -64, -64, -64, 64, -64, -64, 64, 64, 64, 64, 64, -64, 64, -64, -64, 64, 64, 64, 64, -64, -64, -64, 64, -64, -64, -64, -64, 64, -64, -64, -64, -64, -64, -64, 64, 64, 64, 64, 64, 64, 64, -64, 64, 64, 64, 64, -64, -64, -64, 64, -64, -64, 64, 64, -64, -64, 64, -64, -64, -64, -64, -64, 64, 64, 64, 64, 64, 64, 64, -64, -64, 64, 64, -64, -64, 64, -64, -64, 64, -64, -64, -64, 64, -64, 64, -64, -64, 64, -64, 64, 64, 64, 64, 64, 64, 64, -64, -64, -64, 64, 64, -64, -64, -64, -64, 64, -64, 64, -64, 64, -64, 64, 64, -64, -64, -64, -64, -64, -64, 64, 64, 64, 64, 64, 64, -64, 64, 64, 64, 64, 64, -64, -64, -64, -64, 64, 64, 64, 64, 64, -64, -64, -64, -64, -64, 64, 64, 64, 64, 64, 64, 64, -64, -64, 64, -64, 64, 64, -64, -64, -64, -64, 64, 64, 64, 64, 64, -64, -64, -64, -64, 64, 64, -64, -64, -64, -64, -64, -64, 64, -64, 64, -64, -64, -64, 64, -64, -64, -64, 64, 64, -64, -64, -64, -64, 64, -64, -64, 64, 64, 64, 64, 64, -64, -64, -64, -64, -64, 64, 64, -64, -64, -64, -64, -64, 64, -64, -64, -64, 64, -64, 64, 64, 64, -64, 64, -64, -64, -64, -64, -64, -64, -64, -64, -64, 64, 64, 64, 64, 64, 64, -64, 64, 64, 64, -64, -64, 64, 64, 64, 64, 64, -64, -64, -64, 64, 64, -64, -64, 64, 64, -64, 64, -64, -64, -64, 64, 64, -64, -64, -64, -64, 64, 64, 64, 64, -64, 64, 64, -64, -64, 64, 64, 64, -64, -64, 64, -64, 64, 64, -64, 64, -64, -64, 64, -64, 64, -64, 64, 64, 64, -64, -64, 64, -64, 64, 64, 64, 64, -64, 64, -64, 64, 64, 64, -64, -64, -64, 64, 64, -64, -64, -64, -64, -64, -64, -64, 64, -64, 64, -64, 64, 64, 64, 64, 64, 64, -64, -64, 64, 64, -64, -64, 64, -64, 64, -64, -64, 64, -64, 64, -64, 64, 64, -64, -64, -64, 64, -64, 64, -64, 64, -64, -64, -64, 64, -64, -64, -64, -64, -64, -64, -64, -64, -64, -64, -64, -64, -64, -64, 64, -64, -64, 64, 64, -64, 64, 64, -64, 64, -64, -64, 64, 64, -64, -64, -64, -64, -64, -64, -64, -64, -64, -64, -64, -64, -64, -64, -64, -64, -64, -64, -64, -64, -64, -64, 64, -64, -64, 64, 64, -64, -64, 64, 64, 64, -64, -64, -64, -64, -64, -64, -64, 64, -64, -64, -64, -64, -64, -64, -64, -64, -64, -64, 64, 64, -64, -64, 64, 64, 64, 64, 64, -64, -64, -64, -64, -64, -64, -64, -64, 64, 64, -64, 64, -64, 64, -64, -64, -64, -64, -64, -64, 64, -64, -64, 64, 64, 64, 64, 64, 64, 64, 64, -64, 64, -64, 64, -64, -64, 64, -64, -64, -64, -64, 64, -64, -64, -64, -64, -64, -64, 64, 64, 64, 64, 64, 64, 64, 64, 64, -64, 64, -64, 64, 64, 64, 64, -64, 64, 64, 64, 64, -64, 64, -64, -64, 64, -64, -64, -64, -64, 64, 64, 64, 64, 64, 64, 64, 64, 64, 64, 64, 64, 64, -64, -64, 64, -64, -64, -64, -64, -64, -64, -64, 64, -64, 64, 64, -64, -64, 64, 64, 64, 64, 64, -64, 64, 64, 64, 64, 64, 64, 64, -64, -64, 64, -64, -64, 64, -64, -64, -64, 64, 64, 64, -64, 64, -64, -64, -64, 64, -64, -64, 64, -64, -64, -64, -64, -64, 64, 64, -64, 64, -64, -64, -64, -64, -64, -64, -64, -64, 64, 64, 64, -64, -64, -64, -64, -64, -64, -64, -64, -64, -64, -64, -64, -64, -64, 64, 64, -64, -64, -64, -64, -64, -64, -64, 64, 64, 64, 64, -64, 64, -64, -64, -64, -64, -64, -64, -64, -64, -64, -64, -64, -64, -64, -64, -64, -64, -64, -64, -64, -64, -64, -64, 64, 64, 64, -64, 64, -64, -64, -64, -64, -64, -64, -64, -64, -64, -64, -64, -64, -64, 64, -64, -64, 64, 64, 64, -64, 64, 64, 64, 64, 64, -64, 64, -64, -64, -64, -64, -64, -64, -64, -64, -64, -64, -64, -64, -64, 64, 64, -64, -64, -64, 64, 64, 64, 64, 64, 64, 64, -64, -64, -64, 64, -64, 64, -64, -64, -64, -64, -64, 64, -64, -64, -64, -64, -64, -64, 64, 64, -64, 64, 64, 64, 64, 64, 64, 64, 64, -64, -64, -64, 64, -64, -64, -64, -64, -64, -64, -64, -64, 64, 64, 64, -64, 64, -64, -64, -64, -64, -64, -64, -64, 64, 64, -64, 64, -64, -64, -64, 64, -64, -64, -64, -64, -64, -64, -64, 64, -64, -64, 64, 64, -64, -64, -64, -64, -64, -64, -64, -64, -64, -64, 64, -64, 64, 64, -64, -64, -64, -64, -64, -64, -64, -64, -64, 64, 64, 64, 64, 64, 64, -64, 64, -64, -64, -64, -64, -64, -64, -64, 64, 64, -64, 64, 64, -64, -64, -64, -64, -64, -64, -64, -64, 64, 64, 64, 64, 64, -64, -64, -64, -64, -64, -64, -64, 64, 64, -64, -64, 64, 64, 64, 64, 64, -64, -64, -64, -64, -64, -64, 64, 64, 64, 64, -64, 64, -64, -64, -64, -64, -64, -64, -64, -64, 64, 64, -64, -64, 64, 64, 64, -64, -64, -64, -64, -64, 64, 64, 64, 64, 64, -64, 64, -64, 64, -64, -64, -64, -64, -64, -64, -64, -64, -64, 64, 64, -64, 64, 64, 64, -64, -64, -64, 64, 64, 64, 64, 64, 64, 64, -64, -64, 64, 64, -64, -64, -64, -64, 64, -64, -64, -64, 64, 64, 64, -64, -64, 64, 64, -64, -64, -64, 64, 64, 64, -64, 64, -64, -64, -64, -64, -64, -64, 64, 64, 64, -64, 64, -64, 64, 64, 64, 64, 64, -64, -64, 64, -64, -64, 64, 64, 64, 64, -64, 64, -64, -64, -64, -64, 64, -64, 64, 64, -64, -64, -64, -64, 64, 64, 64, -64, 64, -64, -64, -64, -64, -64, 64, -64, 64, -64, -64, -64, -64, -64, -64, 64, -64, -64, 64, 64, -64, -64, -64, -64, -64, 64, -64, -64, -64, -64, -64, 64, -64, 64, 64, 64, 64, 64, 64, 64, 64, -64, -64, 64, -64, 64, -64, 64, -64, -64, 64, -64, -64, 64, -64, -64, 64, 64, 64, -64, 64, 64, -64, -64, 64, -64, 64, 64, -64, -64, -64, -64, 64, -64, -64, 64, 64, 64, 64, -64, -64, -64, 64, -64, -64, -64, 64, 64, 64, 64, -64, 64, 64, -64, -64, 64, -64, 64, -64, 64, 64, -64, 64, 64, 64, 64, 64, 64, -64, -64, 64, 64, -64, 64, -64, 64, -64, -64, -64, 64, 64, -64, -64, -64, -64, -64, -64, 64, -64, -64, -64, -64, 64, 64, 64, -64, 64, -64, -64, 64, -64, -64, -64, 64, -64, 64, -64, -64, -64, -64, 64, -64, 64, -64, -64, 64, -64, -64, -64, -64, 64, -64, 64, 64, 64, 64, 64, 64, -64, 64, -64, 64, -64, -64, -64, -64, -64, -64, 64, 64, -64, -64, -64, -64, 64, -64, -64, -64, -64, 64, -64, 64, 64, -64, -64, 64, 64, 64, 64, 64, -64, -64, -64, 64, 64, 64, -64, -64, -64, -64, -64, -64, -64, -64, -64, -64, -64, 64, 64, 64, -64, -64, 64, -64, 64, 64, -64, -64, -64, -64, -64, 64, -64, -64, -64, -64, 64, -64, -64, -64, -64, -64, -64, 64, -64, -64, -64, -64, -64, -64, -64, 64, -64, -64, 64, -64, 64, -64, 64, -64, 64, 64, -64, -64, 64, -64, -64, 64, -64, -64, -64, -64, -64, 64, -64, -64, -64, -64, -64, -64, 64, 64, -64, -64, 64, 64, -64, 64, -64, -64, 64, 64, 64, -64, -64, -64, -64, -64, -64, -64, 64, -64, -64, -64, -64, 64, 64, 64, 64, -64, 64, -64, -64, 64, -64, 64, -64, -64, 64, -64, 64, -64, -64, 64, -64, -64, -64, 64, -64, -64, -64, -64, -64, 64, -64, 64, 64, 64, -64, 64, -64, 64, -64, 64, -64, -64, 64, -64, -64, -64, -64, -64, -64, -64, -64, -64, -64, 64, 64, -64, 64, -64, -64, -64, 64, 64, -64, 64, -64, 64, 64, 64, 64, -64, 64, 64, -64, -64, -64, 64, -64, -64, 64, -64, 64, 64, -64, -64, 64, 64, 64, 64, -64, -64, 64, 64, -64, -64, -64, -64, 64, 64, 64, -64, 64, -64, -64, 64, -64, -64, 64, 64, 64, 64, 64, 64, -64, 64, 64, 64, 64, 64, -64, 64, -64, 64, 64, -64, 64, 64, -64, -64, -64, 64, -64, -64, 64, 64, 64, -64, -64, 64, 64, 64, -64, -64, -64, -64, -64, 64, 64, 64, 64, -64, -64, 64, -64, -64, -64, -64, -64, 64, -64, 64, 64, 64, 64, -64, -64, 64, 64, 64, -64, -64, -64, 64, 64, -64, 64, 64, 64, 64, -64, -64, -64, -64, -64, -64, -64, -64, 64, -64, 64, -64, -64, -64, -64, -64, -64, -64, -64, -64, -64, -64, -64, -64, -64, -64, -64, -64, 64, -64, -64, -64, -64, -64, -64, 64, -64, -64, 64, -64, -64, -64, -64, -64, -64, -64, 64, -64, -64, -64, 64, 64, -64, -64, -64, -64, -64, -64, -64, -64, 64, -64, 64, 64, -64, -64, 64, 64, 64, 64, 64, 64, -64, -64, 64, 64, -64, -64, 64, 64, -64, -64, -64, -64, -64, 64, -64, -64, 64, 64, -64, 64, 64, 64, -64, -64, -64, -64, -64, -64, -64, -64, 64, 64, 64, -64, 64, 64, -64, -64, -64, -64, -64, -64, -64, -64, -64, -64, -64, 64, -64, -64, -64, -64, -64, -64, 64, -64, 64, -64, 64, 64, 64, -64, -64, -64, 64, -64, -64, 64, -64, -64, -64, -64, -64, -64, -64, -64, -64, -64, -64, -64, -64, -64, -64, 64, -64, -64, 64, -64, 64, -64, 64, 64, 64, 64, -64, 64, -64, -64, -64, -64, 64, -64, -64, -64, -64, -64, -64, -64, -64, -64, -64, -64, 64, -64, -64, -64, -64, -64, 64, 64, -64, -64, 64, 64, -64, -64, -64, 64, -64, -64, -64, -64, -64, 64, -64, 64, -64, -64, -64, -64, 64, 64, 64, -64, -64, 64, -64, 64, 64, 64, -64, -64, 64, -64, -64, -64, -64, -64, -64, -64, -64, -64, -64, -64, -64, -64, -64, 64, 64, 64, 64, 64, -64, -64, 64, -64, 64, 64, 64, 64, -64, -64, -64, -64, 64, -64, -64, 64, -64, 64, 64, -64, 64, 64, 64, 64, 64, 64, 64, -64, -64, 64, -64, 64, -64, 64, -64, 64, -64, 64, 64, 64, 64, -64, 64, 64, -64, 64, 64, -64, 64, -64, -64, 64, -64, -64, 64, 64, 64, 64, 64, -64, -64, -64, 64, -64, 64, -64, 64, -64, -64, -64, -64, 64, -64, -64, 64, -64, 64, 64, 64, 64, -64, 64, -64, 64, 64, 64, 64, 64, -64, 64, 64, -64, -64, 64, 64, -64, 64, 64, 64, 64, 64, -64, 64, 64, -64, 64, -64, -64, -64, -64, -64, 64, 64, -64, -64, -64, 64, 64, -64, -64, -64, 64, -64, -64, 64, 64, -64, -64, -64, -64, -64, 64, -64, 64, 64, 64, -64, 64, 64, 64, 64, -64, 64, 64, -64, -64, -64, -64, 64, 64, 64, 64, 64, -64, 64, 64, 64, 64, 64, -64, 64, 64, 64, -64, 64, -64, 64, -64, -64, 64, 64, 64, 64, 64, 64, 64, 64, -64, 64, -64, -64, -64, 64, 64, 64, 64, -64, 64, 64, -64, -64, -64, -64, -64, -64, 64, 64, -64, 64, 64, -64, -64, 64, -64, -64, 64, -64, 64, 64, 64, -64, 64, -64, -64, 64, 64, -64, -64, -64, -64, 64, -64, 64, 64, -64, 64, -64, 64, -64, 64, 64, -64, -64, -64, -64, -64, -64, -64, 64, -64, -64, 64, 64, 64, 64, -64, -64, -64, -64, -64, -64, -64, 64, 64, -64, -64, -64, -64, 64, -64, -64, -64, -64, 64, -64, -64, -64, -64, -64, -64, -64, -64, 64, -64, -64, -64, 64, 64, 64, 64, 64, -64, -64, 64, -64, 64, 64, 64, 64, 64, 64, -64, -64, 64, 64, -64, -64, -64, 64, -64, 64, 64, 64, -64, -64, 64, 64, 64, 64, 64, 64, 64, -64, -64, 64, -64, 64, 64, -64, -64, 64, -64, -64, 64, 64, -64, 64, -64, 64, -64, 64, -64, -64, -64, 64, 64, 64, 64, 64, 64, 64, -64, -64, 64, 64, 64, -64, 64, -64, -64, -64, -64, -64, -64, -64, 64, -64, -64, 64, -64, 64, 64, 64, -64, 64, 64, 64, -64, -64, -64, 64, 64, -64, -64, 64, -64, -64, -64, 64, -64, -64, -64, -64, -64, -64, 64, 64, -64, 64, -64, -64, 64, 64, 64, -64, -64, 64, -64, -64, -64, -64, -64, -64, -64, 64, -64, -64, 64, -64, -64, -64, 64, -64, 64, 64, -64, -64, 64, -64, 64, -64, 64, 64, -64, 64, -64, -64, 64, -64, -64, -64, -64, -64, -64, -64, 64, 64, 64, -64, -64, 64, -64, -64, 64, -64, 64, 64, 64, 64, 64, -64, -64, -64, -64, 64, 64, -64, -64, 64, -64, 64, 64, -64, -64, 64, -64, -64, -64, -64, -64, -64, -64, -64, 64, -64, -64, -64, 64, -64, -64, 64, 64, 64, 64, -64, -64, -64, -64, -64, 64, -64, -64, 64, 64, -64, -64, -64, 64, -64, -64, -64, 64, -64, -64, -64, -64, 64, 64, -64, 64, 64, 64, 64, -64, 64, -64, -64, -64, -64, -64, 64, -64, -64, -64, 64, -64, -64, -64, 64, 64, 64, -64, 64, 64, 64, 64, -64, 64, -64, 64, 64, 64, -64, -64, -64, 64, -64, -64, -64, -64, -64, -64, 64, -64, 64, -64, -64, 64, -64, -64, -64, 64, -64, -64, 64, 64, -64, 64, -64, 64, -64, 64, -64, -64, -64, -64, -64, 64, -64, -64, -64, -64, -64, -64, 64, -64, -64, 64, -64, 64, 64, -64, 64, -64, 64, -64, -64, -64, 64, -64, 64, 64, 64, 64, -64, 64, -64, -64, -64, 64, 64, 64, -64, -64, -64, -64, -64, 64, 64, 64, 64, -64, -64, -64, -64, -64, 64, 64, -64, -64, -64, -64, -64, -64, 64, -64, -64, -64, -64, 64, -64, -64, -64, 64, 64, 64, 64, 64, -64, -64, -64, 64, -64, -64, -64, -64, -64, -64, -64, -64, 64, -64, 64, -64, -64, 64, -64, -64, 64, 64, -64, 64, -64, 64, -64, 64, -64, 64, -64, -64, 64, 64, 64, -64, -64, -64, -64, 64, -64, -64, -64, -64, -64, 64, -64, 64, -64, -64, -64, -64, -64, -64, -64, -64, -64, 64, 64, 64, 64, -64, -64, 64, -64, -64, -64, -64, -64, -64, 64, 64, 64, 64, -64, -64, 64, -64, -64, -64, 64, 64, -64, 64, 64, -64, 64, 64, 64, 64, -64, 64, 64, -64, -64, -64, -64, -64, 64, -64, -64, -64, -64, -64, 64, -64, 64, 64, 64, 64, -64, -64, 64, 64, -64, -64, 64, 64, 64, -64, -64, -64, -64, -64, 64, -64, -64, -64, 64, -64, -64, -64, -64, -64, -64, 64, -64, -64, 64, 64, -64, 64, -64, -64, 64, 64, -64, 64, 64, 64, -64, -64, -64, 64, 64, -64, 64, 64, 64, -64, -64, -64, -64, -64, 64, 64, 64, 64, 64, -64, -64, 64, 64, 64, -64, -64, -64, -64, 64, 64, 64, 64, -64, -64, 64, -64, 64, 64, -64, -64, -64, -64, -64, -64, 64, -64, -64, -64, 64, -64, -64, 64, -64, -64, 64, 64, -64, -64, -64, 64, 64, -64, -64, 64, -64, 64, -64, 64, -64, 64, -64, 64, 64, 64, -64, -64, 64, -64, 64, -64, 64, -64, -64, -64, -64, -64, -64, 64, 64, -64, 64, -64, 64, -64, 64, 64, 64, 64, -64, 64, 64, 64, 64, 64, 64, 64, 64, 64, -64, 64, 64, -64, -64, 64, 64, -64, 64, 64, -64, -64, 64, 64, -64, -64, 64, 64, 64, 64, -64, 64, 64, -64, 64, 64, 64, -64, -64, -64, 64, -64, 64, -64, 64, 64, -64, 64, -64, -64, 64, -64, -64, -64, -64, -64, 64, -64, 64, -64, -64, 64, 64, -64, -64, 64, 64, 64, -64, 64, -64, 64, -64, -64, 64, -64, -64, 64, 64, 64, 64, 64, -64, 64, -64, -64, -64, -64, 64, -64, -64, -64, -64, -64, 64, 64, -64, 64, -64, 64, 64, -64, 64, -64, 64, 64, 64, -64, 64, -64, -64, 64, -64, 64, -64, -64, 64, -64, -64, -64, 64, 64, 64, 64, -64, 64, 64, 64, -64, 64, -64, -64, 64, 64, 64, -64, 64, 64, -64, -64, 64, 64, -64, -64, -64, -64, 64, 64, 64, 64, 64, 64, 64, 64, 64, 64, 64, 64, 64, 64, 64, 64, 64, 64, -64, -64, 64, 64, -64, -64, 64, -64, -64, 64, 64, -64, 64, -64, 64, 64, 64, 64, 64, 64, 64, 64, 64, 64, 64, 64, 64, 64, 64, 64, -64, 64, -64, -64, -64, 64, 64, 64, -64, 64, -64, -64, -64, -64, 64, 64, 64, 64, -64, -64, 64, 64, 64, 64, 64, -64, 64, 64, -64, -64, 64, 64, 64, -64, 64, -64, -64, -64, -64, -64, 64, 64, -64, 64, 64, 64, -64, -64, 64, -64, -64, 64, 64, -64, 64, 64, 64, 64, -64, -64, -64, -64, -64, -64, -64, 64, -64, -64, -64, 64, -64, -64, -64, -64, -64, 64, 64, -64, -64, -64, -64, 64, 64, 64, 64, 64, 64, -64, 64, -64, -64, -64, -64, -64, -64, -64, -64, -64, -64, -64, -64, 64, 64, 64, 64, 64, -64, -64, -64, -64, -64, 64, -64, 64, 64, -64, 64, -64, -64, -64, -64, 64, -64, -64, -64, -64, 64, -64, -64, -64, 64, -64, -64, -64, -64, 64, 64, 64, 64, 64, -64, -64, -64, -64, 64, 64, -64, -64, 64, 64, -64, -64, -64, 64, 64, 64, 64, 64, 64, 64, 64, -64, -64, -64, 64, 64, 64, 64, -64, -64, 64, -64, -64, -64, 64, 64, 64, 64, -64, -64, -64, 64, 64, 64, 64, 64, 64, 64, -64, -64, -64, 64, 64, 64, 64, -64, -64, -64, 64, -64, -64, 64, -64, 64, 64, -64, 64, -64, -64, 64, 64, 64, 64, 64, 64, 64, 64, 64, 64, -64, -64, 64, 64, -64, -64, -64, 64, -64, -64, 64, 64, -64, 64, -64, 64, 64, 64, 64, 64, 64, 64, 64, 64, -64, 64, 64, -64, -64, -64, -64, 64, -64, -64, 64, -64, 64, 64, -64, -64, 64, 64, 64, 64, -64, -64, 64, 64, 64, 64, 64, 64, 64, 64, -64, -64, 64, 64, -64, -64, 64, -64, -64, -64, -64, -64, 64, 64, 64, 64, 64, -64, 64, 64, -64, 64, -64, 64, -64, 64, 64, 64, -64, -64, -64, 64, 64, 64, 64, 64, -64, 64, -64, 64, 64, -64, 64, 64, 64, 64, 64, 64, 64, 64, 64, 64, -64, -64, 64, 64, 64, -64, -64, 64, 64, 64, 64, 64, -64, 64, -64, 64, 64, 64, -64, 64, -64, -64, 64, 64, 64, 64, 64, 64, 64, 64, 64, 64, -64, -64, 64, 64, 64, 64, 64, 64, -64, -64, -64, -64, 64, -64, -64, 64, 64, 64, 64, 64, 64, 64, -64, -64, 64, 64, 64, -64, 64, 64, 64, 64, 64, 64, 64, -64, 64, 64, 64, -64, 64, -64, 64, 64, 64, 64, 64, 64, 64, 64, 64, 64, 64, 64, 64, -64, -64, 64, 64, 64, 64, 64, 64, 64, 64, -64, 64, 64, -64, -64, 64, -64, 64, 64, 64, 64, -64, 64, -64, 64, 64, 64, -64, 64, -64, 64, -64, 64, 64, -64, -64, 64, -64, 64, -64, -64, 64, -64, -64, 64, -64, 64, 64, 64, 64, -64, 64, 64, 64, 64, 64, -64, -64, -64, -64, 64, 64, 64, -64, -64, 64, -64, 64, 64, 64, -64, 64, 64, 64, 64, 64, -64, 64, -64, 64, 64, 64, -64, 64, 64, -64, -64, 64, 64, 64, 64, 64, 64, 64, 64, 64, 64, 64, -64, -64, -64, 64, 64, -64, -64, -64, -64, 64, 64, -64, -64, -64, -64, -64, -64, 64, 64, 64, 64, 64, -64, 64, -64, -64, -64, -64, -64, -64, -64, 64, 64, -64, -64, -64, -64, -64, -64, -64, -64, 64, -64, -64, -64, 64, 64, 64, 64, 64, -64, 64, 64, -64, -64, 64, 64, 64, -64, 64, 64, -64, -64, -64, -64, 64, 64, -64, -64, 64, 64, 64, -64, -64, -64, 64, 64, 64, -64, 64, 64, -64, 64, 64, -64, 64, 64, 64, -64, -64, -64, 64, 64, 64, 64, -64, -64, -64, -64, -64, 64, -64, -64, 64, -64, 64, 64, -64, 64, -64, -64, 64, 64, -64, 64, -64, 64, -64, 64, -64, 64, 64, -64, 64, 64, 64, -64, 64, -64, 64, -64, -64, -64, -64, -64, 64, 64, -64, -64, 64, 64, -64, 64, -64, 64, 64, 64, 64, 64, -64, -64, 64, -64, -64, -64, -64, -64, 64, -64, 64, 64, -64, 64, 64, -64, 64, -64, -64, 64, 64, 64, -64, -64, -64, -64, 64, -64, -64, -64, -64, -64, 64, -64, 64, 64, 64, 64, 64, 64, 64, 64, -64, 64, -64, 64, 64, 64, -64, -64, 64, 64, 64, 64, -64, 64, -64, -64, -64, -64, 64, 64, -64, 64, 64, 64, 64, 64, -64, -64, -64, -64, -64, 64, 64, 64, -64, 64, -64, 64, 64, 64, -64, 64, 64, -64, -64, -64, 64, 64, -64, 64, -64, 64, -64, -64, 64, -64, 64, 64, -64, -64, -64, 64, 64, 64, 64, -64, -64, -64, 64, -64, -64, 64, -64, -64, -64, -64, 64, -64, 64, -64, -64, 64, 64, -64, 64, -64, -64, -64, 64, -64, 64, -64, -64, -64, -64, -64, -64, -64, -64, -64, -64, -64, 64, -64, -64, -64, -64, -64, -64, -64, -64, -64, -64, -64, 64, 64, 64, -64, -64, -64, 64, -64, -64, -64, -64, -64, -64, -64, -64, -64, -64, -64, -64, -64, -64, -64, -64, 64, -64, -64, 64, 64, -64, -64, 64, -64, -64, 64, 64, -64, -64, -64, -64, -64, -64, -64, -64, 64, 64, 64, -64, -64, -64, -64, -64, -64, -64, -64, -64, -64, -64, 64, 64, 64, -64, -64, -64, 64, -64, 64, -64, 64, -64, -64, -64, -64, 64, -64, -64, -64, -64, -64, -64, -64, -64, 64, -64, -64, -64, 64, -64, 64, -64, -64, -64, 64, 64, 64, 64, 64, 64, -64, -64, 64, -64, 64, -64, -64, -64, 64, -64, 64, -64, 64, 64, 64, 64, -64, -64, 64, -64, -64, -64, 64, -64, -64, 64, -64, -64, -64, -64, -64, 64, -64, -64, 64, 64, 64, -64, -64, -64, -64, 64, -64, -64, 64, -64, -64, 64, -64, -64, -64, -64, -64, -64, -64, -64, -64, 64, 64, -64, -64, 64, -64, -64, -64, -64, -64, -64, -64, 64, 64, 64, 64, -64, -64, -64, -64, 64, 64, -64, 64, -64, -64, 64, -64, 64, 64, -64, -64, -64, -64, -64, -64, 64, -64, -64, -64, -64, 64, 64, 64, -64, -64, 64, -64, -64, -64, -64, -64, -64, -64, -64, 64, 64, -64, 64, 64, 64, -64, -64, -64, -64, -64, -64, -64, -64, -64, 64, -64, -64, 64, 64, 64, 64, -64, -64, -64, -64, 64, 64, 64, 64, -64, -64, 64, -64, -64, -64, 64, -64, 64, -64, -64, -64, 64, -64, -64, -64, 64, -64, 64, -64, -64, -64, 64, 64, -64, 64, -64, -64, -64, 64, -64, -64, -64, -64, -64, -64, -64, -64, -64, -64, -64, -64, 64, 64, -64, 64, 64, -64, -64, -64, -64, 64, 64, 64, -64, -64, -64, 64, 64, 64, -64, -64, -64, 64, 64, -64, -64, -64, 64, 64, 64, -64, 64, 64, 64, 64, -64, -64, -64, 64, -64, 64, -64, -64, 64, 64, -64, -64, -64, -64, -64, -64, -64, 64, 64, 64, 64, 64, 64, 64, 64, 64, 64, -64, -64, 64, -64, 64, -64, 64, -64, -64, 64, 64, -64, -64, -64, -64, -64, 64, -64, -64, 64, 64, 64, 64, -64, 64, -64, 64, -64, -64, -64, -64, -64, 64, 64, 64, 64, 64, -64, -64, -64, -64, -64, -64, -64, 64, 64, -64, 64, 64, -64, 64, 64, 64, 64, -64, 64, -64, -64, 64, -64, -64, -64, -64, 64, -64, 64, -64, 64, -64, -64, -64, 64, -64, -64, 64, 64, 64, 64, -64, -64, 64, -64, -64, 64, 64, -64, -64, -64, -64, -64, -64, -64, 64, -64, -64, -64, -64, 64, -64, 64, -64, 64, 64, 64, 64, 64, -64, -64, -64, 64, 64, -64, -64, 64, 64, -64, 64, -64, -64, -64, -64, -64, -64, -64, -64, 64, 64, 64, -64, -64, -64, -64, 64, 64, -64, -64, -64, 64, 64, 64, -64, 64, 64, 64, -64, 64, -64, 64, -64, -64, 64, -64, -64, -64, 64, 64, -64, 64, 64, -64, -64, -64, 64, 64, -64, 64, 64, -64, 64, -64, -64, -64, 64, 64, -64, -64, -64, 64, -64, -64, -64, 64, -64, 64, 64, -64, -64, 64, -64, -64, 64, -64, -64, -64, 64, 64, 64, -64, 64, 64, 64, -64, -64, 64, 64, -64, 64, 64, 64, -64, 64, -64, 64, 64, -64, 64, -64, 64, 64, 64, 64, 64, 64, -64, 64, 64, 64, 64, 64, -64, -64, 64, -64, -64, -64, -64, 64, 64, -64, 64, -64, 64, 64, -64, -64, -64, 64, 64, 64, 64, 64, -64, -64, -64, 64, -64, 64, 64, -64, 64, -64, -64, 64, 64, -64, -64, -64, -64, 64, 64, 64, -64, 64, -64, 64, 64, -64, 64, -64, 64, 64, -64, -64, -64, -64, -64, 64, -64, -64, -64, -64, -64, -64, 64, -64, -64, -64, -64, 64, -64, 64, -64, 64, -64, 64, -64, 64, 64, 64, 64, 64, -64, -64, -64, 64, -64, 64, -64, -64, -64, 64, -64, -64, -64, -64, -64, -64, 64, -64, -64, -64, 64, -64, -64, -64, 64, 64, 64, -64, -64, -64, -64, 64, -64, -64, -64, -64, -64, 64, 64, -64, -64, -64, -64, -64, 64, 64, 64, 64, -64, 64, -64, 64, 64, 64, -64, -64, 64, 64, 64, -64, -64, 64, -64, -64, 64, -64, -64, -64, -64, -64, -64, -64, 64, -64, -64, -64, -64, 64, 64, 64, 64, 64, 64, 64, -64, -64, -64, 64, 64, -64, 64, 64, -64, -64, -64, -64, -64, -64, -64, -64, -64, 64, -64, 64, -64, 64, 64, 64, 64, 64, 64, 64, 64, 64, 64, 64, 64, 64, -64, 64, -64, -64, -64, -64, -64, -64, -64, -64, -64, 64, 64, 64, 64, 64, 64, 64, 64, 64, 64, 64, 64, 64, 64, 64, 64, 64, 64, -64, -64, -64, -64, -64, -64, -64, -64, -64, -64, -64, 64, 64, 64, -64, 64, 64, 64, 64, 64, 64, 64, -64, -64, -64, -64, 64, 64, 64, 64, 64, -64, -64, 64, 64, 64, -64, -64, -64, -64, 64, -64, -64, 64, 64, 64, 64, 64, -64, -64, -64, -64, -64, 64, 64, 64, 64, 64, 64, -64, -64, 64, 64, -64, 64, -64, -64, -64, 64, 64, 64, 64, 64, 64, 64, -64, -64, -64, -64, -64, -64, 64, 64, 64, -64, 64, 64, 64, -64, 64, -64, -64, -64, -64, -64, -64, 64, 64, 64, 64, 64, 64, 64, -64, -64, -64, -64, -64, -64, 64, 64, 64, 64, 64, 64, -64, -64, -64, -64, -64, -64, -64, 64, -64, -64, 64, 64, 64, 64, 64, 64, 64, 64, -64, -64, -64, -64, 64, 64, 64, -64, 64, 64, 64, -64, -64, -64, -64, -64, -64, -64, 64, 64, -64, -64, -64, -64, 64, 64, -64, 64, 64, -64, -64, 64, 64, 64, -64, 64, 64, -64, -64, -64, -64, -64, -64, 64, -64, -64, 64, -64, 64, 64, 64, 64, -64, -64, -64, 64, -64, -64, -64, -64, -64, -64, -64, 64, 64, -64, -64, 64, 64, 64, -64, -64, -64, -64, 64, 64, -64, 64, 64, -64, -64, -64, -64, -64, -64, -64, -64, -64, -64, -64, -64, -64, -64, 64, 64, 64, 64, -64, 64, -64, -64, -64, 64, 64, 64, 64, 64, 64, 64, -64, -64, -64, -64, -64, -64, -64, -64, -64, -64, -64, -64, 64, 64, 64, 64, 64, 64, -64, -64, -64, 64, 64, 64, -64, 64, 64, -64, -64, -64, -64, -64, -64, -64, -64, -64, -64, -64, -64, 64, -64, 64, 64, -64, -64, -64, 64, -64, -64, -64, 64, -64, 64, 64, 64, 64, -64, -64, -64, -64, 64, -64, -64, -64, -64, -64, -64, -64, -64, 64, -64, 64, -64, 64, 64, -64, -64, 64, -64, 64, -64, 64, -64, 64, 64, -64, -64, 64, -64, -64, -64, -64, -64, -64, -64, -64, 64, 64, 64, -64, -64, 64, -64, -64, -64, -64, -64, -64, -64, -64, 64, -64, 64, 64, 64, -64, -64, -64, -64, -64, -64, -64, -64, 64, 64, -64, 64, -64, 64, 64, 64, 64, 64, -64, 64, 64, 64, -64, -64, 64, 64, 64, 64, 64, -64, -64, -64, -64, -64, -64, 64, 64, 64, -64, -64, -64, -64, -64, 64, -64, -64, 64, 64, -64, -64, 64, -64, -64, 64, -64, 64, 64, 64, -64, -64, -64, -64, -64, 64, 64, 64, -64, 64, -64, 64, 64, 64, 64, -64, -64, 64, 64, 64, 64, -64, 64, -64, -64, 64, -64, -64, -64, 64, -64, -64, -64, -64, 64, -64, -64, 64, -64, -64, 64, 64, 64, 64, 64, 64, -64, -64, -64, -64, 64, 64, -64, 64, -64, -64, -64, -64, 64, 64, -64, -64, -64, -64, 64, 64, 64, 64, -64, 64, 64, 64, 64, 64, 64, 64, 64, 64, -64, 64, 64, -64, 64, -64, -64, 64, 64, 64, 64, 64, 64, 64, 64, 64, 64, -64, 64, -64, -64, -64, -64, 64, -64, -64, 64, -64, -64, 64, -64, -64, -64, -64, -64, 64, -64, 64, 64, -64, -64, 64, 64, 64, -64, 64, 64, 64, -64, 64, 64, 64, -64, 64, 64, 64, -64, -64, 64, 64, 64, -64, -64, -64, -64, 64, 64, 64, 64, 64, -64, -64, -64, 64, -64, 64, -64, -64, 64, 64, -64, -64, -64, 64, -64, -64, 64, -64, -64, 64, 64, -64, -64, -64, 64, 64, -64, -64, 64, 64, -64, -64, -64, -64, -64, 64, 64, -64, -64, -64, 64, -64, 64, 64, -64, 64, -64, -64, -64, -64, 64, 64, 64, 64, -64, 64, 64, 64, -64, 64, 64, 64, 64, -64, 64, 64, 64, -64, 64, 64, -64, -64, 64, 64, 64, 64, 64, 64, -64, 64, 64, 64, 64, 64, -64, -64, 64, -64, 64, -64, 64, -64, -64, 64, -64, 64, -64, 64, 64, 64, -64, -64, 64, -64, -64, 64, 64, 64, 64, 64, 64, 64, 64, -64, -64, 64, -64, 64, -64, -64, 64, -64, -64, 64, 64, 64, 64, -64, -64, 64, -64, 64, 64, 64, 64, 64, 64, -64, 64, 64, 64, 64, 64, 64, 64, -64, 64, 64, 64, 64, -64, -64, 64, -64, 64, 64, 64, 64, -64, -64, 64, 64, 64, 64, -64, -64, 64, 64, 64, 64, 64, 64, 64, 64, 64, 64, -64, 64, -64, 64, -64, 64, 64, 64, 64, 64, -64, -64, 64, -64, -64, -64, -64, -64, 64, -64, 64, -64, 64, 64, 64, 64, 64, 64, 64, 64, -64, 64, 64, -64, 64, 64, 64, 64, -64, 64, -64, -64, -64, 64, -64, -64, -64, 64, 64, 64, 64, 64, -64, 64, 64, 64, 64, -64, 64, -64, -64, 64, -64, 64, -64, 64, 64, 64, -64, 64, -64, -64, -64, 64, 64, 64, 64, 64, -64, 64, -64, -64, -64, 64, 64, 64, 64, 64, 64, -64, -64, -64, -64, -64, 64, 64, -64, 64, 64, -64, 64, 64, 64, -64, -64, -64, 64, 64, 64, -64, 64, 64, 64, 64, 64, -64, -64, 64, 64, 64, -64, -64, -64, 64, 64, 64, 64, 64, 64, 64, -64, 64, -64, -64, -64, 64, 64, 64, -64, 64, -64, 64, -64, 64, 64, -64, 64, 64, -64, -64, 64, 64, 64, 64, 64, 64, -64, -64, 64, -64, -64, -64, -64, -64, -64, 64, -64, 64, 64, 64, 64, 64, 64, 64, -64, 64, -64, -64, 64, 64, 64, 64, 64, -64, 64, -64, 64, -64, -64, 64, -64, 64, -64, 64, -64, 64, -64, -64, 64, -64, 64, 64, 64, 64, -64, -64, -64, 64, 64, 64, 64, -64, 64, 64, 64, -64, 64, 64, 64, 64, 64, 64, 64, 64, -64, 64, 64, 64, 64, -64, -64, -64, 64, -64, -64, 64, 64, 64, 64, 64, 64, -64, 64, -64, 64, 64, 64, 64, 64, -64, 64, -64, 64, 64, -64, -64, 64, -64, 64, 64, 64, 64, 64, 64, -64, -64, 64, 64, 64, -64, 64, 64, -64, 64, 64, 64, 64, 64, -64, 64, 64, 64, 64, 64, 64, -64, 64, 64, 64, -64, -64, 64, 64, 64, 64, -64, -64, 64, -64, 64, 64, 64, -64, 64, -64, 64, 64, 64, 64, -64, -64, -64, -64, -64, 64, 64, 64, 64, 64, -64, -64, 64, -64, 64, 64, 64, 64, 64, -64, 64, 64, 64, -64, 64, -64, 64, -64, 64, 64, 64, -64, -64, 64, 64, 64, -64, 64, 64, 64, -64, 64, 64, 64, 64, -64, -64, 64, 64, -64, -64, 64, -64, 64, -64, -64, 64, 64, -64, -64, -64, 64, 64, 64, 64, 64, 64, 64, 64, 64, 64, 64, 64, -64, -64, -64, -64, 64, 64, 64, 64, -64, -64, -64, -64, 64, -64, -64, 64, 64, 64, 64, 64, -64, 64, 64, -64, -64, 64, 64, 64, -64, -64, 64, 64, 64, -64, 64, -64, 64, -64, 64, -64, -64, -64, 64, -64, -64, 64, 64, -64, 64, 64, 64, 64, 64, 64, 64, 64, -64, -64, -64, 64, 64, 64, 64, 64, 64, -64, -64, 64, 64, -64, 64, 64, -64, -64, 64, -64, 64, -64, 64, 64, 64, 64, 64, 64, -64, -64, -64, 64, 64, 64, -64, 64, 64, -64, 64, -64, 64, -64, -64, -64, -64, -64, -64, -64, -64, -64, 64, 64, 64, 64, -64, 64, -64, -64, -64, 64, -64, -64, 64, 64, 64, -64, 64, -64, -64, 64, 64, -64, 64, 64, 64, -64, 64, 64, -64, 64, 64, 64, -64, 64, -64, -64, -64, -64, -64, -64, -64, 64, 64, 64, 64, -64, -64, 64, 64, 64, 64, -64, -64, -64, 64, 64, -64, -64, 64, 64, -64, -64, -64, -64, -64, 64, 64, 64, 64, 64, 64, -64, 64, 64, 64, 64, -64, -64, 64, -64, -64, 64, 64, -64, -64, -64, 64, 64, 64, -64, -64, 64, -64, -64, -64, 64, 64, 64, -64, -64, 64, -64, 64, 64, -64, -64, 64, -64, -64, 64, -64, -64, 64, 64, 64, -64, -64, -64, 64, -64, -64, 64, -64, 64, -64, 64, -64, -64, -64, -64, 64, -64, 64, -64, 64, -64, 64, 64, 64, 64, 64, 64, 64, 64, 64, 64, 64, -64, -64, 64, 64, -64, -64, 64, -64, 64, 64, 64, 64, 64, -64, -64, -64, 64, 64, 64, 64, -64, -64, 64, 64, 64, 64, 64, -64, -64, -64, 64, -64, -64, 64, 64, -64, -64, 64, -64, 64, -64, 64, 64, 64, 64, 64, 64, -64, -64, -64, 64, 64, 64, -64, 64, -64, -64, -64, -64, -64, 64, -64, 64, -64, 64, -64, -64, 64, 64, -64, 64, -64, -64, 64, 64, -64, 64, 64, 64, 64, 64, 64, 64, -64, -64, -64, 64, -64, 64, -64, 64, 64, 64, 64, 64, -64, 64, 64, 64, -64, 64, 64, 64, 64, -64, 64, 64, 64, -64, -64, -64, -64, -64, -64, 64, -64, 64, 64, -64, 64, 64, -64, 64, -64, 64, -64, 64, -64, 64, 64, 64, 64, -64, 64, 64, 64, -64, -64, -64, -64, -64, -64, 64, -64, -64, 64, 64, 64, -64, 64, -64, 64, 64, -64, -64, -64, 64, 64, 64, 64, 64, -64, -64, -64, -64, -64, -64, -64, -64, -64, 64, 64, -64, 64, 64, 64, 64, 64, 64, 64, -64, -64, 64, 64, 64, 64, 64, 64, 64, 64, -64, -64, -64, -64, -64, -64, -64, -64, 64, 64, 64, 64, 64, 64, 64, 64, -64, -64, -64, -64, -64, -64, 64, 64, 64, 64, 64, -64, -64, -64, -64, -64, -64, -64, -64, 64, 64, 64, 64, 64, 64, 64, 64, 64, -64, -64, 64, -64, -64, -64, 64, 64, 64, 64, 64, 64, 64, -64, -64, -64, -64, 64, 64, 64, 64, 64, 64, 64, 64, 64, 64, 64, -64, -64, 64, -64, -64, 64, 64, 64, 64, 64, 64, 64, -64, -64, -64, -64, 64, 64, 64, 64, -64, -64, 64, 64, 64, 64, -64, -64, 64, 64, -64, -64, 64, 64, -64, 64, 64, 64, 64, 64, 64, -64, -64, 64, -64, 64, 64, 64, 64, 64, 64, 64, 64, 64, 64, 64, -64, 64, 64, 64, -64, 64, -64, 64, 64, 64, 64, 64, -64, -64, -64, 64, -64, 64, -64, 64, -64, 64, 64, 64, 64, -64, -64, -64, -64, -64, 64, -64, -64, -64, 64, -64, 64, 64, 64, 64, 64, -64, 64, 64, 64, -64, -64, -64, -64, 64, -64, 64, 64, 64, -64, -64, -64, -64, 64, -64, -64, -64, 64, 64, 64, 64, 64, 64, 64, -64, 64, 64, 64, -64, 64, -64, -64, 64, -64, 64, 64, -64, 64, -64, -64, -64, 64, -64, -64, 64, 64, 64, 64, 64, 64, -64, 64, 64, -64, -64, -64, -64, -64, -64, -64, -64, 64, 64, 64, -64, 64, -64, -64, -64, -64, -64, -64, -64, 64, 64, 64, 64, -64, -64, 64, -64, -64, 64, -64, -64, -64, -64, -64, -64, 64, 64, 64, 64, 64, 64, -64, 64, 64, -64, -64, -64, -64, -64, 64, 64, 64, -64, -64, 64, 64, -64, 64, -64, -64, -64, -64, 64, 64, 64, -64, -64, 64, -64, -64, -64, 64, 64, -64, -64, 64, -64, -64, 64, -64, -64, -64, 64, -64, 64, -64, 64, -64, 64, -64, -64, 64, 64, 64, 64, 64, 64, -64, -64, -64, -64, -64, -64, -64, -64, -64, -64, -64, 64, -64, -64, -64, 64, 64, 64, -64, -64, -64, -64, 64, 64, -64, -64, -64, -64, 64, 64, 64, -64, -64, -64, -64, 64, -64, -64, -64, 64, -64, -64, -64, 64, 64, -64, 64, -64, -64, -64, 64, 64, 64, -64, -64, -64, 64, -64, -64, 64, -64, -64, -64, -64, -64, 64, -64, 64, -64, -64, 64, 64, -64, 64, 64, -64, 64, 64, -64, 64, -64, 64, 64, -64, -64, -64, -64, -64, 64, 64, 64, 64, -64, -64, 64, -64, -64, -64, -64, -64, 64, 64, 64, 64, 64, -64, -64, 64, -64, -64, -64, 64, 64, -64, 64, -64, 64, 64, -64, -64, -64, -64, -64, -64, 64, 64, -64, -64, -64, -64, 64, -64, -64, 64, -64, -64, -64, -64, -64, -64, -64, 64, -64, 64, -64, -64, -64, 64, -64, -64, -64, -64, -64, -64, 64, 64, 64, 64, -64, -64, -64, -64, 64, 64, -64, -64, 64, 64, 64, 64, 64, -64, 64, 64, 64, -64, -64, -64, 64, -64, -64, 64, 64, -64, 64, 64, -64, -64, -64, -64, -64, 64, 64, -64, 64, -64, -64, 64, -64, 64, -64, -64, -64, -64, 64, 64, 64, 64, 64, 64, 64, 64, 64, 64, 64, -64, 64, 64, 64, -64, -64, -64, 64, 64, 64, -64, 64, -64, -64, 64, -64, 64, 64, -64, 64, 64, 64, -64, 64, 64, -64, 64, -64, -64, -64, 64, -64, -64, 64, -64, 64, 64, -64, 64, 64, -64, 64, 64, -64, -64, -64, 64, -64, -64, 64, -64, -64, 64, 64, -64, 64, 64, -64, 64, 64, -64, 64, 64, 64, -64, -64, 64, 64, -64, -64, 64, -64, 64, 64, 64, 64, 64, -64, -64, 64, 64, -64, 64, 64, 64, 64, 64, -64, 64, -64, 64, 64, -64, -64, 64, 64, -64, 64, -64, -64, -64, -64, -64, -64, 64, 64, 64, -64, 64, 64, 64, 64, -64, 64, 64, 64, 64, 64, 64, 64, -64, 64, 64, 64, -64, 64, 64, -64, -64, 64, -64, -64, -64, 64, 64, 64, -64, -64, 64, -64, 64, 64, -64, 64, 64, -64, 64, -64, 64, 64, 64, 64, -64, 64, -64, 64, 64, -64, 64, 64, -64, -64, -64, -64, 64, 64, 64, 64, 64, 64, 64, 64, -64, 64, 64, -64, 64, -64, 64, -64, -64, 64, 64, -64, 64, 64, 64, 64, 64, -64, 64, 64, -64, 64, 64, 64, 64, 64, 64, 64, 64, 64, 64, -64, -64, 64, -64, 64, 64, -64, -64, 64, 64, 64, 64, 64, 64, -64, 64, 64, 64, 64, 64, 64, -64, 64, 64, 64, 64, 64, 64, 64, -64, -64, -64, -64, -64, 64, -64, 64, 64, 64, 64, 64, 64, 64, 64, 64, 64, 64, 64, 64, 64, 64, 64, 64, 64, 64, 64, 64, -64, -64, -64, 64, 64, -64, -64, -64, 64, 64, 64, 64, 64, 64, -64, 64, -64, 64, -64, -64, 64, 64, 64, 64, 64, 64, 64, 64, -64, 64, -64, -64, 64, 64, 64, 64, 64, 64, 64, 64, 64, -64, 64, 64, -64, -64, 64, 64, 64, 64, 64, 64, 64, 64, 64, 64, -64, -64, -64, 64, 64, 64, 64, 64, 64, 64, 64, 64, -64, 64, -64, 64, 64, -64, -64, 64, 64, 64, -64, 64, 64, 64, 64, 64, -64, -64, -64, 64, -64, 64, -64, 64, 64, 64, -64, -64, 64, 64, 64, -64, -64, -64, 64, 64, 64, 64, -64, 64, 64, 64, -64, -64, -64, 64, 64, 64, 64, 64, -64, 64, 64, 64, 64, -64, -64, -64, 64, -64, -64, 64, 64, -64, 64, 64, -64, -64, -64, -64, -64, 64, 64, 64, -64, 64, -64, 64, -64, 64, -64, -64, 64, 64, 64, 64, 64, 64, -64, 64, 64, 64, 64, 64, 64, -64, -64, -64, -64, -64, -64, -64, 64, -64, 64, -64, -64, -64, -64, -64, -64, -64, 64, -64, -64, -64, -64, -64, -64, -64, 64, -64, -64, -64, -64, 64, -64, -64, -64, 64, -64, -64, 64, 64, 64, -64, -64, -64, 64, 64, 64, 64, -64, -64, 64, -64, -64, -64, 64, -64, 64, -64, -64, -64, -64, -64, -64, 64, -64, 64, 64, 64, 64, -64, -64, -64, -64, -64, -64, 64, -64, 64, -64, 64, -64, 64, 64, 64, 64, -64, -64, -64, -64, -64, -64, -64, 64, 64, 64, 64, 64, 64, 64, 64, 64, -64, 64, 64, -64, 64, 64, 64, -64, 64, 64, -64, -64, 64, 64, -64, 64, -64, -64, 64, 64, 64, -64, 64, -64, 64, 64, 64, 64, 64, 64, 64, 64, 64, 64, 64, 64, -64, 64, 64, 64, -64, 64, -64, -64, -64, 64, -64, -64, -64, 64, 64, 64, -64, -64, -64, 64, 64, 64, -64, 64, 64, 64, 64, 64, 64, 64, -64, -64, -64, 64, 64, -64, -64, -64, -64, 64, -64, 64, -64, -64, -64, 64, 64, 64, 64, 64, -64, 64, 64, 64, 64, 64, -64, -64, 64, 64, -64, 64, 64, -64, -64, 64, 64, -64, -64, 64, 64, 64, -64, -64, 64, -64, 64, 64, 64, 64, -64, 64, 64, 64, -64, 64, -64, 64, -64, 64, 64, -64, 64, 64, 64, 64, -64, -64, 64, -64, -64, 64, -64, 64, -64, -64, 64, 64, 64, 64, -64, 64, -64, -64, -64, 64, 64, 64, -64, 64, 64, 64, -64, -64, 64, -64, 64, -64, 64, 64, 64, 64, 64, -64, 64, 64, 64, -64, 64, 64, -64, -64, -64, 64, 64, 64, 64, 64, 64, 64, 64, 64, -64, -64, -64, 64, 64, -64, -64, -64, -64, -64, 64, 64, 64, 64, -64, 64, -64, -64, -64, -64, 64, 64, 64, -64, -64, 64, -64, -64, -64, 64, -64, -64, 64, 64, -64, -64, -64, -64, -64, 64, 64, -64, 64, 64, 64, -64, 64, -64, 64, -64, -64, -64, -64, 64, -64, 64, -64, 64, 64, 64, -64, 64, -64, 64, 64, 64, 64, 64, -64, -64, 64, -64, 64, 64, 64, 64, 64, -64, 64, 64, 64, -64, -64, 64, 64, 64, -64, 64, -64, -64, 64, -64, 64, 64, 64, 64, 64, 64, -64, -64, 64, -64, -64, 64, -64, -64, 64, -64, 64, 64, 64, -64, -64, 64, -64, -64, 64, -64, -64, 64, -64, 64, -64, 64, 64, -64, 64, 64, 64, -64, -64, -64, 64, -64, -64, -64, 64, 64, -64, -64, -64, 64, -64, 64, -64, 64, 64, -64, 64, 64, -64, -64, 64, 64, -64, 64, -64, -64, -64, -64, -64, -64, -64, -64, 64, 64, 64, 64, -64, 64, 64, -64, -64, -64, 64, -64, 64, -64, -64, 64, 64, 64, 64, 64, -64, 64, -64, -64, -64, -64, -64, -64, -64, 64, 64, -64, 64, 64, -64, -64, 64, 64, -64, -64, -64, 64, 64, 64, 64, -64, 64, 64, -64, -64, 64, 64, -64, -64, 64, 64, -64, 64, -64, -64, -64, 64, 64, -64, -64, -64, -64, -64, -64, -64, 64, -64, -64, 64, -64, -64, -64, 64, -64, -64, -64, -64, -64, -64, 64, -64, 64, 64, -64, 64, 64, 64, -64, -64, -64, 64, -64, 64, -64, -64, -64, -64, 64, -64, -64, 64, -64, -64, 64, 64, -64, 64, 64, 64, 64, -64, 64, 64, 64, -64, -64, -64, -64, -64, -64, -64, 64, -64, -64, -64, -64, -64, 64, -64, -64, -64, -64, 64, 64, -64, 64, 64, 64, 64, 64, -64, 64, 64, -64, -64, -64, -64, -64, -64, -64, -64, 64, 64, -64, -64, -64, -64, -64, -64, -64, -64, -64, 64, -64, 64, -64, 64, 64, -64, 64, -64, 64, 64, -64, -64, -64, 64, -64, -64, 64, -64, -64, -64, -64, -64, 64, 64, -64, -64, -64, 64, -64, 64, -64, -64, 64, -64, -64, 64, 64, 64, -64, 64, -64, -64, -64, -64, 64, 64, 64, -64, 64, -64, 64, 64, 64, -64, -64, -64, 64, -64, 64, 64, 64, -64, 64, 64, 64, -64, -64, -64, 64, -64, -64, -64, 64, -64, -64, 64, 64, -64, -64, -64, -64, -64, -64, -64, -64, 64, -64, 64, -64, 64, 64, 64, 64, -64, 64, -64, 64, -64, 64, -64, 64, -64, 64, 64, -64, 64, -64, -64, -64, -64, -64, -64, -64, -64, 64, -64, 64, 64, -64, -64, -64, 64, -64, -64, -64, -64, -64, 64, 64, -64, 64, 64, 64, 64, -64, -64, -64, -64, -64, -64, -64, -64, -64, -64, -64, 64, 64, 64, 64, 64, 64, 64, 64, 64, -64, -64, -64, -64, -64, 64, 64, 64, -64, -64, 64, -64, -64, 64, -64, 64, -64, 64, 64, 64, -64, -64, -64, -64, -64, -64, -64, 64, -64, -64, 64, -64, -64, 64, 64, -64, 64, 64, -64, -64, -64, -64, -64, 64, -64, 64, -64, 64, -64, -64, -64, -64, -64, -64, -64, 64, -64, -64, -64, -64, -64, -64, 64, -64, 64, 64, -64, -64, -64, -64, 64, -64, 64, 64, -64, -64, 64, -64, 64, -64, -64, -64, 64, -64, 64, -64, -64, -64, -64, 64, -64, -64, 64, -64, -64, -64, -64, -64, 64, -64, -64, 64, -64, 64, -64, 64, 64, -64, -64, -64, 64, 64, 64, -64, -64, -64, 64, -64, -64, 64, 64, -64, 64, -64, 64, 64, -64, -64, -64, 64, 64, -64, -64, -64, -64, 64, -64, -64, 64, -64, -64, -64, 64, -64, -64, -64, -64, -64, 64, 64, -64, -64, -64, 64, 64, 64, 64, 64, -64, -64, 64, -64, -64, -64, -64, -64, -64, 64, -64, -64, 64, -64, -64, -64, -64, -64, -64, -64, -64, 64, 64, -64, 64, 64, -64, -64, 64, 64, -64, -64, -64, -64, -64, 64, -64, -64, -64, -64, -64, -64, -64, -64, -64, -64, 64, -64, -64, -64, -64, 64, -64, 64, 64, -64, 64, -64, -64, -64, -64, -64, -64, -64, 64, 64, 64, -64, -64, 64, -64, -64, -64, -64, 64, -64, 64, 64, 64, -64, -64, -64, -64, 64, -64, -64, 64, -64, -64, 64, 64, 64, 64, 64, -64, 64, 64, -64, -64, 64, -64, -64, 64, -64, -64, 64, 64, 64, 64, -64, -64, 64, -64, 64, -64, -64, 64, 64, 64, -64, -64, 64, 64, -64, -64, -64, -64, 64, -64, -64, -64, -64, -64, -64, -64, 64, 64, -64, 64, -64, -64, -64, -64, -64, 64, 64, 64, 64, 64, 64, 64, -64, -64, -64, -64, -64, 64, -64, -64, -64, 64, -64, 64, 64, 64, -64, -64, -64, 64, 64, 64, -64, 64, 64, 64, 64, -64, 64, 64, 64, -64, 64, 64, -64, 64, 64, -64, 64, 64, -64, -64, -64, -64, 64, 64, -64, -64, 64, -64, 64, 64, 64, 64, -64, 64, -64, 64, -64, 64, 64, -64, 64, 64, -64, -64, 64, -64, 64, -64, -64, 64, -64, -64, -64, 64, -64, -64, -64, -64, -64, -64, -64, -64, -64, 64, 64, 64, 64, 64, 64, 64, 64, -64, -64, 64, 64, 64, 64, -64, -64, 64, 64, 64, -64, 64, 64, -64, -64, -64, -64, -64, 64, -64, -64, 64, 64, 64, 64, 64, -64, -64, 64, 64, 64, 64, 64, -64, -64, 64, -64, 64, -64, 64, 64, 64, -64, 64, 64, -64, 64, 64, -64, -64, 64, 64, 64, -64, -64, 64, -64, -64, -64, -64, -64, 64, -64, 64, 64, 64, -64, 64, 64, 64, -64, 64, -64, -64, -64, -64, -64, 64, -64, 64, -64, -64, -64, -64, -64, -64, -64, 64, 64, 64, 64, 64, 64, -64, 64, -64, -64, -64, -64, -64, -64, -64, 64, 64, -64, -64, 64, -64, -64, -64, -64, -64, -64, -64, -64, -64, -64, -64, 64, -64, 64, 64, -64, -64, -64, -64, 64, -64, -64, -64, -64, -64, -64, -64, -64, -64, -64, -64, -64, -64, -64, -64, 64, 64, -64, -64, -64, -64, 64, 64, -64, -64, 64, -64, -64, -64, -64, -64, -64, -64, -64, 64, 64, -64, 64, 64, 64, 64, 64, 64, -64, 64, 64, 64, 64, -64, 64, -64, -64, -64, -64, 64, -64, -64, -64, -64, -64, -64, -64, -64, -64, 64, -64, 64, 64, 64, 64, 64, 64, -64, -64, -64, -64, 64, 64, -64, 64, 64, 64, 64, -64, -64, -64, -64, -64, -64, 64, -64, 64, 64, 64, -64, -64, 64, 64, -64, 64, -64, -64, -64, -64, -64, 64, 64, -64, -64, -64, -64, -64, -64, -64, -64, -64, -64, 64, 64, -64, -64, -64, -64, -64, -64, -64, -64, 64, -64, 64, -64, -64, -64, 64, -64, 64, 64, -64, -64, -64, -64, -64, -64, -64, -64, 64, 64, 64, -64, -64, -64, -64, -64, -64, -64, -64, 64, 64, -64, -64, 64, 64, -64, 64, -64, -64, -64, -64, -64, -64, -64, -64, 64, 64, 64, -64, -64, -64, -64, -64, 64, 64, 64, -64, 64, -64, 64, 64, -64, -64, 64, -64, 64, 64, -64, -64, -64, -64, -64, -64, 64, 64, 64, 64, -64, -64, -64, -64, 64, -64, -64, -64, 64, 64, -64, -64, 64, 64, -64, -64, -64, -64, -64, -64, -64, -64, -64, -64, -64, -64, 64, -64, 64, -64, 64, 64, -64, -64, -64, 64, 64, 64, 64, -64, -64, -64, 64, 64, -64, -64, -64, -64, -64, -64, 64, 64, 64, -64, 64, -64, -64, 64, 64, -64, -64, -64, 64, -64, -64, -64, -64, 64, 64, -64, 64, 64, 64, 64, -64, -64, -64, -64, -64, -64, -64, 64, -64, 64, -64, -64, -64, -64, 64, 64, -64, 64, -64, -64, -64, -64, -64, -64, 64, -64, 64, -64, 64, 64, -64, -64, -64, -64, -64, -64, -64, -64, 64, 64, -64, -64, -64, -64, 64, -64, -64, -64, -64, -64, 64, 64, 64, -64, -64, -64, -64, 64, 64, -64, -64, -64, -64, -64, -64, 64, 64, -64, -64, -64, -64, -64, -64, -64, -64, -64, -64, 64, 64, -64, 64, 64, -64, -64, -64, -64, -64, 64, 64, 64, -64, -64, -64, 64, -64, -64, -64, -64, 64, 64, -64, -64, -64, 64, 64, -64, 64, 64, -64, -64, -64, -64, 64, 64, 64, -64, -64, -64, -64, -64, -64, 64, 64, -64, -64, -64, -64, 64, -64, -64, -64, -64, -64, 64, -64, -64, 64, -64, 64, -64, 64, 64, -64, 64, -64, -64, -64, -64, 64, -64, -64, -64, -64, 64, -64, -64, -64, -64, -64, 64, 64, -64, -64, 64, 64, -64, -64, -64, 64, 64, -64, 64, -64, -64, -64, -64, -64, -64, -64, -64, -64, -64, -64, -64, -64, -64, -64, -64, 64, 64, -64, 64, 64, -64, -64, -64, -64, 64, 64, 64, -64, 64, 64, -64, -64, -64, -64, -64, -64, -64, 64, -64, -64, -64, 64, -64, 64, 64, 64, -64, 64, 64, -64, -64, -64, -64, 64, 64, 64, 64, 64, 64, 64, -64, -64, -64, -64, -64, -64, -64, -64, -64, -64, -64, 64, -64, -64, 64, 64, -64, 64, -64, -64, -64, 64, 64, 64, 64, 64, 64, -64, -64, -64, -64, 64, -64, -64, -64, -64, -64, -64, 64, -64, -64, 64, -64, -64, -64, -64, -64, 64, 64, 64, 64, 64, 64, 64, -64, -64, -64, -64, -64, -64, -64, -64, 64, -64, -64, -64, 64, -64, 64, -64, 64, -64, -64, 64, -64, -64, 64, 64, 64, 64, 64, 64, -64, -64, 64, -64, -64, 64, -64, -64, 64, 64, 64, -64, -64, -64, 64, -64, 64, 64, 64, -64, 64, 64, 64, 64, -64, 64, -64, 64, 64, 64, 64, 64, -64, 64, -64, -64, -64, 64, -64, -64, -64, 64, 64, -64, 64, -64, 64, 64, 64, -64, 64, -64, 64, 64, -64, -64, -64, -64, -64, 64, 64, -64, -64, 64, 64, 64, -64, 64, 64, -64, -64, 64, -64, -64, 64, -64, 64, 64, 64, 64, 64, -64, -64, 64, -64, 64, -64, -64, -64, 64, 64, 64, -64, -64, -64, 64, -64, -64, 64, -64, -64, -64, -64, -64, -64, 64, 64, -64, 64, 64, -64, 64, -64, 64, 64, -64, -64, -64, -64, -64, -64, -64, -64, -64, 64, -64, 64, 64, -64, -64, -64, 64, -64, -64, 64, 64, 64, 64, 64, 64, 64, 64, 64, -64, -64, -64, -64, -64, 64, -64, -64, -64, -64, -64, 64, 64, -64, 64, -64, 64, 64, 64, 64, 64, 64, 64, 64, 64, 64, 64, 64, 64, 64, 64, 64, -64, -64, -64, -64, -64, -64, 64, 64, 64, -64, -64, -64, -64, 64, 64, 64, 64, 64, 64, 64, 64, 64, 64, 64, -64, 64, 64, 64, -64, -64, -64, -64, -64, -64, 64, 64, -64, 64, 64, 64, 64, 64, 64, 64, 64, 64, -64, 64, -64, -64, 64, 64, 64, 64, 64, 64, -64, -64, -64, -64, -64, -64, 64, 64, 64, -64, 64, 64, 64, 64, 64, 64, 64, 64, 64, 64, 64, 64, -64, -64, -64, -64, 64, -64, 64, 64, -64, -64, -64, -64, 64, -64, -64, 64, 64, 64, 64, 64, 64, 64, 64, 64, 64, 64, 64, 64, 64, -64, -64, 64, 64, -64, 64, 64, -64, 64, -64, -64, -64, 64, 64, -64, -64, 64, -64, 64, 64, 64, 64, 64, 64, 64, -64, -64, -64, 64, -64, 64, 64, 64, -64, -64, 64, -64, 64, -64, -64, 64, -64, -64, -64, 64, 64, 64, 64, 64, 64, 64, -64, 64, -64, -64, -64, -64, 64, -64, 64, 64, 64, 64, 64, 64, -64, -64, -64, -64, -64, 64, -64, 64, 64, 64, 64, 64, 64, 64, -64, -64, -64, -64, -64, -64, 64, -64, -64, -64, 64, 64, 64, 64, 64, -64, -64, -64, 64, -64, -64, 64, 64, 64, 64, 64, 64, 64, -64, 64, -64, -64, -64, -64, -64, -64, -64, 64, 64, 64, 64, 64, 64, 64, 64, 64, 64, -64, 64, 64, 64, 64, 64, 64, 64, 64, -64, -64, -64, -64, -64, -64, -64, -64, -64, 64, 64, 64, 64, 64, 64, 64, 64, -64, 64, 64, 64, 64, -64, 64, 64, 64, 64, 64, -64, -64, -64, -64, -64, -64, -64, -64, 64, 64, -64, 64, 64, 64, 64, 64, 64, -64, 64, -64, 64, 64, -64, 64, 64, 64, 64, 64, 64, 64, 64, -64, -64, -64, -64, -64, -64, 64, 64, 64, 64, 64, 64, 64, 64, -64, -64, 64, -64, 64, 64, 64, 64, 64, 64, 64, 64, -64, 64, 64, 64, -64, 64, 64, 64, 64, 64, 64, 64, 64, 64, 64, 64, 64, 64, 64, 64, 64, 64, -64, 64, 64, 64, 64, -64, -64, -64, 64, 64, -64, -64, 64, 64, 64, 64, 64, 64, 64, 64, 64, 64, 64, 64, -64, -64, 64, 64, -64, -64, 64, 64, 64, 64, 64, -64, 64, -64, -64, -64, 64, 64, 64, 64, 64, 64, 64, 64, 64, 64, 64, -64, -64, 64, 64, -64, -64, -64, -64, 64, 64, -64, -64, -64, 64, -64, -64, -64, -64, 64, 64, -64, 64, 64, 64, 64, 64, 64, 64, 64, -64, 64, 64, 64, 64, -64, 64, -64, 64, 64, -64, -64, -64, 64, -64, 64, 64, -64, 64, 64, 64, 64, 64, 64, -64, -64, 64, -64, 64, 64, 64, 64, -64, -64, 64, -64, 64, 64, -64, -64, -64, -64, 64, -64, -64, 64, -64, -64, 64, 64, 64, 64, 64, -64, 64, -64, -64, -64, -64, -64, -64, -64, -64, 64, -64, -64, -64, -64, 64, 64, -64, 64, -64, -64, 64, 64, 64, 64, 64, 64, -64, 64, 64, -64, 64, 64, 64, 64, -64, -64, 64, -64, 64, -64, -64, 64, 64, -64, -64, -64, -64, -64, 64, 64, 64, 64, 64, 64, -64, -64, 64, 64, 64, 64, 64, 64, 64, 64, 64, -64, -64, -64, 64, -64, 64, 64, 64, 64, 64, -64, 64, 64, -64, -64, 64, 64, 64, 64, 64, -64, 64, 64, 64, 64, -64, -64, -64, -64, -64, -64, 64, 64, -64, -64, -64, -64, 64, 64, 64, 64, 64, -64, 64, 64, 64, 64, 64, 64, 64, 64, -64, 64, -64, 64, 64, 64, 64, -64, 64, -64, -64, -64, -64, -64, -64, 64, -64, 64, 64, -64, 64, -64, 64, 64, -64, 64, -64, 64, 64, 64, 64, -64, -64, -64, -64, 64, 64, 64, 64, 64, -64, 64, -64, -64, -64, -64, -64, -64, -64, -64, 64, 64, 64, 64, 64, -64, 64, 64, 64, 64, -64, 64, -64, -64, 64, 64, 64, -64, 64, -64, -64, 64, 64, -64, 64, 64, -64, -64, 64, -64, -64, -64, 64, -64, 64, -64, 64, 64, 64, 64, -64, -64, 64, 64, -64, 64, 64, -64, 64, 64, 64, -64, 64, 64, -64, -64, -64, -64, -64, 64, -64, -64, 64, 64, 64, 64, 64, 64, 64, 64, 64, -64, 64, -64, 64, 64, -64, 64, 64, 64, -64, 64, 64, 64, -64, -64, -64, 64, 64, 64, 64, -64, -64, -64, -64, 64, 64, 64, -64, -64, -64, -64, -64, 64, -64, -64, -64, 64, 64, 64, 64, 64, -64, 64, 64, 64, -64, -64, -64, -64, -64, -64, -64, 64, 64, 64, 64, 64, 64, 64, -64, -64, 64, 64, -64, 64, 64, 64, -64, -64, 64, -64, 64, -64, -64, -64, -64, -64, -64, -64, 64, 64, -64, 64, -64, 64, 64, -64, 64, 64, 64, 64, 64, 64, 64, 64, -64, 64, 64, -64, -64, -64, -64, -64, 64, 64, 64, -64, 64, -64, -64, -64, -64, -64, -64, -64, -64, -64, -64, 64, 64, 64, -64, -64, 64, 64, 64, -64, -64, -64, 64, 64, -64, -64, 64, -64, 64, 64, -64, -64, -64, -64, -64, 64, 64, -64, 64, -64, 64, 64, -64, 64, -64, 64, 64, -64, -64, 64, -64, -64, 64, -64, 64, -64, -64, 64, -64, -64, 64, -64, 64, 64, -64, -64, -64, -64, 64, -64, 64, 64, 64, 64, -64, 64, -64, 64, 64, -64, -64, -64, 64, -64, 64, -64, -64, -64, 64, 64, -64, -64, -64, -64, -64, -64, -64, -64, 64, -64, -64, -64, -64, 64, 64, -64, 64, -64, 64, 64, -64, 64, -64, -64, 64, -64, 64, 64, -64, -64, -64, -64, -64, 64, 64, 64, 64, 64, -64, -64, -64, -64, 64, 64, 64, 64, -64, -64, 64, 64, 64, 64, 64, 64, 64, 64, -64, -64, -64, -64, -64, -64, -64, 64, -64, 64, -64, -64, -64, -64, 64, 64, -64, 64, 64, 64, 64, 64, 64, 64, 64, 64, 64, -64, -64, -64, -64, -64, 64, 64, -64, 64, -64, 64, -64, 64, 64, 64, -64, -64, -64, 64, -64, 64, 64, 64, 64, 64, 64, 64, 64, -64, 64, 64, 64, 64, 64, -64, 64, -64, -64, -64, -64, -64, -64, -64, -64, 64, -64, 64, 64, 64, 64, 64, 64, 64, 64, 64, 64, 64, 64, 64, 64, 64, 64, 64, -64, -64, -64, -64, -64, -64, -64, -64, -64, 64, -64, -64, -64, 64, 64, 64, 64, 64, 64, 64, -64, 64, 64, 64, 64, 64, 64, 64, 64, 64, -64, -64, -64, -64, -64, 64, 64, -64, -64, 64, 64, -64, -64, -64, 64, 64, 64, 64, 64, 64, 64, 64, 64, 64, 64, 64, 64, -64, -64, -64, -64, -64, -64, -64, 64, 64, 64, 64, 64, -64, -64, -64, -64, 64, 64, 64, 64, 64, 64, 64, 64, 64, 64, 64, 64, -64, -64, -64, -64, -64, -64, -64, -64, 64, -64, -64, 64, -64, -64, -64, -64, -64, 64, 64, 64, 64, 64, 64, 64, 64, 64, -64, 64, 64, 64, 64, -64, 64, 64, -64, 64, 64, 64, 64, 64, -64, 64, -64, -64, -64, -64, 64, 64, -64, 64, 64, 64, 64, 64, 64, -64, 64, -64, -64, -64, -64, 64, -64, 64, 64, 64, -64, 64, 64, 64, -64, -64, -64, -64, 64, 64, -64, -64, -64, 64, 64, 64, -64, -64, -64, -64, -64, 64, -64, 64, 64, 64, 64, 64, 64, -64, 64, 64, 64, -64, -64, 64, 64, -64, 64, 64, -64, -64, 64, 64, 64, -64, -64, -64, -64, -64, -64, 64, 64, -64, -64, 64, 64, -64, 64, -64, 64, -64, 64, 64, 64, -64, 64, -64, -64, -64, 64, 64, 64, -64, -64, -64, 64, 64, -64, -64, 64, 64, -64, -64, 64, 64, 64, -64, 64, -64, -64, 64, -64, -64, 64, -64, -64, -64, 64, 64, -64, -64, -64, 64, 64, -64, -64, -64, 64, 64, -64, -64, 64, 64, -64, -64, -64, -64, -64, -64, -64, -64, -64, -64, 64, 64, 64, -64, -64, -64, 64, 64, 64, 64, -64, -64, 64, 64, -64, 64, -64, 64, -64, 64, -64, -64, -64, -64, -64, -64, -64, 64, 64, -64, 64, 64, -64, -64, 64, 64, -64, -64, -64, -64, 64, -64, -64, -64, -64, -64, -64, -64, 64, 64, -64, -64, -64, -64, -64, -64, -64, -64, -64, 64, 64, 64, 64, 64, -64, -64, -64, 64, -64, 64, -64, -64, -64, -64, -64, 64, 64, 64, -64, 64, -64, -64, 64, -64, -64, -64, -64, 64, -64, -64, -64, -64, 64, -64, 64, -64, 64, 64, 64, 64, -64, 64, 64, 64, -64, -64, 64, -64, 64, -64, -64, 64, 64, 64, -64, -64, 64, 64, -64, 64, 64, 64, 64, 64, -64, 64, -64, 64, 64, 64, 64, 64, 64, 64, -64, -64, -64, 64, 64, -64, -64, 64, 64, 64, 64, 64, 64, -64, 64, -64, 64, 64, -64, 64, -64, -64, -64, 64, 64, 64, 64, 64, 64, -64, -64, 64, -64, -64, 64, 64, 64, 64, 64, 64, 64, 64, 64, 64, 64, 64, 64, 64, -64, 64, -64, 64, 64, 64, 64, 64, 64, -64, 64, 64, 64, 64, -64, 64, 64, 64, -64, 64, 64, 64, -64, 64, 64, 64, 64, 64, -64, 64, -64, 64, -64, -64, 64, -64, -64, -64, -64, 64, -64, 64, 64, 64, 64, 64, -64, -64, 64, 64, 64, 64, -64, -64, -64, -64, 64, -64, 64, 64, 64, -64, -64, -64, -64, 64, 64, 64, 64, 64, 64, 64, 64, -64, 64, -64, 64, -64, -64, -64, 64, 64, -64, 64, 64, -64, -64, 64, 64, -64, -64, -64, 64, 64, 64, -64, 64, 64, 64, 64, -64, 64, 64, -64, -64, -64, -64, -64, 64, 64, -64, -64, -64, -64, -64, 64, 64, -64, 64, -64, -64, 64, -64, 64, 64, -64, 64, 64, 64, -64, 64, -64, -64, -64, -64, -64, -64, -64, -64, -64, -64, 64, 64, -64, -64, -64, -64, 64, -64, -64, 64, 64, 64, 64, 64, 64, 64, 64, 64, 64, 64, -64, -64, 64, -64, -64, -64, 64, 64, -64, 64, -64, 64, -64, 64, 64, 64, -64, 64, 64, -64, 64, 64, 64, 64, 64, 64, 64, 64, -64, -64, -64, -64, -64, -64, -64, 64, 64, 64, 64, 64, -64, -64, -64, -64, 64, 64, -64, 64, 64, 64, 64, 64, 64, -64, -64, 64, -64, -64, -64, -64, 64, -64, -64, -64, -64, 64, 64, -64, 64, -64, 64, -64, 64, 64, -64, 64, 64, 64, -64, -64, -64, -64, 64, 64, 64, -64, -64, -64, -64, -64, -64, 64, 64, 64, 64, -64, -64, -64, -64, 64, 64, 64, 64, 64, -64, 64, -64, -64, -64, -64, -64, 64, 64, -64, -64, 64, 64, -64, -64, -64, 64, 64, 64, -64, 64, 64, -64, 64, 64, 64, 64, 64, 64, -64, -64, -64, -64, -64, 64, 64, 64, -64, 64, -64, 64, 64, -64, -64, 64, 64, 64, -64, -64, 64, -64, 64, 64, 64, 64, 64, -64, -64, -64, -64, -64, -64, -64, 64, 64, 64, 64, 64, 64, 64, -64, -64, 64, -64, -64, 64, -64, 64, -64, 64, 64, 64, 64, 64, -64, -64, 64, 64, -64, 64, 64, 64, 64, 64, 64, 64, 64, 64, -64, -64, -64, 64, -64, 64, 64, 64, 64, 64, 64, 64, 64, 64, -64, -64, 64, 64, -64, 64, 64, 64, 64, 64, -64, -64, -64, 64, -64, -64, 64, 64, -64, 64, 64, -64, -64, 64, 64, -64, -64, 64, 64, 64, 64, 64, 64, 64, 64, 64, 64, 64, -64, 64, -64, 64, 64, -64, -64, 64, -64, 64, 64, 64, -64, 64, 64, 64, 64, 64, 64, 64, -64, -64, -64, 64, 64, 64, -64, 64, 64, -64, -64, 64, -64, -64, -64, -64, 64, -64, 64, -64, -64, 64, 64, 64, 64, 64, 64, -64, -64, -64, -64, -64, 64, 64, 64, 64, 64, 64, -64, -64, 64, 64, -64, 64, 64, -64, -64, 64, 64, 64, 64, 64, 64, 64, 64, -64, 64, 64, 64, 64, 64, 64, -64, -64, 64, -64, -64, -64, 64, 64, 64, 64, -64, -64, -64, 64, 64, 64, 64, 64, 64, 64, 64, -64, -64, 64, 64, 64, 64, 64, 64, 64, 64, 64, 64, -64, 64, -64, 64, 64, -64, -64, 64, -64, -64, 64, 64, -64, 64, 64, 64, 64, -64, 64, 64, 64, 64, -64, -64, -64, -64, 64, 64, 64, -64, 64, 64, 64, 64, 64, -64, 64, -64, -64, 64, -64, -64, -64, -64, 64, 64, 64, -64, 64, 64, 64, -64, 64, 64, -64, -64, 64, -64, 64, -64, -64, -64, -64, 64, 64, -64, -64, -64, -64, -64, -64, 64, 64, 64, 64, 64, 64, -64, 64, -64, 64, 64, 64, 64, -64, -64, 64, -64, 64, -64, -64, -64, 64, -64, 64, 64, 64, -64, -64, -64, -64, -64, 64, 64, 64, -64, -64, 64, -64, 64, 64, 64, 64, 64, 64, 64, 64, -64, 64, 64, 64, -64, 64, 64, 64, 64, -64, -64, -64, -64, -64, 64, 64, -64, -64, -64, 64, 64, 64, -64, 64, -64, -64, -64, -64, -64, -64, 64, -64, 64, 64, -64, -64, -64, -64, 64, -64, -64, 64, -64, 64, 64, -64, 64, 64, -64, 64, -64, -64, 64, -64, 64, 64, -64, 64, -64, -64, -64, 64, 64, 64, 64, 64, -64, 64, -64, 64, -64, 64, -64, -64, 64, 64, -64, -64, 64, -64, 64, -64, 64, -64, 64, 64, 64, 64, -64, 64, 64, -64, 64, -64, -64, 64, 64, -64, 64, 64, -64, -64, -64, -64, 64, 64, 64, -64, -64, -64, -64, 64, -64, 64, 64, 64, 64, -64, -64, 64, 64, 64, -64, -64, 64, 64, -64, -64, -64, -64, -64, -64, -64, -64, 64, 64, 64, 64, 64, -64, -64, 64, -64, 64, 64, 64, -64, -64, 64, 64, 64, 64, 64, 64, 64, -64, -64, -64, -64, -64, -64, -64, -64, -64, 64, 64, 64, -64, -64, 64, 64, 64, 64, -64, 64, 64, 64, 64, 64, 64, 64, 64, 64, 64, 64, 64, -64, -64, -64, -64, -64, -64, -64, -64, -64, -64, 64, 64, 64, 64, 64, -64, -64, 64, 64, 64, 64, 64, 64, 64, 64, 64, 64, 64, 64, -64, -64, -64, 64, 64, 64, -64, 64, 64, -64, 64, 64, -64, -64, -64, -64, 64, 64, 64, 64, 64, 64, 64, 64, -64, 64, 64, 64, -64, -64, -64, 64, -64, -64, 64, -64, -64, -64, -64, 64, 64, -64, -64, -64, -64, 64, 64, -64, -64, 64, 64, 64, 64, 64, -64, 64, 64, 64, -64, 64, -64, 64, -64, 64, 64, -64, -64, 64, -64, -64, 64, 64, 64, 64, -64, 64, 64, 64, 64, -64, -64, 64, 64, 64, 64, 64, 64, 64, 64, 64, -64, 64, 64, -64, -64, -64, -64, -64, -64, 64, -64, -64, -64, -64, -64, -64, 64, -64, -64, -64, 64, 64, 64, 64, 64, 64, 64, 64, 64, -64, -64, -64, -64, -64, -64, -64, -64, 64, 64, 64, -64, -64, -64, 64, 64, 64, 64, -64, 64, -64, -64, -64, 64, 64, 64, 64, 64, -64, 64, -64, 64, -64, -64, -64, 64, 64, 64, -64, -64, -64, -64, 64, -64, -64, -64, 64, -64, -64, -64, -64, 64, 64, 64, 64, 64, -64, 64, -64, -64, 64, -64, -64, 64, 64, 64, -64, -64, -64, 64, -64, -64, -64, 64, -64, -64, -64, -64, -64, 64, 64, 64, 64, -64, 64, 64, 64, -64, -64, -64, 64, 64, 64, -64, 64, -64, 64, -64, 64, -64, -64, 64, -64, -64, -64, -64, -64, -64, -64, 64, -64, 64, 64, 64, -64, -64, -64, -64, -64, -64, 64, -64, -64, -64, 64, 64, 64, -64, -64, -64, -64, -64, -64, -64, -64, -64, -64, -64, -64, -64, 64, -64, 64, -64, -64, -64, -64, 64, 64, -64, -64, -64, -64, -64, -64, -64, 64, -64, -64, -64, -64, -64, -64, -64, -64, -64, 64, 64, 64, -64, 64, 64, -64, -64, -64, -64, -64, -64, -64, -64, 64, -64, -64, -64, -64, -64, -64, -64, -64, -64, -64, -64, -64, -64, -64, 64, 64, 64, 64, -64, -64, 64, -64, -64, -64, -64, -64, -64, -64, -64, -64, -64, 64, -64, -64, 64, 64, -64, 64, -64, -64, 64, -64, 64, 64, -64, -64, 64, -64, -64, -64, -64, -64, -64, -64, -64, -64, -64, -64, -64, -64, 64, 64, 64, -64, -64, -64, 64, 64, -64, -64, -64, -64, -64, -64, 64, 64, 64, 64, 64, 64, -64, 64, -64, -64, 64, 64, 64, 64, 64, 64, 64, 64, 64, 64, -64, -64, 64, -64, -64, -64, -64, 64, 64, 64, -64, -64, 64, 64, 64, 64, 64, 64, 64, 64, 64, 64, 64, 64, -64, 64, -64, 64, -64, 64, 64, 64, 64, -64, 64, -64, 64, 64, -64, 64, 64, 64, 64, 64, 64, 64, 64, 64, 64, 64, 64, 64, 64, 64, -64, 64, 64, 64, 64, -64, -64, 64, 64, 64, -64, 64, -64, 64, 64, 64, 64, 64, 64, 64, 64, 64, 64, 64, 64, 64, 64, -64, 64, 64, 64, -64, 64, 64, -64, 64, 64, 64, 64, 64, 64, 64, 64, 64, 64, 64, 64, -64, -64, 64, 64, 64, 64, 64, -64, -64, 64, -64, -64, 64, -64, 64, -64, -64, 64, -64, 64, 64, 64, 64, -64, -64, -64, 64, 64, 64, -64, 64, 64, 64, 64, -64, -64, 64, -64, 64, -64, -64, 64, -64, -64, 64, -64, 64, 64, -64, -64, 64, -64, -64, -64, -64, 64, 64, 64, 64, 64, -64, 64, 64, 64, -64, -64, -64, 64, -64, -64, 64, -64, 64, -64, 64, -64, -64, -64, -64, -64, -64, -64, -64, -64, -64, 64, 64, -64, -64, -64, -64, -64, 64, 64, 64, 64, -64, 64, -64, -64, -64, 64, -64, -64, 64, -64, 64, 64, -64, 64, -64, -64, 64, -64, -64, 64, 64, 64, 64, -64, -64, 64, -64, 64, 64, 64, -64, 64, 64, -64, 64, 64, -64, 64, 64, -64, -64, -64, -64, 64, -64, 64, 64, 64, 64, -64, -64, 64, 64, -64, -64, -64, -64, -64, -64, -64, -64, -64, 64, 64, 64, -64, 64, -64, 64, 64, 64, -64, -64, 64, 64, -64, 64, -64, 64, 64, -64, -64, -64, -64, 64, 64, -64, -64, -64, 64, -64, 64, -64, 64, -64, 64, -64, 64, -64, 64, 64, 64, -64, 64, 64, 64, 64, 64, 64, -64, -64, 64, 64, 64, 64, 64, -64, -64, 64, -64, -64, -64, 64, -64, -64, 64, -64, -64, 64, 64, -64, 64, 64, 64, 64, -64, -64, 64, -64, -64, 64, 64, -64, 64, 64, 64, 64, -64, 64, 64, 64, 64, -64, -64, 64, -64, -64, -64, -64, 64, 64, -64, -64, -64, -64, 64, -64, -64, 64, 64, -64, -64, -64, -64, 64, -64, 64, 64, 64, 64, -64, 64, -64, 64, -64, -64, -64, -64, -64, -64, -64, -64, -64, -64, -64, 64, -64, 64, -64, 64, -64, -64, 64, 64, 64, -64, -64, -64, 64, -64, -64, 64, -64, 64, -64, -64, 64, 64, 64, -64, 64, -64, -64, -64, -64, -64, 64, 64, 64, -64, -64, 64, -64, 64, 64, -64, 64, 64, -64, -64, 64, 64, 64, 64, 64, 64, 64, -64, -64, -64, -64, -64, 64, -64, -64, -64, 64, 64, -64, 64, 64, 64, 64, 64, 64, 64, 64, -64, 64, -64, -64, -64, -64, 64, 64, -64, 64, -64, 64, 64, -64, -64, 64, 64, -64, -64, -64, -64, -64, 64, 64, -64, -64, -64, -64, -64, -64, 64, -64, -64, -64, -64, -64, 64, -64, -64, 64, 64, -64, -64, -64, -64, -64, -64, -64, 64, 64, -64, 64, 64, -64, -64, -64, -64, -64, -64, -64, -64, -64, 64, 64, 64, 64, -64, -64, 64, -64, -64, -64, -64, -64, 64, 64, -64, 64, -64, -64, -64, -64, -64, -64, -64, -64, -64, -64, -64, -64, -64, -64, 64, -64, -64, -64, 64, -64, -64, 64, -64, -64, -64, -64, -64, 64, 64, 64, 64, -64, 64, 64, -64, -64, -64, -64, -64, -64, -64, -64, -64, -64, -64, -64, -64, -64, -64, -64, -64, -64, -64, 64, -64, 64, 64, 64, 64, 64, 64, -64, -64, -64, -64, 64, -64, 64, 64, -64, -64, -64, 64, -64, -64, -64, -64, -64, 64, 64, -64, -64, -64, -64, 64, 64, -64, -64, -64, -64, 64, -64, -64, -64, -64, -64, -64, -64, -64, -64, -64, 64, 64, -64, 64, -64, -64, -64, -64, 64, -64, 64, 64, 64, -64, -64, -64, -64, -64, -64, -64, 64, 64, -64, -64, -64, -64, -64, 64, 64, -64, 64, 64, 64, 64, -64, 64, -64, 64, 64, 64, -64, -64, -64, -64, -64, -64, -64, -64, -64, -64, -64, -64, 64, 64, -64, -64, -64, 64, -64, -64, -64, -64, -64, -64, 64, 64, 64, 64, -64, -64, -64, -64, -64, -64, -64, -64, -64, -64, -64, -64, -64, -64, -64, -64, 64, 64, -64, -64, 64, -64, 64, 64, 64, 64, 64, -64, -64, -64, -64, -64, -64, -64, -64, -64, -64, -64, -64, 64, -64, -64, -64, -64, 64, -64, -64, 64, 64, -64, 64, 64, 64, 64, -64, -64, 64, -64, -64, -64, -64, -64, -64, -64, -64, -64, -64, -64, -64, -64, 64, -64, -64, -64, -64, -64, 64, -64, -64, 64, 64, 64, 64, 64, 64, 64, -64, 64, -64, -64, -64, -64, 64, -64, -64, -64, -64, -64, -64, 64, 64, 64, 64, 64, -64, -64, 64, -64, 64, -64, -64, -64, -64, -64, 64, 64, -64, 64, -64, 64, -64, 64, -64, -64, 64, 64, 64, 64, 64, 64, -64, 64, -64, 64, 64, 64, -64, 64, 64, 64, -64, 64, 64, -64, -64, 64, 64, -64, -64, 64, -64, -64, 64, 64, 64, -64, -64, -64, -64, 64, -64, -64, 64, 64, 64, -64, 64, -64, -64, -64, -64, 64, -64, -64, -64, 64, 64, -64, 64, 64, 64, 64, 64, -64, 64, -64, 64, 64, 64, 64, -64, -64, 64, 64, -64, 64, -64, 64, 64, 64, 64, 64, 64, -64, 64, 64, -64, 64, 64, 64, -64, -64, -64, -64, -64, 64, -64, 64, 64, -64, 64, -64, -64, -64, -64, -64, 64, 64, 64, 64, 64, 64, -64, -64, 64, -64, -64, 64, 64, 64, -64, 64, 64, -64, -64, 64, -64, -64, -64, -64, -64, -64, 64, -64, -64, -64, -64, -64, -64, -64, 64, 64, -64, -64, -64, -64, -64, -64, -64, -64, -64, -64, -64, 64, -64, -64, -64, -64, 64, 64, -64, -64, 64, -64, -64, -64, 64, 64, 64, 64, 64, -64, 64, -64, 64, 64, 64, 64, -64, 64, -64, -64, -64, 64, 64, 64, 64, 64, -64, 64, -64, 64, -64, 64, -64, 64, -64, -64, -64, 64, -64, -64, -64, -64, 64, -64, -64, -64, 64, -64, 64, 64, -64, 64, 64, -64, -64, 64, -64, 64, -64, 64, 64, -64, -64, -64, -64, 64, 64, 64, 64, -64, -64, 64, -64, 64, 64, 64, -64, -64, 64, -64, 64, -64, 64, -64, -64, 64, 64, -64, -64, 64, -64, 64, 64, -64, -64, 64, -64, -64, 64, 64, -64, -64, 64, 64, -64, 64, -64, -64, 64, -64, -64, -64, 64, 64, 64, 64, 64, 64, 64, -64, 64, -64, 64, 64, -64, -64, -64, 64, -64, -64, 64, 64, -64, 64, -64, 64, 64, 64, 64, 64, 64, 64, 64, 64, -64, 64, -64, 64, 64, 64, 64, -64, -64, -64, -64, 64, -64, 64, 64, 64, -64, -64, -64, 64, 64, -64, 64, 64, 64, 64, 64, 64, 64, 64, 64, 64, 64, 64, -64, 64, 64, -64, -64, -64, 64, 64, -64, 64, -64, -64, 64, 64, -64, 64, -64, 64, 64, 64, -64, 64, 64, -64, 64, 64, 64, 64, 64, 64, 64, 64, 64, -64, -64, 64, 64, -64, 64, -64, -64, 64, -64, 64, 64, 64, -64, 64, -64, -64, 64, 64, 64, -64, 64, 64, -64, -64, 64, 64, -64, -64, -64, -64, -64, -64, -64, -64, 64, -64, 64, 64, 64, 64, -64, 64, 64, -64, -64, 64, -64, 64, 64, -64, -64, 64, 64, 64, -64, -64, -64, 64, 64, 64, 64, 64, 64, -64, 64, -64, 64, 64, 64, -64, 64, -64, 64, 64, 64, 64, -64, -64, 64, -64, -64, 64, -64, -64, -64, -64, 64, -64, -64, -64, 64, 64, 64, 64, -64, 64, 64, -64, -64, 64, 64, 64, 64, 64, 64, -64, 64, -64, -64, 64, 64, -64, 64, 64, -64, 64, -64, 64, -64, -64, 64, 64, 64, -64, 64, -64, 64, 64, 64, -64, 64, 64, 64, 64, -64, 64, 64, 64, 64, 64, 64, 64, -64, -64, -64, 64, 64, -64, 64, -64, -64, -64, -64, -64, 64, -64, -64, -64, -64, 64, 64, 64, 64, -64, 64, 64, 64, 64, -64, 64, 64, 64, 64, 64, -64, 64, -64, -64, -64, 64, 64, -64, 64, -64, 64, -64, 64, 64, -64, 64, -64, -64, 64, 64, 64, 64, 64, 64, -64, -64, -64, -64, 64, -64, -64, -64, 64, -64, 64, -64, 64, 64, 64, 64, 64, 64, 64, 64, 64, 64, -64, 64, 64, 64, 64, 64, -64, 64, -64, 64, 64, -64, 64, 64, -64, 64, 64, 64, 64, 64, 64, 64, 64, 64, 64, -64, 64, 64, 64, -64, 64, 64, -64, 64, 64, 64, -64, -64, 64, -64, 64, -64, -64, -64, 64, 64, -64, 64, 64, 64, 64, 64, -64, 64, -64, 64, -64, -64, 64, -64, -64, 64, 64, 64, 64, -64, 64, 64, 64, -64, -64, -64, -64, -64, -64, 64, 64, 64, 64, 64, 64, 64, 64, 64, -64, -64, 64, -64, -64, -64, -64, -64, 64, -64, 64, 64, -64, -64, -64, -64, -64, -64, -64, 64, 64, 64, -64, 64, -64, 64, 64, -64, -64, 64, 64, 64, 64, 64, 64, 64, 64, -64, 64, 64, -64, 64, -64, -64, -64, 64, -64, -64, 64, -64, -64, 64, 64, 64, 64, 64, 64, 64, 64, 64, 64, 64, 64, -64, 64, -64, -64, -64, 64, -64, 64, -64, 64, 64, 64, 64, 64, -64, 64, 64, 64, -64, 64, -64, 64, 64, 64, 64, -64, 64, 64, -64, -64, 64, -64, -64, 64, -64, 64, 64, 64, 64, -64, 64, 64, -64, 64, 64, -64, -64, 64, 64, 64, -64, 64, 64, 64, 64, 64, -64, -64, -64, -64, 64, 64, 64, 64, 64, 64, -64, -64, -64, 64, -64, 64, 64, 64, 64, -64, 64, 64, -64, 64, 64, 64, 64, 64, 64, 64, -64, -64, -64, 64, 64, 64, 64, 64, 64, -64, -64, -64, 64, 64, 64, -64, 64, -64, 64, -64, 64, -64, -64, 64, 64, 64, -64, -64, -64, 64, 64, 64, -64, 64, -64, -64, 64, -64, -64, 64, 64, 64, 64, -64, -64, 64, 64, -64, -64, 64, 64, -64, 64, 64, -64, -64, -64, -64, -64, -64, 64, -64, -64, 64, 64, -64, -64, -64, 64, -64, 64, 64, 64, -64, 64, 64, 64, -64, -64, -64, -64, -64, 64, -64, 64, 64, 64, -64, 64, -64, 64, 64, -64, -64, 64, -64, 64, 64, 64, -64, -64, 64, 64, -64, -64, -64, -64, -64, -64, -64, -64, 64, -64, -64, -64, -64, -64, 64, -64, -64, 64, -64, 64, -64, 64, -64, 64, 64, 64, 64, -64, 64, 64, 64, -64, -64, 64, 64, -64, 64, -64, -64, 64, -64, -64, -64, 64, -64, 64, 64, -64, -64, 64, -64, 64, 64, 64, 64, -64, -64, 64, -64, -64, -64, -64, 64, -64, 64, -64, -64, -64, -64, 64, -64, 64, 64, 64, -64, -64, 64, -64, 64, 64, -64, -64, 64, -64, 64, 64, -64, 64, -64, -64, 64, 64, 64, 64, -64, 64, 64, -64, -64, 64, 64, 64, 64, 64, 64, 64, 64, 64, 64, 64, -64, 64, 64, 64, 64, 64, -64, -64, -64, -64, -64, -64, -64, -64, -64, -64, 64, 64, 64, -64, 64, 64, -64, 64, 64, -64, -64, -64, -64, -64, -64, -64, -64, -64, -64, 64, -64, 64, 64, 64, -64, 64, -64, -64, 64, 64, 64, 64, 64, -64, -64, -64, -64, -64, -64, -64, -64, -64, -64, -64, -64, -64, -64, -64, 64, -64, 64, 64, 64, -64, -64, 64, -64, 64, 64, 64, -64, 64, 64, -64, -64, -64, -64, -64, -64, -64, -64, -64, -64, -64, -64, 64, 64, 64, -64, 64, -64, -64, -64, 64, -64, 64, 64, 64, 64, 64, 64, 64, 64, -64, -64, -64, -64, -64, -64, -64, 64, -64, -64, -64, -64, 64, -64, -64, 64, -64, -64, -64, 64, 64, 64, 64, 64, 64, 64, 64, -64, -64, -64, -64, -64, -64, -64, -64, -64, -64, -64, -64, 64, 64, 64, 64, -64, -64, -64, -64, 64, 64, 64, 64, 64, 64, -64, 64, -64, -64, -64, -64, -64, -64, -64, -64, -64, -64, -64, 64, -64, -64, 64, 64, 64, -64, -64, 64, 64, 64, -64, -64, 64, -64, -64, 64, 64, 64, -64, -64, -64, -64, -64, -64, -64, -64, -64, -64, -64, 64, -64, 64, -64, -64, -64, -64, -64, 64, -64, -64, -64, -64, -64, 64, -64, 64, -64, -64, 64, -64, -64, -64, -64, -64, -64, -64, 64, 64, -64, -64, -64, -64, -64, -64, -64, -64, -64, -64, -64, -64, -64, -64, 64, 64, 64, 64, -64, 64, 64, -64, -64, 64, -64, -64, -64, -64, -64, 64, -64, -64, -64, -64, -64, -64, 64, -64, -64, -64, -64, -64, 64, -64, -64, -64, -64, -64, -64, 64, -64, 64, 64, 64, -64, 64, -64, -64, 64, -64, -64, -64, -64, 64, 64, -64, -64, -64, -64, -64, -64, 64, -64, -64, 64, 64, -64, 64, -64, 64, -64, 64, 64, 64, 64, 64, 64, -64, -64, -64, -64, -64, -64, -64, -64, -64, -64, -64, -64, -64, -64, -64, -64, -64, -64, 64, -64, 64, -64, 64, 64, -64, 64, -64, 64, -64, -64, -64, -64, -64, 64, -64, -64, 64, 64, -64, -64, -64, -64, 64, -64, -64, -64, 64, -64, -64, 64, -64, -64, -64, -64, -64, -64, -64, -64, -64, -64, -64, -64, -64, -64, -64, -64, -64, -64, 64, 64, -64, -64, -64, -64, -64, -64, 64, 64, 64, -64, 64, 64, -64, -64, -64, -64, -64, -64, -64, -64, 64, 64, -64, -64, -64, -64, 64, 64, -64, -64, -64, 64, -64, 64, 64, 64, 64, -64, 64, -64, 64, 64, -64, -64, -64, -64, -64, -64, -64, 64, 64, 64, 64, 64, -64, 64, 64, 64, 64, -64, 64, -64, 64, 64, 64, -64, -64, -64, 64, -64, -64, -64, -64, -64, -64, -64, -64, 64, 64, 64, 64, -64, 64, 64, 64, -64, -64, -64, -64, 64, 64, 64, 64, 64, 64, -64, -64, 64, 64, -64, -64, -64, -64, -64, -64, 64, 64, 64, -64, 64, -64, -64, -64, 64, 64, -64, -64, -64, -64, -64, 64, -64, 64, 64, 64, 64, -64, -64, -64, -64, -64, -64, -64, -64, 64, 64, -64, -64, -64, -64, -64, 64, 64, -64, -64, -64, -64, 64, 64, 64, -64, 64, -64, 64, 64, 64, -64, -64, -64, -64, -64, -64, -64, -64, -64, -64, -64, -64, 64, -64, -64, -64, -64, -64, -64, 64, -64, -64, 64, -64, 64, -64, -64, -64, -64, -64, -64, -64, -64, -64, -64, -64, -64, 64, -64, 64, 64, -64, -64, -64, -64, -64, 64, 64, -64, 64, 64, -64, -64, 64, 64, 64, 64, -64, -64, -64, -64, -64, -64, -64, -64, -64, 64, 64, 64, 64, -64, -64, -64, -64, 64, 64, 64, -64, 64, -64, -64, -64, 64, -64, 64, -64, -64, -64, 64, -64, -64, 64, 64, 64, -64, 64, 64, 64, 64, 64, 64, -64, 64, -64, -64, -64, -64, 64, 64, 64, 64, -64, 64, -64, -64, -64, -64, 64, 64, 64, 64, -64, 64, 64, 64, 64, 64, 64, 64, 64, -64, -64, -64, 64, -64, -64, -64, 64, 64, 64, 64, -64, -64, -64, -64, 64, -64, 64, 64, 64, 64, -64, 64, -64, 64, -64, 64, 64, -64, -64, 64, 64, 64, 64, -64, -64, 64, -64, 64, -64, 64, 64, -64, 64, -64, -64, -64, -64, 64, -64, -64, 64, 64, 64, -64, -64, -64, 64, 64, 64, 64, -64, 64, 64, 64, -64, -64, -64, -64, 64, -64, -64, 64, 64, 64, 64, -64, -64, 64, -64, -64, -64, 64, -64, -64, -64, -64, 64, -64, 64, 64, -64, 64, -64, -64, 64, -64, 64, -64, -64, -64, -64, 64, -64, -64, -64, -64, -64, -64, -64, 64, -64, 64, 64, 64, -64, 64, -64, 64, -64, -64, -64, 64, -64, -64, -64, -64, -64, -64, -64, -64, 64, -64, -64, -64, -64, -64, -64, -64, -64, -64, 64, -64, -64, -64, 64, -64, 64, -64, -64, 64, -64, -64, -64, -64, -64, -64, -64, -64, -64, -64, -64, 64, -64, -64, -64, -64, 64, -64, 64, -64, -64, -64, 64, 64, -64, -64, 64, 64, -64, 64, -64, -64, -64, -64, -64, -64, -64, -64, 64, 64, 64, -64, -64, 64, 64, -64, 64, -64, -64, -64, 64, 64, 64, 64, 64, 64, 64, -64, 64, 64, -64, 64, -64, -64, -64, -64, -64, -64, 64, -64, -64, 64, 64, -64, -64, -64, -64, 64, -64, -64, 64, -64, 64, 64, 64, -64, -64, 64, 64, -64, -64, 64, 64, 64, 64, 64, 64, -64, -64, 64, -64, -64, -64, -64, -64, 64, -64, -64, 64, -64, -64, 64, -64, 64, 64, 64, 64, -64, 64, 64, 64, -64, -64, 64, 64, -64, -64, -64, 64, 64, -64, -64, -64, 64, -64, -64, -64, -64, -64, 64, -64, 64, -64, 64, 64, 64, 64, 64, 64, 64, 64, 64, -64, -64, -64, -64, -64, -64, -64, 64, 64, 64, -64, -64, -64, -64, -64, 64, -64, 64, -64, -64, -64, 64, 64, 64, 64, 64, 64, -64, -64, -64, 64, -64, -64, -64, -64, -64, -64, 64, 64, -64, 64, -64, -64, 64, -64, 64, 64, -64, 64, 64, 64, 64, 64, 64, 64, 64, -64, -64, 64, -64, -64, -64, -64, -64, -64, 64, -64, 64, -64, 64, -64, 64, -64, 64, 64, 64, 64, 64, 64, 64, 64, 64, 64, 64, 64, 64, 64, 64, 64, -64, -64, -64, -64, -64, -64, 64, 64, 64, -64, -64, -64, 64, 64, 64, 64, -64, 64, 64, 64, 64, 64, 64, 64, 64, 64, 64, -64, 64, -64, -64, -64, -64, -64, 64, -64, 64, 64, -64, 64, 64, 64, 64, -64, 64, -64, 64, 64, 64, 64, 64, 64, 64, 64, 64, -64, 64, -64, 64, -64, -64, -64, 64, 64, -64, 64, -64, -64, -64, 64, -64, -64, 64, -64, 64, 64, 64, 64, 64, 64, 64, 64, 64, 64, -64, -64, -64, 64, 64, -64, 64, -64, -64, -64, -64, -64, -64, -64, -64, 64, 64, 64, 64, 64, 64, 64, 64, -64, 64, 64, -64, -64, -64, -64, -64, -64, -64, 64, -64, -64, -64, -64, 64, 64, -64, -64, -64, -64, -64, -64, 64, 64, 64, 64, -64, -64, -64, 64, -64, -64, -64, -64, -64, -64, 64, -64, 64, 64, -64, -64, -64, -64, -64, -64, -64, -64, -64, 64, 64, 64, 64, -64, -64, -64, -64, -64, -64, -64, -64, -64, -64, 64, -64, 64, 64, 64, -64, 64, -64, 64, -64, -64, -64, -64, 64, 64, -64, 64, -64, -64, -64, -64, -64, -64, -64, -64, -64, 64, -64, -64, 64, 64, 64, -64, -64, -64, -64, -64, -64, -64, -64, 64, 64, 64, 64, -64, 64, -64, -64, -64, -64, -64, -64, -64, -64, -64, -64, -64, -64, -64, -64, -64, -64, -64, -64, -64, -64, 64, -64, 64, -64, -64, -64, 64, -64, -64, -64, -64, -64, -64, -64, 64, -64, -64, -64, 64, 64, -64, 64, -64, 64, -64, -64, 64, 64, 64, 64, 64, -64, 64, -64, -64, -64, -64, -64, -64, 64, -64, -64, -64, -64, -64, 64, -64, -64, 64, 64, 64, 64, 64, 64, 64, 64, 64, 64, 64, 64, 64, -64, 64, 64, -64, 64, -64, 64, 64, 64, 64, 64, -64, -64, -64, 64, 64, -64, 64, 64, 64, 64, 64, 64, 64, -64, -64, 64, 64, 64, 64, -64, -64, -64, -64, 64, 64, 64, 64, 64, -64, 64, 64, -64, 64, -64, 64, -64, 64, 64, 64, -64, -64, -64, -64, 64, 64, 64, -64, -64, -64, -64, -64, -64, 64, 64, 64, 64, -64, 64, 64, 64, 64, 64, 64, -64, -64, 64, 64, -64, -64, -64, 64, 64, 64, -64, 64, -64, 64, 64, 64, 64, 64, 64, 64, -64, -64, -64, -64, 64, -64, 64, 64, -64, -64, 64, -64, -64, 64, 64, 64, -64, -64, 64, 64, 64, -64, -64, 64, -64, 64, -64, 64, 64, -64, -64, -64, 64, -64, -64, -64, -64, -64, 64, 64, 64, -64, 64, 64, 64, 64, -64, -64, -64, 64, 64, 64, -64, -64, -64, -64, -64, -64, -64, 64, 64, -64, -64, 64, -64, 64, 64, -64, -64, 64, -64, -64, 64, -64, -64, 64, 64, 64, -64, 64, 64, 64, -64, -64, 64, -64, 64, 64, -64, 64, 64, 64, -64, -64, 64, 64, 64, -64, 64, -64, 64, -64, -64, -64, -64, 64, -64, 64, -64, -64, -64, 64, 64, 64, 64, 64, -64, -64, 64, -64, -64, 64, 64, 64, 64, -64, 64, 64, 64, 64, 64, 64, 64, 64, 64, -64, -64, 64, -64, -64, -64, -64, -64, 64, 64, -64, -64, -64, -64, 64, 64, 64, -64, -64, 64, 64, -64, -64, 64, 64, -64, 64, 64, -64, -64, -64, -64, 64, -64, 64, 64, -64, -64, 64, -64, -64, 64, -64, 64, 64, -64, -64, -64, 64, 64, -64, 64, -64, -64, 64, 64, 64, 64, 64, -64, -64, -64, -64, -64, 64, 64, -64, 64, -64, 64, -64, 64, 64, -64, 64, 64, -64, -64, 64, 64, -64, 64, -64, -64, 64, -64, 64, 64, 64, 64, -64, -64, 64, -64, 64, 64, 64, 64, -64, -64, -64, 64, 64, -64, 64, 64, 64, 64, -64, 64, 64, 64, 64, -64, 64, -64, 64, 64, -64, 64, -64, -64, -64, -64, -64, 64, -64, -64, -64, 64, 64, 64, 64, -64, 64, -64, 64, -64, -64, 64, -64, -64, 64, 64, 64, 64, -64, 64, -64, -64, -64, 64, -64, 64, -64, 64, -64, 64, 64, -64, -64, -64, 64, 64, 64, -64, 64, -64, 64, 64, -64, 64, -64, 64, 64, 64, -64, 64, 64, 64, -64, -64, 64, 64, -64, -64, 64, -64, -64, 64, 64, 64, -64, 64, -64, -64, -64, 64, -64, -64, 64, 64, 64, 64, 64, -64, 64, -64, -64, -64, -64, 64, -64, 64, -64, 64, -64, 64, -64, 64, 64, 64, 64, 64, 64, 64, -64, 64, 64, 64, -64, 64, 64, -64, 64, -64, -64, -64, 64, -64, -64, 64, -64, -64, 64, -64, 64, 64, 64, -64, -64, -64, 64, 64, 64, -64, 64, 64, 64, -64, 64, 64, -64, -64, -64, -64, 64, -64, 64, 64, 64, -64, -64, 64, 64, 64, 64, 64, 64, 64, -64, 64, 64, 64, 64, 64, 64, 64, 64, -64, 64, -64, 64, -64, 64, -64, -64, 64, 64, -64, 64, 64, 64, 64, 64, 64, 64, -64, -64, 64, -64, -64, -64, -64, 64, -64, 64, -64, -64, 64, 64, -64, -64, -64, -64, -64, 64, -64, 64, 64, 64, 64, 64, 64, -64, 64, -64, 64, 64, -64, -64, -64, 64, 64, -64, -64, 64, -64, 64, -64, 64, 64, 64, 64, 64, 64, 64, 64, 64, 64, -64, 64, 64, 64, -64, 64, 64, 64, 64, 64, -64, -64, -64, -64, 64, -64, -64, -64, 64, 64, -64, 64, 64, 64, 64, 64, 64, -64, 64, 64, 64, 64, 64, -64, -64, 64, -64, -64, -64, -64, -64, -64, 64, -64, 64, 64, -64, -64, 64, 64, 64, -64, 64, 64, -64, 64, 64, 64, 64, 64, -64, 64, 64, -64, 64, -64, 64, 64, -64, -64, 64, -64, -64, 64, 64, -64, -64, 64, 64, -64, -64, -64, -64, -64, 64, -64, 64, 64, 64, 64, 64, 64, 64, 64, 64, -64, -64, -64, 64, -64, -64, -64, 64, -64, 64, 64, 64, -64, 64, 64, -64, 64, 64, -64, 64, 64, 64, 64, -64, 64, 64, -64, 64, -64, 64, -64, 64, -64, -64, -64, -64, -64, -64, 64, 64, 64, 64, -64, 64, 64, 64, -64, 64, -64, 64, 64, 64, -64, -64, 64, -64, -64, 64, 64, 64, 64, 64, 64, 64, 64, -64, -64, -64, -64, 64, -64, 64, -64, -64, 64, -64, 64, 64, -64, 64, 64, -64, -64, -64, -64, 64, -64, -64, 64, 64, 64, 64, 64, 64, 64, -64, 64, -64, 64, 64, 64, 64, -64, 64, 64, 64, 64, 64, 64, 64, -64, 64, 64, 64, -64, -64, 64, 64, -64, 64, 64, 64, 64, -64, -64, 64, 64, -64, 64, 64, 64, 64, -64, 64, 64, 64, 64, -64, -64, 64, 64, -64, -64, 64, -64, -64, 64, 64, -64, -64, -64, -64, 64, 64, 64, -64, 64, -64, -64, 64, 64, 64, 64, -64, -64, 64, 64, 64, -64, 64, 64, 64, -64, 64, 64, 64, -64, 64, -64, -64, -64, 64, -64, 64, 64, -64, -64, 64, 64, -64, 64, 64, -64, -64, -64, 64, 64, -64, 64, 64, -64, -64, 64, -64, 64, -64, -64, -64, -64, 64, 64, -64, 64, -64, 64, -64, 64, 64, 64, -64, -64, 64, -64, 64, -64, 64, -64, -64, -64, 64, 64, -64, -64, 64, 64, -64, -64, 64, 64, -64, -64, 64, -64, 64, 64, -64, -64, 64, -64, 64, -64, 64, 64, 64, 64, -64, -64, -64, 64, 64, 64, -64, 64, 64, 64, 64, -64, 64, -64, 64, 64, 64, 64, -64, -64, 64, -64, 64, 64, -64, -64, 64, 64, 64, -64, -64, -64, 64, 64, -64, -64, 64, 64, 64, -64, 64, 64, -64, 64, 64, -64, 64, -64, 64, 64, -64, 64, -64, 64, 64, 64, 64, 64, -64, -64, 64, 64, 64, 64, 64, 64, -64, -64, -64, 64, 64, 64, 64, -64, 64, 64, 64, -64, -64, 64, 64, 64, -64, -64, 64, -64, -64, 64, -64, 64, -64, -64, -64, 64, -64, -64, -64, -64, -64, 64, 64, -64, -64, -64, -64, -64, -64, -64, -64, -64, 64, 64, 64, -64, -64, -64, -64, 64, 64, -64, -64, -64, 64, 64, 64, -64, -64, -64, -64, -64, 64, 64, 64, -64, -64, 64, -64, -64, -64, -64, 64, -64, 64, -64, 64, 64, -64, -64, -64, -64, -64, 64, -64, -64, -64, -64, -64, -64, -64, -64, -64, 64, 64, -64, -64, -64, -64, -64, -64, -64, -64, -64, -64, -64, -64, -64, 64, 64, -64, 64, -64, -64, -64, -64, -64, -64, -64, -64, 64, -64, 64, -64, -64, -64, -64, 64, -64, -64, -64, -64, -64, -64, -64, -64, -64, -64, -64, -64, -64, 64, -64, -64, -64, -64, -64, 64, 64, 64, 64, 64, -64, -64, -64, 64, 64, -64, -64, -64, -64, -64, -64, -64, 64, 64, -64, 64, -64, -64, -64, -64, -64, -64, -64, -64, 64, 64, 64, -64, -64, -64, -64, 64, 64, -64, -64, -64, -64, -64, -64, 64, 64, 64, 64, 64, -64, -64, -64, -64, -64, -64, -64, -64, -64, 64, 64, -64, -64, -64, -64, 64, -64, -64, 64, -64, -64, 64, 64, 64, 64, 64, -64, -64, -64, -64, -64, -64, -64, -64, -64, -64, -64, 64, 64, 64, 64, -64, -64, -64, 64, -64, -64, -64, -64, 64, 64, 64, 64, -64, -64, -64, -64, -64, -64, -64, -64, -64, -64, -64, -64, -64, 64, 64, 64, -64, -64, 64, 64, -64, -64, -64, -64, 64, 64, 64, 64, 64, -64, -64, -64, -64, -64, -64, -64, -64, 64, -64, 64, 64, 64, 64, 64, -64, -64, -64, -64, -64, -64, -64, -64, -64, 64, 64, 64, -64, -64, -64, -64, -64, -64, -64, 64, -64, 64, 64, 64, 64, 64, 64, 64, 64, 64, -64, -64, -64, 64, 64, -64, -64, -64, 64, 64, 64, 64, -64, 64, -64, -64, 64, 64, 64, 64, 64, 64, 64, 64, 64, 64, -64, 64, -64, -64, -64, 64, -64, 64, 64, 64, -64, 64, 64, 64, 64, 64, 64, 64, 64, 64, 64, 64, -64, 64, -64, -64, -64, -64, 64, -64, -64, -64, -64, -64, 64, -64, 64, -64, -64, -64, -64, 64, 64, 64, 64, 64, 64, 64, 64, 64, -64, -64, -64, -64, -64, -64, -64, -64, -64, 64, -64, 64, 64, 64, 64, -64, -64, -64, 64, 64, 64, 64, 64, 64, 64, 64, 64, 64, -64, 64, -64, -64, -64, -64, -64, -64, -64, 64, -64, -64, 64, 64, 64, 64, 64, 64, 64, 64, -64, 64, 64, 64, 64, -64, 64, 64, -64, 64, -64, -64, -64, 64, -64, -64, 64, -64, 64, -64, 64, 64, 64, 64, -64, -64, -64, -64, -64, -64, -64, 64, -64, -64, -64, -64, -64, 64, -64, -64, 64, 64, 64, -64, -64, -64, -64, 64, 64, 64, 64, 64, -64, -64, -64, -64, -64, -64, -64, -64, -64, -64, -64, -64, 64, 64, -64, -64, -64, 64, -64, 64, -64, -64, 64, 64, -64, 64, 64, 64, -64, -64, -64, -64, -64, -64, -64, -64, -64, 64, 64, 64, 64, 64, 64, -64, 64, -64, 64, 64, 64, 64, -64, 64, 64, -64, 64, -64, -64, -64, -64, -64, -64, -64, -64, -64, -64, -64, 64, 64, 64, 64, 64, -64, -64, 64, 64, 64, 64, 64, 64, 64, -64, -64, -64, -64, -64, -64, -64, -64, -64, -64, -64, -64, 64, 64, 64, -64, -64, -64, 64, -64, 64, 64, -64, -64, -64, 64, 64, -64, -64, -64, -64, -64, -64, -64, -64, -64, 64, -64, 64, 64, -64, -64, 64, -64, -64, -64, -64, -64, 64, -64, 64, 64, 64, -64, 64, -64, -64, 64, -64, 64, -64, -64, 64, -64, 64, 64, -64, -64, -64, -64, -64, -64, -64, 64, -64, 64, -64, 64, 64, -64, -64, -64, 64, 64, -64, 64, 64, 64, 64, -64, -64, 64, 64, -64, 64, -64, -64, -64, -64, -64, -64, -64, -64, -64, 64, 64, -64, -64, -64, -64, -64, 64, 64, 64, 64, 64, 64, -64, -64, 64, -64, 64, -64, 64, 64, -64, -64, -64, -64, 64, 64, -64, -64, 64, 64, -64, -64, 64, 64, 64, -64, 64, 64, 64, -64, 64, 64, -64, -64, 64, -64, 64, 64, 64, 64, 64, 64, -64, -64, 64, 64, 64, -64, -64, 64, 64, -64, -64, -64, -64, 64, -64, -64, 64, -64, -64, -64, -64, -64, -64, -64, 64, 64, -64, -64, 64, 64, 64, -64, 64, 64, 64, 64, -64, 64, 64, -64, 64, 64, -64, -64, -64, 64, 64, 64, 64, 64, -64, -64, -64, -64, 64, -64, -64, 64, -64, 64, -64, -64, 64, 64, -64, -64, 64, -64, 64, 64, -64, -64, -64, -64, -64, 64, 64, 64, 64, -64, 64, -64, -64, -64, -64, -64, -64, 64, -64, -64, -64, -64, -64, -64, 64, 64, 64, -64, -64, -64, -64, 64, -64, 64, 64, 64, 64, 64, 64, -64, -64, 64, 64, 64, 64, 64, 64, 64, -64, 64, 64, -64, -64, 64, 64, -64, -64, -64, 64, 64, 64, 64, 64, -64, 64, 64, 64, 64, 64, 64, -64, 64, -64, 64, -64, 64, 64, -64, -64, -64, 64, -64, -64, -64, -64, -64, 64, 64, 64, 64, 64, 64, 64, 64, -64, -64, 64, -64, 64, -64, -64, 64, -64, -64, -64, -64, -64, 64, -64, -64, -64, -64, -64, 64, 64, 64, 64, 64, -64, -64, 64, -64, -64, -64, 64, -64, 64, -64, 64, -64, 64, -64, -64, -64, 64, 64, -64, -64, 64, 64, -64, 64, 64, 64, 64, 64, 64, -64, -64, -64, -64, -64, 64, 64, 64, 64, -64, -64, 64, 64, -64, -64, -64, 64, 64, 64, 64, 64, 64, 64, -64, 64, 64, -64, -64, 64, 64, 64, -64, 64, 64, -64, 64, 64, 64, -64, -64, -64, 64, 64, 64, -64, -64, -64, 64, -64, 64, -64, 64, 64, 64, -64, -64, 64, 64, 64, 64, 64, 64, 64, -64, -64, -64, -64, -64, -64, -64, -64, -64, -64, 64, 64, 64, -64, -64, 64, 64, 64, 64, -64, -64, 64, 64, 64, 64, 64, 64, 64, 64, 64, -64, -64, -64, -64, -64, -64, 64, -64, 64, -64, -64, -64, -64, -64, -64, 64, -64, -64, 64, 64, 64, 64, 64, 64, 64, 64, 64, 64, -64, -64, -64, 64, 64, 64, 64, -64, -64, 64, 64, -64, -64, -64, 64, -64, -64, -64, 64, 64, 64, 64, 64, 64, -64, 64, 64, -64, -64, -64, -64, -64, -64, 64, 64, -64, 64, -64, 64, -64, -64, -64, -64, -64, 64, 64, 64, 64, 64, 64, -64, 64, -64, 64, -64, 64, -64, -64, -64, -64, -64, 64, -64, -64, -64, -64, -64, -64, -64, -64, -64, 64, 64, 64, 64, 64, 64, 64, 64, 64, 64, 64, 64, -64, -64, -64, -64, -64, 64, -64, 64, 64, -64, 64, -64, -64, -64, -64, 64, -64, 64, 64, 64, 64, 64, 64, 64, -64, 64, 64, -64, -64, -64, -64, -64, -64, -64, -64, 64, 64, 64, 64, -64, -64, -64, -64, 64, -64, 64, 64, -64, -64, 64, 64, -64, -64, 64, -64, -64, -64, -64, 64, -64, -64, -64, -64, 64, -64, -64, 64, 64, -64, -64, -64, -64, -64, -64, 64, -64, 64, 64, 64, 64, 64, 64, -64, -64, -64, -64, 64, -64, -64, 64, 64, -64, 64, 64, 64, -64, -64, 64, -64, 64, 64, -64, 64, 64, 64, 64, 64, 64, 64, 64, -64, -64, -64, -64, -64, 64, -64, 64, 64, -64, 64, -64, -64, 64, -64, -64, -64, 64, 64, 64, 64, -64, 64, 64, -64, -64, 64, -64, -64, 64, -64, -64, -64, -64, -64, -64, 64, 64, -64, -64, -64, -64, -64, 64, -64, 64, -64, 64, 64, 64, 64, 64, 64, 64, -64, 64, 64, 64, -64, -64, -64, 64, 64, 64, 64, 64, -64, -64, -64, 64, -64, -64, -64, -64, -64, 64, 64, 64, 64, 64, 64, 64, 64, 64, 64, 64, 64, -64, -64, 64, 64, -64, -64, 64, 64, 64, -64, 64, 64, 64, 64, 64, 64, 64, 64, 64, -64, 64, 64, 64, -64, 64, 64, 64, 64, -64, -64, -64, -64, -64, -64, -64, -64, -64, 64, -64, 64, 64, 64, -64, 64, 64, 64, 64, 64, 64, 64, 64, -64, 64, 64, 64, -64, 64, -64, 64, -64, -64, -64, -64, -64, -64, 64, -64, -64, 64, 64, 64, 64, 64, 64, -64, -64, 64, 64, 64, 64, 64, -64, 64, 64, 64, -64, -64, 64, 64, -64, -64, 64, 64, -64, 64, 64, -64, 64, -64, -64, 64, 64, 64, 64, 64, 64, -64, -64, 64, -64, 64, 64, 64, -64, -64, -64, 64, 64, 64, 64, 64, -64, -64, 64, 64, 64, 64, 64, 64, 64, -64, 64, 64, 64, 64, -64, 64, 64, -64, -64, 64, -64, -64, 64, -64, 64, -64, -64, 64, 64, 64, -64, 64, 64, -64, -64, -64, 64, 64, -64, 64, 64, 64, 64, -64, 64, 64, 64, -64, -64, 64, 64, -64, -64, 64, -64, 64, -64, -64, 64, 64, -64, 64, -64, 64, -64, 64, 64, 64, 64, -64, -64, 64, -64, 64, 64, -64, -64, 64, 64, -64, -64, 64, 64, 64, 64, 64, -64, -64, 64, -64, -64, 64, -64, 64, 64, 64, 64, 64, 64, 64, 64, -64, 64, 64, 64, -64, -64, 64, -64, 64, -64, 64, -64, -64, -64, -64, -64, -64, -64, -64, -64, -64, 64, -64, 64, 64, 64, 64, 64, 64, -64, -64, 64, 64, 64, -64, -64, -64, 64, -64, 64, -64, -64, -64, -64, -64, -64, -64, -64, 64, 64, 64, -64, -64, 64, 64, 64, 64, 64, -64, -64, -64, -64, -64, -64, -64, -64, -64, -64, 64, -64, -64, -64, -64, -64, 64, -64, 64, 64, 64, -64, 64, 64, 64, 64, -64, 64, -64, -64, -64, -64, -64, -64, 64, -64, 64, 64, -64, -64, 64, -64, -64, -64, -64, -64, 64, 64, 64, 64, 64, 64, 64, 64, -64, -64, -64, 64, 64, -64, -64, -64, 64, -64, -64, -64, 64, -64, -64, -64, 64, 64, -64, 64, -64, 64, -64, -64, 64, 64, 64, -64, -64, 64, -64, 64, 64, 64, -64, -64, 64, -64, 64, 64, -64, -64, 64, 64, 64, -64, -64, 64, 64, 64, 64, -64, -64, -64, 64, -64, -64, -64, -64, -64, 64, -64, -64, 64, 64, -64, 64, 64, -64, 64, 64, 64, 64, -64, -64, 64, 64, 64, -64, -64, -64, -64, -64, -64, -64, -64, -64, -64, -64, -64, -64, 64, -64, 64, 64, 64, 64, -64, 64, 64, 64, -64, -64, -64, 64, 64, 64, -64, -64, -64, 64, -64, -64, -64, -64, -64, -64, -64, -64, -64, -64, 64, 64, 64, 64, -64, 64, -64, -64, -64, -64, 64, -64, 64, 64, -64, 64, 64, 64, 64, -64, -64, -64, 64, -64, 64, 64, 64, -64, 64, -64, 64, 64, -64, -64, -64, -64, -64, 64, -64, 64, -64, 64, 64, 64, 64, 64, 64, -64, -64, -64, -64, 64, 64, -64, 64, -64, -64, 64, 64, 64, -64, -64, -64, -64, -64, 64, 64, 64, 64, 64, 64, -64, 64, 64, -64, -64, -64, -64, -64, 64, 64, 64, 64, 64, 64, 64, -64, -64, -64, -64, -64, -64, -64, -64, -64, -64, -64, 64, -64, -64, -64, -64, -64, -64, -64, -64, -64, 64, 64, 64, -64, -64, -64, 64, -64, -64, -64, -64, -64, -64, -64, -64, -64, -64, -64, -64, -64, -64, -64, -64, -64, -64, -64, -64, -64, 64, 64, 64, -64, -64, -64, 64, -64, -64, -64, -64, -64, -64, -64, -64, 64, -64, -64, -64, -64, -64, -64, -64, -64, -64, -64, 64, -64, -64, 64, -64, -64, 64, -64, 64, -64, -64, -64, -64, -64, -64, -64, 64, 64, -64, 64, 64, -64, -64, -64, -64, -64, -64, -64, -64, -64, -64, 64, 64, 64, 64, 64, -64, -64, -64, -64, -64, -64, 64, 64, -64, 64, 64, 64, 64, -64, -64, -64, -64, -64, 64, -64, -64, -64, 64, 64, 64, 64, -64, 64, 64, 64, -64, -64, 64, -64, -64, 64, 64, -64, 64, 64, 64, 64, -64, -64, 64, -64, 64, 64, -64, -64, -64, 64, -64, -64, -64, -64, -64, -64, -64, -64, -64, 64, 64, 64, 64, 64, 64, 64, 64, 64, -64, -64, -64, 64, 64, 64, -64, -64, -64, 64, -64, -64, -64, 64, 64, -64, -64, -64, -64, -64, 64, 64, 64, 64, 64, 64, 64, 64, -64, -64, -64, -64, 64, -64, 64, 64, 64, -64, 64, -64, -64, 64, -64, -64, 64, -64, -64, -64, 64, 64, 64, 64, 64, 64, 64, 64, -64, -64, -64, -64, 64, -64, 64, 64, -64, 64, -64, 64, 64, 64, 64, -64, -64, -64, -64, -64, 64, 64, 64, 64, 64, 64, 64, 64, 64, -64, -64, -64, 64, 64, 64, -64, -64, 64, 64, -64, 64, 64, -64, 64, 64, -64, 64, 64, 64, 64, 64, 64, 64, 64, 64, 64, 64, -64, 64, 64, -64, 64, 64, -64, 64, -64, 64, 64, 64, -64, -64, -64, 64, -64, 64, 64, -64, 64, 64, -64, 64, 64, 64, -64, 64, 64, -64, -64, -64, -64, 64, 64, -64, -64, 64, -64, 64, 64, -64, -64, 64, -64, -64, -64, 64, 64, -64, 64, -64, 64, 64, -64, -64, 64, -64, 64, 64, -64, 64, 64, 64, -64, 64, 64, 64, 64, 64, -64, 64, -64, -64, 64, -64, -64, -64, 64, 64, -64, -64, 64, 64, -64, 64, -64, 64, -64, -64, -64, 64, 64, 64, 64, 64, 64, -64, -64, -64, -64, -64, -64, -64, 64, -64, 64, 64, -64, 64, 64, -64, 64, 64, 64, -64, 64, -64, -64, -64, -64, 64, 64, 64, 64, 64, 64, -64, 64, -64, -64, 64, 64, -64, -64, 64, 64, 64, -64, 64, 64, -64, 64, -64, 64, -64, 64, 64, 64, 64, 64, -64, -64, -64, 64, -64, -64, 64, 64, 64, 64, -64, -64, -64, -64, 64, 64, 64, -64, -64, 64, 64, -64, 64, 64, 64, 64, 64, -64, -64, 64, 64, 64, -64, 64, 64, -64, -64, 64, -64, -64, -64, -64, -64, -64, -64, -64, 64, -64, 64, 64, -64, -64, -64, -64, 64, 64, 64, 64, 64, 64, -64, 64, -64, 64, -64, -64, 64, 64, 64, -64, 64, 64, -64, 64, 64, -64, -64, -64, 64, -64, -64, 64, -64, -64, -64, 64, -64, 64, 64, 64, -64, 64, 64, -64, 64, -64, 64, -64, -64, -64, -64, -64, -64, 64, -64, 64, -64, 64, 64, 64, 64, 64, -64, -64, 64, -64, 64, -64, -64, -64, -64, -64, 64, -64, -64, -64, 64, -64, 64, 64, -64, 64, 64, -64, -64, -64, 64, 64, 64, -64, 64, 64, -64, -64, -64, -64, -64, -64, -64, -64, -64, 64, 64, 64, -64, -64, -64, -64, -64, 64, 64, 64, 64, 64, -64, 64, 64, -64, 64, -64, -64, 64, -64, -64, -64, -64, -64, -64, -64, -64, -64, 64, -64, -64, -64, -64, -64, -64, -64, 64, -64, -64, -64, -64, -64, 64, 64, 64, -64, -64, 64, 64, -64, -64, -64, -64, -64, -64, -64, -64, -64, -64, -64, 64, -64, -64, 64, -64, 64, 64, -64, 64, 64, 64, -64, -64, -64, -64, -64, 64, -64, 64, -64, -64, -64, -64, -64, -64, -64, -64, -64, -64, -64, -64, -64, -64, -64, -64, -64, -64, 64, -64, -64, -64, 64, 64, -64, -64, -64, -64, -64, 64, -64, -64, -64, -64, -64, -64, 64, -64, 64, -64, -64, -64, -64, 64, 64, -64, -64, -64, 64, 64, 64, 64, -64, 64, 64, -64, -64, -64, -64, 64, -64, -64, -64, -64, -64, 64, 64, 64, -64, -64, -64, -64, 64, 64, -64, 64, -64, 64, -64, -64, -64, 64, 64, -64, -64, 64, -64, -64, -64, 64, -64, 64, -64, -64, -64, 64, -64, 64, -64, -64, -64, -64, -64, -64, -64, 64, -64, -64, 64, -64, 64, 64, -64, 64, 64, 64, 64, -64, -64, -64, -64, -64, 64, 64, 64, 64, -64, 64, -64, 64, -64, -64, -64, 64, 64, 64, 64, 64, 64, -64, 64, -64, 64, -64, -64, 64, 64, 64, -64, 64, -64, 64, -64, 64, -64, 64, 64, 64, 64, -64, 64, 64, 64, -64, -64, -64, 64, -64, -64, 64, -64, -64, 64, -64, 64, 64, -64, -64, -64, -64, -64, -64, 64, 64, 64, -64, -64, -64, 64, 64, -64, -64, -64, -64, -64, 64, -64, -64, -64, 64, -64, -64, 64, -64, 64, -64, -64, -64, -64, 64, 64, 64, -64, 64, -64, -64, -64, -64, -64, 64, 64, 64, 64, -64, -64, -64, -64, 64, -64, -64, -64, -64, -64, -64, -64, -64, -64, -64, 64, 64, 64, -64, 64, 64, -64, -64, 64, 64, -64, 64, 64, -64, -64, 64, 64, -64, 64, -64, -64, -64, -64, 64, -64, -64, -64, 64, -64, 64, 64, 64, -64, -64, 64, -64, 64, -64, -64, 64, -64, 64, 64, -64, -64, -64, -64, -64, -64, 64, -64, -64, 64, -64, 64, 64, 64, 64, -64, 64, -64, -64, 64, 64, 64, 64, 64, 64, -64, -64, -64, -64, -64, -64, 64, 64, -64, 64, 64, 64, -64, -64, 64, -64, -64, -64, 64, 64, -64, -64, 64, 64, -64, 64, 64, 64, -64, -64, -64, -64, -64, -64, -64, 64, -64, -64, 64, -64, -64, -64, 64, -64, 64, 64, 64, -64, -64, 64, 64, -64, 64, 64, 64, -64, -64, -64, -64, -64, -64, -64, -64, 64, 64, 64, -64, -64, -64, 64, -64, -64, 64, 64, -64, 64, 64, 64, 64, 64, 64, -64, 64, -64, 64, 64, 64, 64, 64, 64, 64, 64, 64, -64, -64, -64, -64, -64, 64, -64, -64, 64, 64, 64, -64, -64, 64, -64, 64, 64, 64, 64, -64, -64, 64, -64, -64, 64, 64, 64, 64, 64, 64, 64, -64, -64, 64, -64, 64, 64, -64, -64, 64, 64, -64, 64, -64, 64, 64, 64, 64, -64, -64, -64, 64, 64, -64, -64, 64, 64, 64, 64, -64, -64, -64, -64, -64, -64, 64, 64, -64, -64, -64, -64, 64, 64, 64, 64, -64, 64, -64, -64, -64, 64, 64, -64, -64, 64, -64, -64, 64, -64, -64, 64, -64, -64, 64, 64, -64, -64, 64, 64, 64, 64, 64, 64, -64, 64, 64, -64, 64, 64, -64, -64, -64, 64, 64, -64, -64, 64, -64, -64, 64, -64, 64, 64, 64, -64, 64, 64, -64, -64, -64, -64, -64, 64, -64, 64, 64, 64, -64, 64, 64, 64, 64, -64, -64, -64, -64, -64, -64, -64, -64, -64, 64, -64, -64, -64, -64, -64, -64, 64, 64, 64, -64, 64, 64, 64, -64, -64, -64, -64, -64, 64, 64, -64, -64, -64, -64, -64, 64, -64, 64, 64, -64, 64, 64, -64, -64, -64, -64, 64, -64, 64, 64, -64, 64, -64, -64, -64, -64, -64, -64, 64, -64, -64, -64, 64, 64, 64, 64, -64, -64, -64, 64, -64, -64, 64, 64, 64, 64, 64, 64, 64, 64, 64, -64, 64, -64, 64, -64, 64, 64, -64, 64, 64, 64, 64, 64, -64, -64, 64, 64, -64, -64, -64, 64, -64, 64, 64, 64, 64, 64, 64, 64, 64, -64, -64, -64, 64, 64, -64, -64, 64, -64, -64, 64, -64, -64, -64, -64, -64, 64, -64, -64, -64, -64, -64, 64, -64, -64, -64, -64, -64, -64, -64, 64, 64, 64, -64, -64, 64, -64, 64, -64, 64, -64, -64, 64, 64, 64, 64, -64, -64, -64, -64, -64, -64, -64, -64, 64, 64, -64, -64, 64, 64, 64, -64, 64, -64, 64, -64, -64, -64, 64, -64, 64, 64, 64, -64, -64, -64, -64, -64, -64, 64, 64, 64, -64, -64, -64, 64, 64, 64, 64, 64, -64, 64, 64, 64, 64, 64, -64, 64, 64, 64, 64, 64, 64, -64, -64, -64, 64, -64, 64, -64, -64, -64, -64, 64, 64, -64, -64, 64, 64, 64, 64, 64, 64, 64, -64, -64, 64, 64, -64, 64, -64, -64, -64, -64, -64, 64, -64, -64, -64, -64, -64, -64, -64, -64, 64, 64, -64, 64, 64, 64, -64, 64, 64, -64, 64, 64, 64, -64, -64, -64, -64, -64, -64, -64, -64, 64, -64, -64, -64, -64, -64, -64, 64, -64, 64, -64, -64, 64, -64, -64, -64, 64, 64, 64, 64, -64, -64, -64, -64, -64, -64, 64, -64, -64, -64, -64, -64, -64, 64, -64, 64, 64, 64, -64, -64, -64, 64, 64, -64, 64, -64, 64, -64, 64, -64, -64, -64, -64, -64, -64, -64, -64, -64, 64, -64, -64, -64, -64, -64, 64, -64, 64, -64, 64, -64, 64, 64, -64, -64, -64, -64, -64, 64, -64, 64, -64, -64, 64, -64, -64, -64, -64, -64, -64, 64, -64, -64, -64, 64, 64, 64, 64, 64, -64, 64, 64, -64, 64, 64, 64, 64, -64, -64, -64, 64, -64, 64, -64, -64, -64, -64, 64, -64, 64, 64, -64, -64, -64, 64, -64, 64, 64, -64, -64, -64, -64, 64, 64, 64, -64, 64, 64, -64, 64, 64, -64, -64, -64, -64, -64, -64, -64, 64, 64, -64, 64, -64, 64, -64, 64, 64, 64, 64, 64, 64, 64, 64, 64, -64, 64, 64, -64, -64, -64, -64, -64, -64, -64, -64, -64, 64, -64, -64, -64, 64, 64, 64, -64, 64, 64, -64, -64, -64, 64, 64, 64, -64, -64, 64, 64, 64, -64, -64, 64, -64, -64, -64, -64, 64, 64, 64, 64, 64, 64, 64, -64, 64, -64, 64, -64, -64, -64, -64, 64, -64, 64, -64, -64, -64, -64, -64, -64, -64, -64, -64, -64, 64, -64, 64, 64, 64, 64, 64, 64, 64, -64, 64, 64, 64, -64, 64, 64, -64, -64, 64, 64, -64, 64, -64, -64, -64, -64, -64, 64, -64, -64, -64, 64, -64, -64, 64, -64, 64, -64, 64, -64, 64, -64, -64, 64, 64, 64, 64, -64, 64, 64, -64, -64, -64, -64, -64, -64, -64, -64, 64, 64, -64, 64, -64, -64, -64, 64, -64, -64, 64, 64, 64, 64, -64, 64, 64, 64, 64, 64, 64, 64, -64, -64, -64, -64, 64, 64, 64, 64, 64, 64, -64, 64, -64, 64, 64, 64, -64, 64, 64, 64, 64, 64, -64, -64, -64, 64, 64, 64, -64, -64, -64, 64, 64, -64, -64, -64, -64, 64, -64, -64, 64, -64, 64, -64, -64, -64, -64, 64, 64, 64, -64, -64, -64, -64, -64, -64, 64, -64, -64, -64, -64, 64, 64, 64, 64, 64, -64, 64, 64, -64, 64, 64, -64, -64, 64, 64, 64, -64, -64, 64, 64, 64, 64, -64, 64, -64, -64, -64, 64, 64, 64, -64, 64, -64, 64, -64, -64, 64, -64, -64, 64, 64, 64, 64, -64, -64, 64, 64, -64, -64, 64, -64, 64, 64, -64, -64, -64, -64, -64, 64, -64, 64, 64, 64, 64, -64, -64, 64, -64, -64, 64, -64, -64, -64, -64, -64, -64, -64, -64, 64, 64, 64, -64, 64, 64, -64, 64, 64, 64, 64, -64, -64, 64, 64, -64, -64, 64, -64, -64, 64, -64, -64, -64, 64, 64, -64, -64, 64, -64, 64, 64, -64, 64, -64, 64, -64, 64, -64, 64, -64, -64, 64, -64, 64, 64, 64, -64, 64, -64, 64, 64, 64, 64, 64, -64, -64, 64, 64, -64, 64, 64, -64, 64, -64, -64, -64, 64, 64, 64, 64, -64, -64, 64, 64, -64, -64, -64, -64, -64, -64, 64, -64, -64, -64, -64, 64, 64, 64, 64, 64, -64, 64, -64, -64, -64, 64, 64, -64, -64, 64, -64, -64, -64, -64, -64, -64, 64, -64, 64, 64, 64, 64, -64, -64, -64, -64, -64, -64, -64, -64, -64, -64, -64, 64, 64, -64, 64, 64, -64, -64, -64, -64, -64, -64, 64, 64, 64, 64, 64, 64, 64, -64, -64, -64, -64, -64, -64, -64, -64, 64, 64, -64, 64, -64, 64, 64, 64, -64, -64, -64, 64, 64, 64, 64, 64, 64, 64, 64, 64, 64, 64, -64, 64, -64, -64, -64, -64, -64, 64, 64, 64, 64, 64, 64, -64, -64, -64, -64, -64, 64, 64, 64, 64, 64, 64, 64, 64, 64, 64, 64, 64, 64, -64, -64, -64, -64, 64, 64, 64, 64, 64, -64, 64, -64, -64, -64, -64, 64, -64, -64, -64, 64, 64, 64, 64, 64, 64, 64, 64, 64, 64, -64, -64, 64, 64, -64, -64, 64, -64, 64, 64, -64, 64, -64, -64, 64, -64, 64, 64, 64, 64, 64, 64, 64, 64, 64, 64, 64, -64, -64, 64, 64, -64, -64, 64, -64, 64, -64, -64, -64, -64, -64, 64, -64, 64, -64, -64, -64, 64, 64, 64, 64, 64, 64, 64, 64, 64, 64, 64, 64, -64, -64, -64, -64, -64, 64, -64, 64, -64, 64, 64, 64, -64, -64, -64, -64, -64, -64, -64, 64, 64, 64, -64, -64, -64, 64, 64, -64, 64, -64, 64, -64, 64, 64, -64, 64, 64, -64, 64, -64, -64, -64, -64, -64, -64, -64, -64, -64, -64, 64, -64, 64, -64, -64, -64, 64, -64, 64, 64, 64, -64, -64, -64, -64, -64, -64, -64, -64, -64, -64, -64, -64, -64, -64, -64, -64, -64, -64, -64, -64, -64, -64, -64, -64, 64, -64, 64, 64, 64, -64, -64, -64, 64, 64, -64, -64, -64, -64, -64, -64, -64, -64, -64, -64, -64, -64, -64, -64, -64, -64, -64, -64, 64, -64, 64, -64, -64, -64, -64, 64, 64, -64, 64, 64, -64, 64, 64, 64, -64, -64, -64, -64, -64, -64, -64, -64, -64, -64, -64, -64, -64, -64, -64, -64, 64, 64, 64, 64, -64, -64, -64, -64, 64, -64, -64, -64, -64, -64, 64, -64, -64, -64, -64, -64, -64, -64, -64, -64, -64, 64, -64, 64, 64, 64, 64, 64, 64, -64, -64, -64, -64, -64, -64, -64, -64, -64, 64, -64, -64, -64, -64, -64, -64, -64, -64, -64, 64, -64, 64, -64, 64, 64, 64, 64, -64, -64, 64, 64, -64, -64, -64, -64, -64, -64, 64, 64, -64, -64, -64, -64, -64, -64, -64, -64, 64, 64, 64, 64, 64, 64, 64, 64, 64, 64, 64, 64, -64, -64, -64, -64, -64, -64, -64, 64, 64, -64, -64, -64, -64, 64, -64, 64, 64, -64, 64, 64, 64, 64, 64, 64, 64, -64, 64, -64, -64, -64, -64, -64, -64, -64, -64, 64, -64, 64, 64, 64, -64, -64, 64, -64, 64, -64, -64, 64, -64, 64, 64, 64, 64, 64, -64, -64, -64, -64, -64, 64, -64, -64, -64, -64, 64, -64, 64, 64, -64, 64, 64, -64, -64, 64, 64, 64, 64, -64, -64, -64, -64, -64, 64, -64, -64, -64, -64, -64, 64, -64, -64, -64, -64, -64, -64, -64, -64, 64, -64, -64, -64, 64, -64, 64, 64, -64, 64, -64, 64, 64, 64, -64, 64, 64, 64, 64, -64, 64, -64, 64, 64, -64, 64, 64, -64, -64, -64, -64, -64, 64, -64, -64, 64, 64, -64, -64, 64, -64, -64, 64, 64, 64, 64, 64, 64, 64, 64, 64, 64, 64, 64, 64, -64, 64, -64, -64, -64, 64, 64, -64, -64, 64, -64, -64, 64, 64, 64, 64, 64, 64, 64, 64, 64, 64, -64, 64, 64, 64, 64, 64, 64, -64, 64, -64, 64, -64, 64, 64, 64, 64, 64, 64, -64, 64, 64, 64, 64, 64, 64, 64, 64, 64, 64, 64, 64, 64, 64, 64, 64, 64, -64, 64, 64, -64, -64, 64, 64, 64, 64, -64, 64, 64, -64, -64, 64, 64, 64, 64, 64, 64, 64, 64, -64, -64, 64, -64, 64, 64, 64, 64, 64, 64, -64, 64, 64, -64, 64, 64, -64, -64, -64, -64, -64, -64, -64, 64, -64, 64, 64, 64, 64, -64, 64, 64, -64, -64, -64, 64, -64, 64, -64, -64, 64, 64, 64, -64, -64, -64, 64, -64, 64, -64, 64, 64, 64, 64, 64, -64, -64, 64, -64, -64, -64, 64, 64, 64, -64, 64, 64, -64, 64, -64, -64, 64, -64, 64, -64, 64, -64, -64, -64, 64, -64, 64, 64, -64, 64, -64, -64, 64, 64, -64, -64, 64, 64, -64, 64, -64, 64, 64, -64, 64, 64, 64, 64, -64, 64, -64, 64, -64, -64, 64, 64, -64, -64, 64, -64, -64, -64, 64, -64, 64, -64, -64, -64, -64, -64, -64, 64, -64, 64, 64, -64, -64, 64, 64, 64, 64, 64, 64, 64, 64, -64, 64, -64, 64, -64, -64, 64, -64, -64, -64, 64, 64, 64, 64, 64, -64, 64, 64, -64, 64, -64, 64, 64, 64, -64, -64, 64, -64, 64, -64, -64, 64, -64, 64, -64, 64, -64, -64, 64, 64, 64, -64, 64, 64, 64, 64, -64, 64, -64, -64, 64, 64, 64, 64, -64, 64, 64, -64, -64, -64, 64, 64, -64, 64, 64, 64, -64, 64, -64, 64, -64, 64, 64, 64, 64, 64, 64, -64, 64, 64, 64, -64, -64, 64, 64, 64, 64, 64, -64, 64, -64, 64, -64, -64, -64, 64, -64, 64, 64, 64, 64, 64, 64, -64, 64, 64, 64, 64, 64, 64, 64, 64, 64, 64, 64, 64, 64, -64, 64, 64, 64, -64, 64, -64, 64, -64, 64, 64, -64, 64, 64, -64, 64, 64, 64, 64, 64, 64, 64, 64, -64, 64, 64, -64, 64, -64, 64, -64, 64, 64, 64, -64, -64, 64, 64, 64, -64, 64, 64, -64, 64, -64, -64, 64, 64, 64, 64, -64, -64, 64, 64, -64, 64, -64, -64, -64, -64, 64, 64, 64, 64, -64, 64, -64, 64, 64, -64, -64, 64, 64, -64, 64, 64, 64, 64, 64, 64, -64, 64, 64, 64, -64, 64, 64, 64, 64, 64, -64, -64, -64, 64, 64, -64, 64, 64, 64, 64, -64, 64, -64, 64, -64, -64, -64, 64, 64, -64, -64, -64, 64, 64, -64, -64, 64, -64, -64, -64, -64, -64, 64, 64, -64, 64, 64, 64, -64, 64, 64, 64, 64, -64, 64, 64, 64, -64, 64, 64, -64, 64, -64, -64, -64, -64, 64, -64, 64, -64, -64, 64, 64, 64, 64, -64, -64, 64, 64, 64, -64, -64, 64, 64, 64, 64, -64, 64, -64, 64, 64, 64, 64, 64, -64, 64, -64, 64, -64, 64, 64, 64, 64, 64, 64, 64, 64, 64, 64, 64, 64, 64, 64, 64, 64, -64, -64, 64, -64, -64, 64, -64, 64, 64, 64, 64, 64, 64, -64, 64, 64, -64, -64, 64, 64, 64, 64, -64, 64, 64, -64, 64, 64, 64, -64, 64, -64, -64, -64, 64, -64, 64, -64, 64, -64, 64, -64, -64, -64, -64, 64, 64, 64, 64, 64, 64, -64, 64, 64, 64, 64, -64, -64, -64, -64, 64, 64, -64, -64, -64, -64, -64, 64, -64, 64, 64, 64, -64, 64, 64, 64, 64, 64, 64, -64, 64, 64, 64, -64, -64, -64, -64, 64, 64, 64, 64, -64, -64, 64, 64, 64, 64, 64, 64, 64, -64, 64, 64, 64, 64, 64, -64, 64, 64, -64, 64, 64, 64, -64, -64, -64, -64, -64, 64, 64, -64, 64, 64, -64, -64, 64, 64, 64, -64, 64, 64, 64, 64, 64, 64, 64, 64, -64, -64, -64, 64, -64, -64, 64, -64, -64, 64, -64, -64, -64, 64, 64, 64, 64, 64, -64, 64, 64, -64, 64, 64, 64, 64, 64, 64, -64, -64, -64, 64, 64, 64, -64, 64, -64, 64, -64, -64, -64, -64, 64, -64, 64, 64, 64, 64, -64, -64, 64, 64, -64, -64, -64, 64, -64, -64, 64, 64, -64, -64, -64, -64, 64, -64, -64, -64, 64, 64, 64, -64, -64, 64, 64, 64, 64, 64, -64, -64, -64, 64, 64, 64, 64, 64, -64, 64, 64, 64, -64, 64, -64, 64, -64, 64, 64, -64, 64, 64, 64, 64, 64, -64, -64, -64, -64, 64, -64, -64, 64, 64, -64, 64, -64, -64, 64, -64, -64, -64, -64, -64, -64, -64, -64, -64, 64, 64, -64, -64, 64, 64, -64, -64, 64, 64, -64, -64, -64, -64, -64, 64, -64, -64, -64, 64, -64, -64, -64, -64, 64, 64, -64, 64, -64, -64, 64, 64, -64, -64, 64, 64, 64, 64, 64, 64, 64, -64, -64, -64, 64, -64, 64, 64, -64, 64, -64, 64, 64, 64, -64, -64, 64, -64, -64, 64, -64, -64, -64, -64, -64, -64, 64, -64, -64, 64, 64, -64, 64, 64, 64, 64, -64, 64, -64, -64, 64, 64, 64, -64, 64, 64, -64, 64, -64, -64, -64, 64, 64, 64, 64, 64, -64, -64, -64, -64, -64, 64, 64, -64, -64, -64, -64, 64, 64, -64, 64, -64, 64, 64, -64, 64, 64, -64, -64, 64, -64, 64, 64, 64, -64, 64, -64, 64, 64, 64, 64, -64, 64, -64, 64, 64, -64, -64, -64, -64, -64, 64, 64, 64, 64, 64, -64, -64, 64, 64, -64, -64, -64, -64, -64, 64, 64, 64, 64, -64, 64, 64, 64, 64, 64, 64, 64, -64, -64, 64, 64, 64, 64, 64, 64, 64, -64, -64, 64, 64, 64, -64, -64, -64, 64, 64, -64, -64, 64, -64, -64, -64, 64, -64, -64, -64, 64, 64, 64, 64, 64, 64, -64, 64, 64, -64, 64, 64, -64, 64, -64, -64, -64, -64, -64, -64, -64, 64, 64, -64, 64, -64, 64, 64, 64, 64, 64, 64, 64, 64, 64, 64, -64, -64, -64, -64, -64, -64, -64, -64, -64, -64, -64, -64, -64, -64, 64, 64, -64, 64, 64, -64, -64, -64, -64, 64, -64, -64, 64, 64, 64, -64, -64, -64, -64, -64, -64, -64, -64, -64, -64, -64, -64, -64, 64, -64, -64, 64, 64, 64, -64, 64, -64, 64, -64, -64, 64, 64, 64, 64, 64, 64, -64, -64, -64, -64, 64, -64, 64, -64, -64, 64, 64, 64, -64, 64, 64, 64, 64, 64, 64, -64, -64, -64, 64, 64, 64, 64, 64, 64, 64, -64, 64, 64, -64, 64, 64, 64, 64, -64, 64, -64, 64, 64, 64, 64, 64, 64, -64, -64, -64, 64, 64, 64, 64, 64, 64, 64, 64, 64, -64, 64, 64, 64, 64, 64, 64, -64, 64, 64, -64, 64, 64, 64, -64, 64, -64, -64, 64, 64, 64, 64, 64, 64, 64, 64, 64, 64, 64, -64, 64, 64, 64, 64, 64, 64, 64, 64, -64, 64, -64, 64, 64, -64, -64, 64, 64, 64, 64, 64, 64, 64, 64, 64, 64, -64, -64, -64, 64, 64, 64, 64, 64, 64, 64, 64, -64, 64, -64, -64, 64, -64, -64, -64, 64, 64, 64, 64, 64, 64, 64, 64, 64, 64, -64, -64, -64, -64, 64, -64, 64, 64, -64, -64, -64, 64, 64, -64, -64, -64, -64, 64, 64, 64, 64, 64, 64, 64, 64, 64, 64, -64, -64, -64, 64, 64, -64, 64, 64, 64, 64, -64, 64, -64, 64, -64, -64, -64, -64, -64, -64, -64, 64, 64, 64, 64, 64, 64, 64, -64, -64, -64, -64, 64, 64, -64, 64, 64, -64, 64, -64, 64, -64, -64, -64, -64, -64, -64, -64, -64, 64, 64, 64, 64, 64, 64, 64, 64, -64, 64, 64, -64, -64, 64, 64, 64, -64, 64, 64, -64, -64, 64, -64, -64, -64, -64, -64, -64, 64, 64, 64, 64, 64, 64, 64, -64, -64, -64, 64, -64, 64, -64, 64, 64, -64, -64, 64, 64, 64, 64, 64, -64, -64, -64, -64, -64, 64, -64, -64, -64, 64, 64, 64, -64, -64, 64, 64, 64, -64, -64, 64, 64, 64, -64, -64, 64, 64, 64, -64, -64, -64, -64, -64, -64, -64, -64, 64, 64, 64, 64, -64, -64, 64, -64, 64, 64, -64, -64, 64, -64, -64, -64, 64, -64, 64, 64, -64, -64, -64, -64, -64, -64, 64, 64, 64, -64, 64, -64, -64, -64, -64, -64, 64, 64, -64, -64, 64, -64, -64, -64, -64, 64, -64, -64, 64, -64, 64, 64, -64, -64, -64, 64, 64, -64, 64, 64, 64, 64, -64, -64, 64, -64, -64, -64, -64, 64, 64, 64, 64, 64, 64, -64, 64, 64, 64, -64, -64, -64, 64, -64, 64, 64, 64, -64, -64, 64, 64, -64, 64, -64, -64, -64, 64, 64, 64, 64, -64, 64, -64, 64, 64, 64, 64, 64, -64, -64, -64, -64, -64, 64, 64, 64, -64, -64, 64, -64, 64, -64, -64, -64, -64, 64, 64, -64, 64, 64, 64, 64, 64, 64, 64, 64, 64, 64, 64, -64, 64, 64, 64, -64, 64, -64, -64, -64, -64, -64, -64, -64, -64, -64, -64, 64, 64, -64, 64, -64, 64, 64, 64, 64, 64, 64, 64, 64, 64, 64, 64, 64, 64, -64, 64, -64, 64, -64, -64, -64, -64, 64, -64, -64, 64, 64, 64, -64, 64, 64, -64, -64, 64, 64, 64, 64, 64, 64, 64, 64, 64, 64, 64, -64, 64, 64, -64, -64, -64, -64, -64, -64, 64, 64, -64, -64, 64, -64, 64, 64, -64, -64, 64, 64, 64, 64, 64, 64, 64, 64, -64, 64, -64, -64, -64, -64, -64, 64, 64, 64, 64, 64, -64, 64, -64, 64, -64, 64, -64, 64, 64, -64, 64, -64, -64, 64, 64, 64, -64, -64, -64, 64, -64, 64, -64, -64, -64, 64, -64, 64, 64, 64, -64, 64, -64, 64, -64, 64, 64, -64, -64, -64, 64, 64, -64, 64, 64, 64, -64, 64, 64, -64, 64, -64, 64, 64, -64, 64, -64, 64, -64, -64, -64, -64, 64, -64, 64, 64, -64, -64, 64, -64, 64, 64, 64, 64, -64, -64, -64, 64, 64, 64, 64, -64, -64, -64, 64, -64, -64, -64, 64, -64, -64, -64, -64, 64, 64, -64, 64, 64, 64, -64, 64, -64, 64, -64, -64, -64, 64, -64, 64, -64, 64, 64, 64, -64, 64, 64, 64, -64, -64, 64, -64, 64, -64, -64, 64, 64, 64, 64, -64, 64, -64, 64, 64, 64, 64, 64, 64, -64, 64, 64, 64, -64, 64, -64, 64, 64, -64, 64, -64, 64, -64, -64, -64, 64, 64, -64, 64, -64, -64, -64, 64, 64, -64, -64, -64, 64, 64, -64, -64, -64, -64, 64, -64, 64, -64, -64, -64, 64, 64, 64, 64, -64, -64, 64, 64, 64, -64, 64, -64, -64, 64, -64, -64, 64, 64, -64, -64, 64, -64, 64, 64, -64, 64, 64, 64, 64, 64, 64, -64, -64, -64, 64, 64, -64, -64, 64, -64, 64, 64, 64, 64, 64, -64, -64, 64, 64, 64, 64, -64, 64, 64, 64, -64, 64, 64, -64, 64, 64, 64, 64, 64, -64, 64, -64, 64, 64, 64, 64, 64, 64, -64, 64, -64, 64, 64, 64, -64, 64, -64, 64, 64, 64, -64, -64, -64, 64, 64, -64, -64, -64, 64, -64, 64, 64, 64, -64, 64, -64, 64, -64, -64, 64, 64, -64, 64, 64, 64, 64, 64, -64, 64, -64, 64, -64, 64, -64, 64, -64, 64, 64, 64, 64, 64, -64, -64, -64, 64, 64, -64, 64, 64, 64, -64, 64, -64, -64, 64, 64, 64, -64, -64, 64, 64, 64, -64, 64, 64, -64, 64, 64, -64, -64, 64, 64, -64, 64, 64, -64, 64, 64, 64, -64, -64, 64, 64, -64, 64, 64, 64, -64, 64, -64, 64, 64, 64, 64, -64, 64, -64, 64, 64, 64, 64, -64, 64, 64, 64, -64, 64, 64, -64, 64, 64, -64, 64, 64, 64, -64, 64, 64, 64, 64, -64, 64, -64, -64, 64, -64, 64, -64, 64, -64, -64, 64, 64, 64, -64, 64, -64, 64, 64, -64, -64, 64, -64, -64, -64, 64, 64, -64, 64, 64, 64, 64, -64, 64, 64, 64, -64, -64, -64, -64, 64, 64, -64, -64, -64, -64, -64, -64, 64, 64, 64, 64, -64, 64, 64, -64, 64, -64, 64, 64, -64, 64, -64, 64, -64, -64, -64, -64, -64, 64, 64, 64, 64, 64, 64, 64, -64, -64, 64, 64, 64, 64, 64, -64, -64, 64, -64, 64, 64, 64, 64, 64, 64, -64, -64, 64, -64, 64, 64, -64, 64, 64, -64, 64, -64, 64, 64, -64, 64, 64, -64, 64, -64, 64, 64, -64, -64, -64, -64, 64, -64, -64, -64, 64, 64, -64, 64, 64, -64, -64, -64, -64, 64, 64, -64, -64, 64, 64, -64, 64, -64, 64, 64, 64, 64, 64, -64, -64, 64, -64, 64, 64, 64, -64, 64, 64, 64, -64, -64, 64, 64, -64, 64, 64, 64, 64, 64, 64, -64, 64, -64, 64, -64, 64, -64, 64, 64, 64, -64, -64, 64, -64, 64, 64, 64, -64, 64, 64, 64, 64, 64, 64, 64, 64, 64, -64, 64, -64, 64, -64, 64, 64, -64, 64, 64, 64, 64, -64, -64, 64, -64, 64, 64, 64, 64, -64, 64, 64, 64, -64, 64, -64, -64, -64, -64, -64, -64, 64, -64, 64, 64, -64, -64, 64, -64, 64, 64, -64, -64, -64, 64, 64, -64, 64, 64, 64, 64, 64, -64, 64, 64, 64, 64, 64, 64, 64, 64, 64, -64, 64, 64, -64, -64, -64, 64, 64, 64, -64, -64, 64, 64, 64, 64, 64, 64, -64, 64, -64, 64, 64, -64, 64, 64, -64, 64, -64, -64, 64, 64, -64, -64, -64, -64, 64, 64, 64, 64, 64, 64, 64, 64, 64, -64, 64, 64, -64, -64, -64, 64, -64, -64, 64, -64, -64, 64, 64, 64, -64, 64, -64, 64, -64, 64, 64, -64, 64, -64, 64, -64, 64, -64, 64, -64, 64, -64, 64, 64, 64, 64, 64, -64, -64, 64, 64, 64, -64, 64, 64, 64, 64, -64, 64, -64, 64, 64, 64, 64, 64, 64, 64, 64, -64, -64, 64, -64, 64, -64, 64, 64, -64, -64, -64, -64, 64, -64, -64, 64, -64, -64, 64, -64, 64, -64, 64, -64, -64, -64, -64, 64, -64, -64, 64, -64, -64, -64, -64, 64, -64, -64, -64, 64, -64, 64, 64, 64, -64, 64, -64, 64, -64, 64, 64, -64, -64, 64, -64, -64, 64, -64, -64, -64, 64, 64, -64, 64, -64, 64, -64, -64, -64, -64, 64, -64, 64, -64, 64, -64, -64, -64, -64, 64, -64, 64, 64, 64, 64, 64, -64, -64, -64, 64, 64, 64, -64, -64, -64, 64, 64, -64, -64, 64, 64, -64, 64, -64, 64, -64, -64, -64, -64, -64, -64, -64, -64, 64, 64, 64, -64, -64, 64, -64, 64, -64, 64, -64, -64, -64, 64, -64, -64, -64, 64, -64, -64, -64, -64, -64, 64, 64, -64, -64, -64, -64, 64, -64, -64, 64, 64, 64, 64, -64, -64, -64, 64, -64, -64, -64, -64, -64, 64, 64, -64, -64, -64, -64, 64, -64, -64, -64, -64, -64, -64, 64, 64, 64, -64, -64, -64, -64, -64, 64, -64, 64, -64, -64, 64, -64, 64, 64, 64, 64, 64, -64, -64, -64, -64, -64, 64, 64, -64, -64, -64, 64, -64, -64, -64, 64, -64, -64, -64, -64, 64, -64, -64, -64, -64, -64, 64, -64, -64, -64, 64, -64, 64, -64, 64, 64, 64, -64, -64, -64, -64, -64, -64, 64, -64, 64, 64, -64, -64, -64, -64, -64, 64, 64, 64, -64, -64, 64, 64, 64, -64, 64, 64, 64, 64, -64, 64, 64, -64, 64, -64, -64, 64, -64, -64, -64, 64, -64, -64, -64, -64, 64, 64, -64, -64, 64, 64, -64, 64, 64, -64, -64, -64, 64, -64, 64, 64, 64, 64, 64, 64, -64, -64, 64, -64, -64, -64, -64, -64, 64, 64, 64, -64, 64, -64, -64, -64, -64, 64, -64, 64, -64, 64, 64, 64, 64, -64, 64, -64, -64, -64, 64, -64, -64, -64, -64, -64, 64, 64, 64, -64, -64, -64, -64, 64, -64, 64, -64, 64, 64, 64, 64, 64, 64, 64, 64, 64, 64, -64, -64, 64, 64, -64, -64, -64, 64, 64, -64, -64, -64, -64, -64, -64, -64, -64, 64, 64, 64, 64, 64, 64, 64, 64, 64, 64, 64, 64, 64, 64, -64, 64, 64, 64, 64, 64, -64, -64, -64, -64, 64, 64, -64, -64, 64, 64, 64, 64, 64, 64, -64, 64, 64, -64, 64, 64, 64, 64, -64, 64, 64, 64, 64, -64, -64, -64, -64, -64, -64, -64, -64, -64, 64, 64, 64, 64, 64, 64, 64, -64, 64, -64, 64, 64, 64, 64, -64, 64, 64, 64, 64, 64, -64, -64, -64, -64, 64, -64, -64, -64, 64, 64, 64, 64, 64, 64, -64, -64, -64, 64, 64, 64, 64, 64, 64, 64, 64, 64, 64, -64, -64, -64, 64, 64, -64, -64, -64, -64, -64, -64, 64, 64, 64, 64, 64, 64, 64, 64, -64, -64, -64, 64, -64, 64, 64, 64, 64, -64, -64, -64, -64, -64, -64, -64, -64, -64, -64, -64, 64, 64, 64, 64, 64, -64, -64, 64, 64, -64, -64, 64, 64, -64, -64, -64, -64, -64, 64, 64, -64, -64, -64, -64, -64, -64, -64, 64, -64, 64, 64, 64, -64, -64, -64, -64, -64, -64, -64, 64, 64, -64, -64, -64, -64, -64, -64, -64, -64, -64, -64, -64, -64, -64, -64, 64, 64, 64, -64, 64, -64, 64, 64, 64, -64, 64, -64, 64, -64, -64, -64, -64, -64, 64, -64, -64, -64, -64, -64, -64, -64, -64, 64, 64, 64, 64, 64, -64, -64, 64, -64, 64, -64, 64, -64, -64, 64, -64, 64, 64, -64, -64, 64, -64, -64, -64, -64, -64, -64, 64, 64, 64, 64, 64, -64, -64, -64, -64, 64, -64, 64, 64, -64, -64, -64, -64, -64, 64, 64, 64, 64, 64, -64, -64, -64, -64, -64, -64, 64, 64, 64, -64, -64, -64, -64, -64, -64, 64, 64, -64, -64, -64, 64, 64, -64, 64, 64, 64, 64, 64, -64, -64, -64, -64, -64, 64, 64, -64, 64, -64, -64, -64, 64, 64, 64, -64, -64, -64, 64, -64, 64, 64, 64, 64, 64, 64, -64, 64, -64, -64, -64, 64, 64, -64, 64, -64, -64, -64, -64, -64, 64, 64, 64, 64, -64, -64, -64, 64, 64, 64, 64, 64, 64, -64, 64, -64, -64, -64, -64, 64, 64, 64, -64, -64, 64, 64, 64, 64, -64, -64, -64, 64, -64, 64, 64, 64, 64, 64, 64, 64, 64, -64, -64, -64, 64, 64, 64, 64, 64, -64, -64, -64, 64, 64, 64, -64, 64, 64, 64, 64, -64, -64, 64, 64, 64, 64, 64, -64, -64, 64, -64, 64, 64, 64, 64, -64, -64, -64, 64, -64, 64, 64, 64, -64, -64, -64, 64, 64, 64, -64, -64, 64, 64, 64, -64, -64, 64, 64, 64, 64, 64, 64, 64, 64, -64, -64, 64, 64, 64, -64, 64, -64, 64, -64, 64, -64, 64, 64, 64, 64, 64, 64, -64, 64, 64, -64, -64, 64, -64, -64, 64, 64, 64, -64, 64, 64, -64, -64, -64, 64, 64, 64, 64, 64, -64, -64, 64, 64, 64, 64, -64, 64, 64, -64, -64, -64, -64, -64, 64, 64, -64, -64, 64, 64, 64, 64, -64, -64, -64, 64, -64, 64, 64, -64, -64, 64, -64, 64, 64, -64, -64, -64, -64, -64, 64, -64, -64, 64, -64, 64, -64, 64, 64, -64, -64, -64, -64, -64, -64, 64, 64, 64, -64, -64, 64, -64, 64, -64, 64, 64, -64, -64, 64, -64, -64, 64, 64, 64, -64, -64, -64, -64, 64, -64, 64, -64, -64, 64, 64, -64, 64, 64, -64, 64, 64, -64, 64, -64, 64, 64, 64, -64, -64, -64, -64, 64, 64, -64, 64, -64, -64, -64, 64, -64, -64, -64, 64, 64, -64, 64, 64, -64, -64, 64, -64, -64, 64, 64, 64, 64, -64, -64, -64, -64, 64, 64, -64, 64, -64, 64, 64, 64, -64, -64, -64, 64, -64, 64, -64, -64, -64, -64, -64, -64, -64, -64, 64, -64, -64, -64, 64, -64, -64, -64, -64, -64, 64, -64, -64, -64, 64, 64, -64, -64, -64, -64, -64, -64, 64, 64, -64, 64, 64, -64, -64, -64, 64, 64, -64, -64, -64, -64, -64, -64, -64, -64, -64, 64, -64, -64, -64, -64, -64, 64, 64, 64, 64, -64, -64, 64, 64, -64, -64, -64, -64, -64, -64, -64, -64, -64, -64, -64, 64, -64, -64, -64, 64, 64, 64, 64, 64, -64, 64, 64, 64, -64, -64, -64, -64, 64, 64, -64, -64, -64, -64, -64, -64, -64, -64, -64, 64, -64, 64, -64, -64, 64, 64, 64, 64, -64, 64, -64, -64, -64, -64, -64, -64, -64, -64, 64, -64, -64, -64, -64, -64, 64, -64, 64, -64, 64, -64, -64, 64, -64, 64, 64, 64, -64, -64, -64, -64, -64, -64, -64, -64, -64, -64, -64, 64, -64, -64, -64, -64, -64, -64, -64, -64, 64, 64, -64, 64, -64, -64, 64, 64, 64, -64, -64, -64, -64, 64, 64, -64, 64, 64, -64, -64, -64, -64, -64, -64, -64, -64, -64, 64, 64, -64, 64, -64, -64, 64, -64, -64, -64, -64, -64, -64, -64, 64, -64, -64, -64, 64, -64, -64, -64, -64, -64, -64, -64, -64, -64, 64, 64, -64, -64, -64, -64, -64, -64, 64, 64, -64, -64, -64, -64, 64, 64, 64, -64, -64, -64, -64, -64, -64, -64, -64, -64, -64, -64, -64, -64, 64, -64, 64, 64, -64, -64, 64, 64, -64, -64, -64, -64, -64, -64, -64, -64, -64, 64, -64, -64, 64, -64, -64, -64, -64, -64, -64, -64, 64, 64, -64, -64, 64, 64, 64, -64, -64, 64, -64, -64, -64, -64, -64, 64, 64, -64, -64, -64, 64, 64, -64, 64, -64, 64, 64, -64, -64, -64, 64, 64, -64, -64, -64, 64, -64, -64, -64, 64, 64, -64, 64, 64, 64, -64, 64, -64, -64, 64, 64, -64, -64, 64, 64, 64, -64, 64, 64, 64, 64, -64, -64, -64, -64, -64, -64, -64, -64, 64, 64, -64, -64, -64, -64, 64, -64, -64, -64, -64, 64, 64, 64, -64, -64, -64, 64, 64, -64, 64, -64, 64, -64, 64, -64, -64, -64, -64, -64, -64, -64, -64, -64, -64, -64, -64, -64, -64, 64, 64, 64, 64, -64, -64, -64, -64, -64, 64, 64, -64, 64, -64, 64, 64, 64, -64, 64, -64, -64, 64, 64, -64, -64, -64, -64, 64, 64, 64, 64, -64, 64, -64, 64, -64, 64, 64, -64, 64, -64, 64, -64, -64, -64, -64, -64, 64, -64, -64, -64, -64, -64, -64, -64, 64, 64, 64, 64, -64, -64, -64, -64, 64, 64, 64, -64, 64, 64, -64, 64, -64, -64, -64, -64, -64, -64, -64, 64, 64, -64, 64, -64, 64, 64, 64, -64, -64, 64, -64, -64, 64, 64, -64, -64, 64, 64, -64, 64, 64, -64, -64, -64, -64, -64, -64, -64, -64, 64, -64, -64, -64, 64, 64, -64, 64, 64, -64, 64, -64, 64, -64, 64, -64, -64, 64, 64, -64, -64, -64, -64, -64, -64, -64, 64, -64, -64, 64, 64, 64, 64, -64, -64, 64, -64, 64, 64, -64, -64, 64, 64, -64, -64, 64, 64, 64, 64, -64, 64, -64, 64, -64, -64, -64, -64, -64, 64, -64, -64, -64, -64, -64, 64, -64, 64, -64, -64, -64, 64, 64, 64, 64, 64, 64, -64, 64, 64, -64, 64, -64, 64, -64, -64, -64, 64, 64, 64, 64, -64, -64, 64, 64, -64, -64, 64, -64, -64, 64, 64, -64, -64, 64, 64, 64, 64, -64, -64, -64, -64, -64, -64, -64, -64, -64, -64, 64, -64, 64, -64, -64, 64, 64, 64, -64, 64, -64, -64, 64, -64, 64, -64, 64, -64, -64, 64, 64, 64, -64, 64, -64, -64, -64, -64, -64, 64, -64, 64, -64, 64, -64, -64, -64, 64, -64, -64, -64, -64, -64, 64, 64, -64, 64, 64, -64, -64, -64, 64, -64, 64, 64, -64, -64, 64, -64, 64, 64, -64, 64, 64, -64, -64, -64, 64, 64, 64, 64, 64, 64, 64, -64, 64, 64, 64, 64, -64, -64, 64, 64, 64, 64, 64, -64, -64, -64, 64, -64, 64, -64, 64, -64, 64, 64, 64, -64, -64, 64, -64, -64, -64, 64, 64, -64, 64, -64, -64, 64, -64, 64, 64, -64, -64, -64, -64, -64, -64, -64, 64, -64, 64, 64, -64, 64, -64, -64, -64, 64, 64, -64, -64, 64, 64, -64, -64, 64, -64, -64, -64, -64, -64, 64, 64, -64, -64, 64, -64, 64, -64, -64, 64, -64, 64, 64, 64, -64, -64, -64, -64, -64, -64, 64, -64, -64, -64, 64, 64, 64, 64, 64, 64, -64, -64, 64, 64, -64, -64, 64, -64, -64, -64, -64, 64, 64, -64, 64, -64, 64, -64, 64, -64, -64, 64, -64, 64, 64, -64, 64, -64, -64, 64, 64, -64, -64, -64, -64, -64, -64, 64, 64, 64, -64, -64, -64, -64, 64, -64, -64, -64, -64, -64, -64, 64, 64, 64, 64, -64, -64, -64, -64, -64, 64, 64, -64, 64, -64, -64, 64, -64, -64, -64, -64, -64, -64, -64, -64, -64, 64, 64, 64, -64, 64, -64, -64, 64, -64, -64, -64, -64, 64, -64, -64, -64, 64, -64, 64, -64, 64, -64, -64, -64, 64, 64, -64, -64, -64, 64, 64, 64, 64, 64, 64, -64, -64, 64, 64, -64, -64, -64, -64, -64, -64, -64, -64, 64, 64, 64, -64, 64, -64, -64, 64, -64, 64, 64, 64, -64, -64, 64, -64, 64, 64, 64, -64, -64, -64, 64, -64, -64, -64, -64, 64, -64, -64, -64, -64, 64, -64, -64, 64, 64, -64, 64, -64, -64, -64, -64, 64, -64, 64, -64, -64, -64, 64, -64, -64, 64, 64, 64, -64, -64, 64, 64, -64, -64, -64, -64, -64, 64, 64, 64, -64, 64, -64, 64, -64, 64, -64, 64, 64, 64, -64, -64, -64, -64, -64, -64, -64, -64, 64, -64, 64, -64, -64, -64, 64, 64, -64, -64, -64, -64, -64, 64, -64, -64, -64, 64, -64, 64, 64, -64, 64, 64, 64, -64, -64, 64, 64, -64, 64, -64, 64, -64, -64, 64, -64, 64, 64, -64, 64, 64, -64, 64, 64, -64, 64, 64, 64, -64, -64, -64, -64, -64, 64, -64, -64, 64, -64, -64, 64, -64, -64, 64, -64, -64, 64, 64, -64, 64, 64, 64, 64, 64, -64, 64, -64, -64, -64, -64, -64, 64, 64, 64, 64, -64, -64, -64, -64, -64, -64, 64, -64, -64, 64, -64, 64, -64, -64, -64, -64, 64, 64, 64, -64, 64, 64, -64, -64, -64, -64, -64, -64, -64, -64, 64, 64, -64, -64, -64, -64, -64, -64, -64, -64, -64, -64, -64, -64, 64, -64, 64, 64, 64, -64, -64, 64, -64, -64, -64, -64, -64, -64, 64, -64, -64, -64, -64, -64, -64, 64, 64, -64, -64, -64, 64, 64, -64, 64, -64, -64, -64, 64, -64, 64, -64, 64, 64, -64, -64, -64, -64, -64, -64, -64, -64, 64, -64, -64, 64, -64, -64, -64, -64, -64, -64, -64, -64, 64, -64, -64, 64, 64, -64, -64, 64, 64, -64, 64, -64, -64, -64, 64, -64, -64, -64, 64, -64, -64, -64, -64, 64, 64, -64, -64, 64, 64, 64, -64, 64, -64, -64, -64, 64, -64, -64, -64, -64, 64, -64, -64, 64, 64, 64, -64, -64, -64, 64, -64, 64, 64, 64, 64, 64, 64, -64, -64, 64, 64, -64, -64, 64, 64, 64, -64, -64, 64, -64, 64, 64, -64, -64, -64, -64, 64, -64, 64, -64, -64, -64, 64, 64, -64, -64, 64, -64, -64, -64, -64, -64, 64, -64, -64, -64, -64, 64, -64, -64, 64, 64, 64, -64, -64, -64, -64, 64, 64, 64, -64, 64, -64, -64, -64, 64, 64, -64, -64, -64, -64, -64, -64, 64, 64, 64, -64, -64, -64, -64, 64, -64, -64, 64, 64, -64, -64, 64, 64, 64, -64, -64, 64, -64, -64, -64, -64, 64, -64, 64, 64, 64, 64, -64, -64, 64, 64, -64, -64, -64, 64, 64, -64, -64, 64, -64, 64, -64, 64, -64, -64, 64, 64, 64, 64, -64, -64, -64, -64, 64, 64, -64, 64, -64, -64, 64, -64, 64, 64, 64, -64, -64, 64, 64, 64, 64, 64, -64, 64, 64, -64, -64, 64, -64, -64, -64, 64, 64, -64, 64, 64, 64, -64, -64, -64, 64, 64, 64, -64, 64, -64, 64, -64, -64, 64, 64, 64, -64, -64, 64, 64, -64, -64, -64, 64, -64, 64, 64, -64, 64, -64, -64, -64, 64, 64, 64, -64, 64, -64, -64, -64, 64, -64, 64, -64, 64, 64, -64, 64, 64, 64, 64, 64, -64, 64, -64, -64, 64, -64, -64, 64, -64, -64, 64, 64, -64, 64, -64, -64, -64, -64, 64, 64, -64, 64, -64, 64, 64, -64, 64, 64, 64, -64, -64, 64, -64, 64, -64, -64, -64, 64, -64, -64, -64, -64, 64, -64, 64, -64, 64, 64, -64, -64, 64, -64, 64, 64, -64, -64, 64, -64, -64, 64, 64, 64, 64, -64, -64, -64, 64, -64, 64, 64, -64, 64, 64, 64, 64, 64, 64, 64, -64, 64, -64, 64, 64, 64, -64, 64, 64, 64, -64, 64, -64, 64, 64, 64, 64, -64, 64, 64, 64, 64, -64, -64, 64, -64, -64, 64, -64, -64, -64, -64, -64, -64, -64, -64, -64, -64, -64, -64, -64, -64, -64, 64, -64, 64, 64, 64, 64, 64, -64, 64, 64, 64, -64, -64, 64, -64, -64, -64, -64, 64, 64, -64, -64, -64, 64, -64, -64, -64, -64, 64, 64, -64, -64, -64, 64, 64, -64, 64, 64, 64, 64, 64, 64, -64, 64, -64, -64, -64, 64, -64, 64, -64, 64, 64, -64, -64, 64, -64, 64, 64, 64, -64, 64, 64, 64, -64, 64, 64, -64, 64, -64, -64, -64, -64, -64, -64, -64, 64, 64, -64, -64, -64, 64, 64, -64, -64, -64, -64, -64, -64, -64, -64, 64, -64, -64, -64, 64, -64, -64, 64, -64, 64, -64, -64, -64, -64, -64, 64, -64, -64, -64, -64, -64, -64, 64, -64, -64, -64, -64, -64, -64, 64, 64, -64, -64, -64, -64, -64, 64, -64, -64, 64, -64, 64, 64, -64, -64, -64, 64, -64, 64, 64, 64, -64, 64, -64, 64, 64, -64, -64, 64, 64, 64, -64, -64, 64, -64, -64, 64, -64, -64, -64, -64, -64, 64, 64, -64, -64, -64, -64, -64, 64, -64, -64, 64, 64, -64, -64, 64, -64, -64, -64, 64, -64, 64, -64, -64, 64, 64, -64, 64, -64, -64, -64, -64, 64, 64, -64, -64, 64, -64, -64, 64, -64, -64, -64, -64, 64, -64, 64, -64, -64, -64, -64, -64, -64, -64, -64, -64, 64, 64, -64, -64, 64, -64, -64, 64, -64, 64, -64, 64, -64, -64, -64, 64, -64, -64, -64, -64, -64, -64, 64, -64, 64, -64, -64, -64, -64, 64, 64, -64, -64, -64, -64, -64, 64, -64, 64, -64, -64, 64, 64, 64, -64, 64, 64, -64, -64, -64, 64, -64, -64, 64, 64, 64, 64, -64, -64, -64, -64, 64, -64, -64, -64, -64, 64, -64, -64, -64, -64, -64, 64, 64, 64, -64, -64, 64, -64, -64, 64, -64, 64, -64, 64, -64, -64, -64, -64, -64, 64, -64, 64, -64, -64, 64, 64, 64, 64, -64, -64, -64, -64, -64, 64, -64, -64, -64, -64, 64, -64, -64, 64, 64, 64, -64, -64, -64, 64, 64, 64, -64, 64, 64, -64, -64, -64, 64, -64, -64, 64, -64, -64, -64, -64, 64, 64, -64, -64, 64, -64, 64, -64, 64, -64, -64, 64, -64, 64, -64, 64, 64, -64, -64, -64, -64, -64, 64, 64, 64, -64, 64, -64, -64, -64, -64, -64, -64, -64, 64, -64, -64, 64, -64, 64, 64, -64, 64, -64, -64, 64, 64, -64, 64, 64, 64, -64, -64, 64, 64, -64, 64, -64, -64, 64, 64, -64, -64, -64, -64, -64, 64, 64, -64, 64, -64, -64, 64, -64, -64, 64, 64, -64, -64, 64, 64, -64, -64, -64, -64, -64, 64, 64, -64, -64, 64, -64, 64, 64, -64, -64, -64, 64, 64, -64, -64, -64, 64, 64, 64, 64, -64, -64, -64, -64, -64, 64, -64, -64, -64, -64, 64, 64, 64, -64, 64, -64, -64, 64, 64, 64, 64, 64, -64, -64, 64, -64, 64, 64, -64, -64, -64, -64, -64, 64, -64, 64, 64, -64, -64, -64, 64, 64, -64, 64, -64, -64, -64, -64, 64, -64, 64, 64, -64, 64, -64, 64, -64, -64, -64, 64, -64, -64, -64, 64, 64, -64, -64, -64, 64, -64, 64, 64, 64, 64, 64, 64, -64, -64, 64, 64, 64, -64, -64, 64, -64, -64, -64, 64, -64, -64, 64, 64, -64, -64, -64, -64, 64, -64, -64, 64, -64, 64, 64, -64, -64, 64, -64, -64, -64, -64, -64, 64, 64, -64, -64, -64, -64, -64, 64, 64, 64, -64, 64, -64, 64, 64, 64, 64, 64, 64, 64, 64, 64, 64, -64, 64, 64, 64, 64, 64, -64, 64, 64, -64, -64, -64, 64, 64, -64, 64, 64, 64, -64, 64, -64, 64, 64, 64, -64, 64, -64, -64, -64, 64, -64, 64, -64, -64, -64, -64, 64, 64, 64, 64, -64, 64, 64, -64, -64, -64, -64, 64, -64, 64, 64, 64, 64, 64, 64, -64, 64, -64, -64, -64, 64, 64, 64, 64, 64, 64, 64, -64, 64, 64, 64, -64, 64, -64, -64, -64, -64, -64, 64, 64, -64, 64, -64, 64, 64, 64, 64, 64, -64, 64, 64, -64, -64, -64, 64, -64, 64, -64, -64, 64, 64, -64, -64, 64, 64, 64, -64, 64, 64, 64, 64, 64, 64, -64, 64, 64, 64, -64, 64, 64, 64, 64, -64, -64, 64, -64, -64, -64, 64, 64, -64, 64, 64, -64, 64, -64, -64, -64, -64, -64, -64, 64, 64, 64, -64, 64, 64, 64, 64, 64, 64, 64, 64, -64, -64, -64, -64, 64, -64, -64, -64, -64, -64, -64, -64, -64, 64, -64, 64, -64, -64, 64, -64, 64, 64, 64, 64, 64, 64, 64, -64, -64, -64, -64, -64, -64, -64, -64, 64, -64, -64, -64, -64, 64, -64, -64, 64, -64, 64, 64, 64, -64, -64, 64, 64, 64, 64, -64, -64, 64, 64, 64, 64, -64, -64, 64, -64, 64, 64, -64, 64, 64, 64, 64, -64, 64, -64, 64, 64, -64, 64, -64, -64, 64, 64, 64, 64, -64, -64, 64, 64, -64, 64, -64, 64, 64, 64, 64, -64, -64, 64, -64, -64, -64, -64, 64, 64, -64, -64, -64, -64, 64, 64, 64, 64, -64, -64, -64, -64, -64, -64, -64, 64, 64, 64, 64, 64, 64, -64, -64, -64, -64, -64, -64, -64, -64, -64, 64, -64, 64, 64, 64, 64, -64, -64, -64, -64, 64, 64, -64, 64, 64, 64, 64, 64, -64, -64, -64, 64, -64, -64, -64, -64, 64, 64, -64, 64, 64, 64, 64, 64, -64, -64, -64, 64, -64, 64, 64, 64, 64, 64, 64, 64, -64, 64, -64, -64, -64, -64, -64, 64, -64, -64, -64, 64, 64, 64, -64, 64, -64, -64, -64, -64, 64, -64, 64, -64, -64, -64, -64, -64, -64, 64, 64, 64, -64, -64, -64, 64, -64, -64, 64, 64, 64, 64, -64, -64, -64, -64, -64, -64, -64, -64, -64, -64, 64, 64, 64, -64, -64, -64, 64, -64, -64, -64, -64, 64, 64, 64, 64, -64, 64, 64, 64, -64, -64, -64, -64, -64, 64, 64, 64, 64, -64, 64, 64, -64, 64, -64, -64, -64, -64, 64, -64, 64, 64, 64, 64, -64, 64, 64, -64, -64, -64, -64, -64, 64, 64, -64, 64, 64, 64, 64, 64, -64, -64, 64, 64, 64, -64, -64, -64, 64, 64, 64, 64, 64, 64, 64, -64, -64, -64, -64, 64, 64, 64, 64, 64, 64, 64, 64, 64, 64, -64, -64, -64, -64, -64, -64, -64, -64, 64, 64, 64, 64, 64, 64, 64, -64, -64, 64, 64, 64, 64, 64, 64, 64, 64, 64, -64, 64, 64, 64, 64, -64, -64, -64, -64, -64, 64, 64, 64, 64, 64, 64, 64, 64, 64, 64, 64, 64, 64, 64, 64, -64, 64, 64, -64, -64, 64, 64, -64, 64, -64, -64, -64, 64, 64, 64, 64, 64, 64, 64, -64, 64, 64, 64, 64, -64, 64, 64, 64, 64, 64, -64, 64, 64, -64, 64, 64, -64, -64, -64, -64, 64, 64, 64, -64, 64, 64, 64, 64, -64, 64, 64, -64, 64, -64, 64, -64, 64, 64, 64, 64, -64, -64, 64, -64, -64, -64, -64, -64, -64, -64, 64, 64, 64, 64, -64, 64, 64, 64, 64, 64, 64, 64, -64, 64, 64, 64, 64, 64, -64, -64, 64, 64, -64, -64, -64, -64, -64, -64, 64, 64, 64, -64, 64, 64, 64, -64, 64, 64, 64, 64, -64, -64, -64, 64, 64, 64, -64, 64, -64, 64, -64, -64, 64, -64, -64, -64, -64, 64, -64, 64, 64, 64, 64, 64, 64, 64, 64, -64, 64, -64, 64, 64, -64, 64, 64, -64, 64, -64, 64, -64, 64, -64, 64, -64, -64, 64, 64, 64, 64, -64, -64, 64, 64, 64, 64, 64, -64, -64, -64, 64, 64, 64, 64, 64, 64, -64, 64, 64, -64, 64, 64, 64, 64, 64, 64, 64, -64, 64, -64, 64, 64, 64, 64, 64, -64, -64, 64, -64, 64, -64, -64, -64, 64, -64, 64, -64, -64, -64, -64, -64, -64, -64, 64, 64, -64, 64, 64, 64, 64, 64, 64, -64, -64, -64, -64, -64, -64, -64, 64, 64, -64, 64, -64, -64, -64, -64, -64, -64, -64, 64, 64, -64, -64, -64, 64, 64, 64, 64, -64, -64, -64, -64, 64, 64, 64, 64, -64, 64, 64, 64, 64, 64, -64, 64, -64, -64, -64, -64, -64, -64, -64, -64, -64, -64, 64, 64, 64, -64, -64, -64, 64, -64, -64, -64, 64, 64, -64, 64, 64, -64, -64, 64, 64, 64, 64, 64, 64, -64, 64, -64, -64, -64, -64, 64, 64, -64, -64, 64, 64, -64, 64, 64, -64, -64, 64, 64, 64, 64, 64, -64, -64, 64, 64, -64, -64, 64, 64, -64, 64, -64, 64, -64, -64, 64, 64, 64, -64, 64, -64, 64, -64, -64, 64, -64, -64, -64, 64, -64, -64, 64, 64, 64, -64, 64, 64, 64, -64, -64, 64, 64, 64, 64, 64, 64, 64, -64, -64, 64, -64, 64, -64, 64, -64, -64, -64, 64, -64, -64, -64, -64, 64, 64, -64, -64, 64, 64, 64, 64, -64, -64, -64, -64, -64, -64, 64, -64, -64, -64, -64, -64, -64, -64, 64, 64, -64, -64, -64, -64, -64, -64, 64, 64, 64, 64, 64, 64, 64, 64, -64, -64, -64, 64, -64, -64, 64, -64, -64, -64, -64, 64, 64, -64, -64, -64, -64, -64, -64, 64, 64, 64, 64, 64, -64, 64, 64, 64, -64, -64, 64, -64, -64, 64, 64, 64, -64, -64, 64, 64, 64, 64, -64, 64, -64, 64, -64, -64, 64, 64, 64, 64, 64, 64, 64, -64, -64, 64, 64, 64, 64, -64, -64, -64, 64, 64, 64, 64, -64, -64, 64, 64, -64, 64, -64, 64, 64, 64, 64, 64, -64, -64, -64, -64, -64, 64, 64, 64, 64, 64, 64, -64, 64, 64, 64, -64, -64, 64, 64, -64, 64, 64, 64, 64, 64, 64, 64, 64, -64, -64, 64, 64, -64, 64, 64, 64, 64, 64, 64, 64, 64, -64, -64, -64, -64, 64, 64, 64, 64, 64, -64, 64, 64, 64, 64, 64, 64, -64, 64, -64, 64, 64, 64, 64, 64, 64, -64, -64, 64, 64, -64, 64, 64, 64, 64, 64, 64, 64, 64, 64, 64, 64, 64, 64, -64, -64, -64, -64, 64, -64, 64, 64, 64, 64, -64, 64, 64, -64, -64, -64, -64, 64, 64, 64, -64, 64, -64, -64, 64, 64, 64, 64, 64, -64, -64, 64, 64, 64, 64, 64, 64, 64, 64, -64, -64, 64, 64, -64, 64, 64, -64, 64, -64, -64, -64, -64, 64, 64, 64, -64, 64, 64, 64, 64, 64, 64, 64, -64, -64, 64, 64, 64, -64, 64, -64, -64, -64, 64, -64, -64, -64, -64, -64, -64, -64, -64, 64, 64, 64, -64, 64, 64, 64, 64, 64, 64, -64, -64, 64, 64, 64, 64, -64, -64, -64, -64, -64, -64, -64, -64, 64, -64, 64, -64, 64, 64, 64, -64, 64, 64, 64, 64, 64, -64, 64, -64, 64, 64, -64, 64, -64, -64, -64, -64, -64, -64, 64, 64, 64, -64, 64, 64, 64, 64, 64, 64, -64, 64, -64, -64, -64, -64, -64, 64, 64, 64, 64, -64, -64, -64, -64, -64, -64, -64, -64, -64, -64, 64, 64, 64, 64, 64, 64, -64, -64, -64, -64, 64, -64, -64, -64, 64, 64, 64, -64, -64, 64, -64, -64, -64, 64, -64, -64, 64, 64, -64, 64, 64, 64, 64, 64, -64, -64, -64, 64, -64, -64, -64, 64, 64, 64, 64, -64, 64, 64, 64, -64, -64, -64, 64, -64, 64, 64, 64, 64, -64, 64, 64, 64, 64, 64, -64, -64, -64, -64, -64, 64, 64, 64, -64, 64, -64, -64, 64, 64, 64, 64, 64, 64, 64, 64, 64, 64, 64, 64, -64, 64, 64, 64, 64, 64, -64, 64, 64, 64, 64, -64, 64, -64, -64, 64, 64, -64, 64, 64, 64, 64, 64, 64, 64, 64, 64, 64, 64, 64, -64, -64, -64, 64, 64, 64, 64, 64, 64, 64, -64, -64, -64, -64, 64, 64, -64, 64, 64, 64, 64, 64, 64, 64, 64, 64, 64, 64, 64, 64, -64, 64, 64, -64, -64, 64, 64, 64, -64, -64, 64, 64, -64, -64, -64, 64, 64, 64, 64, 64, 64, 64, 64, 64, 64, 64, -64, -64, -64, -64, 64, 64, 64, 64, 64, -64, 64, 64, 64, -64, -64, -64, -64, -64, 64, 64, -64, 64, 64, -64, 64, 64, 64, 64, -64, -64, -64, -64, 64, 64, 64, 64, 64, 64, 64, 64, -64, 64, 64, -64, 64, -64, 64, 64, 64, 64, 64, 64, 64, 64, 64, 64, 64, -64, -64, -64, 64, 64, 64, 64, 64, 64, 64, 64, 64, 64, 64, -64, 64, 64, -64, 64, 64, 64, 64, -64, 64, 64, 64, -64, 64, -64, -64, 64, 64, 64, 64, 64, 64, -64, -64, 64, -64, 64, 64, -64, -64, 64, 64, 64, 64, -64, -64, 64, -64, 64, 64, 64, 64, -64, -64, 64, 64, 64, -64, -64, -64, 64, -64, -64, -64, -64, 64, 64, -64, 64, -64, 64, 64, 64, 64, -64, 64, -64, 64, 64, 64, 64, -64, -64, -64, 64, 64, 64, -64, -64, 64, 64, -64, -64, -64, -64, 64, -64, -64, 64, 64, 64, -64, -64, -64, -64, -64, -64, -64, -64, 64, 64, -64, 64, -64, -64, 64, -64, 64, 64, -64, 64, -64, 64, 64, 64, 64, -64, 64, -64, 64, -64, 64, -64, -64, -64, -64, -64, -64, 64, 64, 64, -64, -64, -64, 64, -64, 64, -64, -64, -64, -64, 64, -64, -64, -64, -64, 64, 64, 64, 64, 64, -64, -64, -64, -64, -64, 64, 64, -64, 64, -64, 64, 64, 64, -64, -64, -64, 64, 64, -64, 64, 64, -64, 64, -64, 64, -64, 64, 64, 64, -64, -64, -64, -64, -64, -64, -64, -64, 64, -64, -64, 64, 64, 64, 64, 64, -64, 64, -64, -64, -64, -64, 64, 64, 64, 64, 64, 64, 64, 64, 64, 64, -64, 64, -64, -64, -64, 64, -64, 64, -64, -64, 64, 64, -64, -64, -64, -64, -64, -64, 64, 64, 64, 64, 64, 64, 64, 64, 64, 64, 64, 64, 64, -64, 64, 64, -64, -64, 64, 64, 64, 64, 64, -64, -64, -64, 64, -64, 64, 64, 64, 64, -64, 64, 64, 64, -64, 64, -64, 64, 64, 64, 64, 64, -64, 64, -64, 64, 64, 64, -64, -64, 64, 64, 64, 64, 64, 64, 64, 64, 64, -64, -64, -64, -64, 64, -64, -64, -64, 64, 64, -64, -64, -64, -64, -64, -64, -64, 64, 64, 64, 64, 64, 64, 64, 64, 64, 64, 64, 64, 64, 64, -64, -64, -64, -64, -64, 64, 64, -64, -64, 64, 64, 64, 64, 64, 64, -64, 64, 64, 64, 64, 64, 64, 64, 64, 64, 64, 64, 64, 64, 64, -64, 64, 64, 64, 64, -64, 64, -64, -64, -64, 64, 64, -64, 64, 64, 64, 64, -64, -64, 64, 64, 64, 64, 64, 64, 64, 64, 64, -64, 64, 64, 64, 64, 64, 64, 64, 64, 64, -64, 64, -64, -64, 64, 64, 64, -64, 64, 64, 64, 64, -64, -64, 64, 64, 64, 64, 64, -64, 64, 64, 64, 64, 64, 64, 64, 64, 64, -64, 64, -64, -64, 64, -64, -64, -64, 64, 64, -64, -64, -64, -64, 64, 64, -64, 64, 64, 64, 64, 64, 64, 64, 64, -64, -64, -64, 64, -64, -64, -64, -64, 64, -64, -64, 64, 64, -64, 64, 64, -64, -64, 64, 64, 64, 64, -64, -64, 64, 64, 64, 64, -64, 64, 64, -64, 64, -64, -64, 64, -64, 64, 64, 64, 64, 64, 64, 64, 64, 64, 64, 64, 64, -64, 64, 64, 64, 64, 64, 64, 64, 64, 64, 64, -64, -64, 64, -64, -64, 64, 64, 64, 64, 64, 64, -64, -64, 64, -64, -64, 64, 64, 64, 64, 64, 64, 64, 64, 64, 64, -64, 64, -64, -64, 64, 64, 64, -64, -64, -64, -64, 64, 64, -64, -64, -64, 64, 64, 64, 64, 64, 64, 64, 64, 64, -64, -64, -64, 64, -64, 64, 64, 64, 64, 64, 64, -64, -64, 64, 64, 64, -64, -64, 64, 64, 64, 64, 64, 64, -64, 64, 64, 64, 64, -64, 64, 64, 64, -64, 64, 64, 64, 64, 64, 64, -64, -64, -64, -64, -64, 64, 64, 64, 64, 64, -64, -64, 64, 64, 64, 64, 64, -64, 64, -64, 64, 64, 64, 64, 64, 64, -64, -64, -64, 64, 64, 64, -64, 64, 64, 64, -64, -64, -64, -64, -64, 64, 64, 64, 64, -64, -64, 64, 64, -64, 64, 64, 64, 64, -64, -64, -64, 64, 64, -64, 64, -64, 64, 64, 64, 64, -64, -64, -64, -64, 64, 64, 64, 64, 64, 64, -64, 64, 64, 64, 64, 64, -64, 64, 64, 64, 64, 64, 64, 64, 64, -64, -64, -64, -64, -64, 64, 64, -64, 64, 64, 64, 64, 64, 64, -64, 64, 64, 64, 64, 64, 64, -64, 64, 64, 64, -64, 64, 64, 64, -64, -64, -64, 64, 64, -64, 64, -64, -64, 64, 64, -64, 64, -64, -64, 64, 64, 64, -64, 64, 64, 64, 64, -64, 64, 64, 64, 64, 64, -64, 64, 64, -64, -64, 64, 64, -64, 64, 64, 64, -64, -64, 64, 64, 64, 64, 64, 64, 64, -64, 64, -64, 64, -64, 64, 64, 64, -64, -64, -64, 64, -64, -64, -64, 64, -64, 64, 64, 64, 64, 64, 64, 64, -64, -64, -64, -64, 64, 64, 64, 64, 64, -64, 64, 64, -64, 64, 64, 64, 64, -64, -64, 64, 64, 64, -64, 64, 64, 64, 64, 64, 64, -64, -64, -64, 64, -64, -64, 64, 64, 64, 64, 64, 64, -64, 64, -64, -64, 64, 64, -64, 64, 64, -64, 64, -64, -64, -64, -64, 64, -64, -64, -64, 64, -64, -64, 64, 64, 64, 64, 64, -64, 64, 64, 64, -64, 64, 64, 64, -64, 64, -64, 64, 64, 64, -64, -64, -64, 64, -64, 64, -64, 64, 64, -64, 64, 64, -64, 64, 64, 64, -64, -64, -64, -64, 64, -64, -64, -64, -64, -64, -64, -64, -64, 64, 64, -64, 64, 64, -64, -64, 64, -64, 64, -64, 64, -64, -64, 64, 64, -64, -64, 64, 64, 64, -64, 64, 64, -64, -64, -64, 64, -64, -64, -64, 64, 64, -64, 64, -64, -64, -64, -64, -64, 64, 64, -64, 64, 64, -64, 64, 64, 64, -64, -64, 64, -64, -64, -64, 64, -64, 64, -64, -64, -64, -64, 64, 64, 64, 64, 64, 64, 64, 64, -64, 64, -64, -64, 64, -64, 64, -64, -64, -64, -64, -64, 64, -64, -64, -64, -64, 64, -64, -64, 64, 64, 64, 64, 64, 64, -64, 64, 64, 64, 64, 64, 64, 64, 64, -64, 64, -64, -64, 64, -64, -64, 64, 64, 64, -64, -64, -64, 64, 64, 64, 64, 64, 64, -64, 64, 64, 64, -64, 64, -64, 64, -64, 64, -64, -64, 64, 64, 64, -64, 64, 64, 64, 64, 64, 64, -64, -64, 64, 64, 64, 64, 64, 64, 64, -64, -64, -64, -64, -64, -64, 64, 64, 64, -64, -64, -64, -64, 64, 64, 64, 64, 64, 64, 64, -64, -64, -64, -64, 64, 64, 64, 64, -64, -64, -64, 64, 64, -64, -64, 64, 64, -64, -64, 64, 64, 64, 64, 64, 64, 64, 64, 64, -64, -64, -64, -64, -64, -64, -64, -64, -64, -64, -64, 64, -64, -64, -64, -64, 64, -64, -64, 64, 64, 64, 64, 64, -64, 64, -64, -64, -64, -64, -64, 64, -64, -64, -64, -64, -64, -64, 64, -64, 64, -64, 64, -64, 64, -64, -64, -64, 64, 64, 64, 64, 64, -64, -64, -64, -64, -64, -64, -64, -64, -64, 64, -64, -64, -64, 64, -64, -64, -64, -64, -64, 64, -64, -64, 64, 64, 64, 64, 64, -64, -64, -64, -64, -64, -64, -64, 64, -64, 64, 64, -64, -64, 64, -64, -64, -64, -64, 64, -64, -64, -64, -64, 64, 64, 64, 64, -64, -64, 64, 64, 64, 64, 64, -64, 64, -64, 64, 64, 64, 64, -64, -64, 64, -64, -64, -64, 64, 64, -64, 64, 64, 64, 64, 64, 64, 64, 64, 64, 64, 64, 64, 64, 64, 64, 64, 64, -64, 64, 64, 64, -64, -64, -64, -64, 64, 64, 64, 64, 64, 64, 64, 64, -64, 64, -64, -64, -64, -64, 64, -64, -64, 64, 64, 64, 64, 64, 64, 64, 64, 64, 64, 64, -64, -64, -64, 64, 64, 64, 64, 64, -64, -64, -64, -64, -64, -64, -64, -64, -64, 64, 64, 64, 64, 64, 64, -64, 64, 64, 64, 64, 64, -64, -64, 64, -64, 64, 64, 64, -64, -64, -64, -64, -64, -64, -64, -64, -64, -64, 64, 64, 64, 64, 64, 64, 64, -64, 64, 64, -64, 64, 64, -64, -64, -64, -64, 64, -64, -64, -64, -64, -64, 64, -64, 64, -64, -64, 64, 64, 64, 64, 64, 64, 64, 64, 64, -64, 64, -64, 64, -64, -64, 64, 64, -64, 64, 64, 64, 64, 64, 64, 64, -64, -64, -64, -64, 64, 64, 64, 64, 64, 64, 64, 64, 64, -64, -64, -64, -64, 64, 64, 64, 64, 64, 64, 64, 64, 64, 64, 64, -64, -64, -64, -64, 64, 64, 64, 64, 64, 64, 64, -64, -64, 64, -64, -64, -64, -64, -64, -64, 64, 64, 64, 64, 64, 64, 64, 64, -64, 64, -64, 64, -64, 64, 64, 64, 64, -64, 64, -64, -64, -64, 64, -64, 64, -64, -64, 64, -64, 64, 64, 64, 64, 64, 64, 64, -64, 64, -64, 64, -64, 64, 64, 64, 64, -64, -64, -64, -64, 64, -64, 64, -64, -64, 64, 64, 64, 64, 64, -64, 64, 64, 64, 64, -64, -64, 64, 64, 64, 64, 64, 64, 64, -64, -64, 64, 64, -64, -64, -64, 64, -64, -64, 64, 64, -64, 64, -64, -64, -64, 64, -64, 64, 64, 64, 64, 64, 64, -64, 64, 64, -64, 64, 64, 64, -64, 64, 64, -64, -64, -64, -64, 64, 64, -64, -64, -64, -64, 64, 64, 64, 64, 64, 64, 64, 64, 64, 64, 64, -64, 64, -64, 64, 64, 64, -64, -64, -64, -64, -64, -64, -64, -64, -64, -64, -64, -64, 64, -64, 64, -64, 64, 64, -64, 64, 64, 64, 64, 64, 64, -64, 64, 64, -64, 64, -64, -64, 64, -64, -64, -64, -64, -64, -64, -64, -64, -64, -64, -64, -64, 64, 64, 64, 64, 64, 64, 64, 64, -64, 64, -64, -64, 64, 64, 64, -64, -64, -64, -64, -64, -64, -64, -64, -64, -64, -64, -64, -64, -64, -64, 64, 64, -64, -64, -64, -64, 64, -64, 64, 64, 64, 64, 64, 64, -64, -64, 64, -64, -64, -64, -64, 64, -64, 64, 64, -64, 64, -64, -64, 64, -64, -64, 64, 64, 64, -64, 64, 64, 64, 64, -64, 64, 64, -64, -64, -64, -64, 64, -64, 64, 64, 64, 64, -64, -64, 64, 64, 64, 64, 64, -64, 64, -64, 64, -64, -64, 64, -64, -64, 64, 64, -64, -64, -64, 64, 64, -64, -64, -64, -64, 64, 64, 64, -64, 64, 64, 64, 64, -64, 64, -64, 64, 64, 64, 64, -64, 64, -64, 64, -64, -64, -64, 64, 64, -64, 64, -64, -64, 64, -64, -64, 64, -64, 64, -64, 64, 64, -64, 64, 64, -64, 64, 64, 64, -64, 64, -64, 64, 64, 64, -64, -64, 64, -64, 64, 64, -64, -64, 64, 64, 64, 64, 64, 64, -64, -64, -64, 64, -64, 64, 64, -64, -64, -64, -64, -64, -64, 64, 64, 64, 64, 64, -64, 64, 64, 64, 64, -64, 64, 64, 64, 64, 64, 64, 64, -64, -64, 64, 64, -64, -64, -64, 64, -64, 64, -64, 64, 64, 64, -64, -64, 64, 64, 64, 64, 64, 64, 64, 64, 64, -64, -64, 64, -64, -64, 64, -64, 64, -64, -64, 64, 64, 64, 64, 64, -64, 64, 64, -64, -64, 64, 64, -64, -64, 64, 64, 64, 64, -64, 64, 64, -64, 64, -64, -64, 64, 64, 64, 64, 64, 64, 64, 64, -64, -64, 64, -64, -64, 64, 64, 64, -64, 64, 64, -64, -64, -64, -64, -64, 64, 64, 64, 64, 64, 64, 64, 64, 64, 64, 64, 64, -64, 64, 64, 64, 64, -64, 64, -64, -64, 64, -64, -64, 64, -64, -64, -64, 64, -64, 64, 64, -64, -64, 64, 64, 64, -64, 64, 64, 64, -64, 64, -64, -64, 64, 64, -64, -64, 64, 64, -64, -64, 64, 64, -64, -64, -64, 64, -64, -64, -64, -64, -64, 64, -64, 64, 64, 64, 64, 64, 64, -64, -64, 64, -64, -64, -64, -64, -64, -64, 64, -64, 64, -64, 64, 64, -64, -64, -64, -64, 64, -64, -64, 64, 64, 64, -64, 64, 64, 64, 64, 64, 64, -64, 64, 64, -64, -64, -64, -64, 64, 64, -64, 64, 64, 64, -64, 64, 64, -64, 64, 64, 64, 64, -64, -64, -64, 64, 64, 64, 64, 64, -64, -64, -64, -64, -64, -64, -64, -64, -64, -64, -64, 64, 64, 64, 64, 64, -64, 64, 64, -64, -64, -64, -64, 64, -64, -64, 64, -64, -64, 64, -64, -64, 64, 64, -64, 64, -64, 64, -64, -64, 64, 64, 64, 64, 64, 64, 64, -64, -64, -64, -64, 64, 64, 64, -64, 64, -64, 64, 64, 64, 64, -64, -64, 64, 64, 64, -64, 64, 64, 64, 64, 64, -64, 64, 64, 64, -64, 64, -64, 64, 64, -64, 64, 64, 64, 64, 64, 64, -64, -64, 64, 64, 64, 64, -64, -64, 64, 64, 64, -64, 64, -64, 64, 64, 64, 64, 64, 64, 64, 64, 64, 64, 64, 64, 64, 64, 64, 64, 64, -64, -64, 64, -64, -64, 64, 64, 64, 64, 64, 64, 64, -64, 64, 64, 64, 64, 64, 64, 64, 64, 64, 64, -64, 64, 64, 64, -64, -64, -64, 64, 64, -64, -64, 64, 64, 64, -64, -64, 64, 64, 64, 64, 64, 64, 64, 64, 64, 64, 64, 64, 64, 64, 64, 64, -64, -64, 64, -64, -64, 64, -64, 64, 64, 64, 64, 64, 64, 64, 64, 64, 64, 64, 64, 64, -64, -64, -64, 64, -64, 64, -64, 64, -64, 64, -64, 64, 64, 64, 64, 64, -64, 64, -64, 64, 64, 64, -64, 64, 64, 64, -64, 64, 64, -64, 64, 64, 64, 64, -64, -64, -64, -64, 64, -64, 64, 64, -64, -64, 64, 64, 64, 64, 64, 64, 64, 64, -64, -64, 64, -64, 64, -64, 64, 64, 64, 64, -64, 64, -64, 64, -64, -64, 64, 64, -64, -64, 64, 64, -64, 64, 64, -64, -64, 64, -64, -64, 64, 64, -64, 64, 64, 64, 64, 64, -64, 64, 64, 64, -64, -64, -64, -64, 64, 64, -64, 64, -64, 64, 64, -64, 64, 64, -64, -64, 64, 64, 64, 64, 64, 64, -64, -64, 64, 64, 64, 64, -64, 64, -64, -64, 64, -64, 64, 64, -64, 64, 64, 64, 64, 64, 64, -64, -64, 64, 64, -64, -64, -64, 64, -64, 64, -64, 64, 64, -64, 64, 64, -64, -64, 64, 64, -64, 64, -64, -64, -64, 64, 64, -64, -64, 64, 64, -64, -64, -64, -64, -64, -64, -64, 64, -64, 64, 64, 64, -64, 64, -64, -64, -64, 64, -64, -64, -64, -64, -64, -64, -64, -64, 64, -64, -64, -64, -64, -64, -64, 64, 64, 64, 64, 64, -64, -64, 64, -64, -64, 64, -64, -64, -64, 64, -64, -64, -64, 64, -64, 64, 64, 64, 64, 64, -64, -64, 64, -64, 64, -64, -64, -64, 64, 64, 64, 64, -64, -64, -64, -64, 64, 64, -64, 64, 64, 64, -64, 64, -64, 64, 64, -64, -64, 64, -64, 64, -64, -64, 64, 64, -64, 64, 64, 64, -64, 64, -64, -64, -64, 64, -64, -64, 64, 64, -64, -64, -64, -64, -64, 64, -64, 64, -64, 64, -64, -64, 64, 64, 64, 64, -64, -64, -64, -64, 64, -64, -64, 64, -64, -64, -64, -64, 64, -64, -64, -64, -64, -64, -64, -64, -64, -64, -64, -64, 64, -64, -64, -64, -64, -64, -64, -64, -64, -64, -64, 64, -64, -64, -64, -64, 64, -64, -64, 64, 64, 64, -64, -64, -64, -64, -64, -64, -64, 64, -64, 64, 64, -64, 64, -64, -64, -64, -64, -64, -64, -64, -64, -64, -64, -64, 64, -64, 64, 64, -64, -64, -64, -64, -64, -64, 64, 64, -64, 64, -64, 64, 64, 64, -64, -64, -64, -64, -64, -64, 64, -64, -64, -64, 64, 64, 64, -64, -64, -64, -64, -64, -64, 64, 64, 64, 64, 64, -64, 64, 64, 64, -64, 64, -64, -64, -64, 64, -64, -64, -64, 64, 64, 64, 64, 64, 64, 64, 64, -64, -64, -64, -64, -64, -64, -64, 64, -64, 64, 64, 64, -64, -64, 64, -64, -64, 64, -64, 64, -64, 64, 64, 64, 64, -64, -64, -64, 64, -64, -64, 64, -64, -64, 64, -64, 64, 64, -64, 64, -64, -64, 64, -64, 64, 64, -64, -64, 64, -64, 64, 64, 64, 64, 64, -64, 64, -64, -64, 64, -64, -64, 64, 64, 64, -64, 64, -64, -64, -64, -64, 64, 64, -64, -64, 64, -64, 64, 64, 64, 64, 64, -64, -64, -64, -64, -64, -64, 64, -64, 64, -64, 64, 64, -64, 64, -64, -64, 64, 64, 64, -64, -64, -64, 64, 64, 64, 64, 64, 64, 64, 64, -64, -64, -64, 64, 64, -64, -64, 64, -64, -64, -64, -64, -64, 64, 64, 64, -64, -64, 64, 64, 64, 64, 64, 64, 64, 64, 64, 64, -64, 64, -64, -64, 64, -64, 64, 64, 64, -64, -64, -64, -64, -64, 64, 64, -64, 64, 64, 64, 64, 64, 64, 64, 64, -64, -64, -64, -64, 64, -64, 64, -64, -64, -64, 64, 64, 64, -64, -64, 64, 64, 64, -64, -64, -64, 64, -64, -64, 64, 64, 64, -64, 64, 64, 64, -64, 64, 64, -64, 64, -64, -64, -64, 64, -64, -64, -64, -64, -64, -64, -64, -64, -64, 64, -64, 64, 64, 64, 64, 64, -64, -64, -64, -64, -64, -64, -64, 64, 64, 64, -64, 64, -64, -64, -64, 64, 64, -64, 64, -64, 64, 64, 64, 64, 64, 64, -64, -64, -64, -64, -64, -64, -64, 64, 64, -64, -64, 64, 64, -64, -64, -64, 64, -64, -64, -64, 64, 64, 64, 64, 64, 64, 64, 64, -64, -64, -64, -64, -64, -64, -64, 64, 64, 64, 64, 64, 64, -64, 64, -64, 64, -64, -64, 64, 64, 64, 64, 64, 64, 64, 64, -64, -64, -64, -64, -64, 64, -64, -64, 64, 64, 64, 64, 64, -64, -64, -64, -64, 64, -64, -64, 64, 64, 64, 64, 64, 64, 64, -64, -64, -64, -64, -64, -64, -64, -64, 64, 64, 64, 64, -64, -64, -64, -64, -64, -64, 64, -64, 64, -64, -64, -64, 64, 64, 64, 64, -64, -64, -64, -64, -64, -64, -64, -64, 64, -64, 64, -64, 64, -64, 64, -64, -64, -64, -64, -64, -64, 64, -64, 64, 64, 64, 64, -64, 64, -64, -64, -64, -64, -64, -64, -64, -64, -64, 64, 64, 64, -64, -64, 64, -64, -64, -64, -64, -64, 64, 64, 64, 64, -64, 64, 64, -64, -64, -64, -64, -64, 64, -64, -64, 64, -64, 64, 64, -64, -64, 64, -64, -64, -64, -64, -64, 64, 64, 64, 64, 64, 64, 64, 64, -64, -64, -64, -64, -64, -64, -64, 64, 64, 64, 64, -64, -64, -64, -64, -64, -64, -64, -64, 64, -64, 64, 64, 64, 64, 64, 64, 64, -64, -64, -64, -64, -64, 64, -64, -64, -64, -64, -64, -64, -64, -64, -64, -64, -64, -64, -64, 64, 64, -64, 64, 64, 64, -64, 64, -64, -64, -64, -64, -64, -64, -64, 64, -64, 64, 64, 64, 64, -64, -64, -64, -64, 64, -64, 64, 64, 64, 64, 64, 64, 64, 64, 64, 64, 64, -64, -64, -64, -64, -64, 64, -64, 64, 64, -64, -64, -64, -64, 64, -64, 64, 64, 64, 64, 64, 64, 64, 64, 64, 64, 64, 64, 64, -64, -64, -64, 64, -64, -64, -64, -64, 64, 64, 64, 64, 64, -64, 64, -64, -64, -64, 64, 64, -64, -64, 64, 64, -64, 64, 64, 64, 64, -64, -64, 64, 64, 64, 64, 64, 64, 64, -64, -64, 64, -64, -64, 64, 64, -64, 64, 64, 64, -64, 64, 64, 64, -64, 64, -64, 64, 64, -64, -64, 64, -64, 64, 64, -64, 64, 64, -64, -64, 64, 64, -64, -64, -64, -64, 64, 64, 64, 64, -64, 64, -64, 64, -64, 64, -64, -64, -64, 64, 64, -64, 64, 64, 64, 64, 64, -64, 64, 64, 64, -64, -64, 64, 64, 64, 64, 64, 64, 64, 64, 64, -64, -64, -64, -64, -64, 64, -64, -64, -64, -64, -64, -64, -64, -64, 64, -64, -64, 64, 64, 64, 64, -64, -64, 64, 64, 64, -64, -64, -64, 64, -64, 64, -64, -64, -64, 64, -64, 64, 64, -64, -64, -64, 64, -64, 64, -64, 64, 64, 64, -64, 64, 64, 64, 64, -64, -64, -64, -64, -64, -64, -64, -64, -64, -64, -64, -64, -64, -64, 64, 64, -64, 64, 64, -64, -64, 64, 64, 64, -64, 64, -64, -64, -64, -64, -64, -64, -64, -64, -64, -64, -64, -64, 64, -64, -64, 64, -64, 64, -64, 64, -64, -64, -64, 64, 64, -64, -64, -64, -64, -64, -64, -64, 64, -64, -64, -64, -64, -64, -64, -64, -64, -64, -64, 64, -64, 64, -64, 64, 64, 64, 64, 64, 64, -64, -64, -64, -64, -64, -64, -64, 64, -64, 64, 64, 64, 64, -64, 64, 64, 64, -64, -64, 64, -64, 64, 64, 64, 64, 64, -64, 64, 64, 64, 64, -64, -64, -64, -64, -64, 64, -64, 64, 64, 64, 64, -64, -64, -64, -64, -64, 64, 64, 64, 64, 64, 64, 64, 64, 64, 64, 64, 64, 64, 64, 64, 64, 64, 64, -64, -64, -64, 64, 64, -64, -64, -64, 64, -64, 64, -64, 64, 64, 64, 64, 64, 64, 64, 64, 64, 64, 64, 64, 64, -64, 64, -64, -64, -64, 64, 64, 64, -64, -64, -64, -64, 64, 64, 64, 64, 64, 64, -64, 64, -64, -64, 64, -64, -64, -64, -64, -64, -64, 64, 64, 64, 64, 64, 64, 64, 64, -64, -64, -64, -64, 64, 64, 64, -64, -64, -64, 64, 64, -64, -64, -64, -64, -64, -64, -64, -64, -64, 64, -64, 64, 64, 64, 64, 64, 64, -64, -64, 64, 64, -64, -64, -64, 64, -64, 64, -64, 64, -64, -64, -64, -64, -64, -64, 64, -64, -64, -64, -64, -64, 64, 64, 64, 64, -64, 64, -64, 64, 64, -64, -64, -64, -64, -64, -64, -64, -64, -64, -64, -64, -64, -64, -64, 64, -64, -64, -64, -64, -64, 64, 64, 64, -64, 64, 64, 64, -64, -64, -64, 64, 64, -64, -64, -64, -64, -64, -64, -64, 64, 64, -64, -64, -64, -64, -64, -64, 64, 64, 64, 64, 64, -64, -64, -64, 64, -64, -64, 64, -64, -64, -64, -64, -64, -64, 64, 64, 64, 64, -64, -64, -64, -64, -64, -64, 64, 64, 64, 64, 64, -64, -64, -64, -64, -64, -64, -64, -64, -64, -64, -64, -64, -64, 64, 64, 64, 64, 64, 64, -64, 64, -64, 64, 64, 64, 64, 64, 64, 64, 64, 64, 64, -64, -64, -64, -64, -64, -64, -64, -64, 64, 64, 64, 64, 64, 64, -64, 64, 64, 64, -64, 64, 64, 64, 64, -64, 64, 64, 64, -64, -64, -64, -64, -64, -64, -64, -64, 64, -64, 64, 64, 64, 64, 64, 64, 64, 64, 64, -64, 64, 64, 64, 64, 64, 64, -64, -64, -64, -64, -64, 64, -64, 64, -64, -64, -64, -64, 64, 64, 64, 64, -64, 64, 64, 64, -64, -64, 64, -64, 64, 64, -64, -64, 64, -64, 64, -64, -64, -64, 64, -64, -64, -64, -64, -64, -64, -64, -64, -64, -64, 64, 64, -64, -64, -64, -64, -64, -64, 64, 64, 64, -64, -64, -64, 64, 64, 64, -64, 64, -64, 64, -64, -64, -64, -64, -64, -64, -64, 64, -64, -64, -64, -64, -64, -64, -64, 64, 64, 64, 64, 64, -64, -64, 64, 64, 64, 64, 64, 64, 64, -64, -64, -64, -64, -64, 64, -64, 64, -64, -64, 64, -64, -64, -64, 64, -64, 64, -64, 64, 64, 64, -64, -64, 64, 64, 64, 64, 64, 64, 64, -64, -64, -64, 64, 64, 64, 64, 64, 64, -64, -64, -64, 64, 64, -64, -64, -64, -64, 64, 64, 64, 64, 64, 64, 64, 64, 64, 64, 64, -64, 64, 64, -64, -64, -64, 64, -64, -64, -64, -64, 64, 64, 64, 64, 64, 64, 64, -64, -64, 64, 64, 64, 64, 64, 64, 64, -64, -64, -64, -64, 64, -64, -64, 64, -64, -64, 64, -64, -64, -64, -64, -64, 64, -64, -64, 64, 64, -64, -64, -64, 64, 64, 64, 64, 64, 64, 64, 64, 64, -64, -64, 64, 64, -64, -64, 64, 64, -64, -64, 64, -64, 64, -64, -64, -64, 64, -64, -64, 64, 64, -64, 64, 64, 64, -64, 64, -64, 64, -64, -64, -64, 64, -64, 64, -64, 64, -64, -64, -64, 64, -64, -64, 64, -64, 64, 64, 64, 64, -64, -64, 64, -64, 64, -64, 64, -64, -64, 64, 64, -64, 64, -64, 64, -64, 64, -64, 64, 64, -64, 64, -64, 64, 64, -64, -64, -64, -64, 64, -64, 64, 64, -64, -64, -64, -64, -64, -64, -64, 64, -64, -64, -64, -64, -64, 64, 64, -64, 64, 64, -64, -64, -64, 64, -64, 64, -64, 64, -64, -64, 64, -64, -64, 64, 64, 64, 64, 64, 64, -64, 64, -64, 64, -64, -64, 64, -64, 64, -64, 64, 64, 64, 64, 64, 64, 64, 64, 64, 64, 64, 64, -64, 64, 64, 64, 64, -64, -64, 64, -64, 64, -64, 64, -64, -64, 64, 64, 64, 64, 64, 64, 64, 64, -64, 64, 64, 64, 64, 64, 64, 64, 64, -64, -64, 64, -64, 64, -64, -64, -64, 64, 64, 64, 64, -64, 64, -64, 64, 64, -64, -64, 64, 64, 64, 64, -64, 64, 64, 64, -64, 64, 64, 64, 64, -64, 64, -64, 64, 64, -64, -64, -64, 64, 64, -64, 64, 64, -64, -64, 64, -64, -64, 64, 64, -64, 64, 64, 64, 64, 64, -64, 64, -64, 64, 64, 64, -64, -64, -64, -64, 64, -64, -64, 64, 64, -64, -64, -64, 64, 64, 64, 64, 64, 64, -64, -64, -64, -64, -64, -64, -64, 64, 64, -64, 64, 64, -64, 64, -64, 64, 64, -64, 64, 64, -64, -64, 64, 64, -64, 64, -64, -64, 64, 64, -64, 64, 64, 64, 64, 64, -64, -64, 64, 64, -64, -64, -64, 64, 64, -64, 64, -64, 64, 64, 64, -64, 64, 64, 64, -64, 64, -64, -64, -64, 64, 64, -64, -64, -64, -64, -64, 64, -64, -64, -64, 64, 64, 64, -64, 64, -64, 64, -64, 64, 64, -64, -64, 64, -64, 64, -64, -64, -64, -64, -64, -64, 64, 64, -64, 64, -64, -64, -64, 64, 64, -64, -64, 64, 64, -64, -64, -64, -64, 64, 64, 64, 64, 64, 64, -64, -64, -64, 64, 64, -64, -64, -64, 64, -64, -64, -64, -64, 64, 64, 64, 64, 64, 64, 64, 64, 64, 64, 64, 64, 64, -64, -64, 64, -64, 64, 64, -64, 64, -64, -64, -64, 64, 64, 64, 64, 64, -64, 64, 64, 64, 64, 64, 64, 64, 64, -64, 64, 64, -64, 64, 64, 64, -64, -64, 64, 64, 64, -64, -64, -64, 64, 64, 64, 64, -64, 64, -64, -64, 64, 64, 64, 64, 64, -64, -64, 64, 64, 64, 64, 64, 64, -64, 64, -64, 64, -64, -64, 64, 64, 64, 64, 64, 64, -64, 64, 64, 64, 64, 64, 64, 64, 64, 64, 64, 64, 64, 64, 64, 64, -64, 64, 64, 64, 64, 64, 64, 64, 64, 64, 64, 64, -64, 64, -64, 64, 64, 64, 64, 64, 64, 64, 64, 64, 64, 64, 64, -64, 64, 64, -64, 64, 64, 64, 64, 64, -64, 64, -64, -64, 64, 64, 64, 64, 64, 64, 64, 64, 64, 64, 64, 64, 64, 64, 64, 64, -64, -64, -64, -64, -64, 64, 64, 64, 64, 64, 64, 64, 64, 64, 64, 64, 64, 64, -64, -64, 64, 64, 64, 64, 64, 64, 64, 64, 64, 64, -64, -64, 64, -64, -64, 64, 64, 64, 64, 64, -64, 64, 64, 64, 64, 64, -64, -64, -64, 64, 64, 64, 64, -64, -64, 64, 64, 64, 64, -64, -64, -64, -64, 64, 64, -64, -64, -64, -64, 64, 64, 64, -64, 64, 64, -64, 64, -64, -64, 64, -64, 64, -64, -64, 64, 64, -64, -64, 64, -64, 64, 64, 64, 64, -64, 64, 64, 64, 64, 64, -64, 64, -64, -64, 64, 64, 64, 64, 64, 64, -64, -64, -64, -64, 64, 64, -64, 64, -64, -64, -64, 64, 64, 64, 64, 64, -64, -64, 64, 64, -64, 64, 64, 64, -64, -64, 64, 64, -64, 64, 64, 64, 64, -64, 64, -64, 64, -64, 64, 64, -64, -64, -64, -64, -64, -64, 64, -64, 64, 64, 64, -64, 64, -64, 64, -64, 64, -64, 64, 64, -64, 64, -64, 64, 64, -64, 64, -64, -64, 64, 64, 64, 64, -64, -64, -64, 64, -64, -64, -64, -64, -64, 64, -64, 64, 64, -64, -64, -64, 64, -64, 64, 64, 64, 64, -64, -64, -64, 64, 64, 64, -64, -64, -64, -64, -64, -64, -64, -64, -64, -64, 64, -64, -64, 64, -64, 64, 64, 64, -64, -64, 64, 64, -64, -64, -64, -64, -64, -64, 64, -64, -64, 64, -64, 64, 64, 64, 64, -64, -64, -64, 64, -64, -64, -64, -64, 64, 64, 64, -64, 64, 64, -64, 64, -64, -64, -64, 64, -64, 64, -64, -64, -64, 64, -64, -64, 64, -64, 64, 64, -64, 64, 64, -64, 64, 64, -64, -64, 64, 64, -64, -64, 64, -64, -64, 64, -64, 64, -64, -64, -64, 64, 64, 64, 64, 64, 64, -64, 64, -64, -64, -64, -64, -64, -64, 64, 64, -64, 64, -64, 64, 64, 64, 64, 64, -64, -64, -64, -64, 64, -64, -64, -64, -64, -64, 64, -64, -64, -64, 64, 64, 64, -64, 64, 64, 64, 64, 64, 64, 64, 64, -64, -64, 64, 64, 64, -64, -64, -64, -64, -64, -64, 64, -64, 64, 64, -64, 64, -64, -64, -64, -64, -64, 64, 64, 64, 64, 64, 64, 64, -64, -64, 64, 64, -64, 64, -64, -64, -64, -64, 64, 64, -64, 64, 64, 64, -64, -64, 64, -64, -64, -64, -64, -64, -64, -64, 64, 64, 64, 64, -64, 64, 64, -64, -64, -64, -64, -64, -64, 64, 64, 64, -64, -64, -64, -64, -64, -64, -64, -64, -64, -64, -64, -64, 64, 64, 64, 64, 64, 64, -64, -64, -64, -64, -64, -64, -64, -64, -64, -64, 64, -64, 64, -64, -64, -64, -64, -64, -64, -64, -64, -64, 64, 64, -64, 64, -64, -64, -64, -64, 64, -64, -64, 64, -64, -64, 64, -64, -64, 64, 64, 64, -64, -64, -64, -64, -64, -64, -64, 64, 64, -64, 64, 64, 64, -64, -64, -64, -64, -64, 64, 64, 64, 64, 64, -64, 64, 64, 64, -64, -64, -64, -64, 64, 64, 64, 64, -64, -64, -64, -64, -64, 64, 64, -64, -64, -64, 64, 64, 64, 64, 64, 64, 64, 64, -64, 64, -64, -64, -64, 64, -64, -64, -64, 64, 64, -64, -64, 64, 64, -64, -64, -64, 64, 64, 64, 64, 64, -64, 64, 64, -64, 64, 64, -64, -64, 64, -64, -64, 64, 64, 64, 64, -64, -64, 64, -64, -64, -64, -64, -64, 64, 64, 64, 64, 64, 64, -64, -64, 64, 64, -64, 64, -64, -64, 64, -64, -64, -64, 64, -64, -64, 64, -64, -64, -64, -64, -64, 64, 64, -64, 64, 64, 64, 64, -64, -64, -64, -64, 64, -64, -64, 64, 64, -64, -64, -64, -64, 64, -64, -64, -64, -64, -64, 64, 64, -64, -64, -64, -64, -64, -64, -64, 64, 64, -64, 64, -64, -64, 64, 64, 64, -64, -64, -64, -64, -64, -64, -64, -64, -64, -64, -64, 64, -64, -64, -64, -64, -64, -64, -64, -64, -64, -64, -64, 64, 64, -64, -64, 64, -64, -64, -64, -64, -64, -64, -64, -64, -64, -64, -64, -64, -64, -64, -64, -64, -64, -64, -64, 64, 64, -64, 64, -64, 64, -64, 64, -64, -64, -64, -64, -64, -64, -64, 64, 64, -64, 64, 64, -64, -64, -64, -64, -64, -64, -64, -64, 64, 64, 64, -64, 64, 64, -64, 64, -64, -64, -64, 64, -64, -64, -64, 64, 64, 64, 64, -64, 64, -64, -64, -64, -64, -64, -64, -64, 64, -64, 64, -64, 64, -64, 64, 64, -64, -64, 64, -64, -64, 64, -64, 64, -64, 64, -64, -64, 64, -64, -64, -64, -64, -64, -64, 64, -64, -64, 64, 64, 64, 64, 64, 64, -64, -64, -64, -64, -64, 64, 64, 64, -64, -64, -64, 64, 64, 64, -64, -64, -64, -64, -64, -64, 64, 64, 64, -64, -64, 64, -64, -64, -64, -64, -64, 64, 64, 64, -64, -64, -64, -64, -64, 64, 64, -64, -64, -64, -64, -64, -64, -64, -64, 64, -64, -64, -64, 64, -64, -64, -64, -64, -64, 64, 64, 64, -64, -64, -64, -64, 64, -64, -64, -64, -64, -64, 64, -64, -64, -64, 64, 64, 64, 64, 64, -64, -64, -64, -64, -64, 64, 64, 64, 64, -64, -64, 64, 64, -64, -64, 64, -64, -64, 64, -64, -64, -64, -64, -64, -64, 64, -64, -64, -64, 64, 64, -64, 64, 64, 64, 64, 64, 64, 64, 64, -64, -64, 64, -64, -64, -64, -64, -64, -64, 64, 64, -64, 64, -64, -64, 64, 64, -64, 64, 64, 64, 64, -64, 64, 64, -64, -64, -64, -64, -64, -64, 64, 64, -64, 64, 64, -64, 64, -64, -64, -64, 64, 64, -64, -64, -64, -64, 64, 64, 64, -64, -64, -64, 64, -64, 64, -64, -64, 64, -64, 64, -64, 64, -64, -64, -64, 64, 64, 64, 64, 64, -64, 64, 64, 64, 64, 64, -64, 64, -64, -64, -64, 64, 64, 64, 64, 64, 64, 64, 64, 64, -64, -64, 64, -64, -64, -64, 64, 64, 64, 64, 64, -64, -64, -64, 64, -64, 64, 64, 64, -64, -64, -64, -64, -64, 64, 64, 64, 64, 64, 64, 64, -64, 64, 64, 64, 64, 64, 64, 64, 64, -64, 64, 64, -64, -64, -64, -64, 64, -64, -64, 64, 64, -64, 64, 64, 64, 64, 64, 64, -64, -64, 64, 64, -64, 64, -64, -64, -64, 64, -64, -64, 64, -64, 64, -64, -64, 64, 64, 64, -64, 64, 64, 64, 64, 64, 64, 64, -64, -64, -64, -64, 64, -64, -64, 64, 64, -64, 64, 64, 64, 64, 64, -64, -64, 64, 64, -64, 64, -64, 64, -64, 64, 64, -64, -64, 64, 64, 64, -64, 64, 64, -64, 64, -64, -64, 64, 64, 64, 64, -64, -64, 64, 64, 64, 64, 64, 64, 64, -64, 64, 64, -64, -64, 64, -64, 64, -64, -64, 64, 64, 64, 64, -64, 64, 64, 64, -64, -64, -64, 64, -64, 64, -64, 64, 64, -64, -64, -64, -64, 64, -64, -64, 64, 64, -64, -64, 64, -64, -64, 64, -64, 64, 64, -64, -64, -64, -64, 64, -64, -64, -64, 64, 64, -64, -64, -64, -64, -64, -64, 64, -64, 64, -64, -64, 64, 64, 64, -64, -64, 64, -64, -64, -64, -64, 64, 64, 64, 64, -64, 64, -64, 64, -64, -64, -64, -64, -64, -64, -64, 64, -64, 64, -64, 64, -64, 64, 64, -64, -64, -64, -64, -64, -64, -64, -64, -64, -64, -64, -64, -64, -64, 64, -64, -64, -64, -64, 64, 64, -64, -64, 64, -64, 64, -64, 64, -64, -64, -64, -64, -64, -64, -64, 64, 64, -64, -64, -64, -64, -64, -64, -64, -64, -64, -64, -64, -64, 64, 64, 64, -64, 64, -64, -64, -64, 64, 64, -64, 64, 64, 64, -64, -64, 64, -64, -64, 64, -64, -64, -64, -64, -64, -64, -64, 64, -64, 64, 64, -64, 64, -64, -64, -64, 64, 64, -64, 64, -64, -64, -64, -64, -64, -64, -64, -64, -64, -64, -64, -64, -64, -64, 64, 64, -64, 64, 64, 64, -64, 64, 64, 64, 64, -64, -64, -64, 64, -64, -64, -64, -64, -64, -64, -64, -64, -64, -64, -64, 64, -64, -64, 64, 64, -64, 64, 64, 64, 64, 64, -64, -64, 64, -64, 64, 64, -64, -64, -64, 64, 64, -64, 64, -64, 64, -64, -64, 64, 64, -64, -64, 64, 64, -64, 64, -64, -64, 64, -64, -64, 64, -64, 64, -64, -64, -64, -64, -64, 64, -64, -64, 64, -64, -64, 64, 64, 64, 64, 64, -64, 64, 64, -64, 64, -64, -64, 64, 64, -64, 64, -64, -64, -64, 64, 64, -64, 64, -64, 64, -64, 64, -64, -64, -64, 64, -64, -64, 64, -64, 64, 64, 64, 64, -64, 64, -64, 64, -64, -64, -64, -64, -64, 64, -64, -64, 64, -64, -64, 64, -64, 64, -64, 64, 64, -64, 64, 64, 64, -64, 64, 64, -64, 64, -64, -64, -64, -64, -64, 64, -64, -64, -64, 64, -64, -64, -64, -64, 64, 64, -64, 64, 64, -64, 64, 64, 64, -64, 64, -64, -64, -64, 64, -64, -64, -64, 64, -64, 64, -64, -64, 64, -64, -64, -64, -64, 64, 64, -64, 64, -64, 64, 64, 64, -64, 64, 64, -64, -64, -64, -64, 64, -64, -64, 64, 64, 64, 64, -64, -64, 64, -64, -64, -64, 64, -64, -64, -64, 64, -64, -64, -64, -64, -64, 64, -64, -64, -64, 64, -64, -64, -64, -64, 64, -64, 64, -64, -64, -64, -64, 64, 64, 64, -64, -64, -64, -64, 64, -64, 64, -64, -64, -64, -64, 64, -64, -64, -64, -64, -64, -64, 64, -64, -64, -64, -64, 64, -64, 64, 64, 64, -64, -64, -64, 64, -64, -64, -64, 64, 64, 64, -64, 64, -64, -64, -64, -64, 64, -64, -64, -64, -64, 64, -64, 64, 64, -64, -64, -64, -64, -64, -64, 64, 64, -64, -64, -64, -64, -64, -64, -64, 64, -64, -64, -64, -64, -64, -64, -64, 64, -64, 64, -64, 64, -64, -64, -64, -64, -64, 64, 64, -64, 64, -64, -64, -64, 64, 64, -64, -64, -64, -64, -64, -64, -64, -64, -64, -64, 64, -64, -64, -64, -64, 64, -64, -64, -64, 64, -64, -64, -64, -64, 64, 64, -64, -64, -64, -64, -64, 64, -64, -64, -64, 64, 64, 64, -64, 64, -64, -64, -64, 64, -64, -64, -64, -64, 64, -64, -64, 64, 64, 64, 64, -64, -64, -64, 64, -64, 64, -64, -64, -64, -64, -64, 64, -64, 64, 64, -64, 64, 64, -64, -64, 64, 64, -64, 64, 64, 64, 64, 64, -64, -64, 64, -64, -64, -64, 64, -64, 64, 64, 64, -64, 64, 64, 64, -64, 64, 64, 64, -64, 64, -64, -64, -64, 64, 64, 64, 64, -64, 64, 64, -64, -64, 64, 64, 64, 64, 64, -64, 64, 64, 64, -64, 64, 64, 64, -64, -64, -64, 64, -64, -64, -64, -64, -64, -64, 64, -64, 64, 64, 64, -64, -64, -64, 64, -64, 64, 64, -64, 64, -64, 64, 64, -64, 64, 64, -64, -64, -64, 64, 64, 64, 64, 64, -64, 64, -64, -64, 64, 64, -64, 64, 64, 64, 64, -64, -64, -64, 64, -64, -64, -64, -64, -64, 64, 64, 64, 64, -64, 64, 64, 64, -64, -64, -64, -64, 64, -64, -64, 64, -64, 64, -64, -64, 64, 64, 64, 64, 64, 64, -64, -64, 64, 64, 64, 64, -64, 64, -64, -64, -64, 64, -64, -64, -64, 64, 64, -64, -64, -64, -64, 64, 64, 64, -64, -64, -64, -64, 64, -64, 64, -64, 64, -64, 64, -64, -64, -64, -64, -64, 64, -64, 64, 64, -64, 64, -64, -64, 64, 64, -64, 64, 64, -64, 64, 64, -64, -64, -64, 64, 64, 64, 64, -64, -64, -64, -64, -64, 64, 64, -64, 64, 64, -64, -64, 64, -64, 64, -64, -64, 64, 64, -64, -64, -64, -64, 64, 64, -64, -64, 64, -64, 64, 64, 64, -64, -64, -64, 64, -64, -64, 64, 64, -64, 64, -64, -64, -64, -64, 64, 64, 64, -64, -64, -64, -64, -64, -64, -64, -64, -64, 64, -64, 64, 64, 64, -64, -64, -64, -64, -64, -64, -64, 64, 64, -64, -64, 64, -64, -64, -64, 64, -64, 64, -64, -64, -64, 64, -64, 64, 64, 64, -64, 64, -64, 64, 64, -64, -64, 64, 64, 64, -64, -64, -64, 64, -64, -64, -64, 64, 64, -64, -64, -64, 64, -64, -64, -64, 64, 64, 64, 64, -64, -64, -64, 64, -64, -64, 64, 64, -64, -64, 64, -64, -64, 64, -64, 64, 64, -64, 64, -64, 64, 64, 64, -64, -64, 64, -64, -64, 64, -64, -64, 64, -64, -64, -64, 64, -64, 64, -64, -64, -64, -64, -64, 64, -64, -64, 64, -64, -64, 64, 64, 64, 64, 64, -64, 64, 64, -64, -64, -64, -64, -64, -64, -64, 64, 64, -64, -64, -64, 64, -64, -64, -64, -64, -64, -64, 64, -64, 64, -64, 64, 64, 64, 64, -64, -64, -64, -64, 64, 64, -64, 64, -64, -64, -64, 64, -64, 64, -64, -64, -64, -64, -64, -64, -64, 64, 64, 64, -64, 64, 64, 64, 64, -64, -64, -64, 64, 64, -64, -64, -64, -64, -64, -64, 64, -64, 64, -64, -64, -64, -64, -64, 64, -64, 64, -64, -64, -64, 64, -64, -64, 64, -64, -64, -64, -64, -64, -64, -64, -64, 64, -64, -64, 64, -64, 64, -64, -64, -64, -64, 64, -64, -64, -64, -64, -64, -64, 64, -64, -64, -64, -64, -64, -64, 64, -64, -64, -64, -64, 64, -64, -64, -64, -64, 64, 64, -64, 64, 64, 64, 64, -64, -64, -64, 64, -64, 64, -64, 64, -64, -64, -64, 64, -64, 64, -64, -64, 64, -64, -64, -64, -64, 64, 64, 64, -64, 64, -64, -64, 64, 64, 64, 64, -64, -64, -64, -64, 64, 64, -64, -64, -64, 64, -64, -64, -64, -64, -64, -64, -64, 64, 64, -64, 64, -64, -64, 64, -64, -64, 64, -64, 64, -64, 64, -64, -64, -64, 64, -64, 64, -64, -64, -64, -64, 64, -64, -64, -64, -64, 64, -64, -64, -64, -64, 64, 64, -64, 64, -64, -64, -64, -64, -64, 64, 64, -64, -64, 64, -64, -64, -64, -64, -64, -64, -64, -64, -64, 64, 64, 64, -64, 64, 64, -64, -64, 64, -64, -64, -64, -64, -64, 64, -64, -64, -64, 64, -64, 64, -64, 64, -64, 64, 64, -64, -64, -64, 64, 64, 64, 64, -64, 64, -64, -64, 64, -64, -64, -64, -64, -64, -64, 64, 64, 64, -64, -64, -64, -64, -64, -64, -64, 64, -64, -64, 64, 64, -64, 64, 64, -64, 64, 64, -64, -64, -64, -64, -64, -64, -64, 64, 64, -64, -64, -64, -64, 64, -64, -64, 64, -64, -64, 64, -64, 64, 64, -64, 64, -64, 64, 64, -64, -64, -64, -64, -64, -64, -64, -64, 64, -64, 64, -64, -64, -64, -64, -64, -64, -64, -64, -64, 64, -64, 64, -64, -64, -64, 64, -64, -64, -64, 64, -64, 64, -64, -64, -64, -64, -64, -64, 64, -64, 64, -64, -64, -64, -64, -64, 64, -64, 64, 64, -64, 64, 64, -64, 64, -64, -64, -64, -64, -64, 64, 64, 64, 64, -64, -64, 64, -64, 64, 64, -64, -64, 64, 64, 64, -64, 64, 64, -64, 64, -64, 64, -64, 64, -64, -64, 64, 64, 64, -64, 64, 64, -64, 64, -64, -64, 64, -64, 64, -64, 64, 64, 64, -64, 64, -64, -64, 64, -64, -64, 64, -64, -64, -64, -64, 64, 64, 64, 64, -64, 64, -64, 64, -64, 64, -64, -64, 64, -64, 64, 64, -64, -64, -64, -64, 64, 64, -64, -64, 64, -64, -64, -64, 64, -64, 64, 64, 64, 64, 64, -64, -64, 64, -64, -64, -64, 64, -64, -64, 64, -64, 64, 64, 64, -64, -64, 64, -64, -64, -64, 64, -64, -64, 64, 64, 64, -64, 64, 64, -64, 64, 64, 64, 64, 64, -64, -64, -64, -64, -64, 64, 64, -64, -64, 64, 64, -64, -64, 64, 64, 64, -64, -64, 64, 64, -64, -64, 64, -64, 64, 64, 64, 64, -64, -64, -64, -64, -64, -64, -64, -64, 64, -64, -64, -64, -64, 64, -64, -64, -64, 64, 64, 64, 64, 64, -64, -64, 64, 64, 64, 64, -64, 64, -64, 64, 64, -64, -64, -64, -64, -64, -64, -64, -64, 64, -64, -64, 64, 64, -64, -64, 64, 64, 64, -64, 64, 64, -64, 64, -64, -64, 64, -64, 64, -64, 64, 64, -64, -64, -64, -64, -64, -64, 64, 64, -64, 64, 64, 64, 64, 64, 64, -64, -64, -64, -64, -64, 64, 64, -64, -64, -64, 64, 64, -64, 64, -64, -64, -64, -64, -64, -64, -64, -64, 64, 64, 64, 64, 64, 64, -64, -64, -64, -64, -64, 64, -64, 64, -64, 64, -64, 64, 64, 64, -64, -64, -64, 64, -64, -64, 64, -64, 64, 64, 64, 64, 64, 64, 64, -64, -64, -64, -64, -64, -64, -64, -64, 64, 64, -64, -64, 64, 64, -64, -64, -64, -64, -64, 64, 64, 64, 64, 64, 64, 64, 64, -64, -64, -64, -64, -64, -64, -64, 64, 64, -64, 64, 64, 64, 64, -64, -64, -64, -64, -64, -64, -64, -64, 64, 64, 64, 64, 64, -64, -64, -64, -64, -64, -64, -64, 64, -64, -64, -64, 64, 64, 64, 64, -64, -64, -64, -64, 64, -64, 64, 64, 64, 64, 64, 64, 64, -64, -64, -64, -64, -64, -64, 64, -64, 64, 64, 64, -64, 64, 64, 64, -64, -64, -64, 64, 64, 64, 64, 64, 64, 64, 64, -64, -64, 64, -64, -64, -64, -64, 64, 64, -64, 64, 64, 64, 64, 64, 64, -64, -64, -64, 64, 64, 64, 64, 64, 64, 64, -64, -64, -64, 64, -64, -64, 64, 64, -64, 64, 64, 64, 64, 64, -64, 64, 64, -64, -64, -64, -64, -64, -64, 64, 64, 64, -64, -64, -64, -64, -64, -64, 64, -64, 64, 64, 64, 64, 64, 64, -64, -64, 64, 64, 64, -64, -64, -64, -64, 64, -64, -64, 64, 64, -64, -64, -64, -64, -64, -64, -64, -64, 64, 64, 64, 64, 64, 64, -64, -64, -64, 64, -64, -64, -64, -64, -64, -64, -64, -64, -64, -64, -64, -64, -64, -64, -64, -64, 64, -64, 64, 64, 64, 64, 64, -64, -64, 64, 64, -64, -64, 64, -64, -64, -64, -64, -64, -64, 64, -64, -64, -64, 64, -64, -64, -64, 64, 64, 64, 64, 64, 64, 64, 64, -64, -64, -64, -64, -64, -64, 64, -64, 64, 64, 64, -64, 64, 64, 64, 64, 64, 64, 64, 64, -64, 64, 64, 64, 64, 64, 64, 64, 64, -64, 64, 64, -64, -64, -64, -64, -64, 64, 64, -64, 64, 64, 64, 64, 64, 64, -64, -64, -64, -64, 64, -64, 64, 64, -64, 64, -64, 64, 64, -64, 64, -64, -64, -64, -64, -64, -64, 64, 64, 64, 64, -64, 64, 64, -64, 64, 64, -64, 64, 64, 64, 64, 64, -64, 64, 64, -64, 64, -64, -64, -64, -64, -64, -64, -64, 64, 64, 64, 64, 64, 64, 64, -64, -64, 64, -64, -64, 64, 64, 64, 64, -64, -64, -64, -64, 64, 64, 64, -64, -64, -64, -64, -64, 64, 64, 64, -64, -64, -64, 64, -64, -64, 64, -64, 64, 64, -64, -64, 64, -64, -64, 64, 64, -64, -64, -64, -64, -64, -64, 64, 64, 64, 64, 64, 64, 64, 64, 64, 64, 64, -64, 64, -64, 64, -64, -64, 64, -64, 64, -64, 64, 64, 64, -64, -64, 64, 64, 64, 64, 64, -64, 64, 64, 64, -64, -64, 64, -64, -64, 64, -64, -64, -64, 64, 64, -64, 64, -64, 64, 64, 64, 64, 64, 64, 64, -64, 64, -64, -64, -64, -64, -64, -64, -64, -64, -64, -64, 64, -64, -64, -64, -64, 64, 64, 64, -64, 64, 64, -64, 64, 64, -64, -64, -64, -64, -64, -64, 64, 64, 64, -64, -64, -64, -64, -64, -64, -64, -64, -64, -64, 64, -64, -64, -64, -64, -64, 64, 64, 64, -64, 64, -64, -64, -64, -64, -64, 64, 64, -64, -64, 64, 64, -64, -64, 64, -64, -64, -64, -64, 64, 64, 64, -64, -64, -64, 64, -64, 64, -64, -64, -64, -64, 64, 64, -64, -64, -64, -64, 64, -64, -64, -64, 64, 64, -64, 64, -64, -64, -64, -64, -64, 64, -64, 64, 64, 64, 64, -64, -64, 64, 64, 64, -64, 64, -64, 64, 64, 64, -64, -64, -64, -64, 64, 64, -64, -64, -64, 64, -64, -64, 64, -64, 64, -64, -64, -64, 64, -64, 64, -64, 64, 64, 64, 64, 64, 64, -64, -64, -64, 64, -64, 64, 64, 64, -64, -64, -64, -64, 64, -64, -64, 64, 64, -64, 64, 64, -64, -64, 64, 64, -64, 64, 64, 64, -64, -64, -64, -64, -64, -64, -64, 64, 64, 64, -64, 64, -64, -64, 64, 64, -64, 64, -64, -64, 64, -64, 64, 64, 64, -64, 64, 64, -64, -64, 64, -64, -64, 64, 64, 64, 64, -64, 64, 64, 64, -64, -64, 64, 64, 64, 64, 64, 64, -64, 64, -64, 64, 64, 64, 64, 64, 64, 64, 64, 64, 64, 64, -64, 64, 64, -64, 64, 64, -64, 64, 64, 64, 64, 64, 64, -64, 64, 64, 64, 64, 64, 64, 64, 64, 64, 64, 64, 64, 64, 64, 64, 64, -64, -64, -64, -64, 64, 64, 64, 64, 64, -64, 64, -64, 64, 64, 64, 64, 64, 64, 64, 64, 64, 64, 64, 64, 64, -64, -64, 64, -64, -64, 64, 64, 64, 64, 64, 64, 64, 64, -64, 64, 64, 64, 64, 64, -64, 64, 64, 64, 64, -64, -64, -64, -64, 64, 64, -64, 64, 64, -64, -64, -64, 64, 64, 64, 64, 64, 64, 64, -64, 64, -64, -64, -64, 64, -64, 64, 64, -64, -64, -64, -64, -64, -64, -64, -64, -64, 64, 64, 64, 64, 64, 64, 64, 64, 64, 64, -64, -64, -64, -64, -64, -64, 64, 64, 64, 64, -64, -64, -64, -64, -64, -64, -64, 64, 64, 64, 64, 64, 64, 64, 64, 64, 64, -64, -64, -64, -64, 64, -64, -64, -64, -64, 64, 64, 64, 64, -64, -64, -64, -64, 64, -64, -64, 64, 64, 64, 64, 64, 64, -64, 64, -64, -64, -64, -64, 64, -64, -64, 64, 64, 64, 64, 64, 64, 64, 64, 64, -64, 64, 64, 64, 64, 64, 64, 64, 64, -64, -64, 64, -64, -64, -64, -64, -64, -64, -64, -64, 64, 64, 64, 64, 64, 64, 64, 64, -64, -64, -64, 64, -64, 64, 64, 64, 64, -64, -64, -64, -64, -64, -64, -64, 64, -64, -64, -64, 64, 64, 64, 64, 64, 64, 64, 64, -64, -64, -64, -64, -64, 64, -64, 64, 64, -64, 64, -64, -64, -64, 64, -64, -64, -64, -64, -64, -64, 64, 64, 64, 64, 64, 64, 64, -64, 64, 64, 64, 64, -64, 64, 64, 64, 64, 64, -64, -64, -64, -64, -64, -64, 64, 64, 64, -64, 64, 64, 64, -64, -64, 64, 64, 64, -64, 64, 64, -64, -64, 64, 64, 64, 64, -64, 64, -64, -64, -64, 64, -64, 64, -64, -64, 64, 64, -64, 64, 64, -64, -64, 64, -64, 64, -64, -64, 64, 64, 64, 64, 64, 64, 64, -64, 64, -64, 64, -64, 64, 64, 64, 64, -64, -64, 64, -64, -64, 64, 64, 64, 64, 64, -64, 64, -64, 64, 64, 64, 64, 64, 64, 64, 64, -64, -64, 64, -64, 64, 64, -64, 64, 64, 64, 64, 64, 64, 64, 64, -64, -64, -64, -64, 64, -64, 64, 64, 64, -64, 64, 64, 64, -64, -64, -64, 64, 64, -64, -64, 64, 64, 64, 64, 64, 64, 64, 64, 64, -64, 64, 64, -64, 64, 64, 64, -64, 64, 64, 64, 64, 64, -64, 64, -64, 64, -64, -64, 64, 64, 64, 64, 64, 64, 64, 64, -64, 64, 64, -64, -64, 64, 64, 64, 64, 64, 64, 64, 64, 64, 64, 64, 64, -64, 64, 64, 64, 64, 64, 64, 64, 64, 64, -64, -64, 64, -64, 64, 64, 64, 64, 64, 64, 64, 64, 64, 64, 64, 64, 64, -64, -64, 64, -64, -64, -64, -64, 64, 64, 64, 64, -64, 64, 64, -64, 64, 64, 64, 64, -64, 64, 64, 64, -64, -64, 64, 64, 64, 64, 64, 64, -64, -64, -64, 64, 64, 64, -64, -64, -64, -64, -64, 64, -64, -64, -64, -64, -64, -64, -64, -64, -64, -64, 64, 64, -64, 64, 64, 64, -64, -64, 64, -64, 64, 64, 64, -64, -64, 64, 64, -64, 64, 64, -64, -64, -64, -64, -64, -64, -64, -64, -64, -64, -64, -64, -64, 64, -64, -64, 64, 64, -64, -64, -64, 64, -64, -64, 64, 64, -64, 64, -64, 64, -64, -64, 64, 64, 64, -64, -64, -64, 64, 64, 64, -64, -64, 64, -64, 64, -64, 64, 64, -64, -64, 64, -64, 64, 64, -64, -64, 64, -64, 64, -64, -64, -64, -64, -64, -64, 64, -64, 64, 64, 64, -64, -64, 64, -64, 64, -64, 64, -64, -64, 64, 64, 64, 64, -64, 64, -64, -64, -64, -64, 64, 64, 64, 64, -64, 64, 64, -64, -64, 64, 64, 64, 64, -64, -64, 64, 64, 64, 64, 64, -64, 64, -64, -64, 64, 64, 64, -64, 64, -64, -64, -64, -64, 64, -64, 64, -64, 64, 64, 64, -64, -64, 64, -64, 64, 64, 64, 64, -64, -64, 64, 64, 64, 64, -64, -64, 64, -64, 64, -64, 64, -64, -64, -64, -64, -64, -64, -64, -64, 64, 64, -64, -64, 64, 64, 64, 64, -64, -64, -64, -64, 64, -64, 64, -64, -64, -64, -64, -64, -64, -64, -64, -64, -64, -64, -64, -64, -64, -64, -64, -64, -64, -64, 64, -64, 64, -64, -64, 64, 64, 64, -64, -64, -64, -64, -64, -64, -64, -64, -64, -64, -64, -64, -64, 64, 64, 64, 64, 64, 64, 64, -64, 64, -64, -64, -64, 64, 64, 64, -64, -64, -64, -64, -64, 64, -64, -64, -64, -64, -64, -64, -64, 64, 64, 64, 64, -64, 64, 64, -64, -64, 64, -64, -64, -64, -64, -64, -64, -64, -64, -64, -64, -64, -64, -64, -64, 64, 64, 64, 64, 64, 64, 64, 64, -64, -64, -64, 64, -64, 64, 64, 64, -64, 64, -64, -64, -64, 64, -64, 64, -64, -64, -64, -64, 64, 64, 64, 64, 64, 64, 64, 64, 64, 64, -64, -64, 64, 64, 64, -64, -64, -64, -64, 64, -64, 64, 64, 64, 64, -64, -64, -64, -64, 64, 64, 64, 64, 64, 64, 64, 64, 64, 64, -64, -64, 64, -64, -64, -64, -64, 64, -64, -64, 64, 64, 64, 64, 64, 64, 64, -64, 64, 64, 64, 64, 64, 64, 64, 64, 64, -64, -64, -64, 64, -64, -64, -64, -64, 64, 64, 64, 64, 64, 64, 64, -64, 64, -64, 64, 64, 64, 64, 64, 64, 64, 64, 64, -64, 64, -64, -64, -64, -64, -64, -64, -64, 64, 64, 64, 64, 64, -64, 64, 64, 64, -64, -64, -64, 64, 64, 64, 64, 64, 64, 64, 64, 64, 64, -64, -64, -64, -64, -64, 64, 64, 64, 64, 64, 64, 64, 64, 64, 64, -64, -64, -64, 64, 64, 64, 64, 64, -64, -64, 64, -64, 64, -64, 64, -64, 64, 64, 64, 64, 64, 64, 64, 64, -64, -64, 64, 64, -64, -64, -64, 64, 64, 64, -64, -64, -64, -64, -64, 64, -64, 64, -64, 64, -64, -64, 64, 64, 64, 64, 64, -64, 64, 64, 64, 64, 64, 64, 64, 64, 64, -64, 64, -64, -64, 64, -64, -64, 64, -64, -64, -64, -64, 64, -64, -64, -64, 64, -64, -64, 64, 64, 64, 64, -64, -64, -64, 64, 64, 64, -64, -64, -64, -64, 64, -64, -64, 64, 64, -64, 64, -64, -64, -64, -64, 64, 64, 64, -64, 64, 64, 64, -64, 64, 64, 64, 64, 64, -64, -64, -64, -64, 64, -64, 64, 64, -64, -64, -64, -64, -64, -64, 64, -64, -64, -64, 64, 64, 64, 64, 64, 64, 64, 64, -64, -64, -64, -64, -64, -64, 64, 64, 64, 64, 64, -64, -64, 64, -64, 64, -64, -64, 64, -64, 64, 64, 64, -64, -64, 64, 64, 64, -64, -64, 64, -64, -64, -64, 64, -64, 64, 64, -64, 64, -64, 64, 64, 64, -64, -64, -64, -64, 64, 64, 64, -64, -64, -64, 64, 64, -64, -64, -64, -64, 64, -64, -64, 64, -64, -64, 64, -64, -64, 64, 64, 64, -64, -64, -64, -64, 64, 64, -64, -64, -64, -64, -64, 64, -64, -64, -64, -64, -64, -64, 64, -64, -64, -64, 64, -64, -64, 64, 64, 64, 64, -64, -64, -64, 64, -64, -64, -64, -64, -64, -64, -64, -64, -64, -64, 64, -64, 64, 64, -64, 64, -64, -64, -64, 64, -64, 64, -64, 64, 64, 64, 64, -64, -64, -64, -64, -64, -64, -64, -64, -64, -64, 64, 64, -64, -64, 64, 64, 64, 64, 64, 64, 64, 64, -64, 64, 64, 64, 64, 64, 64, 64, -64, -64, -64, 64, -64, -64, 64, -64, 64, 64, 64, -64, 64, -64, 64, -64, 64, 64, 64, 64, 64, 64, 64, 64, 64, 64, 64, -64, 64, 64, 64, -64, -64, 64, 64, 64, 64, 64, 64, 64, 64, 64, 64, -64, -64, -64, -64, 64, 64, 64, 64, 64, 64, 64, 64, -64, 64, -64, -64, -64, -64, -64, 64, 64, 64, 64, -64, 64, 64, -64, 64, -64, -64, 64, -64, 64, -64, 64, -64, 64, -64, 64, 64, -64, 64, 64, 64, 64, 64, 64, 64, 64, 64, 64, 64, -64, 64, -64, -64, -64, -64, -64, -64, -64, -64, 64, -64, -64, -64, 64, -64, 64, 64, 64, 64, 64, 64, 64, -64, 64, 64, 64, 64, 64, 64, -64, 64, 64, 64, 64, 64, 64, 64, 64, 64, 64, -64, 64, 64, -64, 64, -64, 64, 64, 64, -64, 64, -64, 64, 64, -64, 64, -64, 64, -64, 64, -64, 64, 64, 64, 64, 64, 64, 64, 64, 64, -64, 64, 64, -64, -64, -64, -64, -64, -64, 64, 64, -64, 64, -64, 64, 64, 64, 64, -64, -64, -64, 64, 64, -64, 64, 64, -64, -64, -64, 64, -64, 64, -64, 64, 64, 64, -64, 64, -64, -64, -64, -64, 64, -64, -64, -64, 64, 64, -64, 64, -64, 64, 64, 64, 64, 64, 64, -64, 64, 64, -64, -64, -64, 64, -64, -64, 64, 64, -64, -64, -64, -64, 64, 64, 64, -64, -64, -64, -64, 64, 64, 64, 64, 64, 64, 64, 64, 64, 64, 64, 64, -64, -64, 64, 64, 64, 64, 64, 64, 64, 64, 64, -64, 64, -64, -64, -64, 64, 64, 64, 64, 64, 64, 64, -64, 64, 64, -64, 64, 64, -64, -64, -64, -64, -64, 64, 64, -64, 64, 64, 64, 64, -64, -64, 64, 64, 64, 64, 64, 64, 64, 64, -64, 64, 64, -64, -64, 64, 64, 64, 64, -64, 64, -64, 64, 64, 64, 64, -64, 64, 64, -64, -64, -64, 64, 64, 64, 64, 64, 64, 64, 64, 64, -64, 64, 64, 64, 64, 64, 64, -64, 64, 64, -64, -64, 64, -64, -64, 64, -64, -64, 64, 64, -64, 64, 64, 64, 64, 64, 64, 64, -64, 64, 64, 64, 64, 64, 64, 64, 64, 64, 64, -64, 64, 64, -64, 64, 64, -64, -64, 64, -64, 64, 64, 64, -64, 64, 64, 64, 64, -64, 64, -64, -64, 64, -64, 64, 64, 64, 64, -64, 64, -64, -64, -64, 64, -64, 64, -64, -64, 64, 64, 64, 64, -64, 64, 64, 64, -64, -64, -64, 64, 64, 64, 64, 64, 64, -64, 64, -64, -64, -64, -64, 64, -64, -64, -64, -64, -64, -64, -64, -64, 64, -64, 64, 64, -64, -64, 64, 64, 64, 64, 64, 64, -64, -64, -64, -64, 64, -64, -64, 64, -64, -64, -64, -64, -64, 64, 64, 64, 64, 64, 64, 64, -64, -64, 64, -64, 64, 64, 64, 64, 64, -64, 64, 64, -64, 64, 64, -64, -64, -64, -64, -64, -64, 64, 64, 64, -64, 64, -64, -64, 64, -64, -64, -64, 64, -64, 64, 64, 64, -64, -64, -64, -64, -64, 64, -64, -64, -64, -64, -64, -64, 64, 64, -64, -64, 64, -64, 64, -64, -64, 64, 64, 64, 64, 64, 64, 64, 64, -64, 64, -64, -64, -64, 64, 64, -64, 64, -64, -64, 64, 64, 64, 64, 64, -64, 64, 64, -64, -64, -64, -64, -64, 64, 64, 64, -64, 64, 64, -64, 64, -64, 64, -64, -64, 64, 64, 64, 64, 64, 64, 64, 64, 64, 64, 64, -64, -64, 64, -64, 64, 64, 64, 64, 64, -64, 64, 64, 64, 64, 64, 64, 64, -64, 64, 64, 64, 64, 64, -64, 64, -64, -64, -64, -64, 64, -64, -64, 64, -64, 64, 64, 64, -64, 64, -64, -64, 64, 64, 64, 64, 64, 64, 64, -64, -64, 64, 64, 64, -64, -64, -64, 64, 64, 64, 64, 64, 64, -64, 64, 64, -64, -64, 64, -64, 64, 64, 64, 64, 64, -64, -64, 64, 64, 64, 64, 64, -64, -64, -64, 64, 64, 64, -64, 64, 64, 64, 64, -64, -64, 64, -64, -64, 64, 64, 64, 64, 64, -64, 64, -64, 64, 64, 64, -64, 64, 64, -64, -64, 64, 64, 64, 64, -64, -64, -64, 64, -64, -64, 64, 64, 64, 64, 64, 64, 64, 64, 64, 64, 64, 64, 64, 64, -64, -64, 64, 64, -64, 64, -64, -64, 64, 64, 64, -64, -64, 64, 64, 64, -64, -64, -64, 64, 64, 64, -64, 64, 64, 64, -64, -64, 64, 64, 64, -64, 64, -64, -64, -64, 64, -64, -64, 64, -64, -64, -64, -64, -64, -64, -64, 64, 64, 64, 64, 64, 64, -64, 64, -64, -64, 64, -64, -64, 64, -64, -64, 64, 64, -64, -64, 64, 64, 64, 64, -64, -64, -64, -64, -64, -64, 64, -64, 64, 64, 64, -64, -64, 64, 64, -64, -64, -64, -64, -64, -64, 64, -64, -64, 64, 64, 64, 64, 64, -64, -64, -64, -64, 64, 64, 64, -64, 64, -64, 64, 64, 64, 64, -64, -64, -64, -64, -64, 64, -64, -64, -64, -64, -64, -64, 64, 64, -64, -64, 64, -64, 64, -64, -64, -64, -64, -64, -64, 64, 64, 64, 64, -64, 64, 64, 64, 64, -64, 64, 64, -64, 64, 64, -64, 64, 64, 64, 64, -64, -64, -64, 64, 64, 64, 64, -64, -64, -64, -64, -64, 64, 64, -64, 64, -64, 64, 64, -64, 64, 64, -64, 64, -64, -64, 64, -64, 64, -64, -64, -64, 64, 64, -64, -64, -64, -64, 64, 64, -64, -64, 64, 64, 64, -64, -64, -64, 64, -64, 64, -64, -64, 64, 64, -64, 64, -64, -64, -64, -64, -64, -64, -64, -64, -64, -64, -64, -64, 64, 64, 64, -64, -64, 64, -64, -64, 64, 64, 64, 64, 64, 64, -64, -64, -64, -64, -64, -64, -64, -64, -64, -64, 64, 64, 64, -64, -64, -64, 64, -64, 64, 64, 64, 64, 64, -64, -64, 64, -64, -64, 64, -64, -64, -64, -64, -64, -64, -64, -64, 64, 64, 64, 64, 64, -64, -64, 64, -64, -64, 64, 64, 64, 64, 64, -64, 64, -64, -64, -64, -64, -64, -64, -64, -64, 64, 64, 64, -64, -64, -64, -64, -64, -64, -64, 64, 64, -64, 64, -64, -64, 64, -64, 64, -64, -64, -64, -64, -64, -64, -64, -64, -64, -64, 64, 64, 64, -64, -64, 64, 64, 64, -64, 64, -64, -64, 64, 64, 64, 64, -64, 64, -64, -64, -64, -64, -64, -64, -64, -64, -64, -64, -64, 64, 64, -64, 64, -64, 64, 64, 64, -64, -64, -64, 64, -64, 64, -64, 64, -64, -64, -64, -64, -64, -64, -64, -64, -64, -64, -64, 64, 64, -64, -64, -64, -64, 64, 64, -64, 64, 64, -64, -64, 64, -64, 64, 64, 64, -64, -64, -64, 64, 64, -64, 64, -64, -64, -64, 64, -64, -64, -64, -64, -64, -64, 64, -64, -64, 64, -64, -64, -64, 64, -64, -64, 64, 64, -64, -64, -64, -64, -64, -64, -64, -64, -64, -64, -64, -64, 64, 64, -64, 64, -64, 64, 64, 64, -64, -64, 64, 64, -64, -64, -64, 64, -64, 64, -64, -64, 64, -64, -64, -64, -64, -64, 64, -64, -64, -64, 64, 64, -64, 64, -64, -64, -64, -64, -64, 64, -64, -64, 64, 64, 64, 64, -64, -64, 64, 64, -64, -64, -64, -64, -64, -64, -64, -64, -64, -64, 64, 64, 64, -64, -64, -64, -64, 64, -64, -64, -64, 64, 64, 64, -64, -64, -64, -64, -64, -64, -64, -64, -64, -64, -64, -64, -64, 64, 64, 64, -64, -64, -64, -64, -64, 64, 64, -64, 64, 64, 64, -64, -64, -64, -64, -64, -64, -64, -64, -64, -64, -64, -64, -64, 64, 64, 64, 64, -64, -64, 64, 64, -64, -64, -64, 64, 64, -64, 64, 64, 64, -64, 64, 64, -64, -64, -64, -64, -64, -64, -64, -64, -64, 64, 64, -64, -64, -64, -64, -64, 64, -64, -64, -64, 64, 64, -64, 64, 64, 64, -64, 64, -64, -64, -64, -64, -64, -64, -64, -64, -64, 64, -64, -64, -64, -64, -64, -64, -64, -64, -64, 64, -64, 64, -64, 64, 64, 64, 64, -64, -64, -64, -64, -64, 64, -64, 64, 64, 64, 64, -64, -64, -64, -64, -64, -64, -64, 64, 64, 64, 64, 64, 64, 64, -64, 64, -64, 64, -64, 64, 64, -64, 64, 64, 64, 64, 64, -64, -64, -64, -64, -64, -64, 64, -64, -64, 64, -64, -64, 64, 64, -64, -64, 64, -64, -64, -64, -64, -64, -64, 64, 64, 64, 64, -64, -64, -64, -64, -64, -64, -64, -64, -64, 64, 64, 64, 64, 64, 64, 64, -64, -64, -64, -64, -64, -64, -64, -64, 64, -64, 64, 64, 64, 64, -64, -64, -64, -64, -64, -64, -64, -64, 64, 64, 64, -64, 64, -64, -64, -64, -64, -64, -64, -64, 64, 64, -64, -64, -64, -64, -64, 64, -64, -64, -64, 64, -64, 64, -64, -64, 64, -64, 64, -64, 64, -64, -64, -64, -64, -64, -64, -64, 64, -64, -64, -64, -64, -64, 64, -64, 64, -64, 64, -64, 64, 64, -64, 64, 64, 64, 64, -64, 64, -64, -64, -64, -64, -64, 64, -64, -64, -64, -64, -64, -64, -64, -64, 64, 64, -64, -64, 64, -64, -64, -64, -64, -64, -64, -64, 64, -64, -64, -64, -64, -64, -64, -64, 64, -64, -64, -64, -64, -64, -64, -64, 64, 64, -64, 64, 64, 64, 64, -64, 64, 64, 64, 64, 64, 64, -64, 64, 64, -64, 64, -64, -64, 64, -64, 64, 64, -64, -64, 64, -64, -64, 64, 64, 64, 64, -64, 64, -64, -64, -64, -64, -64, 64, 64, -64, 64, 64, -64, 64, 64, -64, -64, -64, -64, 64, -64, 64, 64, 64, 64, 64, 64, 64, 64, -64, -64, 64, -64, -64, 64, -64, 64, 64, 64, 64, 64, 64, -64, 64, -64, 64, 64, 64, 64, 64, -64, 64, 64, 64, -64, -64, 64, 64, -64, -64, 64, -64, 64, -64, -64, -64, -64, 64, -64, 64, -64, -64, -64, -64, 64, -64, -64, 64, -64, -64, -64, -64, 64, -64, -64, -64, -64, -64, 64, 64, -64, -64, 64, -64, -64, 64, -64, -64, 64, -64, -64, -64, -64, -64, 64, -64, -64, 64, 64, -64, -64, -64, 64, -64, 64, -64, 64, 64, -64, -64, -64, 64, 64, 64, -64, -64, -64, -64, -64, 64, -64, 64, 64, -64, -64, 64, 64, -64, -64, -64, 64, 64, -64, 64, 64, -64, -64, 64, 64, 64, 64, -64, 64, -64, -64, -64, 64, -64, 64, 64, 64, 64, -64, -64, 64, 64, 64, -64, -64, 64, 64, -64, -64, 64, 64, 64, 64, -64, 64, -64, -64, 64, -64, -64, -64, -64, 64, 64, 64, 64, 64, 64, -64, 64, 64, 64, 64, -64, 64, -64, 64, 64, 64, 64, -64, -64, 64, 64, 64, 64, 64, -64, -64, -64, 64, 64, 64, 64, 64, 64, 64, -64, -64, -64, -64, -64, -64, -64, -64, -64, 64, -64, -64, 64, -64, -64, -64, -64, -64, -64, -64, 64, 64, -64, 64, 64, 64, 64, 64, -64, -64, -64, -64, -64, -64, -64, -64, 64, 64, 64, -64, -64, -64, -64, -64, -64, -64, -64, -64, -64, -64, -64, 64, 64, 64, 64, -64, -64, -64, 64, 64, 64, 64, -64, -64, -64, -64, 64, 64, -64, -64, -64, 64, -64, -64, -64, -64, -64, -64, -64, -64, -64, 64, 64, -64, 64, -64, 64, 64, -64, 64, -64, -64, 64, -64, 64, 64, -64, 64, -64, -64, 64, 64, -64, 64, -64, -64, -64, 64, -64, 64, 64, 64, -64, -64, -64, 64, -64, 64, 64, 64, -64, -64, -64, -64, -64, -64, -64, 64, 64, -64, -64, -64, 64, -64, -64, -64, -64, 64, 64, 64, -64, -64, -64, 64, -64, -64, 64, 64, -64, 64, -64, -64, -64, -64, -64, 64, 64, -64, 64, -64, -64, -64, -64, -64, -64, 64, 64, 64, -64, 64, -64, -64, 64, -64, -64, 64, 64, 64, -64, -64, -64, -64, 64, 64, -64, -64, -64, -64, -64, -64, -64, -64, -64, 64, 64, 64, -64, 64, 64, 64, -64, -64, -64, -64, 64, -64, -64, -64, -64, -64, -64, 64, -64, -64, -64, -64, -64, -64, -64, -64, -64, 64, 64, -64, -64, -64, 64, 64, 64, 64, 64, 64, 64, -64, -64, -64, -64, -64, -64, -64, -64, -64, -64, -64, -64, -64, -64, -64, -64, 64, 64, -64, 64, -64, -64, 64, 64, -64, -64, -64, 64, 64, -64, -64, -64, -64, 64, 64, 64, -64, -64, 64, 64, -64, -64, 64, 64, 64, -64, -64, 64, 64, 64, 64, 64, -64, 64, 64, -64, -64, 64, -64, 64, 64, 64, 64, -64, 64, 64, -64, -64, 64, 64, -64, -64, -64, -64, -64, 64, 64, 64, -64, 64, 64, 64, 64, 64, -64, 64, -64, 64, 64, 64, 64, 64, 64, 64, 64, -64, 64, 64, 64, 64, 64, 64, 64, -64, 64, 64, -64, 64, 64, 64, 64, -64, -64, -64, 64, 64, 64, 64, 64, 64, 64, 64, 64, 64, 64, 64, 64, 64, -64, 64, 64, 64, -64, 64, 64, 64, 64, 64, -64, -64, -64, 64, 64, 64, 64, 64, 64, 64, 64, 64, 64, 64, 64, 64, 64, 64, 64, -64, 64, 64, 64, 64, -64, -64, -64, -64, 64, 64, 64, 64, 64, 64, 64, 64, 64, 64, 64, 64, 64, 64, 64, -64, 64, 64, 64, -64, 64, -64, -64, 64, -64, -64, 64, 64, 64, -64, 64, 64, 64, 64, 64, -64, 64, -64, 64, 64, -64, -64, -64, -64, -64, -64, 64, -64, 64, -64, -64, 64, 64, -64, 64, 64, 64, 64, 64, 64, 64, 64, 64, 64, 64, 64, -64, -64, -64, -64, -64, -64, -64, -64, 64, 64, 64, 64, -64, 64, 64, 64, -64, -64, 64, -64, 64, 64, 64, -64, 64, 64, -64, 64, -64, -64, -64, -64, -64, -64, -64, -64, 64, 64, 64, -64, -64, 64, 64, -64, 64, 64, 64, -64, 64, -64, 64, -64, 64, 64, -64, -64, -64, -64, -64, -64, -64, -64, 64, 64, 64, -64, -64, -64, 64, 64, 64, 64, 64, -64, 64, -64, 64, -64, -64, -64, -64, -64, -64, -64, -64, -64, -64, -64, -64, -64, -64, 64, 64, -64, -64, -64, -64, -64, 64, -64, -64, -64, 64, 64, -64, -64, -64, -64, -64, -64, 64, -64, -64, -64, -64, -64, -64, 64, -64, 64, -64, 64, -64, -64, -64, -64, 64, -64, 64, -64, -64, -64, 64, -64, -64, -64, -64, 64, -64, -64, -64, -64, -64, -64, -64, -64, -64, -64, -64, -64, -64, -64, -64, 64, 64, -64, 64, 64, 64, 64, -64, -64, 64, 64, 64, -64, -64, -64, -64, 64, -64, -64, 64, -64, -64, 64, -64, -64, -64, -64, 64, -64, 64, -64, -64, 64, -64, 64, -64, 64, 64, 64, -64, -64, 64, 64, 64, 64, -64, 64, -64, -64, 64, -64, -64, 64, -64, -64, -64, -64, -64, -64, -64, 64, 64, -64, -64, 64, -64, 64, 64, 64, 64, 64, 64, -64, 64, -64, -64, -64, 64, 64, 64, 64, -64, -64, -64, -64, 64, 64, 64, 64, -64, 64, 64, -64, -64, -64, 64, 64, -64, 64, 64, -64, -64, -64, 64, -64, -64, 64, 64, -64, 64, -64, 64, -64, -64, 64, 64, 64, -64, 64, 64, -64, -64, -64, -64, 64, 64, -64, -64, 64, 64, -64, 64, -64, -64, 64, -64, -64, 64, -64, 64, -64, 64, 64, 64, 64, -64, 64, -64, 64, -64, 64, 64, -64, 64, 64, -64, 64, 64, -64, 64, 64, 64, -64, -64, -64, -64, 64, 64, -64, 64, -64, 64, 64, -64, 64, 64, 64, 64, 64, 64, -64, 64, 64, -64, 64, 64, -64, -64, 64, 64, 64, -64, 64, -64, -64, -64, -64, -64, -64, 64, 64, 64, 64, -64, -64, -64, -64, -64, -64, -64, 64, 64, 64, 64, 64, -64, -64, 64, 64, 64, 64, -64, 64, 64, 64, 64, -64, 64, -64, 64, 64, 64, 64, -64, -64, -64, 64, 64, 64, 64, -64, 64, -64, -64, -64, -64, 64, 64, 64, -64, 64, -64, -64, -64, 64, -64, 64, -64, -64, -64, 64, -64, -64, -64, 64, 64, 64, -64, 64, 64, -64, -64, 64, -64, 64, -64, -64, 64, -64, -64, -64, 64, -64, -64, -64, -64, -64, -64, -64, 64, 64, 64, -64, 64, 64, 64, 64, 64, 64, 64, 64, -64, 64, 64, -64, 64, -64, -64, 64, 64, 64, -64, -64, 64, 64, -64, -64, -64, 64, -64, -64, 64, 64, 64, 64, 64, 64, -64, -64, 64, 64, 64, 64, 64, -64, -64, 64, -64, 64, -64, 64, 64, 64, -64, -64, -64, -64, 64, 64, -64, 64, -64, 64, -64, 64, 64, -64, 64, 64, -64, 64, -64, -64, -64, 64, 64, -64, 64, -64, -64, -64, -64, -64, -64, 64, 64, -64, -64, 64, -64, 64, 64, 64, -64, 64, -64, 64, -64, -64, 64, -64, 64, 64, -64, -64, -64, -64, -64, 64, -64, 64, -64, 64, 64, -64, -64, 64, 64, -64, -64, 64, 64, 64, 64, 64, 64, -64, 64, 64, 64, 64, -64, -64, 64, 64, -64, 64, 64, -64, 64, 64, 64, 64, -64, -64, 64, 64, 64, 64, -64, 64, 64, 64, 64, 64, 64, -64, -64, 64, 64, -64, 64, 64, 64, 64, 64, -64, 64, 64, -64, 64, 64, 64, 64, -64, 64, -64, 64, -64, 64, 64, 64, -64, -64, 64, 64, 64, 64, 64, -64, 64, 64, -64, 64, 64, 64, 64, -64, 64, -64, 64, 64, 64, 64, -64, 64, 64, 64, 64, 64, 64, 64, -64, -64, 64, 64, 64, -64, 64, -64, -64, 64, 64, 64, 64, 64, -64, 64, 64, 64, 64, 64, 64, 64, -64, 64, 64, -64, 64, -64, 64, -64, -64, -64, 64, -64, 64, -64, -64, 64, 64, -64, -64, -64, 64, -64, 64, 64, 64, -64, -64, 64, 64, -64, 64, 64, 64, 64, -64, 64, 64, 64, -64, 64, 64, -64, 64, -64, 64, -64, -64, -64, -64, 64, -64, -64, 64, 64, 64, 64, 64, -64, -64, -64, 64, 64, 64, -64, 64, 64, -64, 64, -64, 64, 64, -64, 64, -64, 64, 64, 64, 64, 64, 64, -64, 64, -64, -64, 64, 64, 64, 64, 64, 64, 64, 64, 64, 64, -64, 64, -64, 64, 64, 64, 64, 64, 64, -64, 64, 64, -64, 64, -64, 64, 64, 64, 64, 64, 64, -64, 64, 64, -64, -64, 64, 64, -64, -64, -64, 64, -64, -64, 64, -64, -64, -64, -64, 64, 64, 64, 64, -64, 64, 64, 64, -64, 64, -64, 64, 64, -64, 64, 64, -64, 64, -64, 64, -64, 64, 64, -64, 64, 64, -64, -64, 64, 64, 64, 64, -64, -64, 64, 64, 64, 64, -64, 64, -64, 64, -64, -64, 64, 64, -64, -64, 64, 64, -64, -64, -64, 64, 64, 64, 64, 64, 64, 64, 64, 64, -64, 64, 64, -64, 64, -64, 64, 64, 64, 64, 64, -64, -64, 64, 64, 64, 64, -64, -64, -64, -64, 64, 64, -64, -64, 64, 64, -64, -64, -64, 64, 64, 64, 64, 64, 64, 64, 64, 64, -64, -64, 64, -64, -64, 64, -64, 64, -64, 64, -64, 64, -64, -64, 64, -64, 64, -64, 64, 64, 64, 64, -64, -64, -64, 64, 64, -64, -64, 64, 64, -64, 64, 64, 64, 64, 64, -64, -64, 64, 64, 64, -64, 64, 64, 64, -64, -64, -64, -64, 64, -64, 64, -64, -64, 64, 64, -64, 64, -64, 64, -64, -64, -64, -64, -64, 64, -64, -64, 64, -64, -64, -64, 64, -64, 64, -64, -64, -64, 64, 64, 64, 64, -64, -64, -64, -64, -64, -64, -64, 64, -64, 64, 64, -64, -64, 64, 64, -64, -64, 64, -64, -64, 64, -64, 64, 64, -64, 64, 64, -64, -64, 64, -64, 64, 64, 64, -64, -64, 64, 64, -64, -64, 64, 64, -64, -64, 64, 64, 64, 64, -64, 64, -64, -64, 64, -64, -64, 64, 64, 64, -64, -64, -64, 64, -64, 64, 64, 64, 64, 64, 64, 64, -64, -64, -64, 64, 64, 64, 64, 64, 64, -64, 64, -64, -64, -64, 64, -64, 64, 64, -64, 64, 64, -64, 64, -64, 64, 64, 64, 64, -64, -64, -64, 64, -64, 64, 64, 64, 64, -64, -64, 64, -64, 64, -64, 64, -64, 64, 64, -64, 64, 64, -64, -64, 64, -64, 64, -64, 64, -64, -64, 64, -64, 64, 64, 64, -64, 64, 64, 64, -64, 64, -64, -64, 64, -64, 64, 64, 64, 64, 64, -64, -64, 64, 64, 64, -64, -64, 64, 64, 64, -64, 64, -64, -64, 64, -64, 64, -64, 64, -64, 64, 64, 64, 64, 64, 64, 64, 64, 64, -64, -64, 64, -64, 64, -64, -64, -64, -64, 64, 64, -64, 64, -64, 64, 64, 64, 64, 64, -64, -64, -64, -64, -64, -64, 64, 64, -64, 64, 64, 64, 64, -64, 64, 64, 64, 64, 64, 64, -64, 64, 64, 64, 64, 64, -64, -64, 64, -64, -64, 64, -64, -64, -64, -64, 64, -64, 64, 64, 64, 64, -64, 64, 64, -64, -64, 64, 64, 64, 64, 64, 64, 64, -64, 64, 64, 64, -64, -64, -64, 64, 64, -64, 64, 64, -64, -64, 64, 64, -64, -64, -64, -64, 64, -64, 64, -64, 64, 64, -64, 64, -64, 64, -64, 64, -64, 64, -64, -64, 64, 64, -64, -64, -64, 64, -64, 64, 64, 64, 64, 64, -64, -64, 64, 64, 64, 64, 64, 64, -64, -64, -64, -64, -64, -64, 64, 64, -64, 64, 64, -64, -64, -64, 64, 64, 64, 64, 64, 64, -64, 64, 64, 64, 64, -64, -64, 64, 64, 64, -64, 64, -64, 64, 64, 64, -64, 64, 64, 64, 64, -64, 64, 64, 64, 64, 64, -64, -64, 64, 64, 64, 64, 64, 64, -64, -64, 64, -64, 64, -64, -64, -64, -64, -64, -64, 64, 64, 64, 64, 64, 64, -64, 64, 64, 64, 64, 64, 64, 64, 64, 64, 64, 64, 64, -64, 64, 64, 64, -64, -64, 64, -64, -64, 64, 64, 64, 64, 64, 64, 64, 64, 64, 64, 64, 64, 64, 64, -64, -64, -64, 64, 64, 64, -64, -64, -64, -64, -64, 64, 64, -64, -64, 64, 64, 64, 64, -64, 64, -64, 64, -64, 64, 64, 64, 64, 64, 64, -64, 64, -64, -64, 64, 64, -64, -64, 64, 64, -64, 64, -64, 64, 64, 64, 64, 64, -64, -64, -64, 64, 64, -64, 64, 64, 64, 64, 64, 64, -64, -64, -64, 64, 64, 64, 64, 64, 64, 64, -64, -64, 64, -64, 64, 64, -64, 64, -64, 64, 64, 64, 64, 64, -64, 64, 64, -64, 64, -64, -64, -64, -64, -64, 64, 64, 64, -64, -64, 64, -64, 64, -64, 64, 64, -64, -64, 64, 64, 64, 64, -64, 64, 64, -64, 64, -64, -64, -64, -64, -64, 64, -64, -64, 64, -64, 64, 64, 64, 64, -64, 64, -64, 64, 64, 64, 64, 64, -64, -64, -64, -64, -64, 64, 64, -64, 64, -64, -64, -64, 64, -64, 64, -64, -64, 64, 64, -64, 64, 64, 64, -64, 64, -64, -64, 64, -64, 64, 64, 64, 64, -64, 64, -64, 64, -64, 64, -64, 64, -64, -64, -64, 64, 64, 64, 64, 64, 64, 64, 64, 64, 64, 64, -64, 64, 64, -64, 64, -64, -64, 64, -64, -64, 64, -64, -64, 64, -64, 64, -64, -64, -64, 64, 64, 64, -64, 64, 64, 64, 64, 64, 64, 64, -64, 64, 64, -64, 64, -64, -64, -64, -64, 64, -64, -64, 64, 64, -64, 64, -64, -64, -64, 64, -64, -64, -64, 64, -64, 64, 64, 64, -64, 64, 64, 64, -64, 64, -64, -64, 64, 64, 64, 64, 64, 64, -64, -64, 64, 64, -64, 64, 64, 64, 64, 64, -64, 64, 64, 64, -64, 64, -64, 64, -64, 64, 64, 64, -64, 64, -64, -64, -64, 64, -64, -64, -64, -64, -64, 64, -64, 64, -64, 64, 64, -64, 64, -64, -64, 64, -64, -64, -64, -64, 64, -64, -64, 64, 64, -64, 64, 64, 64, -64, 64, 64, 64, 64, 64, 64, 64, -64, 64, -64, 64, 64, 64, -64, 64, 64, -64, -64, 64, 64, 64, -64, -64, 64, 64, 64, -64, 64, -64, 64, 64, -64, -64, -64, 64, 64, -64, 64, 64, -64, -64, -64, -64, 64, -64, 64, -64, -64, 64, -64, 64, -64, 64, -64, 64, 64, -64, -64, 64, -64, -64, 64, -64, -64, -64, -64, 64, 64, 64, -64, -64, -64, -64, -64, 64, -64, 64, -64, 64, -64, -64, -64, 64, -64, -64, -64, 64, -64, -64, -64, 64, -64, -64, -64, 64, 64, -64, 64, -64, 64, 64, 64, 64, -64, 64, 64, -64, 64, 64, 64, 64, -64, 64, 64, -64, -64, -64, 64, -64, -64, 64, 64, -64, 64, -64, -64, -64, 64, 64, -64, -64, 64, 64, -64, 64, 64, -64, -64, -64, -64, -64, -64, -64, -64, -64, -64, -64, -64, -64, -64, -64, -64, -64, -64, 64, -64, -64, -64, -64, -64, -64, 64, 64, 64, -64, 64, 64, 64, 64, -64, -64, -64, -64, -64, 64, -64, 64, -64, -64, -64, 64, -64, -64, 64, 64, 64, 64, -64, -64, -64, -64, -64, 64, 64, -64, -64, -64, -64, -64, -64, -64, -64, -64, 64, 64, -64, -64, -64, -64, -64, 64, 64, 64, -64, -64, 64, 64, -64, -64, -64, 64, -64, 64, 64, -64, -64, -64, 64, 64, -64, -64, -64, 64, -64, -64, -64, -64, 64, 64, 64, -64, -64, -64, -64, -64, -64, -64, 64, -64, -64, 64, 64, -64, -64, -64, -64, -64, -64, -64, -64, -64, -64, -64, -64, -64, -64, 64, 64, -64, -64, 64, -64, 64, 64, -64, -64, -64, 64, -64, -64, -64, 64, 64, 64, -64, 64, 64, -64, -64, -64, 64, 64, -64, -64, -64, -64, -64, 64, 64, 64, -64, 64, -64, 64, -64, 64, -64, -64, -64, -64, -64, 64, 64, -64, -64, -64, 64, 64, 64, -64, -64, 64, 64, 64, -64, -64, -64, -64, 64, 64, 64, -64, 64, -64, -64, 64, -64, -64, 64, 64, -64, -64, -64, -64, -64, 64, 64, -64, -64, -64, -64, -64, 64, -64, -64, -64, 64, -64, -64, -64, 64, 64, -64, -64, -64, -64, -64, -64, 64, -64, -64, 64, 64, -64, -64, 64, -64, 64, -64, 64, 64, 64, -64, -64, 64, 64, 64, 64, -64, 64, 64, 64, 64, -64, 64, -64, 64, -64, -64, -64, -64, 64, 64, -64, -64, 64, -64, 64, 64, -64, 64, -64, 64, -64, 64, -64, 64, 64, 64, -64, -64, -64, 64, -64, -64, -64, -64, -64, 64, 64, -64, -64, -64, -64, -64, 64, -64, -64, 64, -64, 64, 64, -64, 64, 64, -64, -64, 64, -64, -64, -64, 64, -64, -64, -64, 64, -64, -64, -64, 64, 64, -64, 64, -64, -64, -64, -64, -64, -64, 64, 64, -64, -64, 64, 64, -64, 64, -64, -64, -64, 64, -64, -64, -64, -64, 64, -64, -64, -64, -64, 64, -64, 64, -64, -64, -64, 64, 64, -64, 64, -64, 64, -64, -64, -64, -64, -64, -64, 64, -64, 64, -64, -64, 64, -64, -64, -64, -64, -64, 64, -64, -64, -64, 64, -64, 64, 64, -64, 64, 64, -64, -64, 64, -64, 64, -64, -64, -64, 64, -64, -64, 64, -64, 64, -64, -64, -64, -64, 64, -64, -64, 64, -64, -64, 64, -64, 64, 64, -64, -64, 64, 64, -64, -64, 64, -64, -64, -64, -64, 64, 64, -64, -64, -64, -64, -64, -64, -64, 64, 64, 64, -64, 64, -64, -64, 64, -64, -64, -64, 64, -64, 64, -64, -64, -64, -64, 64, -64, -64, 64, -64, -64, -64, 64, -64, -64, 64, 64, 64, -64, 64, -64, 64, 64, -64, -64, 64, -64, 64, -64, -64, -64, 64, -64, -64, 64, -64, -64, -64, -64, 64, 64, 64, -64, 64, 64, -64, -64, 64, -64, 64, -64, 64, -64, 64, -64, -64, -64, 64, -64, -64, 64, -64, -64, -64, -64, -64, -64, -64, -64, 64, 64, 64, 64, 64, 64, -64, -64, -64, -64, -64, 64, 64, 64, 64, 64, -64, -64, -64, 64, 64, -64, -64, -64, 64, -64, 64, 64, 64, 64, -64, -64, 64, 64, -64, -64, 64, -64, 64, 64, -64, 64, -64, 64, 64, 64, -64, -64, 64, -64, -64, -64, -64, -64, 64, 64, 64, -64, -64, -64, -64, 64, -64, -64, 64, 64, -64, -64, -64, -64, -64, 64, -64, -64, -64, -64, -64, -64, 64, -64, -64, -64, -64, 64, 64, 64, 64, 64, -64, 64, -64, 64, 64, 64, 64, -64, -64, -64, -64, -64, -64, 64, -64, 64, -64, -64, -64, 64, 64, 64, 64, -64, 64, 64, 64, -64, 64, -64, 64, 64, -64, 64, -64, -64, 64, -64, -64, -64, -64, -64, -64, 64, -64, 64, 64, -64, -64, 64, 64, 64, -64, -64, -64, 64, 64, 64, -64, -64, -64, 64, -64, 64, -64, 64, -64, -64, 64, -64, 64, -64, -64, 64, 64, 64, 64, 64, 64, -64, -64, 64, -64, 64, 64, 64, 64, -64, 64, 64, -64, -64, 64, -64, 64, 64, -64, -64, -64, -64, 64, -64, 64, 64, -64, -64, -64, 64, 64, 64, 64, 64, 64, -64, 64, 64, -64, 64, -64, -64, -64, -64, -64, 64, 64, 64, 64, 64, 64, -64, -64, -64, 64, 64, -64, -64, -64, -64, 64, 64, -64, 64, 64, 64, 64, -64, -64, 64, 64, -64, -64, 64, -64, 64, -64, -64, 64, 64, 64, 64, -64, -64, -64, 64, 64, 64, -64, -64, -64, -64, -64, -64, -64, -64, 64, -64, 64, -64, -64, 64, 64, 64, 64, -64, 64, -64, -64, 64, 64, -64, -64, 64, 64, -64, -64, 64, 64, -64, 64, -64, 64, 64, -64, -64, 64, -64, -64, 64, 64, -64, 64, 64, 64, 64, 64, 64, -64, 64, -64, -64, -64, 64, -64, -64, 64, 64, -64, 64, 64, -64, -64, -64, -64, -64, -64, 64, -64, -64, 64, -64, 64, 64, 64, 64, 64, -64, -64, -64, -64, 64, 64, 64, 64, 64, 64, -64, -64, 64, 64, -64, 64, -64, 64, 64, 64, 64, -64, -64, 64, 64, 64, -64, -64, -64, 64, -64, -64, -64, -64, -64, 64, 64, -64, -64, -64, -64, 64, 64, 64, 64, 64, 64, 64, 64, -64, 64, 64, 64, 64, 64, 64, -64, -64, -64, 64, -64, 64, -64, -64, -64, -64, -64, 64, 64, 64, 64, 64, 64, 64, 64, 64, -64, 64, 64, 64, 64, 64, 64, -64, -64, 64, -64, -64, -64, 64, -64, 64, 64, 64, 64, -64, 64, 64, 64, 64, 64, 64, 64, 64, -64, 64, 64, 64, 64, 64, 64, 64, -64, -64, -64, 64, -64, 64, 64, 64, 64, 64, -64, -64, -64, 64, 64, -64, 64, 64, 64, 64, -64, 64, 64, 64, 64, 64, 64, -64, -64, -64, -64, -64, -64, 64, -64, -64, -64, 64, 64, -64, -64, 64, 64, -64, 64, 64, 64, 64, 64, 64, -64, 64, 64, 64, 64, 64, -64, 64, 64, 64, -64, 64, 64, -64, 64, -64, -64, -64, 64, 64, -64, -64, 64, 64, 64, 64, -64, 64, 64, 64, 64, 64, 64, -64, -64, -64, 64, 64, -64, -64, -64, 64, 64, -64, 64, -64, 64, 64, 64, 64, 64, 64, 64, 64, 64, 64, 64, -64, 64, 64, 64, 64, -64, -64, 64, 64, -64, -64, 64, 64, 64, 64, 64, -64, 64, 64, -64, -64, 64, 64, 64, 64, 64, 64, -64, 64, 64, 64, 64, -64, -64, 64, -64, -64, -64, -64, -64, -64, -64, -64, -64, -64, 64, 64, 64, 64, 64, 64, 64, 64, 64, 64, -64, 64, 64, 64, 64, 64, -64, 64, 64, 64, 64, -64, -64, -64, 64, 64, -64, 64, -64, -64, 64, 64, 64, 64, 64, 64, 64, 64, 64, 64, 64, 64, 64, 64, -64, 64, -64, -64, -64, -64, -64, -64, -64, -64, 64, -64, 64, -64, -64, -64, 64, 64, 64, 64, 64, 64, 64, 64, 64, 64, -64, 64, 64, -64, 64, 64, 64, 64, 64, -64, 64, 64, 64, 64, 64, -64, 64, -64, 64, 64, 64, 64, 64, 64, 64, 64, 64, -64, 64, -64, 64, 64, 64, -64, -64, -64, 64, 64, 64, -64, -64, -64, -64, -64, -64, 64, -64, -64, -64, -64, 64, 64, 64, 64, 64, 64, 64, 64, 64, 64, 64, 64, -64, 64, 64, -64, -64, 64, -64, -64, -64, -64, -64, -64, -64, -64, -64, 64, -64, 64, 64, 64, 64, 64, 64, 64, -64, 64, 64, 64, 64, 64, 64, -64, 64, -64, 64, -64, 64, -64, -64, -64, 64, -64, -64, -64, -64, 64, 64, -64, 64, 64, 64, 64, -64, 64, 64, 64, 64, 64, -64, -64, 64, -64, 64, 64, 64, 64, 64, 64, -64, -64, -64, -64, 64, 64, -64, 64, 64, 64, 64, 64, 64, -64, 64, 64, -64, 64, -64, -64, 64, -64, 64, 64, 64, 64, -64, -64, -64, -64, -64, 64, 64, 64, 64, 64, 64, 64, -64, -64, -64, 64, 64, 64, 64, 64, -64, 64, 64, -64, 64, -64, -64, -64, -64, -64, 64, -64, 64, 64, 64, -64, -64, 64, 64, 64, 64, 64, 64, 64, 64, 64, -64, 64, -64, 64, 64, 64, 64, 64, 64, 64, 64, 64, 64, 64, 64, -64, 64, 64, -64, -64, -64, -64, 64, 64, 64, -64, 64, -64, 64, 64, -64, -64, 64, -64, -64, 64, 64, -64, -64, 64, -64, -64, -64, 64, 64, -64, 64, -64, 64, -64, -64, -64, 64, 64, -64, -64, 64, 64, -64, -64, -64, -64, -64, -64, 64, -64, -64, 64, 64, 64, -64, -64, 64, 64, -64, 64, 64, 64, 64, 64, -64, 64, 64, -64, -64, 64, -64, 64, 64, 64, 64, 64, 64, 64, 64, 64, -64, 64, 64, -64, -64, -64, 64, -64, 64, 64, -64, -64, -64, -64, -64, 64, -64, -64, 64, 64, -64, -64, -64, 64, 64, 64, -64, -64, 64, 64, -64, -64, -64, 64, -64, -64, -64, 64, 64, -64, -64, -64, -64, -64, -64, 64, 64, 64, -64, 64, 64, 64, -64, 64, -64, -64, -64, 64, 64, 64, 64, 64, 64, 64, 64, 64, 64, 64, -64, -64, 64, 64, -64, 64, 64, 64, 64, -64, -64, -64, 64, -64, 64, 64, 64, 64, 64, 64, 64, 64, -64, 64, -64, -64, -64, 64, 64, -64, -64, -64, -64, -64, -64, -64, 64, -64, 64, -64, -64, -64, -64, 64, 64, 64, 64, 64, 64, -64, -64, -64, -64, -64, -64, -64, -64, -64, -64, -64, -64, -64, -64, 64, -64, 64, 64, -64, 64, -64, -64, -64, -64, -64, -64, -64, -64, -64, -64, -64, 64, 64, -64, -64, -64, -64, -64, -64, -64, -64, 64, 64, -64, 64, 64, -64, -64, 64, 64, -64, -64, -64, -64, 64, 64, 64, -64, -64, -64, -64, -64, -64, -64, -64, -64, -64, -64, 64, 64, -64, 64, -64, -64, -64, 64, -64, 64, -64, -64, -64, -64, -64, -64, -64, -64, -64, -64, -64, 64, -64, 64, -64, -64, -64, -64, -64, 64, -64, 64, 64, -64, 64, -64, -64, 64, -64, -64, 64, 64, -64, 64, -64, -64, -64, -64, -64, -64, -64, 64, 64, -64, -64, -64, 64, -64, -64, -64, 64, 64, 64, -64, -64, -64, -64, -64, -64, 64, -64, -64, 64, -64, -64, -64, -64, -64, -64, 64, -64, 64, -64, -64, -64, -64, -64, -64, 64, 64, -64, -64, -64, -64, -64, -64, -64, -64, 64, 64, -64, 64, -64, -64, -64, 64, -64, -64, 64, 64, 64, 64, -64, 64, -64, -64, 64, 64, 64, -64, -64, -64, -64, 64, -64, -64, -64, 64, 64, 64, 64, 64, 64, -64, 64, 64, 64, -64, 64, -64, -64, 64, -64, -64, -64, -64, 64, 64, 64, -64, -64, 64, -64, -64, -64, 64, -64, 64, 64, -64, -64, 64, 64, 64, 64, -64, 64, 64, -64, 64, 64, 64, -64, 64, 64, 64, 64, 64, 64, 64, 64, 64, -64, -64, -64, -64, -64, -64, -64, -64, -64, 64, -64, 64, 64, 64, 64, 64, -64, -64, 64, 64, 64, 64, 64, -64, 64, 64, -64, -64, -64, -64, -64, -64, -64, -64, -64, 64, 64, 64, 64, 64, 64, 64, 64, 64, -64, 64, 64, 64, 64, -64, -64, -64, 64, -64, -64, -64, -64, -64, -64, -64, -64, -64, -64, -64, -64, 64, 64, 64, 64, 64, 64, 64, -64, -64, 64, -64, 64, 64, 64, -64, -64, -64, -64, -64, -64, -64, -64, -64, -64, -64, -64, 64, -64, 64, 64, 64, 64, -64, 64, -64, -64, 64, -64, 64, 64, 64, 64, -64, -64, -64, -64, -64, -64, -64, -64, -64, -64, -64, 64, 64, -64, -64, 64, 64, 64, -64, -64, -64, -64, -64, -64, 64, 64, 64, 64, 64, -64, -64, -64, -64, -64, -64, -64, -64, -64, -64, 64, 64, 64, 64, -64, 64, 64, -64, -64, 64, 64, -64, 64, 64, 64, 64, 64, 64, 64, -64, -64, -64, -64, -64, -64, -64, -64, 64, 64, 64, 64, -64, -64, -64, -64, -64, 64, -64, -64, 64, -64, -64, 64, 64, 64, 64, 64, 64, -64, 64, -64, -64, 64, -64, -64, -64, -64, -64, -64, -64, -64, -64, 64, 64, 64, 64, -64, 64, 64, 64, -64, 64, -64, 64, -64, -64, -64, 64, -64, -64, -64, -64, -64, -64, -64, -64, -64, -64, -64, 64, 64, -64, 64, -64, -64, -64, 64, -64, -64, 64, 64, -64, -64, -64, -64, -64, -64, -64, -64, 64, -64, -64, 64, -64, -64, -64, -64, -64, -64, -64, 64, -64, 64, -64, -64, -64, 64, -64, 64, -64, 64, -64, -64, 64, 64, -64, -64, 64, 64, -64, -64, -64, -64, -64, -64, 64, -64, -64, 64, -64, -64, 64, 64, 64, 64, 64, -64, 64, 64, 64, 64, 64, -64, -64, -64, -64, -64, -64, -64, -64, 64, -64, 64, -64, 64, -64, 64, 64, 64, 64, -64, 64, -64, 64, -64, -64, -64, 64, 64, 64, -64, 64, -64, 64, 64, -64, -64, 64, -64, -64, 64, -64, -64, 64, -64, 64, -64, -64, 64, 64, -64, -64, 64, -64, -64, -64, 64, -64, -64, -64, 64, 64, 64, 64, 64, -64, 64, -64, -64, -64, 64, -64, -64, -64, -64, -64, 64, -64, 64, -64, 64, 64, -64, -64, -64, -64, 64, 64, -64, -64, -64, 64, 64, -64, 64, 64, -64, 64, 64, 64, -64, 64, 64, 64, 64, -64, 64, 64, 64, 64, -64, 64, -64, 64, 64, 64, -64, -64, -64, 64, 64, 64, -64, -64, 64, 64, 64, 64, 64, 64, -64, 64, 64, 64, -64, -64, 64, 64, -64, 64, 64, 64, 64, 64, -64, 64, 64, 64, 64, -64, 64, -64, -64, -64, -64, -64, 64, -64, 64, -64, -64, 64, 64, 64, -64, 64, 64, 64, 64, 64, 64, 64, 64, 64, 64, 64, 64, -64, -64, -64, -64, -64, -64, -64, -64, -64, -64, 64, 64, 64, 64, 64, 64, -64, 64, -64, 64, 64, 64, 64, 64, 64, 64, 64, 64, -64, -64, -64, -64, -64, -64, -64, -64, 64, 64, -64, -64, 64, 64, -64, -64, -64, -64, -64, -64, -64, 64, 64, 64, 64, 64, 64, 64, -64, -64, -64, -64, -64, -64, -64, -64, 64, 64, -64, -64, 64, 64, 64, 64, -64, -64, -64, -64, -64, -64, -64, 64, 64, 64, 64, -64, -64, -64, 64, -64, 64, 64, -64, 64, 64, 64, -64, -64, 64, -64, 64, 64, 64, -64, 64, -64, -64, -64, 64, 64, 64, 64, 64, -64, -64, 64, 64, 64, 64, -64, 64, -64, 64, -64, -64, -64, 64, 64, 64, 64, 64, -64, 64, -64, -64, 64, 64, 64, 64, 64, 64, -64, 64, 64, 64, 64, 64, -64, -64, 64, 64, 64, 64, 64, -64, 64, 64, 64, 64, 64, 64, -64, 64, 64, -64, 64, 64, 64, -64, -64, 64, 64, 64, 64, 64, 64, 64, 64, 64, 64, 64, 64, 64, -64, 64, 64, 64, 64, 64, 64, 64, 64, -64, 64, 64, -64, -64, 64, 64, 64, 64, 64, -64, 64, 64, 64, 64, 64, -64, 64, -64, -64, -64, 64, 64, 64, 64, 64, 64, 64, -64, -64, 64, -64, -64, -64, 64, 64, 64, 64, 64, 64, 64, 64, 64, -64, 64, -64, 64, -64, -64, 64, 64, 64, 64, 64, -64, -64, -64, -64, 64, -64, -64, 64, 64, -64, -64, 64, 64, 64, 64, -64, 64, -64, -64, 64, -64, 64, 64, 64, 64, 64, 64, 64, -64, -64, -64, -64, 64, -64, -64, 64, -64, -64, -64, 64, 64, 64, 64, 64, 64, -64, 64, 64, -64, -64, 64, -64, 64, 64, 64, -64, -64, -64, -64, 64, -64, 64, 64, 64, 64, -64, 64, -64, 64, -64, -64, 64, 64, 64, 64, -64, -64, -64, 64, 64, 64, 64, 64, -64, -64, -64, 64, 64, -64, -64, -64, -64, -64, -64, -64, 64, 64, 64, 64, 64, 64, -64, -64, 64, 64, 64, 64, 64, 64, 64, 64, -64, 64, 64, 64, -64, 64, -64, -64, -64, 64, 64, 64, 64, 64, 64, 64, 64, 64, 64, 64, -64, -64, 64, 64, -64, 64, 64, 64, -64, 64, 64, 64, 64, -64, 64, -64, 64, -64, 64, 64, 64, 64, 64, 64, -64, 64, 64, 64, -64, 64, -64, 64, 64, 64, -64, 64, -64, 64, 64, -64, -64, 64, -64, 64, 64, 64, 64, 64, 64, 64, 64, 64, 64, 64, -64, 64, -64, -64, -64, 64, 64, 64, -64, 64, 64, 64, 64, -64, 64, -64, -64, 64, 64, 64, 64, 64, 64, 64, 64, 64, 64, 64, -64, -64, 64, 64, 64, -64, 64, 64, 64, 64, 64, 64, 64, -64, -64, 64, -64, -64, -64, 64, -64, 64, 64, 64, 64, 64, -64, -64, 64, 64, 64, 64, 64, -64, 64, 64, 64, 64, 64, 64, 64, -64, -64, 64, -64, 64, 64, 64, 64, 64, 64, 64, 64, 64, 64, 64, -64, 64, 64, 64, 64, 64, 64, 64, 64, 64, 64, 64, 64, -64, -64, 64, -64, -64, -64, 64, 64, 64, -64, 64, 64, 64, -64, -64, -64, -64, 64, -64, 64, 64, 64, 64, 64, 64, 64, 64, 64, -64, -64, -64, -64, -64, -64, -64, -64, 64, -64, -64, -64, -64, -64, 64, 64, -64, 64, -64, 64, 64, -64, 64, 64, 64, 64, 64, -64, -64, -64, -64, 64, -64, 64, 64, 64, 64, -64, -64, 64, 64, 64, -64, -64, -64, -64, -64, -64, 64, -64, 64, 64, 64, 64, 64, -64, -64, -64, 64, 64, 64, 64, 64, 64, 64, 64, -64, 64, -64, -64, 64, 64, 64, -64, -64, -64, -64, -64, 64, -64, 64, 64, 64, -64, 64, 64, 64, 64, 64, 64, 64, -64, 64, 64, 64, -64, 64, -64, -64, -64, 64, -64, -64, -64, -64, 64, -64, -64, 64, 64, 64, -64, -64, -64, 64, 64, -64, 64, 64, -64, -64, -64, -64, -64, -64, -64, 64, 64, -64, -64, -64, -64, 64, 64, -64, -64, -64, 64, -64, 64, -64, 64, 64, -64, -64, 64, -64, -64, 64, 64, -64, 64, 64, 64, -64, 64, 64, 64, -64, -64, -64, 64, -64, -64, -64, 64, -64, -64, -64, 64, -64, -64, 64, 64, 64, 64, 64, 64, -64, -64, 64, -64, -64, -64, 64, -64, -64, -64, 64, 64, -64, 64, -64, -64, -64, 64, 64, -64, 64, 64, -64, 64, -64, 64, 64, 64, 64, 64, -64, 64, 64, -64, -64, 64, 64, 64, -64, 64, 64, 64, -64, -64, 64, 64, 64, 64, 64, -64, 64, 64, 64, 64, 64, 64, 64, 64, -64, 64, -64, 64, -64, 64, -64, 64, 64, -64, -64, 64, 64, -64, -64, 64, -64, 64, 64, 64, 64, 64, 64, 64, 64, 64, 64, 64, 64, -64, 64, 64, 64, 64, 64, 64, 64, 64, -64, 64, 64, 64, 64, 64, -64, 64, 64, 64, 64, -64, 64, 64, 64, 64, 64, 64, 64, 64, 64, 64, 64, 64, 64, 64, 64, 64, 64, 64, 64, 64, 64, 64, 64, -64, -64, -64, -64, 64, -64, -64, 64, 64, 64, 64, 64, 64, -64, 64, -64, 64, -64, 64, 64, 64, 64, 64, 64, 64, 64, 64, -64, -64, -64, -64, -64, -64, -64, 64, 64, 64, 64, 64, 64, -64, 64, 64, -64, -64, 64, 64, 64, 64, 64, 64, 64, 64, -64, -64, -64, -64, -64, -64, -64, 64, -64, 64, 64, 64, 64, 64, 64, -64, 64, -64, 64, 64, 64, -64, 64, 64, 64, 64, 64, -64, -64, -64, 64, 64, -64, 64, 64, 64, 64, 64, 64, 64, 64, 64, -64, 64, -64, 64, -64, 64, 64, -64, -64, 64, 64, 64, -64, -64, 64, 64, -64, 64, 64, 64, 64, 64, 64, 64, 64, 64, 64, 64, 64, 64, 64, -64, -64, -64, 64, -64, 64, 64, 64, 64, -64, -64, -64, -64, 64, 64, -64, -64, 64, -64, -64, 64, -64, 64, 64, 64, 64, 64, 64, -64, 64, -64, -64, -64, -64, 64, 64, -64, -64, 64, 64, 64, 64, -64, -64, -64, -64, -64, 64, 64, 64, -64, 64, -64, 64, 64, 64, -64, -64, 64, -64, 64, 64, 64, 64, -64, -64, -64, 64, 64, -64, 64, -64, -64, -64, -64, 64, 64, 64, -64, 64, 64, 64, 64, 64, 64, -64, 64, 64, -64, 64, 64, 64, -64, -64, -64, 64, -64, -64, -64, 64, -64, -64, -64, 64, 64, 64, 64, 64, 64, 64, 64, 64, 64, 64, 64, 64, 64, -64, 64, 64, 64, -64, 64, -64, -64, -64, 64, 64, 64, 64, 64, 64, 64, -64, 64, 64, 64, 64, -64, -64, 64, -64, 64, 64, -64, -64, 64, 64, 64, 64, -64, -64, -64, -64, 64, 64, 64, 64, 64, 64, 64, 64, 64, 64, 64, 64, 64, -64, 64, -64, -64, -64, 64, -64, 64, 64, 64, 64, 64, 64, -64, -64, -64, 64, 64, -64, -64, 64, 64, 64, 64, 64, 64, -64, 64, 64, 64, -64, -64, 64, -64, -64, 64, 64, 64, 64, 64, 64, 64, 64, 64, 64, -64, -64, 64, 64, 64, 64, 64, 64, 64, 64, 64, 64, 64, 64, -64, -64, 64, 64, 64, 64, 64, 64, 64, 64, 64, 64, 64, -64, -64, 64, 64, 64, 64, 64, 64, 64, 64, -64, 64, -64, -64, -64, -64, -64, -64, 64, 64, 64, 64, 64, 64, 64, 64, 64, -64, 64, -64, 64, 64, 64, 64, 64, 64, 64, 64, -64, -64, -64, -64, 64, 64, -64, -64, 64, 64, 64, 64, 64, 64, 64, 64, 64, -64, 64, 64, 64, 64, 64, 64, 64, -64, 64, 64, 64, -64, 64, -64, -64, -64, 64, -64, -64, -64, 64, 64, 64, -64, -64, 64, 64, 64, 64, -64, 64, 64, 64, 64, 64, 64, 64, 64, 64, 64, -64, 64, 64, -64, -64, -64, -64, -64, -64, -64, -64, -64, -64, -64, 64, -64, -64, 64, 64, 64, 64, 64, -64, -64, 64, -64, -64, 64, 64, -64, -64, 64, 64, -64, -64, -64, -64, -64, -64, -64, -64, -64, -64, 64, 64, 64, 64, 64, 64, -64, 64, -64, -64, 64, -64, 64, 64, 64, -64, 64, 64, 64, -64, -64, -64, 64, 64, 64, -64, -64, -64, -64, -64, -64, -64, -64, -64, -64, -64, -64, -64, -64, -64, -64, -64, 64, 64, 64, 64, 64, -64, 64, 64, 64, 64, 64, 64, 64, -64, -64, -64, -64, -64, -64, 64, 64, -64, 64, -64, -64, 64, 64, 64, -64, 64, 64, -64, 64, -64, 64, 64, -64, -64, -64, -64, -64, 64, 64, -64, -64, 64, 64, 64, -64, -64, 64, -64, -64, 64, 64, -64, -64, -64, -64, 64, 64, -64, 64, 64, 64, 64, 64, 64, 64, -64, -64, 64, 64, -64, 64, -64, 64, -64, -64, -64, -64, 64, 64, 64, 64, -64, -64, -64, 64, 64, -64, -64, -64, -64, 64, 64, -64, 64, 64, 64, 64, -64, 64, -64, 64, -64, 64, 64, 64, 64, 64, -64, -64, -64, 64, 64, -64, 64, 64, -64, 64, 64, -64, 64, -64, 64, -64, -64, 64, 64, 64, 64, 64, -64, 64, -64, -64, -64, 64, -64, 64, 64, -64, 64, -64, -64, 64, 64, -64, 64, -64, 64, -64, 64, -64, 64, 64, -64, 64, -64, -64, -64, 64, 64, 64, -64, -64, -64, -64, -64, -64, -64, 64, 64, -64, -64, 64, 64, -64, -64, -64, 64, -64, -64, -64, 64, -64, 64, -64, 64, -64, 64, 64, 64, -64, -64, 64, 64, -64, -64, 64, 64, 64, 64, 64, -64, 64, 64, 64, 64, -64, -64, -64, -64, -64, -64, -64, 64, -64, 64, 64, -64, -64, -64, -64, -64, -64, -64, 64, -64, 64, 64, -64, 64, -64, 64, -64, 64, 64, 64, 64, -64, -64, -64, -64, -64, 64, 64, 64, -64, 64, -64, -64, -64, 64, 64, 64, 64, 64, -64, -64, -64, -64, 64, -64, -64, -64, -64, -64, -64, -64, -64, -64, -64, 64, -64, -64, -64, -64, 64, 64, -64, 64, -64, -64, -64, -64, -64, -64, -64, 64, -64, -64, 64, -64, -64, -64, -64, -64, -64, -64, -64, -64, -64, -64, 64, 64, -64, -64, -64, -64, -64, 64, -64, -64, -64, -64, 64, 64, -64, 64, -64, -64, -64, -64, -64, 64, 64, -64, -64, -64, -64, -64, -64, -64, -64, 64, 64, 64, -64, 64, -64, -64, -64, -64, -64, -64, -64, 64, 64, -64, -64, -64, 64, -64, 64, -64, -64, -64, -64, -64, -64, -64, -64, 64, 64, 64, -64, 64, -64, -64, -64, 64, 64, -64, -64, -64, -64, -64, -64, 64, 64, 64, 64, -64, -64, -64, -64, -64, -64, 64, 64, 64, 64, 64, -64, -64, -64, -64, -64, -64, 64, -64, -64, 64, -64, -64, -64, 64, 64, 64, 64, 64, -64, 64, -64, -64, -64, 64, -64, 64, -64, 64, -64, 64, -64, -64, -64, -64, -64, -64, -64, -64, -64, -64, -64, 64, 64, 64, -64, -64, -64, -64, -64, -64, -64, 64, 64, 64, -64, 64, -64, -64, 64, -64, -64, -64, -64, -64, 64, -64, -64, -64, 64, -64, -64, 64, 64, -64, -64, -64, 64, -64, 64, 64, 64, -64, 64, 64, 64, -64, 64, 64, -64, -64, -64, -64, -64, -64, -64, -64, -64, -64, 64, -64, -64, -64, -64, -64, -64, 64, 64, -64, -64, 64, 64, -64, -64, 64, -64, -64, -64, -64, 64, -64, -64, 64, -64, 64, 64, -64, -64, -64, -64, -64, 64, -64, -64, -64, 64, -64, 64, -64, -64, 64, 64, -64, 64, -64, -64, -64, -64, -64, -64, -64, 64, 64, -64, 64, -64, 64, -64, -64, -64, -64, 64, -64, 64, 64, 64, 64, -64, -64, -64, 64, -64, -64, 64, 64, -64, -64, 64, -64, 64, 64, -64, -64, -64, 64, -64, 64, -64, -64, -64, -64, 64, 64, 64, -64, -64, -64, -64, 64, -64, -64, -64, -64, -64, -64, -64, 64, 64, 64, -64, 64, -64, -64, 64, -64, -64, 64, 64, -64, -64, 64, 64, -64, 64, 64, 64, -64, -64, 64, -64, -64, -64, -64, -64, 64, 64, 64, -64, -64, -64, -64, 64, -64, -64, -64, -64, -64, 64, -64, -64, -64, 64, -64, -64, -64, -64, -64, -64, -64, 64, 64, -64, 64, 64, -64, -64, -64, -64, -64, 64, -64, -64, -64, -64, -64, -64, 64, 64, 64, 64, 64, -64, 64, 64, -64, -64, 64, 64, 64, 64, 64, 64, -64, -64, -64, -64, -64, -64, -64, -64, -64, -64, -64, -64, -64, -64, -64, -64, 64, 64, -64, 64, -64, 64, -64, 64, -64, -64, -64, -64, -64, -64, -64, -64, -64, 64, 64, -64, -64, -64, -64, 64, 64, 64, -64, 64, 64, 64, -64, -64, -64, 64, 64, 64, 64, 64, -64, -64, 64, 64, 64, 64, 64, 64, 64, 64, 64, 64, -64, -64, 64, -64, -64, 64, -64, -64, 64, 64, -64, -64, -64, -64, -64, 64, -64, -64, -64, 64, 64, 64, 64, -64, -64, 64, 64, -64, 64, -64, -64, -64, -64, -64, -64, -64, 64, 64, 64, 64, 64, 64, -64, 64, -64, 64, 64, -64, 64, 64, 64, 64, 64, 64, 64, -64, 64, -64, -64, 64, -64, 64, 64, 64, -64, 64, 64, -64, 64, 64, -64, 64, -64, -64, -64, 64, -64, -64, 64, 64, -64, -64, 64, -64, -64, -64, 64, -64, 64, 64, -64, 64, -64, 64, -64, 64, -64, 64, 64, 64, 64, 64, -64, 64, -64, -64, 64, 64, 64, 64, -64, -64, 64, -64, 64, 64, 64, -64, -64, 64, 64, 64, 64, 64, 64, 64, -64, 64, -64, 64, -64, -64, -64, -64, -64, 64, -64, 64, 64, 64, -64, -64, -64, -64, -64, -64, 64, 64, 64, 64, -64, 64, -64, 64, -64, 64, -64, -64, -64, -64, -64, 64, 64, 64, 64, 64, -64, 64, 64, -64, -64, 64, 64, -64, 64, -64, 64, 64, 64, 64, 64, -64, -64, -64, -64, -64, -64, -64, -64, -64, 64, -64, -64, 64, 64, -64, -64, 64, 64, -64, -64, 64, -64, 64, 64, 64, 64, -64, -64, -64, -64, -64, -64, 64, -64, -64, -64, -64, -64, 64, 64, 64, 64, 64, 64, 64, 64, 64, -64, -64, 64, 64, 64, -64, 64, -64, -64, 64, 64, 64, -64, -64, -64, -64, -64, -64, -64, 64, 64, 64, 64, 64, 64, 64, 64, -64, 64, -64, 64, 64, -64, -64, -64, -64, -64, -64, -64, -64, -64, -64, -64, -64, -64, -64, -64, 64, 64, 64, 64, 64, 64, 64, 64, 64, -64, -64, 64, -64, -64, -64, -64, -64, -64, -64, -64, -64, -64, -64, 64, -64, -64, 64, -64, -64, 64, 64, 64, 64, 64, 64, 64, -64, -64, 64, 64, -64, -64, -64, -64, -64, -64, -64, -64, -64, -64, 64, 64, 64, 64, 64, -64, -64, 64, 64, 64, -64, 64, 64, 64, 64, -64, 64, -64, 64, -64, -64, -64, -64, -64, -64, -64, 64, 64, 64, 64, 64, 64, -64, -64, -64, -64, -64, 64, -64, -64, 64, 64, 64, -64, -64, 64, 64, -64, -64, -64, -64, -64, -64, 64, 64, 64, 64, 64, 64, -64, -64, -64, -64, -64, -64, -64, -64, -64, 64, 64, -64, 64, -64, 64, 64, -64, -64, -64, -64, -64, -64, 64, 64, 64, 64, -64, -64, -64, -64, 64, -64, -64, -64, -64, 64, -64, 64, 64, 64, -64, 64, 64, -64, 64, -64, -64, -64, -64, -64, -64, -64, -64, 64, 64, -64, -64, -64, -64, 64, -64, 64, 64, -64, -64, 64, 64, 64, 64, 64, -64, -64, 64, -64, -64, -64, -64, -64, -64, -64, 64, -64, 64, -64, 64, -64, -64, -64, -64, -64, -64, -64, -64, 64, -64, 64, 64, -64, 64, -64, -64, -64, -64, -64, -64, -64, -64, -64, 64, 64, -64, 64, 64, 64, -64, -64, -64, -64, -64, -64, -64, 64, -64, -64, -64, 64, 64, -64, 64, -64, -64, -64, 64, 64, 64, 64, 64, 64, 64, 64, -64, -64, -64, -64, -64, -64, -64, -64, -64, 64, 64, 64, -64, 64, 64, -64, -64, -64, -64, 64, -64, -64, -64, -64, 64, 64, 64, 64, 64, -64, -64, -64, -64, -64, -64, -64, -64, -64, 64, -64, -64, -64, 64, 64, -64, 64, 64, 64, 64, 64, -64, 64, 64, 64, 64, 64, 64, -64, -64, -64, -64, -64, -64, -64, -64, 64, -64, 64, 64, -64, -64, 64, -64, 64, 64, 64, 64, -64, 64, 64, 64, 64, -64, 64, -64, -64, 64, -64, -64, -64, -64, 64, -64, 64, -64, -64, 64, -64, -64, 64, -64, -64, 64, 64, 64, -64, -64, -64, 64, 64, 64, 64, 64, -64, 64, -64, 64, 64, 64, 64, -64, 64, -64, 64, -64, 64, -64, -64, -64, 64, 64, 64, -64, -64, -64, -64, -64, -64, -64, -64, -64, 64, 64, -64, 64, 64, -64, 64, 64, 64, -64, 64, 64, 64, 64, 64, 64, 64, 64, 64, 64, -64, -64, -64, -64, -64, 64, 64, -64, -64, 64, 64, -64, -64, -64, 64, 64, 64, -64, 64, -64, -64, 64, 64, 64, 64, 64, 64, 64, 64, -64, -64, -64, 64, -64, -64, -64, -64, -64, -64, -64, -64, 64, 64, 64, 64, 64, -64, -64, 64, -64, -64, -64, -64, 64, 64, 64, 64, 64, -64, -64, 64, 64, -64, -64, -64, -64, -64, -64, -64, 64, 64, 64, -64, 64, 64, -64, -64, 64, -64, -64, -64, -64, 64, -64, -64, 64, -64, -64, -64, -64, 64, -64, -64, -64, 64, 64, -64, -64, 64, -64, -64, -64, 64, -64, -64, 64, -64, 64, 64, -64, 64, -64, -64, -64, -64, -64, -64, 64, 64, -64, -64, 64, -64, -64, -64, 64, -64, 64, -64, -64, -64, 64, -64, 64, -64, -64, -64, -64, 64, 64, -64, -64, -64, -64, -64, -64, -64, -64, -64, -64, -64, -64, 64, -64, 64, -64, -64, 64, 64, 64, -64, -64, -64, -64, 64, 64, 64, 64, -64, 64, 64, -64, -64, -64, -64, 64, -64, -64, 64, -64, 64, 64, -64, 64, 64, -64, 64, 64, 64, -64, -64, -64, 64, 64, -64, 64, -64, 64, -64, -64, -64, 64, 64, 64, -64, 64, -64, -64, 64, -64, 64, -64, 64, -64, -64, -64, 64, 64, -64, 64, -64, -64, -64, 64, 64, 64, 64, 64, 64, 64, -64, -64, 64, -64, -64, 64, 64, -64, 64, 64, -64, 64, 64, 64, 64, 64, -64, -64, 64, -64, 64, -64, 64, 64, 64, 64, 64, 64, 64, 64, -64, -64, 64, 64, 64, 64, 64, 64, 64, 64, -64, 64, 64, -64, 64, -64, -64, -64, -64, -64, -64, 64, 64, 64, -64, 64, 64, 64, 64, -64, 64, 64, 64, -64, -64, -64, 64, -64, 64, -64, -64, 64, -64, -64, 64, 64, -64, 64, 64, 64, 64, 64, -64, -64, -64, -64, -64, -64, -64, -64, -64, -64, 64, -64, 64, 64, -64, 64, 64, 64, -64, 64, 64, -64, 64, 64, -64, -64, -64, 64, -64, -64, -64, 64, -64, -64, 64, -64, -64, 64, -64, -64, -64, -64, -64, 64, 64, 64, 64, -64, 64, 64, 64, -64, 64, -64, -64, -64, 64, 64, 64, 64, -64, -64, -64, -64, -64, -64, -64, -64, -64, 64, -64, -64, -64, 64, -64, 64, 64, 64, 64, -64, 64, -64, -64, -64, 64, 64, 64, 64, 64, 64, -64, 64, 64, -64, -64, 64, -64, -64, 64, 64, 64, 64, 64, -64, -64, -64, 64, -64, -64, -64, -64, 64, 64, -64, 64, 64, 64, -64, -64, 64, -64, -64, 64, -64, -64, -64, -64, 64, 64, 64, 64, 64, -64, -64, -64, -64, 64, -64, 64, 64, 64, 64, -64, 64, -64, -64, -64, 64, -64, -64, -64, -64, -64, -64, -64, -64, -64, 64, -64, -64, -64, 64, 64, -64, -64, -64, -64, -64, 64, 64, 64, 64, -64, -64, -64, -64, -64, -64, -64, -64, -64, -64, -64, 64, 64, -64, 64, -64, -64, 64, -64, 64, -64, -64, -64, -64, 64, -64, 64, 64, 64, 64, -64, 64, 64, 64, -64, 64, 64, -64, -64, -64, 64, 64, -64, -64, 64, -64, 64, 64, -64, -64, -64, -64, -64, -64, 64, 64, -64, 64, 64, 64, 64, -64, 64, -64, 64, -64, 64, -64, -64, -64, -64, 64, 64, -64, 64, -64, -64, -64, -64, -64, -64, -64, 64, 64, -64, -64, -64, -64, 64, -64, -64, 64, -64, 64, 64, -64, -64, 64, -64, 64, -64, -64, -64, -64, 64, -64, -64, -64, -64, 64, -64, 64, -64, -64, -64, -64, 64, 64, 64, -64, 64, 64, -64, -64, -64, -64, 64, -64, -64, -64, -64, 64, -64, -64, 64, -64, -64, -64, -64, 64, -64, -64, 64, -64, -64, -64, -64, -64, 64, -64, -64, 64, -64, 64, -64, 64, 64, -64, -64, 64, -64, -64, -64, 64, 64, -64, 64, -64, -64, 64, -64, -64, -64, 64, 64, 64, -64, 64, 64, 64, -64, 64, 64, 64, -64, -64, 64, 64, 64, -64, 64, -64, -64, -64, -64, -64, -64, 64, -64, 64, -64, -64, -64, 64, 64, 64, 64, 64, 64, 64, 64, 64, 64, -64, 64, -64, -64, -64, -64, -64, -64, -64, 64, -64, -64, -64, -64, -64, -64, -64, 64, 64, -64, 64, 64, 64, 64, -64, 64, 64, 64, 64, -64, -64, -64, -64, -64, -64, -64, -64, 64, -64, -64, 64, -64, 64, -64, 64, 64, -64, 64, 64, -64, 64, 64, 64, 64, 64, 64, -64, -64, -64, -64, -64, -64, -64, 64, 64, 64, -64, -64, -64, -64, -64, 64, 64, 64, -64, -64, -64, 64, -64, 64, -64, 64, -64, -64, 64, 64, -64, -64, -64, 64, 64, -64, -64, -64, -64, -64, 64, 64, 64, 64, -64, -64, 64, 64, 64, 64, -64, -64, -64, 64, -64, 64, 64, 64, 64, 64, -64, 64, 64, -64, 64, 64, -64, 64, 64, -64, 64, -64, -64, -64, -64, 64, 64, -64, 64, -64, -64, 64, 64, 64, 64, -64, -64, -64, -64, 64, 64, -64, 64, 64, -64, -64, -64, -64, -64, 64, -64, 64, 64, 64, -64, 64, 64, -64, -64, -64, 64, 64, -64, -64, -64, -64, -64, 64, -64, -64, 64, -64, -64, -64, 64, 64, 64, 64, 64, -64, 64, 64, -64, 64, -64, 64, -64, -64, -64, -64, 64, 64, 64, 64, -64, -64, -64, -64, 64, 64, 64, -64, 64, -64, 64, -64, 64, -64, 64, 64, 64, 64, -64, -64, 64, 64, -64, -64, -64, -64, -64, -64, 64, 64, -64, 64, 64, 64, 64, 64, -64, 64, -64, -64, -64, 64, 64, -64, 64, -64, 64, -64, 64, 64, -64, -64, 64, 64, -64, 64, -64, -64, 64, 64, -64, 64, 64, -64, -64, 64, -64, -64, 64, 64, 64, -64, -64, -64, 64, -64, -64, 64, -64, 64, -64, -64, 64, 64, -64, -64, -64, 64, 64, 64, -64, 64, -64, 64, -64, -64, 64, 64, -64, 64, 64, 64, -64, 64, 64, 64, 64, 64, -64, 64, 64, -64, 64, 64, 64, 64, 64, 64, -64, -64, -64, -64, -64, -64, 64, 64, 64, 64, -64, -64, -64, 64, -64, -64, -64, -64, -64, 64, 64, 64, 64, 64, -64, 64, 64, -64, 64, 64, -64, 64, -64, 64, -64, -64, 64, 64, -64, 64, -64, 64, -64, -64, -64, -64, 64, 64, 64, 64, 64, 64, -64, -64, -64, 64, 64, 64, -64, -64, -64, -64, -64, 64, -64, 64, -64, -64, 64, -64, 64, 64, 64, -64, -64, -64, 64, -64, -64, 64, 64, 64, 64, -64, -64, 64, 64, 64, -64, -64, -64, -64, -64, -64, 64, 64, -64, 64, 64, 64, -64, 64, 64, 64, 64, 64, -64, -64, -64, -64, -64, 64, -64, -64, -64, 64, 64, -64, -64, -64, -64, -64, 64, -64, 64, 64, 64, 64, -64, -64, 64, -64, 64, -64, -64, -64, -64, -64, 64, -64, -64, -64, -64, -64, 64, -64, -64, 64, -64, 64, -64, -64, -64, 64, 64, 64, 64, -64, 64, -64, -64, -64, -64, -64, -64, 64, 64, -64, -64, -64, 64, -64, -64, 64, 64, -64, -64, 64, 64, 64, -64, 64, 64, -64, 64, 64, -64, 64, -64, -64, -64, 64, 64, -64, -64, 64, -64, -64, -64, -64, 64, -64, -64, 64, 64, 64, 64, -64, 64, -64, 64, 64, -64, 64, 64, 64, -64, -64, -64, -64, -64, -64, -64, -64, 64, 64, 64, 64, -64, -64, -64, -64, 64, 64, 64, -64, -64, 64, 64, -64, -64, 64, -64, 64, -64, -64, -64, -64, -64, -64, -64, -64, -64, -64, -64, -64, 64, 64, -64, 64, -64, 64, 64, -64, 64, -64, 64, -64, 64, -64, 64, -64, -64, -64, -64, 64, -64, -64, 64, -64, 64, -64, 64, -64, -64, 64, 64, -64, -64, -64, 64, 64, 64, 64, 64, -64, -64, 64, -64, 64, -64, 64, -64, -64, -64, -64, -64, -64, -64, -64, -64, -64, -64, -64, 64, -64, -64, -64, -64, 64, 64, 64, -64, -64, 64, -64, -64, -64, 64, -64, 64, -64, 64, -64, -64, -64, -64, 64, -64, 64, -64, -64, -64, -64, -64, 64, -64, 64, 64, -64, -64, -64, -64, 64, -64, 64, 64, -64, 64, 64, -64, -64, -64, -64, -64, -64, 64, -64, 64, -64, -64, -64, 64, 64, -64, -64, 64, -64, 64, -64, -64, -64, 64, 64, 64, -64, 64, -64, 64, -64, -64, -64, 64, 64, 64, 64, -64, -64, 64, 64, 64, 64, -64, -64, -64, 64, -64, -64, 64, -64, 64, -64, -64, -64, -64, -64, 64, -64, -64, -64, -64, -64, -64, 64, 64, 64, -64, 64, 64, 64, -64, 64, 64, 64, -64, 64, 64, -64, -64, 64, 64, 64, 64, 64, -64, -64, -64, -64, 64, 64, 64, -64, 64, -64, -64, 64, -64, 64, -64, 64, -64, -64, -64, 64, -64, -64, -64, -64, 64, -64, -64, -64, 64, 64, -64, -64, -64, -64, 64, 64, -64, -64, 64, 64, 64, -64, 64, 64, -64, -64, -64, 64, 64, -64, -64, -64, -64, -64, -64, 64, -64, 64, 64, 64, -64, 64, 64, 64, 64, -64, 64, 64, 64, -64, -64, -64, -64, -64, 64, 64, 64, -64, -64, 64, 64, -64, 64, -64, -64, -64, -64, 64, -64, -64, -64, 64, 64, -64, -64, -64, -64, -64, -64, 64, 64, -64, 64, 64, 64, -64, -64, -64, 64, -64, 64, 64, -64, -64, 64, 64, -64, -64, -64, -64, -64, 64, -64, -64, 64, 64, 64, 64, 64, -64, 64, -64, -64, 64, -64, -64, 64, 64, 64, 64, -64, 64, -64, -64, -64, -64, -64, -64, -64, -64, -64, 64, 64, 64, -64, 64, 64, -64, -64, -64, -64, 64, -64, -64, 64, -64, -64, -64, 64, -64, 64, 64, -64, -64, 64, -64, 64, 64, -64, -64, 64, 64, 64, -64, 64, 64, -64, -64, -64, 64, -64, -64, 64, -64, -64, -64, -64, -64, -64, 64, -64, -64, -64, 64, 64, -64, -64, 64, 64, -64, 64, 64, 64, -64, -64, -64, -64, -64, 64, -64, -64, 64, -64, -64, -64, -64, 64, -64, 64, -64, -64, -64, 64, 64, 64, -64, -64, -64, 64, -64, -64, -64, -64, 64, 64, -64, 64, -64, -64, -64, 64, 64, -64, -64, -64, -64, 64, -64, -64, -64, -64, -64, -64, 64, -64, 64, -64, -64, -64, 64, -64, 64, -64, -64, -64, -64, 64, -64, -64, 64, 64, 64, -64, -64, -64, -64, -64, -64, 64, 64, 64, -64, -64, -64, 64, -64, -64, 64, 64, 64, 64, 64, -64, 64, -64, 64, -64, -64, -64, -64, 64, -64, 64, -64, 64, 64, -64, -64, -64, 64, -64, -64, -64, 64, 64, 64, -64, 64, 64, 64, 64, 64, -64, -64, 64, -64, 64, -64, -64, -64, -64, -64, -64, 64, 64, -64, -64, 64, -64, -64, -64, 64, 64, 64, -64, 64, -64, -64, -64, 64, -64, -64, 64, -64, -64, -64, -64, 64, -64, -64, 64, 64, 64, 64, 64, 64, -64, -64, -64, -64, -64, -64, -64, 64, 64, -64, 64, 64, 64, 64, -64, -64, -64, -64, -64, -64, -64, -64, 64, 64, 64, 64, -64, -64, -64, -64, -64, -64, 64, -64, -64, -64, -64, 64, 64, 64, -64, -64, -64, -64, -64, -64, -64, -64, -64, 64, 64, 64, 64, 64, -64, -64, -64, -64, -64, 64, -64, 64, 64, 64, 64, -64, 64, -64, -64, -64, 64, -64, -64, -64, -64, -64, 64, 64, 64, 64, 64, 64, 64, 64, 64, 64, 64, -64, 64, 64, 64, 64, -64, 64, 64, -64, -64, -64, -64, -64, -64, -64, -64, 64, 64, 64, 64, -64, 64, 64, 64, 64, 64, -64, -64, -64, 64, -64, -64, 64, -64, -64, -64, -64, 64, -64, -64, -64, -64, -64, 64, 64, 64, 64, 64, 64, 64, -64, -64, -64, -64, -64, -64, 64, 64, 64, -64, -64, 64, -64, -64, -64, 64, -64, -64, -64, -64, -64, -64, 64, -64, -64, -64, -64, -64, -64, -64, -64, 64, -64, -64, -64, -64, 64, -64, 64, -64, 64, 64, -64, -64, -64, -64, -64, -64, -64, -64, -64, -64, -64, -64, -64, -64, -64, -64, 64, -64, -64, -64, -64, -64, -64, 64, -64, 64, 64, -64, -64, -64, 64, -64, -64, -64, 64, 64, 64, 64, -64, -64, -64, -64, -64, 64, 64, -64, -64, -64, -64, 64, -64, 64, -64, 64, 64, 64, -64, -64, -64, -64, -64, -64, -64, 64, 64, -64, -64, -64, -64, 64, -64, -64, -64, 64, 64, 64, -64, -64, 64, -64, 64, -64, 64, 64, -64, -64, -64, -64, -64, 64, 64, 64, 64, -64, -64, -64, -64, 64, -64, -64, 64, 64, -64, -64, -64, 64, -64, -64, 64, 64, 64, 64, 64, 64, -64, -64, -64, 64, 64, 64, -64, -64, -64, -64, -64, -64, -64, -64, -64, -64, -64, -64, -64, -64, 64, 64, 64, -64, 64, 64, 64, -64, -64, -64, 64, -64, 64, -64, -64, -64, -64, 64, -64, -64, -64, -64, -64, -64, -64, -64, 64, 64, -64, 64, 64, -64, -64, 64, 64, 64, -64, -64, 64, 64, 64, -64, -64, -64, -64, -64, 64, -64, -64, -64, -64, -64, -64, -64, -64, -64, -64, -64, -64, 64, -64, -64, 64, -64, -64, -64, 64, 64, -64, -64, -64, 64, -64, -64, 64, 64, -64, -64, -64, -64, -64, 64, -64, -64, -64, -64, -64, -64, -64, 64, -64, -64, -64, -64, 64, -64, -64, 64, -64, -64, -64, -64, 64, -64, -64, -64, 64, -64, 64, -64, 64, -64, -64, 64, 64, -64, -64, -64, 64, -64, 64, 64, 64, 64, 64, -64, -64, -64, -64, 64, -64, 64, -64, -64, -64, 64, 64, -64, 64, -64, 64, 64, 64, -64, -64, -64, -64, 64, -64, 64, 64, 64, 64, -64, -64, -64, -64, -64, 64, 64, -64, -64, -64, 64, 64, 64, -64, -64, 64, 64, -64, -64, -64, -64, -64, -64, -64, 64, 64, 64, 64, 64, -64, 64, -64, -64, 64, -64, -64, -64, -64, -64, 64, -64, 64, 64, -64, 64, -64, 64, -64, -64, -64, -64, -64, 64, -64, -64, -64, 64, 64, -64, -64, 64, 64, 64, -64, -64, -64, 64, 64, 64, -64, -64, -64, -64, -64, -64, -64, -64, -64, -64, -64, -64, -64, 64, 64, 64, 64, 64, -64, -64, -64, -64, -64, 64, 64, 64, 64, -64, -64, 64, 64, 64, 64, 64, -64, 64, 64, -64, 64, -64, -64, 64, 64, -64, -64, -64, -64, 64, -64, -64, -64, -64, 64, 64, 64, 64, -64, 64, 64, 64, -64, 64, -64, -64, -64, -64, -64, -64, -64, -64, -64, -64, -64, -64, -64, -64, 64, -64, 64, -64, 64, -64, 64, -64, -64, 64, -64, -64, 64, -64, -64, -64, 64, 64, -64, -64, 64, -64, 64, -64, -64, -64, -64, -64, 64, 64, -64, 64, 64, -64, -64, -64, 64, -64, 64, 64, 64, 64, 64, -64, 64, 64, 64, 64, -64, 64, -64, -64, -64, -64, 64, 64, 64, -64, 64, 64, -64, 64, 64, 64, -64, -64, -64, -64, -64, 64, 64, -64, 64, -64, -64, 64, -64, 64, 64, -64, -64, 64, -64, -64, -64, 64, -64, 64, 64, 64, 64, -64, -64, 64, 64, -64, -64, -64, 64, -64, 64, -64, 64, 64, -64, 64, 64, 64, -64, -64, 64, -64, -64, 64, 64, -64, -64, 64, 64, 64, 64, 64, 64, -64, 64, -64, 64, -64, 64, -64, -64, 64, -64, 64, 64, 64, -64, 64, 64, 64, -64, -64, 64, -64, -64, 64, -64, 64, -64, 64, -64, 64, -64, 64, -64, -64, -64, -64, 64, 64, 64, 64, 64, -64, -64, -64, 64, -64, 64, 64, 64, 64, -64, 64, 64, -64, -64, 64, 64, -64, -64, -64, -64, 64, 64, 64, 64, 64, 64, -64, -64, -64, -64, -64, -64, -64, 64, 64, 64, -64, -64, -64, 64, 64, 64, -64, 64, 64, 64, -64, 64, 64, 64, 64, 64, -64, -64, 64, 64, -64, -64, -64, -64, -64, -64, -64, -64, -64, -64, -64, -64, 64, 64, 64, 64, 64, 64, 64, 64, 64, 64, -64, 64, 64, -64, -64, -64, -64, -64, -64, -64, 64, -64, 64, 64, -64, -64, -64, -64, 64, 64, 64, -64, -64, -64, 64, 64, 64, 64, 64, -64, 64, -64, 64, -64, -64, -64, 64, 64, 64, 64, 64, 64, -64, -64, -64, -64, -64, 64, 64, -64, -64, -64, 64, -64, 64, 64, -64, -64, -64, 64, -64, -64, -64, -64, 64, 64, 64, 64, 64, 64, 64, 64, 64, 64, 64, 64, 64, 64, 64, -64, 64, 64, 64, -64, -64, -64, 64, -64, -64, -64, -64, 64, 64, 64, 64, 64, 64, -64, 64, 64, 64, 64, 64, 64, 64, 64, -64, 64, 64, 64, -64, -64, -64, -64, 64, -64, 64, -64, -64, 64, 64, 64, 64, 64, 64, 64, 64, 64, 64, 64, 64, 64, -64, 64, 64, -64, -64, -64, -64, -64, -64, 64, -64, 64, -64, -64, 64, 64, 64, 64, 64, 64, -64, 64, 64, 64, 64, 64, -64, 64, 64, 64, 64, -64, 64, -64, -64, -64, -64, 64, -64, -64, -64, -64, 64, 64, 64, 64, 64, 64, 64, 64, 64, 64, 64, 64, 64, 64, 64, -64, 64, 64, 64, 64, -64, -64, -64, 64, 64, 64, -64, -64, 64, 64, 64, 64, 64, -64, -64, -64, 64, 64, 64, 64, -64, -64, -64, 64, -64, 64, 64, -64, -64, -64, -64, 64, -64, -64, -64, 64, 64, 64, 64, 64, 64, -64, -64, -64, 64, 64, 64, 64, 64, -64, 64, -64, 64, -64, 64, 64, 64, 64, -64, 64, 64, 64, 64, 64, 64, 64, 64, 64, -64, -64, -64, -64, -64, -64, -64, -64, -64, 64, -64, 64, -64, -64, 64, -64, 64, -64, 64, -64, -64, 64, 64, 64, 64, -64, 64, -64, -64, -64, -64, -64, -64, -64, -64, -64, -64, -64, -64, 64, 64, -64, 64, -64, 64, 64, -64, -64, -64, 64, 64, 64, 64, -64, -64, -64, -64, -64, -64, 64, -64, 64, -64, 64, 64, -64, 64, 64, 64, 64, 64, 64, -64, 64, -64, -64, 64, -64, 64, 64, 64, -64, -64, -64, -64, -64, -64, 64, -64, -64, -64, -64, 64, 64, -64, 64, 64, -64, -64, 64, -64, 64, -64, 64, -64, -64, -64, 64, -64, -64, 64, 64, -64, -64, -64, 64, -64, -64, -64, -64, 64, 64, -64, -64, -64, -64, -64, 64, -64, 64, 64, -64, 64, -64, 64, 64, 64, -64, 64, 64, -64, -64, -64, -64, -64, -64, -64, -64, 64, 64, -64, -64, 64, 64, 64, 64, 64, 64, 64, 64, 64, 64, -64, 64, 64, 64, 64, -64, -64, -64, -64, -64, -64, -64, -64, -64, -64, -64, -64, -64, 64, 64, -64, 64, -64, -64, 64, 64, 64, 64, 64, 64, -64, -64, -64, -64, -64, -64, -64, -64, -64, -64, -64, -64, -64, -64, -64, 64, 64, -64, -64, 64, 64, -64, 64, 64, 64, -64, -64, 64, -64, -64, -64, -64, -64, -64, -64, 64, -64, -64, -64, -64, -64, -64, -64, -64, 64, 64, 64, 64, -64, 64, 64, 64, 64, -64, 64, 64, -64, -64, -64, -64, -64, -64, -64, -64, -64, 64, -64, -64, -64, 64, 64, -64, -64, -64, 64, 64, 64, 64, 64, 64, 64, 64, 64, 64, 64, 64, 64, 64, 64, 64, -64, -64, 64, -64, -64, -64, -64, -64, 64, 64, -64, -64, -64, 64, 64, -64, 64, 64, 64, 64, 64, 64, 64, 64, 64, 64, 64, -64, -64, -64, 64, 64, -64, -64, -64, 64, 64, -64, -64, -64, 64, 64, 64, -64, 64, 64, 64, 64, 64, 64, 64, 64, 64, 64, 64, -64, 64, 64, 64, 64, 64, -64, -64, 64, 64, -64, -64, -64, -64, 64, 64, 64, 64, 64, 64, 64, 64, -64, 64, 64, -64, 64, 64, 64, 64, 64, -64, -64, 64, 64, 64, -64, 64, -64, -64, -64, -64, -64, 64, 64, 64, -64, -64, -64, -64, 64, -64, 64, -64, -64, -64, -64, -64, 64, -64, 64, -64, -64, -64, -64, 64, 64, 64, 64, -64, -64, 64, -64, -64, 64, 64, -64, 64, -64, -64, -64, -64, -64, -64, 64, -64, -64, 64, -64, 64, 64, -64, 64, -64, 64, 64, 64, -64, -64, -64, 64, -64, -64, -64, -64, 64, -64, 64, 64, -64, -64, -64, -64, -64, -64, 64, -64, -64, -64, 64, -64, 64, 64, -64, -64, -64, 64, 64, 64, 64, 64, -64, -64, -64, -64, -64, -64, -64, -64, -64, -64, -64, -64, -64, -64, -64, -64, -64, -64, 64, -64, 64, -64, -64, 64, 64, 64, -64, 64, 64, 64, 64, -64, 64, -64, 64, 64, -64, -64, -64, -64, -64, -64, 64, 64, -64, -64, -64, 64, -64, 64, 64, -64, 64, 64, 64, 64, -64, 64, 64, -64, -64, 64, -64, -64, -64, -64, -64, -64, -64, -64, -64, -64, -64, -64, -64, 64, -64, 64, -64, 64, 64, 64, 64, 64, 64, 64, 64, -64, 64, 64, -64, -64, -64, -64, -64, -64, -64, -64, 64, 64, 64, 64, -64, 64, 64, 64, 64, 64, 64, 64, 64, 64, 64, 64, 64, -64, 64, 64, 64, -64, -64, 64, 64, 64, -64, -64, 64, 64, 64, 64, -64, -64, 64, 64, 64, 64, 64, 64, 64, 64, 64, 64, 64, 64, -64, -64, -64, -64, -64, 64, 64, 64, -64, 64, 64, 64, 64, 64, 64, 64, -64, -64, 64, 64, -64, 64, -64, 64, 64, 64, -64, 64, -64, -64, -64, -64, -64, 64, 64, 64, -64, 64, 64, 64, 64, 64, -64, 64, 64, 64, 64, 64, 64, 64, 64, 64, 64, 64, 64, 64, -64, -64, -64, -64, -64, 64, 64, 64, -64, 64, 64, -64, -64, 64, -64, -64, -64, 64, -64, -64, 64, 64, 64, 64, 64, 64, -64, 64, -64, -64, -64, -64, -64, 64, 64, 64, -64, 64, -64, -64, 64, -64, -64, 64, -64, 64, -64, 64, -64, -64, 64, 64, 64, -64, 64, 64, 64, -64, -64, -64, -64, 64, 64, 64, 64, -64, -64, -64, -64, 64, -64, -64, 64, -64, -64, -64, 64, 64, 64, 64, 64, -64, 64, 64, -64, -64, -64, -64, 64, 64, 64, -64, 64, 64, -64, -64, -64, -64, 64, -64, -64, 64, 64, 64, -64, -64, 64, 64, -64, -64, -64, -64, -64, -64, -64, -64, -64, 64, -64, 64, -64, 64, -64, -64, -64, -64, 64, 64, -64, 64, 64, -64, 64, -64, -64, -64, 64, -64, -64, -64, -64, -64, -64, -64, -64, -64, 64, 64, 64, -64, -64, -64, -64, -64, -64, -64, -64, -64, -64, 64, -64, -64, -64, 64, -64, -64, -64, -64, -64, -64, -64, -64, 64, 64, 64, 64, 64, 64, -64, -64, 64, 64, -64, -64, 64, 64, -64, -64, -64, -64, -64, -64, -64, -64, 64, -64, -64, -64, -64, -64, -64, 64, 64, 64, 64, -64, -64, 64, 64, 64, 64, -64, 64, 64, -64, -64, -64, -64, -64, -64, 64, 64, 64, -64, -64, -64, 64, 64, -64, 64, 64, 64, -64, -64, 64, 64, 64, 64, -64, -64, -64, -64, -64, -64, 64, -64, -64, 64, 64, 64, -64, -64, -64, -64, 64, -64, -64, 64, -64, 64, 64, -64, -64, -64, 64, 64, -64, -64, -64, -64, 64, 64, -64, 64, -64, 64, 64, 64, 64, -64, -64, -64, -64, 64, -64, -64, 64, -64, -64, -64, -64, 64, -64, -64, 64, -64, -64, 64, -64, -64, -64, -64, -64, -64, 64, -64, -64, -64, -64, -64, 64, 64, 64, 64, 64, 64, 64, 64, -64, 64, 64, 64, -64, -64, 64, 64, 64, 64, 64, -64, -64, 64, -64, 64, -64, 64, 64, -64, -64, 64, 64, 64, 64, 64, -64, -64, 64, 64, 64, 64, 64, -64, 64, 64, 64, 64, 64, 64, 64, -64, 64, 64, -64, -64, -64, -64, -64, 64, -64, -64, -64, 64, -64, -64, -64, -64, 64, -64, 64, -64, 64, -64, 64, -64, -64, 64, 64, 64, -64, -64, -64, -64, -64, -64, -64, 64, -64, 64, 64, 64, 64, 64, -64, 64, -64, 64, -64, 64, -64, 64, -64, 64, 64, 64, 64, 64, -64, 64, 64, -64, -64, -64, 64, 64, 64, 64, 64, 64, -64, -64, -64, 64, 64, 64, -64, -64, -64, 64, 64, 64, 64, 64, 64, 64, 64, 64, 64, -64, 64, 64, 64, 64, 64, 64, -64, 64, -64, -64, 64, -64, -64, 64, -64, -64, -64, -64, 64, -64, -64, -64, -64, 64, -64, 64, 64, -64, -64, 64, -64, 64, 64, -64, 64, -64, 64, -64, -64, -64, -64, 64, -64, -64, -64, 64, -64, 64, -64, 64, 64, -64, -64, 64, -64, 64, 64, -64, 64, 64, 64, -64, -64, 64, 64, -64, -64, 64, 64, 64, -64, -64, 64, -64, -64, -64, 64, 64, -64, 64, 64, -64, -64, 64, 64, 64, -64, 64, 64, -64, -64, 64, -64, -64, 64, -64, 64, 64, -64, 64, 64, -64, -64, 64, 64, 64, -64, -64, -64, 64, -64, -64, 64, 64, 64, 64, 64, -64, -64, -64, -64, -64, 64, -64, 64, -64, 64, -64, 64, 64, -64, -64, -64, 64, 64, -64, -64, -64, 64, 64, -64, 64, 64, 64, 64, -64, -64, -64, -64, -64, -64, -64, 64, -64, 64, 64, 64, -64, -64, 64, -64, 64, 64, -64, -64, -64, -64, -64, -64, -64, 64, -64, -64, -64, -64, 64, 64, -64, -64, -64, 64, 64, 64, 64, 64, 64, -64, 64, -64, -64, -64, -64, -64, -64, -64, -64, -64, -64, 64, 64, -64, 64, 64, 64, -64, 64, -64, 64, 64, -64, -64, -64, -64, 64, 64, -64, -64, -64, -64, -64, 64, -64, -64, -64, -64, 64, -64, 64, -64, -64, -64, -64, 64, 64, -64, 64, 64, -64, -64, -64, -64, 64, 64, 64, -64, -64, -64, -64, -64, -64, 64, -64, 64, -64, -64, 64, -64, 64, 64, -64, 64, -64, 64, 64, 64, -64, -64, 64, -64, 64, 64, -64, -64, -64, -64, -64, -64, -64, -64, -64, 64, 64, -64, -64, -64, -64, 64, -64, 64, -64, -64, 64, 64, -64, 64, 64, -64, -64, -64, 64, -64, -64, -64, -64, -64, -64, 64, -64, -64, 64, -64, -64, -64, -64, -64, 64, 64, -64, -64, 64, 64, -64, -64, 64, -64, 64, -64, -64, -64, -64, -64, -64, -64, 64, -64, -64, 64, 64, 64, 64, 64, -64, -64, -64, -64, 64, 64, 64, 64, -64, -64, 64, 64, -64, 64, -64, 64, -64, -64, 64, 64, 64, -64, -64, 64, 64, -64, 64, -64, -64, -64, -64, -64, -64, 64, -64, 64, 64, -64, 64, 64, 64, 64, -64, -64, -64, 64, 64, -64, -64, -64, -64, 64, 64, 64, 64, -64, -64, -64, -64, -64, -64, -64, -64, -64, -64, -64, 64, -64, 64, 64, -64, -64, -64, 64, -64, -64, -64, -64, 64, 64, -64, 64, -64, -64, -64, -64, -64, -64, -64, -64, -64, -64, -64, -64, -64, 64, -64, -64, -64, -64, -64, -64, -64, -64, -64, -64, 64, -64, 64, -64, -64, -64, -64, -64, -64, -64, -64, -64, -64, -64, 64, 64, -64, 64, -64, -64, -64, 64, -64, -64, -64, -64, -64, -64, 64, -64, -64, -64, -64, -64, -64, -64, -64, -64, -64, -64, -64, 64, -64, -64, 64, -64, -64, 64, 64, -64, 64, -64, -64, -64, -64, -64, 64, -64, -64, -64, -64, -64, -64, -64, 64, -64, -64, -64, -64, -64, 64, 64, 64, 64, -64, -64, -64, -64, -64, -64, -64, -64, -64, -64, -64, -64, -64, -64, -64, -64, -64, -64, -64, -64, -64, -64, -64, 64, -64, -64, -64, 64, 64, -64, -64, -64, -64, -64, 64, 64, -64, -64, -64, -64, 64, -64, -64, -64, -64, -64, 64, -64, -64, -64, -64, 64, -64, 64, 64, 64, 64, 64, -64, -64, -64, -64, 64, -64, -64, -64, -64, 64, 64, -64, -64, -64, -64, -64, -64, -64, -64, 64, -64, -64, -64, -64, -64, -64, 64, 64, -64, 64, 64, 64, 64, -64, -64, -64, -64, -64, -64, -64, 64, 64, -64, -64, 64, -64, -64, -64, 64, 64, 64, 64, -64, -64, 64, -64, -64, -64, 64, 64, -64, -64, -64, 64, 64, -64, -64, -64, -64, -64, 64, 64, 64, -64, -64, 64, -64, 64, -64, 64, 64, 64, 64, -64, -64, -64, 64, 64, 64, 64, 64, 64, -64, -64, -64, 64, 64, -64, 64, -64, -64, -64, -64, -64, -64, 64, 64, -64, 64, 64, 64, -64, -64, -64, -64, 64, 64, 64, 64, 64, -64, -64, 64, -64, -64, 64, 64, -64, 64, -64, -64, -64, -64, -64, -64, 64, -64, 64, -64, 64, -64, -64, 64, -64, 64, 64, 64, 64, -64, 64, 64, 64, 64, 64, 64, 64, -64, -64, 64, -64, -64, -64, -64, -64, -64, -64, 64, -64, -64, -64, -64, -64, -64, -64, -64, 64, 64, 64, -64, 64, 64, -64, 64, 64, 64, 64, 64, -64, -64, 64, 64, -64, 64, 64, 64, 64, 64, -64, -64, -64, 64, 64, 64, 64, -64, -64, -64, 64, -64, 64, 64, -64, -64, -64, 64, 64, -64, -64, -64, -64, -64, -64, 64, 64, -64, 64, 64, 64, 64, 64, 64, -64, 64, 64, 64, 64, -64, -64, -64, 64, -64, 64, 64, -64, -64, 64, 64, 64, 64, -64, -64, 64, 64, 64, 64, 64, 64, -64, 64, 64, -64, -64, -64, -64, 64, -64, 64, 64, 64, -64, 64, -64, -64, -64, -64, -64, -64, 64, 64, -64, 64, -64, 64, -64, 64, 64, -64, -64, -64, -64, 64, 64, 64, -64, 64, -64, -64, -64, -64, 64, -64, 64, -64, -64, 64, 64, -64, -64, 64, -64, -64, 64, 64, 64, 64, 64, 64, -64, -64, -64, 64, 64, -64, -64, 64, -64, 64, 64, -64, -64, -64, 64, 64, 64, 64, -64, 64, 64, -64, -64, 64, -64, -64, 64, 64, 64, 64, -64, -64, 64, 64, 64, -64, -64, 64, -64, -64, 64, -64, 64, 64, 64, 64, -64, 64, 64, 64, 64, 64, 64, 64, -64, 64, 64, 64, 64, 64, -64, 64, -64, 64, -64, 64, -64, -64, 64, -64, 64, -64, -64, -64, 64, -64, 64, 64, 64, 64, 64, 64, 64, 64, 64, -64, 64, 64, 64, -64, 64, 64, 64, 64, -64, 64, -64, 64, 64, -64, 64, -64, 64, 64, 64, 64, 64, 64, 64, 64, 64, 64, 64, 64, 64, 64, 64, 64, 64, 64, 64, 64, -64, 64, 64, -64, -64, 64, 64, -64, 64, 64, 64, 64, -64, 64, 64, 64, 64, 64, 64, 64, 64, 64, 64, 64, 64, 64, -64, -64, -64, 64, 64, 64, -64, -64, -64, -64, 64, 64, 64, 64, 64, 64, 64, 64, 64, 64, 64, -64, 64, 64, 64, 64, 64, 64, -64, 64, -64, -64, 64, 64, -64, 64, -64, 64, -64, 64, 64, 64, 64, 64, 64, -64, -64, -64, -64, -64, 64, -64, -64, -64, 64, -64, 64, 64, 64, -64, -64, -64, 64, 64, 64, 64, 64, -64, -64, -64, -64, 64, -64, -64, -64, -64, -64, -64, -64, -64, 64, 64, -64, 64, -64, -64, -64, -64, -64, 64, 64, -64, 64, 64, 64, 64, 64, -64, -64, -64, 64, -64, -64, -64, -64, -64, 64, 64, 64, 64, 64, 64, -64, -64, -64, -64, -64, 64, 64, -64, -64, 64, -64, -64, -64, -64, -64, -64, -64, -64, -64, -64, 64, 64, 64, 64, 64, 64, 64, 64, -64, -64, -64, -64, -64, 64, -64, 64, 64, 64, -64, -64, -64, -64, -64, -64, -64, 64, 64, 64, 64, 64, 64, -64, 64, 64, 64, -64, -64, -64, -64, -64, -64, 64, 64, -64, -64, -64, -64, 64, -64, -64, -64, -64, 64, -64, 64, 64, 64, -64, -64, 64, 64, 64, 64, -64, -64, -64, -64, 64, 64, 64, -64, 64, -64, 64, 64, 64, -64, -64, -64, 64, 64, 64, 64, 64, 64, 64, 64, -64, 64, 64, 64, 64, -64, -64, -64, 64, 64, 64, 64, -64, 64, 64, 64, 64, -64, -64, -64, -64, 64, 64, 64, 64, 64, -64, 64, 64, 64, 64, 64, -64, -64, -64, -64, 64, 64, 64, 64, -64, -64, 64, 64, 64, 64, 64, 64, -64, -64, -64, -64, 64, 64, 64, 64, 64, 64, 64, 64, 64, 64, -64, 64, 64, 64, -64, 64, 64, 64, -64, 64, 64, 64, 64, 64, 64, -64, 64, 64, 64, -64, 64, 64, 64, 64, 64, 64, 64, 64, 64, 64, 64, 64, -64, -64, -64, -64, -64, 64, 64, 64, 64, 64, 64, -64, 64, 64, 64, 64, 64, -64, 64, 64, 64, 64, 64, -64, -64, 64, 64, -64, -64, -64, 64, -64, -64, 64, 64, -64, 64, 64, 64, 64, 64, 64, -64, 64, -64, 64, 64, 64, -64, 64, 64, 64, 64, 64, 64, -64, 64, 64, 64, -64, 64, 64, 64, -64, 64, 64, 64, 64, 64, 64, 64, 64, -64, 64, 64, 64, 64, -64, 64, 64, 64, -64, -64, 64, -64, -64, -64, 64, -64, 64, 64, -64, 64, 64, 64, 64, 64, 64, -64, -64, 64, 64, 64, 64, -64, -64, 64, 64, 64, 64, -64, 64, 64, 64, 64, -64, 64, 64, 64, 64, 64, 64, 64, 64, -64, -64, -64, 64, 64, -64, -64, 64, -64, -64, -64, 64, 64, 64, 64, -64, 64, 64, 64, 64, -64, -64, -64, 64, 64, 64, 64, 64, -64, 64, -64, -64, 64, 64, -64, 64, 64, -64, -64, -64, 64, -64, -64, 64, -64, -64, -64, -64, -64, 64, 64, 64, 64, 64, 64, 64, -64, 64, 64, 64, 64, -64, -64, -64, 64, -64, 64, -64, -64, -64, -64, -64, -64, 64, 64, -64, 64, 64, 64, 64, 64, 64, 64, 64, -64, -64, 64, 64, 64, 64, -64, -64, 64, -64, 64, -64, 64, -64, 64, 64, 64, -64, -64, 64, 64, 64, 64, -64, 64, 64, 64, 64, -64, 64, -64, 64, -64, 64, -64, 64, -64, 64, 64, 64, -64, -64, 64, -64, -64, -64, -64, -64, 64, -64, 64, 64, 64, 64, 64, 64, -64, -64, 64, 64, -64, 64, -64, -64, 64, 64, 64, -64, -64, -64, -64, 64, 64, 64, 64, -64, -64, 64, 64, 64, 64, -64, 64, 64, 64, 64, 64, 64, 64, 64, -64, 64, 64, 64, 64, -64, -64, 64, -64, 64, 64, -64, 64, 64, 64, -64, -64, 64, -64, 64, -64, -64, -64, 64, 64, 64, 64, 64, -64, 64, 64, 64, 64, 64, -64, -64, -64, -64, -64, 64, -64, -64, -64, 64, 64, 64, 64, 64, 64, -64, 64, 64, 64, 64, -64, -64, -64, -64, -64, 64, -64, -64, 64, 64, 64, -64, 64, -64, 64, -64, -64, 64, 64, 64, 64, -64, 64, 64, 64, 64, 64, 64, 64, -64, -64, -64, -64, -64, -64, 64, 64, 64, 64, 64, -64, 64, -64, 64, 64, -64, 64, -64, -64, -64, -64, -64, 64, 64, 64, 64, 64, -64, -64, -64, -64, -64, -64, 64, 64, 64, 64, 64, 64, 64, -64, 64, -64, -64, 64, -64, -64, -64, -64, 64, 64, 64, 64, 64, 64, 64, 64, 64, -64, -64, 64, -64, 64, 64, -64, 64, 64, 64, 64, -64, -64, -64, -64, -64, -64, -64, 64, 64, 64, 64, 64, 64, 64, 64, 64, 64, -64, -64, -64, -64, 64, 64, -64, -64, -64, 64, -64, 64, -64, -64, -64, -64, 64, 64, 64, 64, 64, 64, 64, 64, 64, 64, 64, -64, -64, -64, -64, 64, -64, 64, -64, -64, 64, -64, 64, 64, 64, 64, 64, 64, 64, 64, -64, -64, 64, 64, 64, 64, 64, 64, -64, -64, -64, -64, -64, 64, 64, 64, 64, -64, 64, -64, -64, 64, 64, -64, 64, 64, 64, 64, 64, 64, 64, 64, 64, 64, 64, 64, -64, -64, -64, 64, 64, 64, 64, 64, 64, -64, -64, -64, 64, -64, -64, -64, 64, -64, -64, -64, 64, 64, 64, 64, 64, 64, -64, -64, -64, -64, 64, 64, 64, 64, 64, 64, 64, -64, -64, -64, 64, -64, 64, 64, 64, 64, -64, 64, 64, 64, 64, 64, -64, -64, 64, -64, -64, -64, -64, 64, 64, 64, 64, 64, -64, -64, -64, -64, -64, 64, -64, 64, 64, -64, -64, 64, 64, -64, -64, -64, -64, 64, 64, 64, -64, -64, -64, -64, 64, 64, 64, 64, 64, -64, 64, 64, 64, 64, -64, -64, -64, -64, 64, -64, -64, -64, -64, -64, -64, -64, 64, 64, -64, -64, 64, -64, -64, 64, 64, -64, 64, 64, -64, -64, 64, 64, 64, -64, -64, -64, -64, -64, -64, -64, -64, -64, -64, -64, -64, 64, -64, -64, 64, -64, -64, 64, -64, 64, -64, 64, -64, -64, 64, -64, -64, -64, 64, -64, -64, -64, -64, -64, 64, -64, -64, -64, 64, -64, 64, -64, -64, -64, -64, -64, -64, 64, 64, -64, -64, -64, 64, -64, 64, -64, -64, -64, -64, -64, -64, 64, -64, 64, -64, -64, -64, 64, -64, -64, -64, -64, -64, -64, 64, 64, 64, 64, -64, 64, 64, -64, -64, -64, -64, -64, -64, -64, -64, 64, -64, 64, -64, 64, -64, -64, 64, -64, -64, 64, -64, 64, -64, 64, -64, -64, 64, -64, 64, 64, 64, -64, -64, -64, -64, -64, -64, 64, -64, 64, 64, 64, -64, -64, 64, 64, 64, 64, -64, -64, -64, -64, -64, -64, 64, -64, 64, 64, -64, -64, -64, -64, -64, -64, -64, 64, 64, 64, 64, 64, 64, 64, 64, 64, -64, 64, -64, 64, -64, -64, -64, -64, -64, -64, -64, -64, -64, -64, -64, 64, 64, 64, 64, 64, 64, 64, 64, 64, 64, 64, 64, -64, 64, 64, -64, -64, -64, -64, -64, -64, -64, 64, -64, 64, -64, -64, 64, 64, 64, 64, 64, 64, 64, 64, 64, 64, 64, 64, 64, 64, 64, -64, 64, 64, 64, 64, 64, 64, 64, 64, -64, 64, -64, 64, 64, 64, 64, 64, 64, 64, 64, 64, 64, 64, 64, 64, 64, -64, -64, -64, -64, 64, 64, 64, 64, 64, 64, 64, 64, -64, 64, -64, 64, 64, 64, 64, 64, 64, 64, 64, 64, -64, 64, 64, -64, -64, -64, 64, -64, -64, 64, 64, 64, -64, 64, 64, -64, 64, 64, 64, -64, 64, 64, 64, 64, 64, 64, 64, 64, 64, 64, -64, 64, 64, 64, 64, -64, 64, 64, -64, -64, -64, -64, 64, 64, -64, -64, 64, 64, 64, 64, -64, 64, 64, 64, 64, 64, 64, 64, 64, 64, 64, 64, 64, 64, 64, 64, -64, -64, -64, -64, 64, 64, -64, 64, -64, 64, 64, 64, -64, -64, 64, 64, 64, 64, 64, 64, -64, -64, 64, -64, 64, 64, 64, 64, -64, 64, -64, 64, -64, 64, 64, 64, 64, -64, -64, -64, 64, -64, -64, 64, -64, 64, -64, 64, -64, -64, 64, -64, -64, -64, -64, -64, -64, 64, -64, -64, 64, -64, 64, -64, 64, 64, -64, -64, -64, -64, 64, 64, 64, 64, -64, 64, 64, 64, -64, 64, -64, -64, -64, -64, -64, -64, 64, -64, -64, 64, -64, -64, 64, 64, -64, 64, -64, 64, -64, 64, -64, -64, -64, -64, -64, -64, -64, -64, -64, -64, -64, 64, -64, 64, 64, -64, -64, 64, -64, 64, -64, -64, -64, -64, -64, -64, -64, -64, -64, -64, 64, 64, -64, 64, -64, -64, -64, -64, -64, 64, 64, 64, -64, 64, -64, -64, -64, -64, -64, -64, -64, 64, -64, -64, -64, -64, -64, -64, -64, -64, -64, -64, -64, -64, 64, 64, 64, -64, 64, -64, -64, -64, 64, 64, 64, 64, -64, -64, -64, -64, -64, -64, -64, -64, -64, -64, 64, 64, -64, 64, 64, 64, -64, 64, 64, -64, -64, 64, 64, -64, -64, -64, 64, 64, -64, -64, -64, -64, -64, -64, -64, -64, -64, -64, -64, -64, -64, 64, 64, 64, 64, 64, 64, 64, -64, -64, -64, 64, 64, 64, -64, -64, -64, -64, -64, -64, -64, -64, -64, -64, -64, 64, -64, -64, -64, 64, 64, 64, 64, 64, -64, -64, -64, -64, -64, -64, -64, 64, 64, -64, -64, -64, -64, -64, -64, -64, -64, -64, -64, -64, -64, -64, 64, 64, 64, 64, 64, 64, -64, -64, -64, -64, -64, -64, 64, -64, 64, -64, 64, -64, -64, -64, -64, -64, -64, -64, -64, -64, -64, -64, -64, -64, 64, 64, 64, -64, -64, -64, -64, -64, -64, -64, 64, 64, 64, 64, 64, -64, -64, -64, -64, 64, -64, -64, 64, -64, 64, -64, -64, -64, 64, 64, 64, -64, -64, -64, -64, 64, -64, -64, -64, -64, 64, 64, -64, -64, -64, -64, -64, -64, 64, -64, -64, -64, -64, -64, -64, -64, -64, -64, -64, -64, -64, -64, -64, -64, -64, 64, -64, -64, -64, -64, -64, -64, -64, 64, -64, 64, 64, -64, 64, -64, -64, -64, -64, -64, -64, -64, 64, -64, -64, -64, 64, 64, 64, 64, -64, -64, -64, 64, -64, -64, -64, -64, 64, 64, 64, 64, 64, 64, -64, -64, -64, -64, -64, 64, -64, -64, -64, -64, 64, 64, 64, 64, 64, 64, -64, 64, -64, -64, 64, 64, 64, 64, 64, 64, 64, 64, -64, -64, -64, -64, -64, -64, -64, -64, -64, 64, 64, 64, -64, 64, 64, 64, -64, -64, -64, 64, 64, 64, -64, 64, 64, 64, 64, -64, -64, -64, -64, -64, 64, 64, -64, 64, 64, 64, -64, 64, 64, 64, 64, 64, 64, -64, 64, 64, 64, 64, 64, 64, 64, 64, -64, -64, -64, -64, -64, 64, -64, -64, 64, -64, -64, -64, 64, 64, -64, 64, 64, 64, -64, -64, -64, 64, 64, 64, 64, 64, 64, 64, -64, -64, -64, -64, -64, 64, 64, 64, 64, 64, -64, 64, 64, 64, 64, 64, 64, -64, 64, -64, -64, 64, 64, 64, 64, 64, 64, 64, -64, -64, -64, -64, -64, 64, 64, -64, -64, 64, -64, 64, 64, 64, 64, 64, -64, -64, -64, -64, 64, 64, 64, 64, 64, 64, -64, 64, -64, -64, -64, 64, 64, 64, 64, 64, -64, -64, -64, -64, 64, 64, 64, 64, 64, 64, -64, -64, 64, 64, 64, 64, 64, -64, -64, -64, -64, -64, -64, -64, 64, 64, 64, -64, -64, 64, -64, 64, 64, -64, 64, 64, 64, -64, 64, 64, 64, 64, 64, 64, 64, -64, -64, -64, -64, 64, 64, -64, -64, 64, -64, -64, -64, -64, -64, 64, 64, 64, 64, 64, 64, -64, -64, -64, -64, 64, 64, 64, 64, 64, 64, 64, 64, -64, 64, -64, -64, 64, 64, -64, 64, 64, -64, -64, -64, -64, 64, 64, -64, 64, 64, -64, -64, 64, 64, 64, -64, -64, -64, -64, -64, -64, -64, -64, 64, -64, 64, -64, 64, -64, -64, -64, -64, -64, 64, -64, 64, 64, 64, -64, 64, 64, -64, -64, -64, -64, -64, 64, -64, -64, -64, -64, -64, 64, -64, -64, -64, -64, -64, -64, -64, -64, 64, -64, -64, -64, -64, -64, -64, -64, -64, -64, -64, -64, -64, -64, -64, -64, -64, -64, -64, -64, -64, -64, -64, -64, -64, -64, -64, -64, 64, -64, -64, -64, 64, 64, 64, 64, -64, 64, -64, -64, -64, 64, -64, -64, -64, -64, 64, -64, -64, -64, -64, -64, -64, 64, 64, -64, -64, -64, 64, -64, -64, 64, 64, 64, -64, -64, -64, -64, -64, -64, 64, 64, -64, 64, 64, 64, -64, -64, 64, -64, 64, 64, 64, 64, -64, 64, 64, 64, -64, 64, -64, 64, 64, 64, 64, 64, 64, 64, 64, 64, -64, 64, 64, -64, -64, -64, -64, -64, 64, 64, 64, 64, -64, 64, -64, 64, -64, -64, 64, -64, 64, -64, -64, 64, -64, 64, -64, -64, -64, -64, -64, 64, -64, -64, -64, -64, 64, 64, 64, -64, 64, -64, -64, -64, 64, 64, 64, 64, 64, -64, 64, -64, -64, -64, -64, -64, -64, 64, 64, -64, -64, -64, -64, -64, -64, -64, -64, -64, -64, 64, 64, -64, -64, 64, -64, -64, -64, 64, 64, 64, -64, -64, -64, -64, -64, -64, -64, -64, -64, -64, -64, 64, -64, -64, -64, -64, -64, 64, 64, 64, -64, 64, 64, 64, -64, 64, 64, 64, 64, 64, -64, -64, -64, -64, -64, -64, 64, -64, -64, 64, -64, -64, -64, -64, -64, -64, -64, 64, 64, 64, -64, -64, -64, 64, -64, 64, -64, -64, -64, -64, -64, -64, -64, -64, 64, -64, -64, -64, -64, -64, -64, -64, -64, -64, 64, 64, -64, 64, -64, -64, -64, -64, -64, 64, 64, -64, -64, -64, -64, -64, -64, -64, 64, -64, 64, 64, 64, -64, -64, 64, 64, 64, -64, 64, -64, -64, -64, -64, -64, -64, 64, -64, -64, -64, 64, 64, -64, 64, -64, 64, 64, -64, 64, -64, 64, 64, 64, 64, 64, -64, -64, 64, 64, -64, -64, -64, -64, -64, -64, -64, -64, 64, 64, 64, 64, -64, 64, -64, 64, 64, 64, 64, 64, 64, 64, 64, 64, -64, -64, 64, -64, -64, 64, -64, -64, -64, -64, -64, 64, 64, 64, 64, 64, 64, 64, 64, 64, 64, 64, 64, -64, -64, 64, 64, 64, -64, -64, -64, -64, -64, 64, -64, -64, -64, 64, 64, 64, 64, 64, 64, -64, -64, 64, 64, 64, 64, 64, 64, 64, 64, -64, 64, 64, 64, 64, 64, -64, 64, -64, -64, -64, 64, 64, 64, 64, -64, 64, -64, -64, -64, -64, 64, 64, 64, -64, -64, -64, 64, 64, 64, 64, 64, -64, 64, -64, 64, 64, -64, 64, 64, 64, 64, -64, -64, -64, -64, -64, 64, 64, 64, 64, -64, -64, -64, -64, -64, -64, 64, 64, -64, 64, 64, -64, 64, 64, -64, 64, 64, 64, 64, 64, -64, -64, -64, -64, -64, 64, 64, 64, -64, 64, -64, -64, -64, -64, 64, 64, -64, 64, 64, 64, 64, 64, 64, 64, 64, 64, 64, 64, 64, -64, -64, -64, -64, -64, 64, 64, -64, -64, -64, -64, -64, -64, 64, -64, -64, -64, -64, 64, -64, -64, 64, 64, 64, 64, 64, 64, 64, -64, -64, -64, 64, -64, -64, 64, 64, 64, -64, -64, -64, 64, -64, -64, 64, 64, 64, -64, -64, -64, -64, 64, 64, -64, 64, -64, -64, -64, 64, 64, 64, 64, -64, 64, -64, 64, -64, -64, -64, 64, -64, -64, 64, 64, 64, 64, 64, 64, -64, -64, 64, 64, 64, 64, 64, -64, 64, 64, 64, 64, 64, 64, 64, 64, 64, 64, -64, 64, -64, -64, 64, -64, -64, 64, -64, 64, -64, 64, 64, 64, 64, 64, 64, 64, 64, 64, 64, 64, 64, 64, 64, 64, 64, 64, 64, -64, 64, 64, -64, -64, -64, 64, -64, 64, -64, -64, -64, -64, -64, -64, -64, 64, -64, -64, -64, 64, 64, 64, 64, 64, -64, -64, -64, 64, 64, 64, 64, -64, 64, -64, 64, -64, 64, -64, -64, -64, -64, -64, -64, -64, -64, -64, 64, 64, 64, -64, 64, -64, -64, -64, -64, 64, 64, -64, -64, 64, -64, -64, 64, 64, -64, -64, -64, -64, -64, -64, -64, -64, -64, -64, -64, -64, -64, -64, -64, -64, -64, -64, -64, -64, -64, -64, -64, 64, 64, -64, -64, -64, -64, -64, -64, -64, -64, -64, -64, -64, -64, -64, -64, -64, -64, 64, -64, 64, 64, -64, -64, 64, 64, -64, 64, -64, 64, -64, -64, -64, 64, -64, 64, 64, 64, -64, -64, -64, -64, -64, -64, -64, -64, -64, 64, 64, 64, 64, 64, 64, 64, -64, -64, 64, 64, 64, -64, 64, -64, 64, 64, 64, -64, 64, 64, -64, 64, 64, -64, -64, -64, 64, 64, 64, 64, 64, 64, 64, 64, 64, 64, 64, 64, -64, 64, 64, 64, 64, 64, 64, 64, 64, 64, 64, 64, 64, 64, 64, -64, -64, 64, 64, 64, -64, -64, 64, -64, -64, -64, 64, -64, 64, -64, 64, -64, 64, -64, 64, 64, -64, 64, 64, -64, 64, 64, 64, -64, 64, 64, 64, 64, -64, 64, 64, -64, 64, 64, 64, 64, -64, 64, -64, 64, -64, -64, -64, 64, 64, 64, -64, -64, 64, 64, -64, -64, -64, -64, 64, 64, -64, 64, -64, -64, 64, -64, -64, -64, 64, 64, -64, 64, 64, 64, -64, 64, 64, 64, -64, 64, -64, -64, -64, 64, 64, -64, -64, -64, -64, -64, -64, 64, 64, -64, 64, 64, -64, -64, -64, 64, -64, -64, -64, -64, 64, -64, -64, -64, 64, -64, -64, 64, -64, 64, 64, -64, 64, -64, -64, 64, 64, 64, -64, 64, 64, -64, -64, 64, -64, 64, 64, 64, 64, -64, -64, 64, 64, -64, -64, 64, -64, -64, -64, 64, -64, 64, -64, 64, -64, 64, 64, 64, -64, 64, 64, 64, -64, -64, -64, 64, 64, 64, 64, -64, 64, 64, -64, -64, -64, -64, 64, -64, 64, 64, -64, -64, -64, -64, -64, -64, -64, 64, 64, -64, -64, -64, -64, 64, 64, 64, 64, 64, -64, -64, -64, 64, 64, -64, -64, -64, -64, 64, 64, -64, -64, -64, 64, -64, -64, 64, -64, -64, -64, -64, 64, -64, -64, 64, 64, 64, 64, -64, 64, -64, -64, -64, 64, 64, -64, 64, 64, 64, -64, -64, 64, -64, -64, 64, 64, -64, -64, -64, -64, 64, 64, 64, 64, 64, 64, 64, -64, -64, -64, -64, -64, -64, -64, 64, -64, -64, -64, 64, 64, 64, -64, 64, -64, 64, 64, -64, 64, 64, 64, -64, 64, 64, 64, -64, -64, -64, -64, -64, -64, -64, 64, 64, 64, 64, 64, 64, 64, 64, -64, -64, 64, 64, 64, 64, -64, 64, -64, -64, 64, 64, -64, 64, 64, -64, 64, 64, 64, -64, 64, 64, 64, -64, -64, -64, 64, 64, 64, 64, 64, -64, 64, -64, -64, 64, -64, 64, 64, 64, 64, 64, 64, 64, 64, 64, 64, 64, 64, 64, -64, -64, 64, -64, 64, -64, -64, 64, 64, 64, 64, -64, -64, -64, 64, 64, 64, 64, 64, 64, 64, 64, 64, 64, 64, 64, 64, 64, 64, 64, 64, -64, -64, -64, -64, -64, 64, 64, 64, -64, -64, -64, 64, 64, 64, 64, 64, 64, -64, 64, 64, 64, 64, 64, 64, -64, -64, 64, -64, -64, 64, 64, -64, -64, 64, 64, -64, -64, -64, 64, 64, 64, 64, 64, -64, 64, -64, -64, 64, 64, 64, 64, 64, -64, -64, -64, 64, 64, -64, -64, -64, -64, -64, 64, -64, -64, -64, -64, 64, 64, 64, 64, -64, 64, -64, 64, -64, 64, 64, 64, 64, 64, 64, 64, 64, 64, -64, -64, -64, 64, 64, 64, -64, 64, 64, 64, 64, -64, 64, -64, 64, 64, 64, 64, 64, 64, -64, -64, 64, 64, 64, 64, -64, -64, -64, -64, -64, 64, -64, 64, 64, 64, 64, 64, 64, -64, -64, -64, 64, -64, 64, 64, 64, 64, 64, -64, 64, 64, 64, 64, 64, 64, 64, 64, -64, 64, -64, 64, 64, 64, 64, 64, 64, 64, -64, 64, 64, 64, -64, 64, 64, 64, 64, 64, 64, 64, 64, 64, 64, 64, 64, -64, -64, -64, -64, -64, 64, 64, 64, 64, -64, 64, 64, 64, -64, -64, -64, 64, 64, 64, 64, 64, 64, 64, 64, 64, 64, 64, -64, -64, 64, -64, -64, -64, 64, 64, 64, 64, 64, 64, -64, 64, 64, 64, 64, 64, 64, 64, 64, 64, 64, -64, 64, -64, 64, 64, 64, 64, -64, 64, -64, 64, -64, -64, 64, 64, 64, 64, 64, 64, 64, 64, 64, 64, 64, -64, 64, 64, -64, -64, -64, -64, -64, 64, -64, -64, 64, 64, 64, 64, 64, 64, 64, 64, 64, -64, -64, 64, 64, 64, 64, -64, -64, -64, 64, -64, -64, -64, 64, -64, -64, -64, -64, -64, -64, 64, -64, 64, 64, 64, 64, 64, 64, 64, 64, 64, 64, -64, -64, -64, -64, -64, -64, -64, -64, -64, -64, 64, -64, 64, -64, 64, 64, -64, -64, 64, 64, 64, 64, 64, 64, 64, 64, 64, -64, -64, -64, -64, -64, -64, 64, -64, -64, 64, 64, 64, 64, -64, -64, -64, -64, 64, -64, 64, 64, 64, 64, 64, 64, 64, -64, -64, 64, -64, 64, -64, 64, 64, 64, -64, -64, 64, 64, 64, -64, -64, 64, 64, 64, 64, -64, 64, 64, 64, 64, 64, 64, -64, 64, 64, -64, -64, -64, -64, 64, 64, -64, 64, 64, 64, -64, -64, -64, 64, 64, 64, 64, 64, 64, -64, 64, 64, 64, 64, 64, -64, -64, -64, -64, -64, -64, -64, 64, -64, -64, 64, 64, 64, 64, 64, -64, 64, 64, 64, -64, 64, -64, 64, -64, 64, 64, 64, -64, 64, 64, 64, -64, 64, -64, -64, 64, 64, -64, 64, 64, 64, 64, 64, 64, 64, 64, -64, 64, 64, 64, 64, 64, 64, -64, -64, 64, 64, 64, 64, -64, 64, -64, -64, 64, 64, 64, 64, -64, -64, -64, 64, 64, 64, -64, 64, -64, -64, 64, 64, 64, -64, -64, -64, -64, 64, 64, 64, 64, -64, -64, -64, 64, 64, -64, 64, 64, 64, 64, 64, -64, -64, -64, -64, 64, 64, -64, -64, 64, -64, 64, -64, -64, -64, -64, -64, -64, -64, -64, -64, 64, -64, -64, -64, -64, 64, -64, 64, 64, -64, -64, -64, 64, 64, 64, -64, -64, 64, 64, -64, -64, 64, 64, -64, -64, -64, -64, -64, -64, -64, 64, -64, -64, -64, -64, 64, -64, 64, 64, 64, 64, 64, -64, -64, -64, -64, -64, -64, -64, -64, -64, -64, -64, -64, -64, -64, -64, -64, -64, -64, -64, -64, -64, -64, -64, 64, -64, -64, 64, -64, 64, -64, 64, 64, -64, -64, -64, -64, -64, -64, -64, -64, 64, 64, 64, 64, 64, 64, -64, -64, -64, -64, 64, 64, 64, -64, 64, -64, -64, -64, -64, 64, -64, -64, 64, -64, -64, -64, -64, -64, 64, 64, -64, -64, -64, 64, 64, 64, 64, 64, 64, 64, -64, -64, -64, 64, 64, -64, -64, -64, 64, -64, -64, -64, -64, -64, -64, -64, -64, -64, -64, 64, -64, -64, 64, 64, 64, 64, 64, 64, 64, 64, -64, 64, 64, 64, 64, -64, -64, -64, -64, -64, -64, -64, -64, -64, -64, -64, -64, 64, 64, 64, 64, 64, 64, 64, 64, -64, 64, 64, -64, 64, 64, -64, 64, -64, 64, -64, -64, -64, -64, 64, 64, -64, -64, -64, -64, 64, 64, -64, 64, 64, 64, 64, 64, 64, 64, -64, -64, -64, 64, 64, -64, -64, -64, -64, -64, 64, 64, 64, 64, -64, -64, -64, 64, 64, 64, 64, -64, 64, 64, 64, -64, 64, 64, 64, 64, 64, 64, 64, -64, -64, -64, 64, 64, 64, 64, -64, -64, -64, 64, -64, 64, 64, -64, -64, -64, 64, -64, 64, 64, 64, 64, 64, 64, -64, 64, 64, -64, -64, -64, -64, 64, 64, 64, -64, -64, -64, 64, 64, 64, -64, -64, -64, 64, -64, -64, -64, 64, 64, 64, -64, 64, 64, 64, 64, -64, -64, -64, 64, 64, 64, 64, 64, 64, 64, 64, 64, -64, -64, -64, -64, 64, -64, 64, -64, 64, 64, 64, 64, 64, -64, -64, 64, -64, -64, 64, -64, 64, 64, 64, 64, -64, 64, 64, 64, -64, -64, -64, -64, -64, -64, -64, -64, 64, -64, 64, 64, -64, 64, 64, -64, -64, -64, 64, -64, 64, -64, 64, 64, 64, 64, 64, 64, -64, -64, -64, -64, -64, -64, -64, 64, 64, 64, -64, 64, 64, 64, -64, -64, -64, -64, -64, -64, 64, -64, 64, 64, 64, 64, 64, 64, 64, -64, -64, -64, -64, -64, 64, 64, -64, -64, 64, -64, 64, 64, 64, -64, -64, -64, -64, -64, 64, -64, -64, -64, 64, 64, 64, 64, 64, -64, -64, -64, -64, 64, -64, -64, -64, -64, 64, -64, 64, 64, 64, -64, -64, -64, 64, 64, 64, 64, 64, 64, 64, 64, 64, 64, 64, -64, -64, -64, 64, -64, -64, 64, -64, 64, -64, -64, 64, -64, -64, -64, -64, -64, -64, 64, -64, -64, 64, 64, 64, 64, 64, -64, -64, -64, -64, -64, -64, -64, -64, -64, -64, 64, 64, -64, -64, -64, -64, -64, -64, -64, -64, -64, -64, -64, -64, -64, 64, 64, 64, -64, -64, -64, -64, -64, -64, -64, -64, -64, -64, -64, -64, -64, 64, -64, -64, -64, -64, -64, -64, -64, 64, -64, -64, -64, 64, 64, 64, -64, -64, 64, 64, -64, -64, 64, -64, 64, 64, -64, 64, -64, -64, 64, -64, -64, -64, -64, -64, -64, 64, -64, -64, -64, 64, 64, 64, -64, -64, -64, -64, -64, -64, -64, -64, -64, -64, -64, 64, -64, 64, 64, -64, -64, -64, -64, 64, 64, 64, 64, -64, -64, 64, 64, 64, -64, 64, -64, -64, -64, -64, -64, -64, 64, 64, -64, -64, 64, -64, -64, -64, 64, -64, -64, 64, 64, 64, -64, -64, 64, 64, 64, 64, 64, 64, -64, -64, -64, -64, -64, 64, -64, -64, 64, 64, 64, -64, -64, -64, -64, -64, -64, 64, 64, 64, -64, -64, 64, 64, 64, 64, 64, 64, 64, 64, -64, -64, 64, -64, 64, -64, -64, -64, 64, -64, 64, -64, -64, 64, 64, 64, -64, -64, -64, -64, -64, 64, 64, -64, -64, -64, -64, -64, -64, 64, -64, 64, -64, -64, 64, -64, 64, -64, 64, 64, 64, 64, 64, -64, -64, -64, -64, -64, -64, -64, -64, -64, -64, 64, 64, 64, -64, -64, 64, 64, 64, 64, -64, -64, 64, -64, -64, -64, 64, 64, 64, 64, -64, 64, 64, -64, -64, 64, -64, -64, 64, -64, -64, 64, 64, 64, -64, 64, 64, -64, -64, -64, 64, -64, -64, 64, 64, -64, -64, 64, -64, 64, -64, 64, -64, -64, 64, 64, 64, 64, 64, -64, 64, 64, -64, -64, -64, -64, -64, -64, -64, -64, -64, -64, -64, 64, -64, 64, -64, -64, 64, -64, 64, -64, 64, -64, -64, 64, 64, 64, 64, 64, 64, -64, -64, 64, 64, 64, 64, 64, 64, -64, 64, 64, 64, -64, 64, 64, 64, 64, 64, 64, 64, 64, -64, 64, 64, 64, -64, -64, -64, -64, -64, -64, 64, 64, 64, 64, 64, 64, -64, 64, -64, 64, 64, 64, 64, -64, -64, 64, 64, 64, 64, 64, 64, 64, 64, 64, 64, -64, 64, -64, 64, 64, 64, -64, -64, 64, -64, -64, 64, 64, 64, 64, 64, 64, 64, 64, 64, 64, 64, 64, 64, 64, 64, 64, 64, 64, 64, -64, 64, 64, -64, -64, -64, 64, 64, 64, -64, 64, 64, 64, 64, -64, 64, 64, 64, 64, 64, 64, 64, 64, 64, 64, 64, 64, 64, 64, 64, 64, -64, -64, -64, 64, 64, 64, -64, 64, 64, 64, 64, 64, 64, 64, 64, 64, 64, 64, 64, 64, 64, 64, 64, 64, 64, 64, 64, 64, 64, 64, 64, -64, 64, 64, -64, -64, 64, 64, 64, 64, 64, 64, 64, 64, 64, 64, 64, 64, 64, 64, 64, -64, -64, -64, -64, 64, 64, -64, 64, -64, -64, -64, -64, 64, 64, 64, 64, 64, 64, -64, 64, 64, 64, 64, -64, -64, -64, -64, -64, -64, -64, -64, 64, -64, -64, 64, -64, -64, -64, -64, 64, 64, 64, 64, -64, 64, 64, 64, -64, -64, -64, -64, -64, -64, -64, -64, -64, -64, -64, -64, 64, -64, 64, -64, -64, 64, -64, 64, 64, 64, 64, 64, -64, -64, -64, -64, -64, -64, -64, -64, -64, -64, -64, -64, -64, -64, -64, -64, 64, -64, -64, -64, -64, -64, -64, -64, 64, -64, -64, -64, -64, -64, -64, -64, -64, -64, 64, -64, -64, -64, -64, -64, 64, -64, -64, -64, 64, 64, -64, 64, -64, -64, -64, -64, 64, 64, 64, -64, -64, -64, -64, -64, -64, 64, 64, 64, -64, 64, -64, 64, 64, 64, -64, -64, -64, -64, 64, -64, -64, -64, -64, -64, 64, 64, 64, -64, -64, -64, -64, -64, 64, 64, 64, 64, 64, 64, 64, 64, -64, 64, 64, -64, -64, -64, 64, -64, -64, -64, -64, -64, 64, 64, -64, 64, -64, 64, 64, 64, 64, 64, 64, 64, -64, 64, 64, 64, 64, -64, 64, -64, -64, -64, -64, 64, 64, 64, 64, -64, -64, -64, -64, -64, 64, -64, -64, 64, -64, 64, 64, -64, -64, -64, 64, 64, 64, -64, 64, -64, -64, -64, -64, 64, 64, 64, 64, 64, -64, 64, 64, 64, 64, 64, 64, 64, 64, 64, -64, -64, 64, 64, -64, -64, 64, 64, 64, -64, -64, -64, 64, -64, -64, 64, -64, -64, 64, 64, 64, 64, 64, -64, 64, 64, 64, 64, 64, -64, -64, 64, 64, 64, 64, 64, 64, 64, 64, -64, -64, -64, -64, 64, -64, -64, -64, 64, 64, 64, -64, -64, 64, -64, 64, 64, 64, 64, -64, 64, 64, 64, 64, 64, 64, -64, 64, 64, -64, 64, -64, -64, -64, -64, -64, -64, 64, -64, 64, -64, 64, 64, 64, -64, 64, 64, -64, -64, 64, 64, 64, 64, -64, 64, 64, -64, 64, 64, 64, 64, 64, 64, -64, 64, -64, -64, -64, -64, 64, 64, 64, -64, 64, -64, -64, 64, 64, 64, 64, -64, -64, 64, -64, 64, 64, 64, 64, 64, 64, 64, 64, 64, 64, -64, 64, 64, 64, 64, 64, 64, 64, -64, -64, 64, 64, 64, 64, -64, -64, -64, -64, -64, 64, 64, 64, 64, 64, -64, -64, -64, 64, 64, 64, 64, 64, 64, 64, 64, 64, -64, -64, 64, 64, -64, 64, -64, -64, 64, -64, -64, -64, -64, -64, -64, -64, 64, 64, -64, -64, 64, 64, 64, 64, 64, 64, 64, 64, 64, -64, 64, 64, 64, -64, 64, 64, 64, 64, 64, 64, 64, -64, -64, -64, 64, -64, -64, -64, -64, 64, 64, 64, 64, 64, 64, 64, 64, -64, -64, 64, 64, -64, -64, -64, -64, 64, 64, 64, -64, 64, -64, -64, -64, -64, -64, 64, 64, 64, 64, 64, 64, 64, -64, -64, -64, 64, 64, 64, 64, -64, -64, 64, 64, 64, -64, -64, -64, 64, -64, -64, -64, -64, -64, -64, -64, 64, 64, 64, 64, 64, -64, -64, -64, -64, 64, 64, -64, -64, 64, -64, -64, 64, -64, -64, -64, -64, -64, 64, 64, 64, 64, 64, -64, 64, 64, -64, -64, -64, 64, -64, -64, -64, 64, 64, -64, -64, -64, 64, 64, 64, 64, -64, -64, 64, 64, -64, -64, -64, -64, 64, 64, -64, 64, 64, 64, -64, -64, -64, 64, 64, 64, -64, 64, 64, -64, -64, -64, -64, 64, -64, 64, 64, 64, 64, -64, 64, 64, -64, -64, -64, 64, -64, -64, -64, -64, 64, -64, -64, -64, 64, -64, -64, -64, 64, 64, -64, 64, -64, 64, -64, 64, 64, -64, 64, 64, -64, -64, -64, -64, -64, 64, 64, 64, -64, -64, -64, -64, -64, 64, -64, -64, -64, -64, -64, -64, -64, 64, 64, -64, -64, -64, -64, -64, 64, -64, -64, 64, -64, 64, 64, -64, -64, -64, -64, -64, -64, -64, -64, -64, -64, 64, 64, 64, 64, -64, -64, 64, -64, -64, 64, 64, -64, 64, 64, 64, 64, -64, 64, -64, -64, -64, -64, -64, -64, -64, -64, 64, 64, 64, 64, 64, -64, 64, -64, 64, -64, -64, -64, -64, -64, 64, 64, -64, 64, 64, 64, 64, 64, 64, -64, 64, 64, -64, -64, 64, 64, 64, 64, -64, 64, 64, -64, 64, -64, -64, -64, -64, -64, 64, -64, -64, -64, 64, 64, -64, -64, -64, -64, 64, -64, -64, 64, 64, 64, 64, -64, 64, -64, -64, 64, -64, -64, 64, -64, -64, -64, -64, 64, 64, 64, -64, -64, -64, -64, -64, -64, -64, -64, -64, 64, 64, 64, 64, -64, 64, -64, 64, -64, 64, -64, -64, 64, -64, 64, -64, -64, 64, -64, 64, -64, -64, -64, -64, 64, -64, -64, -64, 64, -64, -64, -64, -64, 64, 64, 64, -64, -64, -64, 64, 64, 64, -64, -64, -64, -64, -64, -64, -64, -64, -64, -64, 64, -64, 64, 64, 64, 64, 64, -64, 64, -64, 64, -64, -64, -64, 64, -64, 64, -64, -64, -64, 64, -64, 64, -64, -64, -64, -64, -64, -64, -64, -64, 64, -64, 64, -64, -64, -64, 64, 64, 64, -64, -64, 64, 64, -64, 64, -64, 64, 64, 64, -64, 64, 64, -64, -64, -64, -64, -64, 64, -64, 64, 64, 64, 64, 64, -64, 64, 64, 64, -64, -64, -64, 64, -64, -64, 64, -64, 64, -64, -64, -64, -64, -64, -64, -64, -64, -64, -64, 64, 64, 64, -64, -64, -64, 64, 64, -64, -64, -64, -64, -64, 64, 64, 64, -64, 64, 64, -64, -64, -64, -64, 64, 64, -64, 64, 64, 64, 64, -64, 64, -64, 64, -64, -64, -64, 64, -64, 64, -64, -64, 64, -64, 64, -64, -64, -64, -64, -64, 64, -64, -64, 64, -64, -64, 64, 64, -64, -64, -64, -64, 64, 64, 64, -64, -64, -64, 64, -64, 64, -64, -64, -64, 64, -64, -64, -64, -64, -64, 64, 64, -64, -64, -64, -64, -64, -64, 64, -64, -64, 64, 64, -64, -64, -64, -64, 64, -64, 64, 64, -64, 64, -64, -64, 64, -64, 64, -64, -64, 64, -64, -64, -64, -64, -64, 64, 64, -64, -64, 64, -64, -64, -64, -64, -64, -64, -64, 64, -64, -64, -64, -64, 64, -64, -64, 64, -64, 64, -64, 64, -64, -64, 64, -64, 64, 64, -64, -64, -64, -64, -64, 64, -64, -64, -64, 64, 64, -64, 64, -64, -64, 64, 64, -64, 64, 64, -64, -64, -64, -64, -64, 64, 64, -64, -64, -64, -64, -64, -64, 64, 64, 64, -64, -64, -64, 64, -64, -64, -64, -64, -64, 64, 64, 64, 64, -64, 64, 64, 64, 64, -64, 64, -64, -64, -64, -64, -64, 64, 64, -64, -64, -64, 64, 64, -64, -64, -64, 64, -64, 64, -64, 64, 64, 64, 64, 64, 64, -64, -64, 64, 64, -64, -64, -64, -64, -64, -64, -64, -64, 64, -64, 64, -64, -64, -64, -64, 64, -64, 64, 64, -64, -64, 64, 64, 64, -64, 64, 64, -64, 64, 64, 64, -64, -64, 64, -64, -64, -64, -64, 64, -64, -64, -64, -64, -64, 64, 64, 64, 64, -64, 64, -64, -64, -64, 64, 64, -64, 64, -64, -64, -64, -64, -64, -64, 64, -64, -64, -64, -64, 64, 64, -64, -64, -64, 64, 64, -64, -64, -64, 64, -64, 64, 64, 64, -64, -64, 64, 64, -64, -64, 64, -64, 64, -64, -64, -64, -64, -64, -64, -64, -64, -64, -64, -64, 64, -64, -64, -64, -64, 64, 64, 64, -64, -64, -64, 64, -64, 64, 64, 64, -64, 64, -64, -64, -64, 64, 64, -64, -64, -64, -64, -64, -64, 64, -64, -64, -64, -64, -64, 64, -64, -64, 64, 64, 64, 64, 64, -64, 64, -64, 64, -64, -64, -64, -64, 64, -64, 64, -64, 64, -64, -64, 64, -64, 64, 64, -64, -64, 64, 64, -64, -64, 64, 64, -64, -64, 64, -64, -64, 64, -64, -64, -64, 64, 64, 64, 64, 64, -64, 64, 64, 64, -64, 64, -64, -64, -64, -64, -64, 64, 64, -64, 64, -64, 64, -64, 64, 64, 64, 64, 64, 64, -64, 64, -64, -64, -64, -64, -64, 64, -64, -64, 64, -64, -64, -64, 64, -64, 64, 64, 64, 64, 64, 64, -64, 64, -64, -64, 64, 64, -64, -64, -64, -64, -64, 64, 64, 64, -64, -64, -64, 64, -64, 64, 64, 64, -64, 64, 64, -64, 64, 64, 64, 64, -64, 64, 64, -64, 64, 64, -64, -64, 64, -64, -64, 64, -64, -64, 64, 64, -64, -64, -64, 64, 64, 64, -64, 64, 64, -64, 64, 64, 64, -64, 64, -64, -64, -64, -64, 64, 64, -64, 64, 64, 64, 64, 64, 64, 64, -64, -64, -64, -64, -64, -64, -64, -64, 64, 64, -64, -64, -64, -64, 64, -64, -64, -64, 64, 64, 64, 64, -64, -64, -64, -64, 64, 64, 64, 64, 64, -64, -64, -64, -64, 64, 64, 64, -64, -64, -64, 64, -64, 64, 64, -64, -64, 64, -64, -64, -64, -64, -64, -64, -64, -64, -64, -64, -64, -64, -64, -64, -64, 64, 64, -64, 64, 64, -64, 64, -64, -64, 64, 64, -64, -64, -64, -64, -64, -64, -64, 64, 64, 64, 64, 64, -64, -64, -64, -64, 64, -64, -64, 64, -64, -64, -64, -64, 64, -64, 64, -64, -64, -64, -64, -64, -64, -64, -64, 64, -64, -64, 64, 64, -64, -64, -64, -64, 64, 64, 64, -64, -64, -64, 64, 64, -64, -64, -64, -64, -64, -64, -64, -64, -64, -64, -64, -64, -64, -64, -64, -64, -64, -64, -64, -64, -64, -64, 64, -64, -64, -64, 64, -64, 64, -64, -64, -64, -64, -64, -64, 64, 64, -64, -64, -64, -64, -64, 64, 64, -64, -64, -64, -64, -64, -64, -64, -64, -64, -64, -64, -64, -64, 64, -64, -64, -64, -64, -64, 64, -64, -64, -64, -64, -64, -64, -64, -64, -64, -64, -64, -64, -64, -64, -64, -64, -64, -64, -64, -64, -64, -64, -64, -64, -64, -64, -64, 64, -64, -64, -64, -64, 64, -64, -64, -64, 64, -64, -64, -64, -64, -64, -64, 64, -64, 64, -64, -64, -64, -64, -64, 64, -64, 64, -64, 64, 64, -64, -64, 64, 64, -64, -64, 64, 64, -64, 64, -64, -64, -64, -64, 64, -64, -64, -64, -64, -64, -64, -64, -64, 64, 64, 64, 64, -64, -64, 64, -64, -64, -64, 64, -64, 64, -64, 64, -64, -64, -64, -64, 64, -64, -64, -64, -64, -64, -64, -64, -64, -64, 64, -64, -64, -64, -64, 64, -64, 64, 64, -64, -64, 64, 64, -64, -64, -64, -64, -64, -64, -64, -64, -64, -64, -64, -64, -64, -64, -64, -64, -64, 64, 64, -64, 64, 64, -64, 64, -64, -64, 64, -64, -64, -64, -64, 64, 64, -64, -64, -64, -64, -64, -64, -64, -64, 64, -64, -64, -64, -64, 64, 64, 64, 64, 64, -64, -64, 64, -64, -64, -64, 64, -64, -64, 64, 64, -64, -64, -64, -64, -64, -64, -64, 64, 64, -64, -64, 64, 64, -64, -64, 64, 64, 64, -64, 64, -64, -64, 64, 64, 64, 64, 64, 64, -64, -64, -64, -64, -64, -64, 64, -64, 64, -64, -64, -64, -64, -64, 64, -64, 64, -64, -64, -64, -64, -64, -64, 64, -64, -64, -64, 64, 64, 64, -64, 64, -64, -64, -64, -64, -64, 64, -64, -64, -64, -64, -64, -64, -64, -64, 64, -64, 64, 64, 64, -64, 64, 64, 64, 64, 64, 64, 64, 64, 64, 64, -64, 64, 64, -64, -64, -64, -64, 64, -64, 64, -64, 64, 64, 64, 64, 64, -64, -64, -64, 64, 64, 64, 64, 64, 64, 64, 64, -64, -64, -64, -64, -64, -64, -64, -64, 64, 64, -64, -64, 64, 64, -64, 64, -64, -64, 64, -64, 64, 64, 64, 64, 64, 64, 64, -64, -64, -64, -64, -64, -64, -64, 64, 64, 64, 64, -64, -64, -64, -64, -64, -64, -64, -64, 64, -64, 64, -64, -64, 64, -64, 64, 64, 64, -64, 64, -64, -64, -64, -64, -64, -64, 64, -64, -64, -64, 64, -64, 64, -64, -64, -64, -64, -64, -64, 64, -64, -64, -64, -64, -64, -64, -64, -64, -64, -64, -64, -64, 64, 64, -64, -64, -64, 64, -64, 64, -64, -64, -64, -64, -64, -64, -64, -64, -64, -64, -64, -64, -64, 64, -64, 64, 64, -64, 64, -64, -64, -64, 64, -64, -64, -64, 64, 64, -64, -64, 64, -64, -64, -64, -64, -64, -64, 64, -64, -64, 64, 64, 64, -64, -64, 64, -64, -64, 64, -64, 64, 64, 64, -64, -64, -64, -64, -64, 64, -64, -64, 64, 64, 64, -64, 64, -64, -64, -64, -64, -64, 64, 64, -64, 64, 64, 64, -64, 64, 64, 64, 64, -64, 64, 64, -64, 64, -64, 64, 64, 64, -64, 64, 64, 64, -64, 64, -64, -64, -64, 64, 64, 64, -64, 64, 64, 64, -64, 64, -64, 64, 64, -64, 64, -64, -64, 64, 64, 64, -64, 64, 64, -64, -64, -64, 64, -64, 64, 64, -64, 64, 64, 64, -64, 64, -64, -64, 64, -64, -64, -64, -64, 64, -64, 64, -64, 64, 64, 64, 64, 64, -64, 64, 64, 64, -64, 64, 64, 64, 64, -64, 64, 64, 64, 64, -64, -64, -64, 64, -64, 64, -64, -64, 64, 64, 64, 64, -64, 64, 64, -64, 64, -64, -64, -64, 64, 64, 64, 64, 64, -64, -64, -64, 64, -64, 64, 64, -64, 64, 64, -64, 64, 64, -64, -64, -64, -64, -64, -64, 64, -64, 64, 64, 64, 64, 64, 64, 64, 64, -64, -64, 64, 64, -64, -64, 64, 64, 64, 64, 64, -64, -64, 64, 64, 64, -64, 64, 64, 64, 64, -64, 64, -64, -64, -64, -64, 64, 64, -64, 64, 64, 64, 64, 64, -64, 64, -64, -64, -64, -64, 64, 64, 64, 64, 64, 64, 64, 64, 64, 64, -64, 64, -64, 64, 64, 64, 64, -64, 64, 64, -64, 64, -64, 64, -64, -64, 64, 64, 64, 64, 64, 64, 64, 64, 64, 64, -64, -64, -64, 64, 64, 64, 64, -64, -64, 64, -64, 64, 64, 64, -64, -64, -64, 64, 64, 64, 64, -64, -64, 64, 64, 64, 64, -64, -64, 64, -64, -64, -64, -64, 64, -64, 64, 64, 64, -64, -64, -64, 64, -64, 64, -64, 64, 64, 64, -64, -64, 64, 64, 64, 64, -64, -64, -64, -64, -64, -64, -64, -64, 64, -64, -64, -64, -64, -64, -64, 64, -64, 64, -64, 64, 64, -64, -64, 64, 64, 64, 64, 64, -64, 64, -64, -64, -64, -64, -64, 64, 64, 64, -64, -64, 64, -64, 64, 64, 64, 64, -64, 64, 64, 64, 64, 64, 64, 64, -64, 64, -64, 64, -64, -64, -64, 64, -64, 64, 64, -64, -64, 64, 64, -64, 64, -64, 64, 64, 64, 64, 64, 64, 64, 64, 64, 64, 64, 64, 64, 64, 64, 64, -64, -64, -64, 64, -64, -64, 64, 64, -64, -64, -64, -64, -64, -64, -64, -64, 64, 64, 64, 64, 64, 64, 64, 64, 64, 64, 64, -64, -64, 64, -64, 64, 64, -64, -64, -64, -64, -64, -64, -64, -64, -64, -64, 64, 64, 64, 64, 64, 64, 64, 64, 64, 64, 64, 64, 64, -64, -64, -64, -64, 64, -64, 64, 64, 64, 64, 64, 64, -64, -64, -64, -64, -64, 64, 64, 64, 64, 64, 64, 64, 64, 64, 64, -64, 64, -64, -64, -64, 64, 64, -64, 64, 64, 64, -64, -64, -64, -64, -64, -64, -64, 64, 64, 64, 64, 64, 64, 64, 64, 64, 64, 64, -64, -64, 64, -64, -64, -64, -64, -64, -64, 64, -64, -64, -64, 64, 64, 64, -64, -64, 64, 64, 64, 64, 64, 64, 64, 64, 64, -64, -64, -64, -64, -64, -64, 64, 64, 64, -64, 64, -64, -64, -64, 64, 64, 64, -64, -64, -64, -64, -64, 64, 64, 64, 64, 64, 64, 64, -64, -64, 64, 64, -64, -64, -64, 64, -64, -64, -64, -64, 64, 64, -64, -64, -64, -64, 64, -64, 64, -64, 64, 64, -64, -64, 64, -64, -64, -64, -64, -64, -64, 64, 64, -64, -64, -64, 64, -64, -64, -64, 64, 64, 64, 64, 64, 64, 64, 64, 64, 64, -64, 64, 64, -64, 64, -64, -64, -64, -64, -64, 64, 64, -64, -64, 64, 64, 64, 64, 64, 64, -64, -64, -64, 64, -64, 64, 64, -64, -64, 64, 64, -64, 64, -64, 64, -64, 64, 64, 64, -64, -64, -64, -64, -64, 64, 64, 64, 64, -64, 64, 64, 64, -64, -64, -64, 64, 64, 64, -64, -64, 64, -64, 64, 64, -64, 64, 64, 64, 64, 64, 64, 64, 64, -64, -64, 64, -64, 64, 64, 64, -64, 64, 64, 64, 64, 64, -64, 64, -64, -64, 64, -64, -64, -64, 64, -64, -64, 64, 64, 64, 64, 64, 64, 64, 64, 64, 64, 64, 64, 64, 64, -64, 64, 64, 64, 64, -64, -64, -64, -64, 64, -64, -64, -64, 64, -64, -64, 64, 64, 64, -64, 64, -64, 64, 64, 64, 64, 64, -64, 64, -64, 64, 64, -64, 64, -64, -64, 64, 64, 64, -64, 64, -64, -64, -64, 64, -64, -64, 64, 64, 64, -64, 64, 64, 64, -64, 64, -64, 64, 64, 64, 64, 64, 64, -64, 64, -64, -64, -64, 64, 64, 64, -64, -64, 64, 64, -64, -64, 64, -64, 64, 64, 64, 64, -64, -64, -64, -64, -64, 64, -64, -64, -64, -64, -64, 64, 64, -64, -64, -64, -64, 64, -64, -64, -64, -64, -64, 64, 64, -64, 64, -64, 64, 64, -64, -64, -64, 64, -64, -64, -64, 64, 64, -64, 64, -64, -64, 64, 64, 64, -64, -64, -64, -64, 64, -64, -64, 64, 64, -64, -64, 64, 64, -64, -64, 64, -64, -64, -64, 64, -64, 64, -64, -64, -64, -64, -64, -64, -64, 64, 64, -64, 64, 64, -64, -64, 64, 64, 64, 64, -64, -64, -64, -64, 64, -64, -64, 64, 64, 64, -64, 64, -64, -64, 64, -64, -64, -64, 64, 64, -64, -64, -64, -64, 64, -64, 64, -64, 64, 64, 64, -64, 64, 64, -64, 64, 64, 64, -64, 64, -64, -64, -64, 64, 64, -64, -64, 64, 64, -64, -64, 64, 64, 64, 64, 64, -64, -64, -64, 64, -64, -64, 64, 64, 64, -64, 64, -64, 64, -64, 64, 64, -64, 64, 64, 64, -64, -64, 64, 64, 64, 64, 64, 64, 64, 64, 64, 64, -64, 64, -64, 64, -64, 64, 64, -64, -64, 64, 64, -64, -64, 64, 64, 64, 64, 64, 64, -64, -64, 64, 64, 64, 64, -64, 64, 64, -64, 64, 64, 64, 64, 64, 64, 64, 64, -64, 64, -64, -64, -64, 64, 64, -64, 64, 64, 64, 64, 64, 64, -64, -64, 64, 64, -64, 64, 64, 64, 64, -64, 64, -64, 64, -64, -64, 64, -64, -64, 64, -64, -64, -64, 64, 64, 64, 64, 64, 64, 64, -64, 64, 64, -64, -64, 64, 64, 64, 64, 64, 64, 64, 64, -64, -64, -64, -64, -64, -64, -64, 64, 64, 64, 64, 64, 64, 64, 64, 64, 64, 64, 64, -64, -64, 64, 64, -64, 64, -64, -64, 64, -64, -64, -64, -64, -64, 64, -64, -64, 64, 64, 64, 64, 64, -64, 64, -64, 64, 64, -64, -64, -64, 64, 64, -64, -64, 64, -64, 64, 64, 64, -64, -64, 64, -64, 64, 64, 64, 64, 64, -64, 64, 64, 64, 64, 64, 64, -64, -64, -64, -64, -64, -64, 64, -64, 64, -64, -64, -64, -64, -64, -64, 64, 64, 64, 64, 64, 64, 64, 64, 64, 64, -64, 64, -64, -64, -64, -64, -64, -64, -64, -64, 64, -64, 64, -64, -64, -64, 64, -64, 64, 64, 64, 64, 64, 64, 64, 64, 64, 64, 64, 64, 64, -64, 64, 64, -64, -64, -64, 64, -64, -64, -64, -64, -64, -64, -64, -64, 64, 64, 64, 64, 64, 64, 64, 64, 64, 64, -64, -64, -64, 64, 64, -64, -64, -64, -64, -64, 64, -64, -64, -64, 64, -64, 64, -64, 64, -64, -64, 64, -64, 64, 64, 64, 64, -64, -64, -64, 64, 64, -64, 64, -64, -64, -64, 64, -64, 64, 64, -64, 64, -64, -64, 64, 64, 64, 64, 64, 64, 64, 64, 64, 64, 64, -64, -64, 64, 64, 64, 64, -64, -64, -64, 64, 64, 64, 64, 64, -64, -64, -64, 64, 64, 64, 64, 64, 64, 64, -64, -64, 64, -64, 64, 64, -64, 64, 64, 64, 64, -64, -64, 64, -64, 64, -64, 64, -64, 64, -64, -64, 64, 64, 64, -64, -64, 64, -64, 64, 64, -64, -64, 64, -64, 64, -64, -64, -64, 64, 64, -64, 64, -64, 64, 64, 64, -64, 64, -64, 64, 64, -64, 64, -64, 64, 64, -64, 64, 64, 64, -64, -64, -64, -64, -64, 64, 64, -64, -64, 64, 64, 64, 64, -64, -64, -64, 64, 64, -64, 64, 64, 64, 64, 64, 64, -64, 64, -64, -64, -64, -64, 64, -64, -64, -64, 64, 64, -64, -64, -64, 64, -64, 64, 64, 64, 64, 64, -64, 64, 64, 64, -64, 64, -64, 64, 64, 64, -64, -64, -64, -64, -64, 64, 64, 64, 64, 64, 64, 64, 64, 64, 64, 64, 64, 64, 64, 64, -64, 64, 64, 64, 64, -64, -64, 64, -64, -64, -64, -64, 64, -64, 64, -64, -64, -64, -64, 64, 64, 64, 64, 64, 64, 64, 64, 64, 64, -64, -64, 64, -64, 64, 64, 64, 64, -64, -64, 64, -64, 64, -64, -64, -64, -64, -64, 64, 64, 64, 64, -64, 64, 64, 64, 64, -64, 64, -64, 64, 64, -64, 64, 64, 64, -64, -64, 64, 64, 64, 64, 64, -64, 64, 64, -64, 64, -64, -64, -64, 64, -64, 64, 64, 64, -64, -64, -64, 64, -64, 64, -64, -64, -64, 64, -64, -64, 64, 64, 64, 64, -64, -64, -64, -64, 64, 64, -64, 64, 64, 64, -64, -64, 64, -64, -64, -64, -64, -64, -64, -64, -64, -64, 64, -64, -64, -64, -64, 64, -64, -64, -64, 64, -64, 64, 64, 64, 64, -64, -64, 64, 64, -64, 64, -64, -64, 64, -64, -64, -64, -64, 64, 64, 64, 64, -64, -64, 64, -64, -64, 64, 64, -64, 64, -64, -64, -64, -64, -64, -64, 64, 64, 64, 64, 64, -64, 64, -64, 64, 64, 64, -64, 64, 64, 64, -64, 64, 64, 64, -64, 64, -64, -64, 64, 64, -64, 64, -64, -64, -64, -64, -64, 64, 64, -64, -64, -64, 64, 64, 64, -64, -64, -64, -64, 64, 64, 64, 64, -64, -64, 64, -64, -64, -64, -64, -64, -64, 64, -64, -64, -64, -64, -64, 64, -64, -64, 64, 64, -64, 64, -64, -64, 64, 64, 64, 64, 64, -64, 64, -64, -64, -64, -64, -64, -64, 64, -64, -64, 64, -64, -64, 64, -64, -64, 64, -64, 64, -64, 64, -64, -64, -64, 64, -64, -64, 64, 64, 64, 64, -64, 64, 64, 64, 64, 64, 64, 64, -64, 64, -64, -64, -64, -64, 64, -64, 64, 64, -64, 64, 64, -64, 64, 64, 64, 64, 64, 64, 64, -64, 64, -64, 64, -64, -64, 64, -64, -64, 64, -64, -64, -64, 64, 64, 64, 64, -64, 64, -64, -64, 64, 64, -64, 64, 64, -64, 64, -64, -64, -64, 64, -64, 64, 64, -64, -64, -64, -64, 64, 64, 64, 64, -64, -64, 64, 64, -64, 64, -64, -64, -64, -64, -64, 64, -64, 64, 64, 64, 64, 64, -64, 64, 64, 64, -64, 64, 64, 64, -64, -64, -64, 64, 64, -64, -64, -64, 64, -64, -64, -64, 64, -64, -64, -64, -64, 64, 64, -64, 64, -64, 64, 64, 64, 64, 64, 64, 64, 64, 64, 64, -64, 64, 64, 64, -64, 64, 64, 64, 64, 64, 64, -64, 64, 64, 64, -64, 64, -64, -64, 64, 64, 64, 64, 64, 64, -64, -64, 64, 64, 64, -64, 64, -64, -64, 64, 64, 64, 64, 64, 64, -64, 64, -64, -64, -64, -64, -64, 64, 64, 64, 64, 64, -64, -64, -64, 64, 64, 64, 64, -64, 64, 64, 64, 64, 64, -64, -64, 64, 64, 64, -64, 64, -64, -64, -64, -64, 64, 64, 64, -64, 64, -64, 64, -64, 64, -64, -64, -64, -64, 64, 64, 64, 64, -64, 64, -64, -64, -64, -64, -64, -64, -64, 64, 64, -64, -64, 64, 64, -64, 64, 64, -64, 64, -64, 64, 64, 64, 64, 64, 64, 64, 64, -64, -64, -64, -64, -64, -64, -64, 64, -64, 64, -64, 64, -64, -64, -64, 64, -64, -64, 64, 64, 64, 64, 64, 64, 64, -64, -64, -64, 64, -64, -64, -64, -64, -64, -64, -64, -64, -64, -64, 64, 64, 64, 64, 64, 64, -64, -64, -64, 64, -64, 64, 64, 64, -64, -64, -64, -64, -64, -64, -64, -64, -64, -64, -64, -64, -64, -64, -64, 64, -64, 64, 64, 64, 64, 64, -64, 64, 64, 64, 64, 64, -64, -64, -64, -64, -64, -64, -64, -64, -64, -64, 64, 64, -64, -64, 64, 64, 64, 64, -64, -64, 64, 64, 64, 64, 64, 64, -64, 64, 64, -64, -64, -64, -64, -64, -64, -64, -64, -64, -64, -64, -64, -64, 64, 64, 64, 64, -64, -64, 64, -64, -64, 64, 64, 64, -64, 64, 64, -64, -64, -64, -64, -64, -64, -64, -64, -64, -64, -64, 64, -64, 64, 64, 64, 64, 64, -64, -64, -64, 64, 64, 64, -64, 64, -64, 64, -64, -64, -64, -64, -64, -64, -64, -64, -64, 64, 64, 64, -64, 64, 64, 64, 64, -64, 64, -64, -64, -64, 64, 64, 64, -64, -64, -64, 64, -64, -64, -64, -64, -64, -64, -64, -64, 64, -64, 64, 64, 64, 64, -64, 64, -64, 64, 64, -64, -64, 64, 64, -64, 64, -64, -64, -64, 64, 64, -64, -64, 64, -64, -64, 64, -64, 64, 64, 64, 64, 64, 64, 64, -64, 64, 64, 64, -64, -64, 64, 64, -64, -64, -64, 64, 64, 64, 64, -64, -64, -64, 64, 64, 64, 64, 64, 64, 64, 64, -64, -64, -64, -64, 64, 64, -64, 64, 64, 64, -64, 64, -64, -64, 64, 64, 64, -64, -64, 64, -64, 64, 64, -64, 64, 64, 64, 64, -64, 64, 64, -64, -64, 64, -64, -64, -64, -64, -64, 64, 64, 64, 64, 64, 64, -64, -64, 64, -64, -64, 64, 64, -64, -64, -64, -64, -64, -64, 64, 64, -64, -64, -64, 64, -64, -64, -64, 64, 64, 64, 64, 64, -64, -64, 64, -64, 64, 64, 64, 64, 64, -64, -64, 64, 64, 64, -64, 64, 64, 64, 64, -64, -64, 64, 64, -64, -64, -64, -64, 64, -64, -64, 64, -64, 64, 64, -64, 64, 64, 64, -64, -64, 64, -64, -64, -64, 64, -64, 64, 64, -64, 64, -64, 64, -64, -64, -64, -64, -64, -64, -64, 64, 64, 64, 64, -64, -64, 64, 64, 64, 64, -64, -64, 64, 64, 64, 64, 64, -64, -64, -64, -64, -64, 64, -64, -64, 64, 64, -64, -64, 64, 64, 64, 64, -64, 64, -64, 64, 64, 64, -64, 64, -64, 64, -64, 64, 64, 64, 64, -64, -64, 64, -64, 64, 64, -64, 64, 64, 64, 64, 64, -64, -64, -64, -64, 64, 64, -64, 64, -64, 64, -64, -64, 64, 64, 64, -64, 64, 64, -64, -64, 64, -64, 64, 64, -64, 64, 64, -64, -64, -64, -64, -64, -64, 64, 64, 64, -64, -64, 64, -64, 64, 64, 64, -64, 64, -64, -64, 64, -64, -64, 64, 64, -64, -64, 64, -64, -64, 64, -64, -64, 64, -64, 64, 64, -64, -64, -64, -64, 64, 64, 64, 64, -64, 64, 64, -64, -64, -64, -64, -64, -64, 64, -64, -64, 64, 64, 64, -64, 64, 64, 64, -64, -64, -64, -64, -64, -64, 64, 64, 64, -64, 64, 64, -64, 64, -64, 64, -64, 64, -64, -64, -64, 64, 64, 64, 64, 64, 64, -64, 64, 64, -64, -64, 64, -64, 64, 64, -64, 64, 64, 64, 64, -64, -64, -64, -64, 64, 64, -64, -64, -64, 64, 64, -64, -64, 64, 64, -64, -64, 64, 64, -64, 64, -64, 64, -64, 64, 64, -64, -64, -64, -64, 64, 64, -64, -64, -64, -64, 64, -64, -64, 64, 64, -64, -64, 64, 64, -64, 64, 64, 64, -64, 64, -64, -64, -64, -64, -64, -64, 64, 64, -64, -64, 64, -64, 64, 64, 64, -64, -64, 64, -64, -64, 64, 64, -64, -64, -64, -64, -64, -64, 64, 64, -64, -64, -64, -64, -64, -64, -64, -64, -64, -64, -64, -64, 64, -64, 64, 64, 64, 64, 64, 64, -64, 64, -64, 64, -64, -64, -64, -64, -64, -64, -64, 64, 64, 64, -64, -64, 64, 64, -64, -64, -64, -64, -64, 64, -64, -64, -64, -64, -64, 64, -64, 64, -64, -64, -64, -64, 64, -64, -64, -64, 64, 64, -64, 64, 64, -64, -64, -64, -64, -64, -64, -64, -64, -64, -64, 64, -64, -64, 64, -64, -64, -64, -64, -64, -64, -64, -64, 64, 64, 64, 64, 64, -64, -64, 64, -64, -64, -64, -64, 64, -64, -64, 64, -64, -64, -64, 64, -64, -64, 64, 64, -64, -64, -64, -64, 64, -64, 64, -64, -64, -64, 64, -64, -64, -64, -64, 64, -64, 64, 64, -64, 64, 64, 64, 64, -64, 64, -64, -64, -64, -64, -64, 64, -64, 64, -64, -64, -64, -64, -64, -64, -64, -64, -64, 64, 64, 64, -64, 64, -64, 64, -64, -64, 64, 64, 64, -64, -64, 64, -64, 64, -64, 64, -64, -64, -64, -64, 64, -64, -64, -64, 64, 64, -64, 64, 64, 64, 64, 64, 64, -64, 64, 64, 64, -64, 64, -64, -64, 64, 64, -64, -64, -64, 64, -64, -64, 64, -64, -64, -64, -64, 64, 64, 64, -64, -64, 64, -64, -64, 64, 64, -64, 64, 64, -64, -64, -64, 64, -64, -64, -64, -64, 64, 64, 64, -64, -64, -64, -64, -64, -64, -64, 64, -64, -64, 64, 64, -64, -64, 64, 64, -64, 64, -64, -64, -64, -64, -64, -64, -64, -64, -64, 64, 64, 64, -64, 64, -64, 64, -64, 64, -64, 64, -64, -64, -64, -64, -64, -64, -64, 64, -64, 64, 64, 64, -64, -64, -64, -64, -64, -64, 64, 64, -64, -64, 64, -64, -64, -64, 64, 64, 64, 64, 64, -64, 64, -64, 64, -64, 64, 64, -64, -64, -64, -64, -64, 64, 64, -64, -64, 64, -64, -64, -64, 64, -64, -64, -64, 64, -64, 64, 64, -64, 64, -64, -64, 64, -64, -64, 64, -64, -64, -64, 64, 64, 64, 64, 64, 64, 64, -64, -64, 64, 64, -64, 64, -64, 64, -64, -64, -64, -64, -64, -64, -64, -64, -64, -64, -64, -64, 64, -64, 64, 64, -64, 64, 64, -64, -64, 64, 64, 64, 64, 64, -64, -64, 64, -64, -64, -64, -64, -64, 64, -64, 64, -64, -64, -64, -64, -64, 64, 64, 64, 64, 64, 64, 64, -64, 64, -64, 64, -64, -64, -64, 64, -64, 64, -64, -64, -64, -64, 64, 64, -64, 64, -64, 64, -64, 64, 64, 64, 64, 64, 64, 64, 64, 64, 64, -64, -64, -64, -64, 64, 64, 64, -64, -64, 64, -64, -64, -64, -64, -64, 64, -64, -64, -64, -64, 64, -64, 64, -64, 64, 64, -64, -64, -64, -64, 64, 64, 64, 64, 64, -64, -64, -64, -64, 64, -64, 64, 64, 64, -64, 64, 64, -64, 64, 64, -64, -64, -64, -64, 64, -64, -64, -64, -64, -64, -64, -64, -64, -64, 64, -64, 64, -64, -64, -64, -64, -64, -64, -64, -64, -64, -64, 64, -64, 64, 64, 64, -64, 64, -64, -64, 64, 64, -64, 64, 64, 64, -64, 64, -64, 64, 64, -64, 64, -64, 64, -64, 64, 64, -64, 64, 64, -64, 64, 64, -64, -64, -64, -64, -64, 64, 64, -64, 64, 64, 64, -64, 64, -64, 64, 64, 64, 64, 64, -64, -64, 64, 64, 64, 64, 64, -64, 64, 64, 64, -64, 64, 64, 64, -64, -64, -64, 64, -64, -64, -64, -64, 64, 64, -64, -64, 64, -64, 64, 64, 64, -64, 64, -64, 64, 64, 64, 64, 64, 64, -64, -64, 64, -64, 64, -64, -64, 64, -64, -64, -64, -64, 64, 64, 64, 64, 64, 64, 64, 64, -64, 64, -64, 64, -64, 64, -64, 64, -64, -64, -64, 64, 64, 64, -64, -64, -64, -64, -64, -64, -64, -64, 64, 64, 64, 64, 64, 64, 64, 64, -64, 64, 64, 64, -64, 64, 64, -64, 64, -64, -64, -64, -64, -64, -64, -64, -64, -64, -64, 64, 64, -64, 64, -64, 64, 64, 64, 64, -64, 64, 64, 64, 64, 64, -64, -64, -64, 64, -64, 64, 64, -64, -64, -64, -64, -64, 64, 64, 64, 64, 64, -64, 64, -64, -64, 64, 64, 64, 64, 64, 64, 64, 64, -64, -64, 64, 64, -64, 64, -64, -64, -64, -64, 64, 64, 64, 64, 64, 64, 64, 64, 64, -64, -64, 64, 64, 64, -64, -64, 64, 64, -64, -64, -64, -64, -64, -64, -64, -64, -64, -64, -64, 64, 64, -64, 64, 64, 64, 64, 64, 64, -64, -64, -64, -64, 64, 64, -64, 64, -64, -64, -64, 64, -64, -64, -64, -64, -64, -64, 64, -64, -64, 64, 64, 64, 64, -64, 64, 64, -64, 64, -64, 64, 64, 64, -64, -64, -64, -64, -64, -64, -64, -64, -64, -64, -64, -64, 64, 64, 64, 64, 64, 64, -64, 64, 64, 64, -64, -64, -64, 64, 64, 64, -64, 64, -64, 64, 64, 64, -64, -64, -64, -64, -64, -64, -64, 64, 64, 64, 64, 64, -64, 64, 64, 64, -64, -64, 64, 64, 64, 64, 64, 64, -64, 64, 64, -64, -64, -64, -64, -64, -64, -64, 64, 64, 64, 64, 64, 64, -64, -64, -64, -64, -64, -64, 64, 64, -64, -64, -64, 64, -64, -64, -64, -64, -64, -64, -64, -64, 64, 64, 64, 64, 64, -64, -64, -64, -64, -64, -64, -64, -64, -64, -64, -64, -64, -64, 64, 64, -64, -64, 64, -64, -64, -64, -64, -64, -64, 64, 64, 64, -64, 64, -64, -64, -64, -64, -64, -64, -64, -64, -64, -64, -64, -64, -64, -64, -64, 64, -64, -64, -64, -64, -64, -64, -64, 64, 64, 64, 64, 64, -64, -64, -64, -64, -64, -64, -64, -64, -64, -64, -64, -64, -64, 64, -64, 64, -64, 64, -64, -64, -64, -64, 64, 64, -64, 64, -64, 64, -64, -64, -64, 64, -64, -64, -64, -64, -64, -64, -64, -64, -64, -64, 64, -64, -64, -64, -64, -64, -64, -64, 64, 64, 64, 64, 64, 64, -64, 64, 64, 64, -64, -64, -64, -64, -64, -64, 64, -64, -64, -64, -64, 64, -64, -64, -64, -64, 64, 64, -64, -64, -64, -64, 64, -64, -64, 64, 64, -64, -64, -64, -64, -64, -64, -64, 64, 64, -64, -64, -64, 64, -64, -64, -64, -64, -64, -64, 64, 64, 64, -64, 64, 64, 64, 64, 64, 64, -64, -64, -64, -64, -64, -64, -64, -64, 64, 64, 64, 64, -64, -64, -64, -64, -64, -64, -64, -64, 64, 64, 64, -64, 64, 64, 64, 64, -64, -64, -64, 64, -64, -64, -64, -64, 64, -64, -64, 64, 64, 64, -64, -64, -64, -64, -64, -64, 64, 64, 64, 64, 64, 64, 64, 64, -64, -64, -64, -64, -64, 64, -64, -64, -64, -64, -64, 64, 64, 64, 64, 64, -64, -64, -64, -64, 64, 64, 64, 64, -64, 64, -64, -64, -64, -64, -64, -64, -64, -64, -64, -64, 64, 64, 64, 64, 64, 64, 64, 64, -64, -64, -64, -64, 64, 64, 64, 64, 64, -64, -64, -64, -64, -64, -64, -64, -64, 64, 64, -64, -64, 64, -64, 64, -64, -64, -64, -64, -64, -64, -64, -64, -64, 64, 64, 64, 64, 64, 64, -64, -64, -64, -64, -64, -64, 64, -64, -64, 64, -64, -64, -64, 64, -64, -64, -64, -64, 64, 64, 64, 64, 64, 64, 64, 64, 64, 64, 64, 64, 64, -64, 64, -64, -64, 64, -64, 64, 64, 64, 64, -64, 64, 64, 64, 64, 64, 64, 64, 64, 64, 64, -64, -64, 64, 64, 64, -64, 64, -64, 64, -64, -64, -64, 64, 64, -64, 64, 64, 64, 64, 64, 64, -64, 64, 64, -64, -64, -64, 64, 64, 64, -64, -64, 64, 64, -64, -64, 64, -64, 64, -64, 64, 64, -64, 64, -64, -64, 64, -64, -64, -64, 64, -64, -64, 64, -64, 64, -64, 64, -64, 64, -64, -64, 64, 64, -64, -64, 64, -64, 64, 64, 64, -64, 64, 64, -64, 64, 64, -64, -64, 64, -64, -64, 64, -64, -64, 64, 64, 64, 64, -64, -64, -64, -64, -64, -64, -64, -64, -64, -64, -64, 64, 64, 64, 64, 64, -64, 64, -64, -64, -64, 64, 64, 64, 64, 64, 64, 64, -64, -64, -64, -64, -64, 64, 64, -64, -64, -64, -64, 64, 64, -64, 64, -64, -64, -64, 64, 64, 64, -64, 64, 64, 64, 64, -64, -64, -64, -64, -64, -64, -64, -64, -64, 64, -64, -64, 64, -64, -64, 64, -64, 64, -64, -64, 64, 64, 64, 64, -64, 64, -64, -64, 64, -64, -64, -64, -64, -64, -64, -64, -64, -64, 64, -64, 64, 64, 64, -64, 64, -64, 64, -64, -64, 64, -64, 64, 64, 64, 64, 64, -64, -64, -64, -64, -64, -64, -64, -64, -64, 64, -64, 64, -64, -64, -64, -64, -64, 64, -64, -64, -64, -64, -64, 64, -64, 64, 64, -64, -64, -64, -64, -64, -64, 64, -64, 64, -64, -64, -64, -64, 64, 64, 64, -64, 64, -64, -64, -64, -64, -64, -64, -64, 64, 64, -64, -64, -64, -64, -64, -64, -64, -64, -64, -64, -64, 64, 64, 64, -64, 64, 64, -64, -64, -64, -64, -64, -64, -64, -64, 64, 64, -64, -64, -64, 64, -64, -64, -64, -64, -64, -64, 64, -64, -64, 64, 64, 64, 64, 64, -64, -64, -64, -64, -64, -64, -64, -64, 64, 64, 64, 64, -64, 64, -64, -64, -64, -64, 64, -64, 64, -64, 64, 64, -64, -64, 64, -64, -64, 64, -64, -64, -64, -64, -64, -64, -64, 64, 64, 64, 64, -64, -64, -64, 64, 64, -64, 64, 64, -64, -64, -64, -64, 64, 64, -64, -64, -64, -64, -64, -64, -64, -64, -64, 64, 64, 64, 64, 64, -64, -64, -64, -64, -64, 64, 64, 64, 64, 64, 64, -64, 64, 64, -64, 64, -64, -64, -64, -64, -64, -64, -64, -64, 64, 64, 64, 64, -64, -64, -64, -64, -64, -64, -64, -64, 64, -64, -64, -64, -64, -64, 64, -64, -64, -64, -64, -64, -64, -64, -64, 64, 64, -64, -64, -64, -64, -64, -64, -64, -64, -64, -64, -64, -64, 64, -64, 64, -64, 64, 64, -64, -64, 64, -64, -64, -64, 64, 64, 64, 64, 64, -64, 64, -64, -64, -64, -64, -64, -64, -64, -64, 64, 64, -64, -64, 64, 64, 64, -64, -64, -64, -64, -64, -64, 64, -64, -64, 64, 64, 64, -64, -64, -64, -64, -64, -64, -64, -64, -64, -64, 64, -64, 64, -64, -64, -64, 64, -64, 64, 64, 64, -64, -64, -64, -64, -64, -64, 64, 64, -64, -64, -64, -64, -64, -64, -64, -64, 64, -64, 64, 64, -64, 64, -64, -64, 64, 64, 64, 64, -64, -64, -64, -64, 64, 64, -64, -64, -64, -64, -64, -64, -64, -64, -64, -64, -64, -64, -64, 64, -64, 64, 64, -64, -64, 64, 64, 64, 64, -64, 64, -64, 64, 64, -64, 64, -64, 64, 64, 64, 64, 64, -64, -64, 64, -64, 64, -64, -64, 64, 64, -64, -64, -64, 64, 64, 64, -64, -64, 64, 64, 64, 64, 64, 64, -64, 64, -64, 64, -64, 64, 64, 64, 64, 64, 64, -64, 64, -64, -64, -64, -64, 64, -64, -64, 64, -64, -64, 64, -64, -64, -64, -64, -64, 64, -64, 64, 64, 64, 64, 64, 64, 64, 64, -64, -64, 64, -64, -64, -64, -64, -64, -64, -64, -64, -64, -64, 64, 64, -64, -64, 64, 64, 64, 64, 64, 64, 64, -64, -64, -64, 64, 64, 64, 64, -64, -64, 64, -64, -64, -64, -64, -64, -64, 64, -64, -64, -64, 64, -64, 64, 64, 64, 64, 64, 64, 64, 64, 64, 64, -64, -64, 64, 64, 64, -64, -64, -64, -64, -64, -64, -64, -64, -64, -64, -64, -64, 64, -64, -64, 64, 64, -64, 64, -64, -64, -64, 64, -64, -64, -64, 64, 64, -64, -64, -64, -64, -64, -64, -64, 64, -64, -64, -64, -64, 64, -64, 64, 64, 64, -64, -64, 64, 64, 64, -64, 64, 64, -64, -64, 64, -64, -64, -64, -64, -64, -64, -64, -64, -64, -64, -64, -64, -64, -64, -64, -64, 64, -64, -64, 64, -64, 64, 64, 64, -64, -64, 64, 64, -64, -64, -64, 64, -64, -64, -64, -64, -64, -64, -64, -64, -64, 64, -64, 64, -64, 64, 64, 64, 64, -64, -64, -64, 64, -64, -64, -64, -64, -64, -64, -64, -64, 64, 64, 64, 64, -64, 64, -64, 64, 64, 64, -64, -64, -64, -64, 64, -64, 64, 64, 64, 64, 64, 64, 64, 64, 64, 64, 64, -64, 64, -64, -64, -64, 64, 64, -64, 64, -64, -64, -64, -64, -64, -64, -64, -64, 64, 64, 64, -64, 64, -64, 64, 64, -64, 64, -64, -64, -64, -64, -64, -64, 64, -64, -64, 64, 64, -64, 64, -64, -64, 64, -64, -64, -64, -64, -64, 64, -64, -64, 64, 64, 64, 64, 64, 64, -64, 64, -64, -64, 64, -64, -64, 64, 64, 64, 64, 64, 64, -64, -64, -64, -64, 64, 64, -64, -64, -64, -64, -64, 64, -64, -64, -64, 64, 64, 64, 64, 64, 64, -64, 64, 64, -64, 64, 64, -64, -64, 64, 64, 64, 64, 64, 64, 64, 64, -64, -64, -64, -64, -64, 64, 64, -64, -64, -64, 64, 64, 64, 64, 64, 64, -64, 64, -64, -64, 64, -64, 64, -64, -64, 64, -64, 64, -64, -64, 64, 64, -64, -64, 64, -64, 64, 64, 64, -64, 64, 64, 64, -64, 64, -64, -64, -64, 64, 64, 64, -64, 64, 64, -64, 64, 64, -64, -64, 64, -64, 64, 64, 64, -64, -64, -64, -64, -64, 64, 64, 64, 64, 64, -64, 64, -64, 64, 64, -64, 64, -64, -64, 64, 64, 64, -64, 64, 64, -64, 64, 64, -64, 64, 64, 64, -64, 64, 64, -64, -64, 64, 64, -64, -64, 64, -64, -64, -64, -64, 64, 64, 64, -64, 64, 64, 64, 64, 64, 64, 64, 64, -64, -64, 64, 64, 64, 64, 64, -64, -64, 64, 64, -64, 64, 64, 64, -64, 64, 64, -64, -64, 64, 64, 64, 64, 64, -64, -64, 64, 64, 64, 64, 64, 64, -64, 64, -64, 64, 64, -64, 64, 64, -64, 64, 64, -64, 64, -64, -64, 64, 64, -64, -64, 64, 64, -64, -64, 64, -64, 64, -64, 64, 64, 64, 64, 64, -64, -64, -64, -64, -64, -64, -64, 64, 64, -64, 64, 64, -64, -64, 64, -64, 64, -64, 64, 64, 64, 64, 64, 64, 64, -64, -64, 64, -64, -64, 64, -64, 64, -64, 64, 64, 64, 64, -64, 64, 64, -64, -64, -64, -64, -64, -64, 64, -64, 64, 64, 64, 64, 64, -64, 64, -64, 64, -64, -64, 64, -64, 64, 64, 64, 64, 64, 64, 64, 64, 64, 64, 64, 64, 64, 64, 64, 64, 64, 64, 64, 64, -64, 64, -64, 64, 64, 64, -64, -64, 64, 64, 64, 64, 64, 64, 64, 64, 64, 64, 64, -64, 64, -64, 64, 64, 64, 64, 64, -64, -64, -64, 64, -64, -64, 64, 64, 64, 64, -64, -64, 64, 64, -64, 64, -64, 64, -64, 64, -64, 64, 64, 64, -64, -64, -64, -64, 64, -64, 64, 64, -64, 64, 64, 64, 64, 64, -64, -64, 64, -64, 64, 64, -64, 64, 64, 64, 64, 64, 64, 64, 64, 64, 64, 64, 64, 64, -64, 64, -64, -64, 64, -64, -64, -64, -64, -64, -64, 64, -64, 64, 64, -64, 64, -64, 64, 64, 64, 64, -64, 64, -64, 64, 64, -64, 64, 64, -64, 64, -64, -64, 64, -64, 64, -64, -64, -64, 64, -64, 64, -64, 64, 64, -64, 64, -64, 64, -64, 64, 64, -64, -64, 64, -64, -64, 64, -64, -64, -64, 64, 64, 64, 64, -64, 64, 64, 64, 64, 64, 64, 64, -64, 64, 64, 64, -64, 64, 64, -64, 64, -64, -64, 64, 64, 64, -64, -64, 64, 64, 64, -64, 64, 64, -64, 64, -64, 64, 64, -64, 64, 64, 64, 64, 64, 64, -64, -64, 64, -64, -64, -64, 64, -64, 64, 64, 64, -64, -64, 64, -64, -64, -64, 64, -64, -64, -64, 64, 64, 64, 64, 64, 64, -64, -64, -64, 64, -64, -64, -64, 64, -64, -64, 64, -64, 64, 64, 64, -64, 64, 64, -64, 64, -64, -64, -64, 64, 64, -64, 64, 64, -64, 64, -64, 64, 64, -64, 64, -64, -64, 64, -64, 64, 64, -64, 64, 64, 64, -64, -64, 64, 64, -64, 64, 64, -64, 64, 64, -64, -64, -64, 64, -64, -64, 64, -64, -64, -64, -64, 64, 64, 64, -64, -64, 64, 64, 64, 64, -64, -64, 64, 64, 64, -64, -64, 64, 64, 64, 64, 64, 64, -64, -64, -64, 64, 64, -64, 64, 64, 64, 64, -64, 64, -64, -64, -64, 64, 64, -64, 64, 64, 64, -64, -64, 64, -64, -64, -64, -64, -64, 64, -64, 64, -64, -64, -64, 64, -64, 64, -64, -64, 64, -64, 64, 64, -64, -64, 64, 64, -64, 64, -64, 64, 64, 64, 64, 64, -64, 64, -64, -64, 64, 64, 64, 64, 64, -64, 64, 64, 64, 64, 64, 64, 64, -64, -64, 64, 64, 64, 64, 64, -64, 64, -64, -64, 64, -64, -64, 64, -64, -64, -64, -64, -64, -64, -64, 64, 64, -64, -64, 64, -64, -64, -64, 64, -64, 64, -64, 64, 64, 64, 64, -64, -64, 64, 64, -64, 64, -64, 64, 64, -64, -64, -64, -64, -64, 64, -64, 64, 64, -64, -64, -64, -64, -64, 64, -64, 64, 64, -64, 64, 64, 64, 64, 64, 64, 64, -64, 64, 64, -64, -64, 64, 64, -64, -64, 64, -64, -64, 64, -64, 64, 64, 64, -64, -64, -64, -64, -64, -64, 64, 64, 64, -64, 64, 64, 64, -64, -64, -64, 64, 64, -64, 64, -64, -64, 64, -64, -64, 64, 64, 64, 64, 64, 64, 64, 64, -64, 64, 64, 64, 64, 64, -64, 64, 64, -64, -64, 64, -64, -64, -64, -64, -64, -64, -64, 64, 64, 64, 64, -64, -64, 64, 64, 64, 64, 64, 64, 64, 64, 64, 64, -64, -64, -64, -64, 64, -64, -64, -64, -64, -64, -64, -64, 64, -64, -64, -64, -64, -64, 64, 64, 64, -64, -64, -64, -64, 64, 64, 64, 64, -64, -64, -64, -64, -64, -64, 64, 64, -64, 64, 64, -64, -64, 64, -64, 64, -64, 64, 64, -64, -64, -64, -64, -64, 64, -64, 64, -64, 64, -64, -64, 64, 64, -64, 64, 64, 64, 64, 64, 64, 64, -64, 64, 64, 64, 64, 64, -64, -64, -64, 64, 64, 64, 64, -64, -64, 64, -64, -64, 64, -64, -64, -64, -64, -64, 64, 64, -64, 64, 64, -64, 64, 64, -64, 64, -64, 64, 64, 64, 64, 64, 64, -64, 64, -64, -64, -64, -64, -64, -64, -64, -64, 64, -64, 64, -64, 64, 64, 64, 64, 64, 64, 64, 64, 64, 64, 64, 64, 64, 64, -64, 64, 64, -64, -64, 64, -64, -64, -64, -64, -64, -64, -64, 64, 64, 64, -64, -64, 64, 64, 64, 64, 64, 64, 64, 64, 64, -64, 64, 64, -64, -64, 64, -64, 64, 64, -64, -64, -64, -64, 64, 64, 64, 64, 64, 64, 64, 64, 64, 64, -64, -64, 64, 64, 64, 64, 64, -64, 64, -64, -64, -64, 64, 64, -64, -64, -64, -64, 64, 64, 64, 64, 64, 64, 64, 64, 64, -64, 64, 64, 64, 64, 64, 64, 64, -64, -64, -64, -64, -64, 64, -64, -64, -64, -64, -64, -64, 64, 64, 64, 64, 64, 64, 64, -64, -64, -64, -64, 64, -64, 64, -64, 64, -64, 64, 64, -64, -64, 64, -64, -64, -64, -64, 64, -64, 64, 64, -64, 64, -64, 64, 64, 64, -64, -64, -64, -64, -64, 64, -64, -64, 64, 64, 64, 64, -64, -64, -64, -64, -64, -64, 64, 64, -64, -64, 64, 64, 64, 64, 64, 64, -64, -64, -64, -64, -64, 64, -64, 64, 64, -64, 64, 64, -64, -64, -64, -64, -64, -64, 64, -64, -64, -64, -64, 64, 64, 64, 64, -64, -64, -64, -64, -64, -64, -64, -64, -64, -64, 64, 64, -64, 64, -64, 64, -64, -64, -64, -64, -64, -64, 64, -64, 64, 64, -64, 64, -64, -64, -64, -64, -64, 64, -64, -64, -64, -64, 64, 64, 64, -64, 64, 64, -64, 64, -64, -64, -64, 64, 64, 64, 64, 64, 64, -64, -64, -64, -64, -64, 64, -64, 64, -64, -64, -64, -64, 64, -64, 64, 64, 64, 64, 64, 64, -64, 64, 64, 64, 64, 64, 64, 64, -64, -64, -64, -64, -64, 64, 64, -64, 64, 64, -64, 64, -64, 64, 64, 64, 64, 64, 64, 64, 64, -64, 64, 64, 64, 64, 64, -64, -64, -64, -64, -64, -64, -64, 64, 64, -64, 64, 64, 64, -64, -64, 64, 64, 64, -64, 64, 64, 64, 64, -64, -64, 64, 64, -64, -64, -64, -64, -64, -64, -64, -64, -64, -64, 64, -64, 64, 64, 64, 64, 64, 64, 64, 64, 64, 64, 64, 64, -64, -64, -64, -64, -64, -64, -64, -64, -64, -64, -64, 64, -64, -64, 64, 64, 64, -64, 64, 64, 64, 64, 64, -64, 64, 64, -64, -64, -64, -64, -64, -64, -64, -64, -64, -64, -64, -64, 64, 64, 64, 64, -64, 64, -64, 64, 64, 64, 64, 64, 64, 64, 64, 64, 64, 64, 64, -64, -64, -64, -64, -64, -64, -64, -64, -64, -64, 64, 64, -64, -64, -64, -64, 64, 64, 64, 64, 64, 64, 64, -64, 64, 64, 64, 64, 64, 64, 64, 64, 64, -64, -64, -64, 64, 64, 64, 64, 64, -64, 64, -64, -64, -64, -64, 64, 64, 64, 64, 64, 64, 64, 64, 64, 64, 64, 64, 64, 64, 64, 64, 64, 64, -64, 64, -64, 64, -64, -64, -64, -64, 64, -64, -64, 64, -64, -64, -64, 64, -64, 64, 64, 64, -64, -64, -64, 64, 64, 64, -64, -64, 64, 64, -64, 64, -64, -64, 64, -64, 64, -64, 64, 64, 64, -64, -64, 64, 64, 64, 64, -64, -64, 64, 64, 64, 64, 64, -64, -64, 64, 64, -64, -64, 64, 64, 64, -64, -64, 64, -64, -64, 64, -64, 64, -64, -64, 64, -64, 64, 64, -64, 64, 64, 64, 64, 64, -64, -64, 64, 64, 64, -64, -64, 64, 64, -64, -64, 64, 64, -64, 64, 64, -64, -64, 64, -64, 64, 64, -64, -64, -64, 64, -64, 64, -64, 64, 64, -64, 64, 64, -64, 64, -64, -64, -64, -64, 64, 64, 64, 64, 64, 64, 64, 64, 64, -64, -64, -64, -64, 64, -64, -64, -64, -64, 64, -64, 64, 64, -64, 64, -64, 64, 64, 64, 64, 64, 64, 64, -64, -64, 64, -64, -64, -64, 64, -64, -64, 64, -64, -64, 64, -64, -64, -64, -64, 64, 64, 64, -64, 64, -64, -64, -64, 64, 64, -64, -64, -64, 64, -64, 64, -64, -64, -64, 64, 64, 64, 64, -64, 64, 64, 64, 64, 64, -64, -64, -64, 64, 64, 64, 64, 64, 64, 64, -64, 64, -64, 64, 64, 64, -64, -64, 64, 64, -64, 64, 64, 64, -64, -64, 64, -64, -64, -64, -64, -64, 64, -64, 64, 64, 64, 64, 64, -64, -64, -64, -64, 64, 64, -64, -64, 64, 64, -64, -64, 64, -64, -64, 64, -64, 64, -64, 64, -64, 64, -64, -64, 64, 64, -64, 64, 64, -64, -64, -64, 64, 64, 64, 64, 64, 64, 64, -64, 64, 64, -64, -64, -64, 64, 64, 64, -64, -64, -64, -64, -64, 64, 64, 64, 64, 64, 64, 64, 64, 64, 64, 64, 64, 64, 64, 64, 64, 64, -64, 64, 64, -64, -64, -64, 64, -64, -64, 64, 64, 64, -64, 64, 64, -64, 64, 64, 64, 64, 64, 64, 64, 64, 64, 64, 64, 64, -64, 64, 64, 64, -64, -64, -64, -64, 64, -64, 64, 64, 64, -64, -64, -64, 64, -64, 64, -64, 64, 64, 64, 64, 64, 64, 64, 64, 64, 64, -64, -64, 64, -64, -64, -64, 64, 64, 64, 64, 64, 64, -64, 64, 64, 64, 64, -64, -64, -64, 64, 64, 64, 64, 64, 64, -64, -64, 64, 64, -64, 64, -64, -64, 64, -64, 64, -64, 64, -64, 64, -64, 64, -64, -64, -64, -64, -64, -64, 64, 64, 64, 64, 64, 64, 64, 64, 64, -64, 64, 64, -64, 64, -64, 64, -64, 64, 64, 64, -64, -64, -64, 64, -64, -64, -64, -64, -64, -64, 64, 64, 64, 64, -64, 64, 64, 64, -64, 64, 64, 64, 64, 64, 64, 64, 64, 64, 64, 64, 64, 64, 64, -64, 64, -64, -64, -64, -64, 64, 64, 64, -64, -64, 64, 64, -64, -64, 64, 64, 64, 64, 64, 64, 64, 64, 64, 64, 64, 64, 64, 64, -64, -64, -64, -64, -64, 64, 64, 64, 64, -64, -64, -64, 64, -64, 64, -64, 64, 64, 64, 64, 64, 64, 64, 64, 64, 64, 64, -64, 64, -64, -64, -64, -64, -64, 64, 64, -64, -64, -64, 64, 64, -64, -64, 64, 64, 64, 64, 64, 64, 64, 64, 64, 64, 64, 64, -64, 64, -64, -64, -64, -64, 64, 64, 64, 64, 64, 64, 64, -64, -64, -64, -64, 64, 64, 64, 64, 64, 64, 64, 64, 64, 64, 64, 64, -64, -64, -64, -64, -64, 64, 64, 64, -64, 64, 64, 64, -64, -64, -64, -64, 64, -64, -64, 64, 64, 64, 64, 64, -64, -64, 64, -64, 64, -64, -64, 64, -64, -64, 64, 64, 64, 64, -64, -64, 64, -64, -64, -64, -64, -64, -64, -64, -64, 64, -64, -64, 64, -64, -64, -64, -64, -64, -64, 64, 64, -64, -64, 64, 64, 64, -64, 64, 64, -64, -64, -64, -64, 64, -64, -64, -64, -64, 64, -64, -64, -64, -64, 64, 64, -64, -64, 64, 64, 64, -64, -64, -64, 64, 64, -64, -64, 64, -64, 64, -64, 64, 64, -64, 64, 64, -64, 64, -64, 64, 64, 64, -64, 64, 64, 64, 64, -64, -64, -64, -64, -64, 64, -64, -64, -64, -64, 64, -64, 64, -64, -64, 64, 64, 64, -64, -64, -64, -64, -64, 64, 64, 64, 64, 64, 64, 64, 64, -64, -64, -64, 64, -64, 64, -64, -64, -64, -64, -64, -64, -64, -64, -64, -64, 64, 64, 64, 64, 64, 64, 64, 64, 64, 64, -64, 64, -64, 64, 64, 64, -64, 64, -64, 64, -64, 64, -64, -64, 64, 64, 64, 64, 64, 64, -64, 64, 64, 64, 64, 64, 64, -64, 64, 64, -64, -64, -64, 64, -64, -64, 64, -64, 64, -64, 64, 64, -64, -64, -64, -64, 64, -64, 64, 64, 64, 64, 64, 64, -64, 64, 64, 64, -64, 64, 64, 64, -64, -64, -64, 64, -64, -64, -64, 64, 64, -64, 64, -64, 64, 64, 64, -64, -64, 64, 64, 64, 64, -64, -64, 64, 64, -64, 64, 64, 64, 64, -64, 64, 64, 64, -64, 64, -64, -64, -64, 64, 64, 64, -64, 64, 64, -64, -64, -64, -64, 64, -64, 64, -64, 64, 64, -64, 64, 64, 64, -64, -64, -64, -64, -64, -64, -64, -64, -64, -64, -64, -64, -64, 64, -64, -64, -64, -64, -64, 64, -64, 64, -64, 64, 64, 64, 64, 64, 64, 64, -64, 64, -64, -64, -64, -64, -64, -64, -64, -64, -64, 64, -64, 64, -64, -64, -64, 64, -64, 64, -64, 64, 64, -64, -64, 64, 64, 64, 64, 64, 64, -64, -64, -64, -64, -64, -64, -64, 64, 64, 64, 64, 64, 64, 64, 64, 64, 64, 64, -64, -64, -64, 64, 64, 64, -64, 64, 64, 64, 64, 64, -64, -64, 64, 64, 64, 64, 64, 64, 64, -64, -64, -64, -64, -64, -64, -64, -64, 64, 64, -64, 64, 64, 64, -64, 64, 64, -64, -64, -64, -64, 64, 64, 64, 64, 64, 64, 64, -64, -64, -64, -64, -64, 64, -64, 64, 64, 64, 64, 64, 64, 64, 64, 64, 64, -64, 64, -64, 64, 64, 64, 64, 64, 64, 64, -64, -64, -64, -64, -64, 64, -64, 64, 64, 64, -64, -64, 64, 64, -64, 64, 64, 64, -64, 64, 64, 64, 64, 64, 64, 64, 64, -64, -64, -64, 64, -64, 64, 64, 64, -64, -64, -64, 64, -64, -64, 64, -64, -64, 64, -64, 64, 64, 64, 64, 64, 64, 64, 64, 64, -64, 64, -64, -64, 64, 64, 64, 64, 64, -64, 64, 64, -64, 64, 64, 64, 64, 64, 64, 64, 64, 64, 64, 64, 64, 64, -64, 64, 64, 64, -64, 64, 64, 64, 64, -64, 64, 64, 64, -64, 64, 64, 64, 64, 64, 64, 64, -64, 64, 64, 64, 64, 64, 64, 64, 64, 64, 64, 64, 64, 64, 64, 64, 64, -64, 64, -64, -64, -64, 64, 64, 64, 64, -64, 64, 64, 64, 64, 64, 64, 64, -64, 64, 64, 64, 64, 64, 64, 64, 64, 64, 64, 64, 64, 64, -64, -64, -64, 64, 64, 64, -64, 64, 64, 64, 64, 64, 64, 64, 64, 64, 64, 64, 64, 64, 64, -64, 64, -64, 64, 64, -64, -64, 64, 64, 64, 64, 64, 64, 64, 64, -64, 64, 64, 64, 64, 64, 64, 64, 64, 64, -64, 64, 64, 64, 64, -64, -64, -64, 64, -64, -64, -64, 64, -64, 64, 64, 64, -64, 64, -64, 64, 64, -64, -64, -64, 64, -64, 64, -64, 64, 64, 64, -64, 64, 64, -64, -64, -64, -64, -64, 64, 64, -64, 64, -64, 64, 64, -64, -64, 64, -64, -64, -64, 64, 64, 64, -64, -64, 64, 64, -64, 64, -64, -64, 64, -64, -64, 64, 64, 64, -64, 64, -64, -64, 64, 64, 64, 64, 64, 64, 64, 64, 64, 64, 64, -64, 64, 64, 64, -64, -64, -64, 64, -64, -64, 64, 64, 64, -64, -64, -64, 64, -64, -64, -64, -64, -64, -64, 64, 64, 64, 64, -64, -64, 64, 64, -64, -64, -64, 64, 64, 64, 64, 64, 64, 64, 64, 64, -64, -64, -64, -64, -64, 64, 64, -64, 64, 64, 64, 64, 64, -64, 64, 64, -64, 64, 64, 64, 64, -64, 64, 64, 64, 64, 64, 64, -64, 64, -64, -64, -64, -64, -64, 64, -64, 64, 64, 64, 64, -64, -64, -64, 64, 64, 64, -64, 64, -64, 64, -64, 64, 64, -64, 64, 64, 64, -64, -64, 64, -64, 64, 64, 64, -64, -64, -64, -64, -64, -64, -64, -64, -64, -64, -64, 64, 64, 64, 64, -64, -64, 64, -64, -64, 64, -64, 64, 64, 64, -64, -64, 64, -64, -64, -64, -64, -64, -64, -64, -64, 64, -64, 64, 64, 64, 64, 64, -64, -64, -64, -64, 64, 64, 64, 64, 64, 64, 64, 64, 64, 64, 64, 64, -64, -64, -64, -64, 64, -64, 64, -64, 64, -64, 64, 64, -64, -64, -64, 64, -64, -64, 64, -64, 64, -64, 64, 64, 64, 64, 64, -64, -64, -64, 64, -64, -64, -64, 64, -64, 64, -64, -64, -64, 64, 64, 64, 64, 64, 64, 64, 64, 64, 64, 64, 64, 64, 64, 64, 64, -64, -64, -64, -64, -64, 64, -64, -64, 64, 64, 64, -64, 64, 64, -64, -64, -64, -64, -64, 64, 64, 64, 64, 64, 64, -64, 64, 64, 64, 64, 64, -64, -64, -64, -64, 64, -64, 64, -64, -64, -64, -64, 64, -64, 64, 64, -64, -64, -64, -64, 64, -64, 64, 64, -64, 64, -64, 64, 64, -64, -64, -64, -64, 64, 64, -64, 64, -64, -64, -64, 64, -64, -64, -64, -64, 64, 64, -64, 64, -64, -64, -64, -64, -64, 64, -64, 64, 64, 64, 64, 64, -64, -64, -64, 64, 64, 64, -64, 64, 64, 64, 64, 64, -64, -64, -64, -64, 64, 64, 64, 64, -64, 64, -64, 64, -64, -64, 64, 64, -64, -64, -64, -64, 64, -64, -64, 64, -64, 64, 64, 64, 64, 64, 64, 64, 64, 64, 64, 64, 64, 64, 64, -64, -64, 64, 64, 64, 64, -64, -64, 64, -64, 64, -64, -64, 64, 64, -64, 64, 64, 64, 64, 64, 64, 64, 64, 64, 64, 64, -64, 64, 64, 64, -64, 64, 64, -64, 64, 64, 64, 64, -64, 64, 64, -64, -64, -64, -64, -64, 64, 64, 64, 64, 64, 64, 64, -64, 64, -64, 64, -64, -64, 64, 64, -64, 64, 64, 64, -64, -64, -64, -64, -64, -64, -64, -64, -64, -64, -64, -64, -64, 64, -64, -64, -64, -64, -64, -64, -64, 64, 64, -64, 64, 64, 64, -64, -64, -64, -64, -64, -64, -64, -64, -64, 64, 64, 64, 64, -64, -64, -64, -64, -64, -64, 64, -64, -64, -64, 64, -64, -64, -64, 64, 64, -64, -64, -64, -64, -64, -64, -64, -64, 64, 64, 64, 64, -64, -64, -64, -64, 64, 64, 64, 64, -64, 64, -64, -64, 64, 64, -64, 64, 64, -64, -64, 64, -64, 64, -64, -64, 64, 64, 64, 64, 64, 64, -64, -64, 64, 64, 64, 64, -64, 64, -64, -64, 64, 64, -64, -64, -64, 64, 64, -64, -64, 64, -64, 64, 64, 64, 64, 64, 64, 64, 64, 64, 64, 64, 64, 64, -64, -64, 64, -64, -64, 64, 64, -64, -64, 64, -64, 64, 64, 64, 64, 64, 64, 64, 64, 64, 64, -64, -64, -64, 64, 64, -64, -64, -64, 64, 64, 64, -64, -64, 64, -64, 64, 64, 64, 64, -64, -64, -64, 64, 64, 64, 64, -64, -64, -64, -64, -64, 64, -64, -64, -64, -64, -64, 64, -64, -64, -64, 64, 64, -64, 64, 64, -64, -64, -64, -64, -64, -64, -64, -64, -64, -64, -64, -64, 64, 64, -64, -64, 64, 64, -64, 64, -64, -64, -64, 64, -64, -64, -64, -64, -64, -64, -64, -64, -64, -64, -64, -64, -64, 64, -64, -64, -64, -64, -64, -64, 64, 64, -64, 64, -64, 64, 64, 64, -64, -64, -64, -64, -64, -64, 64, -64, -64, -64, -64, -64, 64, -64, -64, -64, 64, -64, -64, 64, 64, 64, 64, 64, -64, 64, -64, -64, -64, -64, 64, -64, -64, -64, -64, -64, -64, -64, -64, -64, -64, -64, 64, -64, -64, 64, -64, -64, 64, 64, 64, 64, 64, -64, 64, -64, -64, -64, 64, 64, 64, -64, -64, -64, -64, -64, -64, -64, 64, -64, 64, 64, -64, 64, 64, 64, 64, 64, 64, 64, 64, -64, -64, -64, -64, 64, 64, 64, 64, 64, 64, -64, -64, -64, -64, -64, 64, 64, 64, 64, 64, 64, 64, 64, 64, 64, 64, 64, 64, 64, 64, 64, 64, 64, 64, 64, 64, 64, -64, -64, -64, -64, -64, 64, 64, -64, 64, 64, -64, -64, 64, 64, 64, 64, -64, -64, -64, 64, -64, -64, -64, 64, 64, 64, 64, 64, -64, -64, 64, -64, 64, 64, -64, -64, 64, 64, -64, 64, 64, 64, 64, 64, 64, 64, 64, -64, 64, -64, 64, 64, 64, 64, 64, 64, 64, 64, 64, 64, 64, 64, -64, -64, 64, -64, 64, 64, 64, -64, -64, 64, -64, 64, 64, 64, -64, 64, 64, 64, 64, 64, 64, 64, 64, 64, 64, 64, 64, -64, -64, -64, -64, -64, -64, 64, -64, 64, 64, -64, 64, -64, -64, 64, -64, 64, 64, 64, 64, 64, 64, -64, 64, -64, -64, 64, -64, -64, -64, -64, -64, -64, -64, 64, -64, -64, -64, -64, 64, 64, -64, -64, 64, -64, 64, 64, 64, 64, -64, -64, -64, -64, -64, -64, -64, -64, -64, -64, 64, -64, -64, 64, -64, -64, -64, 64, -64, -64, -64, -64, -64, 64, -64, 64, -64, -64, 64, -64, -64, -64, 64, -64, -64, -64, 64, 64, -64, 64, -64, 64, 64, 64, -64, 64, 64, -64, -64, 64, 64, 64, 64, -64, 64, -64, 64, -64, -64, -64, -64, -64, -64, 64, 64, 64, 64, 64, -64, 64, 64, 64, 64, -64, -64, 64, 64, -64, 64, -64, 64, 64, -64, 64, 64, 64, 64, -64, 64, -64, 64, 64, 64, 64, 64, 64, 64, 64, -64, 64, 64, -64, 64, 64, 64, -64, -64, -64, 64, -64, 64, 64, 64, 64, 64, 64, 64, -64, 64, -64, 64, 64, 64, 64, 64, -64, 64, 64, 64, -64, -64, 64, 64, -64, 64, 64, -64, -64, 64, 64, 64, 64, 64, -64, 64, -64, 64, -64, -64, -64, 64, 64, -64, 64, 64, 64, 64, -64, -64, 64, 64, -64, 64, -64, -64, -64, -64, 64, -64, 64, 64, 64, 64, 64, 64, -64, 64, -64, -64, 64, 64, -64, -64, 64, 64, 64, -64, -64, 64, -64, 64, 64, -64, 64, -64, -64, 64, 64, 64, 64, 64, 64, -64, -64, 64, -64, 64, -64, -64, 64, 64, -64, 64, -64, -64, 64, -64, -64, 64, -64, 64, 64, 64, -64, 64, -64, -64, 64, -64, -64, 64, -64, 64, 64, -64, 64, -64, 64, -64, -64, -64, 64, -64, -64, 64, 64, 64, -64, 64, 64, 64, 64, -64, 64, -64, -64, -64, 64, -64, -64, -64, 64, -64, -64, 64, -64, 64, -64, -64, 64, 64, -64, 64, -64, -64, 64, 64, 64, 64, -64, -64, 64, -64, 64, -64, -64, -64, -64, -64, 64, 64, -64, 64, -64, -64, -64, -64, 64, 64, -64, 64, -64, -64, 64, -64, -64, -64, 64, 64, 64, -64, -64, -64, -64, -64, -64, -64, 64, 64, -64, -64, -64, -64, -64, 64, -64, -64, -64, 64, 64, 64, 64, -64, 64, -64, 64, -64, 64, -64, 64, 64, -64, -64, -64, 64, -64, -64, -64, 64, -64, -64, -64, 64, 64, -64, -64, 64, 64, -64, -64, -64, 64, -64, 64, -64, 64, -64, -64, 64, -64, 64, -64, -64, -64, 64, -64, -64, -64, 64, 64, 64, -64, 64, 64, -64, -64, 64, -64, 64, 64, 64, -64, -64, -64, -64, -64, 64, -64, 64, -64, -64, 64, 64, -64, -64, 64, 64, 64, -64, -64, -64, -64, -64, -64, 64, -64, -64, 64, 64, -64, 64, 64, -64, 64, 64, -64, -64, -64, -64, -64, -64, 64, 64, 64, 64, 64, -64, 64, 64, -64, 64, -64, 64, -64, 64, -64, 64, -64, -64, -64, -64, -64, 64, -64, -64, -64, -64, -64, -64, -64, -64, 64, -64, 64, -64, 64, -64, -64, -64, -64, -64, -64, -64, -64, -64, 64, 64, 64, -64, -64, -64, 64, -64, -64, 64, 64, -64, -64, -64, 64, 64, 64, -64, 64, 64, 64, 64, -64, 64, -64, 64, -64, -64, -64, -64, -64, -64, 64, -64, -64, 64, -64, -64, 64, -64, 64, -64, 64, 64, -64, -64, 64, -64, 64, -64, -64, -64, 64, -64, -64, -64, 64, -64, 64, 64, -64, 64, -64, 64, -64, 64, 64, 64, -64, -64, -64, 64, -64, -64, 64, -64, 64, -64, 64, 64, 64, 64, -64, -64, -64, 64, -64, 64, -64, 64, -64, 64, -64, -64, -64, -64, 64, 64, -64, 64, 64, -64, -64, -64, 64, 64, 64, 64, -64, -64, -64, 64, -64, 64, -64, -64, 64, -64, -64, 64, -64, -64, 64, -64, 64, -64, -64, 64, -64, -64, 64, -64, -64, 64, 64, -64, -64, 64, 64, 64, -64, -64, -64, 64, 64, -64, -64, -64, -64, -64, -64, -64, 64, -64, 64, -64, -64, 64, -64, 64, -64, 64, 64, -64, -64, -64, -64, -64, 64, -64, 64, -64, 64, -64, -64, -64, -64, -64, -64, -64, -64, -64, -64, 64, 64, 64, 64, 64, 64, -64, 64, 64, -64, -64, 64, 64, 64, -64, 64, 64, 64, -64, -64, -64, 64, -64, -64, -64, -64, 64, 64, -64, 64, -64, -64, -64, -64, 64, -64, 64, 64, 64, 64, 64, -64, 64, -64, -64, -64, -64, -64, 64, -64, -64, -64, 64, -64, 64, -64, -64, 64, 64, -64, -64, 64, -64, -64, -64, 64, 64, 64, 64, 64, -64, 64, 64, -64, -64, -64, 64, -64, 64, -64, -64, -64, 64, 64, -64, -64, 64, 64, 64, -64, 64, -64, 64, -64, 64, -64, -64, -64, 64, -64, -64, -64, -64, -64, -64, -64, -64, -64, 64, -64, -64, 64, 64, -64, -64, 64, 64, 64, -64, -64, -64, 64, 64, -64, -64, -64, -64, -64, 64, 64, -64, -64, -64, -64, -64, -64, 64, 64, -64, 64, -64, 64, 64, -64, -64, 64, -64, -64, 64, -64, -64, -64, 64, -64, 64, 64, 64, -64, 64, 64, -64, -64, 64, -64, -64, -64, 64, 64, 64, 64, -64, -64, 64, -64, 64, 64, 64, -64, -64, -64, -64, -64, -64, -64, -64, 64, -64, -64, -64, 64, 64, 64, -64, -64, 64, 64, -64, 64, 64, 64, -64, 64, -64, 64, 64, 64, 64, 64, 64, -64, 64, 64, -64, 64, -64, 64, 64, 64, 64, -64, 64, 64, -64, 64, -64, 64, 64, 64, 64, 64, 64, 64, -64, 64, 64, 64, -64, 64, -64, -64, 64, -64, 64, -64, -64, -64, -64, 64, 64, 64, 64, 64, -64, -64, 64, -64, 64, -64, 64, -64, 64, -64, 64, -64, -64, -64, -64, -64, -64, 64, -64, 64, 64, -64, -64, 64, 64, 64, -64, 64, -64, 64, -64, -64, -64, 64, 64, 64, 64, 64, -64, -64, -64, 64, 64, -64, 64, 64, 64, -64, 64, 64, 64, 64, -64, -64, 64, 64, -64, -64, -64, 64, -64, 64, 64, -64, 64, -64, -64, 64, -64, -64, -64, -64, -64, 64, 64, 64, -64, -64, 64, -64, -64, 64, 64, -64, 64, -64, -64, -64, 64, 64, 64, 64, -64, 64, -64, 64, 64, 64, -64, -64, 64, -64, -64, 64, -64, -64, -64, 64, -64, -64, 64, 64, -64, 64, -64, -64, 64, -64, 64, 64, -64, -64, 64, 64, -64, -64, 64, -64, 64, -64, -64, -64, 64, 64, -64, 64, -64, 64, -64, 64, 64, -64, -64, -64, -64, 64, 64, -64, 64, 64, -64, 64, -64, 64, 64, 64, -64, -64, -64, 64, 64, 64, -64, 64, 64, -64, -64, 64, -64, -64, 64, -64, -64, 64, -64, -64, -64, 64, 64, -64, -64, 64, -64, -64, 64, -64, -64, -64, 64, -64, -64, -64, 64, -64, -64, -64, 64, -64, -64, -64, 64, -64, 64, -64, -64, -64, -64, -64, 64, 64, -64, -64, -64, -64, 64, 64, -64, -64, -64, -64, -64, -64, -64, -64, -64, -64, 64, 64, 64, 64, 64, 64, -64, 64, 64, -64, -64, -64, -64, -64, -64, -64, -64, 64, 64, 64, 64, -64, 64, -64, -64, 64, -64, -64, -64, -64, -64, -64, -64, 64, -64, 64, -64, -64, -64, 64, -64, -64, -64, 64, -64, -64, -64, 64, -64, -64, -64, 64, -64, 64, 64, 64, -64, 64, 64, -64, -64, -64, -64, 64, -64, 64, -64, 64, -64, -64, -64, -64, 64, 64, -64, -64, -64, -64, -64, -64, -64, -64, 64, 64, 64, 64, -64, 64, -64, 64, -64, 64, 64, 64, 64, -64, -64, 64, -64, 64, 64, 64, -64, -64, -64, -64, -64, -64, -64, 64, -64, -64, -64, 64, 64, -64, -64, -64, 64, 64, 64, -64, -64, -64, -64, -64, -64, 64, -64, -64, -64, 64, -64, -64, -64, -64, -64, 64, 64, 64, 64, -64, -64, 64, 64, -64, -64, 64, 64, 64, 64, -64, -64, 64, -64, -64, -64, 64, 64, 64, -64, -64, -64, -64, -64, -64, -64, 64, 64, 64, 64, 64, 64, -64, 64, -64, -64, 64, 64, -64, 64, -64, 64, -64, -64, 64, -64, 64, -64, -64, -64, -64, -64, -64, 64, 64, -64, 64, -64, 64, -64, -64, -64, -64, 64, -64, -64, -64, 64, 64, -64, -64, -64, -64, -64, -64, -64, -64, -64, 64, -64, 64, -64, -64, -64, -64, -64, -64, 64, 64, 64, -64, -64, 64, -64, 64, 64, 64, 64, 64, -64, -64, 64, -64, -64, -64, -64, -64, -64, 64, -64, 64, 64, -64, 64, 64, 64, 64, -64, 64, -64, -64, -64, -64, -64, 64, 64, 64, 64, -64, 64, -64, -64, -64, -64, 64, 64, -64, -64, -64, -64, -64, -64, 64, -64, 64, -64, -64, 64, 64, 64, -64, 64, -64, 64, -64, -64, -64, -64, 64, -64, -64, -64, -64, -64, 64, -64, 64, 64, -64, -64, 64, -64, -64, 64, -64, 64, -64, 64, 64, -64, -64, 64, 64, 64, -64, -64, -64, -64, -64, 64, 64, 64, -64, -64, -64, 64, -64, -64, 64, -64, 64, -64, 64, 64, -64, -64, -64, 64, -64, -64, -64, 64, 64, 64, 64, -64, -64, 64, -64, -64, 64, -64, 64, -64, 64, 64, 64, 64, 64, -64, -64, -64, -64, -64, 64, 64, 64, 64, 64, 64, -64, -64, 64, -64, -64, -64, -64, -64, 64, -64, -64, -64, -64, -64, 64, 64, -64, 64, 64, 64, -64, 64, 64, 64, -64, 64, -64, -64, 64, 64, -64, 64, 64, -64, -64, -64, -64, -64, -64, 64, -64, -64, -64, -64, 64, 64, 64, -64, 64, -64, -64, 64, 64, -64, -64, -64, -64, 64, -64, -64, -64, 64, 64, -64, 64, 64, -64, 64, 64, -64, 64, 64, 64, 64, 64, -64, 64, -64, 64, 64, -64, -64, -64, 64, 64, 64, 64, 64, 64, -64, 64, 64, 64, -64, -64, 64, -64, 64, 64, -64, 64, -64, -64, 64, -64, -64, 64, 64, -64, 64, -64, -64, -64, -64, -64, 64, -64, -64, -64, 64, -64, -64, 64, -64, -64, 64, -64, 64, 64, 64, -64, -64, 64, -64, -64, 64, 64, 64, -64, -64, -64, -64, -64, -64, 64, 64, 64, -64, -64, -64, 64, 64, -64, 64, -64, 64, -64, 64, 64, -64, 64, -64, -64, -64, 64, 64, -64, -64, -64, 64, -64, 64, -64, -64, -64, -64, 64, 64, -64, -64, -64, -64, 64, -64, -64, 64, -64, -64, -64, 64, 64, 64, 64, -64, -64, -64, 64, 64, -64, 64, 64, 64, 64, -64, -64, 64, 64, -64, 64, -64, -64, 64, -64, -64, 64, -64, -64, -64, 64, 64, 64, -64, 64, 64, 64, 64, -64, 64, 64, -64, -64, 64, -64, 64, -64, 64, 64, -64, -64, -64, 64, -64, 64, 64, -64, -64, -64, 64, 64, 64, -64, 64, 64, 64, -64, -64, 64, 64, 64, 64, -64, 64, 64, -64, -64, -64, 64, 64, -64, -64, -64, -64, -64, 64, -64, -64, 64, 64, 64, 64, 64, 64, 64, -64, 64, 64, -64, 64, -64, 64, 64, -64, 64, -64, -64, -64, -64, -64, -64, 64, 64, 64, 64, 64, 64, 64, 64, 64, 64, 64, 64, -64, 64, 64, 64, -64, 64, -64, 64, -64, -64, -64, -64, 64, -64, -64, 64, 64, 64, -64, 64, 64, 64, 64, 64, 64, -64, 64, 64, 64, 64, 64, 64, 64, 64, 64, -64, -64, -64, -64, -64, 64, 64, 64, 64, 64, -64, 64, 64, 64, -64, -64, -64, 64, 64, -64, 64, 64, -64, -64, 64, 64, 64, -64, -64, -64, -64, 64, -64, 64, -64, -64, -64, 64, 64, 64, -64, 64, -64, -64, -64, -64, 64, -64, 64, -64, 64, 64, 64, -64, 64, 64, -64, -64, -64, -64, -64, -64, -64, -64, -64, -64, 64, 64, -64, 64, -64, -64, -64, 64, -64, 64, 64, -64, 64, 64, 64, 64, 64, -64, -64, -64, -64, -64, -64, -64, -64, -64, -64, -64, -64, 64, -64, -64, 64, -64, -64, -64, 64, -64, 64, 64, 64, 64, 64, 64, -64, -64, -64, 64, -64, -64, -64, 64, -64, 64, -64, -64, -64, -64, -64, 64, -64, -64, -64, -64, -64, 64, 64, 64, 64, 64, 64, -64, 64, -64, -64, 64, -64, -64, 64, 64, 64, 64, -64, 64, -64, -64, 64, -64, -64, -64, -64, -64, -64, 64, -64, -64, -64, 64, 64, 64, -64, 64, -64, -64, -64, 64, 64, -64, 64, -64, 64, -64, -64, 64, -64, -64, -64, -64, -64, -64, 64, -64, 64, 64, 64, 64, 64, -64, -64, -64, 64, 64, 64, -64, 64, -64, 64, 64, -64, -64, -64, 64, 64, -64, 64, -64, -64, 64, -64, 64, 64, 64, 64, 64, 64, -64, -64, 64, -64, 64, -64, -64, -64, -64, 64, 64, -64, -64, -64, -64, 64, 64, -64, -64, -64, 64, 64, 64, 64, 64, 64, 64, 64, 64, -64, -64, -64, 64, 64, -64, -64, -64, -64, 64, 64, -64, 64, 64, 64, 64, -64, -64, -64, 64, 64, 64, 64, 64, 64, 64, 64, -64, -64, 64, 64, -64, 64, -64, -64, -64, -64, -64, 64, -64, -64, 64, 64, 64, 64, -64, -64, 64, 64, 64, 64, 64, 64, 64, 64, 64, -64, 64, -64, 64, 64, -64, 64, -64, 64, 64, 64, -64, -64, 64, -64, 64, -64, 64, 64, 64, -64, 64, 64, 64, 64, 64, 64, 64, -64, 64, 64, 64, 64, -64, 64, 64, 64, 64, -64, -64, -64, -64, 64, -64, 64, 64, 64, -64, -64, 64, -64, 64, 64, 64, 64, 64, -64, 64, -64, 64, 64, -64, 64, 64, 64, -64, 64, 64, -64, 64, 64, 64, 64, 64, 64, 64, 64, 64, 64, -64, 64, 64, 64, 64, 64, 64, 64, 64, 64, -64, 64, 64, 64, -64, 64, 64, 64, 64, 64, 64, 64, -64, 64, 64, 64, 64, 64, 64, 64, -64, -64, -64, -64, -64, 64, 64, -64, 64, 64, 64, 64, -64, 64, 64, 64, 64, 64, 64, 64, 64, 64, 64, -64, 64, -64, -64, -64, -64, -64, -64, 64, -64, 64, 64, 64, 64, 64, 64, -64, 64, 64, 64, 64, 64, 64, 64, 64, 64, 64, 64, -64, 64, -64, 64, -64, -64, -64, -64, 64, -64, 64, -64, 64, 64, -64, -64, -64, 64, 64, -64, 64, 64, 64, 64, 64, -64, 64, -64, 64, 64, -64, 64, 64, -64, -64, -64, -64, 64, -64, 64, -64, 64, -64, 64, 64, -64, -64, 64, 64, 64, 64, 64, -64, -64, -64, -64, -64, 64, -64, -64, -64, -64, -64, -64, -64, 64, -64, -64, -64, 64, -64, 64, -64, -64, 64, 64, -64, 64, -64, -64, 64, -64, -64, -64, -64, -64, -64, -64, -64, -64, -64, 64, 64, -64, -64, 64, 64, -64, -64, 64, -64, 64, 64, 64, 64, -64, -64, -64, -64, 64, -64, -64, -64, -64, -64, -64, 64, 64, 64, 64, 64, -64, -64, 64, 64, -64, 64, -64, -64, 64, -64, -64, -64, -64, -64, -64, -64, -64, 64, 64, 64, -64, 64, 64, -64, -64, 64, -64, 64, 64, -64, 64, 64, 64, 64, 64, -64, 64, 64, -64, -64, 64, 64, 64, 64, -64, 64, -64, 64, 64, 64, 64, 64, 64, 64, 64, -64, 64, -64, 64, 64, 64, -64, 64, 64, 64, -64, 64, 64, 64, 64, 64, -64, -64, -64, -64, 64, 64, -64, 64, 64, 64, 64, 64, 64, 64, 64, -64, 64, 64, 64, -64, -64, 64, -64, -64, 64, 64, 64, 64, 64, 64, 64, 64, 64, 64, -64, -64, 64, 64, 64, 64, 64, 64, -64, 64, -64, -64, 64, 64, -64, 64, -64, 64, -64, 64, 64, -64, 64, -64, 64, 64, 64, 64, 64, 64, 64, 64, -64, 64, 64, 64, 64, 64, -64, -64, 64, 64, 64, -64, 64, 64, -64, -64, 64, -64, 64, 64, 64, 64, 64, -64, 64, -64, -64, -64, 64, -64, -64, -64, 64, 64, 64, 64, 64, 64, 64, 64, -64, -64, -64, -64, 64, 64, 64, 64, 64, 64, -64, -64, -64, -64, -64, -64, -64, -64, 64, -64, 64, 64, -64, 64, -64, -64, 64, 64, -64, -64, -64, -64, -64, 64, 64, 64, 64, -64, -64, -64, -64, -64, 64, -64, -64, -64, -64, -64, 64, 64, 64, 64, 64, -64, 64, 64, -64, -64, -64, -64, -64, 64, 64, 64, 64, 64, 64, 64, 64, 64, 64, 64, -64, -64, -64, 64, -64, 64, 64, -64, 64, -64, 64, 64, -64, -64, -64, -64, -64, -64, 64, -64, -64, 64, -64, 64, 64, -64, -64, -64, -64, -64, -64, 64, -64, 64, 64, 64, 64, -64, -64, 64, -64, -64, 64, -64, -64, -64, -64, 64, 64, 64, 64, 64, 64, 64, 64, -64, -64, -64, -64, -64, -64, -64, 64, 64, -64, 64, 64, 64, -64, -64, -64, -64, -64, -64, 64, 64, -64, -64, -64, 64, 64, 64, 64, -64, -64, -64, -64, -64, -64, 64, 64, 64, 64, -64, -64, -64, -64, -64, -64, -64, -64, -64, -64, -64, 64, 64, 64, 64, 64, 64, 64, -64, -64, -64, -64, -64, -64, -64, 64, 64, -64, -64, -64, -64, -64, -64, -64, 64, -64, -64, -64, -64, 64, 64, 64, 64, 64, 64, 64, -64, -64, -64, -64, -64, -64, -64, -64, -64, -64, -64, 64, 64, -64, -64, -64, -64, 64, -64, 64, 64, 64, 64, 64, 64, 64, 64, -64, -64, -64, -64, -64, -64, 64, -64, -64, -64, 64, -64, 64, -64, 64, 64, -64, -64, 64, 64, 64, 64, 64, 64, -64, 64, 64, 64, -64, -64, -64, -64, -64, -64, -64, -64, -64, -64, 64, -64, 64, 64, 64, 64, 64, 64, -64, -64, -64, 64, 64, 64, 64, 64, 64, 64, -64, 64, -64, 64, -64, 64, 64, -64, -64, 64, -64, 64, 64, -64, 64, 64, -64, 64, -64, -64, -64, -64, 64, 64, 64, 64, 64, -64, -64, -64, 64, 64, 64, 64, 64, 64, 64, 64, 64, 64, 64, 64, -64, 64, 64, 64, -64, -64, -64, -64, -64, -64, -64, -64, -64, 64, 64, 64, -64, -64, 64, 64, 64, 64, -64, 64, 64, -64, 64, 64, 64, 64, 64, 64, -64, -64, -64, -64, -64, -64, -64, 64, 64, 64, 64, 64, 64, -64, 64, 64, 64, 64, 64, 64, 64, -64, 64, 64, -64, 64, 64, 64, 64, -64, -64, -64, -64, -64, -64, 64, 64, 64, 64, 64, 64, -64, 64, 64, 64, 64, -64, 64, 64, 64, 64, 64, 64, 64, 64, 64, 64, 64, 64, -64, -64, 64, 64, 64, 64, 64, 64, -64, -64, 64, 64, -64, -64, 64, -64, 64, 64, -64, 64, 64, 64, 64, 64, 64, -64, 64, 64, 64, -64, -64, 64, 64, -64, 64, 64, 64, -64, 64, -64, -64, -64, 64, 64, 64, 64, -64, -64, 64, 64, -64, -64, 64, 64, -64, -64, -64, -64, -64, -64, -64, -64, 64, 64, 64, 64, 64, 64, -64, -64, 64, -64, 64, 64, 64, -64, -64, -64, -64, -64, 64, -64, 64, 64, -64, -64, -64, -64, -64, -64, 64, -64, -64, 64, 64, 64, -64, 64, -64, 64, -64, 64, -64, 64, -64, -64, 64, 64, -64, -64, -64, 64, 64, -64, 64, -64, -64, -64, 64, 64, 64, 64, 64, 64, 64, 64, 64, -64, -64, 64, 64, 64, 64, -64, 64, -64, -64, -64, -64, -64, -64, 64, 64, 64, -64, -64, 64, 64, 64, 64, 64, -64, -64, 64, -64, -64, 64, -64, -64, 64, 64, 64, -64, -64, -64, -64, -64, -64, -64, -64, -64, -64, -64, 64, 64, -64, 64, 64, 64, -64, -64, 64, -64, -64, -64, -64, -64, 64, -64, -64, 64, 64, -64, 64, -64, -64, -64, 64, -64, 64, 64, -64, -64, 64, -64, -64, -64, 64, 64, 64, -64, -64, -64, 64, 64, 64, 64, -64, 64, -64, -64, -64, -64, 64, 64, 64, 64, -64, 64, -64, -64, 64, -64, 64, -64, -64, 64, -64, -64, 64, -64, 64, -64, -64, 64, 64, -64, -64, -64, -64, -64, 64, 64, 64, -64, -64, 64, 64, -64, 64, 64, 64, 64, -64, 64, -64, -64, 64, -64, 64, -64, -64, -64, 64, -64, -64, -64, -64, -64, -64, -64, 64, 64, 64, 64, 64, 64, -64, -64, -64, -64, 64, -64, -64, -64, -64, -64, -64, 64, 64, 64, -64, -64, 64, 64, 64, 64, 64, -64, -64, -64, 64, 64, -64, -64, -64, -64, -64, 64, 64, 64, -64, 64, -64, -64, 64, -64, -64, 64, -64, -64, -64, -64, -64, 64, 64, -64, -64, 64, 64, -64, -64, -64, -64, -64, -64, -64, -64, -64, -64, -64, -64, -64, 64, 64, 64, -64, -64, 64, 64, 64, 64, 64, 64, -64, -64, -64, -64, 64, -64, -64, 64, -64, 64, -64, -64, -64, -64, -64, -64, -64, 64, 64, 64, 64, -64, 64, 64, 64, -64, -64, -64, -64, -64, -64, -64, -64, 64, -64, 64, 64, 64, 64, 64, -64, 64, -64, -64, -64, -64, -64, 64, 64, 64, 64, 64, -64, 64, -64, -64, -64, -64, -64, -64, 64, -64, 64, 64, -64, 64, 64, 64, 64, 64, 64, 64, -64, -64, 64, -64, 64, 64, -64, 64, 64, 64, 64, -64, -64, -64, -64, -64, 64, 64, 64, 64, -64, 64, 64, 64, 64, 64, 64, -64, 64, 64, 64, 64, 64, 64, 64, 64, 64, 64, -64, -64, -64, -64, -64, 64, 64, 64, 64, 64, 64, 64, -64, 64, 64, 64, 64, -64, 64, 64, -64, 64, 64, 64, 64, 64, 64, 64, -64, -64, -64, -64, 64, 64, 64, 64, 64, 64, 64, 64, 64, 64, 64, 64, 64, -64, -64, 64, -64, 64, 64, 64, -64, 64, -64, -64, -64, -64, -64, -64, 64, 64, 64, 64, 64, -64, 64, 64, 64, -64, -64, -64, 64, -64, -64, 64, -64, -64, -64, 64, 64, -64, -64, -64, -64, -64, -64, 64, 64, 64, 64, 64, -64, -64, -64, 64, 64, -64, -64, -64, -64, 64, 64, -64, -64, 64, 64, 64, 64, -64, -64, -64, -64, -64, -64, 64, 64, 64, 64, 64, 64, -64, 64, 64, 64, -64, -64, -64, 64, 64, -64, -64, 64, -64, 64, -64, -64, -64, -64, -64, -64, -64, -64, 64, 64, 64, 64, 64, -64, 64, -64, 64, 64, -64, -64, -64, 64, 64, 64, -64, 64, 64, -64, -64, 64, 64, -64, -64, -64, -64, -64, 64, 64, 64, 64, 64, 64, 64, 64, 64, 64, -64, -64, -64, -64, 64, -64, -64, -64, 64, 64, -64, -64, -64, -64, -64, -64, -64, -64, 64, 64, 64, 64, 64, 64, 64, -64, 64, -64, 64, -64, -64, -64, 64, -64, -64, 64, -64, 64, 64, -64, -64, -64, -64, 64, -64, -64, -64, 64, 64, 64, 64, 64, 64, 64, -64, -64, -64, 64, -64, 64, -64, 64, 64, 64, 64, -64, 64, 64, -64, -64, -64, 64, -64, 64, 64, 64, 64, 64, 64, 64, -64, 64, 64, -64, -64, 64, 64, 64, -64, 64, 64, -64, 64, -64, 64, -64, -64, -64, -64, 64, 64, 64, -64, 64, 64, 64, 64, -64, -64, -64, -64, -64, -64, -64, 64, 64, -64, -64, 64, -64, 64, -64, -64, 64, 64, 64, 64, 64, 64, -64, 64, -64, 64, 64, 64, -64, -64, -64, -64, -64, 64, 64, -64, -64, -64, 64, 64, -64, -64, -64, -64, 64, 64, 64, -64, -64, -64, -64, -64, -64, 64, -64, 64, -64, -64, -64, -64, 64, -64, -64, -64, -64, 64, 64, -64, 64, -64, -64, 64, 64, 64, 64, 64, 64, -64, 64, 64, -64, -64, 64, -64, -64, -64, -64, 64, -64, -64, -64, -64, -64, 64, 64, 64, -64, -64, 64, 64, -64, 64, 64, 64, 64, 64, 64, 64, -64, -64, -64, 64, -64, 64, -64, -64, -64, -64, -64, -64, -64, -64, 64, -64, -64, -64, -64, -64, -64, 64, -64, 64, 64, 64, 64, 64, 64, 64, 64, 64, -64, 64, -64, -64, 64, -64, -64, -64, -64, -64, -64, 64, -64, -64, -64, -64, 64, 64, -64, 64, 64, 64, 64, 64, 64, 64, 64, 64, 64, -64, -64, -64, -64, -64, -64, -64, 64, -64, -64, 64, -64, -64, -64, 64, -64, -64, -64, -64, -64, -64, -64, -64, -64, 64, 64, -64, -64, -64, -64, -64, -64, -64, -64, -64, 64, 64, -64, 64, 64, -64, -64, -64, -64, -64, 64, 64, 64, 64, -64, -64, 64, 64, 64, -64, 64, 64, 64, -64, 64, 64, -64, -64, 64, -64, -64, -64, 64, -64, 64, -64, 64, 64, -64, 64, -64, 64, 64, 64, -64, -64, 64, -64, 64, -64, -64, -64, 64, 64, -64, 64, 64, -64, -64, 64, -64, 64, -64, 64, 64, -64, -64, 64, 64, 64, -64, -64, -64, 64, 64, 64, 64, -64, 64, 64, 64, 64, -64, -64, 64, 64, 64, -64, 64, -64, 64, -64, 64, -64, 64, 64, 64, 64, -64, -64, -64, -64, -64, -64, 64, 64, 64, 64, 64, 64, 64, 64, 64, -64, -64, 64, 64, -64, -64, -64, 64, -64, 64, -64, 64, 64, 64, 64, -64, -64, -64, -64, -64, -64, 64, 64, 64, 64, -64, 64, 64, -64, -64, 64, -64, -64, -64, -64, 64, 64, 64, -64, 64, 64, -64, -64, -64, -64, -64, 64, 64, 64, -64, -64, 64, 64, -64, 64, 64, 64, -64, -64, -64, 64, -64, -64, 64, 64, 64, 64, 64, 64, -64, 64, 64, -64, -64, -64, 64, 64, -64, -64, 64, 64, -64, -64, -64, -64, 64, 64, -64, 64, 64, -64, -64, -64, -64, -64, 64, 64, -64, -64, 64, 64, 64, 64, 64, -64, 64, -64, 64, 64, 64, 64, -64, -64, -64, 64, 64, 64, -64, -64, -64, -64, -64, 64, -64, -64, -64, -64, -64, 64, -64, -64, -64, -64, -64, -64, 64, 64, 64, -64, 64, 64, -64, 64, 64, 64, 64, -64, -64, -64, 64, 64, -64, 64, 64, -64, -64, -64, 64, 64, 64, -64, -64, -64, 64, 64, 64, 64, -64, -64, -64, -64, 64, 64, 64, 64, -64, -64, 64, -64, -64, 64, 64, -64, 64, 64, -64, 64, -64, -64, 64, 64, 64, 64, 64, -64, -64, -64, -64, 64, 64, -64, -64, -64, -64, -64, 64, -64, -64, 64, 64, -64, -64, 64, 64, -64, -64, -64, 64, -64, 64, 64, 64, 64, -64, -64, -64, -64, 64, 64, -64, 64, -64, -64, -64, -64, 64, 64, 64, 64, -64, -64, -64, -64, -64, -64, 64, -64, -64, 64, 64, 64, 64, -64, -64, -64, 64, 64, 64, 64, 64, -64, -64, 64, 64, 64, 64, -64, -64, -64, -64, -64, -64, -64, 64, 64, -64, 64, 64, 64, 64, -64, -64, -64, 64, 64, -64, -64, 64, 64, -64, 64, 64, 64, -64, -64, -64, -64, -64, -64, -64, -64, 64, 64, 64, 64, 64, 64, 64, 64, 64, -64, 64, -64, 64, 64, 64, 64, 64, 64, 64, 64, 64, -64, -64, -64, -64, -64, -64, -64, -64, 64, 64, 64, 64, 64, 64, 64, 64, -64, 64, -64, -64, -64, 64, 64, 64, 64, 64, 64, 64, 64, -64, -64, -64, -64, -64, -64, 64, 64, 64, 64, 64, 64, 64, 64, 64, -64, 64, -64, -64, -64, 64, -64, -64, 64, 64, 64, -64, -64, -64, -64, 64, -64, -64, 64, -64, 64, 64, 64, 64, -64, -64, -64, 64, 64, -64, -64, 64, 64, 64, -64, -64, -64, -64, 64, 64, 64, 64, 64, -64, 64, 64, 64, 64, 64, 64, 64, -64, -64, -64, 64, 64, 64, 64, 64, 64, -64, 64, -64, -64, 64, 64, 64, 64, 64, 64, 64, 64, -64, 64, 64, 64, 64, 64, -64, -64, 64, 64, -64, 64, 64, -64, -64, -64, -64, -64, -64, 64, 64, -64, 64, 64, 64, 64, 64, 64, 64, -64, -64, -64, 64, -64, -64, -64, -64, 64, 64, 64, -64, 64, -64, 64, -64, 64, 64, 64, 64, -64, -64, -64, 64, 64, 64, 64, -64, -64, -64, -64, -64, -64, -64, -64, 64, 64, 64, -64, -64, -64, 64, -64, -64, -64, 64, 64, 64, 64, -64, -64, -64, -64, -64, -64, 64, -64, -64, -64, -64, -64, -64, -64, -64, -64, -64, 64, 64, -64, 64, 64, 64, -64, 64, 64, 64, -64, 64, -64, -64, -64, 64, 64, -64, -64, -64, -64, -64, -64, -64, -64, -64, 64, -64, 64, -64, 64, 64, 64, 64, -64, 64, 64, 64, 64, 64, 64, -64, -64, -64, 64, -64, -64, -64, -64, -64, -64, -64, -64, -64, -64, -64, 64, 64, -64, -64, 64, -64, 64, -64, 64, 64, 64, 64, -64, 64, -64, 64, 64, 64, 64, -64, -64, -64, -64, -64, -64, -64, -64, -64, 64, -64, 64, 64, -64, 64, -64, 64, 64, 64, -64, 64, 64, -64, 64, 64, -64, 64, 64, -64, -64, -64, 64, 64, 64, 64, 64, -64, -64, 64, 64, -64, -64, 64, 64, 64, 64, 64, -64, -64, 64, 64, 64, 64, 64, 64, -64, -64, 64, 64, 64, 64, 64, -64, -64, -64, 64, -64, 64, -64, -64, -64, -64, -64, 64, -64, -64, -64, -64, -64, 64, 64, -64, -64, 64, -64, 64, 64, 64, 64, 64, -64, -64, -64, -64, -64, 64, 64, 64, 64, -64, 64, -64, -64, 64, -64, -64, -64, -64, -64, 64, -64, -64, -64, 64, 64, 64, -64, 64, -64, -64, -64, 64, -64, -64, 64, -64, -64, 64, -64, -64, -64, -64, 64, 64, -64, 64, -64, 64, 64, -64, -64, 64, -64, -64, 64, 64, -64, -64, -64, -64, 64, 64, -64, 64, -64, 64, -64, 64, -64, 64, -64, 64, 64, 64, -64, -64, 64, 64, -64, 64, 64, 64, 64, -64, 64, 64, -64, 64, -64, -64, -64, 64, 64, 64, -64, 64, 64, -64, 64, -64, -64, -64, -64, -64, 64, 64, -64, -64, 64, 64, 64, -64, 64, 64, 64, 64, -64, -64, -64, 64, 64, -64, -64, -64, -64, 64, 64, -64, -64, -64, 64, 64, -64, -64, -64, -64, 64, 64, 64, 64, -64, -64, 64, 64, 64, 64, -64, 64, 64, -64, -64, 64, 64, 64, -64, -64, -64, -64, 64, 64, -64, -64, 64, -64, -64, -64, 64, -64, 64, -64, 64, 64, 64, -64, 64, -64, -64, 64, 64, 64, 64, -64, -64, 64, 64, -64, -64, -64, -64, -64, -64, -64, -64, -64, 64, 64, -64, 64, 64, 64, -64, -64, 64, -64, 64, -64, -64, -64, -64, 64, -64, -64, -64, -64, -64, -64, 64, -64, -64, -64, -64, -64, 64, -64, -64, -64, 64, 64, 64, -64, 64, -64, -64, -64, -64, -64, -64, 64, -64, -64, 64, -64, -64, -64, -64, -64, 64, -64, -64, -64, -64, -64, -64, -64, 64, 64, 64, 64, 64, -64, 64, -64, -64, -64, -64, -64, -64, -64, -64, -64, -64, 64, 64, -64, -64, -64, -64, -64, -64, -64, -64, -64, 64, -64, 64, 64, 64, -64, 64, -64, 64, -64, -64, -64, -64, -64, 64, 64, 64, 64, 64, -64, -64, -64, -64, -64, 64, -64, -64, -64, 64, -64, 64, 64, 64, -64, -64, -64, 64, 64, -64, 64, 64, 64, 64, 64, 64, 64, -64, -64, -64, -64, -64, -64, -64, -64, -64, 64, 64, 64, 64, -64, 64, -64, 64, -64, 64, 64, 64, 64, 64, 64, 64, 64, 64, 64, -64, -64, -64, -64, -64, -64, -64, -64, 64, 64, -64, -64, -64, -64, -64, -64, 64, -64, 64, 64, -64, -64, 64, 64, -64, 64, 64, -64, -64, 64, 64, -64, -64, 64, -64, -64, 64, 64, -64, 64, -64, -64, 64, 64, 64, -64, -64, -64, -64, 64, 64, 64, 64, -64, -64, -64, -64, -64, -64, 64, -64, -64, 64, -64, 64, 64, -64, -64, -64, 64, -64, 64, 64, -64, -64, -64, -64, -64, -64, -64, -64, -64, -64, -64, -64, 64, 64, -64, -64, -64, -64, -64, -64, -64, -64, -64, -64, -64, -64, 64, -64, -64, 64, -64, -64, -64, -64, -64, -64, -64, -64, -64, -64, -64, -64, -64, -64, 64, -64, -64, -64, -64, -64, -64, -64, 64, -64, 64, -64, -64, -64, 64, -64, -64, -64, -64, -64, -64, -64, -64, -64, -64, 64, -64, -64, -64, 64, -64, -64, -64, -64, -64, -64, 64, 64, 64, -64, -64, -64, -64, -64, 64, 64, -64, -64, -64, -64, -64, -64, -64, -64, 64, -64, -64, 64, 64, 64, 64, 64, -64, -64, 64, 64, -64, -64, -64, -64, -64, -64, -64, 64, 64, -64, 64, 64, 64, -64, -64, -64, -64, -64, -64, 64, 64, 64, 64, 64, -64, -64, 64, -64, 64, -64, -64, 64, -64, -64, 64, -64, -64, -64, 64, -64, -64, 64, -64, -64, -64, -64, 64, -64, -64, -64, 64, -64, 64, -64, -64, -64, -64, -64, -64, -64, -64, -64, -64, -64, -64, -64, 64, -64, -64, -64, -64, -64, -64, -64, -64, -64, 64, -64, -64, -64, -64, -64, -64, 64, -64, 64, -64, -64, -64, -64, -64, -64, -64, -64, -64, 64, 64, -64, -64, -64, -64, -64, -64, -64, -64, -64, 64, 64, 64, -64, -64, -64, 64, -64, -64, -64, -64, -64, -64, -64, -64, 64, -64, -64, -64, 64, 64, -64, -64, 64, 64, 64, -64, -64, 64, 64, 64, -64, 64, -64, 64, 64, -64, -64, -64, -64, -64, -64, 64, -64, 64, -64, 64, -64, 64, -64, -64, -64, -64, 64, 64, -64, 64, 64, -64, -64, -64, -64, 64, -64, -64, 64, 64, 64, -64, -64, -64, -64, -64, -64, -64, -64, -64, -64, 64, 64, 64, -64, -64, 64, -64, 64, 64, 64, -64, 64, 64, 64, 64, 64, -64, 64, 64, -64, -64, -64, 64, 64, -64, 64, -64, 64, 64, 64, 64, -64, -64, -64, 64, 64, -64, 64, -64, 64, 64, 64, 64, -64, 64, 64, -64, 64, -64, -64, 64, -64, -64, -64, 64, 64, 64, 64, 64, -64, -64, 64, -64, 64, -64, 64, 64, -64, 64, 64, -64, -64, -64, 64, 64, -64, -64, 64, -64, -64, -64, 64, 64, -64, -64, -64, -64, 64, -64, 64, 64, -64, 64, -64, 64, -64, 64, -64, 64, 64, -64, 64, 64, 64, -64, -64, -64, -64, 64, -64, 64, 64, -64, 64, -64, 64, -64, 64, 64, 64, 64, -64, -64, 64, -64, 64, -64, -64, 64, 64, 64, -64, -64, -64, -64, -64, -64, -64, -64, 64, 64, 64, -64, -64, -64, -64, -64, -64, -64, 64, -64, -64, 64, -64, -64, -64, -64, -64, -64, -64, -64, -64, -64, -64, 64, -64, 64, 64, 64, 64, -64, -64, -64, -64, -64, -64, 64, -64, -64, 64, 64, 64, -64, 64, 64, 64, -64, -64, -64, 64, -64, 64, -64, 64, 64, 64, 64, -64, -64, 64, -64, -64, 64, 64, -64, 64, 64, 64, -64, 64, 64, 64, -64, -64, -64, -64, -64, -64, -64, 64, 64, 64, 64, 64, 64, -64, -64, -64, -64, 64, 64, 64, 64, -64, 64, -64, -64, -64, 64, 64, -64, -64, -64, -64, -64, -64, 64, 64, 64, 64, 64, 64, -64, -64, -64, -64, -64, -64, -64, 64, 64, -64, -64, 64, 64, 64, 64, 64, 64, 64, -64, -64, -64, -64, 64, 64, 64, 64, 64, 64, -64, -64, -64, -64, -64, -64, 64, 64, 64, 64, -64, 64, 64, -64, 64, -64, -64, -64, -64, -64, -64, -64, 64, 64, 64, 64, 64, -64, -64, -64, -64, 64, -64, 64, 64, 64, 64, 64, -64, 64, 64, -64, 64, 64, -64, -64, -64, -64, -64, -64, 64, 64, 64, 64, 64, 64, -64, -64, 64, -64, 64, 64, 64, 64, 64, 64, 64, -64, -64, 64, -64, 64, -64, 64, -64, -64, -64, -64, 64, 64, 64, 64, -64, -64, -64, -64, -64, 64, 64, -64, 64, -64, -64, -64, -64, -64, 64, -64, -64, 64, -64, -64, -64, -64, -64, 64, 64, 64, 64, 64, -64, -64, -64, -64, -64, 64, 64, -64, -64, -64, -64, -64, -64, 64, 64, 64, -64, -64, -64, -64, -64, -64, 64, 64, 64, 64, 64, 64, 64, -64, 64, -64, -64, -64, -64, -64, -64, -64, -64, -64, -64, -64, 64, 64, -64, -64, -64, -64, -64, 64, 64, 64, 64, 64, -64, -64, 64, -64, -64, -64, -64, -64, 64, 64, -64, -64, -64, 64, -64, 64, -64, -64, -64, -64, -64, -64, -64, -64, -64, -64, -64, 64, 64, -64, 64, 64, 64, -64, 64, 64, 64, -64, -64, -64, -64, -64, 64, -64, -64, 64, -64, -64, -64, 64, -64, 64, -64, 64, 64, -64, -64, 64, -64, 64, 64, 64, -64, 64, -64, 64, -64, -64, 64, 64, 64, -64, -64, -64, 64, 64, -64, -64, 64, 64, 64, 64, -64, 64, 64, -64, 64, 64, 64, -64, -64, -64, -64, -64, 64, 64, -64, 64, 64, -64, 64, 64, 64, -64, -64, -64, 64, 64, 64, -64, 64, 64, 64, 64, -64, 64, -64, -64, 64, -64, -64, 64, -64, 64, -64, 64, 64, 64, 64, 64, 64, 64, 64, 64, 64, 64, 64, -64, -64, -64, -64, 64, 64, 64, -64, 64, -64, 64, -64, -64, 64, -64, 64, -64, -64, -64, -64, -64, 64, -64, 64, 64, 64, 64, 64, 64, -64, 64, 64, -64, -64, 64, 64, -64, 64, -64, 64, -64, 64, 64, 64, 64, 64, 64, 64, 64, 64, -64, 64, -64, 64, 64, -64, -64, 64, 64, 64, -64, -64, -64, -64, -64, -64, 64, 64, -64, 64, 64, 64, -64, -64, 64, -64, -64, 64, -64, 64, -64, 64, 64, 64, 64, 64, 64, 64, 64, 64, 64, 64, 64, 64, -64, -64, 64, 64, 64, 64, 64, 64, -64, 64, 64, -64, 64, 64, 64, -64, 64, -64, 64, 64, 64, 64, 64, 64, 64, 64, 64, 64, -64, -64, 64, 64, 64, -64, -64, 64, -64, 64, -64, 64, -64, 64, 64, -64, -64, -64, -64, 64, 64, 64, -64, 64, -64, -64, 64, 64, -64, -64, -64, -64, -64, 64, -64, 64, -64, 64, -64, -64, -64, 64, -64, 64, 64, -64, -64, 64, -64, -64, -64, -64, -64, 64, -64, 64, -64, -64, -64, -64, -64, 64, 64, 64, 64, -64, -64, 64, -64, -64, -64, 64, 64, 64, -64, 64, -64, -64, 64, -64, 64, 64, 64, 64, 64, 64, -64, 64, 64, -64, -64, 64, -64, -64, 64, 64, -64, -64, -64, 64, -64, 64, -64, 64, 64, -64, 64, 64, 64, 64, 64, 64, 64, 64, 64, 64, 64, 64, -64, -64, -64, 64, -64, -64, -64, 64, 64, 64, -64, 64, 64, 64, 64, -64, 64, 64, -64, 64, -64, 64, 64, -64, 64, 64, -64, 64, 64, -64, 64, 64, 64, -64, -64, 64, -64, -64, -64, 64, 64, -64, 64, 64, 64, -64, 64, 64, -64, -64, 64, 64, 64, -64, -64, 64, 64, 64, 64, 64, 64, 64, -64, -64, 64, 64, 64, 64, 64, 64, -64, 64, -64, 64, 64, -64, 64, 64, 64, 64, 64, -64, 64, 64, -64, 64, 64, 64, -64, 64, 64, -64, -64, -64, 64, -64, -64, -64, -64, 64, -64, 64, -64, -64, -64, 64, 64, 64, 64, -64, -64, 64, 64, 64, -64, -64, -64, 64, 64, -64, 64, 64, -64, -64, -64, -64, -64, -64, 64, 64, 64, 64, 64, 64, 64, 64, 64, 64, 64, 64, -64, 64, -64, 64, 64, 64, -64, 64, 64, 64, -64, 64, 64, -64, -64, -64, -64, -64, 64, -64, -64, -64, -64, 64, 64, 64, 64, -64, -64, 64, -64, 64, 64, -64, 64, -64, -64, -64, 64, 64, 64, -64, -64, -64, -64, -64, -64, -64, -64, -64, 64, 64, 64, -64, -64, -64, 64, -64, -64, -64, 64, 64, -64, -64, -64, -64, -64, -64, -64, -64, -64, -64, -64, -64, -64, -64, -64, -64, -64, 64, -64, 64, -64, -64, 64, 64, 64, 64, -64, 64, 64, 64, -64, -64, -64, -64, -64, -64, -64, -64, 64, 64, -64, -64, -64, -64, -64, -64, -64, -64, -64, -64, -64, 64, 64, -64, -64, -64, -64, -64, -64, -64, -64, -64, -64, -64, -64, -64, 64, -64, 64, -64, 64, -64, -64, -64, -64, -64, -64, -64, 64, -64, -64, 64, -64, -64, -64, -64, -64, -64, 64, -64, -64, -64, -64, -64, -64, 64, -64, -64, -64, -64, -64, -64, -64, -64, -64, -64, 64, -64, 64, 64, 64, -64, -64, -64, -64, 64, 64, -64, -64, 64, -64, 64, 64, 64, -64, 64, -64, -64, -64, -64, -64, -64, -64, -64, -64, -64, 64, 64, 64, -64, -64, -64, -64, 64, 64, 64, 64, -64, 64, 64, -64, 64, 64, 64, -64, -64, -64, -64, -64, -64, -64, -64, -64, 64, 64, -64, 64, -64, -64, -64, -64, 64, 64, 64, 64, 64, -64, 64, 64, 64, -64, 64, 64, 64, 64, -64, -64, -64, -64, -64, -64, 64, -64, -64, -64, -64, -64, -64, 64, 64, 64, 64, 64, 64, 64, 64, 64, 64, 64, 64, 64, 64, -64, 64, 64, -64, -64, -64, -64, -64, -64, 64, -64, -64, -64, -64, 64, -64, -64, 64, 64, -64, 64, 64, 64, 64, 64, 64, 64, -64, -64, -64, 64, -64, -64, -64, 64, 64, -64, 64, -64, -64, -64, -64, -64, -64, 64, -64, 64, 64, 64, -64, 64, 64, 64, 64, -64, -64, -64, -64, -64, -64, -64, -64, -64, 64, 64, -64, 64, -64, -64, -64, -64, -64, -64, -64, 64, 64, -64, -64, 64, -64, 64, -64, -64, -64, -64, -64, -64, -64, -64, 64, -64, -64, 64, 64, 64, -64, -64, -64, -64, -64, -64, -64, -64, 64, 64, 64, 64, 64, -64, -64, -64, -64, -64, -64, -64, -64, -64, -64, -64, -64, -64, -64, -64, -64, -64, -64, -64, -64, -64, -64, -64, -64, -64, 64, 64, -64, -64, -64, -64, -64, -64, -64, -64, -64, -64, -64, -64, 64, 64, 64, -64, -64, -64, -64, -64, -64, -64, -64, -64, 64, 64, -64, -64, -64, -64, -64, -64, -64, -64, -64, -64, -64, 64, -64, -64, -64, 64, -64, 64, -64, -64, -64, -64, -64, -64, -64, -64, -64, -64, -64, -64, 64, 64, 64, 64, -64, -64, -64, -64, -64, -64, 64, -64, -64, 64, -64, 64, -64, -64, -64, -64, -64, -64, -64, -64, -64, -64, -64, 64, -64, 64, 64, 64, -64, -64, -64, -64, 64, -64, -64, -64, 64, 64, 64, -64, 64, -64, 64, -64, -64, -64, -64, -64, -64, -64, -64, -64, -64, 64, 64, 64, -64, -64, -64, -64, -64, -64, -64, 64, 64, -64, -64, -64, -64, -64, 64, 64, 64, 64, -64, -64, -64, -64, -64, -64, -64, 64, 64, 64, 64, 64, -64, -64, 64, 64, 64, 64, 64, 64, 64, -64, 64, 64, 64, 64, 64, 64, -64, 64, -64, -64, -64, -64, -64, -64, 64, 64, 64, 64, 64, -64, -64, -64, 64, -64, -64, 64, -64, -64, 64, 64, 64, -64, -64, 64, -64, -64, -64, 64, -64, -64, -64, 64, 64, 64, -64, 64, 64, 64, -64, -64, 64, -64, 64, 64, 64, 64, 64, 64, -64, 64, 64, 64, 64, -64, -64, 64, 64, 64, 64, 64, 64, 64, 64, -64, -64, -64, -64, -64, -64, 64, 64, -64, 64, -64, 64, -64, -64, 64, 64, 64, 64, -64, -64, 64, 64, 64, 64, 64, -64, -64, 64, -64, -64, -64, -64, -64, 64, -64, 64, 64, 64, 64, -64, -64, -64, -64, -64, -64, 64, 64, -64, 64, -64, -64, -64, -64, -64, -64, -64, 64, 64, 64, -64, 64, -64, -64, 64, 64, -64, -64, 64, 64, -64, -64, 64, -64, -64, 64, -64, -64, 64, -64, -64, -64, -64, 64, 64, -64, 64, 64, 64, 64, -64, -64, 64, 64, 64, -64, -64, 64, -64, -64, -64, 64, 64, 64, -64, 64, 64, 64, 64, 64, -64, 64, 64, -64, 64, 64, 64, -64, 64, 64, -64, -64, 64, 64, -64, 64, -64, -64, 64, -64, -64, -64, 64, 64, 64, -64, 64, 64, 64, 64, 64, -64, 64, 64, 64, 64, 64, -64, 64, 64, -64, -64, 64, -64, -64, -64, 64, -64, 64, 64, 64, 64, -64, 64, 64, 64, 64, 64, 64, 64, -64, 64, -64, 64, -64, -64, 64, 64, 64, -64, 64, -64, 64, 64, -64, 64, -64, 64, 64, -64, -64, 64, -64, -64, -64, 64, 64, 64, 64, 64, 64, 64, -64, 64, 64, 64, -64, 64, -64, 64, 64, -64, -64, -64, 64, -64, 64, -64, -64, -64, -64, -64, -64, -64, -64, -64, 64, 64, 64, -64, 64, 64, -64, -64, 64, -64, 64, 64, -64, 64, 64, 64, 64, -64, -64, -64, -64, -64, -64, -64, -64, -64, -64, 64, 64, 64, -64, -64, -64, -64, 64, 64, -64, -64, -64, 64, -64, -64, -64, -64, 64, -64, 64, -64, -64, -64, -64, -64, -64, -64, -64, -64, 64, 64, 64, -64, -64, -64, -64, -64, -64, 64, -64, 64, -64, 64, -64, -64, -64, 64, -64, -64, -64, -64, -64, -64, -64, -64, -64, 64, -64, 64, 64, 64, -64, -64, -64, 64, -64, 64, 64, 64, 64, 64, -64, 64, 64, 64, -64, -64, -64, -64, -64, -64, -64, -64, -64, 64, -64, 64, -64, 64, 64, 64, 64, 64, -64, -64, 64, 64, -64, -64, -64, -64, -64, 64, 64, -64, -64, -64, -64, -64, -64, -64, -64, 64, 64, -64, -64, -64, 64, 64, -64, 64, 64, 64, 64, 64, 64, -64, -64, 64, -64, 64, 64, 64, 64, -64, -64, -64, -64, -64, -64, -64, -64, 64, -64, 64, 64, 64, -64, -64, 64, -64, 64, 64, 64, -64, 64, 64, 64, 64, 64, -64, -64, -64, -64, 64, -64, -64, -64, -64, 64, 64, -64, -64, 64, -64, 64, 64, -64, 64, 64, 64, -64, -64, -64, -64, -64, 64, -64, -64, -64, -64, -64, -64, 64, -64, -64, 64, 64, -64, 64, -64, 64, 64, 64, -64, 64, 64, 64, 64, 64, -64, -64, -64, -64, -64, 64, -64, -64, 64, -64, -64, -64, -64, -64, 64, -64, 64, 64, 64, -64, 64, -64, 64, 64, -64, 64, 64, 64, -64, 64, 64, -64, -64, 64, 64, -64, -64, -64, -64, -64, 64, 64, 64, 64, 64, 64, -64, 64, -64, 64, -64, -64, 64, 64, 64, -64, 64, -64, -64, 64, -64, -64, -64, -64, -64, -64, -64, 64, -64, -64, -64, 64, 64, 64, 64, -64, -64, -64, 64, -64, -64, 64, 64, -64, -64, -64, -64, -64, 64, -64, -64, -64, -64, -64, -64, 64, 64, -64, -64, -64, 64, -64, 64, -64, -64, 64, 64, 64, 64, 64, -64, 64, -64, -64, -64, -64, -64, 64, -64, -64, -64, -64, 64, -64, 64, 64, 64, 64, 64, 64, -64, 64, 64, -64, -64, 64, 64, 64, -64, -64, -64, 64, -64, -64, -64, -64, -64, -64, -64, -64, 64, -64, 64, -64, 64, 64, -64, 64, 64, 64, 64, 64, -64, 64, 64, -64, -64, -64, 64, 64, 64, -64, 64, -64, -64, -64, -64, 64, 64, 64, -64, 64, 64, -64, 64, -64, 64, -64, -64, 64, 64, -64, -64, 64, 64, 64, -64, -64, -64, -64, -64, -64, -64, -64, 64, 64, 64, 64, -64, 64, 64, -64, -64, -64, -64, -64, 64, -64, 64, -64, 64, -64, 64, 64, -64, 64, -64, -64, -64, -64, -64, 64, -64, 64, 64, 64, 64, 64, 64, -64, -64, 64, -64, 64, -64, -64, -64, 64, 64, 64, 64, -64, 64, 64, -64, -64, -64, -64, 64, -64, 64, 64, 64, 64, 64, -64, -64, -64, -64, 64, 64, 64, 64, -64, 64, 64, -64, 64, -64, 64, -64, -64, -64, -64, 64, -64, -64, 64, 64, -64, 64, 64, -64, -64, -64, -64, -64, 64, 64, 64, 64, 64, -64, 64, 64, 64, 64, 64, -64, -64, 64, -64, 64, -64, -64, -64, 64, -64, -64, 64, 64, 64, -64, -64, -64, -64, 64, 64, -64, 64, -64, -64, 64, 64, -64, 64, -64, 64, -64, -64, 64, -64, 64, 64, -64, -64, -64, 64, -64, 64, -64, 64, 64, 64, 64, -64, -64, 64, -64, -64, 64, -64, -64, -64, 64, -64, -64, 64, 64, -64, 64, -64, 64, -64, 64, 64, -64, 64, -64, -64, 64, 64, -64, -64, 64, -64, 64, 64, 64, 64, 64, 64, -64, -64, -64, 64, -64, 64, 64, 64, -64, 64, -64, -64, 64, 64, 64, 64, -64, 64, 64, 64, 64, -64, 64, 64, 64, 64, 64, 64, -64, -64, -64, -64, -64, -64, -64, 64, -64, -64, 64, -64, 64, -64, -64, 64, 64, 64, -64, 64, 64, -64, 64, 64, 64, 64, 64, 64, 64, -64, -64, -64, -64, 64, 64, 64, -64, -64, -64, -64, 64, -64, 64, 64, -64, -64, 64, -64, 64, 64, 64, -64, -64, -64, -64, -64, -64, 64, -64, 64, -64, -64, -64, -64, -64, 64, -64, 64, 64, -64, -64, -64, 64, -64, 64, 64, 64, 64, -64, -64, -64, -64, -64, 64, 64, 64, -64, -64, -64, -64, -64, 64, -64, -64, -64, -64, 64, 64, -64, -64, -64, 64, -64, -64, -64, -64, -64, -64, -64, -64, -64, -64, 64, 64, -64, -64, 64, -64, -64, -64, -64, 64, -64, -64, -64, -64, 64, -64, -64, -64, -64, 64, 64, 64, -64, 64, -64, 64, -64, -64, 64, -64, -64, 64, 64, 64, 64, -64, 64, 64, -64, -64, -64, -64, -64, -64, -64, 64, 64, 64, -64, -64, -64, -64, 64, 64, 64, 64, -64, -64, 64, -64, 64, 64, -64, -64, -64, 64, -64, -64, -64, -64, 64, 64, 64, -64, -64, 64, 64, -64, -64, -64, 64, -64, -64, -64, -64, -64, -64, -64, -64, -64, -64, 64, -64, -64, -64, -64, -64, -64, -64, -64, -64, 64, -64, 64, -64, -64, -64, -64, -64, -64, -64, -64, 64, 64, -64, -64, 64, -64, -64, -64, -64, -64, -64, -64, 64, -64, 64, 64, 64, -64, 64, -64, 64, 64, -64, -64, 64, -64, -64, -64, 64, -64, -64, -64, 64, -64, -64, -64, -64, -64, 64, -64, 64, -64, 64, 64, -64, -64, 64, -64, -64, 64, -64, 64, -64, -64, -64, 64, -64, 64, -64, 64, -64, 64, -64, 64, 64, 64, -64, -64, -64, -64, -64, -64, -64, -64, 64, 64, -64, -64, 64, -64, 64, -64, -64, 64, 64, -64, -64, -64, -64, -64, 64, -64, -64, -64, 64, -64, 64, -64, 64, -64, -64, 64, 64, -64, -64, 64, -64, -64, 64, -64, -64, 64, 64, -64, -64, 64, -64, -64, -64, 64, 64, 64, 64, -64, -64, 64, -64, -64, -64, 64, -64, -64, 64, 64, -64, 64, 64, -64, -64, -64, 64, 64, -64, -64, 64, -64, -64, -64, 64, -64, 64, -64, -64, -64, -64, -64, -64, 64, 64, -64, -64, 64, -64, 64, 64, 64, 64, 64, -64, -64, 64, 64, 64, -64, -64, 64, -64, -64, -64, -64, 64, 64, -64, -64, 64, 64, 64, 64, -64, 64, -64, -64, 64, 64, -64, 64, -64, -64, -64, 64, 64, -64, -64, -64, -64, 64, -64, -64, 64, -64, -64, 64, 64, 64, 64, -64, 64, -64, 64, -64, 64, 64, -64, 64, 64, 64, -64, -64, 64, -64, 64, -64, -64, -64, -64, -64, -64, 64, -64, 64, 64, 64, 64, -64, -64, 64, 64, 64, 64, 64, -64, 64, 64, 64, -64, -64, 64, -64, 64, 64, 64, -64, -64, 64, 64, -64, -64, 64, -64, -64, -64, -64, -64, 64, 64, -64, 64, 64, -64, 64, -64, 64, -64, -64, -64, 64, 64, -64, 64, 64, 64, -64, 64, 64, -64, 64, 64, -64, -64, -64, -64, 64, 64, 64, -64, 64, 64, -64, -64, 64, -64, 64, -64, -64, -64, -64, 64, -64, -64, 64, 64, -64, -64, -64, 64, 64, 64, -64, 64, -64, -64, -64, -64, -64, -64, 64, -64, -64, -64, 64, 64, -64, -64, -64, -64, -64, 64, -64, -64, -64, -64, 64, -64, 64, -64, -64, 64, 64, 64, -64, -64, -64, 64, -64, 64, -64, 64, -64, -64, -64, 64, 64, 64, 64, 64, -64, -64, -64, -64, -64, 64, 64, -64, -64, -64, 64, 64, -64, -64, 64, -64, -64, -64, 64, 64, -64, -64, 64, -64, 64, 64, -64, -64, 64, -64, 64, -64, -64, 64, 64, -64, -64, -64, 64, 64, 64, 64, 64, 64, -64, -64, 64, -64, 64, -64, 64, -64, 64, -64, 64, 64, 64, -64, 64, -64, -64, -64, -64, 64, 64, -64, 64, 64, 64, -64, -64, -64, -64, 64, 64, 64, 64, -64, 64, 64, -64, -64, 64, 64, 64, -64, -64, -64, -64, 64, 64, 64, -64, 64, 64, 64, -64, -64, -64, -64, 64, -64, 64, -64, -64, 64, 64, 64, -64, -64, -64, 64, 64, 64, -64, 64, 64, -64, -64, 64, 64, 64, 64, 64, -64, -64, -64, -64, -64, -64, -64, -64, 64, -64, -64, 64, -64, -64, 64, -64, -64, -64, 64, -64, -64, -64, -64, -64, 64, 64, -64, -64, 64, -64, -64, -64, 64, 64, 64, 64, 64, 64, -64, 64, -64, -64, -64, 64, 64, 64, 64, 64, -64, 64, 64, -64, -64, 64, -64, -64, 64, -64, 64, -64, 64, 64, 64, -64, -64, -64, 64, 64, 64, 64, 64, 64, -64, 64, 64, -64, -64, -64, 64, 64, -64, -64, -64, 64, 64, 64, 64, -64, -64, -64, 64, 64, -64, 64, 64, -64, 64, 64, 64, 64, 64, 64, -64, -64, 64, 64, 64, 64, 64, -64, -64, 64, -64, 64, -64, 64, -64, 64, 64, -64, -64, -64, -64, 64, 64, 64, -64, 64, 64, 64, 64, 64, 64, 64, 64, 64, -64, 64, 64, 64, 64, 64, 64, -64, 64, 64, 64, 64, 64, 64, 64, 64, 64, 64, 64, 64, 64, 64, 64, 64, -64, -64, -64, -64, -64, 64, -64, -64, -64, -64, 64, -64, 64, 64, 64, 64, 64, 64, 64, -64, 64, -64, 64, 64, 64, 64, 64, 64, 64, -64, 64, -64, 64, -64, 64, 64, -64, -64, 64, -64, 64, 64, 64, 64, 64, 64, 64, 64, 64, 64, 64, 64, 64, 64, 64, 64, -64, -64, -64, -64, -64, 64, 64, 64, 64, 64, 64, 64, 64, 64, 64, 64, 64, 64, 64, -64, 64, 64, -64, 64, -64, 64, 64, 64, 64, -64, -64, -64, -64, -64, 64, 64, -64, 64, 64, 64, 64, 64, 64, 64, 64, 64, -64, 64, 64, 64, -64, 64, 64, 64, 64, 64, -64, -64, -64, -64, -64, -64, -64, 64, 64, -64, -64, 64, 64, -64, 64, 64, 64, -64, 64, 64, -64, 64, 64, -64, 64, -64, 64, -64, -64, -64, -64, -64, -64, -64, -64, 64, -64, -64, 64, -64, 64, -64, 64, 64, -64, -64, -64, -64, -64, 64, -64, -64, -64, 64, 64, -64, -64, -64, -64, -64, -64, -64, -64, 64, 64, -64, 64, 64, 64, -64, 64, 64, -64, -64, -64, -64, -64, 64, 64, 64, 64, 64, -64, -64, -64, -64, -64, -64, 64, 64, 64, 64, -64, -64, 64, -64, 64, 64, -64, -64, -64, -64, -64, -64, 64, 64, 64, 64, 64, 64, 64, -64, -64, -64, 64, 64, -64, 64, -64, -64, -64, 64, 64, 64, 64, 64, 64, 64, -64, -64, -64, -64, 64, 64, 64, 64, 64, -64, -64, -64, -64, 64, 64, 64, 64, 64, 64, -64, -64, 64, 64, 64, 64, 64, -64, -64, -64, -64, -64, -64, 64, -64, 64, -64, -64, 64, 64, 64, 64, 64, 64, 64, 64, 64, 64, -64, -64, -64, -64, 64, 64, -64, 64, 64, 64, 64, 64, -64, 64, -64, -64, 64, 64, 64, 64, 64, 64, 64, 64, 64, 64, 64, 64, -64, 64, -64, 64, 64, 64, -64, 64, -64, 64, -64, 64, -64, 64, -64, -64, 64, 64, 64, 64, 64, -64, -64, 64, -64, -64, 64, -64, -64, -64, -64, 64, 64, 64, 64, -64, -64, 64, 64, -64, -64, -64, 64, 64, 64, 64, 64, 64, 64, 64, -64, 64, 64, -64, -64, -64, 64, -64, -64, -64, 64, 64, 64, -64, 64, 64, -64, -64, -64, -64, 64, 64, 64, 64, 64, 64, 64, 64, 64, -64, -64, 64, -64, 64, -64, 64, -64, 64, 64, 64, 64, -64, -64, 64, -64, -64, 64, 64, 64, 64, -64, 64, 64, 64, 64, 64, 64, 64, -64, 64, 64, 64, 64, 64, 64, 64, 64, -64, -64, -64, -64, -64, -64, -64, 64, 64, 64, 64, 64, 64, 64, 64, 64, 64, 64, 64, 64, -64, 64, -64, 64, 64, 64, 64, 64, -64, -64, -64, -64, -64, 64, 64, 64, 64, 64, 64, 64, 64, 64, 64, -64, -64, 64, 64, 64, 64, -64, -64, 64, -64, 64, -64, -64, -64, -64, -64, -64, 64, -64, 64, 64, 64, 64, 64, -64, -64, 64, 64, -64, 64, -64, 64, -64, 64, 64, -64, -64, -64, -64, -64, -64, -64, -64, -64, -64, -64, 64, 64, -64, 64, 64, 64, 64, 64, -64, 64, -64, 64, 64, 64, -64, -64, -64, 64, -64, -64, -64, -64, -64, 64, -64, 64, -64, 64, 64, 64, 64, 64, -64, -64, -64, 64, 64, -64, -64, -64, -64, 64, 64, -64, -64, 64, 64, -64, -64, -64, 64, 64, -64, 64, -64, -64, 64, 64, -64, -64, -64, -64, 64, -64, 64, 64, 64, -64, 64, -64, 64, 64, 64, -64, 64, 64, -64, -64, 64, -64, -64, 64, -64, 64, -64, 64, 64, -64, 64, 64, 64, -64, -64, -64, -64, 64, 64, -64, -64, -64, 64, -64, 64, -64, 64, 64, -64, 64, 64, -64, -64, -64, 64, 64, -64, 64, -64, -64, -64, 64, -64, 64, 64, 64, -64, 64, -64, -64, 64, 64, 64, 64, -64, 64, 64, 64, -64, -64, -64, 64, 64, -64, -64, -64, -64, -64, -64, -64, 64, 64, 64, -64, 64, 64, -64, 64, -64, -64, 64, -64, -64, 64, -64, 64, 64, -64, -64, -64, 64, 64, -64, -64, 64, -64, -64, -64, -64, 64, 64, -64, -64, 64, -64, -64, 64, 64, -64, -64, 64, 64, -64, -64, -64, -64, 64, 64, -64, 64, -64, 64, -64, -64, -64, -64, 64, -64, 64, -64, 64, -64, -64, -64, 64, 64, -64, -64, -64, 64, -64, -64, -64, -64, 64, -64, -64, -64, -64, 64, -64, 64, 64, -64, 64, 64, -64, -64, 64, 64, -64, 64, -64, 64, 64, 64, 64, 64, -64, -64, 64, 64, -64, -64, -64, 64, 64, -64, 64, 64, 64, 64, 64, 64, 64, -64, -64, 64, 64, 64, -64, 64, -64, -64, 64, 64, -64, -64, -64, -64, 64, -64, -64, -64, -64, 64, -64, -64, -64, 64, 64, -64, 64, -64, 64, -64, 64, -64, -64, 64, 64, 64, 64, -64, -64, -64, -64, -64, -64, -64, -64, -64, 64, -64, -64, -64, -64, 64, 64, 64, 64, 64, 64, 64, -64, 64, -64, -64, -64, 64, -64, -64, -64, -64, -64, -64, -64, 64, 64, -64, 64, -64, -64, -64, -64, 64, 64, 64, 64, 64, 64, 64, 64, -64, 64, -64, -64, 64, -64, -64, -64, -64, -64, -64, -64, -64, 64, -64, 64, -64, -64, 64, -64, 64, -64, 64, 64, 64, 64, 64, 64, -64, -64, 64, -64, 64, 64, 64, 64, 64, -64, 64, 64, 64, 64, 64, 64, 64, -64, 64, 64, 64, 64, 64, 64, 64, 64, 64, -64, -64, 64, 64, -64, 64, 64, 64, -64, -64, 64, 64, 64, 64, 64, 64, -64, -64, 64, -64, 64, 64, 64, 64, 64, 64, 64, 64, -64, -64, 64, 64, -64, 64, -64, 64, -64, -64, 64, 64, 64, 64, 64, 64, -64, -64, -64, -64, 64, 64, -64, 64, 64, 64, 64, 64, 64, 64, -64, 64, -64, -64, -64, 64, -64, -64, -64, 64, 64, 64, 64, 64, -64, -64, -64, -64, 64, -64, -64, -64, -64, -64, 64, 64, 64, -64, -64, 64, -64, -64, -64, -64, -64, -64, 64, 64, 64, 64, 64, -64, -64, -64, -64, 64, 64, 64, 64, -64, 64, 64, -64, 64, 64, -64, -64, -64, -64, -64, 64, 64, -64, -64, 64, -64, 64, 64, 64, 64, 64, -64, 64, 64, 64, 64, 64, -64, 64, -64, -64, -64, -64, -64, -64, -64, -64, -64, -64, -64, -64, -64, 64, 64, 64, 64, 64, 64, 64, 64, 64, 64, 64, 64, 64, -64, 64, -64, -64, -64, -64, -64, -64, -64, 64, 64, -64, -64, 64, -64, -64, -64, 64, 64, 64, 64, 64, -64, 64, 64, 64, 64, 64, 64, 64, -64, -64, -64, -64, 64, -64, -64, 64, -64, -64, -64, -64, -64, -64, 64, -64, 64, 64, 64, 64, 64, -64, 64, -64, 64, -64, -64, -64, -64, -64, -64, -64, -64, -64, 64, -64, 64, -64, -64, -64, 64, -64, -64, -64, 64, -64, 64, 64, 64, 64, -64, -64, -64, 64, -64, 64, -64, -64, -64, -64, 64, -64, -64, -64, -64, -64, -64, -64, -64, -64, 64, -64, 64, 64, 64, 64, 64, 64, 64, 64, -64, -64, -64, -64, -64, -64, -64, -64, 64, -64, -64, -64, -64, 64, -64, 64, -64, -64, 64, 64, -64, -64, 64, -64, 64, -64, -64, -64, -64, -64, -64, -64, -64, -64, 64, 64, -64, 64, -64, 64, 64, 64, -64, 64, 64, 64, 64, -64, -64, -64, -64, -64, 64, -64, 64, 64, -64, -64, -64, -64, 64, -64, 64, 64, -64, 64, -64, 64, -64, -64, -64, -64, -64, -64, 64, 64, -64, -64, -64, -64, -64, -64, -64, 64, -64, -64, -64, -64, 64, 64, 64, 64, 64, 64, -64, 64, -64, 64, 64, 64, -64, 64, -64, -64, 64, -64, -64, 64, 64, -64, 64, -64, -64, -64, -64, 64, 64, 64, -64, 64, -64, -64, -64, 64, -64, 64, 64, -64, 64, 64, -64, -64, -64, -64, -64, -64, -64, -64, -64, -64, -64, -64, -64, -64, -64, -64, -64, 64, -64, -64, -64, -64, 64, -64, -64, 64, 64, -64, 64, 64, 64, 64, 64, 64, 64, -64, -64, 64, 64, 64, -64, 64, -64, -64, 64, 64, 64, -64, -64, -64, -64, -64, 64, -64, 64, 64, -64, 64, -64, 64, -64, 64, -64, 64, -64, -64, 64, -64, 64, 64, -64, 64, 64, 64, 64, -64, 64, 64, -64, -64, -64, -64, -64, -64, 64, 64, -64, 64, -64, -64, -64, -64, 64, -64, -64, 64, -64, -64, 64, 64, -64, 64, 64, 64, -64, 64, 64, 64, 64, 64, -64, -64, 64, 64, -64, 64, 64, 64, -64, 64, -64, -64, -64, 64, 64, 64, 64, -64, -64, -64, 64, -64, 64, -64, 64, -64, -64, 64, -64, -64, -64, 64, -64, -64, -64, -64, -64, -64, -64, -64, -64, -64, -64, -64, -64, -64, -64, -64, -64, 64, 64, -64, -64, -64, -64, -64, 64, 64, 64, 64, -64, 64, -64, -64, -64, -64, 64, -64, 64, -64, 64, 64, -64, -64, -64, -64, 64, 64, -64, 64, 64, 64, 64, 64, 64, 64, 64, 64, 64, 64, -64, 64, 64, 64, -64, -64, -64, -64, -64, -64, -64, 64, -64, 64, -64, -64, 64, -64, 64, -64, 64, 64, -64, -64, 64, 64, 64, 64, 64, -64, -64, 64, -64, -64, -64, -64, -64, -64, -64, -64, -64, -64, -64, 64, 64, 64, 64, 64, -64, 64, 64, 64, 64, 64, 64, 64, 64, -64, -64, -64, 64, -64, -64, -64, -64, -64, -64, -64, -64, -64, -64, -64, -64, -64, -64, 64, 64, 64, 64, 64, 64, 64, -64, -64, -64, -64, 64, 64, 64, -64, -64, -64, -64, -64, -64, -64, -64, -64, -64, -64, -64, -64, 64, 64, 64, 64, 64, -64, -64, 64, -64, -64, -64, -64, 64, 64, 64, -64, -64, -64, -64, -64, -64, -64, -64, -64, -64, 64, -64, -64, 64, -64, -64, -64, -64, -64, -64, -64, -64, -64, -64, 64, 64, 64, 64, 64, -64, -64, -64, -64, -64, -64, 64, -64, -64, 64, -64, 64, 64, 64, -64, -64, -64, -64, -64, -64, -64, -64, -64, 64, 64, 64, -64, 64, -64, -64, -64, -64, -64, 64, 64, -64, 64, -64, -64, 64, -64, -64, 64, -64, -64, -64, -64, -64, 64, -64, 64, 64, 64, -64, -64, -64, -64, -64, -64, -64, -64, -64, -64, -64, -64, 64, -64, -64, -64, -64, -64, -64, -64, -64, -64, -64, -64, 64, 64, 64, -64, -64, -64, -64, -64, -64, -64, -64, 64, 64, 64, -64, -64, 64, -64, -64, -64, -64, -64, -64, -64, -64, -64, -64, 64, 64, 64, 64, -64, 64, 64, -64, -64, -64, -64, -64, -64, 64, 64, -64, 64, 64, -64, -64, 64, 64, 64, -64, -64, -64, -64, -64, -64, -64, -64, -64, -64, 64, -64, 64, -64, -64, -64, -64, -64, -64, 64, -64, -64, -64, -64, 64, 64, -64, -64, 64, 64, -64, -64, -64, -64, -64, -64, -64, -64, -64, -64, 64, 64, 64, 64, -64, -64, 64, -64, -64, -64, -64, 64, 64, -64, -64, -64, 64, -64, -64, -64, -64, -64, -64, 64, -64, -64, -64, -64, -64, 64, 64, 64, 64, 64, 64, -64, -64, -64, -64, 64, -64, -64, 64, -64, 64, -64, -64, -64, -64, -64, -64, -64, -64, -64, -64, -64, -64, -64, -64, 64, 64, 64, 64, -64, -64, -64, -64, -64, -64, -64, 64, 64, 64, -64, -64, -64, 64, -64, -64, -64, 64, -64, -64, -64, -64, -64, -64, 64, 64, 64, -64, 64, -64, -64, -64, -64, 64, 64, 64, -64, -64, 64, -64, 64, 64, 64, -64, 64, -64, 64, -64, -64, -64, -64, 64, 64, 64, 64, 64, -64, -64, -64, 64, -64, 64, 64, -64, -64, -64, -64, -64, -64, -64, 64, 64, 64, -64, -64, -64, 64, 64, -64, -64, -64, 64, -64, 64, -64, 64, 64, 64, -64, 64, -64, -64, -64, -64, -64, -64, -64, -64, -64, 64, 64, 64, -64, -64, -64, 64, -64, 64, 64, -64, -64, 64, -64, -64, 64, -64, 64, 64, 64, -64, -64, -64, -64, -64, -64, -64, 64, -64, -64, 64, 64, 64, 64, 64, -64, 64, 64, 64, 64, -64, -64, -64, 64, 64, -64, -64, -64, 64, -64, 64, 64, -64, -64, -64, -64, 64, -64, -64, -64, 64, 64, -64, -64, 64, 64, 64, 64, -64, -64, 64, 64, 64, 64, 64, 64, 64, -64, -64, 64, 64, 64, -64, -64, 64, 64, -64, -64, 64, 64, -64, -64, -64, -64, -64, -64, -64, 64, -64, -64, 64, 64, -64, -64, -64, -64, 64, 64, 64, -64, -64, -64, -64, 64, -64, 64, 64, -64, -64, -64, 64, -64, -64, -64, -64, -64, -64, -64, -64, -64, 64, 64, -64, 64, -64, 64, 64, 64, -64, 64, 64, 64, 64, -64, 64, -64, 64, -64, 64, 64, 64, -64, -64, -64, 64, -64, -64, -64, 64, -64, 64, -64, -64, 64, -64, -64, 64, 64, -64, 64, -64, -64, -64, -64, -64, -64, 64, -64, -64, 64, 64, 64, -64, -64, 64, -64, -64, 64, 64, 64, -64, -64, -64, -64, -64, 64, -64, -64, -64, 64, 64, -64, -64, -64, 64, -64, 64, 64, -64, 64, 64, 64, -64, -64, -64, -64, 64, 64, -64, 64, -64, -64, 64, -64, -64, 64, 64, 64, 64, 64, 64, -64, -64, -64, 64, 64, -64, 64, -64, -64, -64, -64, -64, 64, -64, 64, 64, 64, 64, 64, 64, 64, 64, -64, -64, -64, -64, 64, -64, 64, 64, 64, 64, 64, 64, -64, 64, -64, -64, 64, 64, 64, 64, 64, 64, 64, -64, 64, -64, -64, -64, -64, -64, 64, -64, 64, -64, -64, -64, -64, -64, -64, 64, -64, -64, -64, -64, -64, 64, 64, 64, -64, -64, 64, -64, 64, -64, -64, -64, -64, -64, 64, -64, 64, 64, -64, -64, -64, -64, 64, -64, -64, -64, -64, -64, 64, 64, 64, -64, 64, 64, -64, -64, -64, -64, -64, -64, -64, -64, -64, -64, 64, 64, 64, 64, 64, -64, 64, 64, -64, 64, 64, -64, -64, -64, 64, 64, -64, -64, -64, -64, -64, -64, -64, -64, -64, -64, -64, 64, 64, -64, 64, 64, -64, 64, -64, -64, -64, -64, -64, 64, -64, 64, -64, -64, -64, 64, -64, -64, -64, -64, 64, -64, 64, 64, 64, 64, 64, 64, -64, 64, 64, 64, 64, -64, -64, 64, -64, -64, -64, 64, -64, 64, 64, 64, -64, -64, 64, 64, 64, 64, 64, 64, -64, -64, -64, -64, -64, 64, 64, 64, -64, -64, -64, -64, -64, -64, -64, 64, 64, 64, 64, 64, 64, -64, 64, -64, 64, -64, -64, -64, -64, -64, -64, 64, 64, 64, 64, 64, -64, -64, -64, -64, -64, -64, -64, -64, 64, 64, 64, 64, 64, -64, -64, -64, -64, -64, -64, -64, -64, -64, -64, 64, 64, 64, 64, 64, -64, -64, -64, -64, -64, 64, -64, -64, -64, 64, 64, 64, 64, -64, -64, -64, -64, -64, -64, -64, -64, -64, 64, 64, 64, 64, 64, -64, -64, -64, -64, -64, -64, -64, -64, 64, -64, 64, 64, 64, -64, -64, -64, -64, -64, -64, 64, 64, 64, -64, -64, 64, 64, 64, 64, 64, -64, -64, -64, -64, -64, -64, -64, 64, -64, 64, 64, -64, -64, -64, -64, -64, 64, 64, 64, 64, -64, 64, 64, 64, 64, 64, 64, -64, -64, -64, -64, -64, -64, -64, 64, 64, -64, 64, 64, -64, -64, -64, -64, -64, 64, 64, 64, 64, 64, -64, 64, 64, 64, -64, -64, -64, -64, -64, -64, -64, -64, -64, -64, -64, 64, 64, 64, -64, -64, -64, -64, -64, -64, 64, 64, 64, -64, 64, 64, 64, -64, -64, -64, -64, -64, -64, -64, -64, -64, -64, -64, 64, -64, 64, 64, 64, -64, -64, -64, -64, -64, -64, 64, -64, 64, -64, 64, 64, -64, -64, -64, -64, -64, -64, -64, -64, -64, -64, 64, -64, 64, -64, 64, 64, -64, -64, -64, -64, -64, 64, -64, -64, -64, 64, 64, 64, 64, -64, -64, -64, -64, -64, 64, -64, 64, -64, -64, -64, 64, 64, 64, 64, 64, -64, -64, -64, -64, -64, -64, -64, -64, -64, 64, 64, -64, 64, -64, -64, -64, -64, -64, -64, -64, 64, -64, -64, 64, -64, -64, -64, 64, 64, -64, -64, -64, 64, -64, 64, -64, 64, -64, -64, -64, -64, -64, -64, -64, 64, -64, -64, -64, -64, -64, -64, -64, -64, 64, -64, -64, 64, -64, -64, -64, -64, -64, 64, -64, 64, -64, 64, -64, -64, -64, -64, -64, -64, -64, -64, 64, -64, 64, 64, -64, -64, -64, -64, 64, 64, -64, 64, 64, 64, 64, 64, -64, 64, 64, 64, -64, -64, -64, -64, -64, -64, -64, -64, -64, 64, 64, -64, 64, -64, 64, 64, 64, 64, 64, 64, 64, 64, -64, 64, 64, 64, 64, -64, -64, -64, -64, -64, -64, -64, -64, -64, -64, 64, -64, -64, -64, 64, -64, -64, -64, 64, 64, 64, 64, 64, 64, 64, 64, -64, -64, -64, -64, -64, -64, -64, -64, -64, -64, -64, -64, -64, -64, -64, 64, -64, 64, -64, -64, -64, 64, 64, 64, 64, 64, 64, 64, -64, -64, -64, -64, -64, -64, 64, -64, -64, -64, -64, -64, -64, -64, 64, -64, -64, -64, 64, 64, 64, 64, 64, 64, 64, 64, 64, -64, 64, 64, -64, -64, -64, -64, 64, 64, 64, 64, 64, 64, -64, 64, -64, -64, -64, -64, 64, -64, 64, 64, -64, 64, 64, 64, 64, 64, 64, -64, -64, -64, -64, -64, -64, -64, 64, 64, 64, -64, 64, 64, 64, -64, -64, 64, 64, -64, -64, -64, 64, -64, 64, 64, -64, 64, -64, -64, 64, -64, -64, -64, 64, -64, -64, 64, -64, 64, 64, 64, 64, -64, 64, 64, 64, -64, -64, -64, 64, -64, -64, 64, 64, -64, -64, -64, 64, 64, 64, 64, 64, -64, 64, -64, 64, 64, 64, 64, -64, 64, 64, 64, 64, -64, 64, 64, -64, 64, -64, -64, 64, 64, 64, 64, -64, -64, 64, -64, 64, 64, 64, 64, 64, 64, -64, 64, 64, -64, -64, 64, 64, 64, 64, 64, -64, -64, 64, -64, 64, 64, 64, 64, 64, 64, 64, 64, -64, 64, -64, 64, -64, -64, 64, -64, -64, -64, -64, 64, 64, -64, -64, -64, -64, -64, -64, -64, -64, -64, -64, 64, 64, 64, 64, 64, -64, 64, 64, -64, 64, -64, -64, 64, 64, 64, -64, 64, -64, 64, 64, -64, -64, -64, -64, -64, -64, -64, -64, 64, 64, 64, 64, 64, 64, 64, 64, 64, 64, 64, 64, -64, 64, -64, 64, 64, 64, 64, -64, -64, -64, -64, -64, -64, -64, 64, 64, 64, 64, 64, 64, 64, 64, 64, 64, 64, 64, 64, -64, -64, 64, 64, 64, -64, -64, 64, -64, -64, -64, -64, -64, -64, 64, 64, -64, 64, 64, 64, 64, 64, 64, 64, 64, 64, 64, 64, 64, 64, -64, -64, 64, -64, -64, 64, -64, 64, 64, 64, -64, 64, 64, -64, -64, -64, -64, -64, 64, 64, 64, 64, 64, 64, 64, 64, -64, 64, -64, 64, -64, 64, -64, -64, -64, -64, 64, 64, -64, -64, -64, -64, -64, -64, -64, -64, 64, 64, 64, 64, 64, 64, 64, 64, -64, 64, 64, -64, -64, -64, -64, -64, -64, -64, 64, -64, -64, -64, 64, -64, -64, -64, -64, -64, 64, 64, 64, 64, 64, 64, 64, 64, 64, 64, 64, -64, 64, -64, -64, -64, -64, -64, -64, -64, 64, -64, 64, -64, -64, -64, 64, -64, -64, 64, 64, -64, 64, 64, 64, 64, 64, -64, -64, -64, -64, -64, -64, -64, 64, -64, 64, -64, 64, 64, -64, -64, -64, 64, -64, 64, -64, 64, -64, 64, 64, 64, 64, 64, 64, 64, -64, 64, 64, -64, -64, 64, 64, 64, 64, 64, 64, 64, 64, 64, 64, 64, -64, 64, -64, -64, -64, 64, 64, 64, 64, -64, -64, 64, 64, -64, 64, 64, -64, 64, 64, 64, 64, 64, 64, 64, 64, 64, 64, 64, 64, 64, -64, -64, -64, 64, 64, 64, 64, 64, -64, -64, 64, -64, 64, 64, -64, 64, 64, 64, 64, 64, 64, 64, 64, 64, 64, 64, 64, 64, -64, 64, 64, 64, 64, -64, -64, 64, -64, 64, -64, -64, 64, 64, -64, 64, 64, 64, 64, 64, 64, 64, 64, 64, 64, -64, -64, -64, 64, 64, 64, 64, -64, 64, -64, -64, -64, 64, -64, 64, 64, 64, 64, 64, 64, 64, 64, 64, 64, 64, -64, -64, -64, -64, -64, 64, 64, 64, 64, 64, 64, 64, -64, -64, -64, -64, -64, -64, -64, 64, 64, 64, -64, 64, 64, 64, -64, -64, -64, 64, -64, 64, -64, 64, 64, 64, 64, 64, 64, 64, -64, -64, -64, -64, 64, -64, 64, -64, 64, -64, 64, 64, 64, 64, 64, -64, 64, -64, 64, -64, 64, 64, 64, 64, 64, -64, -64, -64, -64, -64, -64, -64, 64, 64, -64, -64, -64, 64, 64, 64, 64, -64, 64, 64, -64, 64, -64, -64, 64, -64, 64, -64, -64, -64, 64, 64, -64, -64, -64, 64, -64, 64, 64, -64, 64, 64, 64, 64, 64, 64, -64, 64, -64, 64, 64, -64, -64, 64, -64, -64, -64, 64, 64, 64, -64, -64, 64, 64, -64, -64, 64, -64, -64, 64, 64, 64, 64, 64, 64, 64, 64, 64, 64, -64, -64, -64, -64, -64, 64, 64, 64, 64, 64, 64, -64, -64, 64, -64, -64, 64, -64, 64, 64, 64, 64, -64, 64, 64, 64, 64, -64, -64, -64, 64, -64, -64, -64, -64, -64, -64, 64, -64, -64, 64, 64, 64, -64, -64, -64, 64, 64, 64, 64, 64, 64, 64, 64, 64, -64, -64, -64, 64, 64, 64, -64, 64, -64, 64, 64, -64, 64, 64, -64, -64, -64, -64, -64, -64, -64, 64, 64, 64, 64, 64, 64, 64, 64, -64, 64, 64, 64, -64, -64, -64, 64, 64, -64, -64, -64, 64, 64, -64, -64, -64, -64, -64, -64, -64, -64, -64, -64, -64, -64, -64, -64, -64, -64, -64, -64, -64, -64, -64, -64, -64, -64, -64, 64, 64, -64, 64, -64, -64, 64, -64, 64, -64, 64, 64, -64, -64, -64, -64, -64, -64, -64, 64, -64, -64, -64, -64, -64, -64, -64, -64, 64, -64, 64, -64, 64, -64, -64, -64, 64, 64, 64, 64, -64, -64, -64, 64, -64, 64, 64, 64, 64, -64, -64, 64, 64, 64, 64, -64, -64, 64, -64, -64, -64, -64, -64, -64, -64, 64, -64, 64, 64, -64, 64, -64, 64, 64, 64, -64, -64, 64, -64, -64, -64, 64, -64, -64, -64, -64, 64, 64, 64, -64, -64, 64, 64, -64, 64, 64, 64, 64, 64, -64, 64, 64, 64, -64, -64, 64, -64, -64, 64, 64, 64, -64, 64, 64, 64, 64, -64, 64, -64, -64, 64, 64, 64, 64, 64, 64, -64, 64, 64, 64, -64, 64, 64, 64, 64, 64, -64, 64, -64, 64, 64, 64, -64, -64, 64, -64, -64, 64, 64, 64, -64, 64, 64, -64, 64, 64, 64, 64, 64, 64, 64, 64, 64, 64, -64, 64, 64, 64, 64, 64, -64, -64, 64, 64, -64, -64, 64, 64, 64, 64, -64, -64, -64, 64, -64, 64, 64, -64, 64, 64, 64, 64, 64, 64, 64, 64, -64, 64, 64, 64, 64, 64, -64, -64, 64, 64, 64, 64, 64, 64, 64, 64, 64, 64, 64, 64, -64, -64, 64, 64, 64, 64, 64, 64, 64, 64, 64, -64, 64, 64, -64, 64, 64, 64, 64, 64, 64, 64, 64, 64, 64, 64, -64, -64, -64, -64, -64, -64, 64, 64, 64, 64, 64, 64, 64, 64, -64, 64, 64, 64, 64, 64, 64, 64, 64, 64, 64, -64, -64, 64, 64, 64, 64, 64, 64, -64, -64, -64, -64, 64, -64, 64, 64, -64, 64, 64, -64, 64, 64, 64, 64, 64, -64, 64, -64, -64, -64, 64, -64, 64, 64, 64, -64, 64, -64, -64, 64, 64, 64, -64, 64, -64, 64, -64, 64, 64, 64, 64, 64, 64, -64, 64, -64, -64, 64, 64, 64, 64, 64, -64, -64, -64, -64, 64, -64, 64, 64, 64, -64, -64, 64, -64, 64, 64, 64, 64, 64, -64, 64, -64, -64, -64, 64, 64, 64, 64, 64, -64, -64, -64, 64, -64, 64, 64, 64, 64, -64, 64, 64, 64, 64, 64, 64, -64, 64, -64, -64, 64, 64, 64, 64, 64, 64, 64, 64, 64, 64, 64, 64, 64, 64, -64, 64, -64, -64, -64, 64, -64, 64, 64, -64, -64, 64, 64, 64, -64, -64, 64, 64, 64, 64, 64, 64, 64, -64, 64, 64, 64, 64, 64, 64, 64, -64, 64, -64, 64, 64, 64, 64, -64, -64, -64, -64, -64, 64, 64, 64, 64, -64, -64, -64, -64, -64, -64, -64, -64, -64, 64, 64, -64, -64, 64, 64, -64, -64, 64, -64, -64, -64, -64, -64, -64, 64, -64, -64, -64, 64, -64, -64, -64, -64, -64, 64, 64, 64, -64, -64, -64, 64, -64, 64, -64, -64, -64, -64, -64, -64, -64, -64, 64, -64, -64, -64, -64, -64, -64, -64, -64, -64, 64, 64, 64, -64, -64, -64, -64, -64, 64, 64, -64, -64, -64, -64, -64, -64, -64, 64, -64, -64, -64, -64, -64, -64, -64, -64, 64, -64, -64, 64, -64, 64, -64, -64, -64, -64, 64, 64, 64, 64, -64, -64, -64, -64, -64, 64, 64, 64, -64, -64, -64, -64, -64, -64, -64, 64, -64, -64, -64, -64, 64, -64, 64, -64, 64, 64, 64, -64, -64, -64, -64, -64, -64, 64, -64, -64, -64, -64, -64, -64, -64, -64, -64, 64, -64, -64, -64, -64, -64, -64, 64, -64, 64, 64, 64, -64, -64, -64, -64, 64, 64, -64, -64, -64, 64, 64, -64, 64, -64, 64, -64, 64, -64, 64, -64, 64, 64, 64, -64, 64, 64, 64, 64, -64, -64, 64, 64, 64, 64, 64, 64, 64, 64, 64, -64, 64, 64, 64, 64, 64, 64, 64, 64, -64, 64, 64, -64, -64, 64, 64, 64, -64, -64, 64, 64, 64, 64, 64, 64, 64, 64, 64, 64, 64, 64, 64, 64, 64, 64, 64, 64, 64, 64, -64, -64, -64, -64, -64, 64, 64, -64, 64, 64, 64, 64, 64, 64, 64, 64, 64, 64, 64, 64, 64, 64, 64, 64, 64, 64, -64, -64, -64, -64, -64, 64, 64, 64, -64, -64, 64, 64, 64, 64, 64, 64, 64, 64, 64, 64, 64, 64, 64, 64, -64, -64, -64, -64, 64, -64, -64, 64, 64, -64, 64, -64, -64, -64, -64, -64, -64, -64, 64, 64, 64, 64, 64, 64, 64, 64, 64, -64, 64, -64, -64, -64, -64, -64, 64, -64, -64, -64, 64, 64, -64, -64, -64, -64, 64, 64, 64, 64, -64, -64, -64, 64, 64, 64, 64, 64, -64, -64, -64, -64, -64, 64, 64, 64, -64, 64, -64, 64, -64, -64, -64, 64, -64, 64, 64, 64, -64, -64, -64, 64, 64, 64, 64, -64, -64, -64, 64, -64, -64, -64, 64, -64, 64, -64, -64, 64, -64, -64, -64, -64, 64, 64, -64, 64, -64, 64, 64, 64, 64, 64, 64, -64, -64, 64, -64, 64, -64, 64, -64, 64, 64, -64, -64, -64, 64, 64, -64, -64, -64, -64, -64, -64, -64, -64, -64, 64, 64, 64, 64, -64, 64, 64, -64, 64, -64, -64, 64, -64, 64, 64, 64, 64, -64, 64, 64, -64, -64, 64, 64, -64, 64, -64, -64, 64, 64, -64, -64, 64, -64, 64, 64, 64, 64, -64, -64, 64, -64, -64, 64, -64, 64, -64, 64, 64, 64, -64, 64, -64, -64, 64, 64, 64, -64, -64, 64, -64, -64, 64, -64, 64, -64, -64, -64, -64, 64, -64, 64, -64, 64, 64, -64, 64, -64, -64, 64, -64, -64, 64, 64, 64, 64, 64, 64, 64, -64, -64, -64, 64, 64, -64, -64, -64, 64, -64, 64, -64, 64, -64, 64, 64, 64, 64, -64, -64, 64, -64, 64, 64, 64, 64, 64, 64, 64, 64, -64, 64, 64, -64, -64, -64, 64, 64, -64, 64, -64, -64, -64, 64, 64, 64, -64, -64, -64, -64, -64, 64, 64, 64, 64, 64, -64, -64, -64, 64, 64, 64, -64, -64, 64, 64, -64, -64, -64, -64, -64, -64, -64, -64, -64, -64, -64, -64, 64, 64, 64, 64, 64, 64, 64, -64, -64, -64, 64, 64, 64, -64, -64, 64, -64, 64, -64, -64, -64, -64, -64, -64, -64, -64, -64, -64, 64, 64, 64, 64, 64, 64, 64, -64, -64, -64, -64, 64, -64, 64, -64, -64, -64, -64, 64, -64, -64, -64, -64, -64, -64, -64, -64, -64, -64, 64, 64, -64, -64, -64, 64, 64, -64, -64, -64, 64, 64, 64, 64, -64, -64, -64, 64, -64, 64, 64, 64, -64, -64, 64, 64, 64, -64, -64, 64, -64, 64, 64, 64, -64, -64, -64, 64, 64, 64, -64, 64, -64, -64, 64, -64, -64, 64, 64, 64, -64, 64, 64, 64, 64, 64, 64, 64, -64, -64, -64, 64, 64, -64, 64, 64, 64, 64, -64, -64, 64, -64, 64, 64, -64, 64, 64, 64, -64, -64, -64, 64, 64, 64, 64, -64, -64, -64, 64, -64, 64, -64, 64, 64, 64, 64, -64, -64, 64, -64, 64, 64, -64, -64, 64, 64, -64, -64, 64, 64, 64, 64, 64, 64, 64, -64, 64, -64, 64, -64, -64, -64, 64, -64, 64, -64, 64, -64, 64, -64, 64, -64, -64, 64, 64, 64, 64, 64, 64, 64, -64, -64, 64, 64, 64, 64, 64, -64, -64, -64, -64, 64, 64, -64, 64, -64, 64, 64, -64, -64, -64, 64, 64, 64, 64, 64, 64, 64, 64, 64, -64, -64, -64, 64, -64, 64, -64, 64, 64, -64, 64, 64, -64, 64, 64, -64, 64, 64, -64, 64, 64, 64, 64, 64, 64, 64, 64, 64, -64, -64, 64, 64, -64, -64, 64, 64, -64, 64, 64, -64, 64, -64, 64, 64, 64, -64, 64, 64, 64, 64, 64, 64, -64, 64, -64, 64, 64, 64, 64, 64, 64, 64, 64, 64, 64, 64, 64, -64, 64, 64, -64, 64, 64, -64, 64, 64, 64, 64, -64, 64, -64, -64, -64, 64, -64, -64, 64, 64, 64, 64, 64, 64, -64, 64, -64, -64, -64, -64, -64, 64, 64, 64, 64, 64, 64, 64, 64, -64, -64, -64, 64, -64, -64, 64, 64, 64, 64, 64, 64, 64, -64, 64, 64, -64, 64, 64, 64, 64, 64, 64, 64, 64, 64, -64, -64, -64, -64, 64, -64, 64, -64, -64, 64, 64, 64, 64, 64, 64, -64, 64, 64, -64, -64, -64, 64, 64, -64, 64, 64, 64, 64, -64, -64, -64, -64, -64, 64, -64, 64, 64, 64, 64, 64, 64, 64, 64, 64, -64, 64, -64, -64, 64, 64, 64, 64, 64, 64, 64, -64, -64, -64, -64, -64, -64, 64, 64, -64, 64, 64, -64, 64, -64, 64, 64, 64, 64, 64, 64, 64, -64, 64, 64, 64, 64, 64, -64, -64, -64, 64, -64, -64, -64, 64, -64, -64, 64, -64, 64, 64, -64, -64, 64, 64, -64, -64, -64, -64, 64, 64, 64, -64, -64, -64, 64, -64, 64, -64, -64, -64, -64, 64, 64, 64, -64, 64, 64, 64, -64, 64, 64, 64, 64, 64, -64, 64, 64, -64, -64, -64, -64, -64, -64, -64, -64, -64, -64, -64, -64, -64, -64, 64, 64, 64, 64, 64, 64, -64, -64, 64, 64, 64, -64, 64, 64, -64, 64, -64, -64, -64, -64, 64, -64, -64, -64, 64, -64, -64, 64, 64, -64, 64, 64, 64, -64, 64, 64, 64, -64, -64, 64, 64, -64, -64, 64, 64, 64, -64, -64, 64, 64, 64, 64, 64, -64, -64, -64, -64, -64, 64, 64, 64, -64, -64, -64, 64, 64, -64, 64, 64, 64, 64, 64, 64, -64, -64, -64, 64, -64, 64, -64, -64, -64, -64, 64, -64, -64, 64, 64, -64, -64, 64, 64, 64, -64, -64, 64, 64, -64, 64, -64, 64, 64, 64, -64, 64, 64, -64, 64, -64, -64, 64, -64, 64, -64, -64, 64, 64, 64, 64, -64, -64, -64, -64, -64, -64, 64, 64, 64, 64, -64, -64, -64, 64, -64, 64, 64, -64, 64, 64, -64, 64, 64, 64, -64, 64, -64, 64, 64, 64, -64, -64, -64, 64, 64, 64, 64, -64, 64, 64, 64, 64, 64, 64, -64, 64, -64, -64, 64, 64, -64, 64, -64, 64, -64, -64, 64, 64, -64, -64, -64, 64, -64, 64, 64, 64, 64, 64, 64, 64, 64, 64, 64, -64, -64, -64, -64, -64, -64, -64, 64, -64, 64, 64, -64, 64, -64, 64, 64, -64, -64, -64, 64, -64, 64, -64, -64, -64, -64, -64, -64, -64, -64, -64, -64, 64, 64, -64, -64, -64, 64, 64, 64, 64, 64, 64, 64, 64, -64, -64, 64, -64, 64, -64, -64, -64, -64, -64, -64, -64, -64, -64, -64, -64, -64, -64, -64, -64, -64, -64, -64, 64, 64, 64, 64, 64, -64, 64, 64, -64, -64, 64, 64, 64, 64, -64, -64, 64, -64, 64, -64, -64, -64, -64, -64, -64, -64, -64, -64, -64, 64, 64, -64, 64, 64, -64, -64, 64, 64, 64, 64, 64, -64, 64, -64, 64, 64, -64, 64, 64, 64, -64, -64, -64, -64, 64, 64, -64, -64, 64, 64, 64, -64, 64, 64, 64, 64, 64, 64, -64, -64, 64, 64, -64, 64, -64, 64, 64, 64, 64, 64, -64, 64, 64, 64, 64, 64, -64, 64, -64, 64, -64, 64, -64, 64, 64, 64, 64, -64, -64, 64, 64, 64, 64, 64, 64, 64, 64, 64, 64, 64, 64, 64, -64, 64, 64, -64, 64, -64, 64, 64, 64, 64, -64, -64, -64, -64, -64, -64, -64, -64, -64, 64, 64, 64, 64, 64, 64, 64, -64, 64, 64, 64, 64, -64, 64, 64, 64, 64, -64, 64, -64, -64, -64, -64, -64, -64, -64, -64, 64, -64, -64, 64, 64, 64, -64, -64, -64, -64, 64, -64, -64, 64, 64, -64, -64, 64, 64, 64, -64, 64, -64, -64, -64, -64, 64, -64, -64, -64, -64, -64, -64, -64, -64, -64, -64, -64, -64, 64, -64, 64, -64, -64, 64, -64, -64, 64, 64, 64, 64, 64, 64, 64, 64, -64, -64, -64, -64, -64, -64, -64, -64, -64, -64, 64, 64, 64, -64, -64, 64, 64, 64, 64, 64, -64, -64, 64, 64, 64, 64, 64, -64, 64, -64, -64, -64, -64, -64, -64, -64, -64, -64, 64, -64, 64, 64, 64, 64, -64, -64, -64, -64, 64, 64, 64, 64, 64, 64, 64, 64, 64, 64, 64, -64, -64, 64, -64, -64, -64, -64, 64, -64, 64, 64, 64, 64, 64, 64, -64, -64, -64, 64, 64, 64, 64, 64, 64, 64, 64, 64, -64, -64, -64, -64, 64, 64, -64, -64, -64, -64, -64, -64, 64, -64, -64, 64, -64, 64, -64, 64, -64, 64, 64, 64, 64, 64, 64, 64, -64, 64, -64, 64, -64, 64, 64, -64, -64, -64, -64, -64, -64, -64, -64, 64, -64, -64, -64, -64, -64, -64, -64, -64, 64, 64, -64, -64, -64, 64, 64, 64, -64, 64, 64, -64, -64, -64, -64, -64, 64, -64, 64, -64, -64, -64, -64, -64, -64, -64, -64, -64, -64, -64, -64, -64, 64, -64, 64, 64, 64, 64, 64, -64, -64, 64, 64, 64, -64, -64, 64, 64, 64, -64, -64, -64, -64, -64, -64, -64, -64, -64, -64, -64, -64, 64, 64, -64, 64, -64, -64, -64, -64, -64, -64, 64, -64, -64, 64, 64, 64, -64, -64, -64, -64, -64, -64, -64, -64, -64, -64, -64, -64, 64, 64, 64, -64, 64, -64, 64, -64, -64, -64, 64, -64, -64, 64, -64, 64, 64, 64, -64, -64, -64, 64, -64, -64, -64, -64, -64, 64, 64, -64, 64, 64, 64, 64, 64, 64, 64, 64, -64, 64, 64, -64, -64, -64, 64, 64, 64, 64, 64, 64, 64, 64, -64, -64, 64, 64, 64, 64, 64, 64, 64, -64, -64, -64, -64, -64, 64, -64, 64, -64, -64, 64, 64, 64, 64, 64, 64, 64, 64, 64, -64, -64, 64, -64, 64, 64, 64, -64, -64, -64, 64, -64, -64, 64, 64, 64, -64, 64, -64, -64, 64, 64, 64, 64, 64, 64, 64, 64, -64, -64, 64, 64, 64, 64, 64, 64, 64, -64, -64, -64, 64, 64, -64, 64, -64, -64, 64, 64, 64, -64, -64, -64, 64, -64, 64, -64, 64, -64, -64, -64, 64, -64, 64, 64, 64, 64, -64, 64, -64, 64, -64, -64, 64, -64, 64, 64, 64, 64, 64, -64, -64, 64, 64, 64, -64, -64, 64, -64, 64, 64, 64, -64, 64, -64, -64, 64, 64, 64, 64, -64, 64, 64, -64, -64, -64, -64, 64, -64, 64, -64, 64, 64, 64, 64, 64, -64, 64, -64, 64, 64, -64, -64, -64, 64, 64, -64, -64, 64, 64, -64, 64, 64, -64, 64, -64, 64, -64, -64, -64, -64, 64, 64, -64, 64, 64, 64, 64, 64, -64, -64, -64, 64, -64, -64, 64, -64, -64, -64, -64, 64, 64, -64, -64, -64, -64, -64, -64, -64, 64, -64, -64, 64, 64, 64, 64, -64, -64, -64, 64, 64, 64, -64, 64, 64, -64, -64, 64, 64, -64, 64, -64, -64, 64, 64, 64, -64, -64, -64, 64, 64, 64, 64, 64, -64, 64, 64, -64, 64, 64, -64, 64, -64, -64, 64, 64, 64, -64, -64, 64, 64, -64, 64, -64, -64, -64, -64, -64, 64, -64, -64, 64, 64, 64, 64, -64, -64, -64, -64, 64, -64, 64, 64, 64, 64, -64, -64, -64, -64, -64, -64, 64, -64, 64, 64, -64, -64, -64, 64, -64, -64, -64, -64, -64, 64, -64, 64, -64, -64, -64, 64, 64, -64, -64, -64, -64, -64, -64, -64, 64, 64, 64, 64, 64, 64, 64, 64, 64, -64, 64, 64, 64, -64, -64, -64, 64, 64, 64, 64, 64, -64, -64, -64, -64, -64, -64, 64, 64, 64, 64, 64, 64, 64, 64, 64, -64, 64, -64, 64, 64, -64, 64, -64, -64, 64, 64, -64, 64, -64, 64, -64, 64, 64, 64, 64, 64, 64, 64, 64, 64, 64, 64, 64, 64, 64, 64, 64, 64, 64, -64, 64, -64, 64, -64, -64, -64, -64, -64, 64, 64, 64, 64, 64, -64, -64, -64, 64, 64, 64, 64, 64, 64, -64, 64, 64, 64, 64, 64, -64, -64, 64, -64, -64, -64, 64, -64, -64, -64, 64, 64, 64, 64, 64, -64, 64, 64, 64, 64, 64, -64, -64, -64, -64, 64, 64, -64, 64, 64, -64, 64, -64, 64, 64, -64, 64, 64, 64, 64, 64, 64, 64, -64, 64, 64, -64, 64, 64, -64, 64, -64, 64, -64, -64, -64, 64, 64, -64, 64, 64, 64, 64, 64, -64, 64, 64, 64, 64, -64, -64, 64, -64, -64, 64, -64, -64, -64, 64, -64, -64, -64, -64, -64, -64, 64, 64, -64, -64, 64, 64, -64, -64, 64, 64, 64, 64, 64, 64, 64, 64, 64, 64, 64, 64, 64, -64, -64, -64, -64, -64, -64, -64, 64, -64, 64, -64, 64, 64, 64, -64, -64, -64, 64, 64, 64, 64, 64, 64, 64, 64, -64, 64, 64, -64, 64, -64, -64, -64, -64, 64, -64, 64, -64, 64, 64, -64, 64, 64, 64, -64, -64, 64, -64, 64, -64, -64, 64, 64, 64, 64, 64, 64, -64, 64, 64, -64, -64, -64, -64, 64, -64, 64, 64, 64, 64, -64, -64, 64, 64, 64, -64, -64, 64, -64, -64, 64, -64, 64, -64, -64, 64, 64, 64, -64, 64, -64, 64, 64, -64, 64, -64, 64, 64, 64, -64, 64, 64, 64, 64, -64, 64, -64, 64, 64, 64, 64, 64, 64, -64, 64, 64, -64, 64, -64, -64, -64, -64, -64, 64, 64, 64, -64, -64, 64, 64, 64, -64, 64, -64, -64, 64, -64, 64, 64, -64, -64, 64, 64, -64, -64, 64, 64, -64, 64, -64, -64, 64, 64, 64, -64, 64, 64, 64, 64, 64, 64, 64, -64, -64, 64, 64, -64, 64, 64, 64, 64, -64, -64, -64, -64, -64, -64, 64, 64, 64, 64, 64, 64, 64, -64, -64, 64, 64, 64, 64, 64, 64, -64, -64, -64, -64, 64, 64, 64, -64, -64, 64, 64, -64, 64, -64, 64, 64, 64, -64, 64, 64, -64, -64, -64, -64, 64, 64, 64, -64, 64, -64, 64, -64, 64, 64, -64, -64, -64, 64, -64, -64, -64, -64, 64, -64, -64, 64, 64, 64, 64, 64, 64, 64, 64, 64, -64, -64, 64, 64, 64, -64, 64, 64, 64, 64, -64, 64, 64, 64, 64, 64, -64, -64, 64, -64, -64, 64, 64, 64, -64, -64, 64, -64, -64, 64, 64, 64, 64, 64, 64, 64, -64, 64, 64, 64, 64, -64, 64, -64, -64, -64, -64, 64, 64, 64, 64, 64, 64, 64, 64, 64, -64, 64, 64, 64, 64, 64, 64, -64, -64, -64, -64, -64, 64, -64, 64, 64, 64, 64, 64, 64, 64, 64, 64, -64, 64, 64, 64, 64, 64, 64, 64, 64, 64, 64, 64, 64, 64, -64, -64, -64, 64, -64, -64, 64, -64, 64, -64, 64, 64, 64, 64, 64, 64, 64, 64, 64, 64, 64, 64, 64, 64, -64, 64, -64, 64, 64, 64, 64, 64, 64, -64, -64, 64, 64, -64, -64, 64, 64, 64, -64, -64, 64, 64, 64, -64, 64, 64, -64, -64, 64, -64, 64, 64, 64, 64, 64, -64, -64, -64, -64, 64, 64, -64, 64, -64, 64, -64, 64, -64, -64, -64, -64, 64, -64, -64, -64, 64, 64, -64, 64, -64, -64, -64, 64, -64, -64, 64, 64, 64, 64, 64, 64, 64, -64, 64, -64, 64, 64, -64, -64, -64, -64, 64, 64, 64, 64, 64, 64, -64, -64, -64, -64, 64, -64, 64, 64, -64, -64, 64, -64, 64, -64, -64, 64, -64, 64, 64, 64, 64, 64, 64, -64, -64, 64, -64, -64, -64, -64, -64, 64, 64, 64, 64, 64, 64, -64, 64, 64, -64, 64, 64, 64, 64, 64, -64, -64, 64, -64, 64, 64, 64, 64, -64, -64, -64, -64, 64, 64, -64, -64, 64, -64, -64, 64, 64, 64, 64, 64, -64, 64, 64, 64, 64, -64, 64, 64, -64, -64, 64, -64, -64, 64, 64, -64, 64, 64, -64, 64, 64, -64, -64, 64, 64, -64, 64, 64, 64, -64, 64, -64, 64, -64, -64, 64, 64, 64, 64, 64, 64, 64, -64, -64, 64, 64, 64, 64, -64, 64, -64, -64, 64, 64, 64, 64, -64, 64, 64, 64, -64, 64, -64, 64, -64, -64, 64, -64, 64, 64, 64, -64, -64, -64, 64, -64, -64, -64, -64, 64, 64, 64, -64, 64, 64, 64, 64, 64, 64, 64, 64, -64, 64, -64, 64, 64, 64, -64, -64, 64, -64, -64, 64, -64, 64, -64, -64, 64, 64, 64, 64, 64, 64, -64, 64, 64, 64, 64, 64, -64, -64, 64, -64, 64, -64, 64, 64, 64, 64, -64, 64, -64, 64, -64, -64, -64, -64, 64, 64, 64, -64, 64, 64, -64, 64, -64, 64, -64, 64, 64, -64, -64, 64, 64, -64, 64, -64, -64, -64, 64, -64, 64, -64, -64, 64, 64, 64, 64, 64, 64, 64, -64, 64, -64, 64, 64, 64, -64, 64, 64, 64, -64, -64, -64, -64, 64, 64, 64, -64, -64, -64, 64, 64, -64, 64, -64, 64, 64, -64, -64, 64, -64, -64, -64, 64, 64, -64, -64, -64, 64, -64, -64, 64, -64, 64, -64, 64, -64, -64, 64, 64, -64, -64, -64, 64, 64, -64, 64, 64, 64, 64, -64, 64, 64, 64, 64, 64, -64, -64, -64, 64, -64, -64, -64, 64, 64, -64, -64, 64, 64, -64, -64, -64, 64, -64, -64, 64, -64, 64, 64, 64, 64, 64, 64, 64, -64, 64, 64, -64, -64, 64, 64, -64, -64, -64, 64, -64, -64, -64, 64, 64, -64, 64, -64, 64, 64, 64, 64, 64, 64, -64, -64, 64, 64, -64, 64, 64, 64, 64, 64, 64, -64, 64, 64, 64, -64, 64, 64, -64, 64, -64, -64, -64, 64, 64, 64, 64, 64, 64, 64, 64, -64, 64, -64, 64, -64, -64, -64, 64, -64, -64, 64, 64, 64, 64, 64, 64, 64, 64, 64, 64, 64, 64, -64, 64, 64, 64, -64, -64, 64, -64, 64, 64, 64, -64, -64, -64, -64, 64, 64, -64, 64, 64, 64, -64, 64, -64, 64, 64, 64, 64, 64, 64, -64, 64, -64, -64, 64, -64, -64, 64, 64, -64, -64, 64, 64, -64, 64, -64, -64, 64, 64, 64, 64, -64, 64, 64, -64, 64, 64, -64, 64, -64, 64, 64, 64, -64, 64, 64, 64, -64, -64, 64, 64, 64, -64, 64, -64, -64, -64, -64, -64, 64, 64, 64, 64, -64, -64, -64, 64, -64, -64, -64, 64, -64, 64, 64, -64, -64, 64, -64, 64, 64, 64, 64, 64, 64, 64, 64, 64, 64, 64, 64, 64, -64, 64, 64, 64, 64, 64, 64, -64, 64, -64, 64, 64, -64, 64, -64, -64, -64, 64, 64, 64, -64, -64, 64, -64, -64, 64, 64, 64, 64, 64, 64, -64, 64, -64, -64, 64, 64, -64, 64, 64, 64, -64, 64, -64, -64, 64, -64, 64, 64, 64, -64, 64, 64, 64, 64, 64, -64, -64, 64, 64, 64, -64, 64, 64, -64, -64, -64, -64, -64, 64, 64, 64, 64, -64, 64, 64, 64, 64, 64, 64, 64, 64, -64, 64, -64, -64, -64, 64, 64, -64, -64, 64, 64, -64, -64, -64, -64, -64, 64, -64, 64, 64, 64, 64, -64, 64, -64, 64, 64, -64, 64, 64, 64, -64, -64, 64, 64, 64, 64, -64, -64, -64, 64, -64, -64, 64, 64, -64, -64, -64, -64, -64, 64, -64, 64, -64, -64, -64, 64, -64, -64, 64, -64, -64, -64, 64, -64, -64, -64, 64, 64, 64, -64, -64, 64, -64, -64, 64, 64, -64, -64, -64, -64, 64, 64, -64, 64, 64, 64, -64, -64, -64, -64, -64, 64, -64, 64, -64, 64, 64, 64, 64, 64, -64, -64, -64, 64, -64, 64, -64, 64, 64, 64, 64, 64, -64, 64, 64, -64, 64, -64, -64, -64, -64, 64, -64, 64, 64, -64, 64, 64, 64, 64, 64, 64, -64, -64, 64, -64, -64, -64, -64, 64, 64, -64, -64, 64, 64, -64, -64, 64, 64, 64, -64, -64, 64, -64, -64, 64, 64, 64, -64, 64, -64, 64, -64, 64, -64, 64, -64, -64, -64, -64, -64, -64, -64, -64, -64, -64, 64, 64, -64, -64, 64, -64, 64, 64, -64, -64, -64, 64, 64, -64, 64, 64, -64, 64, -64, -64, 64, -64, 64, 64, 64, -64, 64, 64, 64, 64, 64, -64, 64, 64, 64, -64, -64, 64, -64, -64, -64, 64, -64, 64, 64, 64, -64, 64, 64, 64, -64, 64, 64, -64, -64, 64, 64, 64, 64, 64, 64, -64, -64, 64, 64, -64, 64, 64, 64, -64, 64, -64, 64, -64, 64, 64, -64, 64, 64, -64, -64, -64, -64, 64, 64, 64, -64, -64, -64, -64, -64, 64, 64, 64, -64, 64, 64, 64, -64, -64, 64, 64, -64, -64, -64, 64, 64, -64, 64, -64, 64, -64, -64, 64, -64, -64, -64, -64, 64, -64, -64, -64, 64, 64, -64, -64, 64, 64, 64, 64, 64, -64, -64, -64, -64, -64, -64, -64, -64, -64, -64, -64, -64, -64, -64, -64, -64, 64, -64, -64, 64, 64, 64, 64, 64, -64, 64, -64, -64, 64, 64, 64, 64, -64, -64, 64, 64, -64, -64, -64, -64, -64, -64, -64, 64, 64, 64, -64, -64, 64, 64, 64, -64, -64, -64, -64, 64, -64, 64, 64, -64, -64, -64, -64, -64, -64, -64, -64, -64, -64, -64, -64, -64, 64, 64, 64, 64, 64, 64, -64, -64, -64, -64, -64, -64, -64, -64, -64, -64, 64, -64, -64, 64, 64, -64, -64, -64, -64, -64, -64, 64, 64, -64, -64, 64, 64, -64, -64, -64, -64, -64, -64, -64, -64, -64, 64, -64, -64, -64, 64, -64, -64, -64, -64, -64, -64, -64, -64, 64, -64, 64, 64, 64, 64, -64, -64, -64, -64, -64, -64, -64, -64, -64, 64, 64, 64, 64, -64, -64, 64, -64, -64, -64, -64, -64, -64, -64, -64, -64, -64, 64, 64, -64, -64, -64, -64, -64, -64, -64, 64, -64, 64, 64, 64, 64, -64, 64, 64, -64, 64, -64, -64, 64, -64, -64, -64, -64, 64, 64, 64, 64, -64, 64, -64, -64, -64, 64, 64, -64, 64, 64, 64, 64, -64, 64, 64, 64, -64, -64, -64, 64, -64, 64, 64, 64, -64, 64, 64, -64, -64, -64, -64, -64, -64, -64, 64, 64, -64, 64, -64, 64, 64, 64, -64, -64, -64, -64, -64, -64, -64, 64, -64, 64, -64, -64, 64, -64, 64, -64, -64, -64, -64, -64, 64, 64, 64, 64, 64, 64, 64, 64, 64, 64, 64, -64, -64, -64, 64, 64, -64, -64, -64, 64, 64, 64, -64, -64, -64, -64, -64, -64, -64, -64, 64, 64, 64, 64, 64, 64, 64, 64, 64, 64, -64, 64, 64, 64, -64, 64, -64, -64, 64, 64, 64, -64, -64, -64, -64, -64, -64, 64, -64, 64, -64, -64, 64, 64, 64, 64, 64, 64, -64, 64, 64, -64, 64, -64, -64, -64, 64, 64, -64, -64, -64, -64, -64, -64, 64, -64, -64, -64, -64, 64, 64, -64, -64, -64, -64, -64, -64, -64, -64, 64, -64, 64, 64, 64, 64, 64, -64, -64, -64, -64, -64, -64, -64, 64, 64, -64, -64, -64, -64, -64, 64, 64, -64, 64, 64, 64, -64, -64, 64, -64, 64, -64, 64, 64, -64, -64, -64, -64, -64, -64, -64, -64, -64, 64, -64, -64, 64, 64, 64, 64, 64, 64, 64, 64, 64, -64, 64, 64, 64, -64, 64, -64, 64, 64, -64, 64, 64, -64, -64, -64, -64, 64, 64, -64, 64, -64, 64, 64, -64, -64, 64, -64, -64, -64, -64, -64, -64, -64, 64, 64, -64, 64, -64, 64, 64, 64, -64, -64, -64, -64, -64, -64, -64, -64, 64, -64, -64, 64, -64, 64, -64, 64, 64, -64, -64, -64, -64, 64, 64, 64, 64, 64, 64, 64, 64, -64, -64, -64, -64, -64, -64, -64, 64, 64, 64, 64, -64, 64, -64, 64, -64, -64, -64, 64, -64, 64, 64, -64, -64, -64, 64, 64, 64, -64, -64, 64, -64, -64, -64, -64, -64, 64, 64, -64, -64, -64, -64, -64, -64, -64, -64, 64, 64, -64, -64, -64, -64, -64, -64, 64, 64, -64, -64, -64, -64, -64, -64, -64, -64, 64, 64, -64, -64, 64, -64, 64, -64, 64, -64, -64, 64, 64, 64, 64, -64, 64, -64, 64, -64, -64, -64, -64, -64, -64, -64, 64, 64, 64, 64, 64, -64, -64, -64, -64, 64, 64, 64, 64, -64, -64, 64, -64, -64, -64, 64, -64, -64, 64, 64, -64, 64, -64, -64, 64, 64, -64, 64, -64, -64, 64, 64, 64, -64, 64, 64, 64, -64, -64, 64, 64, 64, -64, -64, 64, 64, -64, -64, -64, 64, -64, -64, 64, -64, -64, -64, 64, 64, -64, -64, -64, -64, -64, 64, -64, -64, -64, 64, -64, 64, -64, 64, -64, 64, 64, 64, -64, 64, 64, 64, 64, 64, 64, 64, -64, -64, -64, 64, 64, -64, -64, 64, 64, -64, -64, -64, -64, -64, -64, -64, 64, 64, 64, 64, 64, 64, 64, -64, 64, 64, -64, -64, -64, -64, -64, -64, 64, 64, 64, -64, -64, -64, 64, -64, -64, -64, -64, 64, 64, 64, -64, 64, -64, -64, 64, 64, 64, -64, 64, -64, -64, -64, -64, 64, -64, 64, 64, -64, -64, 64, 64, -64, -64, 64, 64, 64, 64, -64, -64, 64, -64, -64, -64, 64, 64, 64, 64, 64, -64, -64, -64, -64, 64, 64, -64, 64, -64, -64, -64, -64, -64, 64, -64, -64, -64, -64, -64, -64, -64, -64, 64, 64, -64, 64, -64, -64, 64, -64, -64, 64, -64, 64, 64, -64, -64, -64, -64, -64, -64, -64, -64, 64, -64, -64, 64, -64, -64, 64, -64, 64, -64, 64, -64, -64, -64, -64, -64, -64, 64, 64, 64, 64, -64, -64, -64, -64, -64, -64, 64, -64, -64, -64, -64, -64, 64, 64, 64, -64, -64, -64, -64, -64, -64, -64, -64, 64, -64, -64, 64, -64, -64, -64, 64, -64, -64, -64, -64, -64, -64, -64, -64, 64, 64, 64, -64, -64, 64, 64, -64, -64, -64, -64, -64, -64, 64, 64, -64, 64, 64, 64, 64, -64, -64, 64, -64, -64, -64, -64, -64, 64, -64, -64, -64, -64, 64, -64, 64, 64, -64, 64, -64, 64, 64, -64, 64, 64, -64, -64, -64, 64, 64, 64, -64, -64, -64, -64, -64, -64, -64, -64, -64, -64, 64, -64, -64, 64, -64, 64, 64, 64, 64, 64, 64, -64, -64, -64, 64, 64, 64, 64, -64, -64, -64, -64, 64, -64, -64, -64, -64, -64, -64, -64, 64, 64, -64, 64, -64, 64, -64, -64, 64, 64, 64, 64, -64, 64, -64, 64, -64, -64, 64, 64, 64, -64, -64, -64, -64, -64, -64, -64, 64, -64, -64, 64, -64, -64, -64, 64, -64, 64, 64, -64, 64, 64, -64, -64, -64, -64, 64, 64, 64, 64, -64, -64, -64, -64, -64, -64, 64, 64, 64, -64, -64, -64, -64, -64, 64, -64, 64, 64, 64, 64, 64, -64, 64, -64, -64, 64, 64, -64, -64, -64, -64, -64, -64, 64, -64, 64, -64, -64, -64, 64, 64, -64, -64, 64, -64, 64, -64, -64, 64, -64, 64, -64, -64, -64, -64, 64, -64, -64, 64, 64, -64, 64, 64, -64, -64, 64, -64, 64, 64, 64, 64, 64, -64, 64, 64, 64, 64, -64, -64, -64, -64, -64, -64, -64, -64, 64, 64, 64, -64, -64, -64, 64, -64, 64, 64, 64, 64, -64, -64, 64, -64, 64, 64, 64, 64, -64, -64, -64, -64, -64, -64, -64, -64, 64, -64, 64, 64, -64, 64, 64, -64, -64, 64, 64, 64, 64, -64, -64, -64, 64, 64, 64, 64, -64, -64, -64, -64, -64, -64, -64, -64, 64, 64, 64, 64, 64, 64, 64, 64, -64, -64, 64, 64, 64, 64, 64, -64, 64, -64, 64, 64, -64, -64, -64, -64, -64, 64, -64, -64, 64, 64, -64, -64, -64, -64, 64, 64, 64, 64, 64, -64, 64, -64, -64, -64, -64, 64, -64, 64, 64, 64, 64, -64, 64, 64, -64, -64, -64, -64, -64, -64, -64, -64, -64, -64, -64, 64, 64, 64, -64, -64, 64, 64, -64, -64, -64, 64, -64, 64, 64, 64, 64, -64, -64, -64, -64, -64, -64, -64, -64, -64, -64, -64, 64, 64, 64, 64, -64, -64, 64, -64, 64, -64, -64, 64, 64, 64, 64, 64, -64, -64, -64, -64, -64, -64, -64, -64, -64, -64, -64, 64, 64, 64, -64, -64, -64, 64, 64, 64, 64, -64, -64, -64, -64, 64, 64, -64, 64, -64, -64, -64, -64, -64, -64, -64, -64, -64, 64, 64, 64, 64, 64, -64, 64, 64, 64, -64, -64, -64, -64, 64, -64, -64, -64, 64, -64, -64, -64, -64, -64, -64, -64, 64, -64, 64, 64, 64, -64, 64, 64, 64, 64, 64, -64, -64, -64, 64, 64, 64, 64, 64, -64, -64, -64, 64, 64, -64, -64, -64, 64, -64, 64, 64, 64, -64, 64, -64, -64, 64, -64, -64, 64, 64, -64, -64, -64, 64, 64, -64, -64, 64, 64, 64, 64, -64, -64, 64, -64, -64, -64, 64, 64, -64, 64, 64, -64, -64, 64, -64, 64, -64, 64, 64, -64, 64, -64, 64, 64, -64, -64, 64, -64, -64, -64, 64, -64, 64, 64, -64, 64, -64, -64, -64, -64, 64, 64, -64, -64, -64, -64, -64, 64, 64, -64, 64, 64, -64, 64, -64, -64, -64, -64, 64, 64, 64, -64, -64, -64, 64, -64, 64, -64, -64, -64, 64, 64, -64, -64, -64, 64, 64, 64, 64, 64, 64, -64, 64, -64, -64, -64, -64, -64, -64, -64, -64, 64, -64, -64, -64, 64, -64, 64, -64, -64, 64, 64, 64, 64, 64, -64, 64, 64, 64, 64, -64, -64, 64, -64, -64, 64, -64, 64, -64, 64, 64, 64, -64, -64, -64, 64, -64, -64, 64, 64, -64, 64, 64, -64, 64, -64, 64, -64, -64, -64, 64, 64, -64, -64, -64, -64, 64, -64, 64, 64, 64, 64, 64, 64, -64, 64, -64, 64, 64, -64, -64, -64, 64, 64, -64, -64, -64, -64, -64, -64, -64, -64, -64, -64, -64, -64, 64, 64, 64, -64, 64, 64, -64, 64, -64, 64, -64, -64, 64, 64, -64, 64, 64, 64, -64, -64, -64, -64, -64, -64, -64, -64, -64, -64, -64, 64, -64, 64, -64, -64, 64, 64, 64, -64, 64, 64, 64, -64, 64, -64, -64, -64, 64, -64, -64, -64, -64, -64, -64, -64, -64, -64, -64, 64, -64, 64, -64, -64, -64, -64, 64, -64, -64, -64, 64, 64, 64, 64, 64, -64, 64, 64, -64, -64, -64, 64, -64, -64, -64, -64, -64, 64, 64, 64, -64, -64, 64, 64, 64, -64, -64, -64, -64, -64, -64, -64, -64, -64, 64, 64, 64, -64, 64, -64, -64, -64, 64, 64, -64, 64, 64, 64, -64, -64, -64, -64, 64, -64, -64, -64, -64, -64, -64, -64, -64, 64, 64, 64, 64, 64, -64, -64, 64, -64, 64, 64, 64, -64, -64, -64, -64, -64, -64, 64, 64, -64, -64, -64, -64, -64, -64, -64, 64, 64, -64, -64, -64, -64, 64, -64, -64, -64, -64, 64, 64, 64, -64, -64, -64, 64, -64, -64, -64, -64, -64, -64, -64, -64, 64, -64, -64, -64, 64, 64, -64, -64, 64, -64, -64, -64, 64, 64, 64, -64, -64, -64, 64, -64, -64, -64, -64, -64, -64, -64, -64, -64, -64, 64, 64, 64, 64, 64, -64, -64, -64, -64, -64, -64, -64, 64, 64, 64, -64, -64, 64, 64, -64, -64, -64, -64, 64, -64, 64, -64, -64, -64, -64, 64, 64, -64, -64, -64, -64, -64, -64, -64, 64, 64, 64, 64, 64, 64, 64, 64, 64, 64, 64, 64, -64, 64, -64, -64, -64, -64, -64, 64, -64, -64, -64, -64, -64, -64, -64, -64, 64, -64, 64, -64, 64, 64, 64, -64, -64, -64, 64, -64, -64, -64, -64, -64, -64, -64, -64, -64, -64, -64, -64, 64, -64, -64, -64, -64, -64, 64, -64, 64, -64, 64, 64, -64, -64, -64, 64, -64, -64, -64, -64, -64, -64, -64, -64, -64, -64, -64, -64, -64, -64, -64, -64, 64, 64, 64, 64, -64, -64, 64, -64, 64, -64, -64, -64, -64, -64, -64, -64, -64, -64, -64, -64, -64, 64, -64, 64, -64, -64, -64, -64, 64, 64, 64, 64, -64, -64, -64, -64, -64, -64, -64, 64, -64, -64, 64, 64, -64, -64, -64, -64, -64, -64, -64, -64, -64, -64, -64, -64, -64, 64, 64, 64, -64, -64, 64, -64, -64, 64, -64, -64, 64, 64, 64, 64, -64, -64, -64, -64, -64, -64, -64, -64, -64, -64, -64, -64, -64, -64, -64, 64, -64, -64, -64, -64, -64, 64, 64, -64, 64, -64, -64, -64, -64, -64, -64, -64, -64, -64, -64, -64, -64, -64, 64, -64, 64, -64, 64, 64, -64, -64, -64, -64, -64, 64, -64, 64, 64, -64, 64, -64, -64, -64, -64, -64, -64, -64, -64, 64, -64, 64, -64, -64, 64, -64, 64, 64, -64, -64, 64, -64, 64, 64, -64, -64, -64, -64, -64, -64, 64, 64, 64, 64, -64, -64, -64, 64, -64, -64, -64, 64, -64, 64, -64, -64, -64, -64, 64, 64, -64, -64, -64, -64, 64, -64, -64, 64, -64, 64, 64, 64, 64, 64, 64, -64, -64, 64, 64, 64, 64, -64, -64, -64, 64, -64, 64, -64, -64, 64, 64, 64, -64, -64, 64, -64, -64, -64, 64, 64, 64, 64, 64, 64, 64, -64, 64, -64, -64, -64, -64, -64, 64, -64, -64, -64, -64, 64, -64, 64, 64, -64, 64, 64, -64, -64, 64, -64, -64, -64, -64, 64, -64, 64, 64, -64, -64, -64, -64, -64, -64, 64, -64, 64, 64, 64, 64, 64, -64, 64, -64, 64, 64, 64, 64, 64, 64, 64, 64, 64, -64, -64, -64, 64, 64, 64, 64, 64, 64, 64, 64, 64, -64, 64, -64, 64, -64, -64, -64, 64, -64, 64, 64, -64, -64, -64, -64, 64, 64, -64, -64, 64, 64, 64, 64, -64, 64, 64, 64, 64, 64, 64, -64, -64, 64, -64, 64, 64, 64, 64, 64, -64, 64, -64, 64, -64, -64, 64, 64, -64, 64, -64, 64, -64, -64, 64, 64, -64, -64, 64, -64, -64, 64, -64, 64, -64, -64, -64, -64, -64, -64, 64, -64, -64, -64, -64, 64, -64, 64, -64, -64, -64, 64, 64, -64, -64, -64, 64, 64, 64, -64, 64, -64, -64, -64, 64, 64, -64, 64, 64, -64, -64, -64, -64, -64, -64, -64, -64, -64, 64, -64, 64, -64, -64, -64, 64, -64, -64, -64, 64, -64, -64, -64, 64, 64, 64, 64, 64, -64, -64, -64, -64, -64, -64, -64, -64, -64, -64, -64, -64, 64, 64, -64, -64, 64, -64, -64, 64, -64, -64, -64, 64, 64, 64, 64, 64, -64, -64, 64, -64, -64, -64, -64, -64, -64, -64, 64, -64, -64, 64, 64, 64, -64, -64, -64, -64, -64, -64, -64, -64, 64, 64, 64, -64, 64, 64, 64, 64, 64, -64, 64, -64, -64, -64, -64, -64, -64, 64, -64, -64, 64, 64, -64, -64, -64, -64, 64, -64, 64, 64, -64, -64, -64, -64, -64, -64, 64, 64, -64, -64, -64, 64, -64, -64, 64, 64, -64, -64, -64, -64, -64, -64, -64, -64, -64, -64, -64, -64, -64, 64, -64, -64, -64, -64, 64, 64, -64, 64, -64, -64, -64, -64, -64, -64, 64, -64, -64, 64, 64, 64, -64, 64, -64, -64, 64, -64, -64, -64, -64, -64, -64, -64, 64, 64, 64, 64, -64, 64, 64, -64, 64, 64, -64, -64, -64, 64, 64, 64, 64, 64, 64, 64, -64, -64, -64, -64, -64, -64, 64, 64, 64, 64, 64, 64, 64, 64, 64, -64, 64, 64, 64, -64, 64, 64, 64, 64, -64, -64, -64, -64, -64, -64, -64, -64, -64, 64, 64, 64, 64, 64, 64, 64, 64, 64, 64, 64, 64, 64, 64, 64, -64, -64, 64, 64, 64, -64, 64, 64, -64, -64, -64, -64, 64, 64, 64, 64, 64, 64, 64, 64, 64, 64, 64, -64, 64, -64, 64, 64, -64, -64, -64, -64, 64, 64, -64, 64, 64, 64, -64, -64, -64, -64, -64, 64, 64, 64, 64, 64, 64, 64, 64, 64, -64, -64, -64, -64, 64, -64, -64, -64, 64, 64, 64, -64, -64, 64, 64, 64, 64, 64, 64, 64, -64, -64, 64, 64, 64, 64, 64, 64, 64, 64, 64, 64, -64, -64, -64, 64, 64, 64, 64, 64, -64, 64, 64, -64, 64, 64, -64, 64, 64, -64, -64, 64, 64, 64, 64, 64, 64, -64, -64, -64, 64, -64, -64, 64, 64, -64, 64, -64, 64, 64, 64, 64, -64, 64, 64, -64, 64, -64, -64, 64, 64, 64, 64, 64, 64, -64, -64, -64, 64, 64, 64, 64, 64, -64, 64, 64, -64, 64, -64, 64, 64, 64, 64, 64, -64, -64, -64, 64, -64, 64, 64, 64, 64, 64, 64, 64, 64, 64, 64, 64, 64, 64, 64, -64, 64, 64, 64, 64, 64, 64, 64, -64, -64, 64, 64, 64, -64, 64, 64, 64, 64, 64, -64, -64, 64, 64, 64, 64, -64, 64, 64, 64, 64, 64, 64, 64, 64, -64, -64, -64, -64, -64, 64, -64, -64, 64, 64, 64, 64, -64, 64, 64, 64, 64, 64, 64, 64, 64, 64, 64, 64, 64, 64, 64, -64, -64, -64, 64, -64, 64, 64, -64, 64, 64, -64, -64, 64, -64, -64, -64, -64, -64, -64, 64, 64, 64, -64, 64, 64, 64, 64, 64, -64, 64, 64, 64, 64, -64, -64, 64, -64, 64, -64, 64, -64, -64, -64, -64, 64, 64, -64, 64, 64, 64, -64, 64, 64, 64, -64, -64, -64, -64, -64, 64, 64, -64, -64, 64, -64, -64, -64, -64, 64, 64, 64, 64, 64, -64, -64, -64, 64, -64, -64, 64, 64, 64, 64, -64, -64, -64, -64, -64, -64, -64, 64, -64, -64, -64, 64, 64, -64, 64, -64, 64, 64, -64, -64, -64, 64, -64, 64, 64, 64, 64, -64, -64, -64, -64, -64, -64, -64, -64, -64, -64, -64, -64, 64, -64, -64, 64, -64, 64, -64, -64, -64, -64, -64, -64, 64, 64, 64, -64, -64, -64, -64, -64, -64, -64, -64, -64, -64, -64, -64, 64, 64, 64, 64, -64, 64, -64, 64, 64, -64, 64, 64, 64, 64, 64, 64, 64, 64, -64, -64, -64, -64, -64, -64, -64, -64, -64, 64, 64, 64, -64, -64, -64, 64, 64, 64, 64, 64, 64, -64, -64, -64, -64, -64, -64, -64, -64, -64, -64, -64, -64, -64, -64, -64, 64, -64, 64, 64, -64, 64, 64, 64, 64, -64, -64, 64, 64, 64, 64, -64, -64, -64, -64, -64, -64, -64, -64, 64, 64, -64, -64, -64, -64, -64, -64, 64, 64, -64, -64, -64, 64, 64, 64, -64, 64, -64, -64, -64, -64, -64, -64, -64, -64, -64, -64, 64, -64, -64, -64, -64, -64, -64, -64, 64, -64, 64, 64, 64, 64, -64, 64, -64, 64, 64, 64, -64, 64, -64, -64, -64, -64, -64, 64, 64, -64, 64, 64, -64, 64, -64, -64, -64, -64, -64, 64, 64, 64, -64, 64, -64, 64, -64, -64, 64, -64, 64, 64, 64, 64, -64, 64, 64, 64, 64, 64, 64, 64, 64, -64, -64, -64, 64, 64, 64, 64, -64, 64, -64, -64, 64, -64, -64, 64, 64, 64, 64, 64, 64, 64, 64, -64, 64, 64, 64, 64, 64, 64, -64, 64, 64, 64, 64, 64, -64, 64, -64, -64, -64, -64, -64, -64, -64, 64, 64, 64, 64, 64, 64, -64, 64, -64, 64, 64, 64, -64, -64, 64, -64, -64, 64, 64, 64, -64, -64, -64, -64, -64, -64, -64, -64, -64, -64, -64, -64, 64, 64, 64, -64, -64, 64, 64, 64, -64, 64, 64, -64, 64, -64, -64, 64, 64, 64, -64, -64, -64, -64, -64, -64, -64, -64, -64, -64, 64, -64, 64, 64, 64, 64, 64, 64, 64, 64, 64, -64, 64, -64, -64, -64, -64, 64, 64, -64, 64, 64, -64, -64, 64, 64, -64, -64, 64, 64, -64, 64, 64, 64, 64, 64, 64, -64, 64, 64, 64, 64, 64, 64, 64, 64, 64, -64, -64, 64, 64, 64, 64, 64, 64, 64, 64, 64, 64, -64, -64, 64, 64, 64, 64, 64, 64, 64, -64, -64, -64, 64, 64, -64, 64, 64, 64, -64, 64, 64, 64, 64, 64, -64, 64, -64, -64, -64, 64, 64, 64, 64, 64, 64, 64, 64, 64, -64, -64, 64, -64, -64, 64, -64, 64, 64, 64, 64, 64, 64, 64, 64, -64, -64, -64, -64, 64, 64, -64, -64, 64, 64, 64, 64, 64, 64, 64, 64, -64, -64, -64, -64, 64, 64, 64, 64, 64, 64, 64, -64, 64, 64, -64, 64, -64, 64, -64, 64, 64, 64, -64, -64, -64, 64, 64, 64, 64, -64, -64, 64, 64, 64, 64, 64, 64, -64, -64, 64, 64, 64, 64, 64, 64, 64, -64, 64, 64, 64, 64, 64, -64, -64, 64, -64, 64, -64, 64, -64, 64, 64, 64, 64, 64, 64, 64, 64, 64, 64, 64, 64, 64, -64, -64, -64, 64, 64, -64, -64, 64, -64, 64, 64, -64, 64, 64, 64, -64, -64, 64, 64, 64, 64, 64, 64, 64, 64, 64, 64, 64, -64, -64, -64, -64, 64, 64, 64, 64, 64, 64, 64, 64, -64, -64, 64, -64, 64, 64, 64, 64, 64, 64, 64, 64, -64, -64, 64, 64, 64, -64, -64, 64, 64, -64, 64, 64, -64, 64, 64, 64, 64, 64, 64, -64, 64, 64, 64, 64, 64, 64, 64, 64, 64, 64, -64, 64, 64, -64, -64, -64, -64, 64, -64, 64, 64, -64, -64, 64, 64, 64, 64, 64, 64, 64, 64, 64, 64, 64, 64, 64, 64, 64, 64, 64, 64, 64, -64, 64, 64, 64, 64, -64, -64, 64, 64, 64, 64, 64, 64, 64, 64, -64, 64, -64, 64, 64, 64, 64, 64, 64, 64, 64, -64, -64, -64, 64, 64, 64, 64, -64, -64, -64, 64, -64, 64, 64, 64, 64, 64, 64, 64, 64, 64, 64, 64, 64, 64, 64, -64, 64, -64, -64, -64, 64, 64, 64, -64, -64, 64, 64, -64, -64, 64, 64, 64, 64, -64, -64, -64, 64, 64, 64, 64, 64, 64, -64, 64, -64, -64, 64, 64, 64, 64, 64, -64, -64, 64, 64, -64, -64, -64, 64, 64, 64, 64, 64, 64, 64, 64, 64, 64, 64, -64, 64, 64, -64, -64, 64, 64, 64, 64, 64, -64, -64, -64, -64, 64, -64, -64, -64, -64, -64, -64, -64, 64, -64, -64, -64, -64, -64, -64, -64, -64, 64, 64, 64, 64, 64, 64, -64, 64, 64, 64, -64, -64, -64, 64, -64, -64, -64, -64, -64, -64, 64, -64, -64, -64, 64, 64, -64, -64, 64, 64, 64, 64, 64, 64, 64, -64, -64, 64, 64, -64, -64, -64, -64, -64, -64, -64, -64, -64, -64, -64, -64, 64, -64, -64, 64, 64, -64, -64, 64, -64, -64, 64, 64, 64, 64, 64, -64, -64, -64, -64, -64, -64, -64, 64, 64, 64, 64, 64, 64, 64, 64, 64, 64, 64, 64, -64, -64, 64, 64, -64, -64, -64, -64, 64, -64, 64, -64, 64, -64, -64, 64, 64, 64, 64, 64, 64, 64, -64, 64, 64, 64, 64, 64, 64, 64, -64, 64, -64, -64, -64, 64, -64, 64, -64, 64, 64, -64, 64, -64, -64, -64, -64, 64, -64, -64, 64, 64, 64, 64, 64, -64, 64, 64, 64, -64, 64, 64, 64, -64, -64, 64, -64, 64, 64, 64, 64, -64, 64, -64, -64, 64, 64, 64, -64, -64, -64, 64, 64, 64, -64, 64, -64, -64, 64, 64, -64, 64, 64, -64, -64, -64, 64, -64, -64, -64, 64, 64, -64, -64, -64, -64, -64, 64, 64, 64, -64, -64, -64, 64, 64, 64, 64, -64, -64, -64, -64, 64, -64, 64, 64, -64, -64, -64, 64, 64, -64, 64, 64, 64, -64, -64, -64, -64, 64, -64, -64, -64, 64, -64, -64, 64, -64, 64, -64, 64, 64, -64, 64, -64, -64, -64, -64, -64, -64, -64, -64, -64, 64, -64, -64, -64, -64, -64, -64, -64, -64, -64, -64, 64, -64, -64, -64, 64, 64, 64, 64, 64, -64, 64, 64, -64, -64, -64, -64, -64, 64, 64, 64, 64, -64, -64, -64, 64, 64, -64, -64, 64, 64, 64, 64, 64, 64, 64, 64, 64, -64, 64, 64, 64, -64, 64, 64, 64, 64, 64, -64, -64, -64, 64, -64, 64, -64, -64, -64, -64, 64, -64, 64, -64, 64, 64, -64, 64, -64, 64, 64, 64, 64, 64, 64, 64, 64, 64, -64, -64, 64, 64, -64, -64, -64, -64, -64, -64, 64, 64, 64, -64, -64, 64, 64, 64, 64, 64, 64, 64, 64, 64, 64, 64, 64, 64, -64, -64, 64, -64, 64, 64, 64, 64, 64, 64, 64, 64, -64, 64, -64, -64, 64, -64, 64, 64, 64, 64, 64, 64, 64, 64, 64, 64, 64, 64, 64, 64, 64, 64, 64, 64, 64, 64, 64, -64, -64, -64, 64, -64, 64, 64, -64, 64, 64, 64, 64, 64, 64, 64, 64, 64, 64, 64, 64, 64, 64, -64, 64, 64, -64, -64, 64, -64, -64, -64, 64, 64, 64, 64, 64, 64, 64, 64, 64, 64, 64, 64, 64, 64, 64, 64, 64, -64, 64, -64, 64, 64, 64, 64, 64, 64, 64, -64, 64, 64, 64, 64, 64, -64, -64, 64, -64, -64, 64, 64, 64, 64, 64, 64, 64, 64, 64, -64, 64, 64, -64, -64, -64, -64, 64, -64, 64, 64, 64, 64, -64, -64, 64, 64, -64, -64, -64, 64, 64, 64, 64, 64, 64, 64, 64, -64, 64, -64, -64, -64, -64, 64, 64, -64, -64, 64, 64, -64, -64, -64, -64, 64, -64, -64, -64, -64, 64, 64, -64, 64, -64, 64, 64, -64, 64, -64, 64, -64, -64, -64, 64, 64, 64, -64, -64, -64, -64, -64, -64, -64, -64, -64, -64, 64, -64, 64, -64, -64, 64, -64, -64, 64, 64, 64, 64, -64, 64, 64, -64, 64, 64, 64, 64, -64, -64, -64, 64, -64, -64, -64, -64, -64, -64, 64, -64, -64, 64, -64, 64, 64, 64, 64, -64, -64, -64, 64, -64, 64, 64, -64, -64, -64, -64, -64, 64, -64, -64, -64, -64, -64, -64, -64, -64, -64, 64, -64, -64, 64, -64, -64, -64, -64, -64, 64, 64, -64, -64, -64, -64, 64, -64, -64, 64, -64, -64, -64, -64, -64, -64, -64, -64, 64, 64, 64, -64, -64, -64, -64, -64, 64, 64, 64, 64, -64, 64, -64, -64, -64, -64, -64, -64, -64, 64, -64, -64, -64, -64, -64, -64, -64, -64, 64, -64, -64, 64, -64, 64, 64, 64, 64, -64, 64, -64, -64, -64, 64, 64, 64, 64, -64, -64, -64, -64, 64, -64, -64, 64, -64, -64, 64, 64, 64, -64, -64, -64, 64, 64, -64, 64, 64, -64, 64, -64, 64, -64, 64, 64, 64, -64, 64, -64, 64, 64, -64, -64, 64, -64, 64, 64, -64, 64, -64, 64, -64, 64, 64, 64, -64, -64, -64, -64, 64, 64, 64, 64, 64, 64, 64, 64, 64, 64, 64, 64, 64, -64, 64, -64, -64, -64, -64, -64, -64, -64, 64, 64, 64, 64, -64, -64, -64, 64, 64, 64, 64, 64, 64, 64, 64, 64, 64, -64, 64, -64, 64, 64, 64, -64, -64, -64, -64, 64, -64, -64, 64, -64, 64, 64, -64, 64, 64, 64, 64, 64, 64, 64, 64, 64, 64, 64, 64, -64, -64, -64, -64, -64, -64, -64, -64, -64, 64, -64, -64, -64, -64, 64, 64, 64, 64, -64, -64, 64, -64, 64, 64, 64, 64, -64, 64, 64, 64, -64, -64, -64, -64, -64, -64, 64, 64, 64, -64, -64, 64, 64, -64, 64, 64, 64, -64, -64, -64, 64, 64, -64, 64, 64, 64, 64, 64, -64, 64, 64, -64, 64, 64, 64, -64, -64, -64, -64, 64, -64, -64, 64, 64, -64, -64, -64, 64, -64, 64, 64, 64, 64, 64, 64, 64, -64, -64, 64, -64, -64, -64, 64, -64, -64, -64, 64, -64, 64, -64, 64, -64, 64, -64, 64, -64, -64, -64, 64, -64, 64, 64, 64, 64, -64, 64, 64, 64, 64, 64, 64, 64, 64, 64, -64, 64, 64, 64, -64, -64, 64, -64, 64, -64, -64, -64, -64, -64, 64, 64, 64, -64, 64, 64, -64, 64, 64, 64, -64, -64, -64, -64, 64, 64, -64, 64, 64, -64, 64, 64, 64, -64, -64, 64, -64, -64, 64, 64, -64, -64, 64, -64, 64, -64, 64, 64, 64, 64, -64, -64, 64, 64, -64, -64, 64, -64, 64, 64, 64, -64, -64, 64, -64, -64, 64, 64, -64, -64, 64, -64, -64, 64, 64, -64, -64, -64, -64, 64, -64, -64, 64, 64, 64, 64, 64, 64, 64, -64, -64, 64, 64, 64, -64, 64, 64, -64, 64, 64, 64, 64, -64, -64, -64, -64, -64, 64, -64, 64, 64, 64, 64, -64, 64, 64, -64, -64, 64, 64, 64, 64, -64, 64, 64, 64, 64, -64, 64, 64, 64, 64, 64, -64, 64, -64, 64, 64, -64, -64, 64, 64, 64, 64, 64, 64, 64, 64, 64, 64, 64, 64, 64, 64, 64, -64, 64, -64, 64, 64, 64, -64, 64, 64, -64, 64, 64, 64, 64, 64, 64, 64, 64, 64, 64, 64, -64, -64, 64, 64, 64, 64, -64, 64, 64, -64, -64, 64, 64, -64, 64, 64, -64, 64, 64, 64, -64, 64, 64, 64, -64, 64, -64, 64, 64, 64, 64, -64, -64, 64, -64, -64, -64, -64, -64, -64, 64, -64, -64, -64, 64, -64, 64, 64, 64, -64, -64, -64, 64, 64, -64, -64, 64, -64, -64, -64, 64, -64, -64, 64, 64, 64, -64, -64, -64, -64, 64, 64, 64, -64, 64, -64, 64, -64, -64, -64, 64, -64, -64, -64, -64, 64, 64, 64, 64, -64, 64, 64, -64, -64, 64, 64, -64, 64, 64, -64, 64, 64, -64, 64, 64, -64, -64, -64, -64, -64, -64, 64, -64, 64, 64, 64, 64, 64, 64, 64, -64, 64, -64, -64, 64, -64, -64, 64, -64, 64, 64, 64, -64, -64, -64, -64, -64, -64, -64, -64, -64, 64, 64, 64, 64, 64, 64, 64, -64, 64, 64, -64, -64, -64, 64, -64, -64, -64, 64, -64, -64, -64, -64, -64, 64, 64, 64, 64, 64, 64, 64, 64, 64, 64, 64, 64, -64, 64, 64, 64, -64, -64, -64, -64, 64, 64, -64, -64, -64, -64, 64, 64, 64, 64, 64, 64, -64, 64, -64, -64, -64, 64, -64, -64, 64, 64, -64, 64, 64, -64, -64, -64, 64, 64, 64, 64, -64, -64, 64, -64, -64, 64, 64, -64, -64, -64, 64, 64, 64, 64, 64, 64, 64, 64, -64, 64, 64, -64, -64, -64, 64, 64, 64, 64, -64, -64, -64, 64, 64, 64, 64, 64, 64, 64, 64, 64, 64, 64, 64, -64, -64, -64, -64, -64, -64, 64, -64, 64, 64, -64, -64, 64, -64, -64, 64, 64, 64, 64, 64, -64, 64, 64, 64, 64, 64, -64, 64, 64, -64, -64, 64, 64, 64, -64, 64, 64, -64, 64, 64, -64, -64, -64, -64, -64, 64, -64, 64, 64, 64, 64, 64, 64, 64, 64, 64, -64, -64, -64, -64, 64, 64, 64, 64, 64, -64, -64, -64, -64, -64, -64, -64, -64, 64, 64, 64, 64, 64, 64, 64, 64, 64, 64, -64, -64, 64, -64, -64, 64, 64, 64, -64, -64, -64, 64, 64, -64, -64, 64, 64, 64, 64, 64, 64, 64, 64, 64, 64, 64, 64, 64, -64, 64, -64, -64, -64, -64, -64, -64, -64, -64, 64, -64, 64, -64, 64, 64, 64, 64, 64, 64, 64, 64, 64, 64, 64, -64, -64, 64, 64, -64, 64, -64, -64, -64, 64, 64, 64, 64, 64, -64, 64, 64, 64, 64, 64, 64, 64, 64, 64, 64, -64, 64, 64, 64, 64, 64, -64, 64, -64, -64, -64, -64, 64, -64, -64, 64, -64, -64, -64, 64, 64, 64, 64, 64, 64, 64, 64, 64, 64, 64, 64, 64, 64, 64, -64, 64, -64, -64, -64, -64, -64, -64, 64, -64, 64, 64, 64, 64, 64, 64, 64, 64, -64, 64, 64, 64, -64, 64, -64, -64, -64, -64, 64, 64, -64, -64, -64, -64, -64, -64, -64, 64, -64, -64, -64, 64, -64, -64, 64, -64, 64, 64, 64, -64, -64, -64, 64, -64, -64, 64, 64, -64, -64, -64, -64, 64, 64, 64, -64, 64, 64, 64, 64, 64, -64, -64, -64, -64, 64, 64, -64, -64, 64, 64, -64, -64, -64, -64, -64, 64, 64, -64, -64, 64, 64, -64, -64, 64, -64, 64, 64, -64, -64, -64, -64, 64, -64, -64, 64, -64, -64, 64, 64, -64, 64, -64, -64, 64, -64, 64, -64, -64, -64, -64, 64, 64, -64, -64, 64, -64, 64, -64, -64, -64, 64, -64, 64, 64, -64, 64, -64, -64, 64, -64, 64, 64, -64, 64, -64, -64, -64, -64, -64, -64, -64, 64, 64, -64, -64, 64, -64, -64, 64, 64, -64, 64, 64, -64, -64, -64, 64, 64, -64, -64, -64, -64, -64, 64, -64, 64, -64, -64, -64, -64, -64, 64, -64, 64, -64, 64, -64, -64, -64, -64, -64, 64, -64, -64, 64, 64, 64, -64, -64, 64, 64, -64, 64, -64, -64, -64, -64, 64, -64, 64, 64, 64, 64, 64, -64, -64, -64, -64, -64, -64, 64, -64, 64, 64, -64, -64, -64, -64, -64, 64, -64, 64, -64, 64, 64, 64, 64, -64, -64, 64, 64, -64, 64, -64, -64, -64, -64, 64, 64, -64, 64, 64, 64, 64, -64, 64, -64, -64, 64, -64, 64, -64, -64, 64, 64, -64, -64, -64, -64, -64, -64, -64, -64, -64, -64, -64, -64, -64, 64, 64, -64, -64, -64, -64, 64, -64, -64, 64, 64, -64, -64, -64, 64, 64, -64, -64, 64, -64, -64, 64, -64, -64, -64, -64, -64, -64, -64, -64, -64, -64, -64, -64, 64, -64, -64, -64, -64, -64, 64, 64, 64, 64, 64, 64, -64, -64, -64, -64, 64, 64, -64, -64, 64, -64, 64, 64, 64, -64, -64, -64, -64, 64, 64, -64, 64, 64, -64, 64, -64, 64, 64, -64, -64, -64, -64, -64, 64, -64, -64, -64, -64, -64, 64, 64, 64, -64, -64, -64, -64, -64, -64, 64, 64, 64, 64, -64, -64, -64, -64, -64, -64, -64, -64, -64, -64, -64, -64, -64, 64, -64, 64, 64, 64, 64, 64, 64, -64, 64, 64, 64, -64, -64, 64, 64, -64, -64, -64, 64, -64, 64, -64, -64, 64, 64, -64, 64, -64, 64, 64, 64, 64, -64, 64, 64, -64, -64, 64, 64, -64, 64, 64, -64, 64, -64, -64, -64, 64, 64, 64, -64, -64, -64, 64, 64, 64, -64, 64, 64, 64, -64, 64, -64, -64, -64, 64, -64, 64, 64, -64, -64, -64, -64, 64, -64, 64, 64, 64, 64, -64, -64, -64, -64, 64, 64, 64, 64, 64, -64, 64, -64, -64, -64, -64, -64, 64, 64, -64, 64, -64, -64, -64, -64, -64, -64, 64, -64, -64, -64, -64, 64, 64, 64, 64, 64, 64, -64, -64, 64, -64, -64, 64, 64, -64, -64, -64, -64, 64, 64, -64, -64, -64, 64, -64, -64, -64, -64, -64, 64, 64, 64, 64, -64, -64, -64, -64, 64, -64, -64, 64, -64, 64, -64, -64, -64, -64, 64, -64, -64, 64, -64, -64, -64, -64, -64, 64, 64, -64, -64, 64, -64, 64, -64, 64, -64, -64, -64, -64, 64, -64, 64, -64, 64, 64, -64, -64, -64, -64, -64, -64, -64, 64, -64, 64, 64, -64, -64, -64, -64, -64, -64, 64, 64, -64, -64, 64, -64, 64, -64, -64, -64, -64, -64, -64, -64, -64, -64, -64, -64, -64, 64, 64, 64, -64, -64, -64, -64, -64, -64, 64, 64, -64, -64, -64, 64, 64, -64, -64, -64, 64, -64, -64, -64, -64, 64, -64, -64, 64, 64, 64, -64, -64, -64, -64, -64, -64, -64, 64, -64, -64, -64, -64, 64, 64, 64, 64, 64, -64, -64, -64, -64, -64, -64, -64, -64, -64, 64, -64, -64, -64, -64, -64, -64, -64, -64, -64, 64, -64, -64, 64, -64, 64, 64, -64, -64, -64, -64, 64, 64, -64, -64, 64, 64, -64, -64, -64, -64, -64, -64, -64, -64, -64, -64, 64, 64, -64, -64, 64, -64, -64, -64, -64, -64, -64, 64, -64, 64, 64, 64, 64, 64, -64, -64, -64, -64, -64, -64, -64, -64, -64, 64, -64, 64, -64, -64, -64, 64, -64, 64, -64, -64, 64, 64, 64, 64, -64, 64, 64, 64, -64, -64, -64, -64, -64, -64, -64, -64, -64, -64, 64, -64, -64, -64, 64, -64, -64, 64, -64, 64, 64, 64, 64, -64, 64, 64, 64, 64, -64, -64, -64, -64, -64, -64, -64, 64, 64, -64, -64, -64, 64, 64, 64, -64, -64, 64, 64, 64, 64, 64, 64, 64, 64, 64, -64, -64, -64, -64, -64, -64, -64, 64, -64, -64, 64, -64, -64, -64, 64, -64, 64, -64, 64, 64, -64, -64, 64, 64, 64, 64, 64, 64, 64, -64, -64, -64, -64, 64, -64, -64, -64, -64, 64, 64, 64, 64, -64, 64, 64, 64, 64, -64, 64, -64, 64, 64, 64, 64, 64, 64, 64, -64, -64, -64, 64, -64, -64, 64, -64, 64, -64, 64, 64, 64, 64, 64, -64, 64, 64, 64, 64, 64, 64, 64, 64, 64, 64, 64, 64, 64, 64, -64, 64, -64, 64, 64, 64, 64, 64, -64, -64, -64, 64, 64, 64, 64, 64, 64, -64, 64, -64, 64, 64, 64, 64, -64, 64, 64, -64, -64, 64, 64, 64, 64, -64, 64, -64, -64, -64, 64, 64, 64, 64, -64, -64, 64, 64, -64, -64, -64, 64, -64, -64, 64, 64, -64, 64, -64, 64, -64, 64, -64, -64, -64, -64, -64, 64, -64, -64, -64, 64, -64, -64, 64, -64, -64, -64, 64, -64, -64, -64, 64, 64, 64, -64, 64, 64, -64, 64, 64, 64, -64, -64, 64, 64, -64, -64, -64, 64, 64, 64, 64, 64, -64, -64, -64, -64, -64, 64, -64, 64, -64, -64, -64, 64, 64, 64, 64, -64, 64, -64, 64, -64, -64, 64, -64, 64, 64, -64, 64, 64, 64, -64, -64, -64, 64, 64, -64, 64, 64, 64, 64, 64, 64, -64, -64, 64, 64, 64, 64, 64, 64, -64, -64, 64, -64, -64, -64, 64, -64, -64, -64, -64, 64, 64, 64, 64, -64, 64, -64, -64, 64, -64, 64, 64, -64, -64, 64, 64, -64, -64, -64, -64, -64, -64, -64, 64, 64, -64, 64, -64, 64, 64, 64, 64, 64, 64, 64, 64, 64, 64, 64, -64, -64, 64, -64, 64, -64, 64, 64, 64, 64, 64, 64, 64, 64, -64, -64, -64, -64, 64, 64, 64, -64, -64, 64, -64, 64, 64, -64, 64, 64, 64, 64, -64, 64, -64, 64, -64, -64, -64, 64, 64, 64, -64, 64, -64, 64, 64, 64, 64, -64, -64, -64, 64, 64, 64, 64, 64, 64, -64, 64, -64, 64, 64, -64, -64, 64, 64, -64, -64, 64, -64, -64, 64, 64, -64, 64, 64, 64, 64, -64, 64, 64, 64, -64, -64, -64, 64, 64, 64, -64, -64, -64, 64, -64, 64, 64, 64, -64, 64, -64, -64, 64, -64, 64, -64, 64, 64, -64, 64, 64, 64, 64, 64, 64, 64, 64, -64, 64, 64, -64, 64, -64, -64, -64, 64, -64, -64, -64, 64, 64, 64, 64, 64, -64, -64, 64, 64, 64, 64, -64, -64, 64, 64, -64, -64, 64, -64, -64, 64, -64, 64, 64, -64, -64, -64, 64, 64, 64, -64, -64, 64, 64, 64, -64, 64, 64, 64, 64, 64, 64, 64, 64, 64, -64, -64, -64, 64, 64, 64, -64, 64, 64, -64, -64, 64, -64, 64, -64, 64, -64, 64, 64, 64, -64, -64, -64, 64, -64, 64, 64, -64, 64, -64, 64, -64, -64, -64, 64, 64, -64, 64, 64, -64, -64, 64, 64, 64, 64, 64, 64, 64, -64, 64, -64, -64, 64, 64, -64, 64, 64, 64, -64, -64, -64, 64, -64, 64, 64, -64, -64, 64, 64, 64, -64, 64, 64, 64, 64, 64, 64, 64, 64, 64, 64, 64, -64, 64, 64, -64, 64, 64, -64, -64, -64, 64, -64, 64, 64, 64, -64, 64, 64, 64, -64, 64, 64, 64, 64, -64, 64, 64, -64, 64, 64, -64, 64, 64, 64, 64, 64, -64, -64, 64, -64, 64, -64, -64, 64, 64, 64, 64, -64, 64, 64, 64, -64, 64, 64, 64, 64, 64, -64, -64, 64, 64, -64, 64, -64, -64, -64, 64, -64, -64, 64, 64, 64, 64, -64, 64, 64, 64, 64, 64, -64, 64, 64, 64, 64, -64, 64, 64, 64, -64, -64, 64, 64, 64, -64, -64, 64, -64, 64, 64, 64, 64, -64, 64, 64, 64, -64, 64, -64, 64, 64, 64, 64, -64, 64, 64, -64, 64, 64, 64, 64, 64, -64, 64, -64, 64, 64, 64, -64, 64, 64, 64, 64, 64, -64, 64, -64, 64, 64, 64, 64, 64, -64, 64, -64, 64, -64, -64, 64, -64, 64, -64, 64, 64, 64, 64, 64, 64, 64, 64, 64, 64, 64, 64, 64, -64, -64, 64, -64, -64, -64, 64, -64, 64, -64, -64, -64, 64, -64, -64, -64, 64, 64, 64, 64, 64, 64, -64, 64, 64, -64, 64, 64, 64, 64, 64, 64, -64, 64, 64, -64, 64, 64, 64, -64, -64, 64, 64, -64, -64, 64, 64, -64, 64, 64, -64, 64, 64, -64, 64, 64, -64, 64, -64, 64, 64, -64, -64, -64, -64, -64, -64, -64, 64, -64, 64, 64, 64, -64, 64, 64, -64, -64, 64, 64, 64, 64, 64, -64, 64, -64, 64, -64, 64, -64, -64, -64, 64, 64, 64, -64, 64, -64, -64, 64, 64, -64, 64, 64, 64, -64, 64, 64, 64, 64, 64, 64, -64, -64, 64, -64, 64, 64, 64, 64, 64, 64, -64, 64, -64, -64, -64, -64, 64, 64, -64, -64, 64, -64, 64, 64, 64, -64, 64, 64, -64, 64, 64, -64, 64, 64, 64, 64, 64, -64, 64, -64, 64, 64, 64, -64, 64, 64, 64, 64, 64, -64, 64, 64, -64, -64, -64, -64, -64, -64, -64, 64, 64, 64, 64, 64, -64, -64, 64, 64, 64, 64, 64, 64, -64, -64, -64, 64, -64, 64, 64, -64, -64, 64, 64, -64, 64, 64, 64, 64, -64, 64, -64, -64, -64, -64, -64, -64, 64, 64, 64, -64, 64, -64, 64, 64, -64, -64, -64, -64, 64, -64, -64, -64, 64, 64, -64, 64, -64, -64, -64, 64, -64, -64, -64, -64, -64, 64, 64, 64, 64, 64, -64, 64, 64, 64, -64, 64, -64, -64, -64, -64, 64, -64, -64, 64, -64, -64, 64, 64, 64, 64, 64, -64, -64, -64, -64, -64, -64, -64, -64, -64, -64, -64, 64, -64, -64, 64, -64, -64, -64, -64, -64, -64, -64, -64, -64, 64, -64, -64, 64, 64, -64, -64, 64, -64, 64, -64, -64, 64, 64, 64, 64, -64, 64, -64, -64, -64, -64, -64, -64, -64, -64, -64, -64, -64, 64, -64, -64, 64, -64, -64, 64, -64, 64, -64, -64, 64, -64, 64, 64, 64, 64, 64, 64, 64, -64, 64, 64, 64, -64, -64, -64, -64, -64, -64, -64, 64, -64, 64, -64, -64, 64, 64, 64, -64, 64, 64, 64, 64, 64, 64, 64, 64, 64, 64, 64, 64, -64, -64, -64, 64, -64, -64, -64, -64, -64, -64, 64, -64, 64, -64, -64, 64, 64, 64, -64, 64, -64, 64, -64, 64, 64, 64, 64, 64, -64, 64, -64, -64, -64, -64, -64, 64, -64, 64, -64, -64, 64, -64, -64, 64, 64, -64, 64, 64, 64, 64, -64, -64, 64, 64, 64, 64, -64, 64, 64, -64, -64, -64, -64, 64, 64, 64, 64, -64, 64, -64, -64, 64, -64, -64, -64, -64, -64, -64, -64, 64, 64, 64, 64, 64, 64, -64, -64, -64, -64, -64, -64, 64, -64, 64, 64, -64, -64, -64, 64, 64, 64, -64, -64, -64, 64, -64, -64, -64, 64, 64, 64, -64, -64, -64, -64, 64, -64, -64, -64, -64, -64, -64, -64, -64, 64, -64, 64, 64, -64, -64, -64, 64, -64, -64, -64, 64, 64, 64, 64, -64, -64, -64, -64, -64, 64, -64, 64, 64, -64, -64, -64, 64, 64, 64, -64, 64, -64, 64, 64, 64, 64, -64, -64, -64, -64, 64, -64, 64, -64, -64, -64, 64, 64, 64, 64, -64, 64, 64, -64, 64, 64, 64, -64, 64, -64, -64, 64, 64, 64, -64, -64, -64, 64, 64, -64, -64, -64, 64, -64, -64, 64, 64, -64, -64, -64, 64, -64, -64, -64, -64, -64, 64, -64, 64, 64, 64, 64, -64, -64, -64, -64, 64, -64, -64, -64, -64, -64, 64, 64, 64, -64, 64, 64, 64, -64, -64, -64, 64, 64, 64, -64, 64, 64, 64, 64, 64, -64, -64, 64, -64, -64, -64, 64, 64, 64, 64, 64, 64, 64, -64, -64, -64, -64, -64, -64, -64, -64, -64, 64, 64, 64, -64, 64, -64, -64, -64, -64, -64, 64, -64, 64, 64, 64, 64, 64, 64, 64, -64, -64, 64, 64, -64, -64, 64, 64, -64, 64, 64, 64, -64, -64, -64, 64, -64, 64, 64, 64, 64, 64, 64, 64, -64, 64, 64, 64, -64, 64, -64, 64, -64, -64, 64, -64, 64, 64, 64, 64, 64, 64, 64, -64, -64, -64, 64, -64, 64, 64, 64, 64, -64, 64, 64, 64, 64, -64, 64, -64, -64, -64, 64, -64, -64, -64, 64, 64, 64, -64, 64, 64, -64, -64, -64, -64, -64, 64, 64, 64, 64, 64, 64, 64, -64, -64, 64, -64, -64, -64, -64, -64, -64, -64, 64, 64, 64, -64, 64, 64, -64, 64, 64, -64, 64, 64, 64, 64, 64, 64, 64, 64, 64, -64, -64, -64, -64, -64, -64, 64, -64, -64, 64, 64, 64, -64, 64, -64, -64, 64, 64, 64, 64, 64, 64, 64, 64, 64, -64, -64, 64, 64, 64, 64, -64, -64, 64, -64, -64, 64, 64, 64, 64, 64, -64, 64, 64, 64, 64, 64, 64, -64, 64, 64, 64, 64, 64, 64, 64, -64, -64, -64, 64, -64, -64, 64, 64, 64, 64, 64, 64, 64, 64, 64, 64, 64, 64, 64, 64, 64, 64, 64, 64, 64, 64, 64, -64, -64, 64, 64, 64, -64, -64, -64, 64, 64, 64, 64, 64, 64, 64, -64, 64, -64, -64, 64, 64, -64, 64, 64, 64, 64, 64, -64, 64, -64, 64, -64, 64, -64, -64, -64, 64, 64, -64, -64, -64, -64, -64, -64, -64, -64, -64, -64, -64, -64, -64, -64, 64, 64, 64, 64, 64, -64, -64, 64, -64, 64, 64, -64, 64, -64, -64, -64, -64, -64, -64, -64, -64, -64, -64, 64, -64, -64, -64, 64, 64, 64, 64, -64, -64, -64, -64, -64, 64, -64, -64, -64, -64, -64, 64, 64, -64, -64, -64, -64, -64, -64, -64, -64, -64, -64, -64, -64, -64, -64, 64, 64, 64, -64, -64, 64, 64, -64, -64, -64, 64, 64, 64, -64, 64, 64, 64, 64, -64, 64, 64, 64, -64, -64, 64, -64, 64, -64, -64, 64, 64, 64, 64, 64, -64, -64, 64, -64, -64, -64, 64, 64, -64, -64, -64, -64, 64, -64, 64, 64, 64, -64, -64, -64, 64, 64, 64, 64, 64, -64, -64, 64, 64, -64, -64, 64, -64, -64, -64, -64, 64, 64, 64, -64, 64, -64, 64, -64, 64, -64, -64, -64, -64, 64, 64, -64, 64, 64, 64, -64, 64, 64, 64, 64, 64, -64, -64, 64, 64, -64, 64, -64, -64, -64, 64, -64, 64, 64, 64, 64, 64, 64, 64, -64, 64, -64, 64, -64, 64, 64, 64, 64, -64, -64, -64, -64, -64, 64, 64, 64, 64, 64, 64, 64, 64, 64, -64, 64, -64, -64, 64, -64, -64, -64, -64, 64, -64, 64, 64, -64, -64, 64, 64, -64, 64, -64, 64, 64, 64, 64, 64, 64, 64, 64, 64, -64, 64, -64, -64, -64, 64, -64, -64, -64, 64, 64, 64, -64, -64, -64, 64, 64, 64, 64, -64, 64, 64, 64, 64, 64, 64, 64, 64, -64, -64, -64, -64, -64, -64, -64, -64, 64, 64, 64, 64, 64, 64, 64, 64, 64, 64, -64, -64, -64, -64, 64, 64, 64, 64, -64, -64, -64, -64, -64, 64, -64, -64, -64, -64, -64, -64, -64, 64, 64, -64, 64, 64, 64, -64, -64, -64, -64, -64, -64, 64, -64, -64, -64, -64, -64, -64, -64, 64, 64, 64, 64, 64, -64, -64, -64, -64, -64, 64, 64, 64, -64, -64, -64, -64, -64, -64, -64, 64, -64, 64, 64, 64, -64, -64, -64, 64, 64, 64, -64, 64, -64, -64, 64, -64, -64, -64, -64, -64, -64, -64, -64, -64, -64, -64, -64, -64, -64, -64, 64, -64, -64, -64, -64, -64, 64, 64, 64, 64, -64, -64, -64, -64, -64, -64, -64, -64, -64, -64, -64, -64, -64, -64, -64, -64, -64, -64, -64, -64, -64, -64, -64, -64, 64, 64, 64, -64, -64, 64, -64, -64, -64, -64, -64, -64, -64, -64, -64, -64, -64, -64, -64, -64, -64, -64, -64, -64, -64, -64, -64, -64, 64, 64, -64, 64, -64, 64, -64, -64, -64, -64, -64, -64, -64, 64, 64, -64, -64, -64, -64, -64, -64, -64, -64, -64, -64, -64, -64, 64, 64, 64, -64, 64, 64, 64, 64, -64, -64, -64, -64, -64, -64, 64, 64, 64, 64, -64, -64, -64, 64, 64, 64, -64, -64, 64, -64, -64, -64, -64, 64, -64, 64, 64, -64, -64, -64, 64, -64, 64, 64, 64, 64, 64, -64, 64, -64, -64, -64, 64, 64, 64, 64, 64, -64, -64, 64, -64, -64, -64, 64, 64, 64, 64, -64, 64, 64, 64, -64, 64, -64, -64, -64, -64, -64, -64, 64, -64, 64, 64, -64, 64, 64, -64, 64, -64, -64, -64, 64, 64, 64, 64, -64, 64, -64, -64, -64, 64, -64, 64, -64, -64, -64, -64, -64, -64, 64, 64, 64, -64, -64, 64, 64, 64, -64, 64, 64, 64, 64, 64, -64, 64, 64, 64, -64, -64, -64, -64, -64, -64, -64, 64, -64, -64, -64, 64, 64, 64, 64, 64, 64, -64, 64, -64, 64, 64, 64, -64, -64, -64, 64, 64, 64, -64, -64, -64, -64, -64, 64, -64, -64, -64, -64, -64, -64, -64, 64, -64, -64, -64, 64, 64, 64, 64, 64, 64, -64, -64, -64, 64, -64, -64, -64, -64, -64, -64, 64, 64, 64, 64, -64, -64, -64, -64, -64, -64, 64, -64, 64, -64, -64, 64, 64, 64, -64, 64, -64, 64, -64, -64, -64, -64, 64, -64, 64, 64, 64, 64, 64, -64, -64, 64, -64, -64, -64, 64, 64, -64, 64, 64, -64, -64, 64, -64, 64, 64, -64, 64, -64, 64, -64, 64, -64, -64, 64, 64, 64, 64, 64, -64, 64, 64, -64, 64, -64, 64, -64, -64, -64, 64, 64, 64, 64, 64, -64, 64, 64, 64, 64, -64, 64, 64, 64, 64, 64, -64, -64, -64, 64, -64, -64, 64, 64, 64, 64, 64, 64, 64, 64, 64, 64, -64, -64, 64, 64, -64, -64, -64, -64, -64, 64, 64, 64, 64, 64, 64, -64, -64, 64, -64, -64, -64, -64, -64, -64, 64, -64, -64, -64, 64, -64, 64, -64, -64, -64, 64, 64, 64, -64, 64, -64, 64, 64, 64, 64, -64, 64, 64, -64, 64, 64, 64, -64, -64, -64, -64, -64, -64, -64, -64, -64, -64, -64, -64, -64, -64, 64, -64, -64, 64, -64, -64, -64, 64, 64, 64, -64, 64, 64, -64, -64, -64, -64, -64, -64, -64, 64, 64, -64, -64, -64, -64, -64, -64, -64, -64, 64, -64, 64, -64, -64, 64, -64, -64, -64, 64, -64, -64, -64, 64, 64, 64, 64, 64, 64, 64, -64, 64, -64, 64, 64, -64, -64, 64, -64, -64, -64, 64, -64, -64, 64, 64, 64, 64, 64, -64, 64, 64, -64, -64, 64, 64, -64, -64, 64, 64, -64, 64, 64, -64, -64, -64, -64, -64, -64, -64, -64, 64, 64, 64, -64, 64, -64, 64, 64, -64, -64, -64, 64, 64, -64, 64, -64, -64, -64, 64, -64, 64, -64, -64, 64, 64, -64, 64, -64, -64, 64, 64, 64, -64, -64, 64, 64, -64, -64, 64, -64, 64, 64, -64, 64, -64, -64, 64, -64, 64, -64, 64, 64, 64, -64, -64, 64, 64, -64, 64, 64, -64, 64, 64, -64, -64, 64, -64, -64, -64, -64, 64, -64, 64, 64, 64, 64, -64, -64, -64, -64, -64, 64, -64, 64, -64, 64, 64, 64, -64, 64, 64, 64, 64, -64, -64, 64, 64, 64, -64, 64, -64, -64, -64, -64, -64, -64, -64, 64, -64, -64, 64, 64, 64, 64, 64, -64, 64, -64, 64, -64, -64, -64, 64, -64, 64, -64, -64, -64, -64, -64, 64, -64, -64, -64, 64, -64, -64, 64, 64, 64, 64, 64, 64, 64, 64, 64, -64, -64, -64, -64, -64, -64, 64, -64, -64, -64, -64, -64, -64, -64, -64, 64, 64, 64, 64, 64, -64, 64, -64, 64, 64, -64, -64, 64, -64, -64, 64, 64, -64, -64, 64, 64, -64, 64, -64, 64, 64, 64, 64, 64, -64, -64, 64, 64, -64, -64, 64, 64, 64, -64, 64, -64, -64, -64, 64, -64, 64, 64, 64, 64, 64, -64, -64, -64, -64, -64, -64, -64, -64, -64, 64, -64, -64, -64, 64, -64, 64, 64, 64, -64, -64, 64, -64, -64, -64, -64, -64, 64, -64, -64, -64, -64, 64, -64, -64, 64, -64, -64, -64, 64, -64, 64, -64, 64, 64, 64, 64, -64, -64, -64, -64, -64, 64, 64, 64, -64, -64, -64, -64, -64, 64, -64, 64, -64, -64, -64, 64, 64, -64, -64, -64, -64, -64, 64, 64, -64, 64, 64, 64, 64, 64, 64, 64, -64, -64, -64, -64, -64, 64, -64, -64, -64, -64, -64, -64, 64, -64, -64, 64, 64, -64, 64, -64, -64, 64, -64, 64, 64, 64, 64, 64, -64, 64, -64, -64, -64, -64, -64, -64, -64, -64, -64, -64, -64, -64, 64, 64, 64, 64, 64, 64, -64, 64, 64, 64, 64, 64, 64, 64, 64, -64, -64, -64, -64, 64, -64, -64, 64, -64, -64, -64, -64, -64, -64, 64, -64, 64, -64, 64, 64, 64, 64, 64, -64, 64, 64, -64, 64, -64, -64, -64, -64, -64, -64, -64, -64, -64, -64, -64, -64, 64, -64, 64, 64, -64, -64, 64, 64, 64, 64, -64, -64, 64, -64, -64, 64, 64, -64, 64, -64, -64, -64, 64, -64, -64, -64, 64, -64, -64, -64, -64, -64, 64, 64, 64, -64, 64, 64, 64, -64, 64, -64, 64, -64, -64, -64, 64, -64, 64, -64, -64, -64, -64, -64, 64, -64, -64, -64, -64, -64, 64, 64, -64, -64, 64, -64, -64, 64, -64, 64, -64, -64, -64, 64, 64, -64, -64, 64, 64, -64, -64, -64, -64, -64, -64, -64, -64, -64, 64, 64, -64, 64, -64, -64, 64, 64, 64, 64, -64, -64, -64, -64, -64, -64, 64, -64, 64, -64, 64, -64, 64, -64, -64, -64, -64, -64, -64, -64, -64, 64, 64, -64, 64, -64, 64, 64, -64, -64, -64, -64, -64, 64, -64, 64, 64, 64, -64, -64, -64, 64, -64, -64, 64, 64, 64, -64, 64, 64, 64, -64, -64, -64, -64, -64, -64, -64, -64, -64, -64, -64, -64, 64, 64, -64, 64, -64, 64, 64, -64, 64, 64, -64, -64, -64, 64, -64, -64, -64, 64, -64, 64, 64, 64, -64, -64, -64, -64, -64, -64, 64, -64, -64, -64, -64, -64, -64, -64, -64, -64, -64, -64, -64, 64, -64, 64, -64, -64, -64, -64, -64, 64, -64, -64, -64, -64, -64, 64, 64, 64, -64, 64, 64, -64, 64, -64, 64, 64, -64, 64, 64, 64, 64, 64, -64, -64, -64, -64, -64, -64, -64, -64, -64, -64, -64, -64, 64, 64, 64, -64, 64, -64, -64, 64, -64, 64, -64, 64, 64, -64, 64, 64, -64, 64, -64, -64, -64, -64, -64, -64, -64, -64, -64, 64, 64, 64, 64, -64, -64, -64, 64, 64, 64, 64, -64, 64, 64, 64, 64, 64, 64, 64, 64, 64, -64, -64, -64, -64, -64, -64, -64, 64, 64, 64, 64, 64, 64, -64, 64, 64, 64, -64, -64, 64, -64, 64, -64, 64, 64, -64, 64, -64, -64, -64, 64, 64, -64, -64, -64, 64, 64, 64, 64, 64, 64, 64, -64, 64, 64, 64, -64, 64, 64, 64, -64, 64, 64, 64, -64, -64, 64, -64, 64, -64, 64, -64, -64, 64, -64, 64, 64, 64, -64, -64, -64, 64, -64, 64, 64, -64, 64, 64, -64, -64, 64, 64, -64, 64, -64, -64, 64, -64, -64, 64, -64, -64, 64, -64, 64, -64, -64, -64, 64, -64, -64, 64, 64, 64, -64, 64, -64, 64, -64, -64, -64, 64, -64, -64, -64, -64, -64, 64, 64, 64, -64, 64, 64, -64, 64, -64, -64, -64, 64, 64, -64, 64, -64, 64, 64, -64, -64, 64, -64, -64, -64, -64, -64, -64, -64, -64, -64, 64, -64, -64, 64, 64, -64, -64, -64, 64, -64, 64, -64, 64, -64, 64, -64, 64, -64, -64, 64, -64, -64, -64, -64, -64, -64, -64, -64, 64, 64, 64, -64, -64, 64, -64, -64, -64, -64, -64, -64, 64, 64, 64, 64, 64, -64, -64, -64, -64, -64, -64, -64, -64, -64, -64, 64, 64, 64, -64, 64, -64, -64, -64, 64, 64, 64, -64, -64, -64, 64, 64, -64, 64, -64, 64, -64, -64, -64, -64, -64, -64, -64, 64, 64, 64, 64, 64, 64, -64, 64, -64, 64, 64, -64, -64, -64, -64, -64, -64, 64, 64, 64, 64, 64, -64, -64, -64, 64, -64, 64, 64, 64, 64, 64, 64, 64, -64, -64, -64, -64, 64, 64, -64, -64, -64, -64, 64, -64, 64, 64, -64, 64, -64, -64, 64, 64, -64, -64, -64, 64, 64, 64, -64, 64, -64, -64, -64, -64, -64, -64, -64, -64, -64, -64, -64, -64, 64, 64, -64, -64, 64, 64, 64, -64, 64, -64, -64, 64, 64, -64, -64, -64, -64, -64, -64, -64, -64, -64, -64, 64, -64, -64, 64, -64, 64, -64, -64, -64, -64, -64, -64, 64, 64, -64, -64, -64, -64, -64, -64, -64, -64, -64, -64, -64, -64, -64, -64, -64, 64, -64, 64, 64, 64, 64, 64, -64, -64, -64, 64, -64, -64, -64, 64, 64, 64, -64, 64, -64, 64, -64, -64, 64, -64, -64, -64, -64, -64, -64, -64, -64, 64, 64, 64, -64, -64, 64, 64, 64, -64, -64, 64, -64, -64, 64, 64, 64, -64, -64, 64, 64, 64, 64, -64, -64, -64, -64, 64, 64, -64, 64, 64, -64, -64, 64, -64, -64, -64, -64, -64, -64, -64, -64, 64, 64, -64, 64, 64, 64, 64, 64, 64, -64, -64, 64, -64, -64, -64, 64, 64, -64, -64, -64, -64, -64, -64, -64, -64, -64, -64, 64, 64, -64, 64, -64, 64, 64, 64, 64, -64, 64, 64, 64, 64, -64, 64, 64, -64, 64, 64, 64, -64, -64, -64, -64, -64, -64, -64, -64, -64, 64, 64, 64, 64, 64, 64, -64, -64, 64, 64, 64, 64, 64, 64, 64, 64, 64, 64, -64, 64, -64, -64, -64, -64, 64, 64, -64, -64, -64, 64, 64, 64, 64, 64, 64, 64, 64, -64, 64, -64, -64, 64, -64, 64, 64, -64, -64, -64, -64, 64, -64, -64, -64, 64, 64, -64, -64, 64, 64, 64, 64, 64, -64, -64, 64, -64, -64, -64, -64, 64, 64, 64, 64, 64, 64, -64, 64, -64, -64, -64, -64, -64, 64, 64, -64, -64, 64, -64, 64, 64, 64, 64, 64, 64, -64, -64, -64, -64, 64, 64, -64, -64, -64, 64, 64, -64, -64, -64, -64, -64, -64, 64, 64, -64, -64, -64, 64, 64, -64, -64, 64, -64, -64, -64, 64, -64, -64, 64, -64, -64, 64, 64, -64, -64, -64, -64, -64, -64, -64, -64, -64, -64, -64, -64, -64, -64, -64, -64, 64, -64, -64, -64, -64, 64, -64, 64, 64, 64, -64, -64, -64, -64, -64, -64, -64, -64, -64, -64, -64, -64, -64, 64, -64, 64, 64, 64, -64, 64, 64, 64, 64, -64, -64, 64, 64, 64, 64, 64, 64, -64, 64, 64, -64, -64, -64, -64, -64, -64, -64, -64, -64, 64, -64, 64, -64, 64, 64, -64, -64, -64, 64, -64, -64, 64, 64, 64, -64, 64, 64, 64, -64, 64, -64, 64, -64, 64, 64, -64, -64, -64, -64, -64, 64, 64, -64, 64, 64, -64, 64, 64, -64, -64, -64, 64, -64, 64, -64, -64, -64, -64, -64, 64, 64, 64, 64, -64, -64, -64, -64, -64, 64, -64, -64, 64, 64, 64, -64, 64, -64, -64, -64, 64, -64, -64, 64, -64, -64, 64, 64, 64, 64, 64, -64, 64, -64, -64, -64, 64, 64, -64, 64, -64, 64, 64, 64, -64, -64, 64, -64, -64, -64, -64, -64, 64, -64, 64, 64, 64, -64, 64, 64, 64, 64, -64, -64, -64, 64, 64, 64, 64, 64, -64, -64, -64, -64, 64, -64, -64, -64, -64, -64, 64, 64, 64, 64, 64, 64, 64, -64, 64, -64, -64, 64, 64, -64, -64, 64, 64, 64, -64, -64, -64, 64, 64, -64, 64, -64, 64, -64, -64, -64, 64, -64, 64, -64, -64, -64, 64, -64, 64, 64, 64, -64, 64, 64, -64, 64, 64, -64, -64, 64, 64, -64, -64, 64, -64, 64, -64, 64, -64, 64, 64, 64, 64, 64, 64, 64, 64, -64, -64, 64, 64, -64, -64, -64, -64, 64, 64, -64, -64, -64, 64, 64, 64, -64, -64, 64, 64, 64, -64, 64, -64, 64, -64, 64, 64, -64, -64, -64, 64, 64, 64, 64, 64, 64, -64, -64, -64, 64, -64, -64, 64, 64, -64, -64, -64, -64, -64, -64, -64, -64, -64, -64, -64, -64, -64, -64, 64, -64, 64, -64, 64, 64, 64, 64, -64, 64, -64, 64, 64, 64, 64, 64, 64, 64, -64, 64, -64, -64, -64, -64, 64, 64, 64, -64, -64, -64, 64, 64, 64, 64, -64, 64, -64, 64, 64, 64, 64, 64, 64, 64, 64, 64, 64, 64, 64, -64, 64, 64, -64, -64, -64, -64, -64, -64, 64, -64, -64, 64, 64, -64, -64, 64, 64, 64, 64, 64, -64, 64, -64, -64, -64, 64, -64, -64, 64, 64, -64, -64, 64, -64, -64, -64, -64, 64, 64, 64, 64, -64, 64, 64, -64, -64, -64, -64, -64, -64, -64, 64, -64, -64, 64, 64, -64, 64, 64, 64, 64, -64, 64, 64, -64, 64, 64, -64, 64, -64, -64, -64, -64, -64, -64, -64, -64, -64, -64, -64, -64, -64, 64, 64, -64, -64, 64, 64, -64, -64, 64, -64, 64, 64, -64, -64, -64, -64, -64, -64, -64, -64, -64, -64, -64, -64, -64, -64, 64, -64, -64, -64, -64, -64, -64, -64, -64, 64, -64, -64, -64, -64, -64, 64, -64, -64, -64, -64, -64, -64, -64, -64, -64, 64, 64, -64, -64, 64, 64, -64, -64, -64, -64, -64, -64, 64, -64, -64, 64, -64, 64, -64, -64, -64, -64, -64, -64, -64, 64, 64, 64, 64, 64, 64, -64, 64, -64, -64, -64, -64, -64, -64, 64, -64, 64, -64, -64, -64, 64, -64, -64, -64, -64, -64, -64, 64, 64, 64, 64, 64, 64, -64, 64, -64, 64, -64, -64, -64, -64, -64, 64, -64, 64, 64, 64, 64, 64, 64, -64, 64, 64, -64, 64, 64, 64, 64, -64, 64, -64, -64, -64, -64, -64, -64, -64, 64, -64, -64, -64, -64, -64, -64, 64, -64, 64, 64, 64, 64, -64, -64, -64, -64, -64, -64, 64, -64, 64, -64, -64, -64, -64, -64, -64, -64, 64, -64, -64, 64, 64, 64, 64, -64, 64, 64, -64, 64, 64, -64, -64, 64, 64, -64, 64, -64, -64, -64, -64, -64, 64, 64, 64, -64, 64, -64, 64, 64, -64, -64, -64, 64, -64, 64, -64, -64, -64, -64, -64, -64, -64, -64, 64, -64, -64, -64, -64, -64, -64, -64, -64, 64, 64, -64, -64, -64, 64, -64, 64, 64, -64, -64, -64, -64, -64, -64, -64, -64, -64, -64, -64, -64, -64, 64, -64, -64, -64, -64, -64, -64, -64, 64, -64, -64, -64, -64, 64, 64, 64, 64, -64, -64, 64, -64, 64, 64, -64, -64, -64, -64, -64, -64, 64, 64, -64, 64, -64, -64, 64, -64, -64, -64, 64, -64, 64, -64, -64, 64, 64, 64, 64, 64, -64, -64, -64, -64, -64, -64, -64, -64, -64, -64, 64, -64, 64, -64, 64, 64, -64, -64, -64, 64, -64, -64, -64, 64, 64, 64, -64, 64, -64, 64, -64, -64, -64, -64, -64, -64, 64, 64, -64, 64, -64, -64, -64, -64, -64, -64, 64, 64, -64, -64, -64, -64, -64, -64, 64, -64, 64, -64, -64, -64, -64, -64, 64, 64, -64, -64, 64, -64, -64, -64, -64, -64, -64, -64, -64, -64, 64, -64, -64, -64, -64, 64, -64, -64, -64, -64, -64, -64, -64, 64, 64, 64, -64, -64, 64, -64, -64, -64, -64, -64, -64, 64, -64, -64, 64, -64, -64, -64, -64, -64, -64, -64, -64, -64, -64, 64, 64, 64, 64, -64, -64, -64, 64, 64, -64, -64, -64, -64, -64, 64, 64, -64, 64, 64, -64, 64, -64, -64, 64, -64, 64, -64, 64, 64, -64, -64, -64, 64, -64, -64, -64, -64, -64, -64, -64, -64, 64, 64, 64, 64, -64, -64, 64, 64, -64, 64, -64, -64, -64, -64, -64, -64, -64, 64, -64, -64, -64, -64, 64, -64, 64, -64, -64, -64, -64, -64, 64, -64, -64, -64, 64, 64, -64, 64, -64, -64, -64, -64, -64, 64, 64, -64, -64, -64, 64, -64, -64, -64, -64, -64, -64, -64, -64, 64, -64, 64, 64, 64, 64, -64, 64, -64, -64, -64, -64, 64, -64, 64, -64, -64, -64, 64, -64, -64, -64, -64, -64, -64, -64, -64, 64, 64, -64, 64, 64, 64, -64, -64, -64, -64, 64, 64, -64, -64, 64, 64, 64, -64, -64, 64, 64, 64, 64, -64, 64, -64, 64, 64, -64, 64, -64, -64, -64, -64, 64, -64, 64, -64, 64, -64, -64, 64, -64, 64, 64, 64, 64, -64, -64, 64, 64, 64, 64, 64, -64, 64, 64, 64, 64, -64, 64, -64, 64, 64, -64, -64, -64, 64, 64, -64, -64, -64, -64, 64, 64, 64, -64, 64, 64, 64, -64, 64, 64, -64, -64, 64, -64, 64, -64, 64, 64, 64, -64, -64, -64, -64, -64, -64, -64, -64, 64, -64, 64, -64, -64, -64, 64, -64, -64, -64, -64, -64, 64, -64, -64, -64, 64, 64, -64, -64, -64, -64, -64, -64, -64, -64, -64, -64, -64, -64, -64, -64, -64, -64, -64, 64, -64, -64, -64, -64, -64, -64, -64, -64, -64, -64, -64, 64, -64, -64, -64, -64, -64, -64, 64, -64, -64, -64, -64, -64, -64, -64, 64, -64, -64, 64, 64, -64, 64, -64, -64, -64, 64, 64, 64, -64, -64, -64, -64, -64, -64, -64, -64, -64, -64, -64, 64, -64, -64, 64, 64, -64, -64, 64, 64, 64, -64, 64, 64, 64, -64, -64, 64, -64, -64, -64, -64, -64, -64, 64, -64, -64, -64, -64, 64, 64, 64, -64, -64, -64, -64, 64, 64, 64, 64, 64, 64, -64, 64, -64, -64, -64, -64, -64, 64, 64, 64, 64, 64, -64, 64, 64, 64, 64, 64, 64, 64, 64, 64, 64, 64, 64, 64, 64, 64, 64, -64, 64, -64, -64, -64, -64, -64, 64, -64, -64, -64, 64, 64, 64, -64, 64, 64, 64, 64, 64, 64, 64, 64, 64, 64, 64, -64, -64, 64, 64, 64, -64, -64, -64, 64, -64, 64, -64, 64, 64, 64, -64, -64, -64, 64, 64, 64, 64, 64, 64, 64, 64, 64, 64, 64, 64, 64, 64, -64, -64, 64, -64, 64, 64, 64, 64, 64, 64, -64, -64, -64, 64, -64, -64, -64, -64, 64, 64, 64, 64, 64, 64, 64, -64, 64, -64, -64, -64, 64, -64, 64, 64, 64, 64, 64, -64, -64, -64, -64, 64, 64, -64, -64, 64, 64, 64, 64, 64, 64, -64, -64, 64, 64, 64, -64, 64, -64, -64, 64, 64, -64, 64, -64, -64, 64, 64, 64, 64, -64, -64, -64, -64, 64, 64, 64, 64, -64, 64, -64, 64, 64, 64, 64, 64, 64, -64, 64, -64, 64, -64, -64, -64, -64, 64, -64, 64, 64, -64, -64, -64, -64, -64, -64, -64, -64, -64, -64, 64, -64, 64, -64, 64, -64, -64, -64, -64, -64, -64, -64, -64, 64, -64, 64, 64, 64, 64, -64, -64, -64, -64, -64, -64, -64, 64, -64, -64, 64, 64, -64, -64, -64, 64, 64, -64, -64, -64, -64, -64, -64, 64, -64, 64, -64, -64, -64, -64, -64, -64, -64, -64, -64, -64, 64, -64, -64, 64, -64, -64, -64, 64, -64, -64, -64, 64, -64, 64, 64, 64, 64, 64, -64, -64, -64, -64, -64, -64, -64, -64, 64, 64, 64, 64, 64, -64, -64, -64, 64, -64, -64, 64, 64, -64, -64, -64, 64, -64, 64, -64, -64, -64, -64, -64, -64, -64, -64, -64, -64, 64, -64, 64, -64, -64, -64, -64, -64, -64, -64, -64, -64, -64, 64, -64, -64, -64, -64, -64, -64, 64, -64, -64, -64, -64, -64, -64, -64, 64, -64, -64, 64, 64, -64, 64, -64, -64, -64, -64, -64, -64, -64, -64, -64, -64, 64, 64, -64, 64, -64, -64, -64, -64, -64, -64, 64, -64, -64, -64, 64, 64, -64, -64, 64, -64, -64, -64, -64, -64, -64, -64, -64, -64, -64, 64, -64, 64, -64, -64, -64, -64, -64, -64, -64, 64, 64, -64, -64, 64, -64, -64, 64, -64, 64, 64, -64, -64, -64, 64, -64, -64, -64, -64, 64, -64, -64, -64, -64, 64, 64, 64, 64, 64, -64, -64, 64, -64, -64, -64, -64, -64, -64, 64, -64, -64, 64, -64, 64, 64, -64, -64, 64, -64, 64, 64, 64, 64, -64, 64, 64, -64, -64, 64, 64, -64, -64, -64, 64, 64, 64, 64, 64, 64, 64, 64, 64, 64, 64, 64, 64, 64, 64, 64, 64, 64, 64, 64, 64, 64, 64, -64, 64, 64, 64, -64, 64, 64, 64, 64, 64, 64, 64, 64, 64, 64, 64, 64, 64, 64, 64, 64, 64, 64, -64, 64, 64, 64, 64, -64, 64, -64, -64, 64, -64, 64, -64, 64, 64, 64, 64, 64, 64, 64, 64, 64, 64, 64, 64, 64, 64, 64, 64, -64, -64, -64, 64, 64, 64, 64, 64, -64, -64, 64, 64, -64, 64, -64, 64, -64, -64, 64, 64, 64, 64, 64, 64, 64, 64, 64, -64, -64, -64, -64, 64, 64, 64, 64, 64, -64, -64, 64, 64, 64, 64, -64, -64, 64, 64, 64, -64, -64, 64, 64, 64, 64, -64, -64, 64, 64, -64, -64, 64, -64, -64, 64, -64, 64, 64, 64, 64, -64, 64, 64, 64, 64, 64, 64, 64, -64, -64, -64, 64, 64, -64, -64, 64, -64, 64, -64, 64, -64, 64, -64, -64, 64, -64, -64, -64, 64, -64, 64, -64, -64, -64, -64, -64, -64, 64, 64, 64, -64, 64, 64, 64, -64, -64, -64, -64, 64, 64, 64, -64, -64, 64, 64, 64, 64, 64, 64, 64, 64, 64, 64, -64, 64, -64, -64, 64, 64, 64, 64, 64, -64, -64, 64, -64, -64, -64, 64, -64, -64, -64, -64, 64, 64, 64, 64, 64, 64, 64, 64, 64, 64, 64, 64, 64, 64, 64, 64, 64, -64, 64, 64, -64, 64, -64, 64, -64, 64, 64, -64, -64, 64, 64, 64, 64, 64, 64, 64, -64, 64, 64, 64, 64, 64, 64, 64, 64, -64, -64, -64, 64, -64, 64, 64, 64, -64, -64, -64, 64, 64, 64, -64, -64, -64, 64, 64, 64, 64, 64, 64, 64, 64, 64, -64, -64, -64, -64, -64, -64, 64, -64, 64, -64, -64, -64, -64, 64, 64, -64, 64, 64, 64, -64, 64, 64, 64, 64, 64, 64, 64, 64, -64, -64, -64, 64, 64, -64, -64, 64, -64, -64, -64, -64, -64, 64, 64, -64, -64, -64, 64, -64, -64, -64, -64, -64, -64, -64, -64, -64, -64, -64, -64, -64, -64, -64, 64, -64, 64, -64, -64, -64, -64, -64, -64, -64, 64, 64, -64, -64, -64, -64, -64, -64, -64, -64, -64, -64, -64, -64, -64, -64, -64, -64, 64, 64, 64, 64, -64, -64, -64, -64, 64, 64, 64, 64, -64, 64, -64, -64, -64, -64, -64, 64, -64, -64, -64, -64, -64, -64, 64, -64, 64, -64, 64, -64, -64, -64, -64, -64, 64, 64, 64, -64, -64, -64, -64, -64, -64, -64, -64, -64, -64, -64, -64, -64, -64, -64, -64, 64, 64, 64, 64, -64, -64, -64, -64, 64, -64, 64, -64, -64, -64, -64, -64, -64, -64, -64, -64, 64, -64, -64, -64, -64, -64, -64, -64, -64, -64, -64, 64, -64, -64, -64, -64, -64, 64, 64, -64, -64, -64, -64, -64, -64, -64, -64, 64, -64, -64, -64, -64, -64, -64, 64, -64, -64, -64, -64, -64, -64, -64, -64, -64, -64, 64, -64, -64, -64, -64, 64, -64, -64, -64, -64, -64, -64, -64, -64, 64, 64, -64, -64, -64, -64, -64, 64, 64, -64, -64, -64, -64, -64, -64, 64, -64, -64, -64, -64, -64, -64, -64, -64, -64, 64, 64, 64, 64, -64, -64, -64, 64, 64, 64, 64, 64, 64, 64, 64, -64, -64, 64, -64, -64, 64, -64, -64, -64, -64, 64, -64, -64, 64, 64, 64, -64, -64, -64, -64, 64, 64, 64, 64, -64, 64, 64, 64, -64, -64, -64, -64, -64, -64, -64, -64, -64, -64, -64, -64, -64, 64, 64, 64, -64, -64, -64, -64, -64, 64, 64, 64, 64, 64, 64, 64, 64, -64, -64, -64, 64, 64, -64, -64, 64, 64, 64, 64, 64, 64, -64, 64, 64, -64, -64, 64, 64, -64, -64, -64, 64, 64, 64, 64, 64, 64, 64, 64, 64, 64, 64, 64, 64, 64, 64, 64, 64, 64, -64, 64, 64, -64, -64, 64, 64, 64, 64, -64, -64, 64, 64, 64, 64, 64, 64, 64, 64, 64, 64, 64, -64, 64, 64, 64, 64, 64, 64, 64, 64, 64, 64, 64, 64, 64, -64, -64, 64, 64, -64, 64, 64, 64, 64, 64, 64, 64, 64, 64, -64, -64, 64, 64, 64, 64, 64, 64, 64, 64, 64, 64, 64, -64, 64, -64, 64, -64, -64, -64, -64, 64, 64, 64, -64, 64, 64, 64, 64, -64, -64, 64, 64, 64, 64, 64, -64, -64, 64, 64, -64, 64, -64, -64, 64, 64, -64, -64, -64, -64, -64, -64, 64, -64, 64, -64, -64, -64, -64, -64, -64, 64, 64, -64, -64, -64, 64, 64, -64, 64, 64, -64, 64, -64, 64, 64, -64, -64, -64, -64, -64, -64, -64, -64, -64, -64, -64, -64, -64, 64, 64, 64, 64, -64, 64, 64, 64, -64, 64, -64, -64, -64, 64, 64, 64, 64, -64, -64, -64, -64, -64, -64, -64, -64, -64, -64, -64, -64, 64, 64, 64, -64, 64, -64, 64, -64, -64, -64, -64, 64, 64, -64, -64, 64, 64, -64, -64, -64, -64, -64, -64, -64, 64, 64, -64, -64, -64, -64, 64, 64, -64, -64, 64, 64, -64, 64, 64, 64, 64, 64, -64, -64, 64, -64, 64, -64, -64, -64, 64, 64, -64, -64, 64, -64, -64, -64, 64, 64, -64, -64, -64, -64, 64, -64, 64, 64, 64, -64, 64, 64, -64, -64, -64, -64, 64, -64, -64, -64, -64, -64, -64, 64, -64, 64, -64, -64, 64, -64, -64, -64, 64, -64, 64, 64, -64, 64, -64, -64, -64, 64, -64, -64, 64, 64, -64, -64, -64, -64, -64, -64, 64, 64, 64, -64, -64, -64, -64, -64, -64, 64, -64, -64, 64, 64, -64, 64, -64, -64, -64, -64, -64, -64, -64, -64, -64, -64, -64, -64, 64, 64, -64, -64, 64, 64, 64, 64, -64, -64, -64, -64, 64, -64, -64, -64, -64, -64, -64, -64, 64, -64, -64, -64, -64, -64, -64, -64, -64, -64, 64, -64, -64, 64, 64, 64, -64, -64, -64, -64, 64, -64, 64, -64, -64, -64, -64, -64, -64, -64, -64, -64, -64, -64, 64, 64, 64, 64, 64, 64, 64, 64, 64, -64, -64, 64, 64, -64, 64, 64, 64, 64, 64, 64, 64, -64, -64, -64, -64, -64, -64, -64, 64, 64, 64, 64, 64, 64, 64, -64, -64, -64, -64, -64, -64, -64, 64, -64, 64, -64, 64, 64, -64, 64, 64, 64, 64, 64, 64, 64, 64, 64, 64, 64, 64, 64, 64, -64, 64, -64, -64, 64, 64, 64, 64, -64, 64, 64, 64, 64, 64, 64, 64, 64, 64, 64, 64, 64, 64, 64, 64, 64, 64, 64, 64, 64, 64, -64, 64, 64, -64, 64, 64, -64, 64, 64, 64, 64, 64, 64, 64, -64, -64, 64, -64, 64, 64, 64, 64, 64, 64, 64, 64, 64, 64, 64, 64, -64, 64, -64, -64, 64, 64, 64, 64, -64, 64, -64, -64, -64, -64, -64, 64, 64, 64, 64, 64, 64, 64, 64, 64, 64, 64, -64, 64, -64, 64, -64, -64, -64, -64, -64, -64, -64, -64, -64, -64, -64, 64, 64, 64, 64, 64, 64, 64, -64, -64, 64, 64, 64, -64, -64, 64, -64, -64, 64, 64, 64, -64, -64, -64, 64, 64, -64, 64, -64, 64, 64, 64, 64, 64, 64, 64, -64, -64, 64, 64, 64, -64, -64, -64, -64, 64, 64, 64, 64, 64, -64, -64, -64, -64, -64, 64, 64, -64, 64, 64, 64, -64, -64, -64, -64, -64, -64, -64, -64, -64, -64, -64, -64, -64, 64, 64, 64, 64, 64, -64, -64, 64, 64, 64, 64, 64, -64, 64, -64, -64, -64, -64, -64, -64, -64, -64, -64, 64, -64, -64, -64, -64, -64, 64, 64, -64, -64, -64, -64, 64, 64, 64, 64, 64, 64, -64, 64, 64, -64, 64, -64, -64, -64, -64, -64, 64, -64, -64, 64, -64, -64, 64, -64, -64, -64, -64, -64, 64, 64, 64, 64, 64, 64, 64, 64, -64, 64, -64, 64, -64, -64, -64, -64, -64, 64, -64, -64, 64, -64, -64, 64, -64, -64, -64, -64, 64, 64, 64, 64, -64, 64, 64, 64, 64, -64, -64, 64, -64, -64, -64, -64, -64, 64, -64, -64, 64, 64, 64, -64, -64, -64, -64, -64, -64, 64, 64, 64, 64, -64, 64, 64, 64, -64, -64, 64, 64, -64, -64, -64, -64, -64, 64, -64, 64, 64, 64, 64, -64, -64, -64, -64, -64, -64, 64, 64, 64, 64, 64, 64, 64, -64, -64, -64, -64, -64, -64, -64, 64, 64, -64, 64, 64, 64, 64, 64, 64, 64, 64, -64, -64, 64, 64, 64, 64, -64, 64, 64, 64, -64, -64, -64, 64, 64, 64, 64, 64, -64, -64, 64, 64, 64, 64, 64, 64, 64, 64, 64, 64, 64, 64, 64, -64, 64, 64, 64, -64, -64, 64, 64, 64, 64, -64, -64, -64, 64, -64, 64, -64, 64, -64, 64, 64, 64, 64, 64, 64, 64, 64, -64, -64, -64, -64, 64, -64, -64, 64, 64, 64, 64, 64, 64, 64, 64, -64, 64, -64, 64, 64, 64, 64, 64, 64, 64, 64, 64, 64, -64, -64, 64, -64, -64, -64, -64, 64, 64, 64, 64, 64, -64, -64, 64, 64, -64, 64, 64, 64, -64, 64, 64, 64, 64, 64, 64, 64, -64, -64, 64, 64, -64, 64, 64, 64, 64, 64, 64, -64, -64, 64, -64, 64, -64, 64, -64, 64, 64, -64, 64, 64, 64, 64, 64, 64, -64, 64, 64, 64, 64, -64, 64, 64, 64, 64, 64, -64, -64, -64, -64, -64, -64, -64, -64, -64, 64, 64, -64, 64, -64, 64, 64, 64, -64, -64, 64, 64, 64, -64, -64, 64, -64, 64, 64, -64, -64, -64, 64, -64, -64, -64, -64, -64, -64, 64, 64, -64, -64, -64, -64, -64, -64, -64, -64, -64, -64, -64, -64, -64, 64, 64, 64, -64, -64, 64, 64, 64, 64, 64, 64, -64, -64, 64, 64, 64, 64, -64, -64, -64, -64, -64, -64, 64, 64, -64, -64, -64, -64, 64, 64, -64, -64, -64, -64, 64, 64, 64, 64, 64, -64, 64, 64, -64, -64, 64, 64, -64, 64, 64, -64, 64, -64, -64, -64, -64, 64, -64, 64, -64, 64, -64, 64, 64, 64, -64, -64, 64, -64, -64, -64, -64, 64, 64, -64, -64, 64, 64, 64, 64, -64, -64, -64, 64, -64, 64, -64, -64, -64, 64, 64, 64, -64, -64, -64, -64, -64, 64, 64, -64, 64, 64, 64, 64, 64, -64, 64, -64, -64, 64, -64, 64, 64, -64, 64, -64, -64, -64, -64, 64, -64, -64, -64, -64, 64, 64, 64, 64, -64, 64, -64, -64, -64, -64, -64, -64, 64, 64, 64, 64, 64, 64, 64, 64, 64, -64, -64, -64, -64, 64, -64, 64, 64, -64, 64, -64, -64, 64, 64, -64, -64, -64, -64, -64, 64, 64, 64, -64, 64, 64, 64, -64, 64, 64, -64, 64, 64, -64, 64, 64, -64, 64, 64, -64, -64, 64, 64, -64, -64, -64, -64, -64, 64, -64, -64, 64, 64, -64, -64, -64, -64, 64, -64, 64, 64, 64, -64, -64, 64, 64, 64, 64, -64, -64, 64, 64, -64, 64, -64, -64, 64, 64, -64, -64, -64, -64, -64, -64, -64, -64, -64, -64, -64, 64, -64, -64, 64, 64, -64, -64, -64, 64, -64, -64, -64, -64, 64, -64, 64, -64, -64, -64, -64, 64, 64, -64, 64, 64, 64, 64, 64, 64, -64, -64, -64, 64, 64, -64, -64, 64, 64, 64, -64, -64, 64, -64, 64, 64, -64, -64, -64, -64, -64, -64, 64, -64, -64, 64, -64, 64, 64, 64, -64, -64, -64, -64, 64, 64, -64, -64, -64, -64, 64, 64, 64, -64, -64, -64, -64, -64, -64, -64, -64, -64, -64, 64, -64, 64, 64, -64, 64, -64, -64, -64, -64, -64, -64, -64, -64, -64, 64, 64, 64, -64, -64, -64, -64, -64, -64, -64, 64, -64, 64, -64, 64, -64, 64, -64, -64, -64, -64, -64, 64, -64, -64, -64, -64, 64, 64, -64, -64, -64, -64, -64, -64, -64, 64, 64, -64, 64, -64, -64, -64, 64, -64, -64, 64, 64, -64, -64, 64, 64, 64, 64, -64, 64, 64, -64, -64, -64, -64, -64, -64, -64, -64, -64, -64, 64, -64, -64, -64, -64, 64, -64, -64, -64, -64, -64, -64, 64, 64, 64, -64, 64, 64, 64, 64, -64, -64, -64, 64, 64, 64, -64, 64, 64, 64, 64, -64, 64, 64, -64, -64, -64, -64, -64, 64, -64, 64, -64, 64, 64, 64, 64, 64, -64, -64, -64, 64, -64, 64, -64, -64, -64, -64, -64, 64, -64, -64, 64, 64, -64, 64, -64, -64, 64, -64, -64, -64, -64, 64, 64, 64, 64, 64, -64, -64, -64, 64, 64, -64, -64, -64, -64, 64, -64, 64, 64, -64, -64, -64, -64, -64, -64, -64, -64, -64, 64, -64, 64, 64, -64, -64, -64, 64, 64, 64, -64, -64, 64, -64, 64, 64, 64, -64, -64, -64, -64, -64, -64, -64, -64, -64, 64, -64, -64, 64, 64, -64, -64, -64, 64, -64, -64, -64, -64, -64, -64, -64, 64, -64, -64, 64, -64, -64, -64, -64, -64, -64, -64, -64, 64, 64, 64, -64, -64, -64, -64, -64, -64, 64, -64, -64, 64, 64, 64, -64, 64, -64, -64, -64, 64, -64, -64, -64, -64, -64, -64, -64, 64, -64, 64, -64, 64, -64, -64, -64, -64, -64, 64, 64, 64, 64, 64, 64, 64, -64, 64, 64, -64, -64, -64, -64, -64, -64, -64, -64, 64, 64, 64, 64, -64, -64, -64, -64, -64, -64, -64, 64, 64, 64, -64, 64, 64, 64, -64, -64, -64, -64, -64, -64, -64, -64, -64, -64, 64, 64, 64, -64, -64, -64, -64, -64, -64, -64, -64, 64, -64, -64, -64, -64, 64, -64, -64, -64, -64, -64, -64, -64, -64, -64, -64, 64, 64, 64, -64, -64, -64, -64, -64, -64, -64, -64, 64, -64, -64, -64, -64, 64, -64, 64, -64, 64, -64, 64, -64, -64, -64, 64, 64, -64, -64, -64, 64, -64, 64, -64, -64, -64, -64, -64, 64, -64, 64, -64, 64, -64, -64, 64, -64, -64, -64, -64, -64, -64, -64, 64, 64, 64, 64, -64, 64, -64, -64, -64, -64, -64, -64, -64, -64, -64, 64, -64, -64, 64, -64, -64, 64, -64, -64, -64, -64, -64, -64, -64, 64, 64, -64, -64, 64, -64, -64, 64, -64, -64, -64, -64, -64, -64, 64, 64, -64, -64, -64, -64, 64, 64, -64, -64, 64, 64, -64, -64, 64, -64, -64, -64, -64, 64, 64, 64, -64, -64, -64, 64, -64, 64, -64, 64, -64, 64, -64, -64, -64, -64, 64, -64, -64, 64, 64, 64, -64, 64, -64, -64, 64, 64, 64, 64, 64, 64, 64, -64, -64, -64, -64, 64, 64, 64, -64, -64, 64, 64, 64, 64, -64, -64, -64, 64, 64, -64, -64, -64, -64, -64, 64, -64, 64, -64, 64, -64, 64, 64, 64, 64, -64, 64, -64, 64, 64, -64, -64, -64, -64, 64, -64, 64, 64, 64, 64, -64, 64, -64, -64, -64, 64, 64, 64, 64, 64, 64, 64, -64, 64, -64, -64, -64, -64, 64, 64, -64, -64, 64, 64, 64, -64, -64, -64, -64, -64, -64, 64, -64, -64, 64, 64, 64, -64, -64, -64, 64, -64, -64, -64, 64, 64, 64, 64, 64, -64, -64, -64, -64, -64, -64, 64, 64, 64, 64, 64, 64, -64, -64, 64, -64, -64, -64, -64, 64, 64, -64, -64, 64, 64, -64, 64, 64, -64, -64, 64, 64, -64, 64, 64, 64, 64, 64, 64, 64, -64, -64, 64, 64, -64, 64, -64, -64, 64, -64, 64, -64, -64, -64, -64, 64, 64, 64, 64, 64, 64, 64, -64, 64, 64, 64, 64, -64, -64, 64, 64, 64, -64, -64, -64, -64, -64, -64, -64, -64, 64, 64, 64, 64, 64, 64, 64, 64, -64, 64, 64, 64, 64, 64, 64, -64, -64, 64, -64, -64, -64, 64, 64, -64, 64, -64, 64, -64, 64, 64, -64, 64, 64, 64, 64, 64, -64, 64, 64, 64, 64, 64, 64, -64, 64, 64, -64, -64, 64, 64, 64, -64, -64, 64, -64, 64, -64, 64, 64, 64, 64, 64, 64, 64, 64, 64, 64, 64, -64, 64, 64, -64, 64, -64, -64, -64, -64, -64, 64, 64, 64, -64, -64, 64, 64, 64, 64, 64, 64, 64, -64, 64, 64, 64, 64, 64, 64, 64, 64, 64, 64, 64, -64, -64, -64, 64, -64, 64, -64, 64, 64, -64, 64, 64, 64, 64, 64, 64, -64, 64, 64, 64, 64, 64, 64, 64, 64, 64, -64, 64, -64, -64, 64, 64, 64, -64, -64, 64, 64, 64, 64, -64, 64, 64, -64, 64, -64, 64, 64, 64, 64, -64, 64, 64, -64, -64, 64, 64, 64, 64, 64, 64, -64, -64, 64, 64, -64, 64, 64, -64, -64, -64, 64, 64, 64, -64, 64, 64, -64, -64, -64, 64, -64, 64, 64, -64, -64, -64, -64, -64, 64, -64, -64, 64, -64, 64, -64, -64, -64, -64, -64, 64, -64, 64, 64, 64, -64, -64, -64, 64, 64, 64, 64, -64, -64, -64, 64, 64, 64, -64, 64, 64, -64, -64, -64, -64, 64, 64, 64, 64, 64, 64, 64, 64, -64, 64, 64, 64, 64, 64, 64, 64, 64, 64, 64, 64, 64, 64, 64, -64, -64, -64, -64, -64, 64, 64, 64, 64, -64, 64, 64, -64, -64, 64, 64, 64, -64, 64, 64, -64, 64, 64, 64, 64, 64, 64, 64, 64, 64, -64, 64, 64, 64, 64, 64, -64, -64, -64, -64, -64, -64, -64, 64, 64, 64, 64, -64, 64, 64, 64, 64, 64, -64, -64, 64, -64, 64, 64, 64, 64, 64, 64, -64, -64, 64, -64, -64, -64, -64, 64, 64, 64, 64, 64, 64, 64, 64, 64, 64, 64, -64, -64, -64, 64, -64, 64, 64, 64, 64, -64, 64, -64, -64, -64, -64, -64, 64, 64, 64, 64, 64, -64, 64, -64, 64, 64, 64, -64, -64, -64, -64, 64, 64, 64, 64, 64, 64, 64, 64, -64, -64, -64, -64, -64, 64, 64, 64, 64, 64, -64, 64, 64, 64, -64, 64, -64, 64, -64, 64, -64, 64, -64, 64, -64, -64, 64, -64, -64, -64, -64, -64, 64, 64, 64, 64, 64, 64, 64, 64, 64, 64, 64, 64, -64, 64, -64, -64, -64, 64, 64, 64, 64, -64, 64, -64, -64, -64, -64, -64, -64, 64, 64, 64, 64, -64, 64, 64, 64, -64, 64, 64, 64, -64, -64, -64, -64, -64, 64, 64, -64, -64, 64, 64, -64, -64, -64, -64, -64, 64, 64, 64, 64, 64, 64, 64, 64, -64, 64, 64, 64, -64, 64, -64, 64, -64, -64, -64, 64, 64, 64, 64, -64, -64, -64, -64, 64, 64, -64, -64, -64, 64, 64, 64, 64, 64, 64, -64, -64, -64, -64, 64, 64, -64, -64, 64, -64, 64, 64, -64, 64, -64, -64, 64, 64, -64, -64, 64, -64, 64, 64, 64, -64, -64, 64, 64, -64, -64, 64, -64, 64, 64, 64, -64, 64, -64, 64, -64, -64, -64, -64, 64, 64, 64, -64, -64, 64, 64, 64, -64, 64, -64, 64, -64, -64, -64, -64, -64, 64, -64, 64, -64, 64, -64, 64, -64, -64, 64, 64, 64, 64, 64, 64, 64, -64, 64, 64, 64, -64, -64, -64, -64, -64, -64, -64, 64, 64, 64, 64, 64, 64, 64, 64, -64, -64, -64, 64, 64, -64, 64, -64, 64, 64, -64, -64, -64, 64, 64, -64, -64, 64, 64, 64, -64, 64, -64, 64, 64, -64, 64, -64, 64, -64, -64, 64, -64, -64, 64, -64, -64, 64, 64, -64, 64, 64, -64, -64, -64, -64, -64, -64, -64, 64, 64, -64, -64, 64, 64, -64, -64, 64, 64, 64, -64, 64, -64, -64, -64, -64, 64, -64, -64, 64, 64, -64, -64, 64, 64, 64, 64, 64, -64, 64, 64, -64, -64, -64, 64, 64, -64, 64, -64, -64, -64, -64, 64, -64, -64, 64, -64, 64, -64, -64, -64, -64, 64, -64, -64, 64, -64, 64, 64, 64, -64, -64, 64, 64, -64, -64, -64, 64, 64, 64, 64, 64, 64, -64, -64, 64, -64, -64, -64, -64, -64, 64, -64, 64, -64, -64, -64, 64, 64, 64, -64, -64, 64, -64, -64, 64, 64, -64, -64, -64, 64, -64, 64, 64, -64, -64, 64, -64, 64, -64, 64, -64, 64, -64, 64, 64, -64, 64, -64, -64, 64, -64, -64, 64, -64, 64, -64, 64, 64, 64, 64, 64, -64, -64, -64, 64, -64, -64, 64, 64, 64, -64, 64, 64, 64, -64, -64, 64, 64, -64, 64, -64, 64, -64, 64, 64, 64, 64, -64, -64, 64, 64, 64, -64, 64, -64, 64, 64, -64, -64, 64, 64, 64, 64, 64, 64, 64, 64, 64, 64, 64, 64, 64, -64, 64, 64, 64, -64, 64, -64, 64, -64, -64, 64, -64, -64, -64, 64, 64, -64, 64, 64, 64, 64, 64, 64, 64, 64, 64, 64, 64, -64, -64, -64, 64, 64, 64, 64, 64, -64, -64, -64, 64, 64, 64, -64, 64, 64, -64, 64, 64, 64, 64, -64, 64, 64, 64, 64, -64, 64, 64, 64, 64, 64, 64, 64, -64, 64, -64, -64, 64, 64, 64, -64, -64, -64, -64, 64, 64, 64, 64, 64, 64, -64, 64, 64, 64, 64, -64, 64, 64, 64, 64, 64, 64, -64, -64, -64, -64, -64, -64, -64, 64, -64, 64, -64, 64, 64, 64, 64, 64, 64, 64, 64, -64, 64, -64, 64, -64, 64, 64, 64, 64, -64, -64, -64, -64, 64, -64, -64, -64, 64, -64, -64, -64, 64, 64, -64, 64, 64, 64, 64, 64, -64, 64, 64, -64, 64, -64, 64, -64, -64, 64, -64, 64, -64, 64, -64, 64, -64, 64, -64, 64, 64, 64, 64, -64, -64, 64, 64, -64, 64, -64, 64, -64, -64, 64, 64, -64, 64, 64, -64, -64, -64, 64, -64, -64, 64, 64, 64, 64, 64, 64, 64, 64, 64, -64, 64, -64, 64, 64, 64, 64, -64, 64, 64, 64, 64, -64, 64, -64, -64, 64, -64, 64, -64, -64, 64, 64, 64, -64, 64, 64, -64, 64, -64, -64, -64, 64, 64, 64, 64, 64, 64, 64, 64, 64, 64, -64, 64, -64, 64, -64, 64, 64, -64, 64, 64, 64, -64, -64, -64, -64, 64, -64, 64, 64, 64, 64, 64, 64, 64, -64, 64, 64, -64, 64, 64, -64, 64, 64, -64, 64, 64, -64, 64, 64, 64, 64, 64, 64, -64, -64, 64, -64, -64, 64, 64, 64, 64, -64, 64, 64, -64, 64, 64, -64, 64, 64, -64, 64, -64, -64, -64, -64, -64, -64, 64, -64, 64, -64, 64, 64, 64, 64, 64, -64, 64, -64, 64, -64, 64, 64, -64, 64, 64, -64, -64, 64, -64, -64, -64, -64, -64, 64, 64, -64, -64, 64, -64, 64, -64, 64, 64, -64, -64, -64, -64, 64, -64, 64, -64, -64, -64, 64, 64, 64, 64, 64, -64, 64, -64, 64, -64, 64, -64, 64, 64, -64, 64, 64, 64, -64, -64, -64, -64, -64, -64, 64, -64, 64, 64, -64, -64, 64, -64, -64, 64, 64, 64, -64, 64, 64, 64, 64, 64, 64, 64, 64, -64, -64, 64, 64, -64, -64, -64, -64, -64, 64, -64, 64, 64, -64, 64, 64, 64, 64, 64, -64, 64, 64, 64, 64, -64, 64, 64, 64, 64, -64, 64, -64, -64, 64, -64, -64, -64, 64, 64, -64, 64, 64, 64, 64, 64, -64, 64, -64, 64, 64, 64, 64, 64, 64, -64, 64, -64, -64, 64, 64, -64, -64, 64, 64, 64, -64, -64, 64, 64, 64, 64, 64, 64, 64, 64, 64, 64, -64, 64, 64, 64, -64, -64, 64, -64, -64, -64, 64, 64, -64, 64, 64, -64, 64, -64, 64, 64, 64, -64, -64, 64, 64, 64, 64, 64, 64, 64, 64, -64, -64, 64, 64, -64, -64, 64, -64, -64, 64, 64, -64, 64, -64, -64, -64, 64, 64, -64, -64, -64, 64, 64, 64, 64, 64, -64, -64, 64, -64, 64, 64, -64, -64, 64, -64, -64, -64, 64, 64, -64, 64, 64, 64, -64, 64, -64, -64, -64, -64, 64, 64, -64, -64, -64, -64, 64, 64, 64, 64, 64, -64, -64, -64, 64, 64, 64, 64, 64, 64, -64, 64, 64, -64, 64, -64, 64, -64, -64, 64, -64, 64, 64, -64, -64, 64, 64, 64, 64, 64, 64, 64, -64, 64, 64, -64, 64, 64, 64, 64, -64, 64, -64, -64, 64, -64, -64, -64, 64, -64, 64, 64, -64, 64, -64, 64, -64, 64, 64, -64, 64, 64, -64, -64, -64, 64, 64, -64, 64, -64, 64, 64, 64, -64, 64, -64, -64, 64, 64, -64, -64, -64, 64, -64, 64, -64, 64, 64, -64, 64, 64, 64, -64, 64, -64, -64, -64, -64, -64, 64, 64, -64, -64, -64, -64, 64, 64, 64, 64, 64, -64, 64, 64, -64, -64, 64, -64, -64, -64, 64, -64, -64, -64, 64, 64, 64, -64, 64, 64, 64, -64, -64, 64, 64, 64, -64, -64, 64, 64, -64, -64, -64, -64, -64, -64, 64, 64, 64, -64, 64, -64, 64, 64, 64, -64, 64, 64, 64, 64, 64, 64, 64, 64, 64, 64, -64, 64, -64, -64, -64, -64, -64, -64, 64, -64, 64, -64, -64, -64, -64, -64, -64, -64, 64, 64, -64, 64, 64, 64, 64, 64, 64, 64, 64, -64, -64, -64, -64, -64, 64, -64, 64, 64, -64, 64, 64, 64, -64, 64, 64, 64, 64, 64, -64, -64, -64, -64, 64, 64, 64, 64, 64, 64, -64, -64, -64, -64, 64, -64, 64, -64, -64, 64, -64, -64, 64, 64, 64, -64, -64, 64, -64, -64, -64, 64, 64, 64, 64, 64, 64, 64, -64, -64, -64, -64, 64, -64, 64, 64, -64, -64, 64, 64, -64, -64, -64, -64, 64, -64, -64, -64, -64, -64, 64, 64, 64, 64, -64, 64, 64, 64, -64, -64, -64, -64, -64, -64, -64, -64, 64, 64, -64, -64, -64, -64, -64, -64, -64, -64, 64, 64, 64, 64, 64, 64, 64, 64, 64, -64, -64, -64, -64, -64, -64, -64, -64, -64, -64, -64, -64, 64, -64, -64, -64, -64, -64, -64, 64, 64, 64, 64, 64, 64, 64, 64, -64, -64, -64, -64, -64, -64, -64, 64, -64, -64, 64, 64, 64, 64, -64, -64, -64, -64, 64, 64, -64, 64, 64, 64, 64, 64, -64, 64, 64, -64, -64, -64, -64, -64, -64, -64, -64, 64, -64, -64, 64, -64, -64, -64, -64, -64, 64, -64, 64, -64, 64, 64, 64, 64, 64, 64, 64, -64, -64, -64, -64, -64, -64, -64, 64, 64, 64, 64, -64, 64, -64, -64, -64, -64, 64, 64, 64, 64, 64, 64, 64, 64, 64, 64, 64, 64, -64, -64, -64, -64, -64, -64, 64, 64, -64, -64, -64, 64, -64, -64, -64, -64, -64, 64, 64, -64, 64, 64, 64, 64, 64, 64, -64, -64, -64, -64, -64, -64, -64, -64, 64, 64, -64, 64, -64, -64, -64, -64, -64, -64, -64, 64, -64, 64, 64, 64, 64, 64, 64, 64, 64, -64, -64, -64, -64, -64, -64, -64, -64, -64, -64, 64, 64, -64, -64, -64, -64, -64, 64, 64, 64, 64, 64, 64, 64, 64, 64, 64, -64, -64, -64, -64, 64, -64, -64, -64, 64, 64, 64, -64, 64, -64, -64, -64, -64, -64, 64, 64, 64, -64, 64, 64, 64, 64, 64, 64, -64, -64, -64, -64, 64, 64, -64, -64, 64, 64, 64, 64, 64, 64, -64, -64, -64, -64, 64, 64, 64, 64, 64, 64, 64, 64, 64, 64, -64, -64, -64, -64, 64, 64, -64, 64, -64, -64, 64, -64, -64, 64, 64, -64, -64, -64, 64, 64, -64, 64, 64, 64, 64, 64, 64, -64, -64, -64, -64, -64, 64, 64, 64, 64, 64, -64, -64, -64, -64, 64, 64, -64, -64, -64, -64, 64, 64, 64, 64, -64, 64, -64, 64, -64, -64, -64, -64, -64, 64, 64, 64, 64, -64, -64, 64, 64, -64, 64, -64, 64, -64, -64, -64, -64, -64, -64, -64, -64, -64, 64, 64, 64, 64, 64, -64, -64, -64, 64, 64, 64, 64, 64, -64, -64, 64, 64, 64, 64, 64, 64, 64, -64, 64, 64, 64, -64, 64, 64, 64, 64, -64, -64, -64, -64, 64, 64, 64, 64, 64, 64, 64, 64, 64, -64, 64, -64, 64, -64, 64, 64, -64, -64, 64, 64, 64, 64, 64, 64, -64, -64, -64, -64, 64, 64, 64, -64, 64, -64, 64, -64, 64, -64, 64, 64, -64, -64, -64, 64, 64, -64, 64, -64, 64, 64, 64, -64, -64, -64, -64, -64, 64, 64, 64, 64, -64, 64, 64, 64, -64, -64, 64, 64, -64, -64, -64, -64, 64, 64, 64, -64, -64, -64, 64, 64, 64, -64, -64, -64, -64, -64, -64, -64, -64, 64, 64, -64, 64, 64, 64, 64, 64, 64, 64, 64, 64, -64, 64, -64, 64, 64, 64, 64, 64, 64, 64, -64, 64, -64, -64, 64, -64, -64, -64, -64, 64, -64, -64, 64, 64, 64, 64, 64, -64, 64, 64, 64, -64, 64, 64, 64, 64, -64, 64, -64, 64, -64, 64, -64, 64, -64, 64, -64, 64, -64, 64, 64, -64, 64, -64, -64, 64, -64, 64, 64, 64, 64, 64, -64, -64, 64, 64, 64, -64, -64, 64, 64, -64, -64, 64, 64, -64, 64, 64, 64, 64, -64, -64, 64, 64, -64, 64, 64, -64, -64, -64, 64, 64, 64, -64, -64, -64, -64, 64, -64, 64, 64, 64, -64, 64, -64, -64, -64, 64, -64, -64, -64, 64, -64, 64, 64, -64, -64, 64, 64, 64, 64, 64, -64, 64, 64, 64, 64, 64, 64, -64, 64, 64, -64, -64, 64, -64, -64, 64, 64, 64, 64, -64, 64, 64, -64, 64, -64, 64, 64, -64, 64, 64, 64, 64, -64, 64, -64, -64, 64, 64, 64, -64, -64, -64, -64, 64, 64, 64, -64, 64, 64, 64, 64, 64, 64, -64, -64, 64, -64, -64, -64, 64, -64, -64, 64, -64, 64, -64, 64, -64, 64, -64, -64, 64, 64, -64, 64, 64, 64, -64, 64, -64, 64, -64, 64, -64, -64, -64, 64, 64, -64, 64, -64, 64, -64, 64, 64, -64, -64, 64, -64, 64, 64, 64, 64, 64, 64, 64, 64, 64, -64, 64, 64, -64, -64, 64, 64, 64, 64, -64, -64, 64, 64, 64, 64, 64, 64, -64, -64, -64, 64, -64, -64, 64, 64, 64, 64, 64, -64, 64, 64, 64, 64, 64, -64, 64, -64, 64, -64, -64, -64, 64, -64, 64, -64, 64, 64, -64, 64, 64, -64, 64, 64, -64, 64, 64, 64, -64, -64, -64, 64, 64, 64, 64, -64, 64, 64, 64, -64, 64, -64, 64, 64, 64, 64, -64, -64, 64, -64, 64, 64, 64, 64, 64, 64, -64, -64, 64, 64, 64, 64, -64, 64, -64, -64, -64, 64, 64, -64, 64, 64, 64, 64, -64, 64, -64, -64, 64, 64, 64, 64, -64, 64, -64, 64, -64, 64, -64, 64, 64, -64, -64, -64, 64, 64, -64, 64, -64, 64, 64, 64, 64, 64, 64, -64, 64, -64, -64, 64, 64, 64, 64, 64, 64, -64, 64, 64, -64, 64, 64, -64, 64, 64, 64, 64, 64, 64, 64, -64, 64, 64, -64, -64, 64, -64, 64, 64, -64, -64, 64, 64, -64, 64, -64, 64, -64, -64, -64, 64, -64, -64, 64, 64, 64, 64, -64, 64, 64, -64, -64, 64, 64, -64, 64, 64, 64, 64, -64, 64, 64, -64, 64, 64, -64, -64, -64, -64, 64, -64, -64, 64, -64, 64, 64, -64, -64, 64, 64, 64, -64, 64, 64, 64, 64, -64, 64, 64, 64, 64, -64, 64, -64, 64, 64, 64, 64, -64, 64, -64, 64, -64, 64, -64, 64, 64, 64, 64, 64, 64, -64, 64, 64, 64, -64, -64, 64, 64, 64, 64, -64, 64, -64, -64, -64, 64, -64, -64, 64, -64, 64, 64, -64, 64, -64, -64, -64, -64, 64, 64, 64, -64, -64, 64, 64, 64, 64, 64, 64, -64, 64, -64, 64, 64, -64, -64, 64, 64, -64, -64, 64, 64, -64, -64, 64, 64, 64, -64, 64, -64, 64, 64, 64, -64, -64, -64, 64, 64, -64, 64, -64, -64, 64, 64, -64, -64, 64, 64, 64, -64, 64, -64, -64, 64, 64, 64, -64, -64, 64, 64, 64, -64, 64, -64, 64, 64, 64, -64, 64, -64, -64, -64, 64, 64, 64, 64, 64, 64, 64, 64, 64, -64, 64, 64, 64, 64, 64, 64, 64, 64, 64, -64, -64, 64, 64, 64, -64, -64, 64, 64, -64, 64, 64, 64, 64, 64, 64, -64, 64, 64, 64, -64, 64, 64, 64, -64, -64, 64, -64, 64, 64, 64, -64, 64, -64, 64, 64, -64, 64, 64, 64, 64, 64, 64, -64, 64, 64, 64, 64, 64, -64, 64, 64, 64, 64, -64, 64, -64, 64, -64, -64, -64, 64, 64, 64, -64, -64, 64, 64, -64, 64, 64, 64, 64, 64, 64, 64, -64, 64, -64, -64, -64, -64, 64, -64, -64, -64, 64, -64, -64, 64, -64, -64, 64, 64, 64, 64, 64, 64, 64, -64, -64, 64, -64, -64, 64, 64, -64, -64, -64, 64, 64, 64, 64, -64, 64, -64, -64, 64, -64, -64, -64, 64, 64, 64, 64, 64, 64, 64, 64, 64, 64, -64, -64, -64, -64, -64, -64, 64, -64, 64, -64, -64, -64, -64, 64, -64, 64, -64, -64, -64, 64, -64, 64, 64, 64, -64, 64, 64, -64, 64, 64, 64, 64, -64, 64, 64, -64, 64, 64, 64, 64, 64, 64, -64, 64, -64, -64, -64, 64, 64, 64, -64, -64, 64, 64, 64, 64, 64, 64, 64, 64, 64, -64, 64, 64, 64, -64, 64, 64, -64, 64, -64, 64, 64, 64, 64, 64, -64, -64, -64, -64, 64, -64, -64, -64, 64, -64, 64, -64, -64, -64, 64, 64, 64, -64, -64, -64, -64, 64, -64, -64, -64, -64, 64, 64, -64, 64, 64, 64, 64, 64, -64, 64, 64, -64, 64, -64, -64, 64, 64, -64, -64, 64, -64, -64, 64, -64, 64, -64, -64, 64, -64, 64, 64, 64, 64, -64, 64, 64, 64, 64, 64, 64, 64, 64, 64, 64, -64, 64, 64, -64, -64, -64, 64, 64, -64, -64, 64, -64, -64, 64, 64, -64, -64, 64, 64, 64, 64, -64, -64, -64, 64, -64, 64, -64, 64, 64, -64, 64, 64, -64, 64, 64, 64, 64, 64, 64, 64, -64, -64, -64, 64, 64, -64, -64, -64, 64, 64, 64, 64, 64, 64, 64, 64, 64, 64, -64, -64, 64, 64, -64, -64, 64, -64, -64, 64, -64, -64, -64, -64, -64, 64, -64, -64, 64, 64, 64, 64, 64, 64, 64, 64, 64, 64, 64, 64, -64, 64, 64, -64, -64, 64, -64, -64, -64, -64, 64, -64, 64, 64, 64, 64, 64, 64, 64, 64, 64, 64, 64, 64, 64, 64, 64, 64, 64, 64, 64, -64, 64, 64, -64, -64, -64, 64, 64, -64, 64, 64, -64, -64, -64, -64, 64, 64, 64, 64, 64, 64, 64, 64, 64, -64, 64, -64, 64, -64, 64, -64, -64, -64, 64, 64, 64, -64, 64, -64, -64, -64, -64, -64, -64, 64, 64, 64, 64, 64, 64, 64, 64, 64, -64, -64, -64, -64, 64, 64, -64, -64, -64, 64, 64, 64, -64, -64, 64, -64, -64, -64, -64, 64, 64, 64, 64, -64, 64, 64, 64, 64, 64, 64, -64, -64, 64, 64, 64, -64, 64, 64, -64, 64, 64, -64, 64, -64, 64, -64, 64, 64, 64, 64, 64, 64, 64, 64, 64, 64, 64, 64, -64, -64, 64, -64, -64, 64, 64, -64, -64, -64, -64, -64, 64, 64, 64, -64, -64, -64, -64, 64, -64, 64, 64, 64, 64, 64, 64, -64, -64, -64, -64, 64, -64, -64, 64, -64, -64, -64, -64, 64, 64, 64, -64, 64, -64, -64, -64, -64, 64, -64, 64, 64, 64, -64, -64, -64, 64, 64, -64, -64, 64, -64, -64, -64, -64, -64, -64, 64, 64, 64, 64, 64, -64, 64, -64, -64, -64, 64, 64, 64, 64, 64, -64, 64, -64, -64, 64, -64, -64, -64, 64, -64, -64, -64, -64, -64, 64, 64, 64, 64, 64, 64, -64, -64, 64, 64, 64, 64, -64, -64, -64, -64, -64, 64, 64, 64, 64, 64, 64, -64, 64, 64, 64, 64, 64, 64, 64, 64, 64, -64, -64, -64, 64, 64, 64, 64, 64, 64, -64, -64, 64, -64, 64, 64, 64, 64, 64, 64, 64, -64, -64, 64, 64, 64, 64, 64, 64, 64, -64, -64, 64, 64, -64, 64, 64, 64, -64, -64, -64, -64, -64, 64, -64, 64, 64, -64, -64, 64, -64, 64, 64, -64, -64, 64, 64, 64, -64, -64, -64, -64, 64, 64, 64, 64, -64, 64, -64, 64, 64, -64, -64, 64, 64, 64, 64, 64, -64, 64, 64, -64, 64, 64, 64, 64, -64, -64, 64, 64, 64, 64, 64, 64, 64, -64, -64, 64, -64, -64, -64, 64, 64, 64, -64, -64, 64, 64, 64, 64, 64, 64, 64, 64, -64, -64, 64, 64, 64, 64, 64, 64, -64, -64, -64, -64, 64, -64, 64, 64, 64, 64, 64, 64, 64, 64, 64, 64, 64, 64, 64, 64, -64, 64, -64, -64, 64, 64, 64, -64, -64, -64, -64, 64, -64, 64, 64, 64, 64, 64, 64, 64, 64, -64, 64, 64, 64, -64, 64, -64, -64, -64, 64, -64, -64, 64, 64, -64, 64, 64, 64, 64, 64, 64, 64, -64, -64, 64, 64, 64, 64, 64, 64, 64, 64, 64, 64, -64, 64, 64, -64, -64, 64, 64, -64, -64, 64, 64, 64, -64, 64, 64, -64, 64, 64, 64, 64, 64, 64, 64, 64, 64, 64, -64, -64, -64, 64, 64, 64, -64, 64, 64, 64, 64, -64, 64, 64, 64, -64, -64, -64, 64, -64, 64, 64, 64, 64, 64, 64, -64, 64, -64, 64, 64, -64, 64, 64, -64, -64, 64, 64, 64, 64, -64, 64, 64, 64, 64, 64, -64, 64, 64, 64, 64, 64, 64, 64, 64, 64, -64, -64, -64, -64, 64, -64, -64, -64, -64, 64, -64, -64, -64, -64, 64, -64, 64, -64, -64, -64, -64, -64, -64, -64, 64, 64, 64, 64, -64, -64, -64, -64, -64, -64, -64, -64, 64, 64, 64, -64, -64, 64, 64, 64, -64, -64, -64, 64, -64, -64, 64, -64, 64, 64, 64, 64, 64, -64, -64, -64, -64, -64, -64, -64, -64, -64, -64, -64, 64, -64, 64, 64, 64, -64, -64, -64, 64, 64, -64, 64, 64, -64, 64, -64, 64, -64, -64, -64, -64, 64, -64, -64, -64, 64, -64, 64, -64, 64, 64, -64, -64, 64, -64, 64, 64, 64, -64, 64, 64, -64, 64, -64, -64, 64, -64, -64, -64, 64, 64, -64, 64, -64, -64, -64, 64, 64, -64, -64, 64, 64, -64, -64, 64, 64, -64, -64, 64, 64, -64, -64, 64, 64, 64, 64, -64, 64, -64, -64, 64, 64, -64, 64, 64, 64, 64, 64, 64, 64, -64, 64, -64, 64, -64, -64, 64, 64, -64, -64, -64, -64, -64, 64, 64, -64, -64, -64, -64, -64, -64, -64, 64, 64, 64, 64, -64, -64, -64, -64, 64, -64, 64, 64, 64, 64, -64, -64, -64, -64, 64, 64, 64, -64, 64, -64, -64, 64, -64, -64, -64, -64, -64, -64, 64, -64, -64, 64, -64, -64, -64, 64, -64, 64, -64, -64, -64, -64, -64, 64, 64, 64, -64, -64, -64, -64, 64, 64, -64, 64, -64, -64, -64, -64, 64, -64, -64, 64, -64, 64, 64, 64, 64, 64, 64, 64, -64, -64, 64, -64, 64, 64, -64, -64, 64, 64, -64, -64, 64, 64, 64, -64, -64, -64, 64, -64, -64, -64, -64, 64, 64, 64, 64, 64, 64, 64, 64, 64, -64, 64, -64, -64, 64, -64, 64, 64, 64, 64, -64, -64, 64, -64, -64, -64, 64, -64, -64, 64, 64, 64, 64, 64, 64, 64, 64, -64, -64, -64, -64, -64, -64, -64, -64, -64, 64, -64, -64, 64, 64, -64, -64, 64, 64, -64, -64, 64, 64, 64, 64, 64, 64, 64, 64, -64, -64, -64, -64, -64, -64, -64, 64, 64, -64, 64, -64, 64, 64, 64, 64, -64, -64, 64, -64, -64, -64, -64, -64, 64, 64, -64, 64, 64, -64, -64, -64, -64, -64, -64, 64, -64, -64, -64, -64, 64, 64, 64, -64, -64, -64, -64, -64, -64, -64, -64, 64, -64, -64, 64, -64, -64, -64, -64, -64, -64, -64, 64, 64, 64, 64, -64, 64, -64, 64, 64, -64, -64, -64, -64, -64, -64, -64, -64, -64, -64, 64, -64, -64, 64, -64, -64, -64, -64, -64, 64, 64, 64, 64, -64, -64, 64, 64, 64, 64, 64, -64, -64, -64, -64, -64, -64, 64, -64, -64, -64, 64, 64, 64, 64, -64, 64, 64, -64, 64, -64, -64, 64, -64, 64, 64, 64, -64, 64, -64, -64, -64, -64, -64, 64, 64, 64, -64, 64, -64, -64, 64, -64, 64, -64, -64, -64, -64, 64, -64, 64, 64, 64, -64, -64, 64, -64, -64, -64, -64, -64, -64, 64, 64, 64, 64, 64, 64, -64, -64, -64, -64, -64, -64, -64, 64, -64, 64, -64, 64, 64, -64, -64, -64, -64, -64, -64, -64, 64, 64, 64, 64, 64, -64, -64, -64, -64, -64, -64, -64, -64, -64, -64, 64, -64, -64, 64, -64, -64, 64, -64, -64, -64, -64, -64, 64, 64, 64, 64, 64, 64, -64, 64, -64, -64, -64, -64, 64, -64, -64, -64, 64, -64, -64, -64, -64, -64, -64, -64, -64, -64, -64, -64, -64, 64, 64, 64, 64, -64, -64, -64, -64, -64, 64, 64, 64, -64, -64, -64, 64, 64, 64, 64, -64, -64, -64, -64, -64, -64, -64, -64, -64, -64, -64, 64, -64, -64, -64, -64, -64, -64, 64, 64, 64, -64, -64, -64, 64, -64, -64, -64, 64, 64, 64, -64, -64, -64, -64, -64, -64, -64, 64, 64, 64, -64, -64, -64, -64, 64, 64, 64, 64, 64, -64, -64, 64, 64, -64, -64, -64, 64, 64, -64, -64, -64, -64, 64, 64, 64, 64, -64, -64, -64, -64, -64, 64, 64, 64, 64, 64, 64, 64, 64, 64, 64, -64, 64, 64, 64, 64, 64, 64, 64, -64, 64, -64, -64, 64, -64, 64, -64, 64, 64, 64, -64, 64, 64, -64, 64, 64, -64, -64, -64, -64, 64, 64, 64, 64, 64, 64, 64, 64, 64, -64, 64, 64, 64, -64, -64, 64, -64, 64, 64, -64, 64, -64, 64, 64, -64, 64, -64, -64, 64, 64, 64, 64, 64, 64, 64, -64, 64, -64, -64, 64, -64, 64, -64, 64, 64, 64, 64, 64, 64, 64, 64, 64, -64, 64, -64, 64, 64, 64, 64, 64, 64, 64, 64, 64, 64, 64, 64, 64, 64, 64, -64, -64, 64, 64, 64, 64, 64, -64, -64, 64, -64, 64, 64, -64, 64, -64, -64, -64, 64, 64, 64, 64, 64, 64, 64, 64, 64, -64, -64, 64, 64, 64, 64, 64, 64, 64, -64, 64, 64, 64, 64, -64, 64, -64, 64, -64, 64, 64, 64, 64, -64, -64, -64, 64, 64, 64, -64, -64, -64, 64, 64, 64, 64, -64, 64, -64, -64, 64, 64, -64, -64, -64, -64, -64, 64, -64, -64, -64, -64, -64, -64, -64, -64, -64, 64, -64, -64, -64, 64, -64, 64, 64, -64, 64, -64, 64, -64, -64, 64, 64, 64, -64, -64, 64, 64, -64, 64, -64, -64, 64, -64, -64, -64, -64, -64, 64, -64, 64, 64, 64, -64, 64, -64, 64, -64, 64, -64, -64, -64, -64, -64, 64, -64, -64, 64, 64, 64, -64, 64, 64, -64, -64, 64, -64, -64, 64, 64, 64, -64, 64, -64, 64, 64, -64, -64, 64, -64, 64, 64, -64, 64, -64, -64, -64, -64, -64, -64, -64, -64, -64, 64, -64, -64, -64, 64, -64, -64, -64, 64, 64, -64, -64, 64, 64, 64, 64, -64, 64, -64, -64, 64, -64, -64, -64, 64, -64, -64, -64, 64, 64, 64, -64, 64, -64, -64, -64, -64, 64, 64, -64, -64, -64, -64, 64, -64, 64, -64, -64, -64, 64, -64, -64, -64, 64, 64, 64, 64, 64, 64, -64, -64, -64, -64, -64, -64, 64, -64, -64, 64, -64, -64, -64, -64, 64, 64, -64, 64, -64, 64, -64, -64, 64, 64, 64, -64, -64, -64, -64, -64, 64, 64, -64, 64, 64, -64, 64, 64, -64, 64, -64, 64, 64, 64, 64, 64, 64, 64, 64, 64, 64, 64, 64, 64, 64, 64, 64, -64, 64, 64, -64, -64, -64, 64, 64, -64, -64, -64, -64, 64, -64, 64, 64, 64, 64, 64, 64, 64, 64, 64, 64, 64, 64, 64, 64, 64, 64, 64, 64, -64, -64, 64, 64, -64, 64, -64, -64, 64, 64, 64, 64, 64, 64, 64, 64, 64, 64, 64, 64, 64, 64, 64, 64, -64, 64, -64, 64, 64, -64, -64, 64, -64, 64, 64, -64, -64, 64, 64, 64, -64, -64, 64, 64, -64, 64, 64, 64, 64, 64, 64, -64, -64, -64, -64, -64, -64, -64, 64, -64, -64, 64, 64, -64, -64, -64, 64, 64, 64, 64, 64, -64, 64, 64, 64, 64, 64, 64, 64, 64, -64, -64, -64, -64, -64, -64, -64, -64, -64, 64, 64, -64, 64, -64, 64, 64, 64, 64, 64, -64, 64, 64, -64, 64, 64, 64, 64, 64, -64, -64, -64, -64, -64, -64, -64, -64, 64, 64, 64, 64, 64, -64, 64, 64, 64, 64, -64, 64, -64, 64, 64, -64, 64, 64, 64, 64, -64, 64, -64, -64, -64, -64, -64, -64, 64, 64, 64, 64, 64, 64, 64, 64, 64, 64, 64, -64, -64, -64, -64, -64, -64, 64, 64, 64, 64, -64, -64, -64, -64, 64, -64, 64, -64, -64, -64, 64, 64, 64, 64, 64, 64, 64, -64, 64, -64, -64, -64, -64, -64, 64, 64, 64, 64, 64, 64, 64, -64, -64, -64, -64, -64, -64, 64, 64, 64, -64, 64, 64, -64, -64, -64, -64, -64, -64, -64, -64, 64, 64, 64, 64, 64, 64, 64, -64, -64, -64, -64, 64, 64, -64, 64, 64, 64, 64, 64, 64, -64, -64, 64, -64, -64, -64, 64, -64, -64, 64, 64, 64, -64, 64, 64, -64, -64, -64, -64, -64, -64, -64, 64, 64, 64, -64, 64, 64, -64, -64, -64, -64, -64, -64, 64, 64, 64, 64, 64, -64, -64, 64, -64, -64, -64, -64, -64, -64, 64, -64, -64, 64, 64, -64, -64, -64, -64, -64, -64, -64, -64, 64, -64, -64, 64, 64, -64, 64, 64, -64, -64, -64, -64, 64, -64, -64, -64, -64, -64, 64, 64, -64, -64, -64, -64, -64, -64, -64, -64, 64, 64, 64, 64, -64, -64, -64, 64, -64, -64, -64, -64, -64, 64, -64, -64, 64, -64, 64, 64, 64, -64, -64, 64, 64, -64, -64, 64, 64, 64, 64, -64, 64, -64, 64, 64, 64, -64, 64, -64, -64, -64, 64, 64, 64, 64, 64, 64, 64, 64, 64, 64, 64, 64, 64, 64, 64, 64, 64, -64, -64, 64, 64, 64, -64, -64, -64, 64, -64, -64, 64, 64, 64, -64, 64, 64, 64, 64, 64, 64, 64, 64, 64, -64, 64, 64, 64, 64, -64, 64, 64, -64, 64, -64, 64, -64, -64, 64, -64, 64, 64, -64, 64, 64, -64, 64, 64, 64, 64, 64, 64, 64, 64, 64, 64, 64, 64, 64, 64, 64, -64, 64, -64, 64, 64, -64, -64, 64, -64, 64, 64, 64, 64, 64, 64, -64, 64, -64, 64, -64, 64, 64, 64, 64, 64, 64, 64, -64, 64, -64, -64, -64, -64, -64, -64, 64, -64, -64, 64, 64, 64, 64, 64, 64, 64, 64, 64, 64, 64, 64, 64, 64, 64, 64, 64, 64, 64, 64, -64, -64, -64, 64, -64, -64, -64, -64, -64, -64, 64, 64, 64, -64, -64, -64, 64, 64, 64, 64, 64, 64, 64, -64, 64, 64, 64, -64, 64, -64, -64, 64, 64, -64, -64, 64, 64, -64, 64, 64, -64, 64, -64, 64, -64, 64, 64, 64, -64, 64, 64, 64, -64, -64, 64, -64, -64, 64, 64, 64, -64, -64, 64, -64, -64, 64, 64, 64, 64, 64, -64, -64, -64, 64, -64, 64, 64, 64, -64, -64, 64, 64, -64, -64, -64, 64, 64, -64, 64, -64, -64, 64, 64, -64, 64, 64, -64, 64, 64, -64, 64, -64, 64, -64, 64, -64, -64, -64, 64, -64, 64, 64, -64, -64, -64, 64, -64, 64, -64, -64, 64, -64, 64, 64, 64, -64, -64, -64, -64, -64, -64, -64, 64, 64, 64, 64, 64, 64, 64, -64, -64, 64, -64, 64, -64, 64, 64, 64, -64, -64, 64, -64, -64, -64, -64, -64, -64, -64, -64, -64, -64, -64, -64, 64, 64, 64, 64, -64, 64, -64, 64, 64, 64, -64, 64, -64, 64, -64, -64, -64, -64, -64, -64, -64, -64, -64, -64, -64, -64, -64, -64, -64, -64, 64, -64, -64, -64, -64, 64, 64, -64, 64, 64, 64, -64, -64, -64, -64, -64, -64, -64, -64, -64, 64, 64, 64, -64, -64, 64, -64, 64, 64, 64, -64, -64, -64, -64, 64, -64, -64, -64, -64, 64, -64, -64, 64, 64, -64, -64, 64, 64, -64, -64, -64, -64, -64, -64, -64, -64, -64, -64, -64, -64, 64, 64, -64, 64, -64, 64, 64, 64, 64, -64, 64, -64, -64, 64, 64, 64, -64, -64, -64, -64, -64, -64, 64, -64, -64, -64, -64, 64, -64, 64, -64, -64, -64, -64, 64, 64, 64, 64, 64, 64, 64, -64, -64, 64, -64, -64, -64, -64, -64, -64, 64, 64, 64, 64, -64, 64, 64, 64, 64, -64, 64, 64, 64, 64, -64, -64, 64, 64, -64, -64, 64, -64, -64, -64, -64, -64, -64, -64, -64, 64, 64, 64, -64, -64, 64, 64, 64, -64, 64, 64, 64, 64, 64, -64, -64, 64, 64, -64, 64, -64, -64, -64, -64, -64, -64, -64, -64, 64, -64, -64, 64, 64, 64, -64, -64, 64, 64, 64, 64, -64, -64, -64, 64, 64, 64, 64, 64, -64, -64, 64, 64, 64, -64, 64, -64, -64, -64, -64, -64, -64, 64, 64, -64, 64, 64, 64, 64, -64, -64, -64, -64, 64, -64, 64, -64, -64, 64, 64, 64, 64, 64, 64, -64, -64, -64, -64, -64, -64, 64, 64, 64, 64, 64, 64, -64, -64, -64, -64, -64, 64, 64, 64, -64, -64, 64, 64, 64, 64, -64, 64, -64, -64, -64, 64, -64, -64, 64, 64, -64, -64, -64, -64, -64, 64, -64, -64, -64, -64, -64, -64, -64, 64, 64, 64, 64, -64, -64, -64, -64, -64, 64, 64, -64, 64, -64, -64, -64, 64, 64, 64, -64, 64, -64, -64, -64, 64, -64, -64, -64, -64, 64, -64, 64, -64, -64, -64, -64, -64, -64, -64, -64, 64, 64, 64, -64, -64, -64, 64, 64, 64, -64, -64, -64, -64, -64, -64, -64, -64, 64, 64, -64, -64, -64, -64, -64, -64, 64, 64, -64, 64, -64, -64, -64, 64, 64, -64, 64, -64, -64, -64, -64, 64, -64, -64, -64, -64, 64, 64, -64, 64, 64, -64, 64, 64, -64, -64, -64, -64, -64, -64, 64, -64, -64, -64, -64, -64, -64, -64, -64, 64, 64, -64, -64, 64, 64, -64, -64, 64, 64, -64, 64, -64, -64, -64, -64, -64, -64, -64, 64, -64, -64, -64, 64, -64, -64, 64, -64, -64, -64, -64, -64, -64, -64, -64, 64, -64, -64, 64, -64, -64, 64, -64, -64, -64, -64, 64, -64, 64, -64, 64, 64, -64, -64, 64, -64, -64, -64, -64, -64, -64, -64, 64, -64, -64, 64, 64, -64, -64, -64, 64, -64, -64, 64, 64, -64, 64, -64, -64, 64, 64, 64, -64, -64, -64, -64, -64, -64, -64, -64, -64, -64, -64, -64, 64, 64, 64, 64, 64, -64, -64, -64, -64, 64, -64, 64, 64, 64, 64, 64, 64, 64, -64, -64, -64, -64, -64, -64, -64, -64, 64, 64, -64, 64, 64, 64, 64, 64, -64, 64, -64, -64, -64, -64, 64, 64, 64, 64, 64, 64, -64, -64, -64, -64, -64, -64, 64, 64, -64, 64, 64, 64, 64, 64, 64, -64, 64, -64, -64, 64, -64, 64, 64, 64, -64, -64, 64, 64, 64, 64, -64, 64, -64, 64, -64, -64, -64, 64, 64, 64, 64, 64, -64, -64, 64, 64, 64, -64, 64, 64, 64, -64, 64, -64, -64, -64, 64, 64, -64, -64, 64, 64, -64, -64, -64, -64, 64, 64, 64, -64, -64, 64, -64, -64, 64, 64, -64, -64, 64, 64, 64, 64, -64, -64, -64, -64, 64, 64, 64, 64, 64, 64, 64, -64, -64, -64, 64, 64, 64, -64, 64, -64, 64, -64, 64, -64, -64, 64, -64, 64, 64, 64, 64, -64, 64, 64, 64, -64, 64, -64, 64, -64, -64, -64, 64, -64, -64, -64, -64, -64, 64, -64, -64, -64, -64, 64, -64, 64, -64, -64, 64, -64, -64, 64, -64, -64, -64, 64, 64, 64, -64, 64, 64, -64, -64, 64, -64, 64, -64, -64, 64, -64, 64, 64, 64, 64, -64, -64, -64, -64, 64, -64, -64, -64, -64, -64, -64, -64, 64, -64, 64, 64, 64, 64, 64, 64, -64, -64, -64, -64, -64, -64, -64, -64, -64, 64, -64, -64, -64, -64, 64, 64, -64, 64, 64, 64, -64, 64, -64, -64, -64, -64, 64, 64, -64, -64, 64, 64, -64, 64, 64, 64, 64, -64, 64, -64, 64, 64, 64, -64, -64, -64, -64, -64, -64, -64, 64, -64, -64, -64, -64, 64, 64, 64, -64, -64, 64, -64, 64, -64, -64, 64, 64, -64, 64, 64, -64, -64, 64, -64, -64, 64, 64, -64, -64, -64, -64, -64, -64, 64, -64, -64, -64, 64, 64, -64, 64, 64, 64, -64, 64, 64, 64, 64, 64, 64, -64, -64, -64, -64, -64, -64, 64, -64, -64, -64, -64, 64, 64, -64, -64, 64, 64, -64, 64, 64, 64, -64, 64, 64, 64, 64, -64, -64, -64, 64, -64, 64, 64, 64, -64, 64, -64, -64, 64, 64, 64, 64, 64, -64, -64, 64, -64, -64, 64, -64, 64, 64, 64, -64, 64, -64, -64, 64, 64, 64, 64, 64, 64, 64, -64, 64, -64, 64, 64, -64, -64, 64, -64, 64, 64, 64, 64, 64, 64, 64, 64, -64, 64, -64, -64, 64, -64, 64, 64, -64, 64, 64, 64, 64, 64, 64, -64, 64, -64, 64, 64, 64, -64, 64, 64, 64, 64, 64, 64, 64, -64, -64, -64, 64, -64, -64, -64, 64, -64, 64, 64, -64, 64, 64, 64, 64, 64, 64, 64, 64, -64, 64, 64, 64, 64, 64, -64, 64, 64, -64, -64, 64, 64, -64, -64, -64, 64, 64, -64, -64, -64, 64, -64, -64, 64, 64, 64, 64, 64, 64, 64, 64, 64, 64, -64, 64, 64, 64, 64, 64, 64, -64, -64, -64, 64, -64, -64, 64, 64, 64, 64, -64, -64, -64, 64, 64, -64, 64, 64, 64, 64, 64, 64, 64, 64, 64, 64, 64, -64, -64, -64, -64, -64, -64, -64, -64, -64, 64, 64, -64, -64, -64, -64, 64, 64, 64, 64, 64, 64, -64, 64, 64, 64, 64, 64, 64, 64, 64, -64, -64, -64, 64, 64, 64, -64, -64, -64, -64, 64, 64, 64, 64, -64, 64, 64, -64, -64, -64, -64, -64, 64, 64, 64, 64, -64, -64, 64, 64, -64, -64, -64, -64, -64, -64, 64, 64, 64, -64, -64, 64, 64, -64, -64, -64, -64, -64, -64, -64, -64, -64, -64, -64, -64, 64, 64, 64, -64, -64, 64, -64, 64, -64, -64, 64, 64, -64, -64, 64, 64, -64, -64, -64, -64, -64, -64, -64, -64, -64, -64, -64, 64, 64, -64, -64, -64, -64, 64, 64, 64, -64, -64, -64, 64, 64, -64, 64, 64, -64, 64, -64, -64, -64, -64, -64, -64, -64, -64, -64, -64, 64, -64, -64, 64, 64, -64, 64, 64, -64, -64, 64, 64, 64, 64, 64, 64, -64, 64, -64, -64, -64, -64, -64, -64, -64, -64, -64, 64, 64, -64, 64, 64, -64, 64, -64, -64, -64, -64, 64, -64, -64, 64, 64, 64, 64, -64, 64, 64, -64, -64, -64, -64, -64, -64, -64, 64, -64, 64, 64, 64, 64, 64, -64, -64, -64, -64, 64, 64, 64, 64, 64, 64, 64, 64, 64, -64, -64, -64, -64, -64, -64, -64, 64, 64, -64, 64, -64, -64, -64, -64, 64, 64, -64, -64, -64, 64, -64, 64, 64, 64, 64, -64, 64, 64, -64, -64, -64, -64, -64, -64, 64, 64, -64, 64, -64, -64, -64, 64, -64, -64, -64, -64, 64, -64, -64, 64, -64, -64, -64, -64, -64, -64, -64, -64, -64, -64, -64, -64, -64, 64, 64, 64, 64, -64, 64, 64, 64, 64, 64, -64, -64, 64, 64, -64, 64, -64, -64, -64, -64, -64, -64, -64, -64, -64, 64, -64, 64, 64, 64, -64, -64, -64, -64, -64, -64, 64, 64, 64, -64, -64, 64, 64, -64, 64, -64, -64, -64, -64, -64, -64, 64, -64, 64, 64, 64, 64, -64, -64, -64, -64, -64, -64, 64, -64, 64, -64, -64, -64, -64, 64, 64, 64, -64, 64, 64, 64, 64, 64, 64, 64, 64, 64, 64, 64, 64, 64, 64, -64, 64, 64, 64, -64, 64, 64, 64, 64, -64, 64, 64, 64, -64, 64, -64, 64, 64, 64, 64, -64, 64, 64, 64, 64, 64, 64, 64, 64, 64, 64, 64, -64, -64, -64, 64, 64, 64, -64, -64, 64, 64, 64, 64, 64, 64, 64, 64, -64, 64, 64, 64, -64, 64, -64, 64, 64, 64, -64, -64, -64, -64, 64, 64, -64, 64, -64, 64, 64, 64, 64, -64, -64, -64, -64, -64, 64, 64, 64, 64, 64, -64, -64, -64, -64, -64, 64, 64, 64, 64, -64, 64, -64, 64, -64, -64, 64, 64, -64, 64, 64, -64, -64, 64, 64, 64, -64, 64, 64, -64, 64, -64, 64, -64, 64, 64, 64, -64, 64, 64, 64, -64, 64, -64, 64, 64, 64, 64, 64, -64, -64, -64, 64, -64, 64, -64, 64, -64, -64, 64, 64, 64, -64, -64, 64, -64, -64, 64, -64, -64, -64, 64, 64, 64, -64, -64, -64, -64, -64, 64, 64, -64, -64, -64, -64, -64, -64, -64, 64, 64, -64, -64, 64, -64, -64, -64, -64, 64, 64, 64, -64, -64, -64, -64, -64, 64, 64, -64, -64, -64, -64, -64, -64, 64, 64, 64, -64, -64, -64, -64, 64, -64, 64, 64, 64, -64, -64, -64, -64, -64, -64, -64, -64, -64, -64, 64, 64, -64, -64, -64, 64, -64, -64, 64, -64, -64, -64, -64, -64, -64, -64, -64, 64, 64, -64, -64, 64, -64, -64, -64, -64, -64, 64, 64, 64, 64, 64, 64, 64, 64, -64, 64, 64, -64, -64, -64, -64, 64, 64, -64, -64, 64, -64, -64, -64, -64, -64, -64, -64, 64, 64, 64, -64, -64, 64, 64, -64, 64, -64, -64, 64, -64, -64, -64, 64, 64, -64, 64, -64, -64, -64, 64, -64, 64, -64, -64, 64, 64, 64, 64, -64, -64, -64, -64, -64, 64, 64, 64, 64, 64, 64, 64, 64, 64, -64, -64, 64, -64, -64, 64, -64, 64, 64, 64, 64, 64, 64, 64, 64, 64, 64, -64, 64, 64, 64, 64, 64, 64, 64, 64, 64, 64, 64, 64, -64, -64, -64, -64, -64, 64, 64, 64, 64, 64, 64, 64, 64, 64, -64, -64, -64, 64, -64, 64, 64, 64, 64, 64, 64, 64, 64, 64, 64, -64, 64, -64, -64, 64, 64, 64, 64, 64, 64, 64, 64, 64, -64, -64, -64, 64, 64, -64, -64, 64, 64, 64, 64, -64, 64, -64, 64, -64, 64, 64, -64, 64, 64, 64, 64, 64, 64, 64, 64, -64, -64, 64, -64, 64, -64, -64, -64, -64, 64, 64, -64, -64, 64, -64, -64, -64, 64, -64, 64, 64, 64, 64, 64, 64, 64, 64, 64, 64, -64, 64, 64, 64, -64, -64, -64, 64, 64, 64, -64, -64, 64, 64, -64, 64, 64, 64, 64, 64, 64, -64, 64, 64, 64, 64, 64, 64, -64, 64, -64, -64, -64, -64, 64, 64, 64, 64, 64, -64, -64, -64, 64, -64, 64, -64, 64, 64, 64, -64, -64, 64, 64, -64, -64, -64, 64, 64, -64, -64, -64, -64, -64, 64, 64, 64, -64, -64, -64, -64, 64, -64, -64, -64, 64, 64, 64, -64, 64, -64, -64, -64, 64, 64, -64, 64, -64, -64, 64, 64, 64, 64, 64, 64, -64, -64, -64, 64, -64, 64, -64, -64, 64, 64, 64, 64, 64, -64, -64, -64, 64, -64, -64, 64, -64, -64, -64, 64, 64, 64, -64, 64, -64, -64, -64, 64, 64, 64, -64, 64, -64, 64, 64, 64, 64, -64, 64, 64, -64, 64, 64, 64, 64, -64, -64, 64, 64, 64, -64, -64, 64, -64, 64, -64, 64, 64, -64, -64, -64, 64, 64, 64, 64, 64, 64, 64, 64, 64, 64, -64, -64, -64, 64, -64, 64, 64, 64, 64, -64, 64, -64, 64, -64, 64, -64, 64, -64, 64, 64, 64, 64, 64, 64, 64, 64, 64, 64, -64, -64, 64, 64, 64, -64, 64, -64, -64, -64, 64, -64, -64, -64, -64, -64, -64, -64, 64, 64, -64, -64, 64, 64, 64, 64, 64, 64, 64, 64, -64, 64, 64, 64, 64, -64, 64, 64, -64, 64, 64, -64, -64, 64, -64, -64, -64, -64, -64, 64, 64, 64, 64, 64, 64, 64, 64, 64, 64, 64, 64, 64, 64, -64, 64, 64, -64, 64, -64, -64, 64, -64, 64, -64, -64, 64, -64, 64, -64, -64, 64, 64, 64, 64, 64, 64, 64, 64, 64, 64, 64, 64, 64, 64, -64, 64, 64, -64, 64, 64, 64, -64, -64, 64, -64, -64, -64, -64, -64, 64, 64, 64, 64, 64, 64, 64, 64, 64, 64, 64, 64, -64, -64, -64, 64, 64, -64, 64, -64, -64, 64, -64, -64, -64, -64, -64, -64, -64, -64, -64, -64, -64, -64, -64, -64, 64, 64, 64, -64, 64, -64, 64, -64, 64, 64, 64, 64, 64, 64, -64, -64, -64, -64, -64, -64, -64, -64, 64, -64, 64, 64, -64, 64, 64, 64, -64, 64, -64, -64, -64, -64, -64, -64, 64, -64, 64, -64, 64, -64, -64, 64, 64, -64, -64, -64, 64, 64, -64, -64, -64, 64, 64, -64, 64, 64, 64, 64, 64, 64, 64, -64, 64, 64, -64, 64, -64, -64, 64, 64, -64, -64, -64, 64, -64, -64, 64, -64, -64, -64, -64, 64, 64, -64, 64, 64, 64, 64, -64, -64, 64, -64, 64, -64, -64, 64, 64, 64, -64, -64, -64, 64, 64, -64, 64, 64, -64, -64, -64, 64, 64, 64, -64, -64, -64, 64, -64, -64, -64, -64, -64, 64, 64, 64, 64, 64, -64, 64, 64, -64, 64, -64, -64, 64, 64, 64, -64, -64, 64, 64, -64, -64, -64, 64, -64, -64, -64, -64, 64, 64, 64, -64, -64, -64, -64, -64, -64, -64, -64, 64, 64, 64, 64, 64, -64, 64, 64, 64, 64, -64, 64, 64, 64, -64, 64, 64, -64, 64, -64, -64, -64, -64, -64, -64, -64, -64, -64, -64, -64, -64, 64, 64, 64, -64, -64, -64, 64, -64, -64, -64, -64, -64, -64, 64, -64, 64, -64, -64, -64, -64, -64, -64, -64, -64, -64, -64, -64, -64, -64, -64, 64, 64, 64, -64, 64, -64, -64, -64, 64, -64, -64, -64, 64, 64, -64, -64, 64, -64, -64, -64, -64, -64, -64, -64, 64, 64, 64, 64, 64, 64, 64, -64, -64, -64, -64, -64, -64, 64, -64, -64, -64, -64, -64, 64, 64, -64, 64, 64, 64, 64, -64, 64, 64, 64, 64, 64, 64, 64, -64, -64, -64, -64, -64, -64, -64, -64, 64, -64, -64, 64, 64, -64, 64, -64, 64, 64, 64, 64, -64, 64, 64, 64, -64, -64, -64, 64, 64, -64, -64, -64, 64, -64, 64, -64, 64, 64, -64, 64, 64, -64, 64, 64, -64, 64, 64, -64, -64, 64, -64, -64, -64, -64, -64, 64, 64, -64, -64, -64, -64, -64, 64, -64, -64, 64, -64, -64, -64, 64, 64, -64, -64, 64, 64, 64, -64, -64, -64, -64, -64, -64, -64, 64, 64, 64, -64, -64, -64, -64, -64, -64, -64, -64, 64, 64, -64, 64, 64, 64, -64, 64, 64, 64, -64, -64, -64, -64, -64, -64, 64, 64, 64, -64, -64, -64, -64, -64, 64, -64, 64, 64, 64, 64, -64, -64, 64, 64, 64, 64, 64, 64, -64, -64, -64, -64, -64, 64, 64, 64, 64, -64, -64, -64, 64, -64, 64, -64, 64, 64, 64, 64, 64, 64, 64, 64, 64, -64, -64, -64, -64, 64, 64, 64, 64, 64, 64, 64, 64, 64, 64, -64, -64, -64, 64, 64, 64, 64, 64, 64, 64, 64, 64, 64, 64, 64, 64, -64, 64, -64, -64, 64, 64, 64, 64, 64, 64, 64, -64, -64, -64, -64, -64, -64, -64, 64, 64, 64, 64, 64, 64, 64, 64, 64, 64, 64, 64, 64, 64, 64, 64, 64, 64, 64, 64, 64, -64, -64, -64, -64, -64, -64, -64, -64, 64, 64, -64, 64, 64, 64, 64, 64, 64, 64, -64, -64, 64, 64, -64, 64, 64, 64, -64, -64, -64, 64, -64, -64, 64, 64, -64, -64, 64, -64, 64, 64, 64, 64, 64, 64, 64, -64, 64, 64, 64, 64, 64, -64, -64, -64, -64, 64, -64, -64, -64, 64, -64, 64, -64, -64, 64, -64, -64, 64, 64, -64, 64, 64, 64, -64, -64, 64, 64, 64, 64, 64, 64, -64, 64, -64, -64, -64, -64, 64, 64, -64, 64, -64, -64, -64, -64, -64, -64, -64, -64, -64, -64, -64, 64, 64, 64, 64, 64, 64, 64, 64, -64, -64, -64, -64, -64, -64, -64, 64, 64, 64, -64, -64, -64, -64, -64, -64, -64, -64, -64, -64, 64, 64, 64, -64, -64, 64, 64, 64, -64, -64, -64, -64, -64, 64, -64, -64, 64, -64, -64, -64, -64, -64, -64, -64, -64, -64, -64, -64, -64, 64, -64, -64, 64, 64, 64, -64, -64, -64, -64, -64, 64, -64, 64, 64, 64, -64, 64, -64, -64, -64, -64, 64, -64, -64, -64, 64, 64, 64, 64, 64, 64, 64, 64, 64, -64, -64, -64, -64, 64, -64, -64, -64, -64, -64, 64, -64, -64, -64, -64, 64, -64, -64, 64, 64, 64, 64, 64, 64, 64, 64, 64, 64, 64, 64, 64, 64, -64, 64, 64, -64, -64, -64, 64, 64, -64, -64, -64, 64, 64, 64, 64, 64, 64, 64, 64, 64, 64, 64, 64, -64, 64, -64, 64, 64, 64, -64, -64, -64, -64, -64, -64, 64, -64, -64, 64, -64, -64, -64, -64, -64, 64, -64, 64, 64, 64, -64, -64, -64, -64, -64, 64, 64, 64, 64, 64, 64, -64, 64, 64, -64, -64, -64, -64, -64, 64, 64, -64, -64, -64, -64, 64, 64, 64, 64, 64, 64, -64, 64, -64, 64, -64, 64, -64, 64, -64, 64, -64, 64, 64, 64, 64, -64, -64, -64, -64, 64, 64, -64, 64, 64, 64, -64, 64, 64, -64, 64, -64, -64, 64, 64, -64, 64, 64, 64, 64, -64, 64, 64, -64, -64, 64, 64, -64, -64, -64, -64, 64, -64, 64, -64, 64, -64, -64, -64, -64, -64, 64, -64, -64, 64, 64, 64, 64, -64, -64, -64, 64, 64, -64, -64, 64, 64, 64, 64, -64, -64, -64, -64, 64, -64, 64, 64, -64, -64, 64, -64, 64, 64, 64, 64, 64, 64, 64, 64, 64, 64, 64, 64, 64, 64, 64, 64, 64, 64, 64, 64, 64, -64, 64, -64, 64, 64, 64, 64, 64, -64, 64, -64, 64, -64, -64, -64, 64, -64, 64, 64, 64, 64, 64, 64, -64, 64, -64, 64, 64, 64, 64, 64, 64, 64, 64, -64, 64, -64, 64, 64, 64, -64, -64, 64, 64, -64, 64, 64, 64, 64, 64, -64, 64, 64, -64, 64, -64, 64, 64, 64, 64, -64, 64, 64, 64, 64, -64, 64, -64, -64, -64, 64, 64, 64, 64, 64, -64, 64, 64, 64, 64, 64, 64, 64, 64, 64, 64, 64, 64, 64, -64, 64, 64, 64, -64, 64, 64, 64, 64, 64, 64, 64, 64, 64, 64, 64, 64, 64, 64, 64, 64, 64, 64, 64, -64, -64, 64, 64, -64, -64, -64, 64, -64, 64, 64, -64, 64, 64, 64, 64, 64, 64, 64, 64, 64, 64, 64, 64, 64, 64, -64, -64, -64, -64, 64, -64, 64, 64, -64, -64, -64, -64, -64, 64, -64, 64, -64, 64, 64, 64, 64, 64, 64, 64, 64, 64, 64, 64, -64, -64, -64, -64, -64, 64, -64, -64, 64, -64, -64, -64, -64, 64, 64, -64, -64, -64, -64, -64, -64, -64, -64, -64, -64, -64, -64, -64, 64, -64, -64, -64, -64, 64, -64, 64, 64, -64, 64, -64, 64, 64, 64, -64, -64, -64, -64, -64, -64, -64, -64, -64, -64, -64, 64, -64, 64, -64, -64, 64, -64, 64, -64, -64, 64, -64, 64, -64, -64, 64, -64, -64, -64, -64, -64, -64, -64, -64, -64, -64, 64, -64, 64, -64, -64, -64, -64, -64, 64, -64, -64, -64, 64, -64, 64, -64, -64, -64, 64, -64, -64, -64, -64, -64, -64, -64, -64, -64, 64, -64, -64, -64, -64, -64, -64, 64, 64, -64, -64, -64, -64, -64, -64, -64, 64, 64, -64, -64, -64, -64, -64, -64, -64, 64, 64, 64, 64, 64, -64, 64, -64, -64, -64, -64, -64, -64, -64, 64, 64, -64, 64, 64, 64, 64, -64, -64, -64, -64, -64, -64, 64, 64, 64, -64, -64, -64, 64, -64, -64, -64, 64, -64, -64, -64, 64, -64, -64, -64, 64, -64, 64, -64, -64, -64, 64, 64, 64, 64, 64, 64, -64, 64, -64, -64, 64, -64, -64, -64, -64, -64, 64, -64, -64, -64, -64, -64, 64, -64, 64, -64, -64, 64, 64, -64, 64, 64, 64, 64, 64, 64, -64, -64, -64, -64, -64, 64, -64, -64, 64, -64, -64, -64, -64, 64, 64, 64, -64, 64, -64, -64, -64, -64, 64, 64, 64, 64, 64, -64, -64, -64, -64, -64, -64, -64, -64, -64, -64, -64, -64, 64, -64, 64, -64, 64, -64, 64, 64, 64, 64, -64, 64, -64, 64, -64, 64, 64, 64, 64, -64, -64, -64, -64, 64, -64, -64, -64, -64, -64, -64, -64, -64, 64, 64, 64, 64, 64, 64, 64, 64, 64, 64, 64, 64, 64, 64, 64, -64, 64, 64, 64, 64, -64, -64, -64, 64, 64, -64, 64, 64, -64, 64, 64, 64, -64, -64, -64, 64, 64, -64, 64, 64, 64, 64, 64, -64, -64, 64, 64, 64, 64, 64, 64, -64, 64, 64, -64, 64, 64, 64, 64, 64, 64, 64, 64, 64, 64, 64, 64, 64, 64, 64, -64, 64, -64, 64, 64, 64, -64, 64, 64, -64, -64, -64, 64, 64, 64, 64, 64, 64, 64, 64, 64, -64, 64, 64, 64, 64, 64, 64, 64, -64, -64, -64, 64, 64, 64, 64, 64, 64, -64, -64, -64, -64, 64, -64, 64, 64, 64, 64, 64, 64, 64, 64, -64, -64, -64, 64, -64, -64, 64, -64, 64, 64, 64, -64, 64, -64, 64, 64, -64, -64, 64, 64, 64, 64, 64, 64, 64, -64, 64, -64, -64, 64, -64, 64, -64, -64, -64, -64, -64, -64, 64, 64, 64, 64, 64, 64, 64, 64, -64, -64, 64, 64, -64, 64, -64, -64, -64, -64, -64, -64, 64, 64, 64, -64, -64, 64, -64, -64, 64, -64, 64, 64, -64, 64, -64, 64, 64, 64, 64, 64, 64, -64, -64, -64, -64, -64, -64, -64, 64, -64, 64, -64, -64, -64, -64, -64, -64, 64, 64, 64, 64, -64, 64, -64, 64, 64, 64, -64, 64, 64, -64, -64, -64, -64, -64, -64, -64, -64, 64, -64, -64, 64, 64, 64, 64, 64, 64, 64, 64, 64, 64, 64, 64, 64, -64, 64, 64, -64, 64, 64, -64, 64, 64, 64, -64, -64, -64, 64, 64, -64, -64, -64, -64, -64, -64, 64, -64, 64, -64, -64, -64, -64, -64, 64, 64, 64, -64, 64, 64, -64, 64, 64, 64, 64, 64, -64, 64, 64, 64, -64, 64, 64, -64, -64, 64, -64, 64, 64, 64, -64, 64, -64, 64, 64, -64, 64, 64, 64, -64, -64, 64, -64, -64, -64, -64, -64, -64, 64, 64, 64, -64, -64, -64, 64, -64, -64, 64, -64, -64, 64, -64, 64, -64, 64, 64, -64, -64, -64, -64, 64, -64, 64, -64, 64, 64, -64, -64, -64, 64, -64, 64, 64, -64, -64, 64, 64, 64, 64, 64, -64, -64, 64, -64, 64, -64, -64, -64, 64, -64, -64, 64, -64, 64, -64, 64, 64, -64, -64, 64, -64, -64, -64, 64, 64, -64, -64, -64, -64, 64, -64, -64, 64, 64, -64, 64, -64, -64, 64, 64, -64, -64, 64, -64, -64, 64, 64, 64, -64, 64, -64, 64, -64, 64, 64, -64, 64, -64, -64, -64, 64, -64, -64, -64, -64, 64, -64, 64, -64, 64, -64, 64, 64, 64, 64, 64, 64, 64, -64, 64, 64, -64, -64, -64, 64, -64, -64, -64, 64, -64, -64, 64, 64, 64, -64, -64, -64, -64, -64, 64, 64, -64, 64, 64, -64, -64, -64, -64, -64, -64, -64, 64, -64, -64, 64, -64, -64, -64, -64, 64, 64, -64, -64, -64, -64, -64, 64, 64, -64, -64, 64, 64, -64, -64, -64, 64, -64, 64, -64, 64, 64, -64, -64, -64, -64, -64, -64, 64, -64, -64, -64, 64, -64, -64, -64, -64, -64, 64, -64, -64, -64, -64, -64, -64, -64, -64, -64, 64, 64, -64, 64, -64, -64, 64, -64, -64, 64, -64, -64, -64, -64, 64, -64, -64, 64, -64, -64, -64, 64, -64, -64, 64, 64, -64, 64, -64, 64, 64, -64, 64, 64, 64, -64, -64, -64, 64, -64, 64, -64, -64, -64, -64, -64, -64, 64, 64, 64, -64, 64, 64, -64, -64, -64, 64, 64, -64, -64, 64, -64, -64, -64, -64, 64, -64, -64, 64, 64, -64, -64, 64, -64, 64, 64, -64, 64, -64, -64, 64, -64, -64, -64, -64, -64, -64, 64, -64, -64, -64, -64, -64, -64, -64, -64, -64, 64, -64, -64, -64, 64, 64, 64, -64, 64, -64, -64, 64, -64, -64, 64, -64, 64, -64, 64, 64, -64, 64, -64, -64, -64, -64, -64, -64, 64, -64, -64, 64, 64, -64, 64, -64, -64, 64, 64, 64, 64, 64, 64, 64, -64, 64, 64, -64, 64, -64, -64, -64, 64, -64, 64, 64, 64, 64, -64, -64, -64, -64, 64, -64, -64, -64, 64, 64, 64, -64, 64, -64, -64, 64, -64, -64, -64, -64, -64, -64, -64, -64, -64, -64, -64, -64, 64, -64, -64, -64, 64, -64, 64, 64, 64, -64, -64, -64, 64, -64, -64, 64, -64, -64, 64, -64, -64, -64, -64, -64, -64, -64, -64, -64, -64, -64, -64, -64, 64, 64, 64, -64, -64, 64, -64, -64, -64, -64, -64, -64, -64, -64, -64, 64, 64, -64, -64, -64, -64, 64, 64, -64, 64, -64, -64, -64, 64, -64, 64, -64, 64, 64, 64, -64, -64, 64, -64, -64, 64, 64, 64, 64, -64, -64, 64, 64, -64, -64, 64, -64, -64, 64, -64, 64, -64, -64, -64, -64, 64, 64, -64, 64, 64, -64, 64, -64, -64, -64, -64, 64, -64, -64, 64, 64, 64, -64, -64, -64, 64, -64, -64, -64, 64, 64, 64, -64, 64, -64, 64, 64, 64, 64, -64, -64, -64, 64, -64, -64, 64, -64, -64, -64, 64, 64, -64, 64, 64, 64, -64, 64, 64, -64, -64, -64, 64, 64, 64, 64, 64, -64, -64, 64, 64, -64, -64, 64, -64, -64, -64, 64, 64, 64, 64, -64, -64, 64, 64, -64, 64, -64, 64, -64, -64, -64, 64, -64, -64, -64, 64, -64, 64, 64, -64, -64, 64, 64, -64, -64, 64, -64, 64, 64, 64, 64, -64, 64, 64, 64, 64, -64, -64, 64, 64, -64, 64, -64, 64, 64, 64, 64, -64, -64, -64, 64, 64, -64, -64, 64, 64, 64, 64, 64, -64, -64, -64, 64, -64, -64, 64, 64, -64, -64, 64, 64, 64, -64, 64, 64, 64, -64, -64, -64, 64, -64, 64, -64, -64, -64, 64, -64, -64, -64, 64, 64, -64, 64, 64, 64, -64, 64, 64, 64, -64, -64, 64, 64, -64, -64, -64, -64, 64, 64, -64, 64, 64, -64, 64, -64, -64, 64, -64, 64, -64, -64, -64, -64, -64, 64, 64, -64, 64, -64, -64, -64, 64, 64, -64, -64, -64, -64, -64, 64, -64, -64, -64, -64, -64, 64, 64, 64, -64, 64, 64, 64, -64, 64, 64, -64, -64, -64, -64, -64, 64, 64, 64, -64, 64, -64, -64, 64, 64, 64, 64, 64, -64, 64, 64, -64, 64, -64, 64, -64, 64, 64, -64, 64, 64, 64, 64, 64, 64, -64, 64, -64, 64, -64, -64, 64, -64, 64, -64, -64, -64, 64, -64, -64, 64, 64, 64, -64, -64, 64, -64, 64, -64, -64, 64, -64, -64, -64, -64, -64, -64, 64, -64, 64, -64, -64, -64, 64, -64, 64, -64, -64, 64, 64, 64, 64, -64, 64, -64, -64, -64, -64, 64, 64, 64, 64, -64, -64, -64, 64, -64, -64, -64, -64, -64, -64, -64, -64, 64, -64, -64, 64, -64, -64, 64, -64, -64, -64, -64, -64, 64, 64, 64, -64, -64, -64, -64, -64, -64, -64, -64, -64, -64, -64, -64, -64, -64, 64, 64, 64, -64, -64, -64, -64, -64, -64, -64, -64, -64, -64, -64, -64, -64, -64, -64, -64, -64, -64, -64, -64, 64, -64, -64, 64, 64, 64, -64, 64, -64, -64, 64, 64, 64, -64, -64, -64, -64, -64, -64, -64, -64, 64, 64, 64, 64, -64, -64, 64, 64, -64, -64, -64, -64, -64, 64, 64, -64, 64, 64, -64, -64, -64, -64, -64, -64, -64, -64, 64, 64, 64, 64, 64, 64, 64, 64, 64, -64, -64, 64, 64, 64, 64, 64, 64, -64, -64, 64, -64, -64, -64, -64, -64, 64, -64, 64, 64, 64, 64, 64, 64, 64, 64, 64, 64, 64, 64, 64, -64, -64, -64, -64, 64, -64, -64, -64, -64, -64, -64, -64, -64, 64, 64, 64, 64, 64, -64, -64, 64, 64, 64, 64, 64, 64, -64, 64, -64, 64, -64, 64, -64, 64, 64, -64, -64, -64, -64, -64, -64, 64, 64, 64, -64, 64, -64, -64, -64, 64, 64, 64, 64, 64, 64, 64, 64, -64, -64, -64, -64, 64, 64, 64, -64, -64, -64, -64, 64, 64, -64, -64, -64, -64, -64, -64, 64, -64, 64, 64, 64, 64, 64, 64, 64, 64, -64, 64, 64, -64, -64, 64, -64, -64, 64, -64, 64, 64, -64, -64, -64, 64, -64, -64, 64, 64, 64, -64, -64, 64, 64, -64, 64, 64, 64, 64, -64, 64, 64, 64, -64, -64, -64, 64, -64, -64, -64, -64, -64, -64, -64, -64, -64, 64, 64, -64, -64, 64, 64, -64, 64, 64, -64, -64, -64, 64, -64, -64, -64, -64, 64, 64, -64, -64, -64, -64, 64, 64, -64, -64, 64, 64, -64, 64, 64, 64, -64, -64, -64, -64, 64, 64, -64, 64, 64, 64, 64, 64, 64, 64, 64, 64, 64, -64, -64, -64, -64, -64, -64, 64, -64, -64, -64, 64, 64, 64, -64, 64, 64, 64, 64, -64, -64, 64, 64, 64, 64, 64, -64, 64, 64, 64, 64, -64, -64, -64, -64, -64, -64, -64, -64, 64, 64, 64, 64, -64, 64, 64, 64, 64, -64, 64, 64, 64, 64, 64, 64, 64, -64, 64, 64, -64, -64, -64, -64, -64, -64, -64, 64, 64, -64, -64, -64, -64, -64, 64, 64, 64, 64, 64, 64, 64, -64, -64, -64, -64, -64, -64, 64, -64, -64, 64, -64, -64, -64, -64, 64, 64, -64, -64, -64, -64, -64, -64, 64, 64, -64, 64, 64, 64, 64, -64, -64, -64, -64, -64, -64, -64, -64, 64, -64, -64, -64, 64, 64, 64, 64, -64, 64, 64, -64, -64, 64, -64, 64, 64, 64, 64, 64, -64, -64, -64, -64, -64, -64, -64, -64, 64, -64, -64, -64, -64, -64, -64, -64, -64, 64, 64, -64, 64, 64, 64, 64, -64, 64, 64, -64, -64, -64, 64, -64, 64, -64, -64, -64, -64, -64, -64, -64, -64, -64, -64, -64, -64, 64, 64, 64, 64, 64, -64, -64, 64, 64, 64, 64, 64, -64, 64, -64, 64, -64, 64, -64, -64, -64, -64, -64, -64, -64, -64, -64, 64, -64, -64, 64, -64, -64, 64, -64, -64, 64, 64, 64, 64, 64, 64, -64, 64, 64, 64, 64, -64, -64, -64, 64, -64, -64, -64, 64, 64, -64, 64, 64, -64, -64, 64, 64, 64, 64, 64, 64, 64, 64, 64, 64, 64, -64, -64, 64, -64, 64, -64, 64, 64, 64, -64, 64, -64, 64, -64, -64, -64, -64, -64, -64, -64, 64, 64, 64, -64, 64, 64, 64, -64, 64, 64, 64, 64, 64, -64, -64, 64, -64, 64, -64, -64, 64, 64, -64, 64, 64, 64, -64, 64, 64, -64, 64, 64, 64, 64, 64, -64, -64, -64, -64, 64, 64, 64, 64, -64, -64, -64, -64, -64, -64, -64, -64, 64, 64, 64, 64, -64, -64, -64, -64, 64, -64, -64, 64, 64, 64, 64, 64, -64, -64, 64, -64, 64, -64, 64, -64, 64, -64, 64, -64, 64, 64, -64, -64, 64, 64, 64, 64, 64, 64, -64, 64, 64, 64, 64, 64, -64, 64, -64, 64, -64, -64, -64, -64, -64, -64, 64, -64, -64, -64, 64, 64, -64, 64, -64, 64, 64, -64, 64, 64, 64, -64, 64, 64, 64, 64, 64, -64, -64, 64, 64, 64, 64, -64, -64, -64, 64, 64, -64, 64, -64, 64, 64, -64, -64, -64, -64, -64, -64, 64, -64, 64, 64, 64, -64, -64, -64, -64, -64, 64, 64, 64, -64, -64, 64, 64, -64, -64, -64, -64, -64, 64, -64, -64, -64, -64, -64, -64, -64, -64, -64, 64, 64, -64, -64, -64, -64, -64, -64, 64, 64, 64, 64, 64, -64, -64, -64, -64, 64, 64, -64, -64, -64, -64, 64, -64, 64, 64, 64, 64, -64, -64, -64, -64, -64, -64, -64, -64, -64, 64, -64, 64, 64, 64, -64, 64, -64, 64, -64, -64, 64, -64, 64, -64, -64, -64, 64, 64, -64, -64, -64, -64, 64, 64, 64, -64, 64, 64, 64, 64, -64, -64, 64, -64, -64, 64, 64, 64, -64, -64, -64, -64, -64, -64, -64, 64, 64, 64, -64, -64, 64, -64, 64, 64, 64, 64, 64, -64, -64, 64, 64, 64, 64, 64, -64, -64, -64, -64, -64, -64, -64, -64, -64, -64, 64, -64, -64, -64, 64, 64, 64, 64, 64, -64, 64, 64, 64, -64, -64, -64, 64, -64, -64, -64, -64, -64, -64, 64, -64, -64, 64, 64, 64, 64, 64, 64, 64, -64, 64, 64, 64, -64, 64, 64, -64, -64, -64, -64, -64, -64, -64, -64, -64, -64, 64, -64, -64, -64, 64, 64, -64, 64, -64, 64, 64, 64, 64, -64, 64, 64, 64, -64, -64, -64, -64, -64, -64, -64, -64, -64, -64, -64, 64, -64, -64, -64, 64, 64, -64, 64, 64, -64, 64, -64, 64, 64, 64, 64, -64, -64, 64, -64, -64, -64, -64, -64, 64, -64, -64, -64, -64, -64, 64, 64, -64, -64, -64, -64, -64, -64, -64, -64, 64, 64, 64, -64, -64, 64, -64, -64, -64, -64, -64, -64, 64, -64, -64, -64, 64, -64, 64, -64, 64, -64, -64, -64, -64, -64, -64, 64, -64, 64, 64, 64, -64, -64, -64, -64, -64, -64, -64, -64, -64, 64, -64, 64, 64, 64, 64, 64, -64, -64, -64, -64, -64, -64, -64, 64, 64, -64, 64, -64, -64, 64, 64, -64, -64, -64, -64, -64, -64, 64, -64, 64, 64, 64, -64, 64, -64, -64, -64, -64, -64, 64, 64, 64, 64, -64, -64, 64, 64, 64, 64, -64, -64, -64, -64, 64, 64, 64, 64, 64, 64, 64, -64, -64, -64, -64, -64, -64, -64, -64, -64, 64, 64, 64, 64, -64, -64, -64, -64, 64, -64, 64, 64, 64, 64, -64, 64, 64, 64, -64, -64, -64, -64, -64, -64, -64, -64, 64, 64, 64, 64, 64, -64, 64, -64, -64, 64, 64, -64, 64, 64, -64, 64, -64, 64, -64, 64, -64, -64, -64, -64, -64, 64, -64, -64, -64, -64, 64, 64, 64, 64, 64, -64, -64, -64, 64, 64, 64, 64, -64, 64, 64, 64, 64, 64, -64, -64, -64, 64, -64, -64, -64, -64, -64, 64, 64, -64, 64, -64, -64, -64, 64, 64, -64, -64, -64, 64, 64, 64, 64, -64, 64, -64, -64, -64, -64, -64, -64, -64, -64, -64, -64, -64, -64, -64, -64, -64, 64, -64, 64, 64, -64, -64, -64, 64, -64, 64, -64, -64, -64, -64, 64, -64, -64, -64, -64, -64, -64, -64, 64, -64, 64, 64, -64, -64, 64, -64, 64, -64, -64, -64, 64, -64, -64, -64, -64, -64, -64, -64, -64, -64, -64, -64, -64, -64, -64, 64, 64, 64, -64, 64, -64, -64, -64, -64, -64, 64, -64, 64, -64, -64, 64, -64, -64, -64, 64, 64, -64, -64, -64, -64, -64, 64, 64, 64, 64, 64, -64, 64, -64, -64, 64, -64, 64, -64, -64, -64, -64, -64, -64, -64, -64, 64, 64, 64, 64, -64, 64, 64, 64, -64, -64, 64, 64, 64, -64, -64, -64, -64, 64, 64, 64, -64, -64, -64, -64, -64, -64, -64, -64, -64, -64, 64, 64, -64, 64, 64, -64, 64, -64, -64, -64, -64, -64, -64, -64, -64, -64, 64, -64, 64, 64, -64, -64, -64, -64, -64, -64, 64, 64, 64, -64, -64, -64, -64, -64, -64, -64, -64, -64, -64, -64, -64, 64, -64, -64, -64, -64, 64, 64, -64, 64, -64, -64, -64, -64, -64, 64, -64, -64, 64, -64, 64, -64, -64, -64, 64, 64, -64, 64, -64, -64, 64, -64, -64, 64, -64, 64, -64, 64, -64, -64, 64, -64, 64, -64, -64, -64, -64, -64, -64, 64, -64, -64, 64, -64, -64, 64, 64, 64, -64, -64, 64, -64, 64, -64, 64, -64, 64, 64, 64, -64, 64, -64, 64, -64, -64, 64, -64, 64, -64, -64, 64, -64, -64, 64, 64, -64, -64, -64, -64, 64, 64, 64, -64, -64, -64, 64, 64, -64, -64, -64, -64, -64, 64, -64, 64, -64, -64, -64, 64, 64, 64, -64, -64, -64, -64, 64, 64, 64, 64, 64, 64, 64, -64, -64, -64, -64, 64, 64, -64, 64, -64, 64, -64, -64, 64, 64, 64, -64, -64, -64, 64, -64, -64, -64, 64, 64, -64, 64, 64, 64, 64, -64, 64, -64, 64, -64, 64, 64, -64, 64, 64, 64, 64, -64, 64, 64, 64, 64, 64, 64, 64, 64, 64, -64, 64, 64, -64, -64, -64, 64, 64, 64, 64, -64, 64, -64, -64, 64, 64, -64, 64, -64, 64, -64, -64, -64, -64, 64, 64, -64, 64, -64, -64, 64, 64, 64, 64, 64, 64, 64, 64, -64, -64, 64, 64, -64, -64, 64, 64, -64, 64, 64, -64, -64, -64, -64, 64, -64, -64, 64, 64, 64, 64, 64, 64, 64, 64, 64, 64, 64, 64, 64, 64, -64, 64, -64, 64, 64, -64, 64, -64, 64, 64, -64, 64, -64, 64, -64, -64, -64, 64, 64, 64, 64, 64, 64, 64, 64, 64, 64, -64, 64, 64, -64, -64, 64, -64, 64, 64, 64, 64, -64, 64, 64, 64, 64, 64, 64, 64, 64, -64, 64, 64, 64, 64, -64, 64, -64, -64, 64, -64, 64, 64, 64, 64, -64, -64, 64, 64, 64, 64, 64, 64, -64, -64, 64, -64, -64, -64, 64, -64, 64, 64, -64, 64, 64, -64, 64, 64, 64, 64, 64, -64, -64, 64, -64, -64, -64, -64, -64, -64, -64, -64, -64, -64, 64, 64, 64, 64, 64, 64, -64, -64, 64, 64, 64, 64, 64, -64, 64, 64, 64, 64, 64, -64, -64, -64, 64, 64, -64, -64, 64, 64, -64, 64, -64, 64, 64, 64, 64, -64, 64, -64, -64, -64, 64, 64, -64, -64, 64, -64, 64, -64, 64, -64, 64, -64, 64, 64, 64, 64, -64, -64, -64, -64, -64, 64, 64, 64, 64, 64, -64, -64, 64, 64, 64, 64, -64, 64, 64, 64, -64, -64, 64, -64, 64, 64, 64, -64, -64, 64, 64, -64, -64, -64, -64, 64, 64, 64, 64, 64, 64, 64, 64, 64, -64, -64, 64, 64, 64, -64, 64, 64, -64, 64, 64, -64, 64, -64, 64, 64, 64, 64, 64, 64, 64, -64, 64, -64, 64, 64, -64, 64, 64, 64, 64, -64, 64, 64, 64, -64, -64, 64, 64, 64, 64, -64, 64, 64, 64, -64, -64, 64, -64, -64, 64, 64, -64, 64, 64, 64, 64, 64, -64, 64, -64, 64, 64, -64, -64, -64, 64, -64, -64, 64, -64, 64, 64, 64, -64, -64, 64, 64, 64, 64, 64, -64, -64, 64, -64, -64, 64, -64, -64, -64, -64, -64, -64, 64, -64, 64, 64, 64, 64, 64, 64, 64, 64, 64, 64, 64, 64, -64, 64, -64, 64, -64, -64, 64, -64, 64, -64, -64, 64, -64, -64, 64, -64, 64, -64, 64, -64, 64, 64, -64, -64, 64, 64, 64, -64, -64, 64, 64, 64, -64, 64, 64, -64, 64, -64, -64, -64, 64, 64, 64, -64, 64, -64, 64, 64, -64, 64, 64, -64, -64, 64, 64, 64, -64, 64, -64, 64, 64, 64, 64, -64, 64, 64, 64, 64, 64, 64, 64, 64, -64, 64, 64, -64, 64, 64, 64, 64, 64, -64, 64, -64, 64, -64, 64, 64, 64, 64, 64, 64, -64, -64, -64, -64, 64, 64, -64, 64, -64, -64, 64, -64, -64, -64, 64, 64, 64, -64, 64, -64, 64, 64, -64, 64, -64, -64, 64, -64, 64, 64, -64, 64, -64, 64, 64, -64, -64, 64, 64, -64, 64, 64, -64, 64, 64, -64, 64, 64, 64, 64, -64, 64, -64, 64, 64, -64, -64, 64, 64, -64, 64, -64, -64, 64, 64, 64, 64, -64, 64, 64, -64, -64, -64, 64, 64, -64, 64, -64, 64, 64, 64, -64, 64, 64, -64, 64, -64, -64, -64, -64, -64, -64, 64, -64, 64, 64, 64, 64, 64, 64, 64, 64, 64, -64, 64, -64, -64, 64, 64, 64, 64, 64, 64, -64, 64, -64, 64, -64, 64, 64, 64, -64, 64, 64, 64, -64, -64, -64, 64, -64, 64, 64, 64, -64, 64, 64, 64, 64, -64, 64, -64, -64, 64, -64, 64, 64, 64, 64, 64, -64, 64, 64, 64, -64, -64, -64, 64, 64, 64, 64, -64, -64, -64, -64, -64, 64, 64, -64, 64, -64, -64, -64, 64, 64, 64, 64, 64, 64, 64, -64, 64, 64, 64, 64, -64, -64, 64, 64, -64, 64, 64, -64, 64, -64, -64, -64, -64, 64, 64, -64, -64, -64, -64, -64, 64, -64, -64, 64, 64, 64, 64, -64, 64, 64, -64, 64, 64, -64, 64, 64, -64, -64, 64, 64, 64, 64, 64, 64, 64, 64, 64, -64, 64, -64, -64, -64, 64, -64, 64, -64, -64, -64, 64, -64, 64, -64, -64, 64, -64, -64, 64, -64, -64, 64, -64, -64, -64, 64, 64, -64, -64, 64, 64, -64, -64, -64, -64, -64, -64, -64, 64, -64, -64, -64, -64, 64, -64, -64, -64, -64, -64, -64, 64, -64, -64, 64, 64, -64, -64, 64, 64, -64, -64, 64, -64, -64, -64, -64, -64, 64, 64, 64, -64, -64, 64, -64, 64, -64, 64, -64, 64, -64, 64, -64, 64, -64, -64, 64, -64, 64, -64, -64, -64, 64, 64, 64, -64, 64, -64, -64, 64, 64, -64, 64, -64, 64, 64, 64, 64, -64, 64, 64, -64, 64, 64, 64, 64, -64, -64, -64, 64, 64, 64, 64, -64, 64, 64, -64, 64, 64, -64, 64, 64, 64, 64, -64, 64, -64, 64, -64, 64, -64, 64, -64, -64, -64, 64, 64, 64, 64, 64, -64, -64, 64, 64, 64, 64, 64, 64, -64, 64, 64, 64, 64, 64, -64, -64, -64, 64, -64, -64, -64, 64, 64, 64, 64, -64, -64, 64, 64, 64, 64, 64, -64, 64, 64, 64, -64, -64, 64, 64, 64, 64, -64, -64, 64, 64, 64, 64, 64, 64, 64, 64, 64, -64, 64, -64, -64, 64, 64, -64, -64, 64, -64, 64, 64, -64, -64, 64, -64, 64, 64, 64, -64, 64, -64, -64, 64, 64, 64, 64, -64, 64, -64, 64, 64, 64, 64, 64, 64, 64, 64, -64, -64, 64, 64, -64, -64, -64, -64, 64, -64, 64, 64, 64, 64, 64, 64, -64, -64, 64, 64, -64, 64, 64, -64, 64, -64, 64, 64, 64, 64, 64, 64, 64, 64, -64, 64, 64, 64, 64, 64, -64, 64, 64, 64, 64, 64, -64, 64, 64, 64, -64, 64, 64, -64, -64, 64, -64, -64, 64, 64, 64, -64, 64, -64, -64, -64, 64, 64, -64, 64, 64, 64, 64, -64, 64, 64, 64, -64, 64, -64, 64, 64, 64, 64, 64, 64, 64, -64, 64, -64, -64, -64, -64, -64, 64, -64, 64, 64, 64, 64, 64, 64, 64, 64, -64, 64, 64, 64, -64, -64, 64, 64, -64, 64, 64, -64, 64, -64, -64, -64, -64, 64, 64, 64, -64, -64, 64, 64, 64, 64, -64, -64, 64, -64, -64, 64, -64, 64, 64, 64, -64, 64, 64, -64, 64, -64, -64, -64, -64, 64, -64, -64, -64, 64, -64, -64, 64, 64, 64, 64, 64, 64, 64, 64, 64, 64, 64, 64, -64, 64, -64, 64, -64, -64, 64, -64, -64, 64, -64, -64, 64, -64, 64, -64, 64, 64, 64, 64, 64, 64, 64, 64, 64, 64, 64, 64, 64, 64, -64, 64, -64, 64, 64, 64, -64, -64, 64, -64, -64, 64, 64, -64, 64, 64, -64, 64, 64, 64, -64, -64, 64, -64, -64, -64, -64, 64, 64, 64, 64, 64, 64, 64, 64, -64, 64, -64, -64, -64, -64, 64, -64, -64, 64, 64, -64, 64, 64, 64, -64, 64, 64, -64, 64, 64, 64, 64, -64, 64, -64, 64, -64, 64, -64, 64, -64, -64, 64, -64, -64, -64, 64, -64, 64, 64, -64, -64, 64, 64, -64, 64, 64, 64, -64, -64, 64, 64, -64, 64, 64, -64, -64, -64, -64, 64, 64, -64, 64, -64, -64, -64, 64, -64, 64, 64, -64, 64, 64, 64, 64, -64, 64, 64, 64, 64, 64, -64, 64, 64, 64, 64, 64, 64, 64, -64, 64, 64, -64, -64, 64, 64, 64, 64, 64, 64, 64, 64, 64, 64, 64, 64, 64, -64, 64, -64, -64, 64, 64, -64, 64, 64, 64, 64, 64, 64, -64, 64, 64, -64, 64, 64, -64, 64, 64, 64, 64, 64, -64, -64, 64, 64, 64, 64, 64, -64, -64, 64, -64, 64, 64, -64, 64, 64, -64, 64, -64, 64, -64, 64, -64, 64, -64, 64, 64, 64, 64, 64, -64, 64, 64, -64, 64, -64, -64, -64, 64, 64, -64, -64, 64, 64, 64, 64, 64, -64, -64, -64, 64, 64, 64, -64, 64, 64, -64, 64, 64, 64, -64, -64, -64, -64, 64, 64, 64, 64, -64, -64, 64, -64, 64, 64, 64, 64, 64, -64, -64, 64, -64, -64, 64, 64, -64, -64, 64, 64, 64, 64, -64, 64, -64, 64, 64, -64, 64, 64, 64, -64, 64, 64, 64, 64, -64, -64, -64, -64, 64, -64, 64, 64, -64, -64, -64, 64, -64, 64, -64, 64, -64, 64, -64, -64, 64, 64, -64, 64, 64, -64, -64, 64, -64, -64, 64, 64, 64, -64, -64, 64, 64, 64, 64, -64, -64, -64, 64, -64, 64, 64, -64, -64, 64, 64, 64, 64, 64, 64, 64, 64, -64, -64, 64, -64, 64, -64, -64, -64, -64, 64, 64, -64, 64, 64, 64, 64, 64, -64, -64, 64, -64, 64, -64, -64, 64, 64, 64, -64, -64, -64, -64, -64, -64, -64, 64, -64, -64, 64, -64, -64, 64, -64, -64, 64, -64, -64, -64, 64, 64, 64, 64, 64, -64, 64, -64, -64, 64, -64, 64, 64, -64, -64, 64, -64, -64, 64, -64, -64, 64, 64, -64, -64, -64, 64, -64, -64, -64, 64, -64, 64, 64, 64, -64, -64, -64, 64, 64, 64, 64, -64, -64, 64, 64, 64, 64, -64, -64, -64, -64, 64, -64, 64, 64, 64, -64, 64, 64, -64, 64, -64, 64, -64, -64, 64, -64, 64, -64, -64, 64, 64, 64, 64, 64, -64, -64, 64, 64, -64, -64, -64, 64, -64, -64, -64, 64, -64, 64, 64, -64, 64, 64, 64, 64, 64, 64, 64, 64, 64, 64, -64, -64, -64, 64, -64, -64, -64, 64, 64, -64, -64, -64, -64, 64, -64, -64, 64, -64, -64, 64, -64, -64, -64, 64, 64, -64, 64, 64, 64, 64, 64, -64, 64, 64, -64, -64, 64, -64, 64, -64, -64, 64, -64, 64, -64, -64, -64, 64, 64, -64, -64, -64, -64, -64, -64, 64, -64, -64, -64, 64, 64, 64, 64, 64, -64, -64, -64, -64, -64, -64, -64, 64, -64, -64, -64, -64, -64, -64, -64, -64, -64, 64, 64, 64, -64, -64, -64, 64, -64, -64, -64, -64, 64, -64, -64, -64, -64, -64, -64, -64, -64, -64, -64, -64, -64, -64, -64, -64, -64, -64, 64, 64, 64, -64, 64, -64, 64, -64, -64, 64, 64, 64, -64, -64, -64, -64, 64, -64, -64, -64, -64, 64, -64, -64, -64, -64, -64, -64, 64, 64, 64, 64, 64, 64, -64, 64, 64, -64, -64, -64, -64, -64, 64, -64, -64, -64, -64, -64, -64, -64, -64, -64, -64, -64, -64, -64, -64, -64, -64, 64, 64, 64, 64, -64, -64, 64, 64, -64, -64, -64, 64, 64, 64, -64, 64, -64, -64, 64, -64, -64, -64, -64, 64, -64, -64, 64, -64, 64, -64, -64, 64, -64, 64, 64, -64, -64, -64, -64, -64, 64, -64, -64, 64, -64, 64, -64, 64, -64, -64, -64, -64, -64, 64, -64, 64, -64, -64, 64, 64, -64, 64, -64, -64, -64, -64, -64, -64, 64, 64, -64, 64, 64, -64, -64, 64, -64, -64, 64, -64, 64, -64, 64, -64, -64, -64, -64, -64, -64, 64, -64, -64, -64, 64, -64, -64, 64, 64, -64, -64, -64, 64, 64, -64, -64, -64, 64, -64, -64, -64, -64, -64, -64, -64, -64, -64, -64, -64, -64, -64, -64, -64, -64, -64, -64, -64, -64, -64, -64, 64, -64, -64, -64, -64, -64, -64, -64, -64, -64, -64, -64, -64, -64, 64, -64, -64, -64, 64, -64, -64, -64, -64, -64, -64, -64, -64, -64, -64, -64, -64, -64, -64, 64, -64, -64, -64, -64, -64, 64, -64, 64, 64, -64, 64, 64, -64, 64, -64, -64, -64, -64, -64, 64, 64, -64, -64, -64, -64, 64, -64, -64, -64, -64, -64, -64, -64, -64, 64, 64, -64, -64, 64, -64, -64, 64, -64, -64, 64, -64, -64, -64, -64, 64, 64, 64, -64, -64, -64, -64, -64, -64, -64, -64, -64, -64, 64, -64, 64, 64, 64, -64, -64, -64, -64, -64, -64, -64, 64, -64, 64, -64, 64, -64, -64, 64, -64, -64, 64, -64, -64, -64, -64, -64, -64, 64, 64, -64, -64, -64, 64, 64, -64, -64, 64, -64, -64, 64, -64, -64, -64, -64, 64, 64, 64, 64, 64, 64, 64, 64, 64, -64, 64, -64, -64, 64, -64, -64, 64, -64, -64, -64, 64, 64, -64, -64, -64, -64, -64, 64, -64, -64, -64, -64, 64, -64, 64, 64, 64, 64, -64, 64, -64, -64, -64, 64, 64, 64, -64, 64, -64, 64, 64, -64, -64, -64, -64, -64, 64, -64, 64, 64, 64, 64, 64, -64, -64, -64, 64, -64, -64, -64, -64, -64, -64, 64, 64, 64, -64, -64, -64, -64, -64, 64, 64, 64, -64, 64, -64, 64, -64, 64, 64, 64, 64, -64, -64, 64, -64, 64, -64, -64, 64, 64, -64, -64, 64, 64, -64, 64, 64, 64, 64, -64, -64, -64, 64, -64, -64, -64, 64, -64, -64, -64, 64, 64, -64, 64, -64, 64, 64, -64, 64, 64, 64, -64, 64, 64, 64, 64, 64, 64, -64, 64, 64, -64, 64, -64, -64, -64, -64, -64, 64, -64, -64, 64, 64, -64, 64, -64, 64, -64, -64, 64, -64, 64, 64, -64, -64, -64, -64, 64, -64, 64, 64, 64, 64, -64, 64, -64, 64, 64, -64, -64, -64, -64, -64, 64, -64, 64, 64, -64, 64, 64, -64, 64, -64, -64, 64, 64, 64, -64, 64, 64, 64, -64, 64, -64, -64, -64, -64, 64, -64, -64, -64, 64, 64, -64, -64, -64, -64, -64, 64, -64, -64, -64, 64, -64, -64, -64, -64, -64, -64, -64, -64, -64, 64, -64, -64, 64, -64, -64, 64, -64, 64, -64, -64, -64, -64, -64, -64, -64, -64, -64, -64, -64, -64, -64, 64, 64, -64, -64, 64, 64, -64, 64, -64, -64, -64, -64, -64, -64, -64, 64, -64, 64, -64, -64, -64, -64, -64, -64, -64, -64, 64, 64, 64, 64, 64, 64, 64, 64, -64, 64, 64, 64, -64, 64, 64, -64, -64, -64, -64, -64, -64, -64, -64, 64, -64, -64, 64, -64, -64, 64, 64, -64, -64, 64, 64, 64, -64, -64, -64, -64, -64, 64, 64, -64, -64, -64, 64, 64, 64, 64, -64, -64, -64, -64, 64, -64, -64, 64, -64, -64, 64, 64, 64, 64, 64, -64, 64, 64, 64, 64, -64, -64, -64, -64, 64, -64, -64, -64, 64, -64, 64, 64, -64, 64, 64, 64, -64, 64, 64, -64, -64, -64, 64, -64, 64, -64, -64, 64, 64, 64, -64, -64, 64, -64, -64, -64, 64, 64, 64, -64, -64, 64, 64, 64, 64, 64, 64, 64, -64, -64, 64, -64, -64, 64, -64, 64, 64, -64, -64, -64, -64, 64, 64, 64, 64, 64, 64, 64, -64, 64, 64, 64, 64, 64, 64, 64, -64, 64, 64, 64, -64, 64, 64, 64, 64, 64, 64, -64, 64, 64, 64, 64, 64, 64, -64, -64, -64, 64, 64, 64, 64, -64, -64, 64, 64, -64, 64, -64, -64, 64, -64, 64, 64, 64, -64, 64, -64, 64, -64, -64, 64, -64, -64, -64, -64, 64, 64, 64, 64, 64, -64, -64, -64, -64, 64, -64, 64, -64, 64, -64, 64, 64, -64, -64, -64, 64, -64, -64, -64, -64, -64, -64, -64, -64, 64, 64, -64, -64, -64, -64, -64, -64, -64, 64, 64, 64, 64, 64, -64, -64, -64, -64, 64, 64, -64, 64, 64, -64, -64, -64, -64, -64, 64, -64, -64, -64, -64, -64, -64, -64, -64, -64, 64, -64, 64, 64, -64, -64, -64, -64, -64, -64, -64, 64, -64, -64, -64, -64, -64, 64, -64, 64, 64, -64, -64, -64, -64, -64, -64, 64, -64, 64, 64, -64, 64, 64, -64, 64, 64, -64, 64, -64, -64, 64, -64, -64, -64, 64, 64, 64, 64, 64, -64, -64, -64, 64, -64, 64, -64, -64, 64, -64, 64, -64, 64, 64, 64, 64, 64, -64, -64, -64, -64, -64, 64, 64, 64, 64, 64, 64, -64, -64, -64, -64, -64, 64, 64, 64, 64, -64, 64, -64, 64, 64, 64, 64, -64, 64, -64, 64, -64, -64, 64, 64, 64, 64, 64, 64, -64, -64, -64, -64, -64, 64, 64, 64, -64, 64, 64, 64, 64, 64, -64, 64, -64, -64, -64, -64, -64, 64, 64, 64, 64, 64, 64, -64, -64, -64, -64, -64, -64, 64, -64, -64, -64, 64, 64, 64, 64, 64, -64, 64, -64, -64, -64, -64, -64, 64, 64, 64, 64, -64, -64, -64, -64, -64, -64, -64, -64, 64, -64, 64, 64, 64, 64, 64, 64, 64, 64, 64, -64, -64, -64, -64, 64, 64, 64, -64, 64, 64, -64, -64, -64, -64, -64, -64, 64, -64, 64, -64, 64, -64, 64, 64, 64, 64, 64, 64, -64, -64, -64, -64, 64, 64, 64, 64, 64, 64, 64, -64, -64, -64, -64, -64, 64, 64, -64, -64, 64, 64, 64, 64, 64, 64, 64, -64, 64, -64, 64, 64, -64, 64, 64, 64, 64, 64, -64, -64, -64, -64, 64, -64, -64, 64, -64, 64, 64, 64, 64, -64, 64, 64, -64, 64, -64, 64, 64, -64, 64, 64, 64, 64, 64, 64, -64, -64, -64, 64, 64, -64, 64, 64, 64, -64, -64, -64, 64, 64, -64, 64, 64, -64, -64, 64, -64, -64, -64, -64, 64, 64, -64, 64, -64, 64, -64, 64, 64, 64, 64, -64, -64, 64, 64, 64, 64, -64, -64, -64, -64, -64, 64, 64, -64, 64, -64, 64, 64, 64, 64, -64, -64, 64, 64, 64, 64, 64, -64, 64, 64, 64, -64, 64, -64, 64, 64, -64, -64, -64, -64, 64, -64, -64, -64, -64, -64, -64, -64, -64, -64, -64, 64, 64, 64, 64, 64, -64, 64, -64, -64, -64, 64, 64, -64, -64, -64, -64, -64, -64, -64, -64, -64, -64, 64, -64, 64, -64, -64, -64, -64, -64, 64, -64, -64, -64, -64, 64, -64, -64, -64, 64, -64, 64, -64, -64, 64, 64, -64, 64, 64, -64, 64, 64, 64, 64, -64, -64, -64, 64, -64, -64, 64, 64, 64, -64, 64, 64, 64, 64, 64, -64, -64, -64, -64, 64, 64, 64, 64, -64, 64, 64, -64, -64, 64, 64, -64, -64, 64, -64, 64, -64, -64, 64, -64, -64, -64, -64, 64, -64, 64, 64, -64, 64, -64, 64, 64, -64, -64, -64, -64, 64, 64, 64, 64, -64, 64, 64, 64, -64, -64, -64, 64, -64, 64, -64, -64, -64, -64, 64, 64, 64, -64, 64, 64, -64, -64, -64, -64, -64, -64, -64, -64, 64, 64, 64, 64, 64, 64, 64, 64, -64, 64, -64, 64, 64, 64, 64, 64, -64, 64, 64, -64, -64, -64, -64, -64, -64, -64, 64, -64, -64, -64, 64, 64, -64, -64, -64, -64, 64, 64, -64, 64, -64, -64, -64, -64, -64, -64, -64, -64, -64, -64, -64, -64, -64, -64, -64, -64, -64, -64, -64, -64, 64, -64, -64, -64, -64, -64, -64, 64, -64, -64, -64, -64, 64, 64, -64, -64, -64, -64, -64, -64, 64, 64, -64, -64, -64, -64, -64, -64, 64, -64, -64, 64, 64, 64, -64, 64, 64, 64, -64, 64, 64, -64, -64, -64, -64, -64, -64, -64, 64, -64, -64, -64, -64, -64, -64, 64, -64, -64, -64, -64, 64, 64, 64, 64, 64, -64, -64, 64, -64, 64, -64, -64, -64, -64, 64, -64, 64, 64, -64, -64, -64, -64, -64, 64, 64, 64, -64, -64, 64, 64, 64, 64, 64, -64, -64, -64, -64, -64, -64, 64, 64, 64, -64, -64, -64, 64, 64, -64, -64, 64, -64, -64, -64, -64, -64, 64, -64, 64, 64, -64, -64, 64, -64, -64, -64, -64, 64, 64, 64, -64, -64, 64, 64, 64, 64, -64, 64, -64, -64, -64, -64, -64, 64, 64, 64, 64, -64, -64, -64, -64, -64, -64, -64, -64, -64, 64, 64, 64, -64, -64, 64, 64, 64, 64, 64, -64, -64, -64, -64, -64, -64, -64, -64, 64, 64, 64, 64, -64, -64, -64, -64, 64, 64, -64, -64, -64, -64, 64, 64, 64, 64, 64, -64, 64, -64, 64, 64, 64, 64, 64, 64, -64, 64, -64, -64, 64, -64, -64, -64, -64, 64, -64, -64, -64, -64, 64, -64, 64, 64, 64, -64, -64, 64, 64, -64, -64, -64, -64, 64, -64, -64, -64, -64, 64, -64, -64, -64, 64, 64, 64, -64, 64, 64, -64, -64, -64, -64, 64, 64, 64, 64, 64, 64, -64, 64, -64, -64, 64, -64, 64, 64, 64, -64, -64, 64, 64, 64, 64, -64, -64, 64, 64, 64, -64, 64, 64, 64, 64, 64, 64, -64, 64, -64, -64, 64, 64, 64, 64, 64, 64, 64, 64, 64, 64, 64, 64, 64, 64, -64, 64, -64, -64, -64, -64, 64, -64, -64, -64, -64, -64, -64, 64, -64, 64, 64, 64, 64, 64, 64, 64, 64, 64, -64, 64, -64, 64, 64, -64, 64, -64, 64, -64, 64, 64, -64, -64, 64, 64, -64, 64, 64, 64, -64, 64, -64, 64, 64, 64, 64, 64, 64, -64, 64, 64, 64, 64, -64, -64, 64, -64, -64, -64, -64, 64, -64, 64, 64, 64, -64, 64, 64, -64, -64, -64, -64, 64, 64, 64, 64, 64, -64, 64, 64, -64, -64, -64, -64, -64, -64, -64, -64, 64, -64, -64, -64, 64, -64, -64, 64, -64, -64, -64, -64, -64, -64, 64, 64, -64, -64, 64, 64, -64, -64, -64, -64, -64, -64, -64, -64, 64, -64, 64, -64, 64, -64, -64, 64, -64, -64, -64, -64, -64, -64, -64, -64, -64, -64, -64, 64, -64, -64, -64, 64, -64, 64, -64, -64, -64, -64, -64, -64, 64, -64, 64, -64, -64, -64, -64, -64, -64, -64, -64, -64, -64, -64, -64, -64, -64, -64, -64, -64, -64, -64, -64, 64, -64, -64, -64, 64, 64, 64, -64, -64, -64, -64, -64, 64, -64, -64, -64, -64, -64, -64, -64, -64, -64, -64, -64, -64, -64, -64, -64, -64, 64, -64, 64, 64, -64, 64, 64, -64, -64, -64, -64, -64, -64, -64, -64, -64, 64, -64, -64, 64, 64, -64, -64, -64, -64, -64, -64, -64, 64, 64, 64, -64, -64, 64, -64, -64, 64, 64, 64, -64, -64, -64, 64, 64, -64, -64, 64, 64, -64, -64, -64, -64, -64, 64, 64, -64, 64, 64, -64, -64, 64, -64, 64, 64, 64, 64, 64, 64, 64, 64, 64, 64, 64, -64, -64, -64, -64, -64, -64, -64, -64, -64, 64, -64, 64, 64, -64, 64, 64, 64, 64, 64, 64, -64, 64, 64, -64, 64, -64, -64, 64, 64, 64, 64, 64, -64, 64, -64, -64, -64, -64, -64, 64, -64, 64, 64, -64, 64, 64, 64, 64, -64, -64, -64, 64, 64, 64, 64, 64, 64, -64, -64, 64, -64, -64, -64, -64, 64, -64, 64, 64, 64, -64, -64, 64, 64, -64, 64, -64, -64, 64, 64, -64, -64, 64, -64, 64, 64, -64, -64, 64, -64, -64, 64, 64, 64, -64, 64, 64, -64, -64, 64, -64, 64, -64, -64, 64, -64, -64, 64, 64, -64, 64, 64, 64, 64, -64, 64, -64, 64, 64, -64, 64, -64, 64, -64, -64, -64, 64, -64, -64, 64, 64, -64, -64, -64, 64, -64, -64, 64, -64, 64, 64, 64, -64, -64, -64, 64, -64, 64, -64, -64, 64, -64, -64, -64, 64, 64, -64, -64, 64, 64, 64, -64, 64, 64, 64, -64, 64, -64, -64, 64, -64, -64, -64, 64, 64, 64, 64, 64, 64, -64, 64, 64, 64, -64, -64, -64, 64, 64, -64, 64, 64, 64, 64, -64, -64, -64, 64, 64, -64, -64, 64, 64, -64, -64, 64, 64, 64, -64, -64, -64, -64, 64, -64, 64, 64, -64, 64, 64, 64, 64, 64, 64, -64, -64, -64, -64, -64, -64, -64, 64, 64, -64, 64, -64, 64, 64, 64, 64, 64, -64, -64, -64, 64, -64, 64, 64, 64, -64, -64, -64, -64, -64, -64, -64, -64, -64, -64, -64, -64, -64, 64, -64, -64, 64, 64, 64, -64, -64, -64, 64, 64, 64, 64, -64, -64, -64, -64, -64, -64, -64, -64, -64, 64, -64, 64, -64, -64, -64, -64, -64, -64, 64, -64, 64, 64, 64, 64, 64, -64, -64, -64, -64, -64, -64, -64, -64, 64, 64, -64, -64, -64, 64, -64, -64, -64, -64, -64, -64, 64, 64, -64, -64, -64, 64, 64, 64, -64, -64, -64, -64, 64, -64, -64, -64, 64, -64, -64, -64, -64, -64, 64, -64, -64, 64, -64, -64, -64, -64, -64, 64, 64, 64, 64, -64, 64, -64, -64, 64, -64, -64, -64, -64, -64, -64, -64, 64, -64, 64, -64, -64, -64, -64, -64, -64, -64, -64, -64, -64, 64, 64, 64, 64, -64, 64, -64, -64, 64, -64, -64, -64, -64, -64, -64, 64, -64, 64, -64, -64, 64, -64, 64, -64, 64, 64, 64, -64, -64, 64, -64, 64, -64, -64, 64, -64, -64, -64, -64, -64, 64, -64, -64, -64, 64, 64, 64, -64, -64, -64, -64, -64, 64, -64, -64, -64, -64, -64, 64, -64, 64, -64, 64, -64, -64, -64, -64, -64, -64, -64, -64, 64, 64, 64, 64, -64, -64, -64, -64, -64, 64, 64, -64, 64, -64, -64, -64, -64, 64, 64, 64, 64, -64, 64, 64, 64, -64, -64, -64, -64, -64, 64, 64, 64, -64, -64, 64, -64, -64, -64, -64, -64, 64, 64, -64, -64, 64, 64, 64, 64, 64, -64, -64, 64, -64, -64, -64, 64, -64, 64, -64, 64, -64, 64, -64, -64, -64, -64, -64, -64, 64, 64, -64, 64, -64, 64, 64, -64, -64, -64, -64, -64, 64, 64, 64, 64, 64, -64, 64, 64, -64, -64, 64, -64, -64, 64, -64, -64, -64, -64, 64, 64, 64, 64, -64, -64, -64, -64, 64, -64, -64, -64, -64, 64, -64, 64, 64, -64, 64, 64, -64, -64, -64, -64, -64, -64, 64, 64, 64, -64, -64, 64, -64, -64, 64, 64, 64, 64, -64, -64, -64, -64, 64, 64, 64, -64, -64, 64, 64, 64, -64, -64, -64, -64, 64, 64, 64, 64, -64, -64, -64, -64, -64, -64, -64, -64, -64, -64, -64, 64, -64, -64, -64, -64, 64, -64, 64, -64, -64, -64, -64, -64, -64, -64, 64, 64, -64, -64, 64, -64, 64, 64, -64, -64, -64, -64, -64, 64, -64, -64, -64, -64, 64, -64, -64, -64, 64, -64, -64, -64, -64, 64, 64, 64, -64, -64, -64, -64, 64, 64, -64, -64, -64, 64, -64, 64, 64, 64, 64, 64, 64, 64, 64, -64, -64, -64, -64, -64, -64, -64, -64, 64, -64, 64, -64, -64, -64, -64, -64, -64, 64, -64, -64, -64, -64, -64, 64, 64, -64, -64, -64, 64, 64, -64, 64, 64, 64, 64, -64, 64, 64, 64, 64, 64, 64, -64, -64, -64, -64, -64, -64, -64, -64, -64, -64, -64, 64, 64, -64, 64, 64, 64, 64, 64, -64, 64, -64, -64, 64, 64, 64, 64, -64, 64, -64, -64, -64, -64, -64, -64, -64, -64, -64, 64, -64, -64, -64, 64, 64, 64, 64, -64, -64, 64, -64, -64, -64, -64, 64, 64, 64, 64, -64, 64, -64, -64, -64, -64, -64, -64, -64, -64, 64, -64, 64, 64, 64, 64, 64, -64, -64, -64, 64, 64, 64, -64, -64, 64, 64, 64, -64, 64, -64, -64, 64, 64, -64, 64, 64, 64, -64, 64, 64, 64, -64, -64, 64, -64, -64, -64, -64, -64, 64, 64, 64, -64, -64, 64, -64, -64, 64, 64, 64, -64, 64, 64, -64, -64, -64, 64, 64, -64, -64, -64, -64, -64, -64, 64, 64, 64, -64, -64, 64, -64, -64, 64, 64, -64, -64, 64, -64, 64, -64, 64, 64, 64, -64, -64, 64, 64, -64, 64, -64, -64, -64, 64, -64, -64, -64, -64, 64, 64, -64, -64, -64, 64, -64, -64, -64, 64, -64, -64, 64, 64, 64, -64, 64, 64, 64, 64, 64, 64, -64, 64, -64, 64, 64, -64, -64, -64, -64, 64, -64, 64, -64, 64, -64, 64, -64, 64, -64, 64, 64, -64, -64, -64, -64, -64, 64, -64, 64, 64, 64, -64, 64, 64, 64, -64, 64, -64, 64, 64, -64, 64, -64, 64, 64, 64, 64, 64, 64, 64, 64, -64, 64, 64, -64, 64, -64, 64, -64, 64, -64, -64, 64, -64, 64, 64, -64, 64, 64, 64, -64, -64, -64, -64, -64, -64, 64, 64, 64, 64, 64, 64, 64, 64, -64, -64, 64, 64, -64, -64, 64, 64, 64, 64, 64, 64, 64, 64, -64, -64, -64, 64, -64, -64, -64, 64, 64, 64, 64, 64, 64, 64, -64, -64, -64, 64, 64, 64, 64, 64, 64, 64, 64, 64, 64, 64, 64, -64, 64, -64, -64, -64, -64, -64, 64, 64, 64, 64, 64, -64, 64, 64, -64, 64, 64, 64, 64, 64, 64, 64, 64, 64, 64, 64, 64, 64, -64, -64, -64, -64, -64, -64, 64, 64, 64, 64, -64, 64, -64, -64, -64, 64, 64, 64, 64, 64, 64, -64, 64, 64, 64, 64, 64, -64, -64, -64, -64, -64, -64, -64, 64, 64, 64, -64, -64, -64, -64, -64, 64, 64, 64, 64, 64, -64, 64, 64, 64, 64, 64, -64, -64, -64, -64, 64, 64, -64, -64, -64, -64, 64, -64, -64, 64, -64, -64, 64, 64, 64, 64, 64, -64, -64, 64, 64, -64, -64, -64, 64, -64, 64, 64, 64, 64, -64, -64, -64, -64, -64, -64, 64, 64, -64, -64, -64, 64, 64, 64, 64, -64, -64, -64, 64, 64, -64, -64, -64, 64, 64, -64, 64, 64, 64, -64, -64, -64, -64, -64, -64, 64, -64, 64, -64, -64, 64, 64, 64, -64, -64, -64, 64, 64, 64, 64, 64, 64, -64, -64, 64, 64, 64, -64, -64, -64, -64, -64, -64, -64, 64, -64, -64, 64, -64, 64, 64, -64, -64, 64, -64, 64, 64, 64, 64, -64, -64, -64, 64, 64, 64, -64, -64, -64, -64, -64, -64, -64, -64, -64, -64, -64, 64, -64, 64, 64, 64, -64, -64, 64, -64, 64, 64, -64, -64, 64, 64, 64, 64, 64, 64, -64, -64, -64, -64, -64, -64, -64, -64, -64, 64, 64, 64, 64, -64, -64, -64, -64, -64, 64, -64, -64, -64, 64, 64, 64, 64, 64, 64, 64, 64, 64, -64, -64, -64, 64, -64, -64, 64, 64, 64, 64, 64, 64, -64, -64, -64, -64, -64, -64, 64, 64, 64, 64, 64, 64, 64, 64, 64, -64, 64, -64, 64, -64, 64, 64, -64, -64, 64, 64, 64, 64, -64, -64, -64, -64, -64, -64, 64, 64, 64, 64, 64, 64, 64, 64, 64, -64, -64, -64, -64, -64, 64, -64, 64, 64, -64, 64, -64, -64, -64, -64, -64, -64, -64, -64, -64, 64, -64, -64, 64, 64, 64, 64, 64, -64, -64, -64, 64, -64, 64, 64, -64, 64, -64, 64, -64, -64, -64, -64, -64, -64, -64, -64, 64, 64, 64, 64, 64, 64, -64, -64, -64, -64, -64, -64, -64, -64, 64, -64, -64, -64, 64, -64, 64, -64, 64, -64, -64, -64, 64, 64, 64, 64, 64, 64, 64, -64, -64, -64, -64, 64, -64, 64, -64, 64, 64, -64, 64, 64, 64, -64, -64, -64, -64, -64, -64, 64, 64, 64, 64, 64, 64, 64, 64, 64, -64, -64, -64, 64, 64, 64, 64, 64, -64, -64, 64, 64, 64, -64, -64, 64, 64, -64, -64, 64, 64, 64, 64, 64, 64, -64, 64, -64, -64, -64, -64, -64, 64, -64, 64, 64, 64, 64, 64, -64, 64, 64, 64, 64, -64, -64, -64, 64, 64, -64, 64, 64, 64, -64, -64, -64, -64, 64, -64, -64, -64, -64, 64, 64, -64, 64, -64, 64, 64, 64, 64, 64, 64, 64, 64, -64, 64, -64, 64, 64, -64, -64, 64, -64, -64, -64, -64, -64, -64, -64, -64, 64, 64, -64, 64, 64, 64, 64, 64, -64, -64, 64, -64, 64, 64, 64, 64, 64, -64, -64, -64, -64, -64, -64, -64, 64, -64, 64, -64, -64, -64, 64, 64, 64, -64, 64, -64, -64, 64, -64, -64, -64, 64, -64, -64, -64, -64, -64, -64, -64, -64, 64, 64, -64, -64, -64, -64, -64, 64, 64, 64, 64, -64, 64, -64, 64, -64, -64, -64, -64, 64, -64, -64, 64, 64, -64, 64, -64, 64, 64, -64, 64, -64, -64, 64, 64, -64, -64, 64, 64, 64, -64, 64, -64, 64, -64, -64, -64, 64, 64, -64, 64, 64, 64, -64, -64, -64, -64, -64, 64, 64, -64, -64, 64, -64, 64, -64, -64, 64, -64, 64, 64, -64, -64, -64, -64, 64, 64, -64, -64, -64, 64, 64, 64, -64, -64, -64, -64, 64, 64, 64, 64, -64, 64, 64, -64, 64, -64, -64, 64, -64, -64, -64, -64, -64, -64, -64, -64, -64, -64, 64, -64, -64, -64, -64, 64, 64, 64, -64, -64, 64, 64, 64, -64, 64, 64, 64, -64, -64, -64, -64, -64, -64, -64, -64, -64, -64, 64, 64, -64, 64, -64, -64, -64, -64, -64, 64, 64, 64, -64, 64, 64, -64, -64, 64, -64, -64, -64, -64, -64, -64, -64, -64, -64, -64, 64, -64, -64, -64, -64, 64, 64, 64, -64, 64, -64, -64, 64, 64, 64, -64, -64, 64, -64, -64, -64, 64, -64, -64, -64, -64, -64, -64, -64, -64, 64, -64, -64, -64, -64, -64, 64, -64, -64, -64, 64, -64, 64, 64, 64, 64, 64, 64, -64, 64, -64, 64, -64, -64, -64, 64, 64, -64, 64, 64, 64, 64, 64, 64, -64, 64, 64, 64, -64, -64, 64, 64, 64, -64, -64, -64, -64, -64, 64, -64, -64, -64, -64, 64, 64, 64, 64, -64, -64, -64, -64, -64, -64, 64, -64, 64, -64, -64, -64, -64, -64, 64, -64, -64, 64, 64, 64, 64, -64, 64, 64, 64, -64, -64, 64, 64, -64, -64, -64, 64, 64, 64, -64, -64, -64, -64, -64, 64, -64, 64, 64, 64, -64, 64, -64, -64, -64, -64, 64, 64, 64, -64, -64, 64, -64, 64, -64, 64, 64, 64, -64, -64, 64, -64, -64, -64, -64, 64, 64, 64, -64, 64, -64, -64, -64, -64, -64, -64, 64, -64, -64, -64, 64, 64, -64, 64, 64, 64, 64, -64, -64, 64, -64, -64, -64, -64, -64, 64, 64, -64, -64, -64, -64, -64, -64, 64, -64, 64, 64, 64, 64, 64, 64, 64, 64, 64, 64, -64, -64, -64, -64, 64, -64, -64, 64, 64, 64, -64, 64, 64, 64, 64, 64, 64, 64, -64, -64, -64, -64, -64, 64, 64, 64, -64, 64, 64, -64, 64, -64, 64, 64, -64, -64, 64, 64, 64, 64, 64, 64, 64, 64, 64, -64, -64, -64, 64, -64, 64, -64, -64, -64, -64, 64, -64, -64, 64, -64, -64, 64, -64, -64, 64, 64, 64, 64, 64, 64, 64, 64, 64, 64, -64, -64, -64, -64, -64, -64, -64, -64, -64, 64, -64, 64, 64, 64, -64, -64, -64, -64, 64, 64, 64, 64, 64, 64, 64, 64, 64, 64, -64, -64, -64, -64, -64, -64, 64, -64, -64, 64, -64, 64, 64, -64, -64, -64, -64, -64, 64, 64, 64, 64, 64, 64, 64, 64, 64, 64, -64, -64, -64, -64, -64, 64, 64, -64, -64, 64, -64, 64, 64, -64, -64, -64, -64, -64, -64, -64, -64, 64, -64, 64, -64, 64, -64, -64, -64, -64, -64, -64, -64, -64, -64, 64, -64, 64, -64, -64, 64, 64, -64, -64, -64, -64, -64, -64, -64, -64, -64, -64, -64, -64, -64, -64, 64, -64, 64, 64, -64, -64, -64, 64, -64, -64, 64, 64, 64, 64, -64, -64, -64, -64, -64, -64, -64, -64, -64, -64, -64, 64, -64, 64, -64, 64, 64, 64, -64, -64, -64, -64, -64, -64, -64, 64, -64, 64, 64, 64, -64, -64, -64, -64, -64, -64, -64, -64, -64, 64, -64, 64, 64, -64, 64, -64, -64, 64, -64, -64, 64, -64, 64, -64, -64, 64, 64, 64, 64, -64, -64, -64, 64, -64, -64, 64, 64, 64, 64, -64, -64, 64, -64, -64, -64, 64, 64, 64, 64, 64, 64, -64, 64, 64, 64, -64, -64, 64, 64, 64, 64, 64, 64, 64, -64, -64, -64, -64, 64, -64, 64, -64, -64, -64, -64, -64, 64, -64, 64, -64, 64, 64, 64, 64, 64, -64, 64, 64, 64, 64, 64, 64, 64, -64, -64, 64, -64, -64, 64, -64, -64, -64, -64, -64, -64, -64, 64, 64, 64, 64, 64, -64, 64, 64, 64, 64, 64, 64, -64, 64, -64, -64, -64, -64, 64, 64, 64, 64, 64, -64, -64, -64, -64, 64, -64, -64, 64, 64, 64, 64, 64, 64, 64, -64, 64, 64, 64, 64, 64, 64, -64, -64, 64, -64, -64, -64, -64, 64, 64, -64, 64, 64, -64, 64, 64, 64, -64, 64, 64, 64, 64, -64, 64, 64, 64, -64, -64, -64, -64, -64, 64, -64, -64, -64, 64, 64, -64, -64, -64, 64, -64, -64, 64, 64, -64, -64, 64, -64, -64, -64, -64, 64, -64, -64, -64, 64, -64, 64, -64, 64, -64, -64, -64, 64, 64, 64, -64, -64, -64, 64, -64, -64, 64, 64, 64, 64, -64, -64, -64, -64, -64, 64, -64, -64, -64, 64, 64, 64, 64, 64, 64, 64, -64, 64, 64, 64, -64, -64, -64, -64, 64, -64, -64, 64, 64, 64, 64, -64, 64, -64, -64, -64, -64, 64, -64, -64, -64, -64, 64, 64, -64, 64, -64, -64, -64, -64, 64, -64, -64, 64, -64, -64, 64, 64, -64, -64, -64, 64, -64, 64, -64, 64, 64, 64, -64, -64, -64, 64, 64, -64, 64, 64, 64, -64, 64, 64, -64, -64, -64, 64, -64, 64, -64, 64, -64, -64, -64, -64, -64, -64, 64, 64, 64, 64, 64, 64, 64, -64, -64, 64, 64, 64, 64, 64, 64, -64, -64, -64, -64, -64, -64, -64, 64, 64, 64, 64, 64, 64, -64, 64, 64, 64, 64, 64, 64, 64, 64, -64, 64, -64, 64, 64, -64, -64, -64, -64, -64, -64, -64, -64, -64, 64, 64, 64, 64, 64, 64, 64, 64, 64, 64, 64, -64, -64, 64, -64, 64, -64, 64, 64, -64, -64, -64, -64, -64, -64, -64, -64, 64, 64, 64, -64, 64, 64, 64, 64, 64, 64, 64, -64, 64, 64, 64, 64, 64, 64, 64, 64, 64, 64, 64, -64, -64, -64, -64, -64, 64, 64, -64, 64, 64, -64, 64, -64, -64, 64, 64, 64, 64, 64, 64, -64, -64, -64, 64, 64, 64, -64, 64, 64, 64, -64, 64, 64, 64, 64, 64, 64, 64, 64, 64, 64, 64, 64, 64, 64, 64, 64, -64, 64, -64, 64, 64, 64, 64, 64, 64, 64, 64, 64, 64, 64, 64, 64, 64, 64, 64, -64, -64, 64, -64, 64, 64, 64, 64, 64, -64, 64, 64, -64, 64, 64, 64, 64, 64, 64, 64, 64, 64, 64, 64, 64, 64, 64, -64, 64, 64, 64, 64, 64, 64, 64, 64, 64, 64, 64, -64, -64, 64, 64, 64, 64, 64, -64, 64, -64, -64, 64, -64, 64, 64, 64, 64, -64, 64, -64, -64, 64, 64, 64, 64, 64, 64, 64, 64, -64, 64, 64, 64, -64, 64, 64, -64, 64, 64, 64, -64, -64, 64, 64, 64, 64, -64, -64, 64, 64, -64, 64, -64, 64, 64, 64, -64, -64, -64, -64, 64, 64, 64, -64, 64, 64, 64, -64, 64, -64, 64, 64, 64, -64, 64, 64, 64, 64, -64, 64, -64, -64, -64, 64, -64, -64, -64, -64, 64, 64, 64, 64, 64, -64, -64, 64, -64, 64, 64, -64, 64, 64, 64, 64, 64, -64, 64, 64, -64, -64, -64, 64, 64, -64, 64, -64, 64, 64, 64, 64, 64, -64, -64, -64, -64, 64, -64, 64, 64, 64, 64, 64, -64, 64, -64, -64, -64, -64, 64, -64, -64, -64, -64, 64, 64, -64, 64, -64, -64, -64, -64, -64, -64, 64, -64, 64, -64, -64, 64, 64, -64, -64, -64, -64, -64, -64, -64, -64, 64, -64, 64, 64, 64, 64, 64, 64, -64, 64, -64, -64, -64, -64, 64, -64, 64, 64, 64, 64, -64, -64, 64, -64, 64, -64, -64, 64, 64, 64, 64, -64, -64, -64, -64, -64, 64, 64, -64, -64, 64, 64, -64, 64, 64, 64, -64, 64, 64, 64, 64, 64, 64, 64, -64, 64, 64, 64, 64, 64, -64, 64, 64, -64, 64, 64, -64, -64, -64, -64, 64, 64, 64, -64, 64, 64, 64, 64, -64, -64, 64, 64, 64, -64, -64, -64, -64, -64, -64, 64, 64, 64, 64, 64, 64, 64, 64, 64, 64, 64, 64, 64, -64, 64, 64, -64, 64, -64, -64, 64, 64, -64, 64, -64, -64, 64, 64, 64, -64, -64, 64, 64, 64, -64, 64, 64, 64, 64, 64, 64, 64, 64, 64, 64, -64, -64, 64, 64, 64, 64, -64, -64, 64, -64, -64, 64, -64, 64, 64, 64, 64, 64, 64, 64, 64, 64, 64, -64, 64, 64, -64, 64, -64, -64, 64, 64, -64, -64, -64, 64, 64, -64, -64, -64, -64, 64, -64, -64, 64, -64, 64, 64, 64, -64, 64, -64, 64, -64, -64, -64, -64, -64, -64, 64, -64, 64, -64, -64, 64, 64, -64, -64, 64, -64, -64, -64, 64, 64, -64, -64, 64, 64, -64, -64, 64, 64, 64, 64, -64, -64, -64, -64, -64, -64, -64, -64, -64, 64, -64, 64, -64, 64, 64, 64, -64, -64, 64, 64, 64, -64, 64, 64, 64, 64, 64, -64, -64, 64, -64, -64, 64, 64, 64, -64, -64, -64, -64, 64, 64, -64, 64, 64, -64, 64, 64, -64, 64, 64, 64, -64, 64, 64, -64, 64, 64, 64, 64, -64, 64, 64, -64, 64, 64, 64, -64, 64, 64, -64, 64, 64, 64, -64, 64, 64, -64, -64, -64, -64, -64, 64, -64, 64, -64, 64, -64, -64, 64, -64, -64, -64, -64, 64, -64, 64, 64, -64, 64, 64, -64, -64, 64, 64, 64, 64, -64, -64, 64, -64, 64, 64, 64, 64, -64, 64, 64, 64, -64, -64, -64, 64, -64, 64, 64, -64, -64, -64, 64, 64, 64, -64, -64, 64, -64, -64, -64, -64, 64, 64, -64, 64, -64, 64, -64, -64, 64, 64, 64, -64, 64, -64, 64, -64, -64, 64, -64, 64, -64, 64, 64, -64, -64, 64, 64, -64, -64, 64, -64, 64, -64, -64, 64, 64, -64, 64, 64, -64, -64, -64, 64, -64, 64, 64, 64, 64, 64, 64, 64, -64, 64, -64, -64, -64, -64, -64, 64, 64, -64, 64, -64, -64, -64, 64, -64, 64, 64, 64, 64, -64, 64, -64, 64, -64, -64, 64, 64, -64, -64, 64, 64, 64, 64, 64, 64, 64, 64, 64, -64, -64, -64, 64, -64, 64, -64, 64, 64, 64, 64, 64, 64, -64, -64, 64, -64, -64, 64, 64, 64, 64, 64, 64, 64, 64, 64, 64, 64, 64, -64, 64, 64, 64, 64, -64, -64, -64, 64, 64, 64, 64, -64, 64, 64, -64, 64, 64, 64, -64, -64, -64, 64, 64, -64, 64, 64, 64, -64, -64, -64, -64, -64, 64, -64, 64, 64, 64, 64, 64, 64, -64, 64, 64, -64, 64, -64, 64, -64, -64, 64, 64, -64, 64, 64, 64, 64, 64, -64, -64, -64, 64, 64, 64, 64, -64, 64, 64, -64, -64, 64, 64, 64, 64, 64, -64, -64, 64, -64, 64, -64, -64, 64, 64, -64, -64, -64, 64, 64, 64, -64, 64, 64, -64, -64, 64, -64, -64, 64, -64, 64, -64, 64, 64, 64, 64, 64, 64, 64, 64, 64, -64, -64, 64, -64, 64, -64, 64, -64, -64, 64, -64, 64, -64, 64, 64, -64, 64, 64, 64, 64, -64, -64, -64, 64, -64, 64, -64, -64, -64, 64, 64, -64, 64, 64, 64, 64, 64, 64, -64, -64, -64, 64, 64, 64, 64, -64, 64, 64, 64, 64, 64, -64, 64, 64, -64, 64, 64, -64, -64, -64, -64, -64, 64, -64, 64, 64, 64, 64, 64, -64, 64, -64, 64, -64, -64, 64, -64, 64, -64, 64, 64, 64, -64, 64, 64, 64, -64, -64, -64, 64, -64, 64, -64, 64, 64, 64, 64, 64, -64, -64, -64, 64, -64, -64, 64, 64, -64, 64, -64, -64, 64, -64, 64, -64, 64, -64, 64, 64, -64, -64, -64, 64, 64, 64, 64, -64, 64, 64, 64, 64, 64, 64, 64, 64, 64, 64, 64, 64, -64, -64, 64, -64, 64, 64, 64, 64, -64, -64, -64, 64, -64, -64, -64, 64, 64, 64, -64, -64, -64, 64, -64, -64, -64, 64, -64, -64, 64, 64, 64, 64, 64, 64, -64, -64, -64, -64, 64, 64, 64, -64, 64, 64, 64, 64, 64, 64, -64, -64, -64, 64, 64, 64, 64, 64, 64, 64, 64, -64, 64, -64, -64, 64, 64, 64, -64, 64, 64, 64, 64, 64, -64, 64, 64, 64, 64, 64, 64, 64, -64, 64, 64, -64, 64, 64, 64, -64, 64, 64, -64, 64, 64, -64, 64, 64, 64, 64, 64, -64, 64, -64, 64, 64, 64, -64, -64, 64, -64, 64, 64, 64, 64, 64, 64, 64, -64, -64, -64, 64, -64, 64, 64, 64, 64, -64, 64, 64, -64, -64, 64, -64, 64, 64, 64, -64, -64, 64, 64, -64, 64, 64, 64, 64, -64, -64, -64, -64, -64, 64, -64, 64, -64, -64, 64, 64, 64, 64, 64, 64, -64, 64, 64, 64, 64, 64, -64, -64, -64, 64, -64, 64, 64, -64, -64, 64, 64, 64, -64, 64, 64, 64, 64, -64, 64, 64, -64, 64, -64, 64, -64, 64, 64, -64, -64, 64, 64, -64, 64, -64, -64, -64, 64, 64, 64, 64, 64, -64, 64, -64, 64, -64, -64, 64, 64, 64, -64, 64, 64, -64, -64, -64, 64, -64, -64, 64, 64, -64, -64, 64, 64, 64, -64, -64, 64, -64, -64, -64, -64, 64, 64, 64, 64, 64, 64, 64, 64, -64, -64, 64, -64, -64, 64, 64, -64, -64, 64, -64, -64, 64, -64, 64, 64, 64, -64, -64, -64, -64, 64, 64, -64, 64, -64, -64, 64, -64, -64, 64, -64, -64, 64, 64, -64, 64, -64, -64, -64, 64, 64, 64, 64, 64, 64, 64, 64, 64, -64, -64, 64, -64, -64, -64, -64, 64, 64, 64, 64, 64, 64, 64, -64, 64, 64, -64, -64, -64, -64, -64, 64, -64, 64, 64, -64, 64, 64, -64, 64, -64, 64, -64, 64, -64, -64, -64, -64, -64, 64, 64, 64, 64, -64, 64, 64, 64, 64, -64, -64, -64, -64, -64, 64, 64, -64, 64, -64, 64, -64, -64, 64, 64, -64, 64, -64, -64, -64, 64, -64, 64, -64, -64, -64, 64, -64, -64, -64, 64, -64, -64, -64, -64, 64, -64, -64, 64, 64, 64, -64, 64, 64, -64, -64, -64, -64, 64, -64, 64, 64, -64, 64, 64, 64, 64, 64, -64, -64, -64, -64, -64, -64, 64, -64, 64, -64, -64, 64, 64, 64, -64, -64, 64, 64, 64, -64, -64, 64, 64, -64, 64, -64, -64, 64, -64, 64, 64, 64, 64, -64, -64, 64, 64, 64, -64, 64, 64, 64, -64, 64, -64, 64, -64, -64, -64, 64, 64, 64, 64, -64, 64, 64, 64, 64, 64, -64, 64, -64, 64, -64, 64, 64, 64, 64, 64, 64, 64, 64, 64, 64, 64, 64, 64, 64, -64, -64, -64, -64, -64, -64, 64, 64, 64, 64, 64, 64, 64, 64, -64, 64, 64, 64, 64, 64, 64, -64, 64, 64, -64, -64, -64, -64, 64, -64, 64, 64, 64, 64, 64, 64, 64, 64, 64, 64, -64, 64, 64, 64, 64, -64, -64, -64, 64, 64, -64, -64, 64, 64, -64, 64, 64, 64, 64, -64, 64, 64, 64, 64, 64, 64, -64, -64, 64, 64, 64, 64, 64, -64, -64, -64, 64, 64, -64, -64, -64, 64, -64, -64, -64, 64, 64, 64, -64, 64, 64, 64, 64, 64, -64, 64, -64, -64, -64, -64, 64, -64, 64, -64, 64, -64, -64, -64, 64, -64, 64, -64, 64, -64, 64, -64, -64, 64, -64, 64, -64, 64, -64, -64, 64, 64, -64, 64, -64, -64, 64, 64, -64, -64, -64, -64, -64, 64, -64, 64, 64, -64, -64, -64, 64, 64, 64, 64, 64, -64, -64, 64, 64, 64, -64, -64, 64, -64, 64, 64, -64, -64, 64, 64, -64, -64, -64, 64, 64, -64, -64, 64, 64, 64, -64, -64, -64, -64, -64, 64, 64, 64, 64, 64, 64, -64, 64, 64, 64, 64, -64, 64, -64, 64, -64, -64, -64, 64, 64, -64, 64, -64, -64, -64, 64, 64, -64, 64, 64, 64, 64, 64, 64, 64, 64, 64, 64, 64, 64, 64, 64, 64, 64, -64, 64, -64, 64, 64, 64, -64, 64, 64, -64, 64, -64, -64, -64, 64, 64, 64, 64, 64, 64, 64, 64, 64, 64, -64, 64, 64, -64, -64, 64, -64, 64, -64, 64, -64, 64, 64, -64, 64, -64, -64, -64, 64, 64, 64, 64, 64, -64, 64, 64, -64, 64, 64, -64, 64, -64, 64, -64, 64, -64, 64, -64, -64, 64, 64, -64, -64, -64, 64, -64, -64, -64, 64, 64, 64, 64, 64, -64, -64, -64, 64, 64, 64, -64, -64, 64, 64, 64, 64, 64, -64, -64, 64, 64, 64, -64, -64, 64, 64, -64, 64, 64, 64, 64, -64, -64, -64, 64, 64, -64, 64, 64, -64, -64, 64, 64, -64, -64, 64, 64, 64, 64, 64, 64, 64, 64, 64, 64, 64, 64, 64, 64, 64, -64, 64, -64, -64, -64, 64, 64, -64, 64, 64, 64, 64, -64, 64, 64, 64, 64, 64, 64, -64, 64, -64, 64, 64, -64, 64, 64, 64, 64, 64, 64, 64, 64, -64, -64, -64, 64, 64, -64, 64, 64, 64, -64, 64, 64, 64, 64, 64, 64, 64, 64, -64, -64, 64, 64, 64, 64, 64, 64, -64, -64, -64, -64, 64, 64, 64, -64, 64, -64, -64, -64, -64, -64, 64, 64, 64, -64, 64, 64, 64, -64, 64, 64, -64, 64, 64, 64, 64, -64, 64, -64, -64, 64, -64, 64, 64, 64, -64, -64, 64, 64, 64, 64, 64, 64, 64, -64, -64, -64, 64, 64, 64, -64, -64, 64, -64, 64, -64, -64, -64, -64, -64, 64, 64, 64, -64, 64, 64, 64, 64, 64, 64, -64, 64, -64, -64, -64, -64, -64, 64, 64, -64, -64, 64, -64, -64, -64, 64, -64, -64, -64, 64, -64, -64, -64, -64, -64, 64, 64, 64, 64, 64, -64, -64, 64, 64, 64, -64, -64, -64, 64, 64, -64, -64, 64, -64, 64, 64, -64, -64, -64, 64, -64, 64, -64, 64, 64, -64, -64, -64, -64, -64, -64, 64, 64, 64, 64, -64, -64, -64, 64, -64, 64, 64, -64, 64, 64, -64, -64, 64, -64, 64, 64, 64, 64, 64, 64, -64, -64, -64, -64, -64, -64, -64, 64, -64, 64, -64, 64, -64, 64, 64, -64, -64, 64, -64, 64, 64, -64, 64, 64, 64, 64, 64, -64, -64, -64, -64, -64, -64, -64, 64, -64, -64, -64, -64, -64, -64, -64, -64, -64, -64, 64, -64, 64, -64, 64, 64, 64, 64, -64, -64, -64, -64, -64, -64, 64, 64, -64, -64, 64, 64, -64, -64, 64, 64, -64, -64, 64, 64, 64, 64, -64, 64, -64, -64, -64, -64, -64, -64, -64, -64, 64, 64, 64, -64, -64, 64, 64, 64, 64, -64, -64, 64, -64, 64, 64, 64, -64, 64, -64, -64, -64, 64, -64, 64, 64, 64, 64, -64, -64, 64, 64, 64, 64, -64, 64, 64, 64, 64, -64, 64, 64, 64, 64, -64, 64, 64, 64, -64, -64, -64, -64, 64, 64, 64, 64, -64, 64, -64, 64, -64, -64, 64, 64, -64, 64, 64, -64, -64, -64, -64, 64, 64, 64, 64, -64, 64, 64, -64, 64, 64, 64, 64, -64, -64, -64, 64, 64, 64, -64, 64, -64, -64, 64, -64, -64, -64, -64, 64, -64, 64, -64, 64, -64, 64, 64, 64, -64, -64, -64, -64, -64, -64, -64, -64, 64, 64, 64, 64, -64, 64, -64, 64, 64, 64, 64, 64, -64, 64, 64, -64, -64, -64, -64, -64, -64, -64, -64, -64, 64, -64, 64, 64, 64, -64, -64, -64, -64, 64, -64, -64, 64, -64, 64, 64, -64, -64, -64, -64, -64, -64, -64, -64, 64, 64, 64, 64, -64, 64, 64, 64, 64, 64, 64, 64, 64, 64, 64, -64, 64, -64, 64, -64, -64, -64, -64, -64, -64, -64, -64, 64, 64, 64, 64, 64, 64, 64, 64, 64, 64, 64, -64, 64, 64, -64, 64, -64, -64, 64, 64, 64, -64, -64, -64, -64, 64, 64, -64, 64, 64, 64, -64, 64, -64, 64, 64, 64, 64, 64, 64, 64, 64, 64, -64, -64, -64, 64, 64, -64, 64, 64, 64, 64, 64, 64, 64, 64, 64, 64, -64, -64, 64, 64, 64, 64, 64, -64, 64, 64, 64, 64, 64, 64, 64, -64, 64, 64, -64, 64, -64, 64, 64, 64, 64, -64, 64, 64, -64, -64, -64, -64, 64, 64, 64, 64, 64, 64, 64, 64, 64, -64, 64, 64, -64, -64, -64, 64, 64, 64, 64, 64, 64, 64, -64, -64, 64, -64, -64, 64, 64, 64, 64, 64, 64, 64, 64, -64, -64, -64, -64, 64, 64, 64, 64, -64, 64, 64, 64, 64, 64, 64, -64, -64, 64, -64, -64, -64, 64, 64, 64, 64, 64, 64, 64, 64, 64, 64, 64, 64, -64, -64, 64, -64, 64, 64, 64, 64, 64, 64, 64, 64, -64, -64, -64, -64, 64, 64, 64, 64, 64, 64, 64, -64, -64, 64, 64, -64, -64, -64, 64, 64, 64, 64, 64, 64, 64, 64, -64, 64, 64, -64, 64, 64, -64, 64, 64, -64, 64, 64, 64, 64, 64, 64, 64, -64, 64, -64, 64, -64, -64, -64, 64, 64, 64, 64, 64, 64, 64, -64, 64, -64, 64, 64, 64, 64, 64, 64, 64, 64, -64, -64, 64, -64, 64, -64, -64, 64, 64, 64, 64, 64, 64, 64, 64, 64, 64, 64, 64, -64, -64, 64, -64, 64, 64, 64, 64, -64, 64, -64, -64, 64, -64, -64, -64, -64, -64, 64, 64, 64, 64, 64, 64, 64, 64, 64, -64, 64, 64, 64, 64, 64, -64, -64, 64, 64, 64, 64, 64, 64, 64, 64, 64, -64, 64, 64, 64, 64, 64, 64, 64, 64, 64, 64, 64, 64, 64, 64, 64, 64, 64, -64, 64, -64, -64, 64, 64, 64, 64, 64, 64, -64, 64, 64, 64, 64, 64, -64, 64, 64, -64, 64, 64, -64, 64, 64, 64, -64, -64, 64, -64, 64, 64, 64, 64, -64, -64, 64, 64, 64, 64, 64, 64, -64, 64, -64, -64, 64, 64, 64, -64, 64, 64, -64, 64, -64, -64, -64, -64, 64, 64, 64, -64, -64, 64, 64, 64, 64, 64, 64, -64, -64, -64, -64, -64, 64, 64, -64, 64, 64, 64, -64, 64, 64, 64, -64, -64, 64, 64, -64, 64, -64, -64, -64, 64, 64, 64, -64, 64, -64, 64, -64, 64, 64, 64, 64, 64, -64, -64, 64, 64, -64, 64, 64, -64, -64, 64, 64, -64, -64, -64, 64, -64, 64, 64, 64, 64, 64, 64, 64, 64, 64, 64, 64, -64, -64, -64, -64, 64, -64, -64, 64, -64, 64, 64, 64, -64, 64, 64, -64, -64, -64, -64, -64, 64, -64, 64, 64, 64, 64, 64, 64, 64, 64, 64, 64, 64, -64, -64, -64, 64, 64, 64, 64, 64, 64, 64, 64, 64, 64, 64, -64, 64, -64, 64, 64, -64, -64, -64, 64, 64, 64, -64, 64, 64, 64, 64, -64, -64, -64, -64, 64, 64, -64, -64, -64, -64, 64, -64, -64, 64, 64, -64, 64, 64, -64, -64, 64, 64, 64, -64, -64, 64, 64, -64, 64, -64, 64, 64, 64, -64, -64, -64, 64, 64, 64, 64, -64, -64, -64, -64, 64, 64, 64, -64, -64, -64, 64, -64, -64, 64, 64, 64, 64, -64, -64, 64, -64, 64, -64, 64, 64, -64, -64, -64, -64, 64, 64, -64, 64, -64, 64, -64, 64, -64, -64, -64, -64, 64, 64, -64, 64, -64, 64, 64, 64, -64, 64, 64, 64, -64, -64, -64, 64, -64, -64, 64, -64, 64, 64, 64, 64, -64, 64, -64, 64, -64, 64, 64, 64, 64, -64, -64, -64, -64, 64, 64, 64, 64, 64, 64, -64, 64, 64, -64, -64, 64, -64, 64, -64, 64, 64, -64, 64, 64, 64, -64, -64, -64, 64, -64, -64, 64, -64, 64, -64, 64, 64, 64, -64, -64, 64, -64, 64, 64, 64, 64, 64, 64, -64, -64, 64, 64, 64, 64, 64, -64, 64, -64, 64, 64, -64, -64, 64, -64, -64, -64, -64, -64, 64, 64, 64, 64, 64, 64, 64, 64, 64, -64, 64, -64, -64, -64, 64, -64, 64, 64, -64, -64, 64, 64, -64, -64, 64, 64, 64, -64, -64, 64, -64, 64, 64, 64, 64, -64, -64, -64, 64, -64, -64, -64, -64, -64, -64, -64, -64, 64, 64, 64, 64, -64, 64, 64, 64, -64, -64, -64, 64, 64, 64, 64, 64, 64, 64, 64, 64, 64, -64, -64, -64, 64, 64, -64, 64, 64, 64, -64, 64, -64, 64, 64, 64, 64, 64, 64, 64, 64, 64, 64, 64, 64, -64, 64, -64, -64, -64, -64, -64, 64, -64, -64, -64, 64, 64, 64, 64, -64, 64, 64, 64, 64, -64, 64, 64, 64, 64, -64, -64, -64, -64, -64, -64, -64, -64, -64, -64, 64, 64, -64, -64, 64, -64, -64, -64, 64, 64, 64, 64, 64, -64, -64, 64, 64, -64, -64, -64, -64, -64, -64, -64, -64, -64, -64, -64, 64, 64, 64, -64, 64, 64, -64, -64, -64, -64, 64, 64, 64, -64, 64, 64, 64, -64, -64, -64, -64, -64, -64, -64, -64, -64, -64, -64, 64, -64, -64, -64, -64, -64, 64, 64, 64, 64, 64, 64, -64, -64, 64, -64, -64, -64, -64, -64, -64, -64, -64, -64, 64, -64, -64, -64, 64, -64, 64, -64, 64, -64, -64, 64, 64, -64, 64, 64, -64, 64, -64, 64, -64, -64, -64, -64, -64, -64, 64, 64, 64, -64, -64, -64, 64, 64, 64, 64, 64, -64, 64, -64, -64, -64, 64, 64, 64, -64, -64, 64, -64, -64, -64, -64, -64, -64, -64, 64, -64, 64, -64, 64, 64, 64, 64, 64, 64, -64, -64, -64, 64, 64, -64, -64, 64, -64, -64, 64, -64, -64, -64, -64, -64, -64, -64, -64, 64, 64, 64, 64, 64, 64, 64, 64, 64, -64, 64, 64, -64, -64, -64, -64, -64, -64, -64, 64, -64, 64, 64, -64, 64, -64, -64, -64, -64, -64, -64, -64, -64, 64, -64, 64, 64, 64, -64, -64, 64, 64, -64, -64, -64, -64, 64, 64, -64, -64, -64, -64, 64, 64, 64, -64, -64, -64, -64, -64, 64, -64, 64, 64, 64, 64, 64, -64, -64, 64, -64, 64, 64, 64, 64, 64, -64, -64, 64, 64, -64, -64, 64, -64, 64, -64, -64, -64, 64, -64, -64, 64, 64, -64, 64, 64, -64, 64, -64, -64, 64, 64, 64, 64, -64, 64, -64, -64, 64, -64, -64, 64, -64, 64, 64, 64, 64, 64, -64, 64, -64, -64, -64, 64, -64, 64, 64, -64, -64, -64, 64, 64, 64, 64, -64, -64, -64, -64, -64, -64, 64, 64, 64, 64, 64, 64, 64, 64, -64, -64, 64, 64, 64, -64, 64, -64, -64, 64, 64, 64, 64, -64, 64, 64, -64, -64, -64, -64, -64, 64, 64, 64, 64, 64, 64, -64, 64, 64, -64, 64, -64, 64, 64, -64, -64, -64, -64, -64, -64, -64, 64, 64, 64, -64, -64, -64, 64, 64, 64, 64, 64, 64, 64, 64, -64, -64, 64, 64, -64, -64, 64, -64, -64, -64, -64, 64, -64, -64, 64, 64, -64, -64, -64, 64, 64, 64, 64, 64, 64, 64, -64, 64, -64, -64, 64, -64, -64, 64, 64, -64, -64, 64, -64, 64, 64, 64, 64, -64, -64, -64, -64, 64, -64, -64, -64, 64, 64, 64, -64, 64, -64, 64, -64, 64, -64, -64, -64, -64, -64, -64, -64, -64, 64, -64, -64, -64, -64, 64, -64, -64, -64, -64, 64, 64, -64, 64, 64, -64, -64, 64, 64, -64, 64, -64, -64, -64, -64, -64, -64, -64, -64, -64, -64, -64, 64, 64, -64, -64, 64, -64, 64, 64, 64, -64, -64, -64, 64, 64, -64, 64, 64, -64, -64, -64, -64, -64, -64, -64, -64, -64, -64, -64, -64, 64, 64, 64, 64, 64, 64, 64, 64, 64, 64, -64, 64, 64, -64, -64, -64, 64, 64, 64, -64, -64, -64, 64, -64, -64, -64, -64, -64, -64, -64, 64, -64, -64, 64, -64, -64, 64, 64, 64, 64, -64, 64, 64, 64, 64, -64, -64, -64, -64, -64, 64, 64, -64, -64, -64, -64, -64, -64, 64, 64, 64, 64, -64, 64, 64, 64, -64, 64, 64, -64, -64, 64, 64, -64, -64, -64, -64, -64, 64, 64, 64, 64, -64, -64, 64, -64, -64, 64, -64, -64, 64, -64, 64, -64, 64, 64, -64, -64, 64, 64, 64, 64, 64, 64, -64, -64, -64, -64, 64, 64, 64, -64, 64, 64, -64, -64, 64, -64, 64, 64, -64, -64, -64, -64, 64, 64, -64, 64, -64, 64, 64, -64, 64, -64, 64, 64, -64, 64, 64, 64, -64, -64, -64, -64, 64, -64, -64, 64, 64, -64, -64, 64, 64, 64, -64, 64, 64, 64, -64, -64, -64, 64, -64, 64, -64, 64, -64, -64, 64, -64, -64, -64, -64, 64, -64, 64, -64, -64, 64, -64, 64, 64, -64, -64, 64, 64, 64, 64, -64, -64, -64, 64, -64, -64, -64, 64, -64, -64, -64, -64, -64, -64, -64, -64, 64, -64, 64, -64, -64, 64, 64, 64, 64, 64, -64, -64, -64, -64, 64, -64, -64, -64, -64, -64, -64, 64, -64, -64, -64, -64, -64, -64, -64, -64, 64, -64, -64, 64, -64, -64, 64, 64, -64, 64, 64, 64, 64, -64, -64, -64, -64, -64, -64, -64, -64, -64, -64, -64, -64, -64, -64, -64, -64, -64, -64, -64, 64, 64, 64, -64, -64, -64, 64, 64, -64, -64, -64, 64, -64, -64, 64, 64, -64, -64, 64, 64, -64, -64, -64, 64, -64, 64, -64, 64, 64, 64, -64, -64, -64, 64, 64, 64, -64, -64, -64, 64, 64, 64, -64, 64, -64, -64, -64, 64, 64, 64, -64, -64, -64, 64, -64, 64, -64, 64, 64, 64, 64, 64, 64, 64, -64, 64, 64, 64, 64, 64, 64, 64, 64, -64, 64, 64, 64, -64, -64, 64, -64, -64, -64, -64, 64, 64, 64, 64, 64, 64, 64, 64, 64, 64, 64, 64, 64, 64, 64, 64, 64, 64, -64, 64, -64, -64, -64, -64, -64, -64, 64, -64, -64, 64, -64, 64, 64, 64, 64, 64, -64, 64, 64, 64, 64, 64, 64, 64, -64, -64, -64, 64, -64, -64, -64, -64, 64, 64, 64, -64, -64, 64, 64, 64, 64, 64, -64, -64, -64, 64, 64, -64, -64, -64, -64, -64, -64, -64, -64, -64, 64, -64, -64, -64, -64, -64, -64, 64, -64, -64, 64, 64, 64, -64, 64, 64, -64, 64, -64, -64, -64, -64, -64, 64, 64, 64, -64, -64, 64, -64, -64, 64, -64, -64, -64, -64, -64, -64, 64, 64, 64, -64, -64, 64, -64, -64, -64, -64, -64, -64, -64, -64, -64, -64, 64, 64, -64, 64, 64, -64, 64, -64, -64, 64, -64, 64, 64, 64, -64, -64, -64, -64, -64, -64, -64, -64, -64, -64, -64, 64, 64, -64, 64, 64, -64, -64, -64, -64, 64, 64, 64, 64, -64, -64, -64, -64, -64, -64, 64, -64, -64, -64, -64, -64, -64, -64, -64, 64, 64, 64, 64, 64, -64, -64, -64, -64, -64, -64, -64, -64, 64, 64, -64, -64, -64, -64, -64, -64, -64, -64, -64, -64, -64, 64, 64, 64, 64, -64, 64, -64, -64, -64, -64, -64, 64, -64, -64, -64, 64, -64, -64, -64, -64, -64, -64, -64, -64, -64, -64, 64, 64, 64, 64, 64, 64, -64, -64, -64, -64, -64, -64, -64, 64, -64, 64, -64, 64, -64, 64, 64, -64, -64, -64, -64, -64, -64, 64, -64, 64, 64, 64, 64, 64, -64, -64, -64, -64, 64, -64, -64, -64, -64, -64, -64, 64, 64, 64, -64, -64, -64, -64, -64, -64, -64, -64, -64, 64, -64, -64, 64, 64, -64, -64, -64, -64, -64, 64, 64, 64, 64, 64, 64, 64, -64, 64, 64, -64, 64, -64, -64, -64, -64, 64, 64, -64, -64, -64, 64, 64, 64, -64, -64, -64, 64, 64, 64, 64, -64, 64, -64, -64, -64, 64, 64, -64, -64, -64, -64, 64, -64, -64, -64, -64, -64, 64, -64, 64, 64, -64, -64, 64, 64, 64, 64, -64, -64, 64, 64, 64, 64, -64, 64, 64, -64, -64, -64, -64, -64, -64, -64, -64, 64, 64, 64, 64, 64, -64, -64, 64, 64, -64, 64, -64, -64, -64, -64, 64, -64, 64, -64, 64, -64, -64, -64, 64, 64, -64, -64, -64, -64, 64, 64, 64, 64, 64, -64, -64, 64, 64, 64, 64, -64, 64, -64, 64, -64, -64, 64, 64, 64, 64, 64, 64, 64, 64, -64, -64, 64, 64, 64, 64, 64, 64, -64, 64, -64, 64, 64, 64, 64, -64, 64, -64, 64, 64, -64, 64, -64, -64, 64, -64, 64, -64, -64, -64, 64, 64, 64, 64, 64, 64, 64, -64, 64, -64, 64, -64, 64, 64, 64, 64, -64, 64, 64, 64, -64, 64, -64, 64, 64, -64, -64, -64, -64, 64, -64, -64, 64, 64, 64, 64, -64, 64, 64, 64, 64, 64, 64, -64, -64, -64, 64, 64, -64, 64, 64, 64, 64, -64, 64, -64, -64, 64, -64, -64, -64, 64, -64, 64, -64, 64, 64, -64, 64, -64, 64, 64, 64, 64, -64, 64, -64, -64, 64, -64, 64, 64, -64, 64, 64, -64, 64, -64, -64, 64, -64, -64, -64, -64, 64, 64, 64, -64, 64, -64, -64, -64, -64, 64, -64, 64, 64, 64, 64, 64, -64, -64, -64, -64, 64, 64, 64, 64, -64, 64, 64, 64, -64, 64, -64, -64, -64, -64, -64, -64, -64, -64, -64, 64, 64, 64, -64, 64, -64, -64, -64, 64, 64, 64, 64, -64, -64, -64, -64, -64, 64, -64, 64, 64, -64, 64, 64, 64, 64, 64, -64, 64, -64, 64, -64, 64, -64, -64, -64, -64, 64, 64, 64, 64, -64, -64, -64, -64, 64, -64, -64, -64, 64, -64, 64, -64, -64, 64, 64, 64, -64, -64, 64, -64, -64, -64, -64, -64, 64, -64, -64, -64, 64, -64, -64, 64, -64, 64, 64, -64, 64, -64, -64, 64, 64, 64, 64, 64, -64, -64, 64, 64, 64, -64, -64, -64, -64, -64, -64, -64, 64, -64, -64, 64, -64, 64, 64, 64, 64, -64, 64, -64, -64, -64, -64, 64, -64, -64, 64, 64, -64, -64, -64, 64, -64, -64, -64, -64, 64, -64, -64, -64, -64, -64, -64, 64, -64, 64, 64, 64, 64, 64, -64, -64, -64, -64, -64, 64, -64, -64, -64, 64, -64, -64, -64, -64, -64, -64, -64, -64, -64, 64, 64, 64, 64, -64, 64, 64, 64, -64, 64, -64, -64, -64, -64, -64, 64, -64, 64, 64, -64, -64, -64, -64, -64, -64, -64, 64, 64, -64, -64, -64, 64, -64, 64, -64, -64, -64, 64, 64, -64, -64, -64, -64, -64, -64, 64, 64, -64, -64, -64, -64, -64, -64, 64, -64, 64, 64, -64, -64, -64, 64, -64, 64, -64, -64, -64, -64, -64, -64, -64, -64, 64, 64, 64, -64, -64, -64, -64, -64, -64, 64, 64, -64, -64, -64, -64, -64, -64, -64, 64, -64, -64, 64, -64, -64, -64, 64, -64, -64, -64, 64, 64, -64, -64, -64, -64, -64, -64, -64, -64, -64, -64, -64, -64, -64, -64, 64, -64, -64, -64, 64, -64, -64, -64, 64, -64, -64, 64, 64, -64, -64, -64, -64, -64, -64, -64, 64, -64, -64, 64, -64, 64, 64, 64, -64, 64, 64, 64, 64, -64, 64, -64, -64, -64, 64, 64, 64, -64, 64, -64, -64, -64, -64, -64, -64, -64, -64, 64, -64, 64, 64, 64, 64, -64, -64, 64, -64, -64, -64, -64, -64, -64, 64, 64, -64, 64, 64, -64, -64, -64, -64, -64, -64, -64, -64, -64, -64, 64, 64, -64, 64, -64, -64, -64, 64, -64, -64, -64, -64, -64, -64, 64, -64, -64, 64, -64, 64, -64, -64, -64, -64, -64, -64, -64, -64, 64, 64, 64, 64, -64, 64, -64, -64, -64, -64, -64, -64, -64, 64, -64, 64, 64, 64, 64, -64, -64, -64, -64, 64, -64, -64, -64, -64, 64, 64, 64, 64, -64, 64, -64, -64, -64, -64, -64, -64, -64, -64, 64, -64, -64, 64, -64, -64, -64, -64, -64, -64, 64, -64, -64, 64, -64, 64, -64, -64, -64, -64, 64, 64, -64, -64, -64, 64, -64, -64, 64, 64, -64, -64, 64, -64, -64, 64, -64, -64, 64, -64, 64, 64, 64, -64, -64, 64, 64, 64, -64, -64, -64, -64, -64, -64, 64, -64, 64, -64, -64, -64, -64, 64, -64, -64, 64, -64, -64, -64, -64, -64, 64, -64, 64, 64, 64, 64, -64, -64, -64, -64, -64, -64, -64, 64, -64, -64, -64, -64, -64, -64, 64, 64, -64, -64, -64, 64, -64, -64, 64, -64, 64, -64, -64, 64, -64, 64, -64, -64, -64, -64, 64, 64, 64, 64, -64, -64, -64, 64, -64, -64, -64, -64, -64, 64, -64, -64, -64, -64, 64, 64, -64, 64, 64, -64, 64, -64, -64, 64, -64, 64, -64, -64, -64, -64, 64, -64, -64, 64, 64, -64, -64, 64, 64, -64, -64, 64, 64, 64, 64, -64, -64, -64, 64, 64, -64, -64, -64, -64, -64, -64, -64, -64, -64, 64, -64, -64, -64, -64, 64, 64, -64, -64, 64, -64, 64, 64, -64, 64, -64, 64, -64, -64, -64, -64, 64, -64, -64, -64, -64, -64, 64, -64, -64, -64, 64, -64, -64, 64, -64, 64, 64, -64, 64, -64, -64, 64, 64, 64, -64, 64, 64, 64, -64, -64, 64, -64, -64, 64, -64, -64, 64, -64, -64, -64, 64, 64, 64, -64, 64, -64, 64, 64, 64, -64, -64, 64, 64, -64, -64, -64, -64, 64, 64, -64, 64, 64, -64, 64, -64, 64, 64, -64, 64, -64, -64, 64, -64, -64, 64, -64, 64, -64, -64, 64, -64, 64, 64, -64, -64, 64, 64, 64, -64, 64, -64, 64, -64, -64, -64, 64, 64, 64, 64, 64, -64, -64, 64, 64, 64, -64, 64, 64, -64, -64, 64, 64, 64, 64, 64, -64, 64, 64, 64, 64, 64, 64, -64, 64, 64, -64, -64, 64, -64, 64, 64, 64, -64, 64, -64, -64, -64, 64, -64, 64, 64, -64, -64, -64, 64, -64, -64, 64, 64, -64, 64, -64, -64, 64, -64, -64, -64, -64, -64, 64, -64, 64, -64, 64, -64, 64, 64, -64, 64, -64, 64, 64, 64, 64, -64, 64, 64, -64, 64, -64, 64, 64, 64, 64, 64, -64, -64, -64, -64, 64, -64, -64, 64, -64, 64, -64, 64, -64, 64, -64, -64, -64, -64, 64, -64, 64, -64, -64, 64, 64, -64, 64, 64, 64, 64, 64, -64, 64, 64, -64, -64, -64, 64, 64, 64, -64, -64, 64, -64, -64, -64, -64, -64, -64, -64, -64, -64, 64, -64, -64, -64, 64, 64, -64, -64, 64, -64, 64, -64, 64, -64, 64, 64, 64, -64, 64, -64, 64, -64, -64, -64, -64, 64, -64, 64, 64, 64, -64, -64, -64, 64, 64, 64, -64, 64, 64, 64, 64, 64, -64, 64, 64, -64, 64, -64, 64, -64, 64, -64, -64, -64, 64, -64, -64, 64, -64, 64, 64, 64, 64, 64, -64, 64, -64, -64, 64, 64, 64, -64, 64, -64, -64, 64, -64, -64, -64, 64, -64, -64, -64, -64, -64, 64, -64, -64, -64, 64, 64, -64, -64, -64, 64, -64, -64, -64, -64, -64, -64, -64, -64, -64, 64, -64, 64, -64, 64, -64, -64, 64, -64, -64, 64, 64, -64, 64, 64, -64, -64, -64, 64, -64, -64, -64, -64, -64, -64, -64, -64, -64, -64, 64, -64, -64, 64, -64, -64, -64, 64, -64, 64, -64, -64, -64, -64, 64, 64, -64, 64, -64, -64, 64, -64, 64, -64, -64, 64, -64, -64, -64, -64, -64, -64, -64, -64, 64, -64, -64, -64, -64, -64, -64, 64, -64, -64, 64, 64, -64, 64, -64, 64, -64, 64, 64, 64, 64, -64, 64, -64, -64, -64, 64, -64, -64, -64, -64, -64, 64, -64, -64, -64, 64, -64, -64, -64, -64, 64, -64, -64, 64, -64, -64, 64, 64, 64, -64, 64, 64, -64, 64, -64, -64, 64, -64, -64, -64, 64, -64, -64, -64, -64, -64, 64, -64, -64, -64, -64, -64, 64, -64, -64, 64, -64, -64, 64, -64, -64, -64, -64, -64, 64, -64, -64, 64, 64, -64, -64, 64, -64, 64, -64, -64, -64, -64, -64, 64, -64, -64, -64, 64, -64, -64, -64, -64, -64, -64, -64, -64, 64, 64, 64, 64, 64, -64, -64, 64, 64, -64, 64, -64, -64, 64, 64, -64, 64, 64, -64, -64, 64, -64, 64, -64, -64, -64, -64, 64, -64, -64, -64, -64, 64, 64, 64, -64, -64, 64, 64, 64, 64, -64, -64, -64, -64, 64, -64, -64, -64, -64, -64, -64, -64, 64, 64, -64, -64, 64, -64, 64, -64, 64, -64, 64, -64, -64, 64, -64, -64, 64, -64, 64, -64, -64, -64, 64, -64, -64, 64, 64, 64, -64, 64, -64, -64, -64, -64, -64, 64, -64, 64, -64, 64, 64, -64, -64, -64, -64, 64, -64, -64, 64, -64, -64, -64, -64, -64, -64, -64, -64, -64, -64, 64, 64, 64, -64, 64, -64, 64, -64, 64, 64, 64, 64, -64, -64, 64, -64, 64, -64, -64, -64, 64, -64, 64, -64, -64, -64, -64, 64, -64, -64, 64, -64, 64, -64, -64, -64, -64, -64, 64, 64, -64, -64, -64, -64, -64, -64, -64, -64, 64, -64, 64, -64, -64, -64, 64, 64, 64, -64, -64, 64, -64, -64, -64, -64, 64, -64, -64, -64, 64, 64, 64, -64, 64, -64, -64, 64, -64, -64, 64, -64, -64, -64, -64, 64, -64, -64, -64, 64, -64, -64, 64, -64, 64, -64, 64, -64, -64, -64, -64, -64, -64, -64, -64, -64, 64, 64, 64, 64, 64, 64, -64, 64, 64, -64, 64, 64, -64, 64, 64, -64, 64, 64, -64, 64, 64, 64, -64, -64, -64, -64, -64, 64, 64, 64, -64, 64, -64, -64, 64, 64, 64, 64, -64, 64, -64, -64, -64, 64, -64, -64, 64, -64, -64, 64, -64, 64, 64, -64, -64, -64, 64, -64, 64, -64, 64, -64, -64, -64, 64, 64, -64, 64, -64, -64, 64, -64, -64, -64, -64, -64, 64, -64, -64, -64, -64, 64, 64, -64, -64, -64, -64, 64, -64, -64, 64, 64, -64, -64, 64, -64, -64, -64, 64, -64, 64, 64, 64, 64, 64, -64, -64, 64, 64, -64, -64, -64, 64, -64, -64, 64, -64, 64, -64, 64, -64, 64, -64, -64, 64, -64, -64, 64, -64, -64, 64, -64, 64, 64, -64, 64, -64, -64, -64, -64, -64, -64, 64, -64, 64, -64, -64, -64, 64, -64, -64, 64, -64, 64, -64, 64, -64, -64, -64, -64, -64, -64, -64, 64, -64, -64, 64, 64, 64, 64, 64, 64, -64, 64, -64, -64, 64, -64, -64, -64, -64, -64, 64, 64, -64, 64, 64, 64, -64, 64, 64, 64, 64, -64, -64, -64, -64, 64, 64, 64, -64, 64, 64, 64, 64, 64, -64, 64, -64, -64, 64, 64, -64, -64, -64, -64, 64, 64, 64, -64, -64, -64, -64, -64, -64, -64, -64, 64, 64, -64, 64, 64, 64, 64, -64, 64, -64, -64, 64, 64, 64, 64, -64, 64, 64, 64, 64, -64, -64, 64, 64, -64, -64, -64, -64, -64, -64, 64, 64, 64, 64, 64, 64, -64, -64, -64, -64, -64, -64, -64, -64, 64, 64, -64, -64, 64, 64, 64, -64, -64, 64, -64, -64, -64, -64, -64, 64, 64, 64, 64, 64, -64, 64, 64, -64, 64, -64, -64, -64, -64, -64, -64, -64, -64, -64, 64, 64, 64, -64, -64, -64, -64, -64, -64, -64, 64, 64, 64, 64, 64, -64, -64, -64, 64, -64, -64, -64, -64, -64, -64, -64, -64, 64, -64, -64, 64, -64, -64, -64, -64, -64, -64, -64, 64, 64, 64, 64, 64, -64, -64, -64, 64, -64, 64, 64, 64, -64, -64, 64, 64, -64, 64, 64, -64, -64, -64, -64, -64, 64, 64, 64, 64, 64, 64, 64, 64, -64, -64, -64, 64, 64, 64, 64, 64, 64, 64, 64, 64, 64, 64, 64, 64, -64, -64, -64, -64, -64, -64, 64, 64, 64, 64, 64, 64, 64, 64, -64, -64, 64, -64, 64, 64, 64, 64, 64, 64, 64, 64, 64, 64, 64, -64, -64, -64, -64, -64, 64, 64, 64, 64, 64, 64, 64, 64, -64, 64, 64, 64, 64, 64, 64, 64, 64, 64, 64, 64, 64, 64, -64, -64, -64, -64, -64, -64, 64, 64, 64, 64, 64, 64, 64, -64, -64, -64, 64, 64, 64, 64, 64, 64, 64, 64, 64, 64, 64, 64, 64, 64, -64, -64, 64, -64, 64, -64, 64, 64, 64, 64, -64, 64, -64, 64, 64, 64, 64, 64, 64, 64, 64, 64, 64, 64, 64, 64, 64, 64, -64, 64, 64, -64, -64, 64, 64, 64, 64, 64, 64, -64, 64, -64, 64, 64, -64, -64, 64, -64, -64, 64, 64, -64, 64, 64, 64, 64, 64, 64, 64, -64, -64, -64, 64, 64, 64, 64, -64, 64, -64, 64, -64, -64, -64, -64, -64, -64, -64, 64, -64, 64, 64, 64, -64, -64, 64, 64, -64, -64, -64, -64, 64, 64, -64, -64, -64, 64, -64, -64, -64, 64, -64, -64, -64, -64, 64, -64, -64, -64, -64, 64, 64, 64, -64, -64, -64, -64, -64, 64, 64, -64, -64, 64, -64, 64, -64, -64, 64, -64, -64, -64, 64, -64, 64, -64, -64, 64, 64, 64, -64, -64, 64, -64, -64, 64, -64, 64, 64, 64, 64, -64, -64, -64, 64, 64, -64, -64, -64, -64, 64, -64, -64, 64, 64, 64, 64, -64, 64, 64, -64, -64, -64, -64, 64, 64, 64, -64, 64, -64, -64, -64, -64, -64, -64, -64, 64, -64, -64, 64, -64, -64, 64, 64, -64, 64, -64, 64, 64, -64, 64, 64, -64, 64, -64, -64, -64, 64, -64, -64, -64, 64, -64, -64, -64, -64, -64, 64, -64, 64, 64, 64, -64, -64, -64, 64, -64, 64, 64, -64, -64, -64, -64, -64, 64, -64, -64, -64, -64, 64, 64, -64, 64, -64, -64, 64, 64, -64, -64, -64, 64, -64, 64, 64, 64, 64, 64, 64, 64, 64, -64, -64, -64, -64, 64, 64, -64, -64, -64, -64, -64, 64, 64, -64, 64, 64, 64, 64, 64, 64, 64, 64, 64, 64, 64, 64, 64, 64, -64, -64, -64, 64, 64, -64, 64, -64, 64, -64, -64, -64, -64, -64, -64, 64, -64, -64, -64, 64, 64, 64, 64, 64, 64, 64, 64, 64, 64, -64, -64, 64, -64, -64, -64, 64, -64, -64, -64, -64, -64, 64, 64, 64, 64, -64, 64, 64, 64, 64, -64, 64, 64, 64, 64, 64, 64, 64, 64, -64, -64, -64, -64, -64, -64, -64, -64, -64, -64, 64, -64, -64, -64, -64, -64, 64, -64, 64, -64, 64, 64, 64, 64, -64, 64, 64, 64, -64, 64, -64, -64, -64, -64, -64, -64, -64, -64, -64, -64, -64, -64, 64, 64, -64, -64, 64, 64, 64, -64, 64, -64, 64, -64, -64, 64, 64, -64, -64, 64, -64, 64, -64, 64, -64, -64, -64, 64, -64, 64, 64, -64, 64, 64, 64, -64, 64, -64, 64, -64, -64, 64, 64, -64, -64, 64, 64, -64, 64, -64, -64, -64, 64, 64, 64, 64, -64, 64, 64, -64, 64, -64, -64, -64, 64, 64, -64, 64, 64, 64, 64, 64, 64, -64, -64, 64, -64, -64, 64, 64, -64, 64, 64, 64, -64, 64, -64, 64, 64, -64, 64, -64, -64, 64, 64, 64, 64, -64, 64, 64, -64, 64, -64, -64, -64, 64, -64, 64, -64, 64, -64, 64, 64, 64, 64, 64, -64, -64, -64, 64, -64, -64, -64, 64, 64, 64, 64, 64, -64, 64, 64, -64, -64, 64, -64, 64, 64, 64, 64, -64, -64, 64, 64, -64, -64, -64, -64, -64, -64, -64, -64, -64, 64, -64, 64, -64, -64, 64, -64, -64, -64, 64, 64, -64, 64, 64, 64, -64, 64, 64, 64, -64, -64, -64, -64, -64, -64, 64, 64, -64, 64, 64, 64, -64, -64, -64, -64, -64, -64, -64, 64, -64, 64, 64, 64, 64, -64, 64, 64, -64, 64, 64, -64, 64, -64, -64, -64, -64, 64, 64, 64, 64, 64, 64, 64, -64, -64, -64, 64, -64, 64, 64, 64, 64, 64, 64, -64, -64, 64, 64, -64, -64, -64, -64, -64, -64, -64, 64, 64, 64, 64, 64, 64, -64, -64, -64, 64, 64, -64, -64, -64, -64, 64, 64, -64, -64, -64, -64, -64, -64, -64, -64, -64, -64, 64, -64, -64, 64, 64, -64, 64, -64, 64, -64, 64, -64, -64, -64, -64, 64, 64, -64, -64, -64, -64, -64, -64, -64, -64, -64, -64, -64, -64, -64, 64, 64, 64, -64, 64, -64, 64, -64, 64, -64, -64, -64, 64, 64, -64, -64, -64, -64, -64, -64, -64, -64, -64, -64, -64, -64, -64, -64, -64, 64, 64, -64, 64, 64, -64, -64, 64, -64, -64, -64, -64, -64, -64, -64, -64, -64, -64, -64, -64, -64, -64, -64, -64, -64, -64, -64, -64, 64, 64, 64, 64, -64, -64, 64, 64, 64, -64, -64, -64, 64, 64, -64, -64, -64, -64, -64, -64, -64, -64, -64, -64, -64, 64, -64, -64, 64, 64, -64, -64, -64, -64, 64, 64, 64, -64, -64, 64, 64, -64, -64, 64, 64, 64, -64, -64, -64, -64, -64, 64, -64, -64, -64, -64, -64, -64, -64, 64, 64, 64, 64, 64, 64, -64, -64, 64, 64, -64, -64, 64, -64, 64, -64, -64, -64, 64, -64, 64, -64, -64, -64, -64, -64, 64, -64, 64, 64, 64, 64, -64, 64, 64, -64, 64, -64, -64, 64, 64, -64, 64, 64, -64, 64, 64, -64, -64, -64, -64, -64, -64, -64, 64, 64, 64, 64, -64, 64, -64, 64, -64, -64, -64, -64, 64, 64, 64, -64, -64, 64, -64, -64, -64, 64, 64, 64, -64, -64, -64, -64, 64, -64, -64, 64, -64, -64, 64, -64, -64, 64, -64, -64, -64, -64, -64, -64, -64, -64, -64, 64, -64, 64, 64, 64, -64, -64, -64, 64, -64, 64, -64, 64, 64, -64, 64, -64, -64, -64, -64, -64, -64, -64, 64, -64, -64, 64, 64, 64, 64, -64, -64, 64, -64, -64, -64, -64, 64, 64, 64, 64, -64, 64, 64, -64, -64, -64, -64, -64, -64, -64, 64, -64, -64, 64, 64, 64, 64, -64, -64, -64, -64, 64, -64, 64, 64, 64, 64, -64, -64, -64, 64, -64, 64, -64, -64, -64, -64, -64, -64, -64, -64, -64, 64, 64, 64, 64, 64, 64, 64, -64, -64, -64, 64, -64, -64, -64, -64, -64, -64, 64, 64, -64, 64, -64, -64, -64, -64, -64, -64, -64, 64, 64, -64, -64, -64, -64, 64, -64, 64, 64, 64, -64, 64, 64, -64, 64, -64, -64, -64, -64, 64, -64, -64, -64, -64, -64, -64, -64, 64, 64, 64, 64, -64, -64, 64, -64, 64, -64, 64, -64, -64, -64, 64, -64, -64, -64, -64, 64, -64, -64, -64, -64, -64, -64, -64, -64, 64, 64, 64, 64, 64, 64, 64, 64, 64, -64, -64, 64, -64, 64, 64, 64, -64, -64, -64, -64, -64, -64, 64, -64, -64, 64, -64, -64, -64, 64, 64, 64, 64, 64, 64, 64, 64, 64, -64, -64, -64, -64, -64, -64, -64, 64, -64, -64, -64, -64, -64, -64, -64, -64, -64, -64, -64, 64, 64, -64, 64, 64, -64, 64, -64, -64, -64, 64, -64, 64, 64, -64, -64, 64, 64, -64, -64, 64, -64, -64, -64, -64, 64, -64, 64, -64, 64, -64, -64, 64, -64, 64, -64, -64, 64, 64, 64, -64, 64, -64, 64, 64, -64, -64, -64, 64, -64, -64, -64, -64, 64, 64, 64, 64, 64, -64, 64, -64, 64, -64, 64, -64, -64, -64, -64, 64, -64, -64, -64, 64, -64, 64, 64, -64, 64, -64, 64, 64, 64, 64, 64, -64, 64, -64, -64, -64, 64, -64, 64, -64, 64, -64, 64, -64, -64, 64, -64, 64, -64, -64, 64, -64, 64, 64, -64, 64, 64, -64, -64, -64, 64, -64, -64, 64, -64, -64, -64, -64, 64, -64, 64, -64, 64, -64, 64, 64, 64, 64, 64, 64, 64, 64, 64, -64, 64, -64, -64, -64, 64, -64, -64, 64, -64, 64, -64, 64, -64, -64, -64, -64, 64, -64, 64, 64, 64, 64, -64, -64, -64, -64, -64, 64, 64, 64, -64, 64, 64, 64, 64, 64, 64, 64, -64, -64, -64, 64, 64, -64, -64, -64, 64, -64, -64, 64, 64, -64, -64, 64, -64, -64, 64, 64, 64, 64, 64, 64, 64, 64, 64, 64, 64, 64, 64, 64, -64, 64, 64, -64, 64, -64, -64, -64, -64, -64, -64, -64, -64, 64, -64, 64, 64, 64, 64, 64, 64, 64, 64, 64, -64, 64, 64, 64, -64, 64, -64, -64, -64, -64, -64, 64, -64, -64, -64, -64, -64, -64, -64, 64, 64, 64, 64, 64, 64, 64, 64, 64, 64, -64, 64, 64, -64, -64, 64, 64, -64, -64, -64, -64, -64, -64, -64, -64, -64, -64, -64, -64, 64, -64, 64, 64, 64, 64, 64, 64, 64, 64, 64, -64, 64, 64, 64, 64, -64, -64, -64, -64, -64, -64, -64, -64, 64, -64, 64, 64, 64, -64, 64, 64, 64, 64, 64, 64, 64, 64, 64, 64, -64, -64, -64, -64, -64, -64, -64, -64, -64, -64, -64, -64, 64, -64, -64, -64, 64, 64, 64, 64, 64, 64, -64, 64, 64, 64, 64, 64, -64, -64, -64, 64, -64, -64, -64, -64, 64, -64, 64, 64, 64, -64, 64, -64, 64, -64, -64, 64, 64, 64, 64, 64, 64, 64, 64, -64, -64, -64, 64, -64, -64, -64, -64, 64, 64, 64, 64, 64, -64, 64, 64, -64, -64, 64, 64, 64, 64, 64, 64, 64, 64, 64, 64, -64, 64, 64, 64, -64, -64, -64, -64, 64, 64, 64, 64, 64, 64, 64, 64, 64, 64, 64, 64, 64, 64, 64, 64, 64, 64, -64, -64, -64, -64, -64, -64, 64, -64, -64, -64, 64, -64, 64, 64, -64, 64, 64, 64, 64, 64, 64, -64, -64, -64, 64, -64, 64, 64, 64, 64, -64, -64, 64, 64, 64, -64, -64, -64, -64, 64, -64, 64, -64, 64, -64, 64, 64, 64, -64, 64, -64, -64, -64, -64, -64, 64, 64, 64, -64, 64, 64, 64, 64, -64, 64, -64, 64, 64, -64, -64, -64, -64, -64, 64, 64, 64, 64, -64, -64, 64, -64, -64, -64, 64, -64, -64, -64, 64, -64, -64, -64, -64, -64, -64, 64, 64, -64, 64, 64, -64, -64, -64, -64, 64, -64, 64, 64, -64, -64, -64, -64, -64, -64, -64, -64, -64, -64, 64, -64, -64, -64, -64, 64, 64, -64, -64, -64, -64, -64, -64, -64, 64, 64, 64, -64, -64, -64, -64, -64, -64, -64, -64, 64, -64, -64, -64, -64, -64, -64, -64, 64, -64, -64, 64, 64, 64, -64, 64, -64, 64, 64, -64, -64, -64, -64, -64, -64, -64, -64, 64, -64, -64, -64, -64, -64, -64, -64, -64, 64, 64, 64, 64, -64, 64, 64, 64, 64, 64, 64, 64, -64, -64, -64, -64, -64, -64, -64, 64, -64, 64, 64, 64, 64, -64, -64, -64, -64, 64, 64, 64, -64, 64, 64, 64, 64, 64, 64, 64, 64, -64, -64, -64, -64, -64, -64, -64, -64, -64, 64, -64, -64, -64, -64, -64, -64, 64, 64, -64, 64, 64, 64, 64, 64, 64, 64, 64, -64, -64, -64, -64, -64, -64, -64, -64, 64, 64, -64, 64, -64, -64, -64, -64, 64, 64, 64, 64, -64, 64, 64, 64, 64, 64, 64, 64, -64, -64, -64, -64, -64, -64, -64, 64, 64, 64, 64, 64, -64, 64, 64, 64, -64, 64, 64, 64, 64, 64, 64, -64, 64, 64, 64, -64, -64, -64, -64, -64, -64, -64, -64, 64, -64, 64, -64, 64, -64, -64, -64, -64, 64, 64, 64, 64, 64, -64, -64, 64, 64, 64, 64, -64, -64, -64, -64, -64, -64, -64, 64, 64, 64, -64, -64, -64, 64, -64, -64, 64, 64, 64, -64, -64, 64, 64, 64, 64, -64, 64, 64, -64, -64, -64, -64, 64, -64, -64, 64, -64, 64, -64, -64, 64, -64, 64, 64, -64, 64, -64, -64, 64, -64, -64, 64, 64, 64, -64, 64, 64, -64, -64, 64, 64, 64, -64, 64, 64, -64, 64, -64, 64, 64, -64, 64, -64, -64, -64, -64, -64, -64, -64, 64, -64, 64, -64, 64, -64, -64, -64, 64, 64, -64, -64, -64, -64, 64, -64, 64, 64, 64, 64, -64, -64, -64, 64, -64, 64, 64, -64, -64, -64, 64, 64, -64, -64, -64, 64, 64, -64, -64, -64, -64, -64, -64, -64, -64, 64, -64, -64, -64, -64, 64, -64, 64, 64, -64, 64, -64, 64, -64, -64, -64, -64, 64, 64, 64, -64, 64, -64, -64, 64, -64, 64, -64, 64, 64, -64, 64, 64, -64, -64, -64, 64, 64, -64, -64, 64, -64, 64, -64, -64, -64, -64, -64, 64, 64, -64, 64, -64, -64, 64, 64, 64, 64, -64, -64, 64, 64, 64, -64, -64, 64, 64, 64, 64, -64, 64, 64, 64, 64, 64, 64, 64, 64, -64, 64, -64, -64, -64, -64, -64, -64, 64, 64, -64, -64, 64, -64, -64, 64, -64, 64, 64, 64, 64, 64, 64, 64, -64, 64, -64, 64, 64, -64, -64, 64, -64, -64, -64, -64, -64, 64, 64, 64, 64, -64, 64, 64, 64, 64, -64, 64, 64, -64, 64, -64, -64, -64, 64, -64, 64, -64, 64, -64, -64, 64, -64, 64, -64, 64, 64, -64, -64, -64, -64, -64, -64, -64, -64, 64, 64, 64, -64, 64, 64, -64, 64, 64, -64, 64, 64, -64, 64, 64, -64, 64, 64, 64, -64, 64, 64, -64, -64, -64, -64, -64, -64, 64, -64, -64, -64, -64, 64, -64, 64, 64, 64, -64, 64, -64, -64, -64, -64, -64, -64, -64, 64, -64, -64, -64, -64, -64, -64, -64, -64, 64, -64, 64, -64, -64, -64, -64, -64, 64, -64, -64, 64, -64, -64, 64, -64, -64, 64, 64, 64, -64, -64, -64, -64, -64, -64, 64, -64, -64, -64, 64, -64, -64, -64, -64, -64, -64, -64, -64, -64, 64, -64, 64, -64, -64, 64, 64, -64, -64, -64, -64, -64, -64, -64, 64, 64, -64, -64, -64, -64, -64, -64, -64, -64, -64, -64, 64, 64, -64, -64, 64, 64, -64, -64, -64, -64, 64, -64, -64, -64, -64, 64, 64, 64, -64, 64, -64, -64, -64, -64, -64, -64, -64, -64, -64, 64, -64, 64, -64, 64, -64, -64, -64, -64, -64, -64, -64, -64, -64, -64, 64, 64, 64, 64, 64, -64, -64, -64, -64, -64, -64, -64, -64, 64, 64, 64, 64, -64, -64, 64, -64, -64, -64, -64, -64, 64, 64, 64, 64, -64, -64, -64, 64, -64, -64, -64, -64, -64, -64, -64, -64, 64, -64, -64, -64, 64, -64, -64, -64, -64, -64, -64, 64, -64, 64, 64, 64, 64, 64, -64, -64, -64, 64, -64, -64, 64, -64, -64, 64, 64, 64, 64, -64, 64, -64, -64, -64, -64, -64, 64, -64, -64, 64, -64, -64, 64, -64, -64, 64, -64, -64, 64, 64, -64, -64, -64, 64, 64, -64, 64, -64, 64, 64, 64, 64, 64, 64, -64, -64, -64, -64, 64, 64, 64, -64, -64, -64, -64, 64, -64, 64, 64, -64, 64, 64, -64, 64, -64, 64, -64, 64, 64, 64, -64, 64, -64, 64, -64, -64, 64, -64, -64, -64, -64, -64, 64, 64, 64, 64, -64, -64, 64, -64, 64, -64, 64, 64, 64, 64, 64, 64, 64, 64, 64, -64, -64, -64, -64, -64, -64, -64, -64, 64, 64, 64, -64, 64, 64, 64, -64, -64, 64, -64, 64, 64, -64, 64, 64, 64, 64, 64, 64, 64, 64, 64, 64, -64, -64, 64, -64, 64, 64, 64, -64, 64, 64, 64, -64, 64, -64, -64, -64, 64, 64, 64, 64, 64, 64, -64, -64, 64, 64, 64, 64, 64, 64, -64, 64, 64, -64, 64, -64, 64, 64, 64, 64, 64, 64, 64, -64, -64, 64, 64, -64, 64, 64, -64, 64, -64, 64, 64, 64, 64, 64, 64, -64, 64, 64, -64, 64, -64, -64, -64, 64, -64, 64, 64, 64, -64, 64, 64, -64, 64, 64, -64, -64, -64, -64, -64, 64, -64, 64, -64, -64, 64, -64, 64, 64, -64, -64, 64, 64, -64, -64, -64, -64, -64, -64, -64, -64, -64, -64, -64, -64, -64, -64, -64, -64, 64, -64, -64, -64, -64, -64, 64, -64, 64, -64, 64, 64, 64, 64, -64, -64, -64, -64, 64, -64, 64, -64, -64, -64, -64, -64, -64, 64, -64, -64, -64, -64, -64, 64, -64, -64, -64, -64, -64, -64, -64, 64, -64, -64, 64, 64, -64, -64, -64, 64, 64, 64, -64, 64, 64, 64, -64, -64, 64, -64, -64, -64, -64, -64, -64, -64, 64, -64, -64, 64, 64, 64, 64, -64, 64, 64, -64, -64, 64, -64, -64, -64, 64, -64, 64, 64, -64, 64, 64, 64, -64, -64, -64, 64, -64, -64, -64, -64, -64, 64, -64, -64, -64, 64, 64, -64, -64, -64, 64, 64, 64, -64, -64, -64, 64, -64, -64, -64, -64, -64, -64, 64, 64, -64, 64, 64, 64, -64, 64, -64, -64, 64, 64, 64, -64, 64, 64, -64, -64, 64, -64, 64, 64, 64, 64, 64, 64, 64, -64, 64, 64, 64, 64, 64, -64, -64, -64, -64, -64, 64, 64, 64, -64, 64, -64, -64, -64, -64, 64, 64, 64, -64, -64, -64, 64, 64, -64, 64, 64, -64, -64, -64, -64, 64, 64, -64, -64, -64, 64, 64, 64, -64, 64, -64, -64, 64, -64, 64, -64, 64, 64, 64, 64, -64, 64, -64, 64, -64, -64, 64, 64, 64, -64, 64, -64, 64, 64, 64, 64, -64, 64, 64, -64, -64, 64, 64, -64, -64, 64, -64, -64, -64, -64, -64, -64, 64, -64, 64, 64, -64, 64, -64, -64, 64, 64, -64, 64, 64, 64, 64, 64, 64, 64, 64, 64, -64, -64, 64, -64, 64, 64, 64, 64, 64, 64, 64, -64, 64, -64, -64, 64, 64, 64, -64, -64, 64, 64, -64, 64, 64, 64, 64, -64, 64, 64, 64, 64, 64, 64, 64, 64, 64, 64, -64, -64, 64, -64, -64, 64, 64, 64, 64, -64, -64, -64, -64, -64, -64, 64, -64, -64, 64, 64, 64, 64, 64, 64, 64, 64, -64, 64, 64, 64, -64, -64, -64, 64, -64, 64, 64, 64, 64, 64, -64, -64, 64, 64, -64, 64, 64, -64, 64, 64, -64, 64, 64, -64, 64, -64, 64, 64, 64, 64, -64, 64, 64, 64, 64, -64, -64, -64, 64, -64, 64, -64, -64, -64, 64, -64, -64, -64, -64, 64, -64, -64, -64, -64, 64, 64, 64, -64, -64, -64, -64, 64, -64, -64, -64, -64, -64, 64, -64, -64, -64, -64, -64, -64, -64, -64, -64, -64, -64, -64, -64, -64, -64, -64, 64, -64, -64, 64, 64, 64, 64, -64, -64, -64, -64, -64, -64, -64, 64, -64, -64, -64, -64, -64, -64, -64, -64, -64, -64, 64, -64, -64, 64, -64, -64, 64, 64, 64, 64, -64, -64, -64, 64, -64, -64, 64, 64, 64, 64, 64, -64, 64, -64, -64, -64, -64, 64, 64, 64, -64, -64, 64, -64, 64, 64, 64, -64, -64, -64, -64, -64, -64, -64, 64, 64, 64, 64, 64, 64, 64, -64, -64, -64, -64, 64, 64, -64, 64, 64, -64, -64, 64, 64, 64, 64, -64, -64, -64, -64, -64, 64, 64, 64, 64, -64, 64, 64, -64, -64, -64, -64, -64, -64, -64, -64, 64, 64, 64, -64, 64, 64, 64, -64, -64, -64, -64, -64, -64, -64, -64, 64, 64, 64, 64, -64, 64, 64, -64, -64, -64, -64, 64, -64, -64, -64, -64, 64, 64, 64, 64, -64, -64, -64, 64, 64, -64, -64, -64, 64, -64, -64, 64, -64, 64, 64, 64, 64, -64, -64, 64, 64, 64, 64, -64, 64, 64, -64, -64, -64, -64, -64, -64, -64, -64, -64, -64, 64, -64, -64, -64, -64, 64, 64, 64, -64, -64, -64, 64, -64, -64, -64, -64, -64, 64, -64, -64, -64, -64, -64, -64, -64, -64, -64, -64, -64, -64, -64, -64, 64, 64, 64, 64, 64, -64, 64, -64, 64, -64, -64, 64, 64, 64, -64, 64, 64, -64, 64, -64, -64, -64, -64, -64, 64, -64, -64, -64, 64, 64, 64, -64, 64, -64, 64, -64, 64, -64, 64, 64, 64, -64, 64, 64, -64, 64, -64, -64, -64, -64, -64, 64, -64, -64, -64, -64, 64, 64, 64, -64, -64, -64, -64, -64, -64, -64, 64, -64, -64, -64, 64, 64, 64, 64, -64, -64, -64, -64, -64, -64, -64, -64, -64, 64, 64, 64, -64, -64, -64, -64, -64, -64, -64, -64, -64, -64, -64, 64, 64, 64, 64, 64, 64, 64, -64, -64, 64, -64, -64, -64, 64, -64, 64, 64, 64, -64, -64, -64, -64, 64, 64, 64, 64, 64, 64, 64, 64, -64, 64, 64, 64, 64, 64, -64, -64, -64, 64, 64, 64, 64, -64, 64, -64, -64, -64, -64, -64, 64, 64, -64, -64, -64, 64, -64, -64, 64, 64, 64, 64, 64, 64, 64, 64, -64, -64, 64, 64, 64, -64, -64, -64, -64, -64, -64, 64, 64, -64, 64, 64, 64, -64, -64, -64, -64, -64, -64, 64, -64, 64, -64, -64, -64, -64, -64, -64, -64, -64, -64, -64, -64, -64, -64, -64, -64, 64, 64, -64, 64, -64, 64, 64, -64, -64, -64, -64, -64, -64, -64, -64, -64, -64, -64, -64, -64, -64, 64, -64, -64, -64, -64, 64, -64, 64, 64, -64, -64, -64, 64, 64, 64, -64, -64, 64, -64, -64, -64, 64, 64, -64, 64, 64, -64, 64, 64, 64, 64, -64, 64, -64, -64, 64, 64, -64, 64, 64, 64, 64, -64, -64, 64, 64, -64, 64, -64, 64, -64, -64, 64, 64, 64, 64, 64, -64, 64, 64, -64, -64, -64, 64, -64, -64, 64, 64, -64, -64, 64, 64, -64, 64, -64, -64, 64, 64, 64, 64, -64, 64, 64, 64, 64, -64, 64, 64, -64, 64, 64, 64, -64, 64, -64, 64, 64, -64, -64, 64, 64, 64, -64, -64, 64, 64, 64, 64, 64, 64, 64, 64, 64, 64, 64, -64, -64, -64, -64, 64, -64, 64, 64, 64, -64, 64, 64, 64, -64, -64, 64, -64, -64, 64, 64, 64, -64, -64, -64, -64, -64, 64, -64, 64, 64, -64, -64, 64, 64, 64, 64, 64, 64, -64, 64, -64, -64, -64, -64, 64, 64, 64, -64, -64, -64, -64, -64, 64, -64, 64, -64, -64, -64, 64, -64, 64, 64, 64, -64, 64, -64, 64, -64, -64, 64, 64, -64, -64, -64, 64, -64, -64, -64, -64, -64, -64, 64, 64, 64, -64, -64, 64, -64, 64, -64, -64, 64, 64, 64, -64, -64, -64, -64, -64, -64, -64, -64, -64, -64, -64, -64, -64, -64, -64, -64, -64, 64, 64, 64, -64, -64, -64, 64, -64, 64, -64, -64, -64, 64, 64, 64, -64, 64, 64, 64, 64, 64, 64, -64, -64, 64, 64, 64, -64, 64, 64, -64, 64, 64, 64, -64, -64, 64, 64, 64, 64, 64, 64, 64, 64, 64, 64, 64, 64, 64, -64, -64, -64, -64, 64, 64, 64, -64, -64, 64, 64, -64, -64, -64, 64, -64, -64, 64, -64, 64, 64, 64, 64, 64, 64, 64, 64, -64, -64, -64, -64, 64, 64, -64, 64, 64, -64, 64, 64, 64, 64, -64, -64, 64, 64, 64, -64, -64, -64, -64, 64, -64, 64, 64, 64, 64, -64, -64, -64, -64, 64, 64, 64, 64, 64, -64, 64, 64, 64, -64, 64, -64, -64, 64, -64, -64, 64, 64, 64, -64, -64, 64, -64, 64, -64, -64, -64, 64, 64, 64, 64, 64, -64, -64, -64, 64, -64, -64, -64, 64, -64, 64, 64, -64, -64, -64, 64, 64, -64, -64, 64, 64, -64, -64, -64, 64, -64, -64, -64, -64, 64, -64, -64, -64, -64, 64, 64, 64, 64, 64, 64, 64, 64, 64, 64, 64, 64, 64, 64, -64, -64, -64, -64, 64, -64, -64, -64, -64, -64, -64, -64, -64, 64, -64, -64, 64, -64, -64, 64, -64, 64, 64, 64, 64, 64, 64, 64, -64, -64, -64, -64, -64, 64, 64, 64, 64, -64, -64, -64, 64, -64, 64, -64, 64, 64, -64, -64, 64, 64, 64, 64, 64, 64, 64, -64, -64, -64, 64, -64, -64, 64, 64, -64, -64, 64, -64, -64, 64, -64, 64, 64, -64, 64, 64, -64, 64, 64, 64, 64, 64, 64, -64, 64, -64, -64, -64, 64, 64, 64, 64, -64, -64, 64, -64, -64, 64, -64, 64, 64, -64, -64, -64, 64, 64, 64, 64, 64, 64, 64, 64, 64, 64, 64, 64, 64, 64, 64, 64, -64, -64, 64, 64, 64, 64, 64, -64, 64, 64, -64, -64, -64, 64, 64, 64, 64, 64, 64, 64, 64, -64, -64, -64, 64, 64, 64, 64, 64, -64, 64, 64, 64, 64, -64, -64, -64, -64, 64, -64, -64, 64, 64, -64, 64, 64, 64, 64, 64, 64, 64, -64, 64, 64, 64, -64, 64, 64, 64, 64, 64, 64, 64, 64, -64, -64, -64, -64, -64, -64, -64, 64, 64, -64, 64, 64, 64, 64, 64, -64, -64, 64, 64, -64, -64, 64, 64, 64, 64, -64, 64, 64, 64, 64, -64, 64, -64, -64, -64, -64, -64, 64, -64, -64, -64, -64, -64, 64, 64, 64, -64, 64, -64, 64, 64, 64, -64, 64, -64, -64, 64, 64, -64, -64, 64, -64, -64, -64, -64, -64, 64, -64, -64, -64, -64, -64, -64, 64, 64, -64, 64, 64, 64, 64, -64, -64, 64, -64, 64, 64, -64, 64, 64, -64, -64, -64, -64, -64, -64, -64, -64, -64, 64, 64, 64, 64, 64, 64, 64, 64, 64, 64, 64, 64, -64, 64, -64, 64, -64, 64, 64, -64, -64, -64, -64, 64, -64, -64, -64, 64, 64, 64, 64, 64, 64, -64, 64, 64, 64, -64, 64, -64, 64, -64, 64, -64, 64, -64, 64, 64, 64, 64, 64, 64, 64, 64, 64, 64, 64, 64, 64, -64, 64, 64, 64, 64, -64, -64, -64, -64, 64, 64, 64, -64, -64, -64, 64, 64, 64, 64, 64, 64, -64, 64, -64, -64, 64, 64, 64, 64, 64, 64, -64, -64, 64, -64, -64, 64, -64, -64, -64, 64, 64, 64, 64, 64, -64, -64, 64, -64, -64, 64, -64, -64, 64, 64, 64, -64, 64, 64, -64, -64, -64, 64, -64, 64, 64, 64, -64, 64, 64, 64, -64, -64, -64, 64, 64, 64, -64, 64, -64, -64, -64, -64, -64, -64, 64, 64, 64, -64, -64, 64, -64, -64, 64, 64, -64, 64, 64, -64, 64, -64, -64, 64, 64, 64, -64, 64, -64, -64, -64, -64, 64, -64, -64, -64, -64, 64, -64, 64, -64, -64, 64, 64, -64, -64, 64, 64, 64, 64, -64, -64, -64, 64, -64, 64, 64, -64, 64, 64, -64, 64, 64, 64, -64, 64, -64, -64, 64, -64, 64, -64, -64, 64, 64, -64, 64, 64, -64, -64, -64, 64, -64, 64, 64, 64, 64, 64, 64, 64, 64, -64, -64, -64, -64, 64, -64, 64, -64, -64, 64, -64, 64, 64, 64, 64, 64, 64, 64, 64, -64, 64, 64, 64, 64, 64, -64, -64, 64, 64, 64, -64, 64, -64, -64, -64, -64, 64, -64, 64, -64, 64, -64, -64, -64, -64, 64, 64, 64, 64, 64, 64, 64, 64, -64, -64, -64, 64, -64, -64, 64, -64, 64, 64, 64, -64, 64, 64, 64, -64, 64, -64, 64, -64, 64, 64, -64, 64, 64, 64, 64, -64, -64, -64, -64, 64, 64, -64, -64, 64, -64, -64, -64, -64, 64, -64, -64, 64, 64, 64, 64, 64, 64, 64, -64, -64, -64, -64, -64, 64, 64, 64, 64, 64, -64, -64, -64, 64, 64, -64, -64, -64, -64, -64, 64, -64, 64, -64, 64, 64, 64, 64, 64, 64, 64, 64, 64, 64, -64, 64, -64, -64, -64, -64, -64, -64, -64, 64, 64, -64, 64, -64, -64, -64, 64, -64, 64, 64, 64, 64, 64, 64, 64, 64, -64, 64, -64, 64, -64, 64, 64, -64, -64, 64, -64, -64, -64, 64, 64, 64, 64, 64, -64, -64, -64, 64, 64, 64, 64, 64, 64, 64, 64, 64, -64, 64, -64, -64, -64, 64, -64, 64, 64, 64, 64, 64, 64, 64, -64, -64, 64, -64, 64, 64, 64, 64, 64, 64, 64, 64, 64, -64, -64, -64, -64, -64, -64, 64, 64, 64, 64, 64, 64, 64, 64, 64, -64, 64, -64, -64, 64, 64, -64, 64, 64, 64, 64, 64, -64, -64, -64, -64, -64, 64, 64, -64, 64, -64, 64, -64, -64, 64, 64, -64, -64, 64, -64, 64, 64, 64, 64, 64, 64, 64, -64, -64, -64, -64, -64, -64, -64, 64, 64, 64, 64, 64, -64, -64, -64, -64, 64, -64, 64, -64, 64, 64, 64, -64, 64, -64, -64, -64, -64, -64, -64, -64, -64, -64, -64, -64, 64, 64, 64, -64, 64, -64, 64, -64, 64, -64, 64, -64, -64, -64, 64, 64, -64, -64, -64, -64, -64, -64, -64, -64, -64, 64, -64, 64, -64, 64, 64, -64, 64, -64, 64, 64, -64, -64, -64, 64, -64, 64, 64, 64, -64, -64, -64, -64, -64, -64, -64, -64, -64, 64, -64, 64, 64, 64, 64, 64, -64, 64, 64, -64, -64, 64, 64, 64, 64, 64, 64, 64, -64, -64, -64, -64, 64, 64, 64, 64, -64, -64, -64, 64, 64, 64, 64, 64, 64, 64, 64, 64, -64, -64, -64, -64, 64, 64, 64, 64, 64, 64, 64, 64, 64, 64, 64, -64, -64, -64, -64, -64, 64, 64, 64, 64, 64, 64, -64, -64, 64, -64, -64, -64, -64, 64, 64, 64, 64, 64, 64, 64, 64, -64, 64, -64, -64, -64, -64, 64, 64, 64, 64, 64, 64, 64, 64, -64, 64, 64, 64, -64, -64, -64, 64, 64, 64, 64, 64, 64, 64, -64, 64, -64, -64, -64, 64, 64, 64, 64, 64, 64, 64, 64, 64, -64, -64, -64, 64, -64, -64, -64, 64, -64, 64, 64, 64, 64, -64, -64, -64, -64, -64, 64, -64, 64, 64, 64, 64, 64, 64, 64, -64, -64, -64, 64, 64, -64, -64, -64, -64, 64, 64, 64, -64, -64, -64, -64, -64, 64, 64, 64, 64, 64, 64, 64, 64, 64, 64, 64, 64, -64, 64, 64, 64, -64, -64, -64, 64, 64, 64, -64, 64, -64, 64, 64, 64, -64, 64, 64, 64, 64, 64, 64, 64, 64, 64, -64, -64, 64, -64, -64, -64, -64, -64, -64, 64, 64, 64, 64, -64, -64, -64, -64, -64, 64, 64, 64, 64, 64, 64, 64, 64, 64, 64, 64, 64, 64, 64, -64, -64, -64, -64, -64, -64, 64, -64, -64, -64, -64, -64, 64, 64, 64, 64, 64, 64, -64, 64, 64, 64, 64, -64, -64, -64, 64, -64, -64, -64, -64, -64, -64, -64, -64, 64, -64, 64, -64, -64, 64, 64, 64, 64, 64, -64, -64, -64, -64, 64, -64, 64, -64, 64, 64, -64, -64, -64, 64, 64, 64, 64, 64, -64, 64, -64, -64, -64, -64, 64, 64, 64, -64, 64, 64, 64, 64, 64, -64, -64, 64, -64, -64, -64, -64, 64, -64, 64, 64, 64, 64, 64, 64, -64, -64, -64, -64, -64, -64, 64, -64, -64, 64, 64, -64, 64, 64, 64, 64, -64, 64, -64, 64, -64, -64, -64, -64, -64, 64, 64, -64, 64, 64, -64, -64, 64, 64, 64, 64, 64, 64, 64, -64, -64, -64, -64, 64, -64, -64, -64, 64, -64, 64, 64, 64, -64, 64, -64, -64, -64, -64, -64, 64, -64, -64, 64, 64, 64, 64, 64, -64, -64, -64, 64, 64, 64, -64, 64, 64, -64, 64, 64, 64, -64, -64, -64, 64, -64, -64, 64, 64, -64, -64, 64, -64, 64, 64, -64, 64, -64, -64, -64, 64, 64, -64, 64, -64, 64, 64, 64, -64, -64, -64, -64, -64, -64, -64, 64, -64, 64, 64, -64, 64, 64, 64, -64, 64, -64, 64, -64, 64, -64, 64, -64, -64, 64, -64, -64, 64, 64, -64, -64, -64, -64, -64, -64, 64, 64, 64, 64, 64, 64, 64, 64, -64, 64, -64, 64, -64, -64, -64, -64, 64, -64, 64, -64, -64, 64, -64, -64, -64, -64, 64, -64, 64, 64, 64, 64, 64, 64, 64, 64, 64, 64, 64, 64, -64, -64, -64, -64, 64, -64, 64, 64, 64, 64, -64, 64, -64, -64, -64, -64, 64, 64, 64, 64, 64, 64, 64, 64, 64, 64, 64, 64, -64, 64, -64, -64, 64, -64, -64, -64, 64, 64, 64, -64, -64, 64, 64, -64, 64, -64, -64, 64, 64, 64, 64, 64, 64, 64, -64, 64, 64, 64, 64, -64, -64, -64, -64, 64, -64, -64, 64, 64, 64, -64, 64, 64, -64, -64, -64, 64, 64, -64, 64, 64, 64, 64, 64, 64, 64, -64, -64, 64, -64, 64, 64, -64, -64, -64, -64, 64, 64, -64, 64, 64, -64, -64, -64, 64, -64, 64, 64, 64, 64, -64, 64, 64, -64, -64, 64, 64, 64, 64, 64, -64, 64, -64, 64, -64, 64, 64, 64, -64, -64, -64, -64, -64, -64, -64, -64, 64, -64, 64, 64, 64, 64, -64, -64, -64, 64, -64, 64, 64, 64, 64, -64, 64, 64, 64, 64, 64, -64, 64, -64, -64, 64, -64, -64, 64, 64, 64, -64, 64, 64, 64, -64, 64, -64, -64, 64, 64, -64, 64, 64, 64, 64, -64, -64, 64, 64, 64, 64, 64, -64, -64, -64, 64, -64, -64, -64, -64, -64, 64, -64, 64, 64, -64, -64, -64, 64, -64, 64, 64, 64, -64, 64, -64, -64, -64, 64, 64, 64, -64, -64, -64, 64, 64, 64, 64, 64, 64, -64, -64, 64, 64, 64, -64, -64, 64, -64, -64, 64, 64, -64, 64, -64, 64, 64, 64, 64, -64, 64, 64, 64, 64, 64, 64, -64, -64, 64, -64, -64, 64, -64, 64, 64, 64, 64, 64, 64, 64, 64, -64, 64, 64, 64, -64, 64, -64, -64, 64, 64, -64, -64, -64, -64, 64, -64, 64, 64, 64, -64, -64, 64, 64, 64, -64, 64, 64, 64, 64, 64, -64, 64, -64, 64, 64, -64, 64, 64, 64, 64, -64, -64, 64, 64, -64, -64, -64, 64, 64, 64, 64, 64, 64, 64, 64, 64, 64, 64, 64, 64, 64, 64, 64, 64, -64, 64, 64, 64, -64, 64, -64, -64, -64, 64, 64, 64, -64, 64, 64, 64, -64, 64, 64, 64, 64, 64, 64, 64, -64, 64, -64, -64, 64, 64, 64, 64, 64, -64, 64, 64, 64, 64, -64, -64, -64, 64, -64, 64, 64, 64, 64, 64, 64, 64, 64, 64, -64, 64, -64, -64, 64, 64, 64, 64, -64, -64, -64, -64, -64, 64, 64, -64, 64, 64, 64, 64, 64, 64, 64, 64, 64, 64, 64, 64, 64, -64, -64, -64, -64, 64, 64, 64, 64, 64, 64, 64, -64, 64, 64, -64, -64, 64, -64, -64, 64, 64, -64, 64, 64, 64, 64, 64, 64, -64, -64, -64, 64, -64, 64, 64, 64, 64, 64, 64, -64, 64, 64, 64, 64, -64, 64, -64, 64, 64, 64, -64, 64, 64, 64, 64, -64, -64, -64, -64, 64, 64, 64, 64, 64, 64, 64, -64, 64, 64, 64, -64, -64, -64, -64, 64, 64, 64, 64, -64, -64, 64, -64, -64, -64, -64, 64, 64, 64, 64, 64, 64, 64, -64, 64, 64, -64, -64, -64, -64, 64, -64, 64, -64, 64, -64, -64, -64, -64, -64, -64, -64, 64, 64, 64, 64, -64, -64, 64, -64, -64, 64, 64, -64, 64, 64, -64, -64, -64, -64, 64, 64, -64, 64, -64, -64, -64, -64, -64, -64, 64, 64, 64, 64, 64, 64, -64, 64, 64, -64, -64, 64, 64, 64, -64, -64, 64, -64, 64, -64, -64, -64, -64, -64, -64, -64, 64, 64, 64, 64, 64, 64, 64, 64, -64, -64, -64, -64, 64, -64, 64, -64, 64, -64, 64, 64, 64, 64, 64, -64, 64, -64, 64, 64, 64, 64, 64, 64, 64, 64, 64, -64, 64, 64, 64, -64, -64, -64, -64, 64, -64, -64, 64, -64, 64, 64, -64, -64, -64, 64, -64, -64, 64, 64, 64, -64, 64, 64, 64, -64, 64, -64, 64, 64, 64, 64, -64, 64, -64, 64, -64, -64, -64, -64, 64, -64, 64, 64, 64, -64, 64, 64, 64, 64, -64, 64, -64, -64, 64, 64, 64, 64, -64, 64, 64, 64, -64, -64, 64, -64, 64, 64, -64, 64, -64, -64, 64, 64, -64, 64, 64, 64, -64, 64, 64, -64, -64, 64, 64, 64, 64, -64, 64, 64, -64, 64, -64, -64, -64, 64, 64, 64, 64, -64, 64, 64, -64, -64, 64, 64, 64, 64, -64, -64, -64, 64, -64, 64, -64, 64, -64, 64, 64, 64, -64, 64, 64, 64, 64, 64, 64, 64, 64, 64, 64, -64, -64, -64, 64, -64, 64, -64, 64, 64, -64, 64, -64, 64, -64, 64, 64, -64, 64, 64, -64, 64, 64, 64, 64, -64, 64, -64, -64, 64, 64, 64, -64, -64, 64, -64, 64, 64, 64, -64, -64, 64, 64, 64, -64, 64, 64, -64, 64, -64, -64, 64, -64, -64, -64, -64, 64, -64, -64, -64, -64, -64, -64, -64, -64, -64, 64, -64, 64, 64, -64, 64, -64, -64, -64, 64, -64, 64, -64, -64, -64, -64, -64, -64, -64, -64, -64, -64, 64, -64, -64, -64, 64, -64, -64, 64, -64, -64, -64, -64, 64, -64, -64, 64, -64, -64, -64, -64, -64, -64, -64, -64, -64, -64, -64, -64, 64, -64, 64, -64, 64, 64, -64, 64, -64, 64, -64, 64, 64, 64, -64, -64, -64, -64, -64, -64, -64, 64, -64, 64, -64, -64, -64, -64, 64, -64, 64, 64, 64, 64, 64, -64, -64, -64, 64, 64, -64, 64, -64, -64, 64, -64, -64, -64, 64, 64, 64, 64, -64, 64, -64, -64, -64, -64, -64, 64, -64, -64, 64, 64, -64, 64, 64, -64, 64, 64, -64, -64, -64, 64, -64, -64, -64, 64, 64, -64, 64, 64, 64, -64, -64, -64, 64, 64, 64, 64, -64, -64, -64, 64, -64, -64, 64, -64, 64, -64, -64, -64, -64, 64, -64, -64, -64, 64, 64, -64, -64, -64, -64, 64, -64, -64, -64, -64, -64, -64, -64, -64, 64, 64, 64, -64, -64, -64, -64, -64, 64, -64, -64, -64, -64, -64, -64, -64, -64, -64, -64, 64, -64, -64, 64, 64, 64, -64, 64, 64, -64, 64, 64, 64, 64, 64, -64, -64, 64, -64, -64, -64, -64, -64, -64, -64, -64, -64, -64, -64, -64, -64, 64, 64, 64, 64, 64, -64, -64, -64, -64, -64, 64, 64, -64, 64, -64, -64, -64, -64, -64, -64, -64, -64, -64, -64, -64, -64, -64, -64, -64, -64, -64, 64, 64, 64, -64, -64, 64, 64, 64, -64, -64, -64, -64, -64, 64, -64, -64, -64, -64, -64, -64, -64, -64, -64, -64, -64, -64, 64, 64, 64, 64, -64, -64, -64, -64, -64, 64, 64, -64, -64, -64, -64, -64, -64, 64, -64, -64, 64, -64, -64, -64, -64, -64, -64, -64, 64, 64, -64, -64, 64, -64, 64, -64, -64, 64, 64, -64, -64, 64, 64, 64, -64, -64, -64, -64, -64, -64, -64, -64, -64, -64, 64, 64, -64, 64, -64, -64, 64, -64, 64, -64, 64, 64, 64, 64, 64, -64, 64, 64, 64, -64, -64, -64, -64, 64, -64, 64, -64, 64, -64, -64, -64, -64, -64, -64, -64, 64, 64, 64, -64, 64, -64, -64, 64, -64, 64, -64, -64, 64, 64, 64, 64, 64, 64, 64, -64, 64, -64, -64, 64, -64, -64, 64, -64, -64, -64, 64, -64, 64, -64, 64, 64, 64, -64, 64, -64, -64, 64, 64, -64, -64, 64, 64, 64, 64, 64, -64, -64, -64, 64, 64, -64, 64, -64, 64, -64, 64, -64, 64, -64, 64, -64, -64, 64, 64, 64, -64, 64, -64, -64, 64, -64, -64, 64, -64, 64, 64, 64, -64, 64, -64, -64, 64, -64, -64, -64, -64, 64, -64, -64, -64, 64, -64, 64, -64, -64, -64, -64, -64, 64, 64, -64, -64, -64, 64, -64, 64, 64, 64, -64, 64, -64, -64, 64, -64, 64, -64, -64, 64, -64, 64, -64, 64, 64, -64, -64, -64, -64, 64, -64, -64, -64, -64, -64, -64, 64, 64, -64, 64, -64, 64, 64, -64, 64, 64, 64, -64, -64, 64, 64, -64, 64, -64, -64, 64, -64, 64, 64, -64, -64, -64, 64, -64, -64, -64, 64, 64, -64, -64, 64, -64, 64, -64, -64, -64, -64, 64, -64, -64, -64, -64, 64, -64, 64, -64, 64, -64, -64, -64, 64, -64, -64, 64, -64, 64, -64, 64, 64, -64, 64, 64, 64, 64, 64, 64, -64, 64, -64, -64, 64, 64, 64, -64, 64, 64, -64, 64, 64, 64, 64, -64, -64, 64, -64, 64, -64, 64, -64, -64, 64, -64, 64, 64, 64, 64, -64, -64, -64, -64, -64, 64, 64, -64, -64, -64, 64, -64, 64, -64, -64, -64, -64, 64, -64, 64, 64, 64, 64, -64, 64, 64, -64, -64, 64, -64, -64, 64, -64, 64, -64, 64, 64, -64, 64, 64, 64, -64, 64, -64, -64, -64, -64, 64, 64, 64, -64, -64, 64, 64, -64, 64, 64, 64, -64, 64, -64, -64, 64, -64, -64, 64, 64, 64, 64, 64, -64, -64, 64, -64, -64, -64, 64, 64, -64, -64, 64, -64, -64, -64, -64, 64, 64, 64, 64, 64, -64, 64, -64, -64, 64, 64, -64, 64, -64, 64, 64, -64, -64, 64, 64, 64, -64, -64, -64, 64, 64, 64, 64, 64, 64, 64, -64, -64, 64, 64, 64, 64, -64, -64, 64, 64, 64, 64, -64, 64, -64, 64, 64, -64, -64, -64, -64, -64, 64, 64, -64, -64, -64, -64, -64, -64, -64, -64, -64, -64, -64, 64, 64, -64, -64, -64, -64, 64, 64, 64, -64, -64, -64, -64, -64, -64, -64, 64, 64, -64, -64, -64, -64, -64, -64, -64, -64, -64, 64, -64, 64, -64, 64, 64, 64, 64, 64, 64, -64, -64, 64, -64, -64, -64, -64, -64, -64, -64, -64, -64, -64, -64, 64, -64, -64, -64, 64, 64, -64, 64, 64, 64, 64, 64, 64, 64, -64, 64, -64, -64, 64, 64, 64, 64, -64, 64, -64, 64, 64, 64, 64, 64, -64, 64, 64, 64, 64, 64, -64, -64, 64, 64, -64, 64, 64, -64, -64, -64, -64, -64, 64, 64, 64, 64, 64, 64, 64, 64, 64, 64, -64, -64, -64, 64, 64, 64, 64, 64, 64, 64, 64, 64, -64, -64, -64, -64, -64, 64, 64, 64, 64, 64, 64, 64, 64, 64, 64, 64, 64, 64, -64, -64, 64, 64, -64, -64, 64, -64, 64, -64, 64, -64, -64, -64, 64, 64, 64, 64, 64, 64, 64, 64, 64, 64, 64, 64, -64, -64, -64, -64, 64, 64, 64, -64, -64, 64, 64, 64, 64, -64, -64, -64, -64, -64, 64, 64, 64, -64, -64, 64, 64, 64, 64, 64, 64, -64, -64, 64, 64, 64, -64, 64, -64, -64, 64, 64, -64, -64, -64, 64, 64, 64, 64, -64, -64, -64, 64, 64, 64, 64, 64, 64, -64, 64, -64, -64, 64, -64, 64, -64, 64, 64, 64, 64, 64, 64, -64, 64, -64, -64, 64, 64, -64, 64, 64, 64, -64, 64, 64, -64, 64, -64, 64, 64, 64, -64, 64, 64, -64, 64, 64, 64, 64, 64, -64, -64, 64, -64, -64, 64, 64, 64, 64, -64, -64, -64, 64, -64, 64, -64, 64, 64, 64, 64, 64, -64, -64, 64, 64, 64, 64, 64, 64, 64, 64, 64, 64, -64, -64, 64, -64, 64, -64, 64, 64, 64, -64, -64, 64, 64, -64, 64, -64, 64, 64, 64, 64, 64, 64, 64, 64, 64, 64, 64, 64, 64, 64, 64, 64, 64, 64, 64, 64, 64, 64, 64, 64, -64, 64, -64, -64, 64, -64, -64, 64, 64, 64, 64, 64, 64, 64, 64, 64, 64, 64, 64, 64, 64, 64, -64, 64, 64, 64, 64, -64, 64, 64, 64, 64, 64, 64, -64, 64, 64, 64, 64, 64, 64, 64, 64, 64, 64, 64, 64, 64, 64, 64, 64, -64, 64, 64, -64, -64, -64, -64, 64, -64, 64, -64, 64, 64, 64, 64, 64, 64, 64, 64, 64, 64, 64, 64, 64, 64, 64, 64, 64, 64, 64, 64, 64, -64, 64, 64, 64, 64, 64, 64, 64, 64, -64, 64, 64, 64, -64, 64, -64, -64, 64, 64, 64, 64, 64, -64, 64, -64, -64, -64, -64, -64, -64, 64, 64, -64, -64, -64, 64, 64, -64, 64, -64, 64, -64, -64, -64, 64, -64, 64, 64, 64, 64, 64, 64, -64, -64, -64, -64, 64, -64, -64, -64, 64, -64, 64, 64, 64, 64, 64, -64, 64, -64, -64, -64, -64, -64, -64, -64, 64, -64, 64, 64, -64, -64, 64, 64, -64, 64, -64, 64, 64, 64, -64, -64, 64, 64, 64, 64, -64, -64, -64, -64, -64, -64, -64, -64, 64, 64, 64, 64, -64, 64, 64, 64, -64, 64, -64, 64, 64, 64, -64, 64, 64, 64, 64, -64, 64, -64, -64, 64, -64, -64, -64, -64, 64, 64, 64, 64, -64, 64, 64, 64, 64, 64, -64, -64, 64, -64, -64, 64, -64, -64, 64, 64, 64, 64, 64, 64, -64, -64, 64, -64, 64, 64, 64, 64, -64, -64, 64, 64, -64, -64, 64, 64, 64, -64, -64, 64, -64, -64, -64, -64, -64, -64, -64, -64, 64, -64, -64, -64, -64, 64, 64, 64, -64, -64, 64, -64, -64, 64, -64, -64, 64, 64, 64, -64, 64, -64, 64, 64, 64, 64, 64, 64, -64, 64, -64, -64, -64, 64, 64, 64, -64, -64, 64, -64, -64, -64, -64, 64, -64, -64, -64, 64, 64, -64, 64, -64, 64, 64, -64, 64, 64, 64, -64, -64, 64, 64, -64, 64, -64, 64, -64, -64, -64, 64, 64, 64, -64, 64, 64, 64, 64, 64, 64, 64, 64, -64, 64, 64, 64, -64, -64, -64, -64, 64, -64, -64, -64, -64, 64, 64, -64, -64, 64, -64, 64, 64, 64, 64, -64, 64, 64, 64, 64, 64, 64, 64, 64, -64, -64, -64, 64, -64, -64, -64, -64, -64, -64, 64, -64, 64, 64, -64, 64, 64, 64, -64, 64, -64, 64, -64, -64, 64, 64, -64, 64, -64, 64, 64, 64, -64, -64, -64, -64, 64, 64, 64, -64, -64, -64, -64, -64, 64, -64, -64, -64, 64, -64, 64, 64, 64, 64, 64, -64, 64, 64, 64, 64, 64, -64, 64, 64, 64, 64, 64, -64, -64, 64, 64, 64, -64, 64, 64, -64, -64, 64, 64, -64, 64, 64, -64, 64, -64, 64, -64, 64, 64, -64, -64, 64, 64, 64, 64, 64, 64, -64, -64, 64, -64, -64, 64, -64, 64, -64, 64, 64, -64, -64, -64, -64, -64, -64, -64, 64, 64, 64, -64, 64, 64, 64, -64, -64, 64, 64, 64, -64, 64, -64, 64, -64, 64, -64, -64, 64, -64, -64, -64, -64, -64, -64, -64, -64, 64, 64, 64, 64, 64, 64, 64, -64, 64, -64, -64, -64, 64, 64, -64, -64, -64, -64, -64, 64, -64, -64, -64, -64, -64, -64, -64, -64, 64, 64, 64, 64, 64, 64, 64, 64, 64, -64, 64, -64, 64, 64, -64, -64, -64, -64, -64, -64, 64, -64, -64, -64, -64, -64, -64, 64, 64, 64, 64, -64, -64, 64, -64, 64, -64, -64, -64, -64, 64, 64, -64, -64, -64, -64, -64, -64, 64, -64, -64, -64, -64, -64, -64, 64, 64, -64, 64, -64, 64, 64, -64, -64, -64, 64, -64, 64, -64, 64, -64, -64, -64, -64, -64, -64, -64, -64, -64, -64, -64, -64, -64, 64, 64, -64, 64, -64, -64, -64, -64, -64, -64, -64, -64, 64, -64, 64, -64, -64, -64, -64, 64, 64, -64, -64, -64, -64, -64, -64, 64, 64, 64, -64, 64, 64, 64, -64, 64, -64, 64, -64, 64, 64, -64, -64, -64, -64, -64, 64, 64, 64, -64, -64, -64, -64, -64, -64, -64, 64, 64, -64, -64, 64, 64, -64, 64, 64, 64, 64, 64, 64, 64, 64, 64, -64, -64, -64, 64, 64, 64, 64, -64, -64, -64, -64, -64, -64, 64, 64, 64, -64, 64, -64, 64, 64, 64, -64, -64, 64, 64, 64, 64, -64, 64, 64, 64, 64, 64, 64, -64, 64, -64, -64, 64, 64, -64, 64, 64, 64, 64, 64, -64, 64, -64, 64, 64, -64, -64, 64, 64, -64, -64, 64, 64, 64, 64, 64, 64, -64, -64, -64, -64, -64, 64, -64, 64, 64, -64, -64, -64, 64, 64, 64, 64, -64, 64, -64, 64, 64, -64, 64, 64, 64, 64, 64, -64, -64, -64, -64, -64, -64, 64, 64, 64, 64, -64, -64, -64, 64, -64, 64, 64, 64, 64, 64, -64, 64, -64, 64, 64, 64, 64, 64, -64, -64, -64, -64, -64, -64, 64, 64, -64, -64, -64, 64, -64, 64, -64, 64, 64, 64, -64, 64, 64, 64, 64, 64, 64, 64, 64, -64, -64, -64, -64, -64, -64, -64, -64, -64, -64, 64, 64, 64, 64, 64, 64, 64, -64, 64, -64, 64, 64, 64, 64, 64, 64, 64, 64, -64, -64, -64, -64, 64, 64, 64, -64, 64, 64, 64, 64, -64, 64, 64, -64, -64, -64, 64, 64, 64, 64, 64, 64, 64, 64, 64, -64, -64, 64, -64, -64, -64, 64, -64, 64, -64, -64, -64, -64, 64, -64, -64, 64, 64, 64, -64, 64, -64, 64, 64, 64, 64, 64, 64, 64, 64, -64, -64, 64, 64, -64, -64, -64, -64, -64, -64, -64, 64, -64, -64, 64, -64, -64, 64, 64, 64, -64, -64, 64, 64, 64, 64, 64, 64, 64, -64, -64, -64, -64, 64, 64, -64, -64, -64, 64, -64, 64, -64, -64, 64, -64, -64, 64, -64, -64, -64, -64, 64, 64, 64, 64, 64, -64, -64, -64, -64, 64, -64, -64, -64, -64, -64, -64, 64, -64, -64, 64, 64, 64, 64, 64, -64, 64, -64, -64, 64, -64, -64, -64, -64, -64, -64, -64, -64, -64, -64, -64, -64, -64, -64, -64, -64, 64, -64, 64, -64, 64, -64, -64, -64, -64, 64, 64, -64, 64, -64, 64, -64, -64, -64, -64, -64, -64, 64, -64, -64, -64, -64, -64, -64, 64, 64, -64, -64, -64, -64, -64, 64, 64, 64, 64, 64, 64, 64, -64, 64, -64, 64, 64, 64, -64, -64, 64, -64, -64, -64, 64, 64, 64, -64, 64, -64, 64, 64, 64, -64, 64, 64, 64, 64, -64, -64, -64, 64, 64, -64, 64, -64, -64, 64, -64, -64, -64, 64, -64, 64, 64, -64, 64, 64, 64, 64, -64, 64, -64, 64, -64, 64, -64, 64, -64, 64, 64, 64, -64, -64, -64, -64, -64, -64, -64, 64, -64, -64, -64, -64, 64, 64, -64, -64, -64, -64, -64, -64, 64, 64, -64, -64, -64, -64, -64, 64, 64, -64, -64, 64, -64, -64, -64, 64, 64, -64, -64, 64, 64, 64, 64, 64, -64, -64, -64, -64, 64, 64, 64, 64, 64, -64, -64, 64, 64, 64, -64, -64, -64, -64, 64, 64, -64, -64, 64, -64, 64, -64, -64, -64, 64, -64, -64, 64, 64, 64, 64, 64, 64, 64, -64, 64, 64, 64, 64, 64, 64, 64, 64, 64, 64, -64, 64, -64, 64, -64, 64, -64, 64, -64, -64, -64, 64, 64, -64, -64, 64, 64, 64, 64, 64, 64, 64, 64, 64, 64, 64, 64, 64, 64, 64, 64, 64, 64, -64, 64, -64, -64, -64, -64, 64, -64, 64, 64, 64, 64, 64, -64, -64, 64, 64, 64, -64, 64, 64, 64, 64, 64, 64, 64, -64, 64, -64, 64, -64, -64, -64, -64, -64, -64, -64, -64, 64, 64, 64, -64, 64, 64, -64, -64, -64, -64, -64, -64, -64, 64, -64, 64, -64, -64, -64, 64, 64, -64, -64, -64, -64, -64, 64, 64, 64, 64, 64, 64, -64, -64, -64, -64, -64, -64, -64, -64, -64, 64, -64, 64, -64, -64, 64, -64, -64, -64, -64, -64, -64, -64, 64, 64, 64, 64, 64, 64, -64, -64, -64, -64, -64, -64, -64, -64, -64, -64, 64, 64, -64, 64, -64, -64, 64, -64, -64, 64, 64, -64, -64, 64, 64, 64, 64, -64, -64, -64, 64, -64, -64, -64, -64, -64, -64, -64, -64, -64, -64, -64, -64, -64, 64, -64, -64, -64, -64, -64, -64, 64, 64, 64, 64, -64, 64, 64, -64, 64, -64, -64, -64, -64, -64, -64, -64, -64, 64, 64, 64, 64, -64, -64, -64, -64, -64, -64, -64, -64, 64, 64, 64, 64, 64, -64, 64, 64, -64, 64, 64, 64, -64, -64, -64, 64, 64, 64, 64, 64, 64, 64, -64, -64, -64, -64, -64, -64, 64, 64, -64, 64, 64, -64, 64, -64, -64, -64, 64, 64, -64, -64, -64, -64, -64, -64, -64, -64, 64, 64, -64, 64, -64, -64, -64, -64, -64, 64, -64, 64, -64, 64, -64, 64, -64, 64, 64, 64, -64, -64, 64, -64, 64, 64, -64, -64, 64, -64, -64, -64, -64, -64, -64, -64, -64, -64, -64, -64, -64, -64, -64, -64, 64, -64, 64, -64, 64, 64, 64, -64, 64, -64, -64, -64, 64, -64, -64, -64, -64, -64, -64, -64, -64, -64, -64, 64, -64, -64, -64, -64, -64, -64, 64, -64, 64, -64, 64, 64, 64, 64, 64, -64, -64, -64, -64, -64, -64, -64, -64, -64, -64, -64, -64, -64, -64, -64, 64, -64, -64, 64, 64, -64, 64, 64, 64, -64, -64, 64, -64, -64, -64, 64, -64, -64, 64, -64, 64, 64, -64, -64, -64, -64, -64, -64, -64, -64, -64, -64, 64, 64, 64, 64, 64, 64, -64, 64, -64, -64, 64, 64, -64, 64, 64, 64, 64, 64, -64, -64, -64, -64, -64, -64, -64, 64, 64, 64, -64, 64, 64, 64, 64, -64, -64, -64, -64, 64, 64, 64, 64, 64, 64, 64, 64, 64, 64, -64, -64, -64, -64, -64, -64, 64, 64, -64, -64, 64, 64, 64, 64, -64, -64, 64, 64, -64, 64, 64, 64, 64, 64, 64, 64, 64, 64, 64, -64, -64, 64, 64, 64, 64, 64, -64, 64, 64, 64, 64, 64, 64, -64, 64, -64, 64, 64, 64, -64, -64, 64, -64, 64, 64, 64, 64, 64, 64, -64, -64, -64, 64, 64, 64, 64, 64, 64, 64, 64, -64, -64, 64, -64, -64, -64, -64, -64, -64, -64, -64, 64, 64, 64, 64, 64, 64, -64, 64, 64, 64, -64, 64, 64, 64, 64, 64, 64, 64, -64, -64, 64, 64, 64, -64, -64, -64, -64, -64, -64, -64, -64, 64, 64, 64, 64, 64, 64, -64, -64, 64, -64, 64, 64, 64, 64, 64, 64, -64, 64, 64, -64, 64, -64, -64, -64, -64, -64, -64, -64, -64, 64, 64, 64, -64, -64, -64, 64, 64, 64, 64, 64, -64, -64, 64, 64, 64, 64, 64, 64, -64, 64, -64, -64, 64, -64, -64, -64, -64, 64, -64, 64, -64, -64, -64, -64, 64, 64, 64, -64, 64, 64, 64, 64, -64, -64, -64, -64, -64, 64, 64, 64, -64, -64, -64, 64, 64, 64, -64, 64, 64, -64, -64, 64, 64, -64, -64, -64, -64, -64, 64, -64, 64, 64, 64, -64, -64, 64, 64, 64, -64, 64, -64, -64, 64, 64, -64, -64, 64, 64, 64, 64, -64, 64, 64, -64, 64, 64, -64, 64, -64, -64, 64, 64, 64, 64, 64, 64, 64, 64, 64, -64, -64, -64, -64, 64, -64, 64, 64, -64, 64, 64, -64, -64, -64, -64, 64, -64, 64, 64, -64, -64, 64, 64, -64, -64, 64, -64, -64, 64, 64, 64, -64, -64, 64, 64, 64, 64, -64, -64, 64, -64, 64, -64, 64, 64, -64, -64, 64, -64, 64, 64, 64, -64, -64, -64, -64, -64, -64, -64, -64, 64, 64, 64, 64, 64, 64, 64, 64, 64, 64, -64, -64, 64, -64, -64, -64, 64, 64, 64, -64, -64, -64, -64, -64, -64, -64, 64, 64, -64, -64, 64, -64, -64, -64, -64, -64, 64, -64, -64, 64, 64, -64, 64, -64, -64, -64, 64, 64, -64, -64, -64, -64, -64, -64, -64, 64, 64, 64, 64, -64, 64, 64, 64, -64, 64, 64, -64, 64, 64, -64, 64, -64, 64, -64, 64, -64, -64, -64, -64, -64, -64, -64, 64, 64, 64, 64, 64, 64, -64, -64, -64, 64, 64, 64, -64, -64, -64, -64, 64, 64, 64, 64, 64, -64, -64, -64, -64, -64, -64, 64, 64, 64, 64, 64, 64, -64, 64, -64, -64, -64, 64, 64, -64, -64, -64, -64, 64, -64, 64, -64, -64, -64, -64, -64, -64, -64, 64, 64, -64, -64, -64, 64, 64, 64, 64, 64, -64, -64, -64, 64, -64, -64, -64, 64, -64, 64, 64, -64, -64, -64, -64, -64, -64, 64, 64, -64, 64, 64, 64, 64, 64, 64, 64, -64, -64, -64, 64, -64, -64, -64, -64, -64, 64, -64, -64, -64, 64, -64, -64, -64, 64, 64, 64, -64, -64, -64, 64, 64, 64, 64, 64, -64, -64, 64, -64, 64, -64, -64, 64, -64, -64, -64, 64, -64, -64, -64, -64, -64, -64, -64, -64, -64, -64, -64, 64, -64, 64, 64, -64, -64, -64, -64, 64, -64, 64, -64, -64, 64, 64, 64, -64, -64, -64, -64, -64, -64, -64, -64, -64, -64, 64, -64, 64, 64, 64, -64, -64, -64, -64, -64, -64, -64, -64, -64, 64, -64, -64, 64, -64, -64, -64, 64, -64, -64, 64, -64, -64, -64, 64, 64, 64, -64, -64, 64, -64, -64, -64, -64, 64, -64, -64, -64, -64, -64, 64, 64, -64, -64, -64, 64, 64, -64, -64, -64, -64, -64, 64, 64, 64, 64, -64, -64, -64, -64, -64, -64, -64, 64, 64, -64, -64, 64, 64, 64, 64, 64, 64, -64, 64, -64, 64, -64, -64, -64, -64, 64, 64, -64, 64, -64, -64, -64, -64, -64, -64, -64, -64, -64, -64, -64, -64, -64, -64, 64, -64, 64, 64, 64, -64, -64, -64, -64, 64, 64, 64, 64, 64, 64, -64, -64, -64, 64, -64, 64, -64, -64, -64, -64, 64, 64, 64, -64, -64, -64, -64, -64, -64, -64, -64, -64, -64, 64, 64, -64, -64, 64, -64, -64, -64, -64, -64, -64, -64, -64, -64, -64, -64, 64, -64, -64, 64, -64, 64, -64, -64, -64, -64, -64, -64, 64, 64, -64, 64, 64, -64, -64, -64, -64, -64, -64, -64, -64, 64, -64, 64, -64, 64, 64, 64, -64, -64, -64, -64, -64, -64, -64, -64, -64, 64, 64, 64, 64, 64, -64, -64, -64, -64, -64, -64, -64, 64, -64, 64, 64, -64, 64, 64, -64, 64, 64, -64, -64, -64, -64, -64, -64, 64, -64, 64, -64, -64, -64, -64, -64, -64, -64, -64, -64, -64, 64, 64, -64, 64, 64, 64, -64, 64, -64, -64, -64, -64, -64, -64, 64, 64, 64, 64, -64, -64, -64, -64, -64, -64, -64, -64, -64, 64, -64, 64, 64, 64, 64, 64, 64, 64, -64, 64, -64, -64, -64, 64, 64, 64, 64, 64, 64, -64, -64, -64, -64, -64, -64, -64, -64, 64, -64, -64, 64, 64, -64, -64, 64, 64, 64, 64, -64, -64, -64, 64, 64, 64, -64, -64, -64, -64, -64, -64, -64, -64, -64, -64, 64, -64, 64, 64, -64, 64, -64, -64, 64, 64, 64, 64, 64, 64, -64, 64, -64, -64, -64, -64, -64, -64, -64, -64, 64, 64, 64, 64, 64, 64, 64, 64, -64, 64, -64, -64, 64, 64, 64, 64, 64, 64, 64, -64, -64, -64, -64, -64, -64, -64, 64, 64, -64, -64, -64, 64, -64, 64, -64, -64, 64, -64, 64, 64, -64, 64, 64, -64, -64, -64, -64, 64, -64, 64, -64, 64, 64, -64, -64, 64, 64, 64, -64, -64, -64, -64, 64, 64, 64, 64, -64, 64, 64, -64, -64, -64, -64, -64, -64, -64, 64, -64, -64, -64, -64, 64, 64, 64, -64, -64, 64, 64, -64, 64, 64, 64, 64, 64, -64, -64, 64, -64, -64, -64, 64, 64, -64, -64, 64, -64, 64, -64, -64, -64, 64, 64, -64, 64, -64, -64, -64, -64, 64, 64, -64, -64, 64, 64, -64, 64, -64, -64, -64, -64, -64, -64, -64, -64, 64, 64, 64, -64, -64, 64, 64, -64, 64, -64, -64, 64, -64, 64, 64, -64, 64, 64, 64, 64, 64, -64, 64, 64, 64, 64, 64, 64, 64, 64, 64, -64, 64, 64, 64, 64, -64, 64, 64, 64, 64, 64, 64, 64, -64, 64, 64, 64, 64, -64, -64, 64, 64, 64, 64, 64, 64, -64, -64, 64, -64, -64, -64, -64, -64, -64, 64, 64, -64, -64, -64, -64, 64, 64, -64, -64, -64, 64, -64, 64, -64, -64, 64, 64, 64, -64, -64, 64, -64, -64, -64, -64, -64, -64, -64, -64, -64, -64, -64, 64, -64, -64, -64, -64, -64, -64, -64, 64, -64, -64, -64, -64, -64, 64, 64, 64, 64, -64, -64, -64, -64, -64, -64, 64, -64, -64, -64, -64, 64, -64, 64, 64, -64, 64, 64, -64, -64, 64, -64, -64, -64, 64, 64, 64, -64, -64, -64, -64, -64, -64, -64, -64, -64, -64, -64, 64, -64, 64, 64, -64, 64, 64, 64, 64, 64, -64, -64, -64, 64, -64, 64, 64, 64, -64, -64, -64, -64, -64, -64, -64, -64, 64, -64, 64, 64, 64, 64, 64, 64, -64, -64, -64, 64, -64, -64, -64, 64, 64, 64, 64, 64, -64, -64, 64, -64, -64, -64, -64, 64, -64, -64, -64, -64, 64, 64, 64, 64, -64, 64, -64, -64, -64, -64, -64, 64, 64, 64, 64, 64, -64, -64, 64, -64, -64, -64, 64, 64, 64, 64, -64, 64, 64, -64, -64, -64, 64, -64, -64, -64, -64, -64, 64, 64, 64, 64, 64, 64, 64, 64, 64, 64, -64, -64, -64, -64, -64, -64, 64, 64, 64, -64, 64, -64, -64, -64, -64, 64, -64, -64, 64, 64, 64, 64, 64, 64, 64, 64, 64, 64, -64, 64, -64, 64, 64, -64, -64, -64, 64, 64, -64, -64, 64, -64, -64, -64, 64, -64, 64, 64, 64, 64, 64, 64, -64, -64, 64, -64, 64, -64, -64, -64, -64, -64, -64, -64, -64, -64, -64, -64, -64, -64, -64, 64, 64, 64, 64, 64, 64, 64, 64, 64, 64, -64, -64, -64, 64, -64, -64, 64, 64, 64, -64, -64, -64, -64, -64, -64, -64, -64, 64, 64, -64, 64, 64, 64, 64, 64, 64, 64, -64, -64, -64, -64, 64, 64, 64, -64, 64, -64, -64, -64, -64, -64, -64, -64, -64, -64, 64, 64, 64, 64, 64, 64, 64, 64, 64, 64, -64, -64, -64, -64, -64, 64, -64, -64, 64, 64, -64, -64, -64, -64, -64, 64, 64, 64, 64, 64, 64, 64, 64, 64, 64, 64, 64, 64, 64, -64, -64, -64, -64, 64, 64, -64, 64, -64, -64, -64, -64, -64, -64, 64, 64, 64, 64, 64, 64, 64, -64, -64, -64, -64, -64, -64, 64, 64, -64, -64, -64, 64, 64, 64, 64, 64, 64, 64, -64, -64, -64, -64, 64, 64, 64, 64, 64, 64, 64, -64, -64, -64, -64, -64, -64, 64, 64, 64, 64, 64, 64, 64, 64, -64, 64, 64, -64, -64, 64, 64, -64, 64, 64, 64, 64, 64, -64, -64, -64, -64, -64, -64, 64, -64, -64, -64, -64, 64, 64, -64, 64, 64, -64, 64, 64, -64, -64, 64, 64, -64, -64, -64, -64, -64, -64, -64, -64, -64, 64, 64, -64, -64, -64, -64, 64, 64, 64, 64, -64, -64, -64, -64, -64, -64, -64, 64, 64, -64, -64, -64, -64, -64, -64, -64, -64, 64, -64, 64, -64, -64, -64, -64, 64, -64, 64, 64, -64, -64, -64, 64, -64, -64, 64, -64, -64, -64, 64, 64, 64, -64, 64, -64, -64, -64, 64, -64, 64, 64, 64, -64, -64, 64, 64, 64, -64, 64, 64, 64, 64, 64, 64, 64, 64, 64, 64, 64, 64, 64, 64, 64, -64, -64, 64, -64, 64, 64, 64, -64, -64, -64, -64, 64, -64, -64, 64, 64, 64, -64, -64, 64, 64, -64, 64, -64, 64, -64, -64, -64, -64, 64, -64, 64, 64, 64, -64, -64, -64, 64, -64, 64, 64, 64, 64, 64, 64, -64, 64, 64, 64, -64, 64, 64, 64, 64, 64, 64, -64, -64, -64, -64, -64, 64, -64, -64, -64, -64, 64, 64, -64, -64, 64, 64, 64, -64, -64, 64, -64, 64, -64, 64, -64, -64, 64, -64, 64, 64, 64, 64, -64, 64, 64, 64, -64, 64, -64, 64, -64, -64, 64, 64, 64, 64, -64, 64, 64, 64, -64, -64, 64, -64, -64, 64, -64, 64, -64, 64, 64, 64, -64, -64, -64, 64, -64, -64, -64, -64, 64, 64, 64, -64, -64, 64, -64, 64, 64, 64, -64, 64, -64, 64, 64, 64, -64, 64, 64, -64, 64, 64, -64, -64, 64, -64, -64, 64, -64, -64, -64, 64, 64, 64, 64, -64, 64, -64, 64, 64, -64, -64, 64, -64, -64, -64, -64, -64, -64, -64, -64, -64, 64, 64, -64, -64, 64, -64, -64, -64, 64, 64, 64, -64, -64, -64, -64, 64, -64, 64, 64, 64, 64, -64, 64, -64, 64, -64, 64, -64, 64, 64, 64, -64, -64, -64, -64, 64, -64, -64, 64, -64, -64, -64, -64, -64, -64, -64, 64, -64, -64, -64, 64, 64, 64, -64, 64, 64, -64, 64, -64, 64, 64, -64, 64, -64, -64, -64, 64, -64, -64, -64, -64, -64, -64, -64, -64, -64, -64, 64, 64, 64, 64, -64, -64, -64, 64, 64, -64, 64, 64, -64, -64, -64, -64, -64, -64, 64, -64, -64, 64, -64, 64, 64, 64, 64, 64, -64, 64, 64, 64, 64, -64, -64, 64, 64, -64, -64, 64, 64, -64, -64, -64, 64, 64, 64, 64, 64, 64, 64, 64, 64, -64, -64, 64, 64, 64, 64, 64, 64, 64, 64, -64, -64, 64, 64, 64, 64, -64, 64, -64, 64, 64, -64, 64, -64, 64, 64, 64, -64, -64, -64, 64, 64, 64, 64, 64, 64, 64, 64, 64, -64, -64, -64, 64, 64, 64, 64, -64, -64, -64, -64, -64, 64, 64, -64, -64, -64, -64, 64, 64, 64, 64, 64, 64, 64, -64, 64, -64, 64, 64, -64, 64, 64, -64, 64, -64, -64, -64, 64, -64, 64, -64, -64, -64, -64, 64, 64, 64, 64, 64, 64, 64, -64, -64, 64, -64, 64, -64, -64, 64, 64, -64, 64, -64, -64, -64, 64, -64, -64, -64, -64, -64, 64, 64, 64, 64, 64, 64, 64, -64, -64, -64, 64, -64, -64, 64, 64, -64, -64, 64, 64, -64, -64, -64, 64, 64, -64, -64, -64, -64, 64, -64, 64, 64, 64, 64, 64, -64, -64, -64, -64, -64, -64, -64, -64, -64, 64, 64, 64, -64, -64, 64, 64, 64, -64, -64, -64, -64, 64, -64, -64, 64, 64, -64, 64, -64, -64, -64, 64, 64, -64, -64, 64, 64, 64, 64, -64, -64, -64, 64, -64, -64, -64, -64, -64, -64, 64, 64, -64, 64, 64, 64, 64, -64, -64, -64, -64, 64, 64, -64, 64, 64, 64, 64, -64, -64, -64, -64, -64, -64, -64, 64, 64, 64, 64, 64, -64, 64, 64, -64, -64, -64, -64, -64, -64, 64, 64, 64, -64, -64, 64, 64, 64, -64, -64, 64, -64, 64, 64, 64, 64, 64, 64, 64, -64, -64, -64, -64, 64, -64, -64, -64, -64, 64, -64, 64, 64, 64, 64, 64, 64, 64, -64, -64, -64, -64, 64, 64, 64, 64, 64, 64, -64, -64, -64, -64, 64, 64, -64, -64, -64, 64, 64, -64, 64, -64, -64, 64, 64, -64, -64, -64, -64, -64, 64, 64, 64, 64, 64, 64, 64, 64, -64, -64, -64, -64, -64, -64, 64, -64, 64, 64, -64, 64, -64, 64, 64, 64, -64, 64, 64, 64, 64, 64, 64, 64, -64, 64, 64, 64, 64, -64, -64, 64, 64, 64, 64, 64, 64, -64, 64, -64, 64, 64, 64, 64, 64, 64, -64, 64, 64, 64, -64, 64, 64, 64, -64, 64, -64, -64, -64, -64, 64, -64, 64, 64, -64, 64, -64, -64, -64, 64, 64, 64, 64, 64, -64, 64, 64, 64, 64, 64, 64, -64, -64, -64, -64, 64, -64, 64, -64, -64, -64, -64, 64, -64, 64, -64, -64, -64, 64, 64, -64, 64, 64, 64, 64, -64, -64, -64, -64, 64, -64, -64, 64, 64, -64, 64, -64, -64, -64, -64, 64, 64, -64, 64, 64, -64, -64, -64, 64, 64, 64, 64, 64, -64, 64, -64, -64, -64, -64, -64, -64, 64, 64, 64, 64, -64, -64, -64, -64, 64, -64, 64, 64, 64, -64, 64, 64, 64, -64, -64, 64, -64, -64, 64, -64, -64, 64, -64, -64, -64, -64, 64, 64, 64, -64, -64, -64, -64, 64, -64, -64, -64, -64, 64, 64, 64, -64, -64, 64, -64, -64, 64, 64, -64, 64, -64, 64, -64, 64, -64, -64, 64, 64, 64, -64, 64, -64, -64, -64, 64, -64, 64, -64, -64, 64, -64, -64, -64, -64, -64, -64, -64, -64, -64, -64, -64, -64, -64, -64, 64, 64, 64, 64, -64, -64, -64, -64, -64, 64, 64, -64, 64, 64, 64, -64, -64, -64, -64, -64, -64, -64, 64, -64, -64, -64, -64, -64, -64, -64, -64, 64, 64, -64, -64, -64, -64, 64, -64, 64, 64, -64, -64, -64, -64, 64, 64, -64, -64, 64, 64, 64, -64, -64, -64, -64, 64, -64, 64, 64, 64, 64, 64, 64, 64, 64, -64, -64, -64, 64, -64, -64, 64, 64, -64, -64, 64, 64, 64, 64, -64, -64, 64, -64, -64, 64, 64, -64, 64, 64, -64, -64, -64, 64, -64, -64, 64, -64, 64, -64, -64, 64, -64, -64, 64, 64, -64, 64, -64, 64, -64, 64, 64, 64, 64, 64, -64, 64, 64, 64, -64, -64, 64, 64, -64, 64, 64, 64, -64, -64, -64, -64, 64, 64, -64, 64, -64, -64, -64, 64, 64, -64, -64, -64, 64, 64, 64, 64, -64, -64, 64, -64, 64, 64, 64, 64, -64, -64, 64, -64, -64, 64, -64, 64, -64, 64, -64, -64, -64, 64, -64, 64, -64, -64, -64, -64, 64, 64, 64, -64, 64, 64, 64, -64, 64, 64, 64, -64, -64, 64, -64, -64, -64, 64, 64, 64, 64, 64, -64, -64, 64, -64, -64, 64, -64, 64, 64, 64, 64, -64, -64, -64, 64, 64, 64, 64, -64, 64, -64, 64, 64, 64, 64, -64, -64, -64, -64, -64, 64, 64, 64, 64, 64, -64, 64, -64, 64, 64, 64, -64, -64, -64, 64, 64, 64, 64, 64, 64, 64, -64, 64, -64, 64, 64, -64, -64, 64, -64, 64, -64, 64, 64, -64, 64, -64, -64, 64, -64, -64, -64, 64, 64, 64, -64, 64, 64, -64, 64, 64, 64, -64, 64, 64, -64, -64, 64, 64, -64, 64, 64, -64, 64, -64, -64, 64, -64, 64, 64, 64, 64, 64, 64, -64, 64, 64, 64, -64, 64, 64, -64, -64, -64, -64, 64, -64, 64, 64, 64, 64, -64, 64, 64, 64, -64, -64, 64, -64, 64, 64, 64, 64, 64, 64, 64, 64, -64, -64, -64, 64, -64, 64, 64, 64, -64, 64, -64, -64, 64, 64, -64, -64, 64, 64, 64, -64, 64, 64, -64, 64, 64, 64, 64, 64, 64, -64, -64, 64, 64, 64, -64, 64, 64, 64, 64, 64, 64, 64, -64, 64, -64, -64, 64, 64, 64, 64, 64, 64, 64, 64, 64, 64, 64, 64, 64, 64, -64, -64, -64, -64, 64, 64, -64, -64, 64, 64, 64, 64, 64, -64, 64, 64, -64, 64, -64, 64, 64, 64, -64, -64, 64, 64, 64, 64, -64, -64, -64, -64, 64, 64, -64, -64, 64, 64, 64, -64, 64, 64, 64, 64, 64, 64, -64, -64, 64, 64, 64, -64, 64, -64, 64, -64, 64, -64, -64, 64, 64, 64, 64, 64, -64, -64, -64, 64, 64, 64, 64, 64, 64, 64, 64, 64, 64, -64, 64, 64, 64, -64, 64, -64, 64, -64, -64, 64, 64, -64, -64, 64, 64, -64, -64, 64, 64, 64, 64, -64, 64, 64, 64, 64, -64, -64, 64, 64, -64, 64, 64, -64, -64, -64, 64, 64, 64, 64, 64, -64, 64, 64, -64, -64, -64, -64, 64, 64, 64, 64, 64, 64, 64, 64, 64, 64, -64, -64, -64, -64, -64, -64, 64, -64, -64, 64, 64, -64, -64, 64, -64, -64, 64, 64, 64, -64, 64, 64, 64, -64, -64, -64, 64, 64, 64, 64, 64, -64, 64, 64, -64, -64, 64, 64, -64, -64, 64, -64, 64, 64, -64, 64, -64, 64, 64, -64, 64, 64, 64, 64, 64, -64, 64, -64, -64, 64, 64, -64, -64, -64, -64, 64, -64, -64, 64, 64, 64, 64, -64, -64, 64, 64, 64, -64, -64, 64, 64, -64, 64, 64, 64, 64, -64, 64, 64, 64, 64, -64, -64, -64, 64, 64, 64, -64, -64, 64, -64, 64, -64, -64, -64, 64, 64, 64, 64, 64, 64, 64, 64, -64, 64, -64, -64, -64, -64, 64, 64, -64, 64, 64, -64, 64, 64, -64, 64, -64, -64, 64, -64, -64, -64, -64, 64, -64, 64, 64, 64, 64, 64, 64, -64, -64, -64, 64, -64, -64, 64, 64, 64, 64, -64, 64, -64, -64, -64, -64, 64, 64, -64, -64, 64, 64, -64, 64, 64, 64, 64, 64, -64, 64, 64, 64, -64, 64, -64, -64, 64, -64, -64, 64, 64, 64, -64, 64, 64, -64, 64, 64, -64, 64, 64, 64, -64, 64, 64, 64, 64, -64, -64, -64, 64, 64, 64, -64, 64, -64, 64, -64, 64, -64, -64, -64, -64, -64, -64, -64, 64, 64, 64, 64, 64, 64, 64, 64, -64, 64, -64, -64, -64, -64, -64, 64, -64, 64, 64, 64, -64, -64, 64, -64, -64, -64, -64, 64, 64, 64, 64, 64, -64, 64, 64, -64, -64, 64, 64, 64, 64, 64, -64, -64, 64, 64, 64, 64, 64, 64, 64, 64, -64, 64, 64, 64, 64, 64, 64, -64, -64, 64, -64, 64, -64, 64, 64, 64, 64, -64, -64, 64, -64, -64, 64, 64, 64, -64, 64, -64, -64, 64, -64, 64, -64, 64, 64, 64, 64, -64, 64, -64, -64, -64, -64, -64, 64, 64, 64, 64, -64, 64, 64, 64, 64, 64, -64, -64, -64, -64, -64, -64, 64, 64, 64, -64, -64, 64, 64, 64, -64, -64, 64, -64, -64, -64, 64, 64, -64, 64, 64, -64, 64, 64, 64, -64, 64, -64, 64, 64, 64, 64, 64, 64, 64, 64, -64, -64, 64, 64, 64, 64, -64, 64, 64, 64, -64, -64, -64, 64, 64, -64, -64, 64, 64, -64, 64, 64, 64, 64, 64, 64, 64, -64, -64, 64, 64, 64, -64, -64, 64, -64, -64, 64, 64, -64, 64, -64, 64, -64, -64, -64, 64, 64, 64, -64, 64, 64, -64, -64, -64, 64, 64, -64, -64, 64, -64, 64, -64, 64, -64, -64, -64, 64, -64, 64, -64, 64, -64, 64, -64, 64, 64, 64, 64, -64, 64, -64, 64, 64, -64, -64, -64, -64, 64, 64, -64, -64, -64, 64, 64, -64, -64, -64, -64, -64, -64, -64, -64, -64, 64, -64, -64, -64, 64, -64, 64, -64, 64, -64, 64, 64, -64, 64, -64, 64, 64, -64, 64, 64, -64, -64, -64, -64, -64, -64, -64, 64, -64, 64, -64, 64, -64, 64, 64, 64, 64, 64, -64, 64, -64, -64, -64, -64, -64, 64, 64, -64, 64, -64, -64, -64, -64, 64, 64, 64, 64, 64, 64, -64, 64, 64, -64, 64, 64, 64, 64, 64, 64, -64, 64, 64, -64, 64, 64, 64, 64, -64, 64, 64, 64, 64, -64, 64, 64, 64, 64, 64, 64, 64, -64, 64, -64, -64, -64, 64, 64, -64, 64, -64, 64, 64, -64, -64, -64, -64, 64, 64, 64, -64, -64, 64, 64, 64, 64, 64, 64, 64, 64, -64, -64, -64, -64, -64, -64, 64, 64, 64, 64, 64, 64, 64, -64, 64, 64, 64, 64, -64, 64, 64, -64, 64, 64, 64, 64, 64, 64, -64, -64, -64, -64, -64, 64, 64, 64, 64, 64, 64, 64, 64, -64, 64, -64, 64, 64, 64, 64, -64, 64, -64, -64, -64, -64, -64, -64, -64, -64, -64, -64, -64, -64, 64, 64, -64, 64, 64, -64, 64, 64, -64, 64, 64, 64, 64, 64, -64, 64, 64, 64, 64, 64, 64, 64, 64, 64, 64, 64, -64, -64, 64, -64, 64, 64, -64, 64, 64, 64, 64, 64, -64, 64, 64, -64, 64, 64, 64, 64, 64, 64, -64, -64, 64, 64, 64, -64, -64, -64, 64, 64, -64, 64, 64, 64, 64, 64, 64, -64, 64, -64, -64, 64, 64, 64, -64, 64, -64, -64, 64, -64, 64, 64, 64, 64, -64, 64, -64, 64, -64, 64, 64, 64, 64, -64, -64, -64, -64, -64, 64, 64, 64, 64, 64, -64, -64, 64, -64, 64, -64, 64, 64, -64, -64, -64, 64, -64, -64, 64, 64, 64, 64, 64, 64, 64, 64, 64, 64, 64, 64, 64, 64, 64, -64, 64, -64, -64, -64, 64, -64, -64, 64, 64, 64, -64, 64, 64, 64, 64, 64, 64, 64, 64, 64, 64, 64, -64, 64, 64, 64, 64, -64, -64, 64, 64, 64, 64, 64, -64, 64, 64, 64, 64, 64, 64, 64, 64, 64, 64, 64, 64, 64, 64, 64, -64, -64, -64, 64, 64, 64, -64, 64, 64, 64, 64, 64, 64, -64, -64, -64, 64, 64, 64, 64, 64, 64, 64, 64, 64, 64, 64, -64, 64, -64, -64, 64, -64, 64, -64, 64, 64, -64, -64, -64, 64, 64, 64, 64, 64, 64, 64, 64, 64, 64, 64, 64, 64, 64, 64, -64, -64, -64, 64, -64, 64, 64, 64, -64, 64, 64, 64, 64, 64, -64, 64, -64, 64, 64, 64, -64, 64, 64, 64, 64, 64, 64, 64, -64, -64, -64, 64, 64, 64, 64, -64, -64, 64, 64, -64, -64, 64, 64, -64, -64, 64, -64, 64, 64, 64, 64, -64, -64, 64, -64, 64, -64, -64, -64, 64, 64, 64, 64, 64, -64, -64, 64, 64, -64, 64, 64, 64, -64, -64, -64, -64, -64, 64, 64, -64, 64, 64, -64, 64, -64, -64, 64, 64, 64, 64, 64, 64, 64, 64, 64, -64, 64, 64, 64, 64, -64, -64, 64, 64, 64, -64, -64, -64, -64, 64, -64, -64, -64, 64, -64, 64, 64, 64, 64, 64, -64, 64, -64, -64, 64, 64, 64, -64, 64, 64, -64, -64, 64, 64, 64, 64, 64, 64, -64, -64, 64, -64, -64, -64, 64, 64, -64, 64, -64, -64, 64, -64, 64, 64, -64, -64, 64, 64, 64, -64, -64, 64, -64, -64, -64, -64, 64, 64, 64, -64, 64, 64, 64, 64, -64, -64, 64, 64, -64, 64, -64, 64, -64, 64, 64, 64, 64, 64, -64, -64, 64, 64, -64, 64, 64, -64, -64, 64, -64, 64, -64, -64, 64, 64, -64, 64, 64, -64, -64, 64, -64, -64, -64, 64, 64, -64, -64, 64, 64, -64, 64, 64, -64, -64, -64, -64, -64, -64, -64, -64, -64, -64, -64, 64, 64, -64, 64, 64, -64, -64, 64, -64, -64, -64, -64, -64, -64, -64, -64, -64, -64, -64, 64, 64, -64, 64, -64, -64, 64, -64, -64, 64, -64, -64, -64, -64, -64, 64, 64, -64, -64, 64, 64, 64, -64, -64, -64, -64, -64, -64, -64, -64, -64, -64, -64, 64, -64, -64, 64, 64, 64, 64, -64, 64, 64, -64, -64, 64, -64, 64, 64, -64, -64, 64, -64, 64, 64, 64, 64, -64, -64, -64, -64, -64, -64, -64, -64, -64, 64, -64, 64, 64, -64, -64, 64, 64, 64, 64, 64, -64, 64, 64, 64, -64, 64, 64, 64, -64, -64, -64, -64, 64, -64, -64, -64, -64, -64, -64, 64, -64, -64, -64, 64, -64, -64, -64, -64, 64, 64, -64, 64, 64, 64, 64, 64, 64, 64, 64, -64, 64, -64, -64, -64, 64, -64, 64, 64, 64, -64, -64, -64, 64, -64, -64, 64, -64, 64, 64, 64, 64, 64, -64, 64, 64, 64, 64, 64, -64, -64, -64, 64, -64, -64, 64, 64, -64, -64, 64, 64, -64, 64, 64, 64, 64, -64, 64, 64, -64, 64, 64, 64, 64, 64, 64, 64, -64, -64, -64, -64, 64, -64, 64, 64, 64, -64, 64, -64, -64, -64, 64, -64, -64, 64, 64, 64, -64, 64, 64, 64, 64, 64, 64, 64, -64, -64, -64, -64, 64, 64, -64, 64, 64, 64, -64, -64, 64, 64, 64, 64, 64, 64, -64, 64, -64, 64, 64, 64, 64, 64, 64, 64, -64, -64, -64, -64, -64, -64, -64, -64, 64, 64, -64, -64, -64, -64, -64, 64, 64, 64, -64, -64, 64, 64, -64, 64, 64, 64, 64, -64, -64, -64, -64, -64, -64, -64, -64, -64, 64, 64, -64, -64, 64, 64, -64, 64, 64, -64, 64, 64, -64, 64, -64, -64, 64, 64, 64, -64, -64, -64, -64, -64, -64, -64, -64, -64, 64, 64, 64, 64, 64, 64, -64, -64, 64, 64, -64, -64, 64, -64, -64, -64, 64, 64, 64, -64, -64, -64, 64, -64, -64, 64, -64, 64, -64, -64, 64, -64, 64, 64, -64, -64, 64, 64, 64, -64, 64, 64, -64, 64, 64, 64, 64, -64, 64, -64, -64, 64, -64, -64, 64, 64, 64, -64, -64, 64, 64, -64, 64, -64, -64, 64, 64, 64, 64, 64, 64, 64, 64, 64, 64, -64, -64, 64, -64, 64, -64, 64, 64, 64, -64, -64, 64, -64, 64, 64, 64, 64, 64, 64, 64, 64, -64, -64, 64, 64, 64, 64, 64, 64, -64, -64, 64, 64, 64, 64, 64, 64, 64, 64, 64, 64, -64, -64, -64, 64, 64, 64, 64, 64, -64, 64, 64, 64, 64, 64, 64, -64, -64, -64, 64, -64, -64, 64, 64, 64, 64, 64, 64, -64, -64, 64, -64, -64, 64, 64, 64, 64, 64, 64, 64, 64, 64, 64, -64, 64, -64, 64, 64, 64, 64, 64, 64, 64, 64, -64, -64, -64, -64, 64, 64, 64, 64, 64, 64, -64, 64, 64, 64, 64, 64, 64, 64, -64, 64, 64, 64, 64, 64, 64, 64, 64, 64, -64, -64, -64, -64, 64, 64, 64, -64, -64, -64, 64, 64, 64, 64, 64, 64, 64, -64, 64, 64, 64, 64, -64, 64, -64, 64, -64, -64, -64, -64, -64, 64, 64, -64, -64, 64, -64, -64, 64, 64, 64, -64, -64, 64, 64, 64, -64, 64, 64, 64, 64, -64, -64, 64, -64, -64, -64, 64, -64, 64, -64, -64, -64, 64, 64, 64, 64, 64, -64, -64, 64, -64, 64, 64, 64, 64, 64, 64, 64, -64, 64, 64, 64, -64, -64, -64, -64, -64, -64, -64, 64, 64, -64, 64, 64, 64, -64, -64, 64, 64, 64, 64, 64, 64, 64, 64, -64, -64, 64, -64, 64, -64, 64, 64, 64, -64, -64, -64, 64, 64, 64, 64, -64, -64, -64, -64, 64, 64, 64, 64, 64, 64, 64, 64, -64, -64, -64, -64, -64, -64, -64, -64, -64, 64, -64, -64, -64, 64, -64, -64, -64, -64, -64, -64, 64, 64, -64, 64, 64, 64, 64, 64, -64, -64, -64, -64, 64, 64, -64, -64, 64, 64, 64, 64, -64, -64, -64, -64, -64, -64, -64, -64, 64, -64, -64, -64, -64, 64, -64, -64, -64, -64, -64, 64, -64, 64, 64, 64, 64, -64, -64, -64, -64, -64, -64, -64, -64, -64, -64, -64, -64, -64, -64, -64, -64, -64, -64, -64, -64, -64, 64, -64, 64, -64, -64, 64, 64, -64, 64, 64, 64, -64, 64, -64, -64, 64, -64, 64, 64, 64, -64, -64, 64, -64, 64, 64, 64, -64, -64, 64, 64, 64, 64, 64, 64, 64, -64, -64, -64, -64, 64, 64, 64, 64, 64, -64, 64, 64, -64, -64, -64, 64, 64, 64, -64, 64, 64, 64, -64, -64, 64, 64, 64, -64, 64, -64, 64, 64, -64, -64, -64, -64, -64, -64, -64, 64, 64, 64, -64, -64, -64, -64, -64, 64, -64, -64, -64, -64, -64, -64, 64, -64, -64, 64, -64, 64, -64, -64, 64, 64, -64, -64, -64, -64, 64, 64, -64, -64, 64, -64, -64, -64, -64, -64, 64, -64, -64, 64, 64, 64, 64, 64, -64, 64, 64, -64, 64, 64, -64, -64, -64, -64, 64, 64, -64, -64, -64, 64, -64, -64, -64, -64, 64, 64, 64, -64, -64, -64, 64, -64, -64, -64, -64, 64, 64, -64, -64, 64, 64, 64, -64, 64, -64, -64, 64, -64, -64, -64, -64, -64, -64, -64, -64, 64, 64, 64, -64, -64, 64, 64, 64, 64, -64, -64, 64, 64, 64, 64, 64, 64, 64, 64, 64, 64, 64, 64, -64, -64, 64, 64, -64, -64, 64, 64, 64, -64, -64, 64, 64, 64, 64, 64, 64, 64, -64, 64, 64, 64, -64, 64, -64, -64, 64, -64, 64, 64, -64, -64, -64, 64, -64, 64, -64, -64, 64, 64, 64, 64, -64, -64, -64, 64, -64, -64, -64, 64, -64, -64, -64, 64, 64, 64, 64, 64, 64, -64, 64, -64, 64, 64, -64, 64, -64, 64, 64, 64, 64, -64, -64, -64, 64, 64, 64, 64, 64, -64, -64, 64, 64, 64, 64, 64, 64, 64, -64, -64, 64, 64, -64, -64, -64, 64, 64, 64, -64, -64, -64, -64, 64, 64, 64, 64, -64, 64, 64, -64, 64, 64, 64, 64, 64, 64, -64, -64, 64, 64, 64, -64, 64, 64, 64, -64, -64, -64, -64, 64, 64, 64, 64, -64, 64, -64, 64, 64, -64, 64, 64, 64, 64, 64, -64, -64, 64, 64, 64, 64, -64, 64, 64, -64, -64, -64, 64, 64, 64, 64, 64, -64, -64, -64, -64, -64, -64, 64, 64, 64, 64, -64, 64, -64, 64, 64, 64, -64, -64, -64, -64, -64, -64, -64, 64, 64, 64, -64, -64, -64, -64, -64, -64, -64, -64, -64, -64, 64, 64, 64, 64, -64, -64, 64, -64, -64, -64, -64, -64, -64, -64, 64, 64, 64, 64, 64, 64, -64, -64, -64, -64, -64, -64, -64, 64, 64, 64, 64, 64, 64, -64, 64, -64, -64, -64, -64, -64, -64, -64, 64, 64, 64, -64, 64, -64, -64, -64, -64, -64, 64, -64, -64, -64, 64, 64, -64, 64, 64, -64, -64, -64, -64, -64, -64, -64, 64, -64, -64, -64, -64, -64, 64, -64, -64, -64, -64, -64, -64, -64, -64, -64, 64, 64, -64, -64, -64, 64, -64, 64, -64, -64, -64, -64, -64, -64, -64, -64, -64, 64, 64, -64, -64, -64, -64, -64, -64, -64, 64, 64, 64, 64, 64, 64, 64, 64, 64, 64, -64, 64, -64, -64, -64, -64, -64, -64, -64, -64, -64, -64, -64, -64, -64, -64, -64, -64, 64, 64, 64, -64, 64, 64, -64, 64, 64, 64, -64, 64, -64, 64, 64, 64, -64, -64, 64, -64, -64, -64, -64, 64, 64, 64, -64, 64, 64, 64, 64, 64, 64, 64, -64, 64, -64, 64, 64, -64, -64, 64, -64, 64, -64, 64, 64, -64, -64, -64, 64, 64, -64, -64, 64, 64, 64, 64, 64, -64, -64, 64, -64, -64, 64, 64, -64, -64, 64, 64, 64, 64, 64, 64, -64, -64, -64, 64, -64, -64, -64, 64, -64, 64, 64, 64, 64, -64, 64, -64, 64, -64, 64, -64, -64, -64, -64, 64, 64, 64, 64, -64, 64, -64, -64, -64, 64, 64, -64, -64, -64, 64, 64, 64, 64, -64, 64, -64, -64, -64, 64, -64, -64, 64, 64, 64, 64, 64, 64, -64, -64, -64, 64, 64, -64, -64, 64, 64, -64, 64, 64, -64, 64, -64, 64, -64, -64, 64, 64, 64, 64, 64, 64, 64, 64, 64, 64, 64, 64, 64, 64, -64, 64, -64, -64, 64, 64, 64, -64, 64, -64, 64, 64, -64, 64, 64, 64, -64, 64, 64, 64, 64, 64, 64, -64, 64, 64, -64, 64, -64, -64, -64, -64, -64, 64, 64, 64, 64, 64, -64, -64, -64, -64, -64, -64, 64, 64, 64, 64, 64, -64, -64, -64, -64, -64, -64, -64, -64, -64, -64, -64, 64, 64, 64, 64, -64, 64, 64, 64, 64, 64, 64, 64, -64, -64, 64, 64, 64, 64, -64, -64, -64, -64, -64, -64, -64, -64, -64, -64, 64, 64, -64, 64, 64, -64, 64, 64, 64, -64, -64, -64, 64, 64, 64, -64, 64, 64, 64, 64, -64, 64, 64, -64, -64, 64, 64, 64, -64, -64, -64, -64, -64, -64, -64, 64, 64, 64, 64, -64, 64, -64, 64, -64, 64, -64, -64, 64, -64, 64, -64, 64, 64, 64, 64, -64, -64, 64, 64, -64, -64, 64, 64, -64, 64, -64, 64, 64, 64, 64, -64, 64, 64, 64, 64, 64, -64, -64, 64, -64, -64, -64, -64, -64, -64, 64, -64, -64, -64, 64, 64, -64, -64, -64, -64, -64, 64, -64, 64, 64, 64, -64, -64, -64, -64, -64, 64, 64, -64, 64, 64, 64, 64, -64, -64, 64, 64, -64, -64, 64, 64, 64, 64, 64, -64, -64, -64, -64, 64, -64, -64, 64, 64, -64, -64, 64, -64, 64, -64, -64, -64, -64, -64, 64, 64, 64, -64, 64, 64, -64, 64, 64, -64, -64, -64, 64, -64, -64, 64, 64, 64, 64, 64, -64, 64, 64, -64, 64, -64, -64, 64, 64, -64, 64, 64, -64, 64, 64, -64, -64, -64, -64, 64, 64, 64, 64, 64, 64, 64, 64, 64, 64, 64, 64, 64, 64, 64, 64, 64, 64, 64, 64, 64, 64, 64, -64, -64, -64, -64, 64, 64, 64, 64, 64, 64, -64, -64, -64, 64, 64, -64, 64, 64, 64, 64, 64, -64, 64, -64, 64, -64, -64, 64, -64, 64, -64, -64, 64, 64, 64, 64, -64, 64, -64, 64, -64, -64, -64, 64, -64, 64, -64, 64, -64, -64, 64, 64, 64, -64, -64, -64, 64, 64, -64, -64, -64, 64, -64, 64, -64, 64, 64, 64, 64, 64, 64, -64, -64, 64, 64, 64, -64, 64, 64, -64, 64, 64, -64, 64, -64, -64, 64, 64, 64, -64, -64, -64, -64, 64, -64, -64, 64, 64, 64, 64, -64, 64, -64, -64, 64, -64, 64, 64, 64, 64, -64, 64, -64, 64, 64, -64, -64, -64, -64, -64, 64, -64, -64, -64, -64, -64, 64, 64, 64, 64, 64, 64, -64, 64, 64, 64, -64, 64, 64, 64, -64, -64, 64, -64, 64, -64, -64, 64, 64, 64, -64, -64, -64, -64, 64, 64, 64, 64, 64, 64, 64, 64, 64, 64, 64, 64, 64, -64, -64, 64, -64, 64, 64, 64, 64, 64, 64, -64, 64, -64, -64, -64, -64, -64, -64, 64, 64, 64, 64, 64, -64, -64, 64, 64, 64, 64, 64, -64, -64, -64, 64, 64, 64, 64, 64, 64, 64, 64, 64, 64, 64, -64, 64, 64, 64, 64, 64, -64, -64, -64, -64, -64, 64, 64, -64, -64, -64, 64, -64, -64, 64, 64, 64, 64, 64, 64, 64, 64, 64, 64, 64, 64, 64, 64, -64, 64, -64, -64, -64, 64, 64, 64, 64, 64, 64, -64, 64, 64, -64, 64, 64, 64, 64, 64, 64, 64, -64, -64, 64, 64, 64, 64, 64, 64, -64, -64, -64, -64, -64, -64, -64, -64, -64, -64, -64, 64, 64, 64, 64, 64, 64, 64, 64, 64, -64, -64, 64, 64, -64, 64, -64, -64, -64, -64, -64, 64, 64, -64, 64, 64, -64, 64, 64, 64, -64, 64, -64, 64, -64, 64, 64, -64, 64, -64, 64, 64, 64, 64, -64, -64, -64, -64, -64, 64, -64, -64, 64, -64, -64, 64, -64, 64, 64, 64, 64, -64, 64, 64, 64, 64, -64, 64, 64, 64, 64, 64, 64, -64, -64, -64, -64, 64, 64, 64, -64, 64, 64, 64, -64, 64, 64, 64, 64, 64, 64, 64, 64, -64, -64, 64, 64, 64, 64, 64, 64, -64, 64, 64, 64, -64, -64, -64, -64, -64, -64, 64, 64, 64, 64, 64, -64, -64, 64, 64, 64, 64, 64, 64, 64, 64, -64, -64, 64, 64, -64, 64, -64, -64, 64, 64, 64, -64, 64, 64, -64, -64, 64, 64, 64, 64, 64, 64, 64, 64, 64, 64, 64, 64, -64, 64, 64, 64, -64, 64, 64, 64, 64, -64, -64, 64, -64, 64, -64, 64, 64, -64, 64, -64, -64, 64, 64, 64, 64, 64, 64, 64, 64, 64, 64, -64, 64, -64, 64, -64, 64, -64, -64, 64, -64, -64, 64, 64, -64, -64, -64, 64, 64, 64, -64, 64, 64, 64, 64, 64, 64, 64, 64, 64, -64, 64, 64, -64, -64, -64, -64, -64, -64, -64, 64, 64, -64, -64, 64, 64, 64, 64, 64, -64, 64, -64, -64, 64, 64, 64, -64, -64, -64, 64, 64, -64, -64, -64, -64, -64, -64, 64, 64, -64, -64, -64, -64, 64, 64, -64, 64, 64, -64, -64, 64, 64, -64, 64, -64, -64, -64, 64, 64, 64, 64, -64, 64, -64, -64, -64, -64, -64, -64, 64, 64, -64, 64, -64, -64, -64, 64, 64, -64, 64, 64, 64, -64, -64, -64, 64, 64, -64, -64, -64, -64, -64, 64, 64, 64, 64, 64, -64, -64, 64, 64, -64, 64, 64, -64, -64, -64, 64, 64, -64, -64, -64, -64, 64, 64, 64, -64, -64, -64, 64, -64, 64, 64, 64, 64, -64, -64, -64, -64, -64, -64, -64, 64, -64, 64, -64, -64, 64, -64, -64, -64, 64, 64, 64, -64, -64, 64, -64, 64, 64, 64, 64, 64, 64, -64, -64, 64, 64, -64, 64, 64, 64, 64, 64, -64, 64, 64, 64, -64, -64, 64, 64, 64, 64, 64, -64, -64, -64, -64, -64, -64, 64, -64, 64, 64, -64, -64, 64, -64, -64, -64, 64, 64, 64, -64, -64, 64, -64, 64, -64, -64, -64, 64, 64, 64, -64, 64, -64, -64, 64, -64, -64, 64, -64, 64, 64, 64, -64, 64, -64, -64, 64, 64, -64, 64, 64, -64, -64, 64, 64, -64, 64, 64, 64, -64, -64, 64, 64, 64, -64, -64, -64, 64, 64, 64, -64, 64, 64, 64, 64, 64, -64, -64, 64, 64, 64, 64, -64, 64, 64, -64, -64, 64, 64, -64, -64, -64, -64, 64, -64, -64, -64, 64, 64, 64, 64, 64, 64, -64, -64, 64, -64, -64, -64, -64, -64, -64, 64, 64, 64, 64, -64, -64, -64, 64, 64, -64, -64, 64, -64, 64, -64, 64, 64, -64, 64, -64, 64, 64, -64, -64, 64, -64, -64, -64, -64, -64, -64, 64, -64, 64, 64, 64, 64, -64, 64, 64, -64, 64, 64, 64, -64, 64, 64, 64, 64, 64, -64, 64, 64, -64, -64, 64, 64, -64, 64, 64, 64, 64, 64, 64, 64, -64, 64, 64, 64, 64, 64, 64, 64, 64, 64, -64, -64, 64, -64, 64, 64, 64, -64, 64, 64, -64, 64, 64, 64, 64, 64, 64, -64, 64, 64, 64, 64, 64, 64, 64, 64, 64, 64, -64, 64, -64, -64, 64, 64, 64, -64, -64, -64, 64, 64, 64, -64, 64, -64, 64, -64, -64, 64, 64, 64, 64, 64, 64, 64, 64, 64, -64, -64, 64, -64, -64, 64, 64, 64, -64, 64, 64, 64, -64, 64, -64, -64, 64, 64, 64, 64, 64, -64, 64, 64, 64, -64, -64, -64, -64, 64, -64, -64, -64, 64, 64, -64, -64, -64, -64, 64, 64, -64, 64, -64, 64, 64, -64, 64, -64, 64, 64, 64, 64, -64, -64, 64, 64, 64, -64, -64, -64, -64, -64, 64, 64, -64, 64, 64, 64, 64, 64, 64, -64, 64, 64, 64, 64, 64, 64, -64, -64, -64, -64, 64, 64, 64, -64, -64, -64, -64, 64, -64, -64, -64, -64, 64, -64, -64, -64, -64, 64, -64, 64, -64, 64, 64, 64, 64, -64, 64, 64, 64, 64, -64, -64, -64, -64, -64, -64, 64, -64, -64, -64, -64, -64, -64, 64, 64, 64, 64, 64, 64, 64, -64, 64, 64, 64, 64, 64, -64, -64, -64, -64, -64, 64, -64, -64, 64, 64, -64, 64, 64, 64, 64, 64, 64, -64, -64, -64, 64, 64, -64, -64, 64, 64, 64, 64, 64, -64, 64, 64, 64, -64, 64, -64, 64, -64, -64, 64, -64, 64, -64, 64, 64, 64, -64, -64, 64, -64, 64, 64, 64, 64, 64, -64, -64, 64, 64, 64, 64, 64, -64, 64, 64, -64, 64, 64, -64, 64, -64, -64, 64, 64, -64, 64, -64, -64, 64, 64, -64, 64, 64, 64, -64, -64, 64, -64, -64, -64, -64, -64, 64, 64, 64, -64, -64, 64, 64, 64, 64, -64, -64, -64, -64, -64, -64, 64, 64, 64, -64, -64, 64, 64, 64, -64, 64, -64, 64, -64, -64, -64, 64, -64, 64, 64, 64, 64, 64, 64, 64, 64, 64, -64, -64, 64, 64, 64, 64, 64, 64, 64, 64, 64, 64, -64, -64, 64, -64, 64, 64, -64, -64, -64, 64, 64, 64, -64, 64, 64, -64, -64, -64, 64, 64, 64, 64, 64, 64, 64, 64, -64, -64, -64, -64, -64, -64, -64, -64, 64, -64, 64, 64, 64, 64, 64, 64, 64, 64, -64, -64, -64, 64, 64, 64, -64, 64, -64, -64, 64, -64, -64, 64, 64, 64, 64, -64, 64, -64, -64, 64, -64, 64, 64, -64, 64, 64, -64, 64, 64, 64, 64, -64, 64, -64, 64, 64, -64, 64, 64, 64, -64, -64, 64, 64, 64, -64, -64, 64, -64, -64, -64, 64, -64, 64, 64, -64, -64, -64, 64, -64, -64, 64, 64, 64, -64, 64, -64, -64, -64, -64, -64, 64, -64, -64, 64, 64, -64, 64, 64, -64, 64, -64, -64, 64, 64, 64, -64, 64, 64, 64, 64, 64, -64, -64, 64, 64, -64, -64, 64, -64, 64, 64, -64, -64, 64, -64, 64, -64, 64, -64, -64, -64, 64, -64, 64, -64, 64, -64, -64, 64, 64, 64, -64, 64, -64, -64, -64, 64, 64, 64, 64, 64, -64, -64, 64, 64, 64, -64, -64, -64, -64, -64, 64, 64, -64, 64, -64, -64, 64, 64, -64, -64, -64, 64, 64, 64, 64, -64, -64, -64, -64, -64, 64, -64, -64, 64, 64, 64, -64, 64, -64, -64, 64, -64, 64, 64, -64, -64, 64, 64, -64, 64, 64, 64, 64, 64, 64, 64, -64, 64, 64, -64, 64, 64, -64, -64, 64, -64, -64, 64, -64, -64, 64, -64, -64, -64, -64, -64, -64, -64, 64, 64, -64, -64, -64, -64, -64, 64, 64, 64, 64, 64, 64, -64, -64, -64, 64, 64, 64, -64, 64, -64, 64, 64, 64, -64, -64, 64, 64, -64, -64, 64, 64, -64, 64, -64, -64, 64, 64, -64, -64, -64, -64, -64, -64, -64, 64, 64, 64, 64, 64, 64, -64, -64, 64, -64, 64, -64, 64, 64, -64, 64, -64, 64, 64, 64, 64, 64, -64, -64, -64, -64, -64, -64, -64, 64, 64, 64, 64, -64, -64, 64, 64, 64, -64, -64, -64, 64, 64, 64, -64, -64, 64, 64, 64, 64, 64, -64, -64, -64, -64, -64, 64, 64, 64, 64, 64, 64, 64, 64, 64, -64, -64, 64, -64, -64, 64, -64, 64, -64, 64, 64, 64, -64, -64, 64, -64, -64, -64, 64, 64, -64, 64, 64, 64, 64, -64, 64, -64, 64, -64, -64, -64, 64, 64, -64, -64, 64, 64, -64, -64, -64, -64, -64, -64, 64, 64, 64, 64, 64, -64, 64, 64, 64, -64, 64, 64, -64, 64, 64, -64, 64, -64, 64, 64, -64, -64, -64, -64, -64, -64, -64, -64, -64, 64, 64, 64, 64, 64, -64, 64, 64, 64, -64, -64, 64, 64, 64, 64, 64, -64, -64, -64, -64, -64, -64, -64, -64, -64, -64, -64, 64, 64, 64, 64, 64, 64, -64, 64, 64, -64, 64, 64, -64, 64, 64, 64, 64, -64, -64, 64, 64, -64, -64, -64, -64, -64, -64, -64, 64, 64, 64, 64, 64, -64, 64, 64, 64, 64, -64, 64, 64, 64, 64, 64, -64, 64, -64, -64, -64, -64, -64, -64, -64, -64, -64, 64, 64, -64, -64, 64, -64, -64, 64, 64, 64, 64, 64, 64, 64, 64, 64, 64, 64, 64, -64, 64, -64, -64, -64, -64, -64, 64, 64, -64, -64, -64, -64, -64, -64, -64, 64, 64, 64, 64, 64, 64, -64, 64, 64, -64, 64, 64, 64, 64, -64, -64, -64, -64, 64, 64, 64, 64, -64, -64, -64, -64, -64, 64, 64, 64, 64, -64, -64, -64, 64, 64, 64, 64, 64, 64, 64, 64, 64, -64, -64, -64, -64, 64, 64, -64, -64, -64, -64, -64, -64, -64, 64, 64, 64, 64, 64, -64, 64, 64, -64, -64, -64, 64, 64, 64, -64, -64, -64, 64, 64, -64, 64, -64, -64, -64, -64, -64, -64, 64, 64, 64, -64, 64, 64, 64, -64, -64, 64, 64, 64, 64, 64, -64, -64, -64, -64, -64, 64, 64, -64, -64, -64, -64, -64, -64, -64, 64, -64, 64, 64, 64, 64, 64, -64, -64, -64, 64, -64, 64, 64, 64, -64, 64, 64, -64, -64, -64, 64, 64, 64, 64, -64, -64, 64, -64, 64, -64, 64, 64, 64, 64, -64, -64, 64, 64, 64, -64, 64, 64, 64, 64, 64, 64, 64, 64, -64, -64, -64, -64, -64, 64, -64, -64, 64, 64, -64, -64, -64, 64, 64, 64, -64, 64, -64, 64, 64, 64, 64, 64, 64, -64, -64, -64, -64, -64, -64, 64, 64, 64, -64, 64, 64, -64, -64, -64, 64, 64, 64, 64, -64, 64, 64, -64, -64, -64, 64, 64, 64, 64, 64, -64, -64, -64, 64, -64, -64, 64, -64, -64, -64, -64, -64, 64, -64, 64, 64, 64, -64, -64, -64, -64, 64, 64, 64, 64, 64, 64, -64, -64, -64, -64, 64, -64, 64, 64, -64, -64, -64, -64, -64, 64, -64, 64, -64, -64, -64, -64, -64, -64, 64, 64, 64, 64, -64, -64, -64, -64, -64, 64, 64, 64, -64, -64, -64, -64, -64, -64, -64, -64, 64, -64, -64, -64, -64, -64, 64, -64, -64, 64, 64, 64, -64, 64, -64, -64, -64, -64, -64, -64, -64, -64, -64, -64, -64, -64, -64, -64, 64, 64, -64, -64, 64, 64, 64, 64, -64, 64, 64, 64, -64, 64, -64, 64, -64, -64, -64, -64, -64, -64, -64, 64, 64, -64, 64, -64, 64, 64, 64, 64, 64, 64, 64, 64, 64, 64, 64, -64, -64, -64, -64, -64, -64, -64, -64, 64, 64, -64, -64, 64, -64, 64, 64, 64, 64, 64, -64, 64, -64, 64, -64, -64, -64, -64, 64, -64, -64, -64, 64, -64, 64, -64, -64, 64, 64, -64, -64, -64, 64, -64, -64, -64, -64, 64, 64, 64, -64, -64, -64, -64, -64, 64, 64, -64, -64, -64, 64, -64, -64, 64, 64, -64, 64, -64, -64, -64, 64, -64, 64, -64, -64, -64, 64, 64, 64, 64, -64, 64, 64, 64, -64, 64, 64, 64, -64, -64, -64, -64, -64, 64, -64, -64, 64, 64, -64, 64, 64, 64, 64, 64, 64, 64, 64, -64, -64, -64, 64, -64, -64, -64, -64, -64, -64, -64, -64, -64, 64, -64, -64, -64, 64, -64, -64, 64, 64, 64, 64, -64, 64, -64, -64, -64, -64, 64, -64, -64, 64, 64, -64, -64, -64, 64, -64, -64, 64, 64, 64, -64, -64, 64, 64, 64, 64, 64, -64, 64, 64, -64, 64, -64, -64, -64, -64, -64, -64, -64, -64, -64, -64, -64, 64, -64, 64, -64, 64, 64, 64, 64, 64, -64, -64, 64, -64, 64, 64, -64, 64, -64, 64, -64, -64, -64, -64, -64, -64, -64, -64, -64, -64, -64, -64, -64, -64, 64, -64, 64, -64, -64, 64, -64, 64, -64, 64, 64, -64, 64, -64, -64, -64, -64, -64, -64, -64, -64, -64, -64, -64, -64, -64, -64, -64, -64, -64, 64, 64, 64, -64, -64, 64, 64, 64, 64, -64, -64, 64, -64, -64, -64, -64, -64, -64, -64, -64, -64, -64, -64, -64, -64, -64, 64, -64, 64, 64, 64, -64, -64, 64, -64, 64, -64, -64, 64, -64, -64, -64, -64, -64, 64, -64, -64, -64, -64, -64, -64, 64, -64, 64, 64, 64, 64, -64, 64, 64, 64, 64, -64, -64, -64, -64, -64, 64, 64, -64, -64, -64, 64, -64, -64, 64, -64, -64, -64, 64, 64, -64, -64, -64, -64, -64, 64, -64, 64, 64, -64, -64, -64, 64, -64, 64, 64, -64, -64, -64, 64, -64, -64, 64, -64, -64, -64, -64, -64, -64, 64, -64, -64, -64, -64, -64, 64, -64, 64, -64, -64, 64, -64, 64, 64, -64, 64, 64, -64, -64, 64, 64, -64, 64, -64, -64, -64, -64, 64, 64, 64, -64, -64, -64, -64, -64, 64, -64, 64, 64, 64, 64, 64, 64, -64, -64, -64, -64, 64, 64, -64, 64, -64, 64, -64, -64, -64, -64, 64, -64, -64, -64, -64, -64, -64, -64, -64, -64, 64, 64, 64, 64, 64, -64, -64, 64, 64, 64, 64, -64, -64, -64, -64, 64, -64, 64, 64, 64, 64, 64, 64, 64, 64, -64, -64, 64, 64, 64, 64, -64, 64, -64, 64, 64, -64, -64, -64, -64, -64, 64, 64, 64, 64, -64, -64, -64, -64, -64, 64, 64, 64, -64, 64, -64, 64, 64, 64, 64, 64, 64, 64, 64, 64, -64, -64, -64, -64, -64, -64, -64, -64, -64, -64, -64, -64, -64, 64, 64, 64, -64, 64, 64, -64, -64, -64, -64, 64, 64, 64, 64, 64, 64, -64, -64, -64, -64, -64, 64, -64, -64, -64, -64, -64, -64, -64, -64, -64, 64, 64, -64, 64, -64, -64, 64, -64, -64, 64, 64, -64, -64, -64, -64, 64, 64, 64, 64, 64, -64, -64, -64, -64, 64, -64, -64, 64, 64, -64, 64, -64, -64, -64, -64, -64, -64, -64, -64, -64, -64, -64, -64, -64, -64, 64, 64, -64, 64, -64, -64, -64, 64, -64, -64, 64, -64, 64, 64, -64, 64, 64, -64, -64, -64, -64, -64, -64, -64, -64, -64, -64, -64, 64, -64, -64, -64, -64, -64, 64, -64, -64, 64, -64, -64, 64, 64, 64, 64, 64, 64, -64, -64, -64, -64, -64, -64, -64, 64, 64, 64, 64, 64, -64, -64, -64, -64, 64, -64, 64, -64, 64, 64, 64, 64, 64, 64, 64, 64, -64, -64, -64, -64, -64, -64, -64, -64, 64, 64, 64, -64, -64, -64, -64, -64, -64, -64, -64, 64, 64, -64, 64, -64, -64, 64, 64, 64, 64, -64, -64, -64, -64, -64, -64, -64, 64, -64, -64, -64, -64, -64, -64, 64, 64, -64, 64, 64, -64, -64, 64, -64, 64, -64, 64, 64, 64, 64, -64, -64, -64, -64, 64, -64, 64, -64, -64, -64, -64, -64, 64, 64, 64, -64, 64, 64, -64, -64, -64, -64, 64, 64, 64, 64, 64, 64, 64, 64, -64, 64, -64, -64, -64, -64, -64, -64, -64, 64, 64, 64, 64, -64, 64, 64, 64, 64, 64, 64, 64, -64, 64, 64, 64, 64, 64, 64, 64, -64, -64, -64, -64, -64, -64, -64, 64, -64, -64, 64, 64, -64, -64, 64, -64, 64, -64, -64, 64, 64, -64, 64, -64, -64, -64, -64, -64, -64, 64, 64, 64, -64, -64, -64, 64, 64, -64, 64, 64, -64, -64, 64, -64, -64, 64, 64, 64, -64, -64, -64, -64, -64, -64, -64, -64, -64, -64, -64, -64, -64, -64, -64, -64, 64, 64, 64, 64, 64, -64, 64, 64, 64, -64, 64, -64, 64, 64, -64, 64, 64, 64, -64, -64, 64, -64, -64, -64, 64, -64, -64, 64, 64, -64, -64, -64, -64, -64, 64, -64, -64, -64, 64, 64, 64, -64, 64, -64, -64, -64, -64, -64, -64, 64, -64, 64, 64, -64, 64, -64, -64, -64, -64, 64, 64, 64, -64, -64, -64, -64, -64, -64, 64, 64, -64, -64, -64, 64, 64, -64, -64, -64, 64, 64, 64, -64, -64, -64, 64, 64, 64, -64, 64, -64, -64, 64, 64, 64, -64, -64, 64, 64, -64, 64, 64, 64, -64, -64, -64, 64, -64, -64, -64, 64, -64, -64, -64, -64, 64, -64, -64, 64, 64, 64, 64, 64, -64, -64, 64, -64, -64, -64, -64, -64, -64, -64, -64, -64, -64, 64, -64, 64, 64, 64, -64, -64, -64, 64, -64, -64, 64, 64, 64, 64, -64, -64, -64, -64, -64, -64, -64, -64, -64, -64, 64, 64, -64, 64, 64, 64, 64, -64, -64, -64, -64, -64, -64, -64, 64, -64, 64, -64, -64, -64, -64, -64, -64, -64, -64, 64, -64, -64, -64, -64, -64, -64, -64, -64, -64, -64, 64, 64, 64, 64, 64, -64, -64, -64, 64, -64, -64, -64, -64, -64, -64, 64, -64, 64, 64, 64, 64, 64, -64, 64, -64, -64, -64, -64, -64, 64, 64, 64, 64, 64, -64, 64, -64, 64, 64, -64, -64, -64, -64, 64, 64, 64, 64, 64, 64, 64, 64, 64, 64, -64, -64, 64, -64, -64, 64, 64, 64, 64, -64, 64, -64, 64, -64, -64, -64, -64, 64, -64, 64, 64, 64, 64, 64, 64, 64, -64, -64, 64, -64, -64, -64, 64, 64, 64, 64, -64, -64, -64, 64, -64, 64, -64, 64, -64, 64, -64, 64, 64, 64, 64, 64, 64, 64, -64, -64, 64, -64, -64, -64, -64, 64, 64, 64, -64, 64, -64, 64, 64, -64, 64, -64, -64, -64, 64, 64, 64, 64, 64, 64, 64, -64, -64, -64, 64, -64, -64, -64, -64, 64, -64, -64, -64, -64, -64, 64, 64, 64, -64, -64, -64, 64, 64, 64, 64, 64, 64, 64, 64, -64, -64, 64, 64, 64, -64, 64, 64, -64, 64, 64, -64, -64, -64, -64, -64, -64, 64, -64, -64, 64, 64, 64, 64, 64, 64, 64, -64, 64, 64, 64, 64, -64, -64, 64, 64, 64, 64, 64, 64, -64, -64, 64, -64, 64, -64, -64, -64, -64, -64, -64, 64, 64, 64, -64, -64, -64, 64, 64, 64, 64, 64, 64, 64, -64, -64, -64, 64, 64, 64, -64, 64, -64, -64, 64, -64, 64, 64, 64, 64, 64, 64, -64, 64, 64, 64, 64, 64, 64, 64, 64, -64, -64, -64, -64, 64, -64, 64, 64, -64, -64, 64, -64, -64, 64, 64, 64, 64, 64, 64, 64, -64, 64, 64, 64, 64, -64, -64, -64, 64, -64, -64, 64, 64, -64, 64, -64, -64, -64, 64, 64, -64, 64, -64, 64, 64, 64, 64, 64, -64, 64, 64, -64, -64, -64, 64, -64, -64, -64, -64, -64, 64, 64, 64, -64, -64, -64, 64, 64, -64, -64, -64, -64, -64, -64, 64, 64, -64, 64, 64, 64, 64, -64, -64, -64, -64, -64, 64, -64, 64, 64, -64, 64, 64, -64, 64, 64, -64, -64, -64, -64, -64, -64, -64, -64, -64, -64, -64, 64, 64, -64, -64, -64, 64, 64, 64, 64, 64, 64, 64, 64, 64, -64, 64, -64, -64, 64, -64, -64, -64, -64, -64, -64, -64, -64, 64, 64, 64, -64, -64, -64, 64, 64, 64, -64, 64, 64, -64, -64, 64, -64, -64, 64, 64, -64, 64, -64, -64, -64, -64, -64, -64, -64, -64, 64, -64, 64, -64, 64, 64, 64, 64, -64, 64, 64, 64, 64, 64, 64, -64, -64, 64, 64, 64, -64, -64, -64, -64, -64, 64, -64, 64, 64, -64, -64, 64, 64, 64, -64, 64, 64, 64, 64, -64, -64, 64, 64, -64, -64, -64, 64, -64, 64, -64, -64, 64, 64, -64, -64, 64, -64, 64, 64, 64, 64, 64, 64, 64, 64, -64, 64, 64, -64, -64, -64, -64, -64, -64, -64, -64, 64, -64, 64, 64, 64, 64, 64, -64, 64, 64, -64, -64, 64, 64, -64, 64, 64, -64, 64, 64, -64, 64, 64, -64, -64, -64, 64, 64, 64, 64, 64, 64, 64, -64, 64, 64, 64, -64, -64, -64, 64, 64, -64, -64, -64, -64, -64, -64, 64, 64, 64, -64, 64, 64, 64, 64, 64, 64, 64, 64, 64, 64, 64, 64, 64, 64, -64, -64, 64, 64, -64, 64, -64, 64, -64, 64, -64, 64, -64, 64, 64, 64, 64, 64, 64, 64, 64, 64, 64, 64, 64, 64, 64, -64, 64, -64, -64, 64, 64, -64, -64, 64, 64, -64, -64, -64, 64, 64, 64, -64, -64, 64, -64, 64, -64, 64, 64, -64, -64, -64, 64, -64, -64, 64, 64, 64, -64, -64, 64, 64, 64, 64, 64, 64, 64, -64, 64, -64, 64, -64, -64, 64, 64, -64, 64, 64, 64, 64, 64, -64, -64, 64, 64, -64, 64, -64, -64, -64, -64, -64, 64, 64, -64, -64, 64, -64, -64, -64, 64, -64, -64, 64, 64, -64, 64, -64, -64, -64, 64, -64, 64, -64, -64, 64, -64, -64, -64, -64, -64, -64, -64, 64, 64, -64, -64, -64, -64, 64, 64, 64, 64, 64, 64, 64, 64, 64, 64, 64, 64, -64, 64, 64, -64, -64, -64, 64, 64, -64, -64, -64, -64, 64, -64, -64, -64, -64, 64, 64, 64, 64, 64, -64, 64, 64, 64, 64, 64, -64, -64, 64, -64, 64, -64, 64, 64, -64, -64, -64, 64, 64, -64, -64, -64, -64, 64, -64, -64, -64, -64, -64, -64, -64, 64, 64, 64, 64, -64, 64, 64, 64, -64, 64, -64, -64, 64, 64, -64, -64, -64, -64, -64, -64, -64, -64, -64, -64, -64, -64, -64, -64, -64, -64, -64, -64, -64, 64, -64, 64, -64, 64, -64, -64, 64, -64, -64, -64, -64, -64, -64, -64, -64, -64, -64, -64, -64, 64, -64, -64, -64, -64, -64, -64, -64, -64, -64, -64, -64, 64, -64, -64, -64, -64, 64, 64, -64, -64, -64, -64, -64, -64, -64, 64, 64, -64, -64, -64, -64, -64, -64, -64, -64, -64, -64, -64, -64, -64, 64, -64, -64, -64, -64, 64, -64, -64, -64, -64, -64, -64, 64, -64, -64, -64, -64, -64, -64, -64, -64, -64, -64, -64, -64, -64, -64, -64, 64, -64, -64, -64, 64, -64, -64, -64, 64, -64, -64, 64, -64, -64, -64, -64, -64, -64, -64, -64, -64, -64, -64, -64, -64, -64, -64, 64, 64, 64, -64, -64, -64, -64, 64, 64, 64, 64, 64, 64, -64, -64, -64, -64, -64, -64, 64, -64, 64, -64, 64, 64, -64, -64, -64, 64, -64, 64, 64, -64, 64, 64, 64, 64, 64, 64, -64, 64, 64, -64, -64, 64, 64, 64, -64, -64, -64, 64, 64, 64, -64, -64, -64, -64, -64, -64, -64, 64, 64, 64, 64, 64, 64, 64, 64, 64, 64, 64, 64, 64, 64, 64, 64, 64, 64, 64, 64, 64, 64, -64, -64, 64, -64, -64, 64, 64, 64, 64, 64, 64, 64, 64, 64, 64, 64, 64, 64, 64, 64, 64, 64, 64, 64, 64, 64, 64, 64, 64, 64, -64, 64, -64, -64, -64, 64, 64, 64, 64, 64, 64, 64, 64, 64, 64, 64, 64, 64, 64, 64, -64, 64, 64, 64, 64, 64, 64, -64, -64, -64, -64, -64, 64, 64, 64, 64, 64, 64, -64, 64, 64, 64, 64, 64, 64, 64, 64, -64, 64, 64, 64, 64, 64, 64, -64, 64, 64, 64, -64, -64, 64, 64, 64, 64, 64, 64, 64, -64, -64, 64, -64, 64, 64, 64, 64, -64, 64, 64, 64, -64, -64, -64, 64, -64, 64, -64, -64, -64, -64, 64, -64, 64, 64, 64, 64, -64, -64, -64, 64, -64, 64, -64, -64, 64, 64, -64, 64, -64, -64, -64, 64, -64, 64, -64, -64, -64, -64, -64, -64, 64, 64, 64, 64, 64, 64, -64, 64, 64, 64, 64, -64, 64, -64, -64, -64, -64, -64, -64, 64, -64, 64, 64, -64, 64, -64, -64, 64, -64, -64, -64, 64, -64, 64, -64, 64, 64, -64, -64, -64, 64, -64, -64, 64, -64, -64, -64, -64, 64, -64, 64, -64, 64, -64, -64, 64, -64, -64, -64, 64, -64, -64, -64, -64, -64, -64, -64, 64, 64, -64, 64, 64, 64, 64, -64, -64, -64, -64, 64, 64, -64, 64, -64, -64, -64, -64, -64, -64, -64, -64, -64, -64, -64, -64, -64, -64, -64, -64, 64, -64, -64, -64, 64, 64, 64, 64, 64, 64, 64, -64, -64, -64, -64, -64, -64, -64, -64, -64, -64, -64, -64, -64, -64, -64, -64, -64, -64, -64, 64, -64, 64, -64, 64, 64, -64, -64, -64, 64, -64, -64, -64, 64, -64, -64, -64, -64, -64, -64, -64, -64, -64, -64, -64, -64, 64, 64, -64, 64, 64, -64, -64, 64, 64, -64, -64, -64, 64, -64, -64, -64, -64, -64, 64, -64, -64, -64, -64, -64, -64, -64, -64, 64, 64, 64, 64, 64, 64, 64, -64, -64, -64, 64, 64, -64, 64, 64, 64, 64, 64, 64, 64, -64, -64, -64, 64, 64, 64, 64, 64, -64, 64, 64, 64, 64, -64, -64, 64, 64, 64, 64, -64, -64, 64, -64, 64, 64, 64, 64, -64, -64, 64, 64, 64, -64, 64, -64, -64, -64, 64, -64, -64, -64, 64, -64, 64, 64, 64, 64, 64, -64, -64, -64, -64, -64, 64, -64, -64, 64, -64, -64, -64, 64, 64, -64, -64, 64, 64, 64, -64, 64, 64, -64, 64, -64, -64, -64, -64, 64, -64, -64, -64, 64, -64, 64, -64, -64, -64, 64, -64, 64, -64, -64, -64, -64, 64, -64, 64, 64, 64, 64, -64, -64, -64, -64, 64, -64, -64, -64, -64, -64, 64, -64, 64, -64, -64, -64, -64, -64, -64, 64, -64, -64, -64, -64, -64, -64, 64, -64, 64, -64, -64, -64, -64, -64, -64, -64, 64, 64, 64, 64, -64, -64, -64, -64, -64, -64, -64, -64, -64, -64, -64, -64, -64, -64, -64, 64, 64, -64, 64, 64, -64, -64, -64, 64, 64, -64, 64, 64, -64, -64, 64, -64, -64, -64, -64, -64, -64, -64, -64, -64, 64, 64, -64, 64, -64, -64, -64, 64, 64, -64, 64, -64, -64, 64, 64, 64, 64, 64, 64, -64, -64, -64, -64, -64, -64, -64, -64, -64, 64, 64, -64, -64, -64, -64, 64, -64, 64, -64, 64, 64, 64, -64, -64, -64, -64, -64, -64, -64, -64, 64, -64, -64, -64, -64, -64, -64, -64, -64, -64, -64, -64, 64, -64, -64, 64, 64, 64, 64, 64, 64, 64, -64, -64, 64, -64, -64, 64, -64, -64, -64, 64, 64, -64, -64, -64, -64, -64, -64, -64, 64, 64, 64, 64, 64, 64, 64, -64, 64, 64, 64, 64, 64, 64, -64, -64, 64, 64, 64, -64, -64, 64, 64, 64, -64, -64, -64, -64, 64, 64, 64, 64, 64, 64, 64, -64, 64, 64, 64, 64, -64, -64, 64, -64, 64, -64, -64, 64, 64, -64, 64, -64, 64, -64, -64, 64, -64, -64, -64, 64, 64, -64, 64, 64, 64, 64, 64, -64, -64, -64, 64, 64, 64, 64, 64, 64, 64, -64, -64, -64, 64, -64, -64, -64, 64, -64, -64, 64, 64, 64, 64, 64, 64, 64, 64, -64, 64, -64, -64, -64, -64, -64, 64, 64, -64, -64, 64, -64, 64, -64, 64, 64, 64, 64, -64, -64, -64, -64, 64, 64, -64, 64, 64, -64, -64, -64, -64, -64, -64, -64, 64, 64, -64, 64, -64, 64, 64, 64, -64, -64, -64, 64, 64, -64, 64, 64, 64, 64, 64, 64, 64, -64, -64, -64, -64, -64, -64, -64, -64, 64, -64, 64, 64, 64, 64, 64, -64, 64, 64, 64, -64, -64, -64, 64, 64, 64, 64, 64, -64, -64, -64, -64, -64, -64, -64, 64, 64, -64, 64, 64, 64, 64, -64, 64, 64, 64, 64, -64, -64, -64, 64, 64, 64, 64, 64, 64, -64, -64, -64, -64, -64, -64, -64, -64, 64, -64, -64, 64, 64, 64, 64, -64, -64, -64, 64, -64, 64, -64, -64, 64, 64, 64, -64, -64, -64, -64, -64, -64, -64, -64, -64, 64, 64, -64, -64, 64, 64, 64, -64, -64, -64, 64, 64, 64, -64, -64, -64, 64, 64, 64, -64, 64, -64, 64, 64, 64, -64, -64, 64, 64, 64, -64, 64, 64, 64, 64, -64, -64, -64, 64, 64, -64, 64, 64, -64, -64, 64, 64, -64, 64, -64, 64, 64, 64, 64, 64, 64, 64, -64, -64, -64, 64, 64, 64, -64, -64, 64, -64, -64, 64, -64, -64, -64, -64, -64, -64, 64, -64, 64, 64, 64, 64, 64, 64, 64, -64, -64, -64, -64, 64, 64, 64, -64, -64, -64, -64, 64, 64, 64, 64, -64, -64, -64, -64, -64, -64, -64, -64, -64, 64, 64, 64, 64, -64, -64, -64, -64, -64, 64, 64, -64, -64, 64, 64, -64, -64, -64, -64, 64, -64, -64, 64, -64, -64, -64, 64, -64, 64, -64, -64, -64, -64, -64, -64, -64, -64, 64, 64, -64, -64, 64, 64, -64, 64, -64, 64, -64, -64, -64, -64, -64, -64, -64, -64, -64, -64, -64, -64, -64, -64, -64, -64, -64, 64, -64, -64, -64, -64, -64, -64, -64, -64, 64, -64, 64, -64, -64, -64, -64, 64, 64, -64, -64, -64, -64, -64, -64, -64, -64, -64, -64, -64, 64, 64, -64, -64, -64, 64, -64, 64, -64, -64, 64, -64, -64, 64, -64, 64, -64, 64, -64, -64, -64, -64, -64, -64, -64, -64, 64, 64, -64, 64, 64, 64, 64, -64, -64, -64, 64, 64, -64, -64, 64, 64, 64, 64, -64, 64, -64, -64, -64, -64, -64, -64, -64, 64, 64, 64, 64, -64, 64, 64, 64, 64, -64, 64, -64, 64, 64, 64, 64, 64, 64, 64, 64, 64, -64, -64, -64, 64, -64, -64, 64, 64, 64, -64, 64, 64, -64, -64, 64, 64, -64, 64, 64, 64, 64, -64, 64, 64, -64, -64, -64, -64, -64, 64, 64, 64, -64, -64, -64, -64, -64, -64, 64, -64, 64, 64, -64, 64, 64, 64, 64, 64, -64, 64, -64, -64, -64, -64, -64, 64, 64, -64, 64, -64, -64, 64, 64, -64, 64, 64, 64, -64, 64, -64, 64, -64, 64, 64, -64, -64, -64, 64, 64, 64, 64, -64, 64, -64, -64, 64, -64, -64, -64, 64, 64, 64, -64, 64, -64, -64, -64, 64, 64, 64, 64, 64, 64, 64, 64, -64, 64, -64, 64, -64, -64, -64, -64, 64, -64, -64, 64, -64, -64, 64, -64, 64, -64, -64, 64, -64, 64, 64, 64, 64, 64, -64, 64, -64, 64, -64, 64, 64, -64, -64, -64, -64, 64, 64, 64, 64, -64, -64, 64, 64, -64, -64, 64, 64, 64, 64, -64, -64, 64, 64, -64, 64, -64, -64, -64, -64, 64, 64, 64, -64, 64, -64, -64, -64, -64, -64, -64, -64, -64, 64, 64, 64, 64, 64, 64, 64, 64, -64, 64, 64, -64, -64, -64, -64, 64, 64, -64, 64, -64, -64, 64, 64, 64, -64, -64, -64, -64, 64, -64, -64, 64, -64, -64, -64, 64, -64, -64, -64, -64, -64, 64, 64, -64, 64, 64, 64, -64, 64, -64, -64, -64, -64, 64, 64, -64, -64, -64, -64, 64, 64, 64, 64, 64, -64, -64, -64, -64, -64, -64, -64, -64, 64, 64, -64, -64, 64, -64, -64, -64, -64, -64, -64, -64, -64, -64, -64, 64, 64, 64, -64, -64, -64, -64, -64, -64, -64, -64, -64, -64, 64, 64, -64, -64, -64, -64, -64, -64, -64, -64, -64, -64, -64, -64, -64, 64, 64, 64, 64, -64, -64, -64, -64, 64, 64, -64, -64, 64, 64, -64, -64, -64, -64, -64, -64, -64, -64, -64, 64, -64, -64, -64, -64, -64, -64, 64, 64, -64, -64, -64, 64, -64, -64, -64, -64, 64, 64, 64, 64, 64, 64, 64, -64, -64, -64, -64, -64, -64, -64, -64, -64, -64, 64, -64, 64, 64, 64, -64, 64, 64, 64, -64, -64, -64, 64, 64, 64, 64, 64, 64, 64, -64, -64, -64, -64, -64, -64, -64, -64, -64, -64, -64, -64, 64, 64, -64, -64, 64, 64, 64, 64, -64, -64, 64, 64, 64, 64, 64, -64, -64, -64, -64, -64, -64, -64, -64, -64, 64, 64, -64, -64, -64, -64, -64, -64, -64, -64, -64, 64, 64, -64, -64, 64, -64, 64, -64, -64, -64, -64, -64, -64, -64, -64, -64, 64, 64, 64, 64, -64, 64, 64, -64, -64, 64, -64, -64, 64, -64, -64, 64, -64, -64, 64, -64, -64, -64, -64, -64, -64, -64, -64, -64, 64, 64, 64, -64, 64, 64, 64, 64, 64, 64, 64, 64, -64, -64, -64, -64, -64, 64, 64, -64, -64, -64, -64, -64, -64, -64, 64, 64, 64, 64, 64, -64, 64, -64, -64, 64, 64, -64, -64, 64, 64, 64, -64, -64, -64, 64, 64, -64, -64, -64, -64, -64, -64, -64, -64, -64, 64, 64, 64, 64, -64, 64, -64, 64, -64, -64, -64, -64, -64, 64, 64, -64, -64, -64, 64, 64, -64, -64, -64, -64, -64, -64, 64, -64, 64, 64, 64, 64, 64, 64, 64, -64, 64, -64, -64, -64, -64, -64, -64, 64, 64, 64, 64, -64, -64, -64, -64, 64, 64, 64, 64, -64, 64, 64, 64, 64, 64, 64, 64, -64, -64, -64, -64, -64, 64, -64, -64, 64, -64, -64, 64, -64, -64, 64, -64, -64, 64, -64, -64, -64, 64, 64, 64, 64, -64, -64, 64, -64, -64, -64, -64, -64, -64, 64, -64, 64, -64, 64, 64, 64, -64, 64, 64, -64, -64, -64, -64, 64, 64, 64, 64, -64, 64, -64, 64, -64, 64, 64, -64, -64, -64, 64, 64, 64, 64, 64, -64, -64, -64, -64, 64, -64, -64, -64, 64, 64, 64, 64, 64, -64, 64, -64, -64, -64, -64, 64, -64, 64, -64, -64, -64, 64, -64, 64, -64, -64, -64, -64, -64, 64, -64, 64, 64, 64, 64, 64, 64, 64, -64, -64, -64, 64, -64, 64, -64, 64, -64, -64, -64, -64, -64, -64, -64, -64, -64, -64, -64, 64, 64, 64, -64, 64, 64, -64, 64, 64, -64, 64, -64, 64, 64, -64, 64, -64, -64, -64, -64, -64, -64, -64, -64, 64, 64, -64, 64, 64, 64, -64, 64, -64, -64, -64, 64, 64, -64, -64, -64, 64, 64, 64, -64, 64, -64, -64, -64, -64, -64, -64, -64, -64, -64, 64, 64, 64, -64, -64, -64, 64, -64, 64, -64, 64, -64, 64, -64, -64, 64, 64, 64, -64, -64, 64, -64, -64, -64, -64, -64, -64, -64, 64, -64, -64, -64, -64, -64, -64, -64, 64, 64, -64, -64, 64, 64, 64, 64, -64, -64, 64, 64, -64, -64, -64, -64, -64, -64, -64, -64, 64, -64, 64, 64, -64, 64, -64, 64, -64, -64, 64, 64, 64, 64, -64, 64, 64, -64, -64, 64, 64, 64, 64, 64, 64, -64, -64, 64, -64, -64, -64, -64, 64, 64, -64, 64, 64, 64, -64, -64, 64, 64, -64, 64, -64, 64, -64, -64, -64, -64, -64, -64, 64, 64, -64, -64, 64, -64, 64, 64, -64, 64, -64, -64, 64, 64, -64, -64, -64, 64, 64, -64, 64, 64, -64, 64, -64, -64, 64, 64, -64, -64, -64, -64, 64, 64, 64, -64, -64, -64, -64, 64, 64, 64, 64, 64, -64, 64, 64, -64, 64, 64, -64, -64, 64, -64, -64, -64, -64, -64, -64, -64, -64, -64, 64, -64, -64, 64, 64, -64, -64, -64, 64, 64, -64, -64, -64, 64, -64, -64, -64, 64, -64, -64, -64, -64, -64, -64, -64, 64, 64, 64, 64, 64, 64, 64, -64, 64, -64, 64, 64, 64, -64, 64, 64, -64, -64, 64, 64, -64, -64, -64, -64, -64, 64, 64, 64, -64, 64, 64, 64, 64, 64, 64, 64, 64, 64, 64, -64, 64, -64, -64, -64, 64, 64, 64, -64, 64, 64, 64, 64, 64, 64, 64, 64, -64, -64, 64, 64, 64, 64, -64, 64, -64, 64, 64, -64, 64, -64, 64, 64, 64, -64, 64, 64, -64, 64, 64, 64, 64, 64, -64, -64, 64, -64, -64, 64, 64, 64, 64, 64, 64, 64, -64, 64, -64, -64, -64, -64, -64, -64, -64, -64, -64, -64, 64, 64, 64, -64, -64, -64, -64, 64, 64, 64, 64, -64, 64, 64, 64, 64, 64, -64, 64, -64, 64, -64, -64, -64, -64, 64, -64, -64, 64, 64, -64, -64, -64, -64, -64, 64, 64, 64, 64, 64, 64, 64, 64, -64, -64, -64, 64, 64, -64, -64, -64, -64, -64, -64, -64, -64, 64, 64, -64, -64, 64, -64, -64, 64, 64, 64, 64, 64, 64, -64, 64, -64, 64, 64, -64, 64, -64, -64, -64, -64, -64, 64, -64, 64, 64, 64, 64, -64, -64, 64, 64, 64, 64, 64, 64, -64, 64, 64, -64, 64, -64, 64, -64, 64, -64, -64, -64, -64, 64, -64, 64, 64, 64, 64, 64, -64, -64, -64, -64, -64, 64, 64, 64, 64, 64, -64, 64, 64, -64, -64, 64, -64, -64, -64, 64, 64, 64, 64, 64, 64, 64, 64, 64, 64, -64, -64, -64, -64, 64, 64, 64, 64, 64, 64, -64, -64, -64, -64, -64, -64, 64, 64, -64, 64, 64, 64, -64, 64, 64, 64, 64, -64, -64, 64, -64, 64, 64, 64, 64, 64, 64, -64, 64, -64, -64, 64, 64, -64, -64, 64, 64, 64, 64, 64, 64, 64, 64, 64, 64, -64, -64, -64, -64, 64, 64, 64, 64, 64, 64, 64, 64, -64, -64, 64, 64, 64, -64, -64, 64, 64, 64, 64, 64, 64, 64, 64, -64, -64, -64, 64, -64, 64, 64, 64, 64, -64, -64, 64, 64, -64, -64, 64, -64, 64, 64, -64, 64, 64, 64, 64, 64, 64, 64, 64, -64, -64, 64, 64, 64, 64, 64, 64, 64, 64, -64, 64, 64, -64, -64, -64, 64, 64, -64, -64, 64, 64, 64, 64, 64, 64, 64, 64, 64, 64, -64, 64, 64, 64, 64, 64, 64, 64, -64, -64, 64, -64, 64, -64, -64, -64, 64, -64, -64, 64, 64, 64, 64, 64, 64, 64, 64, 64, 64, 64, 64, -64, 64, 64, 64, -64, 64, 64, 64, 64, -64, -64, 64, 64, -64, -64, -64, 64, -64, 64, 64, 64, 64, 64, 64, 64, 64, 64, 64, 64, -64, -64, 64, -64, 64, -64, -64, 64, -64, -64, -64, 64, -64, -64, 64, 64, 64, 64, 64, 64, 64, 64, 64, 64, -64, 64, -64, -64, -64, -64, -64, 64, -64, 64, 64, -64, -64, -64, -64, 64, 64, 64, 64, 64, 64, 64, 64, 64, 64, -64, 64, 64, 64, -64, 64, -64, -64, 64, 64, -64, -64, 64, -64, -64, 64, 64, 64, -64, 64, -64, -64, -64, 64, 64, 64, -64, -64, -64, -64, -64, 64, -64, 64, -64, 64, -64, 64, 64, 64, 64, -64, -64, -64, -64, 64, -64, 64, -64, -64, -64, -64, -64, -64, 64, -64, -64, -64, -64, -64, -64, -64, -64, -64, 64, 64, 64, 64, 64, 64, -64, -64, 64, 64, -64, 64, -64, -64, -64, -64, -64, -64, -64, 64, 64, -64, -64, -64, -64, -64, -64, -64, 64, 64, 64, -64, 64, 64, 64, -64, 64, -64, -64, -64, 64, -64, 64, -64, -64, 64, -64, -64, -64, -64, -64, -64, -64, -64, 64, -64, 64, -64, -64, 64, -64, -64, 64, -64, -64, -64, -64, 64, 64, -64, 64, -64, 64, 64, 64, -64, 64, 64, -64, -64, -64, -64, -64, -64, -64, -64, -64, 64, -64, 64, -64, 64, 64, 64, -64, 64, 64, -64, -64, 64, 64, 64, -64, -64, 64, 64, -64, 64, 64, 64, -64, 64, -64, 64, -64, 64, 64, -64, 64, 64, 64, -64, -64, -64, -64, 64, -64, -64, 64, 64, -64, 64, 64, -64, 64, 64, 64, 64, 64, 64, -64, 64, 64, -64, 64, 64, 64, 64, 64, -64, 64, 64, 64, -64, 64, -64, -64, -64, -64, 64, 64, -64, -64, -64, -64, 64, 64, 64, -64, 64, 64, 64, 64, -64, 64, -64, -64, -64, 64, 64, -64, 64, 64, 64, -64, 64, 64, -64, 64, 64, -64, 64, 64, 64, 64, 64, 64, 64, 64, -64, 64, -64, -64, -64, -64, 64, -64, -64, -64, 64, -64, -64, -64, 64, -64, -64, 64, 64, 64, 64, 64, 64, 64, 64, -64, 64, 64, -64, -64, -64, -64, 64, 64, -64, 64, 64, -64, 64, -64, -64, -64, -64, 64, 64, 64, 64, 64, 64, 64, 64, 64, 64, -64, -64, -64, 64, -64, -64, -64, 64, 64, -64, 64, 64, -64, -64, -64, -64, -64, -64, -64, 64, 64, 64, 64, 64, 64, 64, -64, -64, -64, -64, -64, -64, 64, 64, 64, 64, 64, 64, 64, 64, 64, 64, -64, -64, -64, -64, 64, 64, 64, 64, 64, 64, 64, 64, -64, -64, -64, 64, -64, -64, -64, 64, 64, 64, -64, 64, 64, -64, 64, -64, 64, -64, -64, -64, -64, 64, 64, 64, 64, 64, 64, 64, -64, -64, 64, -64, -64, 64, 64, 64, 64, 64, 64, 64, -64, 64, -64, -64, 64, 64, -64, -64, -64, -64, 64, 64, 64, 64, 64, -64, -64, -64, 64, 64, 64, 64, 64, 64, 64, 64, 64, -64, -64, 64, 64, 64, 64, -64, -64, -64, -64, -64, 64, 64, 64, 64, 64, -64, -64, 64, 64, 64, 64, 64, 64, 64, 64, -64, 64, 64, -64, 64, 64, 64, 64, 64, 64, -64, -64, -64, 64, 64, 64, 64, -64, -64, -64, -64, 64, 64, 64, 64, 64, 64, 64, 64, 64, 64, 64, 64, 64, 64, 64, 64, -64, 64, 64, 64, 64, 64, 64, -64, -64, -64, -64, 64, 64, 64, 64, 64, 64, 64, 64, -64, -64, 64, 64, 64, -64, 64, 64, 64, 64, -64, -64, 64, 64, 64, 64, -64, 64, 64, -64, 64, 64, 64, 64, 64, 64, -64, 64, 64, -64, -64, -64, -64, 64, 64, 64, 64, -64, 64, 64, 64, 64, 64, -64, 64, 64, 64, 64, 64, 64, 64, -64, -64, 64, -64, 64, 64, -64, 64, -64, -64, -64, 64, 64, 64, 64, 64, -64, 64, -64, 64, 64, -64, 64, 64, 64, 64, -64, -64, -64, -64, -64, -64, -64, 64, -64, -64, 64, 64, -64, 64, 64, 64, 64, -64, 64, 64, -64, 64, 64, -64, -64, 64, 64, 64, -64, -64, -64, -64, -64, -64, 64, 64, 64, 64, -64, -64, -64, 64, 64, 64, 64, -64, -64, -64, -64, -64, 64, -64, 64, 64, 64, -64, 64, -64, -64, -64, -64, -64, -64, -64, 64, 64, -64, -64, -64, -64, 64, 64, 64, 64, -64, 64, 64, -64, -64, -64, 64, 64, 64, 64, 64, 64, 64, 64, 64, -64, 64, 64, -64, -64, -64, 64, 64, 64, -64, -64, 64, 64, 64, -64, -64, 64, -64, 64, 64, 64, 64, 64, -64, 64, 64, 64, 64, 64, -64, 64, 64, -64, 64, -64, 64, 64, 64, 64, 64, 64, 64, 64, -64, -64, 64, 64, 64, 64, 64, 64, 64, -64, 64, 64, 64, -64, -64, -64, 64, 64, -64, -64, -64, -64, -64, 64, 64, 64, 64, -64, -64, 64, -64, 64, 64, 64, 64, 64, -64, 64, -64, -64, 64, 64, -64, -64, 64, 64, -64, -64, 64, 64, 64, 64, 64, 64, 64, -64, 64, 64, -64, 64, 64, 64, 64, 64, 64, -64, -64, -64, -64, 64, -64, -64, -64, -64, -64, 64, -64, 64, -64, -64, 64, 64, 64, -64, 64, 64, 64, 64, 64, 64, 64, 64, 64, -64, -64, 64, 64, -64, -64, -64, -64, 64, 64, 64, 64, 64, 64, 64, 64, 64, 64, -64, -64, -64, -64, -64, 64, 64, 64, 64, -64, 64, -64, 64, 64, -64, -64, 64, 64, -64, 64, 64, -64, 64, 64, 64, 64, 64, 64, 64, -64, -64, -64, -64, 64, 64, 64, 64, -64, 64, 64, 64, 64, 64, -64, 64, -64, -64, -64, -64, -64, 64, 64, -64, -64, -64, 64, 64, 64, -64, -64, 64, 64, 64, 64, 64, 64, 64, -64, -64, -64, 64, 64, -64, 64, 64, -64, -64, 64, -64, 64, -64, -64, 64, 64, -64, 64, 64, -64, 64, -64, -64, 64, 64, 64, 64, 64, 64, 64, -64, -64, -64, 64, -64, 64, -64, 64, -64, 64, -64, 64, -64, 64, -64, -64, -64, -64, -64, -64, -64, -64, 64, -64, 64, 64, 64, -64, -64, -64, -64, 64, -64, -64, 64, 64, 64, -64, -64, -64, 64, -64, -64, -64, -64, -64, -64, 64, 64, 64, -64, 64, 64, 64, 64, -64, -64, -64, -64, -64, 64, -64, -64, 64, -64, -64, -64, -64, -64, 64, 64, -64, 64, 64, -64, 64, -64, -64, -64, 64, 64, 64, -64, -64, -64, 64, 64, -64, 64, -64, 64, 64, -64, -64, 64, 64, 64, -64, 64, -64, 64, 64, 64, -64, -64, -64, -64, -64, 64, 64, -64, 64, -64, -64, -64, 64, -64, -64, -64, 64, -64, 64, -64, 64, 64, 64, -64, -64, -64, 64, -64, 64, 64, 64, 64, 64, 64, -64, 64, -64, 64, 64, -64, 64, 64, 64, 64, -64, -64, -64, -64, -64, -64, -64, -64, 64, 64, 64, 64, 64, 64, 64, 64, 64, 64, 64, 64, 64, 64, 64, -64, -64, 64, -64, -64, -64, -64, -64, -64, -64, -64, -64, -64, -64, -64, 64, 64, 64, 64, 64, 64, 64, 64, 64, 64, 64, -64, -64, 64, -64, -64, -64, 64, -64, -64, -64, 64, -64, -64, 64, 64, 64, 64, 64, 64, 64, 64, 64, 64, 64, 64, 64, 64, 64, 64, -64, 64, 64, 64, -64, -64, -64, -64, 64, 64, 64, 64, 64, 64, 64, 64, 64, 64, 64, 64, 64, 64, -64, -64, -64, 64, -64, 64, -64, -64, -64, 64, 64, -64, -64, -64, 64, -64, 64, 64, 64, 64, 64, 64, -64, 64, -64, -64, 64, 64, 64, 64, 64, 64, -64, 64, 64, 64, -64, -64, -64, -64, -64, -64, -64, 64, -64, 64, 64, -64, 64, 64, -64, -64, -64, -64, 64, 64, 64, -64, 64, 64, 64, 64, 64, 64, 64, 64, -64, -64, -64, -64, -64, -64, -64, 64, 64, -64, -64, 64, -64, -64, -64, 64, 64, 64, -64, -64, -64, 64, 64, 64, 64, 64, -64, 64, -64, -64, -64, 64, -64, -64, 64, -64, -64, -64, -64, -64, -64, -64, 64, 64, 64, -64, -64, 64, 64, -64, -64, 64, 64, 64, -64, 64, 64, -64, 64, -64, -64, -64, 64, -64, -64, -64, -64, -64, 64, 64, 64, -64, 64, -64, -64, 64, 64, 64, 64, 64, 64, -64, 64, 64, 64, 64, 64, 64, -64, -64, -64, 64, -64, 64, 64, 64, 64, 64, 64, 64, -64, -64, -64, -64, 64, 64, 64, 64, 64, -64, -64, -64, 64, -64, 64, 64, -64, -64, 64, 64, 64, 64, 64, 64, 64, 64, 64, 64, -64, -64, 64, -64, 64, 64, 64, 64, -64, -64, -64, 64, 64, -64, 64, -64, 64, -64, 64, 64, 64, 64, 64, 64, 64, 64, 64, -64, -64, 64, 64, 64, -64, 64, -64, -64, -64, -64, 64, -64, -64, -64, 64, 64, 64, -64, 64, 64, 64, 64, 64, 64, 64, 64, 64, -64, -64, 64, 64, 64, -64, -64, -64, 64, -64, 64, -64, 64, -64, 64, 64, -64, -64, -64, 64, 64, 64, 64, 64, 64, 64, 64, 64, 64, -64, -64, 64, 64, -64, -64, -64, 64, 64, -64, 64, -64, 64, 64, 64, -64, -64, 64, 64, 64, 64, 64, 64, 64, 64, 64, 64, -64, -64, -64, -64, 64, -64, 64, -64, 64, -64, -64, -64, 64, -64, -64, 64, -64, 64, 64, -64, 64, 64, 64, 64, 64, -64, 64, -64, -64, -64, 64, -64, -64, 64, -64, 64, 64, 64, -64, 64, 64, 64, -64, 64, 64, 64, 64, -64, 64, 64, 64, 64, 64, -64, -64, 64, 64, -64, 64, -64, -64, 64, -64, -64, 64, -64, -64, -64, -64, 64, -64, 64, 64, 64, 64, 64, 64, 64, -64, -64, 64, -64, -64, -64, -64, -64, -64, -64, 64, 64, 64, 64, 64, -64, -64, 64, -64, -64, -64, 64, 64, 64, 64, 64, 64, -64, 64, -64, 64, 64, 64, 64, -64, -64, 64, -64, 64, 64, 64, 64, -64, 64, 64, -64, -64, -64, -64, 64, 64, 64, 64, -64, -64, -64, -64, 64, -64, 64, 64, -64, -64, -64, -64, 64, 64, 64, 64, 64, -64, -64, -64, 64, -64, 64, -64, 64, -64, 64, -64, 64, -64, -64, 64, 64, 64, 64, -64, 64, 64, 64, -64, 64, -64, 64, 64, 64, 64, -64, -64, 64, -64, -64, -64, 64, -64, -64, -64, -64, -64, -64, -64, 64, -64, -64, 64, 64, -64, -64, 64, -64, -64, -64, -64, 64, 64, -64, 64, -64, 64, 64, -64, 64, -64, -64, -64, -64, -64, -64, 64, 64, -64, -64, -64, -64, -64, -64, -64, -64, -64, -64, -64, -64, -64, 64, -64, 64, 64, 64, 64, 64, 64, 64, -64, -64, -64, 64, 64, 64, 64, 64, 64, 64, -64, 64, -64, -64, -64, -64, -64, -64, 64, -64, 64, 64, 64, 64, 64, 64, 64, -64, -64, -64, 64, -64, -64, -64, 64, -64, -64, 64, 64, 64, -64, -64, -64, 64, -64, -64, -64, 64, -64, -64, 64, 64, -64, 64, 64, -64, -64, -64, 64, -64, 64, 64, 64, 64, 64, -64, 64, -64, -64, -64, -64, -64, 64, 64, 64, 64, 64, -64, -64, 64, 64, -64, -64, -64, 64, 64, 64, -64, 64, -64, 64, -64, 64, -64, -64, -64, -64, -64, -64, 64, 64, -64, -64, 64, 64, 64, 64, -64, 64, -64, -64, -64, -64, -64, -64, -64, -64, -64, -64, -64, -64, -64, -64, -64, 64, -64, -64, -64, 64, -64, -64, -64, 64, -64, 64, 64, -64, 64, -64, -64, -64, -64, 64, 64, -64, -64, -64, 64, -64, 64, 64, 64, -64, -64, -64, -64, -64, -64, -64, -64, 64, 64, 64, -64, 64, -64, -64, -64, -64, -64, -64, -64, -64, 64, 64, 64, 64, -64, -64, -64, -64, 64, -64, 64, 64, 64, 64, -64, -64, -64, -64, -64, 64, -64, -64, -64, -64, 64, 64, 64, 64, 64, 64, 64, 64, -64, 64, 64, 64, 64, 64, 64, 64, -64, 64, -64, 64, 64, 64, -64, -64, 64, -64, -64, 64, 64, 64, 64, 64, 64, 64, 64, 64, 64, 64, 64, 64, 64, 64, 64, -64, -64, -64, -64, -64, 64, 64, 64, 64, -64, -64, 64, -64, -64, -64, 64, 64, 64, 64, 64, 64, 64, 64, 64, 64, 64, -64, 64, -64, -64, 64, 64, -64, 64, -64, -64, 64, -64, 64, -64, 64, -64, -64, -64, 64, 64, 64, 64, -64, 64, 64, 64, 64, 64, -64, 64, -64, -64, 64, 64, 64, -64, -64, -64, -64, 64, -64, -64, 64, 64, 64, 64, 64, 64, -64, -64, 64, 64, 64, 64, 64, 64, 64, -64, -64, -64, -64, 64, 64, 64, -64, -64, 64, 64, -64, 64, 64, -64, -64, 64, 64, 64, -64, 64, 64, -64, -64, 64, 64, 64, -64, -64, -64, -64, -64, -64, 64, -64, 64, 64, 64, 64, -64, 64, 64, 64, -64, 64, 64, 64, -64, 64, -64, -64, -64, 64, 64, 64, -64, -64, -64, -64, -64, 64, 64, 64, -64, 64, 64, 64, 64, 64, -64, -64, -64, -64, 64, 64, -64, -64, -64, -64, -64, 64, 64, 64, 64, -64, -64, -64, -64, -64, -64, -64, -64, 64, 64, 64, 64, -64, 64, 64, -64, -64, -64, -64, 64, 64, -64, 64, 64, 64, 64, 64, 64, -64, -64, -64, 64, 64, -64, -64, 64, -64, 64, 64, 64, 64, -64, -64, -64, 64, -64, -64, -64, 64, 64, -64, 64, -64, 64, 64, -64, -64, -64, -64, 64, 64, 64, -64, 64, 64, 64, 64, 64, 64, -64, -64, -64, -64, -64, -64, -64, -64, -64, -64, 64, -64, -64, -64, -64, -64, -64, 64, 64, 64, 64, -64, -64, -64, -64, 64, 64, 64, 64, -64, -64, -64, -64, -64, -64, -64, 64, 64, 64, -64, -64, -64, -64, -64, -64, -64, 64, 64, -64, 64, -64, -64, -64, 64, 64, 64, 64, -64, -64, -64, -64, -64, -64, -64, 64, 64, 64, -64, -64, -64, -64, -64, 64, 64, 64, 64, 64, 64, 64, -64, -64, 64, 64, 64, 64, -64, -64, -64, -64, -64, -64, 64, 64, 64, 64, 64, -64, -64, -64, -64, 64, 64, 64, 64, -64, -64, 64, -64, -64, -64, 64, 64, 64, 64, 64, -64, -64, -64, -64, 64, 64, 64, 64, -64, -64, -64, -64, -64, 64, 64, 64, 64, -64, 64, -64, -64, -64, 64, -64, 64, 64, -64, 64, 64, -64, -64, -64, -64, -64, 64, 64, -64, 64, 64, -64, 64, 64, 64, 64, 64, 64, 64, -64, -64, 64, 64, 64, 64, 64, 64, 64, -64, 64, -64, -64, 64, 64, 64, 64, 64, -64, 64, 64, 64, -64, -64, 64, -64, -64, 64, -64, -64, -64, 64, 64, 64, -64, 64, 64, 64, -64, 64, 64, 64, 64, 64, 64, 64, 64, 64, -64, 64, -64, 64, -64, 64, -64, 64, 64, 64, -64, 64, 64, -64, 64, -64, -64, -64, 64, -64, 64, 64, 64, 64, -64, 64, 64, 64, 64, 64, 64, -64, -64, 64, -64, 64, -64, -64, -64, -64, 64, 64, -64, -64, 64, -64, 64, -64, 64, 64, 64, 64, 64, 64, 64, 64, 64, 64, -64, -64, 64, -64, 64, -64, -64, 64, -64, -64, -64, -64, 64, 64, 64, 64, 64, 64, 64, 64, -64, -64, 64, 64, 64, 64, 64, 64, -64, -64, -64, 64, 64, -64, -64, -64, 64, 64, -64, 64, -64, 64, 64, 64, 64, 64, 64, -64, 64, 64, 64, 64, 64, -64, 64, 64, -64, 64, -64, 64, 64, 64, -64, 64, -64, -64, -64, 64, -64, -64, 64, -64, 64, 64, 64, 64, -64, 64, -64, 64, -64, 64, 64, 64, 64, 64, 64, 64, 64, 64, 64, -64, -64, -64, -64, -64, -64, 64, -64, 64, 64, -64, 64, 64, -64, -64, -64, -64, 64, 64, -64, 64, 64, -64, 64, 64, -64, 64, 64, 64, -64, -64, 64, -64, 64, 64, 64, -64, -64, -64, -64, 64, 64, -64, -64, -64, -64, -64, -64, 64, -64, 64, -64, -64, -64, -64, 64, -64, 64, 64, -64, -64, 64, -64, -64, 64, 64, 64, -64, 64, -64, -64, -64, 64, -64, -64, -64, -64, -64, -64, -64, -64, -64, 64, 64, -64, -64, 64, -64, 64, -64, -64, -64, 64, -64, -64, -64, 64, -64, 64, -64, 64, 64, -64, -64, -64, -64, -64, -64, -64, 64, 64, 64, -64, 64, 64, -64, -64, 64, -64, -64, 64, -64, 64, -64, 64, -64, 64, -64, -64, 64, -64, -64, -64, -64, -64, -64, -64, -64, -64, -64, -64, -64, 64, 64, 64, 64, 64, -64, 64, 64, 64, 64, 64, 64, 64, 64, 64, 64, -64, 64, -64, -64, -64, -64, -64, 64, -64, -64, 64, -64, 64, -64, 64, 64, 64, 64, 64, 64, 64, 64, 64, 64, 64, 64, 64, 64, 64, 64, -64, 64, -64, 64, 64, 64, 64, 64, 64, -64, 64, -64, 64, 64, 64, 64, 64, 64, 64, 64, 64, 64, 64, 64, 64, 64, 64, 64, 64, 64, 64, 64, 64, 64, -64, 64, -64, -64, 64, 64, 64, 64, 64, 64, 64, -64, 64, 64, 64, 64, 64, 64, 64, 64, 64, 64, 64, 64, -64, -64, 64, -64, -64, -64, -64, 64, 64, 64, -64, -64, 64, -64, -64, -64, -64, -64, 64, -64, 64, -64, 64, 64, -64, 64, 64, -64, -64, -64, -64, -64, 64, 64, -64, 64, -64, -64, -64, -64, 64, 64, -64, -64, -64, -64, 64, -64, -64, -64, 64, 64, -64, 64, 64, 64, -64, -64, -64, -64, -64, -64, 64, -64, 64, 64, 64, 64, -64, 64, -64, -64, -64, -64, -64, -64, -64, -64, 64, 64, 64, 64, 64, -64, -64, -64, 64, 64, -64, -64, 64, 64, -64, 64, -64, -64, -64, -64, -64, -64, -64, -64, -64, -64, -64, -64, -64, 64, 64, 64, -64, -64, -64, -64, 64, -64, -64, 64, 64, -64, 64, -64, 64, 64, -64, -64, 64, -64, 64, -64, -64, -64, -64, -64, -64, -64, -64, 64, 64, 64, 64, 64, -64, -64, 64, -64, -64, 64, 64, 64, 64, 64, 64, -64, -64, 64, 64, -64, -64, -64, -64, -64, -64, 64, 64, 64, 64, -64, -64, -64, 64, 64, -64, 64, 64, 64, -64, -64, -64, -64, -64, 64, -64, 64, -64, -64, -64, -64, -64, -64, -64, 64, 64, 64, 64, -64, -64, -64, -64, 64, 64, -64, 64, -64, 64, 64, 64, -64, -64, -64, -64, 64, -64, -64, -64, -64, -64, -64, -64, -64, -64, -64, -64, 64, -64, -64, 64, 64, 64, 64, -64, 64, 64, 64, 64, -64, -64, -64, -64, -64, 64, -64, -64, -64, 64, -64, 64, 64, 64, 64, 64, -64, -64, 64, 64, 64, 64, 64, 64, 64, 64, -64, 64, 64, -64, -64, 64, 64, 64, -64, -64, -64, -64, 64, -64, 64, -64, 64, 64, -64, 64, 64, 64, 64, 64, -64, 64, 64, 64, 64, 64, 64, 64, 64, -64, 64, -64, -64, 64, 64, 64, 64, -64, -64, -64, 64, 64, 64, 64, -64, 64, -64, 64, 64, -64, -64, 64, 64, 64, -64, 64, 64, -64, -64, 64, -64, -64, 64, 64, -64, -64, -64, -64, 64, 64, 64, 64, 64, 64, 64, -64, -64, -64, 64, 64, 64, -64, 64, 64, 64, 64, -64, -64, 64, 64, 64, 64, -64, -64, 64, 64, 64, 64, 64, 64, 64, 64, -64, 64, -64, 64, 64, -64, 64, 64, 64, 64, 64, 64, 64, 64, 64, 64, 64, 64, -64, -64, 64, 64, 64, 64, 64, 64, 64, 64, 64, 64, -64, -64, 64, -64, 64, 64, 64, 64, 64, 64, 64, 64, 64, 64, 64, -64, -64, 64, 64, 64, -64, 64, 64, 64, 64, -64, -64, -64, 64, -64, 64, 64, 64, 64, 64, 64, 64, -64, -64, 64, 64, 64, 64, -64, -64, 64, 64, 64, 64, 64, 64, 64, -64, -64, 64, -64, 64, -64, 64, -64, 64, 64, 64, 64, 64, 64, 64, 64, 64, 64, 64, 64, 64, 64, 64, 64, 64, 64, 64, 64, -64, -64, 64, 64, -64, -64, 64, 64, 64, -64, 64, 64, -64, 64, 64, -64, -64, 64, 64, 64, -64, -64, -64, -64, 64, 64, 64, 64, -64, -64, -64, 64, -64, -64, 64, -64, -64, -64, -64, -64, -64, 64, -64, -64, 64, -64, -64, 64, -64, 64, 64, -64, 64, 64, 64, 64, -64, -64, 64, 64, 64, 64, 64, 64, 64, 64, 64, 64, -64, 64, 64, -64, 64, -64, 64, -64, 64, 64, 64, -64, -64, -64, -64, 64, 64, 64, -64, 64, -64, -64, 64, 64, -64, -64, -64, 64, 64, -64, 64, 64, -64, -64, -64, -64, 64, -64, 64, 64, 64, -64, 64, 64, 64, -64, -64, 64, -64, -64, -64, -64, 64, -64, 64, 64, -64, 64, -64, -64, -64, -64, -64, -64, -64, -64, 64, 64, 64, 64, 64, 64, -64, 64, -64, 64, -64, -64, -64, 64, 64, -64, -64, 64, -64, -64, -64, -64, -64, -64, -64, -64, -64, -64, -64, -64, -64, 64, 64, 64, -64, 64, 64, 64, -64, -64, 64, -64, 64, -64, -64, -64, -64, -64, -64, -64, -64, -64, -64, -64, -64, -64, -64, -64, 64, 64, 64, 64, 64, -64, 64, 64, 64, 64, -64, -64, -64, -64, -64, -64, -64, -64, -64, -64, -64, -64, -64, -64, -64, -64, -64, -64, 64, -64, 64, 64, 64, 64, -64, 64, -64, -64, -64, 64, -64, 64, -64, -64, -64, -64, -64, -64, -64, -64, 64, -64, 64, 64, 64, 64, -64, 64, 64, 64, 64, 64, -64, 64, 64, -64, 64, -64, -64, -64, -64, -64, -64, -64, -64, -64, -64, 64, -64, 64, 64, 64, 64, 64, 64, 64, 64, 64, 64, 64, -64, 64, -64, -64, -64, 64, 64, -64, -64, -64, -64, -64, -64, -64, 64, 64, 64, 64, 64, 64, 64, -64, -64, -64, 64, 64, 64, 64, 64, -64, 64, -64, -64, 64, 64, 64, 64, -64, 64, -64, 64, -64, 64, 64, 64, 64, -64, -64, -64, -64, -64, -64, -64, 64, 64, 64, 64, 64, 64, 64, -64, -64, 64, 64, 64, 64, 64, 64, 64, 64, -64, 64, -64, -64, -64, -64, -64, -64, -64, -64, -64, -64, 64, 64, -64, -64, -64, -64, -64, -64, 64, 64, 64, -64, -64, -64, -64, -64, -64, 64, -64, -64, -64, -64, -64, -64, -64, -64, -64, 64, 64, -64, -64, 64, 64, 64, -64, 64, 64, -64, 64, 64, 64, -64, -64, 64, 64, -64, -64, -64, -64, -64, -64, -64, -64, -64, -64, 64, 64, -64, 64, -64, 64, 64, 64, -64, -64, 64, 64, -64, 64, -64, 64, -64, -64, -64, 64, 64, -64, -64, -64, -64, -64, -64, -64, 64, 64, -64, -64, -64, 64, 64, -64, -64, -64, 64, 64, 64, 64, -64, -64, -64, -64, -64, 64, 64, -64, -64, -64, -64, -64, -64, -64, 64, -64, -64, -64, -64, -64, 64, -64, -64, -64, 64, 64, 64, -64, -64, -64, -64, -64, -64, 64, -64, -64, 64, -64, -64, -64, -64, -64, -64, -64, -64, 64, -64, 64, 64, -64, -64, -64, 64, 64, -64, 64, 64, 64, -64, 64, -64, -64, -64, -64, -64, 64, -64, -64, -64, -64, -64, 64, -64, -64, 64, -64, 64, -64, -64, -64, -64, 64, 64, 64, -64, -64, 64, -64, -64, -64, -64, -64, -64, 64, -64, -64, -64, -64, -64, -64, 64, -64, 64, 64, -64, 64, -64, -64, -64, -64, -64, -64, -64, 64, -64, -64, -64, -64, -64, 64, -64, -64, 64, -64, 64, 64, -64, -64, 64, -64, -64, -64, -64, -64, -64, -64, -64, -64, -64, -64, -64, 64, -64, -64, -64, -64, -64, -64, 64, -64, -64, -64, -64, -64, -64, -64, 64, -64, 64, -64, 64, -64, 64, -64, -64, -64, 64, 64, 64, 64, -64, -64, -64, 64, 64, -64, 64, 64, -64, -64, -64, -64, -64, 64, 64, 64, -64, -64, -64, -64, -64, -64, -64, -64, -64, 64, -64, 64, -64, -64, -64, 64, -64, 64, -64, -64, -64, -64, -64, -64, -64, -64, 64, 64, -64, -64, 64, 64, -64, -64, -64, -64, -64, -64, -64, -64, -64, -64, 64, -64, 64, -64, -64, -64, -64, -64, -64, -64, -64, 64, 64, -64, 64, -64, -64, 64, -64, -64, -64, -64, -64, -64, 64, 64, -64, -64, 64, 64, 64, 64, 64, -64, -64, -64, 64, -64, 64, -64, 64, 64, -64, -64, -64, 64, -64, 64, 64, 64, -64, 64, 64, -64, -64, -64, 64, 64, 64, 64, 64, -64, 64, 64, -64, -64, 64, -64, 64, 64, -64, 64, 64, -64, -64, -64, -64, 64, 64, 64, 64, -64, -64, 64, 64, 64, 64, 64, 64, 64, 64, -64, 64, 64, 64, -64, 64, 64, 64, 64, -64, -64, -64, 64, 64, -64, 64, 64, 64, 64, 64, -64, 64, -64, 64, 64, 64, 64, -64, -64, -64, -64, 64, -64, 64, 64, 64, 64, 64, -64, 64, 64, -64, 64, -64, 64, -64, 64, 64, -64, -64, 64, -64, 64, 64, -64, 64, 64, -64, 64, -64, -64, 64, 64, -64, 64, 64, 64, -64, 64, 64, 64, -64, 64, 64, -64, -64, -64, 64, -64, 64, 64, -64, -64, 64, 64, -64, 64, -64, 64, 64, 64, 64, -64, 64, -64, 64, 64, 64, -64, -64, 64, 64, 64, -64, 64, -64, 64, -64, -64, -64, -64, 64, -64, 64, 64, 64, 64, -64, -64, 64, -64, 64, -64, -64, 64, -64, -64, -64, -64, -64, -64, 64, -64, -64, -64, -64, -64, -64, -64, 64, 64, -64, -64, 64, 64, 64, 64, -64, -64, 64, 64, 64, 64, -64, -64, 64, 64, 64, -64, -64, -64, -64, -64, 64, -64, 64, -64, -64, -64, -64, -64, -64, -64, -64, -64, -64, 64, -64, -64, -64, 64, 64, 64, 64, 64, 64, -64, 64, -64, 64, -64, 64, -64, -64, -64, -64, -64, -64, 64, -64, -64, 64, -64, 64, 64, 64, -64, 64, 64, -64, -64, 64, 64, -64, -64, -64, -64, -64, -64, 64, -64, -64, 64, -64, -64, -64, -64, 64, 64, -64, -64, -64, -64, 64, 64, 64, -64, -64, -64, 64, -64, 64, -64, -64, -64, -64, 64, -64, 64, -64, 64, -64, -64, -64, -64, -64, 64, 64, -64, 64, -64, -64, 64, -64, 64, 64, -64, -64, -64, -64, -64, -64, 64, -64, 64, -64, -64, -64, -64, 64, 64, -64, -64, 64, -64, -64, -64, 64, 64, 64, -64, 64, 64, 64, 64, -64, 64, -64, -64, -64, -64, -64, -64, 64, 64, -64, -64, -64, -64, -64, -64, 64, 64, -64, -64, 64, -64, -64, -64, 64, 64, -64, -64, -64, -64, 64, -64, -64, -64, -64, 64, 64, -64, 64, -64, 64, -64, 64, 64, -64, 64, 64, -64, 64, 64, -64, 64, 64, -64, 64, -64, 64, 64, -64, 64, -64, -64, -64, -64, 64, 64, -64, -64, -64, -64, 64, -64, -64, -64, -64, 64, 64, -64, 64, -64, -64, 64, -64, -64, 64, -64, -64, -64, 64, -64, -64, 64, -64, -64, 64, -64, -64, -64, 64, -64, -64, 64, -64, 64, 64, -64, 64, 64, 64, -64, -64, -64, -64, 64, -64, -64, -64, 64, -64, -64, -64, 64, -64, -64, -64, 64, 64, 64, -64, -64, -64, 64, -64, 64, 64, -64, -64, -64, -64, -64, -64, -64, -64, 64, -64, -64, -64, -64, 64, 64, -64, -64, 64, -64, -64, -64, 64, -64, -64, -64, -64, 64, 64, 64, 64, -64, 64, 64, 64, 64, 64, -64, -64, -64, -64, -64, 64, -64, -64, 64, 64, -64, 64, -64, -64, 64, 64, -64, 64, -64, -64, 64, 64, -64, 64, -64, -64, 64, -64, -64, -64, -64, -64, -64, 64, -64, 64, 64, 64, -64, -64, -64, -64, -64, -64, -64, 64, -64, 64, -64, -64, -64, -64, 64, -64, 64, 64, -64, -64, -64, -64, -64, -64, 64, -64, -64, 64, -64, -64, -64, 64, 64, -64, 64, -64, -64, 64, -64, 64, -64, -64, 64, 64, -64, -64, -64, -64, -64, 64, -64, -64, -64, -64, 64, -64, -64, 64, -64, -64, 64, 64, -64, -64, 64, -64, -64, -64, 64, -64, 64, -64, -64, 64, 64, 64, -64, 64, -64, -64, -64, 64, -64, -64, -64, 64, -64, -64, 64, 64, -64, -64, -64, -64, -64, -64, -64, 64, 64, 64, 64, -64, -64, -64, -64, -64, 64, 64, 64, -64, 64, -64, -64, 64, -64, 64, 64, 64, 64, 64, 64, -64, -64, -64, -64, 64, -64, -64, -64, -64, 64, 64, 64, 64, 64, -64, -64, -64, 64, -64, 64, 64, -64, 64, -64, -64, -64, 64, -64, -64, -64, 64, -64, -64, -64, 64, -64, -64, -64, -64, -64, -64, 64, -64, -64, -64, -64, 64, -64, -64, -64, -64, 64, -64, -64, -64, 64, -64, -64, -64, -64, -64, -64, -64, 64, -64, 64, -64, -64, 64, -64, 64, 64, -64, 64, 64, -64, -64, 64, 64, 64, 64, -64, 64, -64, -64, -64, -64, 64, -64, 64, -64, -64, 64, -64, 64, -64, -64, -64, -64, -64, 64, 64, -64, -64, -64, 64, -64, 64, 64, -64, -64, -64, -64, -64, 64, 64, -64, -64, 64, -64, -64, -64, 64, 64, 64, -64, -64, 64, -64, 64, 64, -64, 64, -64, -64, 64, 64, -64, -64, 64, 64, -64, -64, 64, 64, 64, 64, -64, -64, -64, -64, 64, -64, 64, 64, -64, -64, -64, -64, -64, -64, -64, 64, 64, 64, -64, -64, -64, -64, -64, 64, 64, 64, -64, -64, 64, -64, -64, -64, 64, 64, 64, 64, -64, 64, -64, -64, -64, 64, -64, 64, 64, 64, 64, -64, 64, -64, -64, -64, 64, 64, 64, 64, -64, 64, 64, -64, 64, 64, 64, -64, -64, 64, 64, 64, -64, -64, -64, -64, -64, -64, 64, 64, -64, -64, 64, 64, -64, 64, 64, -64, -64, -64, -64, 64, 64, -64, -64, -64, -64, 64, -64, -64, 64, -64, -64, -64, 64, -64, -64, 64, -64, 64, -64, 64, -64, -64, -64, -64, -64, 64, -64, 64, 64, 64, 64, -64, 64, -64, -64, -64, -64, -64, 64, -64, -64, 64, 64, 64, 64, 64, 64, -64, -64, -64, -64, 64, -64, 64, 64, 64, -64, -64, 64, 64, 64, 64, -64, -64, 64, -64, 64, -64, -64, 64, 64, 64, 64, -64, -64, 64, -64, 64, 64, 64, -64, 64, -64, 64, 64, 64, 64, -64, 64, 64, 64, -64, -64, 64, 64, -64, -64, 64, -64, -64, -64, -64, 64, 64, 64, 64, 64, 64, 64, 64, 64, -64, 64, 64, 64, 64, 64, 64, 64, 64, 64, 64, 64, -64, 64, -64, 64, 64, -64, 64, 64, 64, -64, 64, 64, 64, 64, 64, 64, 64, 64, 64, 64, 64, 64, 64, 64, -64, -64, 64, -64, -64, -64, -64, -64, 64, 64, -64, -64, -64, 64, 64, 64, 64, 64, 64, -64, -64, -64, -64, -64, -64, -64, 64, 64, 64, -64, 64, -64, -64, -64, -64, -64, -64, 64, 64, -64, 64, -64, 64, 64, 64, 64, -64, -64, 64, -64, -64, -64, 64, 64, 64, 64, 64, -64, -64, -64, -64, -64, -64, -64, 64, -64, -64, -64, -64, 64, 64, 64, 64, 64, 64, -64, -64, 64, -64, -64, 64, 64, 64, 64, 64, 64, -64, -64, -64, -64, -64, -64, 64, 64, 64, 64, 64, 64, -64, 64, 64, 64, -64, -64, -64, 64, 64, 64, 64, 64, 64, 64, -64, -64, -64, -64, -64, -64, -64, -64, 64, 64, -64, -64, 64, 64, 64, 64, 64, -64, 64, 64, 64, -64, 64, 64, 64, 64, 64, 64, -64, -64, -64, -64, -64, -64, -64, -64, -64, -64, 64, 64, 64, 64, -64, 64, -64, 64, 64, 64, -64, -64, 64, 64, 64, 64, 64, 64, -64, -64, -64, -64, -64, 64, 64, 64, 64, 64, 64, 64, 64, 64, -64, 64, -64, -64, 64, 64, -64, 64, 64, 64, 64, 64, 64, 64, -64, -64, -64, -64, 64, 64, 64, 64, 64, 64, -64, -64, -64, -64, 64, 64, 64, 64, 64, 64, 64, 64, 64, 64, 64, 64, 64, -64, 64, -64, -64, 64, -64, 64, -64, 64, 64, -64, 64, 64, -64, 64, -64, 64, -64, 64, 64, -64, -64, 64, 64, -64, 64, -64, 64, 64, -64, -64, -64, -64, 64, 64, -64, -64, 64, -64, 64, -64, 64, 64, 64, -64, 64, 64, -64, -64, -64, -64, 64, -64, 64, 64, -64, -64, 64, -64, -64, 64, 64, 64, -64, -64, 64, 64, -64, -64, 64, -64, -64, -64, -64, -64, -64, -64, -64, -64, -64, -64, 64, 64, 64, 64, 64, 64, 64, 64, 64, -64, -64, 64, -64, -64, -64, 64, -64, 64, -64, 64, -64, -64, -64, -64, -64, -64, -64, 64, 64, 64, 64, 64, 64, 64, 64, 64, 64, 64, 64, 64, 64, -64, 64, 64, 64, 64, 64, -64, -64, -64, 64, -64, 64, 64, -64, -64, 64, 64, 64, 64, 64, 64, 64, 64, 64, 64, 64, -64, 64, 64, 64, 64, -64, -64, -64, -64, -64, -64, 64, -64, 64, 64, 64, 64, 64, 64, 64, 64, 64, 64, 64, -64, -64, 64, 64, 64, 64, 64, 64, -64, -64, -64, -64, -64, -64, -64, 64, 64, -64, -64, 64, 64, 64, 64, 64, 64, 64, 64, 64, -64, 64, 64, 64, 64, -64, 64, 64, 64, 64, 64, -64, -64, -64, 64, -64, 64, 64, 64, 64, 64, 64, 64, 64, 64, 64, 64, 64, 64, 64, -64, -64, -64, 64, 64, -64, -64, 64, -64, -64, -64, -64, -64, -64, -64, 64, 64, 64, 64, 64, 64, 64, 64, 64, 64, 64, 64, 64, 64, -64, 64, 64, -64, -64, 64, -64, 64, 64, 64, -64, -64, -64, -64, -64, 64, 64, 64, 64, 64, 64, 64, -64, 64, 64, -64, -64, 64, -64, 64, -64, -64, -64, 64, -64, 64, -64, -64, -64, -64, -64, -64, -64, -64, -64, -64, 64, 64, 64, 64, 64, 64, 64, 64, 64, 64, 64, -64, -64, 64, -64, 64, 64, 64, 64, 64, -64, -64, -64, 64, 64, 64, 64, -64, 64, 64, 64, -64, -64, 64, 64, -64, -64, 64, 64, 64, 64, 64, 64, -64, -64, 64, -64, 64, -64, 64, 64, -64, -64, 64, -64, 64, 64, 64, -64, -64, -64, -64, -64, -64, 64, 64, -64, -64, -64, -64, -64, -64, -64, 64, -64, -64, 64, -64, 64, -64, -64, -64, -64, -64, -64, -64, -64, -64, -64, 64, 64, -64, -64, 64, 64, 64, 64, -64, 64, 64, -64, 64, 64, -64, 64, -64, -64, -64, -64, -64, 64, 64, 64, -64, 64, 64, -64, 64, -64, 64, 64, -64, -64, -64, 64, 64, -64, -64, -64, 64, 64, -64, 64, 64, 64, 64, -64, -64, 64, -64, -64, -64, 64, -64, -64, -64, -64, -64, 64, -64, 64, 64, -64, -64, -64, 64, 64, 64, -64, -64, 64, 64, -64, 64, -64, -64, 64, 64, 64, -64, -64, 64, -64, -64, -64, -64, 64, -64, 64, 64, -64, 64, -64, -64, -64, 64, 64, 64, 64, -64, 64, 64, -64, 64, 64, 64, 64, 64, 64, 64, 64, -64, 64, -64, -64, -64, 64, 64, 64, 64, 64, 64, -64, 64, -64, -64, -64, 64, 64, 64, 64, -64, 64, 64, 64, -64, -64, 64, 64, -64, -64, -64, 64, 64, -64, -64, 64, -64, -64, 64, -64, -64, 64, -64, 64, 64, 64, 64, 64, 64, 64, 64, 64, 64, 64, 64, 64, -64, -64, 64, 64, -64, -64, 64, 64, -64, 64, -64, 64, 64, -64, 64, -64, 64, 64, -64, -64, -64, -64, 64, -64, -64, -64, 64, 64, 64, -64, -64, 64, -64, 64, -64, -64, -64, 64, 64, 64, 64, -64, 64, 64, -64, 64, -64, -64, 64, 64, 64, -64, 64, 64, -64, 64, -64, 64, 64, 64, 64, -64, 64, -64, 64, -64, 64, -64, 64, 64, 64, -64, -64, 64, 64, -64, -64, -64, -64, 64, 64, -64, 64, -64, -64, -64, 64, 64, 64, -64, 64, 64, -64, 64, 64, 64, -64, 64, 64, 64, -64, -64, 64, -64, 64, 64, 64, 64, -64, 64, -64, 64, -64, 64, -64, 64, -64, -64, 64, 64, 64, 64, 64, -64, 64, 64, 64, 64, -64, -64, 64, 64, -64, 64, -64, 64, -64, -64, -64, 64, 64, -64, 64, -64, 64, 64, -64, 64, 64, 64, 64, 64, 64, 64, 64, 64, -64, 64, 64, 64, 64, 64, 64, 64, 64, -64, 64, 64, 64, 64, 64, 64, 64, -64, 64, 64, 64, -64, -64, 64, -64, 64, 64, 64, 64, 64, 64, 64, 64, 64, 64, 64, 64, 64, 64, 64, -64, 64, 64, 64, -64, 64, 64, -64, 64, 64, -64, 64, 64, 64, -64, -64, 64, 64, 64, 64, -64, 64, 64, 64, -64, 64, 64, 64, -64, 64, -64, -64, -64, -64, 64, -64, 64, -64, 64, 64, -64, 64, 64, 64, 64, 64, 64, 64, -64, -64, 64, -64, 64, 64, 64, 64, 64, -64, 64, -64, -64, -64, 64, -64, 64, -64, -64, 64, 64, 64, -64, 64, 64, 64, 64, -64, 64, 64, 64, -64, -64, 64, 64, 64, 64, 64, 64, -64, -64, -64, 64, -64, -64, -64, -64, 64, -64, 64, -64, 64, 64, 64, 64, 64, 64, -64, -64, -64, 64, 64, 64, 64, 64, 64, -64, -64, -64, -64, -64, 64, 64, -64, -64, -64, 64, 64, -64, 64, 64, 64, 64, 64, 64, 64, 64, 64, 64, 64, 64, 64, -64, -64, -64, -64, -64, 64, 64, -64, -64, 64, -64, -64, -64, 64, -64, 64, 64, 64, -64, 64, 64, -64, 64, 64, -64, 64, 64, 64, 64, -64, 64, 64, 64, -64, 64, 64, -64, 64, 64, -64, 64, 64, 64, 64, 64, 64, 64, 64, -64, 64, 64, 64, 64, 64, -64, -64, -64, 64, -64, 64, -64, -64, -64, 64, -64, 64, -64, -64, 64, 64, -64, -64, -64, 64, 64, 64, 64, 64, 64, -64, 64, 64, -64, -64, -64, 64, 64, 64, -64, 64, -64, -64, -64, -64, -64, -64, -64, 64, 64, 64, 64, -64, 64, -64, -64, 64, 64, 64, 64, -64, -64, 64, -64, 64, 64, 64, -64, 64, -64, 64, -64, 64, 64, 64, 64, 64, -64, -64, 64, 64, -64, -64, 64, 64, -64, 64, 64, -64, 64, 64, 64, -64, -64, 64, 64, 64, -64, -64, 64, 64, 64, 64, 64, -64, -64, 64, -64, 64, 64, 64, 64, 64, 64, 64, 64, -64, -64, -64, 64, 64, -64, 64, 64, -64, 64, -64, -64, 64, -64, 64, 64, 64, 64, 64, -64, -64, 64, 64, -64, 64, -64, -64, -64, 64, -64, -64, 64, -64, 64, -64, -64, 64, 64, -64, 64, -64, 64, 64, 64, -64, -64, -64, 64, -64, -64, 64, 64, -64, 64, -64, -64, 64, 64, 64, 64, -64, 64, 64, 64, -64, 64, -64, -64, -64, 64, -64, -64, 64, 64, 64, 64, -64, -64, 64, 64, -64, 64, 64, -64, -64, -64, -64, -64, 64, 64, 64, 64, -64, -64, 64, -64, 64, 64, 64, -64, -64, -64, -64, -64, 64, -64, -64, 64, -64, -64, -64, -64, 64, -64, 64, -64, 64, 64, -64, 64, 64, -64, 64, -64, -64, -64, 64, -64, -64, 64, 64, -64, -64, -64, 64, -64, 64, 64, 64, 64, -64, -64, -64, -64, 64, -64, -64, -64, 64, -64, 64, 64, 64, -64, 64, 64, 64, -64, -64, -64, 64, -64, -64, 64, -64, 64, -64, -64, 64, 64, 64, 64, 64, -64, -64, -64, 64, -64, -64, 64, -64, -64, 64, -64, 64, 64, 64, -64, -64, -64, 64, -64, 64, -64, -64, 64, 64, -64, -64, -64, 64, 64, 64, 64, 64, -64, 64, 64, -64, -64, 64, 64, -64, -64, -64, -64, -64, -64, 64, -64, 64, 64, 64, -64, -64, 64, -64, -64, -64, -64, -64, 64, 64, 64, 64, -64, 64, -64, -64, -64, 64, 64, -64, 64, -64, 64, -64, 64, -64, 64, -64, 64, -64, 64, -64, -64, -64, 64, -64, -64, -64, -64, -64, 64, 64, 64, -64, 64, 64, 64, 64, 64, 64, -64, -64, -64, -64, -64, -64, -64, -64, -64, 64, -64, -64, -64, 64, 64, 64, -64, 64, 64, -64, 64, -64, -64, 64, 64, -64, -64, -64, 64, 64, -64, -64, -64, -64, -64, -64, -64, -64, -64, -64, -64, -64, 64, 64, 64, 64, -64, 64, 64, -64, 64, -64, -64, -64, -64, -64, -64, -64, -64, 64, 64, 64, -64, -64, -64, -64, -64, -64, -64, -64, 64, 64, 64, 64, 64, -64, -64, 64, 64, 64, -64, -64, -64, -64, 64, -64, -64, -64, 64, 64, 64, -64, -64, -64, -64, -64, -64, -64, -64, -64, 64, -64, -64, 64, -64, -64, 64, -64, -64, -64, -64, -64, 64, -64, -64, -64, 64, 64, -64, -64, -64, -64, -64, 64, -64, -64, -64, -64, 64, 64, 64, -64, 64, -64, -64, 64, 64, -64, 64, 64, 64, -64, -64, -64, 64, 64, 64, -64, 64, -64, -64, -64, -64, -64, -64, -64, 64, -64, 64, -64, 64, -64, 64, 64, 64, -64, -64, -64, -64, -64, -64, -64, 64, -64, -64, 64, -64, -64, -64, 64, 64, 64, 64, 64, 64, -64, -64, 64, 64, -64, 64, 64, -64, -64, -64, -64, -64, -64, -64, 64, 64, -64, 64, 64, -64, -64, -64, -64, -64, 64, 64, 64, 64, -64, 64, -64, -64, 64, 64, 64, 64, -64, 64, 64, -64, -64, 64, 64, 64, 64, 64, -64, -64, 64, 64, 64, 64, 64, 64, 64, 64, 64, 64, -64, -64, 64, 64, 64, 64, -64, 64, 64, 64, 64, 64, 64, 64, 64, -64, -64, -64, 64, 64, 64, 64, 64, 64, 64, -64, 64, 64, 64, 64, 64, -64, 64, -64, 64, 64, 64, 64, 64, -64, -64, -64, 64, -64, -64, -64, -64, -64, 64, 64, -64, -64, -64, -64, 64, 64, -64, 64, 64, -64, 64, -64, -64, 64, -64, 64, 64, 64, -64, 64, 64, -64, -64, -64, -64, 64, -64, -64, -64, -64, -64, -64, -64, -64, 64, 64, 64, 64, 64, 64, 64, -64, -64, 64, 64, -64, -64, -64, -64, -64, -64, 64, -64, -64, 64, -64, -64, 64, -64, 64, -64, -64, 64, -64, 64, -64, -64, 64, 64, 64, -64, -64, -64, -64, -64, -64, -64, -64, 64, -64, 64, 64, 64, -64, -64, -64, -64, 64, -64, 64, -64, 64, -64, 64, 64, -64, 64, 64, -64, -64, -64, -64, -64, -64, -64, -64, -64, 64, 64, -64, 64, -64, -64, 64, -64, -64, -64, 64, 64, 64, 64, -64, -64, -64, -64, -64, -64, -64, -64, -64, -64, -64, -64, -64, -64, 64, -64, -64, -64, 64, 64, 64, -64, -64, -64, -64, 64, 64, -64, 64, 64, -64, -64, -64, -64, -64, -64, -64, -64, -64, -64, -64, 64, -64, 64, -64, 64, -64, -64, -64, -64, -64, -64, -64, -64, -64, -64, -64, 64, 64, -64, -64, -64, -64, -64, -64, -64, -64, -64, -64, -64, -64, -64, 64, -64, -64, -64, -64, 64, 64, 64, 64, -64, 64, 64, 64, -64, -64, 64, -64, -64, -64, -64, -64, -64, -64, -64, -64, -64, -64, 64, 64, -64, -64, 64, -64, 64, -64, -64, 64, -64, -64, 64, -64, 64, 64, 64, -64, -64, -64, -64, 64, 64, -64, -64, 64, -64, 64, 64, 64, -64, 64, 64, 64, 64, -64, 64, -64, -64, -64, -64, -64, -64, -64, 64, -64, 64, -64, -64, 64, -64, -64, 64, 64, -64, -64, -64, 64, 64, 64, 64, 64, -64, -64, -64, 64, -64, -64, 64, -64, -64, -64, 64, -64, 64, -64, 64, 64, -64, 64, -64, 64, 64, 64, -64, -64, 64, -64, -64, 64, -64, -64, -64, 64, -64, -64, 64, -64, -64, 64, -64, -64, -64, -64, -64, -64, -64, -64, -64, -64, 64, -64, 64, 64, 64, -64, 64, 64, -64, -64, 64, -64, 64, -64, 64, 64, 64, 64, 64, -64, -64, -64, 64, 64, -64, -64, 64, -64, -64, -64, 64, 64, -64, 64, 64, -64, -64, 64, -64, 64, -64, -64, 64, -64, -64, 64, 64, -64, 64, 64, 64, -64, -64, -64, 64, 64, 64, 64, 64, -64, 64, -64, -64, 64, -64, -64, -64, 64, -64, 64, 64, -64, -64, 64, 64, 64, 64, 64, 64, 64, -64, 64, 64, 64, 64, 64, 64, 64, 64, 64, -64, 64, 64, -64, 64, -64, 64, 64, 64, 64, -64, -64, 64, -64, -64, -64, -64, -64, -64, -64, 64, -64, 64, 64, 64, 64, 64, -64, -64, -64, -64, -64, 64, -64, -64, 64, -64, -64, -64, 64, 64, -64, -64, -64, 64, 64, -64, -64, 64, -64, 64, -64, -64, 64, 64, 64, -64, -64, 64, -64, 64, 64, -64, -64, -64, 64, -64, 64, 64, -64, 64, -64, 64, -64, -64, -64, -64, -64, -64, -64, 64, -64, 64, -64, -64, -64, 64, 64, 64, -64, -64, -64, -64, 64, 64, 64, 64, 64, -64, -64, -64, -64, -64, -64, -64, -64, -64, -64, -64, -64, -64, 64, -64, -64, 64, -64, -64, -64, -64, -64, 64, 64, 64, -64, -64, -64, -64, -64, -64, -64, -64, -64, -64, -64, -64, -64, -64, 64, -64, -64, -64, 64, 64, -64, -64, -64, 64, -64, 64, 64, 64, -64, -64, -64, -64, -64, -64, -64, -64, -64, -64, -64, -64, -64, -64, 64, 64, -64, 64, -64, -64, 64, -64, 64, 64, -64, -64, -64, -64, -64, -64, 64, -64, -64, 64, 64, 64, -64, -64, 64, -64, -64, 64, -64, -64, -64, -64, -64, 64, 64, 64, -64, -64, 64, -64, -64, -64, -64, -64, 64, 64, 64, -64, 64, -64, 64, -64, 64, -64, -64, -64, -64, -64, -64, -64, -64, 64, -64, 64, -64, 64, 64, -64, -64, -64, 64, -64, 64, 64, 64, 64, 64, 64, 64, 64, -64, -64, -64, -64, -64, -64, -64, -64, -64, 64, 64, 64, 64, -64, -64, 64, -64, -64, -64, -64, -64, -64, -64, -64, -64, -64, -64, -64, -64, -64, -64, -64, 64, 64, 64, 64, 64, 64, 64, 64, 64, -64, -64, -64, -64, 64, -64, -64, -64, -64, -64, -64, -64, -64, -64, 64, 64, -64, -64, -64, 64, 64, -64, -64, -64, 64, -64, -64, -64, -64, 64, -64, -64, -64, -64, -64, 64, 64, 64, -64, 64, -64, 64, -64, -64, -64, -64, 64, 64, 64, 64, 64, -64, 64, -64, 64, -64, 64, 64, -64, -64, 64, -64, -64, -64, 64, -64, 64, 64, 64, 64, -64, -64, 64, 64, 64, 64, 64, 64, 64, 64, -64, 64, 64, 64, 64, -64, 64, 64, -64, -64, -64, -64, -64, 64, -64, 64, -64, -64, -64, -64, -64, -64, -64, -64, -64, -64, 64, 64, -64, 64, -64, -64, -64, 64, 64, 64, 64, -64, -64, 64, -64, -64, -64, 64, -64, 64, -64, -64, -64, -64, -64, 64, -64, 64, 64, -64, -64, -64, 64, 64, -64, 64, 64, 64, 64, -64, -64, -64, -64, -64, 64, -64, -64, -64, -64, -64, -64, -64, -64, -64, -64, 64, 64, -64, 64, 64, -64, 64, 64, 64, 64, -64, 64, -64, -64, -64, -64, 64, -64, -64, -64, 64, -64, -64, -64, -64, -64, 64, -64, 64, -64, 64, -64, -64, 64, -64, 64, 64, 64, -64, 64, 64, -64, -64, 64, -64, -64, -64, -64, -64, -64, -64, -64, 64, -64, 64, 64, -64, -64, 64, -64, -64, -64, -64, 64, 64, -64, 64, 64, -64, -64, 64, 64, -64, -64, 64, -64, 64, -64, -64, -64, -64, -64, -64, -64, -64, -64, 64, -64, -64, 64, -64, 64, 64, 64, -64, 64, -64, -64, -64, -64, 64, -64, -64, -64, 64, 64, 64, -64, -64, -64, -64, -64, -64, -64, -64, -64, 64, 64, 64, 64, -64, 64, 64, -64, -64, -64, -64, -64, -64, -64, -64, -64, 64, -64, -64, -64, -64, 64, 64, -64, -64, -64, 64, 64, -64, -64, 64, -64, -64, -64, -64, -64, -64, 64, -64, -64, 64, -64, 64, 64, 64, -64, -64, 64, -64, 64, -64, -64, -64, -64, -64, -64, -64, -64, 64, 64, 64, 64, -64, 64, 64, -64, 64, -64, 64, 64, -64, -64, -64, -64, -64, -64, -64, -64, 64, -64, 64, 64, -64, -64, 64, 64, -64, -64, 64, 64, 64, -64, -64, -64, 64, 64, -64, -64, -64, -64, 64, -64, 64, 64, 64, -64, -64, 64, -64, 64, -64, 64, 64, 64, -64, -64, -64, -64, 64, 64, -64, -64, -64, 64, 64, -64, -64, 64, 64, 64, 64, 64, 64, 64, -64, -64, -64, -64, 64, -64, 64, -64, 64, -64, -64, 64, -64, 64, 64, 64, 64, 64, 64, 64, 64, 64, 64, 64, 64, -64, 64, -64, 64, -64, 64, -64, 64, -64, 64, 64, -64, 64, 64, -64, 64, -64, -64, 64, 64, 64, -64, 64, 64, 64, 64, 64, -64, 64, 64, 64, 64, 64, -64, 64, -64, 64, 64, 64, 64, -64, -64, 64, 64, 64, 64, 64, 64, 64, -64, -64, 64, 64, 64, 64, -64, 64, 64, 64, 64, -64, 64, 64, -64, 64, -64, 64, -64, -64, 64, 64, 64, 64, -64, 64, -64, -64, -64, -64, -64, -64, 64, 64, 64, 64, 64, 64, 64, 64, 64, -64, 64, 64, -64, -64, 64, -64, 64, -64, 64, -64, -64, -64, 64, -64, -64, -64, -64, -64, -64, 64, 64, 64, 64, 64, 64, 64, 64, 64, 64, -64, 64, 64, 64, 64, 64, -64, -64, -64, 64, 64, -64, -64, -64, 64, 64, 64, 64, 64, -64, 64, 64, -64, 64, 64, 64, 64, 64, -64, -64, 64, 64, 64, -64, -64, -64, -64, -64, 64, -64, -64, 64, 64, 64, 64, 64, 64, -64, -64, -64, 64, 64, 64, 64, 64, 64, 64, 64, -64, 64, 64, -64, -64, -64, -64, -64, -64, -64, -64, 64, 64, 64, -64, 64, -64, -64, -64, -64, -64, 64, 64, 64, 64, 64, 64, 64, -64, 64, -64, -64, -64, -64, -64, -64, -64, -64, 64, -64, 64, 64, 64, -64, -64, -64, -64, -64, 64, 64, 64, 64, 64, 64, 64, 64, -64, 64, -64, -64, -64, 64, 64, 64, 64, -64, -64, 64, 64, -64, -64, -64, -64, -64, -64, -64, 64, 64, 64, 64, 64, 64, 64, 64, -64, -64, -64, -64, -64, 64, 64, 64, -64, -64, 64, 64, 64, -64, -64, -64, -64, -64, -64, 64, -64, -64, 64, 64, 64, 64, -64, 64, -64, -64, 64, 64, -64, 64, 64, 64, 64, -64, 64, -64, -64, -64, -64, 64, -64, -64, -64, -64, -64, -64, 64, 64, 64, 64, 64, -64, 64, -64, 64, -64, 64, 64, 64, 64, 64, 64, -64, -64, -64, -64, -64, -64, 64, -64, 64, -64, 64, -64, 64, -64, 64, 64, 64, -64, 64, -64, -64, 64, -64, 64, 64, -64, 64, 64, 64, 64, -64, -64, -64, 64, 64, 64, 64, 64, 64, 64, -64, -64, -64, 64, -64, -64, 64, -64, 64, 64, 64, 64, 64, -64, -64, 64, -64, 64, -64, 64, 64, 64, 64, 64, -64, 64, 64, 64, 64, -64, -64, -64, 64, -64, -64, -64, -64, -64, 64, 64, 64, 64, 64, -64, 64, -64, -64, 64, 64, 64, 64, 64, 64, -64, -64, -64, -64, -64, -64, 64, 64, -64, -64, 64, 64, -64, -64, -64, 64, 64, -64, 64, 64, 64, -64, -64, 64, 64, 64, 64, 64, 64, -64, 64, -64, -64, 64, 64, -64, 64, 64, -64, -64, -64, 64, 64, 64, 64, 64, -64, 64, 64, 64, 64, -64, 64, -64, -64, -64, -64, 64, -64, 64, -64, -64, -64, -64, 64, -64, 64, 64, -64, 64, -64, 64, 64, 64, 64, 64, 64, 64, 64, 64, 64, 64, -64, -64, 64, 64, 64, 64, -64, 64, 64, 64, 64, -64, 64, 64, 64, -64, -64, 64, 64, 64, 64, 64, 64, 64, 64, 64, -64, -64, 64, 64, 64, -64, -64, -64, -64, 64, 64, -64, -64, -64, -64, 64, -64, -64, -64, -64, 64, 64, 64, 64, 64, 64, 64, 64, 64, -64, 64, 64, 64, -64, 64, -64, -64, -64, 64, -64, 64, -64, -64, 64, 64, -64, -64, -64, 64, 64, 64, 64, 64, 64, 64, 64, -64, -64, 64, 64, -64, -64, -64, -64, 64, 64, -64, -64, 64, -64, -64, -64, 64, -64, 64, -64, 64, 64, 64, -64, 64, 64, 64, -64, -64, -64, -64, -64, -64, -64, -64, -64, 64, 64, -64, -64, 64, 64, 64, 64, 64, 64, -64, -64, 64, 64, 64, 64, 64, 64, -64, -64, -64, -64, -64, -64, -64, -64, -64, 64, 64, 64, 64, 64, 64, -64, -64, -64, -64, -64, 64, -64, 64, 64, 64, 64, 64, 64, -64, -64, -64, -64, -64, 64, 64, 64, -64, 64, 64, 64, 64, 64, -64, 64, -64, -64, 64, -64, -64, 64, 64, -64, -64, 64, 64, 64, -64, -64, -64, -64, -64, 64, 64, -64, -64, 64, 64, 64, -64, 64, -64, 64, 64, 64, 64, 64, 64, -64, -64, 64, -64, 64, 64, -64, -64, 64, -64, 64, -64, 64, -64, -64, -64, -64, -64, 64, 64, -64, -64, 64, -64, -64, 64, -64, 64, 64, 64, -64, -64, -64, -64, 64, 64, 64, -64, -64, 64, 64, 64, 64, 64, -64, -64, 64, 64, -64, -64, -64, -64, 64, 64, 64, -64, -64, -64, 64, -64, 64, 64, -64, -64, 64, -64, -64, -64, -64, 64, -64, -64, -64, -64, -64, 64, -64, -64, 64, 64, 64, 64, -64, 64, -64, -64, 64, -64, 64, 64, 64, 64, -64, -64, 64, -64, -64, -64, 64, -64, 64, -64, 64, 64, -64, -64, 64, -64, 64, -64, 64, 64, -64, 64, -64, 64, 64, 64, -64, -64, 64, 64, 64, 64, -64, 64, 64, 64, 64, -64, 64, -64, 64, -64, -64, -64, -64, -64, 64, -64, -64, 64, -64, 64, -64, -64, 64, 64, -64, -64, 64, 64, -64, 64, -64, 64, -64, 64, 64, 64, 64, 64, -64, 64, 64, -64, 64, -64, 64, -64, -64, -64, -64, -64, -64, -64, -64, 64, 64, 64, 64, 64, 64, 64, 64, -64, 64, 64, -64, 64, 64, -64, -64, -64, 64, -64, -64, 64, -64, -64, -64, -64, -64, -64, -64, -64, -64, -64, -64, 64, 64, 64, -64, -64, -64, -64, 64, 64, -64, -64, -64, -64, -64, -64, -64, -64, -64, -64, -64, -64, -64, -64, -64, -64, 64, -64, -64, 64, 64, 64, 64, -64, 64, 64, 64, -64, 64, -64, 64, -64, -64, 64, 64, -64, -64, -64, 64, -64, 64, -64, -64, 64, -64, -64, 64, -64, -64, 64, 64, 64, -64, 64, 64, -64, 64, 64, 64, -64, -64, 64, -64, -64, 64, 64, 64, 64, 64, -64, 64, 64, 64, -64, -64, -64, 64, -64, 64, 64, 64, 64, -64, -64, -64, 64, -64, -64, -64, -64, -64, -64, -64, -64, 64, 64, 64, -64, -64, -64, 64, 64, 64, -64, -64, -64, -64, -64, -64, 64, 64, -64, -64, -64, 64, -64, -64, -64, 64, -64, -64, -64, -64, 64, -64, -64, -64, 64, -64, -64, 64, -64, -64, -64, -64, -64, -64, 64, 64, -64, 64, -64, 64, 64, -64, -64, -64, -64, -64, -64, -64, 64, 64, 64, 64, 64, -64, -64, -64, -64, -64, -64, -64, -64, -64, -64, -64, -64, 64, 64, 64, 64, -64, -64, -64, -64, -64, -64, 64, 64, 64, 64, -64, -64, -64, 64, -64, -64, -64, -64, -64, -64, 64, -64, 64, 64, 64, 64, -64, 64, -64, -64, -64, -64, -64, -64, 64, 64, 64, 64, -64, 64, 64, -64, -64, -64, -64, -64, -64, -64, 64, 64, -64, 64, -64, -64, 64, -64, 64, -64, -64, -64, 64, 64, 64, 64, -64, -64, -64, 64, -64, -64, -64, -64, -64, -64, -64, -64, 64, 64, 64, -64, -64, -64, 64, -64, -64, 64, -64, -64, 64, 64, 64, 64, 64, 64, 64, -64, -64, -64, -64, -64, -64, -64, -64, -64, 64, 64, 64, 64, 64, 64, -64, 64, -64, -64, -64, -64, 64, -64, -64, 64, 64, -64, 64, 64, -64, -64, -64, -64, -64, -64, -64, -64, 64, 64, 64, -64, 64, 64, -64, 64, -64, -64, -64, -64, -64, 64, 64, 64, 64, -64, -64, -64, -64, 64, -64, -64, -64, -64, -64, -64, 64, 64, 64, -64, 64, 64, 64, -64, 64, -64, -64, -64, -64, -64, 64, -64, 64, -64, -64, -64, -64, 64, 64, -64, -64, -64, -64, 64, -64, 64, -64, 64, 64, 64, 64, -64, 64, -64, -64, 64, -64, 64, 64, -64, -64, -64, -64, 64, 64, 64, -64, 64, -64, 64, 64, 64, -64, -64, -64, -64, -64, -64, -64, 64, 64, 64, 64, -64, -64, -64, -64, 64, 64, -64, 64, 64, 64, 64, -64, -64, -64, 64, 64, -64, 64, -64, 64, -64, 64, -64, -64, 64, 64, -64, 64, -64, -64, 64, 64, -64, 64, 64, 64, 64, 64, -64, 64, -64, -64, -64, 64, 64, -64, 64, -64, 64, 64, -64, -64, -64, 64, -64, -64, -64, -64, -64, -64, 64, 64, 64, 64, 64, 64, 64, -64, -64, -64, 64, 64, -64, 64, -64, 64, -64, 64, -64, 64, 64, -64, -64, -64, -64, 64, 64, -64, 64, 64, 64, 64, 64, 64, 64, 64, -64, -64, -64, -64, -64, -64, 64, -64, 64, 64, -64, -64, 64, 64, 64, 64, -64, -64, -64, -64, -64, -64, 64, 64, 64, 64, 64, 64, 64, 64, 64, -64, -64, -64, 64, 64, -64, -64, 64, 64, 64, -64, 64, -64, -64, -64, -64, -64, -64, -64, -64, 64, -64, -64, -64, -64, -64, 64, -64, -64, -64, -64, -64, -64, 64, -64, -64, 64, -64, 64, 64, 64, -64, -64, -64, -64, 64, -64, 64, -64, 64, 64, 64, -64, 64, -64, 64, -64, -64, 64, 64, 64, -64, -64, -64, 64, 64, 64, -64, 64, 64, 64, -64, 64, 64, 64, 64, -64, 64, -64, 64, 64, 64, 64, -64, 64, 64, -64, -64, -64, 64, -64, 64, 64, -64, 64, -64, -64, -64, -64, -64, -64, -64, -64, -64, -64, -64, -64, 64, -64, -64, -64, 64, 64, 64, 64, -64, 64, 64, -64, 64, 64, 64, 64, -64, -64, -64, -64, 64, -64, -64, -64, 64, -64, -64, -64, -64, 64, -64, -64, -64, -64, -64, -64, -64, -64, -64, -64, 64, -64, 64, 64, -64, -64, -64, -64, -64, -64, -64, -64, -64, -64, -64, -64, -64, 64, 64, 64, 64, 64, -64, -64, 64, -64, -64, -64, 64, -64, -64, 64, 64, -64, 64, 64, -64, 64, -64, -64, -64, -64, -64, -64, -64, -64, -64, -64, 64, 64, 64, 64, 64, -64, -64, -64, 64, -64, 64, 64, 64, 64, 64, -64, -64, -64, 64, 64, 64, -64, -64, 64, 64, -64, 64, 64, 64, -64, -64, 64, 64, 64, 64, -64, -64, 64, -64, -64, 64, -64, -64, 64, 64, 64, 64, -64, 64, -64, 64, 64, 64, 64, 64, 64, 64, -64, 64, 64, 64, 64, 64, -64, 64, 64, -64, -64, 64, -64, -64, -64, 64, -64, -64, 64, 64, 64, 64, 64, 64, 64, 64, 64, 64, 64, -64, -64, 64, -64, 64, 64, -64, 64, -64, -64, 64, -64, -64, -64, -64, 64, 64, 64, 64, 64, 64, 64, 64, 64, 64, 64, 64, -64, -64, -64, 64, 64, 64, 64, 64, 64, -64, 64, -64, -64, -64, -64, 64, -64, 64, 64, 64, 64, 64, 64, 64, 64, 64, 64, 64, 64, -64, 64, 64, 64, -64, -64, 64, 64, -64, -64, -64, 64, -64, 64, 64, -64, 64, 64, 64, 64, 64, 64, 64, 64, -64, 64, -64, -64, 64, 64, 64, 64, 64, -64, 64, -64, 64, 64, -64, -64, -64, -64, 64, 64, 64, 64, 64, 64, 64, -64, -64, -64, -64, -64, -64, -64, 64, -64, 64, -64, 64, 64, -64, -64, -64, -64, -64, -64, -64, 64, 64, 64, -64, -64, 64, 64, -64, -64, -64, 64, -64, -64, 64, 64, 64, 64, -64, -64, 64, -64, -64, 64, -64, -64, -64, 64, 64, -64, 64, 64, 64, -64, -64, -64, 64, -64, -64, -64, -64, -64, 64, -64, -64, 64, -64, -64, -64, 64, -64, -64, -64, 64, 64, -64, 64, 64, 64, 64, 64, 64, 64, 64, -64, 64, -64, 64, -64, -64, 64, -64, -64, 64, 64, -64, -64, -64, 64, 64, -64, -64, -64, 64, -64, 64, 64, 64, 64, 64, -64, 64, -64, -64, -64, -64, -64, -64, -64, -64, -64, -64, 64, -64, 64, 64, 64, 64, -64, -64, -64, -64, 64, 64, 64, 64, 64, 64, 64, 64, -64, -64, -64, -64, -64, 64, -64, -64, -64, 64, 64, 64, -64, 64, 64, 64, -64, -64, -64, -64, -64, 64, 64, 64, 64, 64, -64, 64, -64, -64, -64, -64, -64, 64, 64, -64, -64, -64, 64, -64, 64, 64, -64, -64, -64, 64, -64, -64, -64, 64, 64, 64, 64, -64, -64, 64, 64, 64, 64, -64, 64, 64, -64, 64, -64, -64, -64, -64, 64, 64, 64, -64, 64, 64, -64, -64, -64, -64, -64, -64, -64, -64, -64, 64, 64, 64, -64, -64, 64, 64, 64, 64, -64, -64, -64, -64, 64, 64, -64, -64, -64, -64, -64, -64, -64, 64, -64, -64, -64, -64, -64, -64, 64, -64, -64, 64, 64, 64, 64, 64, 64, 64, 64, 64, 64, -64, 64, -64, -64, -64, -64, -64, -64, -64, 64, -64, -64, -64, 64, 64, -64, 64, 64, 64, 64, 64, 64, 64, 64, 64, 64, 64, 64, 64, -64, -64, 64, -64, -64, -64, -64, 64, -64, 64, 64, 64, 64, 64, 64, -64, 64, 64, 64, 64, 64, 64, 64, -64, 64, 64, 64, 64, 64, 64, -64, 64, -64, -64, -64, 64, 64, 64, 64, 64, 64, 64, 64, 64, 64, 64, 64, 64, 64, 64, 64, -64, 64, -64, 64, 64, -64, 64, -64, 64, 64, -64, -64, -64, -64, -64, 64, 64, 64, 64, 64, -64, -64, 64, 64, 64, 64, 64, 64, 64, -64, 64, 64, 64, 64, 64, -64, 64, -64, -64, 64, -64, -64, -64, 64, -64, 64, 64, 64, 64, 64, 64, 64, 64, 64, -64, -64, 64, -64, -64, 64, 64, 64, 64, -64, -64, 64, 64, 64, -64, -64, -64, -64, -64, -64, 64, 64, 64, 64, -64, 64, -64, -64, -64, 64, 64, 64, 64, -64, -64, -64, -64, -64, 64, 64, 64, -64, 64, 64, -64, 64, 64, -64, -64, 64, -64, 64, -64, 64, -64, -64, -64, 64, -64, -64, -64, -64, 64, 64, 64, -64, 64, 64, -64, -64, -64, 64, 64, 64, -64, -64, 64, -64, 64, -64, 64, -64, 64, 64, -64, -64, 64, 64, -64, -64, -64, -64, -64, 64, -64, 64, -64, 64, 64, -64, 64, 64, -64, -64, -64, 64, 64, 64, -64, 64, -64, -64, 64, -64, -64, -64, 64, 64, -64, 64, -64, 64, -64, -64, -64, 64, 64, -64, 64, -64, 64, -64, -64, -64, -64, -64, -64, -64, -64, -64, -64, -64, -64, 64, -64, -64, -64, -64, -64, -64, -64, 64, -64, -64, -64, 64, 64, -64, -64, 64, 64, -64, -64, -64, -64, -64, -64, -64, -64, -64, -64, -64, 64, 64, 64, -64, -64, 64, -64, 64, -64, 64, -64, -64, -64, -64, -64, 64, 64, 64, 64, 64, 64, 64, 64, -64, 64, -64, -64, -64, -64, 64, 64, -64, -64, -64, -64, 64, 64, 64, -64, -64, -64, -64, -64, 64, 64, 64, 64, -64, 64, 64, -64, 64, -64, -64, -64, 64, -64, -64, -64, -64, 64, -64, 64, 64, -64, 64, 64, 64, -64, 64, 64, -64, -64, -64, 64, -64, 64, 64, 64, 64, -64, -64, -64, -64, -64, 64, -64, -64, -64, -64, 64, 64, 64, -64, -64, -64, 64, 64, -64, -64, -64, -64, -64, -64, 64, 64, 64, 64, 64, -64, -64, -64, -64, -64, 64, -64, 64, 64, 64, 64, 64, -64, -64, -64, 64, -64, -64, -64, -64, 64, 64, -64, -64, 64, 64, 64, 64, 64, -64, -64, -64, -64, -64, -64, 64, 64, 64, 64, -64, -64, -64, -64, -64, -64, -64, -64, -64, -64, 64, 64, 64, -64, -64, 64, -64, -64, -64, -64, -64, -64, -64, 64, 64, -64, 64, 64, 64, -64, -64, -64, -64, -64, -64, -64, -64, 64, 64, 64, 64, 64, -64, -64, -64, -64, -64, -64, 64, -64, -64, 64, 64, 64, 64, -64, -64, -64, -64, -64, -64, -64, -64, -64, -64, 64, 64, 64, 64, 64, 64, -64, -64, -64, -64, -64, 64, -64, 64, 64, 64, -64, 64, 64, -64, -64, -64, -64, -64, -64, -64, 64, 64, 64, 64, 64, 64, 64, -64, -64, -64, -64, -64, 64, 64, 64, -64, 64, -64, 64, 64, 64, 64, -64, -64, -64, -64, -64, -64, -64, 64, 64, 64, 64, 64, 64, -64, -64, -64, -64, -64, -64, -64, 64, 64, -64, -64, 64, 64, 64, -64, -64, -64, -64, -64, -64, -64, 64, 64, 64, 64, 64, 64, 64, -64, 64, 64, -64, -64, -64, -64, 64, 64, -64, 64, 64, 64, 64, -64, -64, -64, -64, -64, -64, -64, -64, 64, 64, 64, 64, 64, -64, -64, -64, -64, 64, -64, 64, 64, -64, 64, 64, -64, -64, 64, -64, -64, -64, -64, -64, -64, -64, -64, -64, 64, 64, 64, -64, -64, -64, -64, 64, -64, -64, -64, -64, 64, -64, -64, 64, -64, -64, -64, -64, -64, -64, -64, -64, 64, -64, -64, -64, -64, 64, 64, -64, -64, -64, -64, -64, -64, -64, -64, 64, 64, 64, 64, 64, 64, 64, 64, -64, 64, -64, 64, -64, -64, -64, -64, -64, 64, -64, -64, -64, -64, -64, -64, -64, -64, -64, -64, -64, 64, 64, 64, 64, 64, 64, 64, -64, -64, 64, 64, 64, -64, -64, -64, 64, -64, -64, -64, -64, -64, 64, -64, -64, -64, -64, -64, -64, 64, 64, -64, -64, 64, -64, 64, -64, -64, 64, 64, -64, -64, -64, 64, -64, -64, -64, -64, -64, -64, -64, -64, -64, 64, 64, 64, -64, 64, 64, 64, -64, -64, 64, 64, -64, -64, 64, 64, 64, -64, 64, 64, 64, 64, -64, -64, -64, -64, 64, -64, 64, 64, -64, -64, -64, -64, -64, -64, -64, 64, 64, -64, -64, 64, -64, 64, 64, 64, 64, 64, 64, -64, 64, -64, 64, -64, -64, -64, 64, 64, -64, -64, -64, -64, -64, -64, 64, -64, -64, 64, -64, 64, 64, -64, -64, 64, 64, 64, 64, -64, 64, 64, -64, 64, -64, -64, -64, -64, -64, -64, -64, 64, -64, -64, 64, -64, -64, -64, -64, 64, 64, 64, 64, 64, 64, 64, -64, -64, -64, -64, -64, -64, -64, -64, -64, -64, -64, 64, 64, 64, 64, 64, -64, 64, -64, -64, -64, 64, 64, 64, 64, 64, 64, -64, -64, -64, -64, -64, -64, -64, -64, -64, -64, 64, 64, -64, -64, -64, 64, 64, -64, 64, -64, 64, 64, 64, 64, 64, 64, -64, -64, -64, 64, -64, 64, 64, 64, 64, 64, 64, 64, -64, 64, 64, -64, -64, 64, 64, 64, 64, 64, 64, 64, 64, -64, 64, -64, 64, 64, 64, -64, 64, -64, -64, 64, 64, 64, -64, 64, 64, -64, -64, 64, 64, -64, -64, 64, -64, 64, 64, -64, 64, 64, -64, 64, -64, -64, 64, -64, -64, -64, -64, 64, 64, -64, 64, -64, 64, -64, 64, -64, 64, 64, -64, -64, -64, -64, -64, -64, 64, 64, 64, 64, -64, -64, 64, 64, 64, 64, 64, -64, -64, -64, 64, -64, -64, 64, -64, -64, 64, 64, -64, 64, -64, 64, -64, -64, 64, 64, 64, 64, 64, 64, 64, -64, 64, 64, -64, -64, -64, 64, 64, -64, -64, 64, -64, -64, -64, 64, -64, -64, -64, -64, 64, 64, -64, 64, 64, 64, -64, -64, 64, -64, 64, 64, 64, 64, -64, 64, 64, -64, -64, -64, -64, -64, 64, 64, 64, -64, 64, 64, -64, -64, 64, 64, -64, -64, 64, 64, 64, 64, 64, 64, 64, 64, -64, 64, -64, 64, -64, -64, 64, 64, 64, 64, 64, -64, -64, 64, -64, 64, 64, 64, 64, 64, -64, 64, 64, 64, 64, 64, 64, 64, 64, 64, 64, 64, 64, 64, -64, 64, 64, -64, 64, -64, -64, -64, 64, 64, 64, 64, 64, 64, 64, 64, 64, 64, 64, 64, 64, 64, 64, 64, 64, 64, 64, -64, -64, 64, 64, -64, 64, -64, -64, 64, 64, 64, 64, 64, -64, 64, 64, 64, 64, 64, 64, 64, 64, 64, 64, 64, 64, 64, -64, 64, -64, -64, 64, 64, 64, 64, 64, 64, -64, 64, 64, -64, -64, -64, 64, 64, 64, 64, -64, -64, -64, 64, 64, 64, 64, 64, 64, 64, -64, 64, -64, 64, -64, -64, 64, 64, 64, 64, 64, 64, 64, 64, -64, -64, -64, 64, -64, -64, -64, 64, 64, 64, -64, -64, 64, 64, -64, -64, -64, -64, -64, -64, 64, 64, 64, 64, 64, 64, 64, -64, 64, -64, 64, -64, -64, -64, 64, -64, -64, -64, -64, -64, -64, -64, -64, -64, -64, -64, -64, 64, 64, 64, -64, -64, 64, -64, 64, -64, -64, -64, 64, 64, -64, 64, -64, 64, 64, -64, -64, -64, 64, -64, -64, -64, 64, -64, 64, 64, -64, 64, -64, 64, 64, 64, -64, -64, -64, 64, 64, 64, -64, 64, 64, 64, 64, 64, 64, 64, -64, -64, -64, 64, -64, -64, 64, 64, -64, 64, -64, 64, 64, -64, -64, -64, 64, 64, -64, -64, -64, 64, 64, 64, 64, 64, -64, 64, 64, -64, -64, -64, 64, 64, 64, -64, -64, 64, 64, -64, -64, -64, -64, -64, 64, -64, -64, -64, -64, 64, 64, -64, -64, 64, 64, 64, 64, 64, -64, -64, 64, 64, -64, 64, 64, 64, -64, -64, -64, -64, -64, -64, 64, 64, 64, -64, -64, 64, 64, -64, -64, 64, 64, 64, 64, 64, 64, 64, -64, -64, -64, 64, -64, 64, -64, -64, 64, 64, -64, -64, -64, -64, -64, 64, -64, 64, 64, -64, -64, 64, 64, 64, 64, 64, 64, 64, 64, 64, -64, -64, -64, 64, 64, -64, -64, 64, 64, -64, -64, -64, 64, 64, 64, 64, -64, -64, 64, 64, 64, 64, 64, 64, -64, -64, 64, 64, 64, -64, -64, -64, 64, 64, 64, -64, 64, -64, -64, -64, -64, -64, -64, -64, -64, -64, -64, 64, 64, 64, 64, 64, 64, 64, 64, 64, 64, 64, -64, -64, 64, 64, 64, 64, 64, -64, -64, -64, -64, 64, -64, 64, 64, 64, 64, 64, 64, 64, 64, 64, 64, -64, 64, 64, -64, 64, -64, -64, 64, 64, 64, 64, 64, -64, 64, -64, -64, -64, 64, 64, 64, -64, 64, 64, 64, 64, -64, 64, 64, 64, 64, 64, -64, 64, -64, 64, 64, 64, 64, 64, 64, 64, 64, 64, -64, 64, 64, 64, 64, 64, -64, 64, 64, -64, -64, -64, -64, -64, 64, 64, -64, -64, -64, 64, 64, 64, 64, 64, 64, 64, 64, 64, 64, 64, -64, 64, 64, 64, 64, 64, 64, -64, -64, -64, 64, -64, 64, 64, 64, 64, 64, 64, -64, 64, 64, 64, 64, 64, 64, 64, 64, 64, 64, 64, 64, 64, 64, -64, -64, -64, -64, 64, 64, 64, -64, 64, 64, -64, -64, -64, 64, -64, 64, 64, 64, 64, 64, 64, 64, 64, 64, 64, 64, 64, -64, -64, 64, -64, -64, 64, 64, -64, 64, -64, -64, -64, 64, -64, -64, -64, -64, 64, -64, 64, 64, 64, 64, -64, 64, -64, 64, 64, 64, -64, -64, -64, -64, -64, -64, 64, -64, -64, -64, 64, -64, -64, 64, 64, 64, -64, 64, 64, 64, -64, -64, -64, 64, -64, -64, -64, 64, -64, -64, -64, -64, 64, -64, -64, 64, -64, -64, -64, 64, 64, 64, 64, 64, 64, -64, -64, 64, 64, 64, -64, -64, 64, 64, -64, -64, 64, 64, 64, -64, -64, -64, -64, 64, -64, -64, 64, 64, -64, -64, -64, 64, 64, -64, 64, 64, -64, -64, 64, -64, 64, 64, -64, 64, -64, 64, 64, 64, -64, 64, -64, 64, -64, 64, 64, 64, 64, -64, 64, -64, 64, 64, 64, -64, -64, 64, -64, 64, 64, -64, 64, -64, -64, 64, 64, -64, -64, -64, 64, 64, -64, 64, -64, 64, -64, 64, 64, 64, 64, -64, 64, -64, -64, -64, -64, 64, -64, 64, 64, 64, 64, 64, 64, 64, 64, 64, -64, -64, -64, -64, 64, 64, 64, 64, 64, 64, 64, -64, -64, 64, -64, -64, -64, -64, -64, -64, -64, 64, -64, 64, -64, -64, -64, -64, -64, 64, 64, 64, 64, -64, 64, -64, -64, -64, -64, 64, -64, -64, -64, 64, -64, 64, 64, 64, 64, 64, -64, 64, -64, 64, -64, 64, 64, 64, 64, -64, 64, 64, -64, 64, 64, 64, 64, -64, -64, 64, -64, 64, 64, -64, -64, 64, -64, 64, 64, 64, -64, -64, 64, 64, 64, 64, 64, 64, -64, 64, -64, 64, 64, -64, 64, 64, -64, 64, -64, 64, 64, 64, 64, -64, -64, -64, -64, 64, 64, 64, 64, 64, 64, 64, -64, -64, 64, -64, -64, -64, 64, -64, -64, -64, 64, -64, 64, -64, -64, 64, -64, -64, -64, -64, 64, -64, 64, 64, 64, 64, 64, 64, 64, -64, 64, 64, -64, -64, 64, -64, -64, -64, 64, 64, -64, 64, 64, 64, -64, -64, -64, -64, -64, 64, 64, 64, 64, 64, 64, 64, 64, -64, 64, -64, -64, -64, -64, 64, 64, 64, 64, 64, 64, 64, -64, 64, -64, -64, -64, 64, 64, 64, 64, 64, 64, 64, 64, 64, -64, -64, 64, -64, -64, -64, -64, -64, -64, 64, 64, 64, -64, -64, 64, 64, 64, -64, -64, 64, 64, 64, 64, -64, 64, 64, 64, 64, 64, -64, 64, -64, -64, -64, -64, -64, -64, 64, 64, 64, 64, 64, 64, 64, 64, -64, 64, -64, 64, 64, -64, 64, -64, 64, 64, 64, 64, 64, 64, -64, -64, -64, -64, -64, -64, -64, 64, 64, 64, 64, 64, 64, 64, -64, 64, 64, -64, -64, 64, -64, -64, -64, 64, 64, 64, -64, -64, -64, -64, -64, -64, -64, -64, 64, 64, 64, 64, 64, 64, 64, -64, 64, 64, 64, 64, -64, -64, -64, 64, -64, -64, 64, -64, -64, 64, -64, -64, 64, 64, -64, 64, 64, 64, 64, 64, 64, 64, 64, 64, 64, 64, 64, 64, 64, 64, 64, 64, 64, -64, 64, -64, -64, -64, 64, -64, 64, -64, -64, 64, 64, 64, 64, -64, -64, 64, 64, 64, 64, -64, -64, -64, 64, 64, 64, 64, 64, -64, -64, -64, -64, -64, -64, 64, 64, -64, -64, -64, -64, 64, 64, -64, 64, 64, 64, 64, 64, 64, 64, 64, 64, 64, 64, 64, -64, -64, -64, -64, 64, -64, -64, 64, -64, -64, -64, -64, -64, 64, -64, -64, -64, 64, 64, 64, 64, 64, 64, 64, 64, -64, 64, -64, -64, -64, -64, -64, 64, 64, 64, -64, 64, -64, -64, 64, 64, 64, -64, -64, -64, -64, 64, -64, -64, 64, 64, 64, 64, -64, -64, -64, -64, -64, -64, -64, 64, -64, -64, -64, -64, 64, -64, 64, -64, -64, -64, -64, -64, -64, 64, 64, -64, 64, 64, 64, -64, -64, -64, -64, -64, -64, -64, -64, -64, 64, 64, 64, 64, -64, 64, 64, 64, 64, -64, 64, 64, 64, -64, 64, 64, 64, -64, 64, 64, 64, -64, -64, -64, -64, -64, -64, 64, -64, -64, -64, 64, -64, -64, 64, 64, 64, -64, -64, 64, 64, 64, 64, 64, -64, -64, -64, 64, 64, -64, -64, 64, -64, -64, -64, -64, 64, -64, 64, 64, 64, -64, 64, -64, 64, 64, 64, 64, 64, 64, 64, 64, 64, 64, -64, -64, -64, 64, -64, -64, -64, -64, 64, -64, -64, 64, 64, 64, 64, 64, -64, 64, -64, 64, 64, 64, 64, 64, 64, 64, 64, 64, 64, -64, -64, -64, -64, -64, -64, 64, -64, 64, 64, -64, 64, 64, -64, -64, -64, -64, -64, -64, 64, -64, 64, 64, 64, -64, -64, 64, 64, 64, 64, 64, -64, -64, -64, -64, -64, 64, -64, 64, 64, 64, -64, -64, -64, -64, -64, 64, 64, 64, -64, -64, -64, 64, -64, 64, -64, 64, -64, 64, -64, -64, -64, 64, -64, -64, -64, -64, -64, -64, 64, -64, -64, -64, -64, -64, -64, -64, -64, -64, -64, -64, -64, -64, -64, 64, -64, -64, 64, 64, 64, -64, -64, -64, 64, -64, 64, -64, 64, 64, 64, 64, -64, 64, 64, 64, -64, -64, -64, -64, 64, 64, 64, 64, 64, -64, -64, -64, -64, -64, 64, 64, -64, -64, 64, -64, 64, -64, 64, -64, 64, 64, 64, -64, -64, 64, 64, -64, 64, -64, 64, 64, -64, -64, -64, -64, 64, 64, 64, 64, 64, -64, -64, 64, 64, 64, -64, -64, 64, -64, -64, 64, -64, 64, 64, -64, -64, -64, -64, -64, 64, -64, -64, 64, -64, 64, 64, 64, -64, -64, 64, 64, 64, 64, -64, -64, 64, -64, 64, -64, 64, -64, -64, -64, -64, 64, 64, -64, 64, -64, 64, 64, -64, 64, 64, -64, 64, -64, -64, -64, -64, -64, -64, 64, -64, -64, -64, -64, -64, 64, -64, -64, -64, -64, -64, -64, -64, -64, -64, -64, -64, 64, 64, -64, 64, -64, 64, -64, -64, -64, -64, -64, -64, -64, -64, -64, -64, 64, -64, -64, -64, 64, -64, -64, -64, -64, 64, 64, -64, -64, -64, -64, 64, 64, 64, -64, -64, 64, -64, -64, -64, 64, -64, -64, -64, -64, -64, 64, -64, -64, 64, -64, -64, -64, -64, -64, 64, -64, 64, 64, -64, -64, -64, -64, 64, -64, -64, 64, 64, -64, -64, -64, 64, 64, 64, 64, -64, 64, -64, -64, -64, -64, -64, 64, -64, -64, -64, -64, 64, 64, -64, -64, -64, 64, -64, -64, -64, -64, -64, -64, 64, 64, 64, -64, -64, 64, -64, -64, 64, -64, 64, 64, 64, 64, 64, 64, 64, -64, 64, 64, -64, 64, -64, -64, -64, -64, -64, 64, 64, 64, 64, -64, -64, 64, -64, -64, -64, 64, 64, -64, 64, 64, 64, -64, 64, 64, 64, -64, 64, -64, -64, -64, -64, 64, 64, -64, 64, 64, 64, -64, -64, -64, -64, -64, -64, 64, -64, -64, 64, 64, 64, 64, -64, 64, 64, -64, -64, -64, -64, -64, -64, -64, 64, 64, 64, 64, 64, -64, -64, -64, -64, -64, -64, -64, 64, 64, -64, 64, -64, 64, -64, -64, -64, -64, 64, -64, -64, -64, -64, -64, 64, 64, 64, -64, 64, -64, -64, -64, -64, -64, -64, -64, -64, -64, -64, 64, 64, -64, 64, 64, -64, 64, -64, 64, -64, -64, -64, -64, -64, -64, 64, 64, 64, 64, 64, -64, -64, -64, -64, -64, -64, -64, -64, -64, -64, -64, 64, -64, 64, -64, 64, -64, -64, -64, -64, 64, -64, -64, -64, 64, 64, 64, -64, -64, -64, -64, -64, -64, -64, -64, -64, -64, -64, 64, 64, 64, -64, -64, 64, 64, 64, -64, -64, 64, -64, -64, -64, 64, 64, -64, -64, -64, -64, -64, -64, -64, 64, -64, 64, -64, -64, 64, -64, 64, -64, 64, -64, 64, -64, 64, -64, 64, -64, -64, -64, 64, -64, -64, -64, -64, -64, -64, 64, 64, 64, -64, -64, 64, -64, -64, 64, 64, 64, 64, -64, -64, -64, 64, -64, 64, -64, -64, -64, 64, 64, -64, -64, -64, -64, 64, -64, -64, 64, 64, -64, 64, -64, -64, -64, -64, -64, -64, 64, 64, 64, 64, -64, -64, -64, -64, 64, 64, 64, -64, -64, -64, -64, -64, 64, 64, 64, -64, 64, -64, -64, -64, 64, 64, -64, 64, 64, 64, -64, -64, 64, -64, -64, -64, 64, 64, 64, -64, -64, -64, -64, -64, 64, -64, -64, -64, -64, -64, 64, -64, 64, 64, -64, 64, -64, 64, -64, -64, -64, -64, -64, -64, 64, 64, 64, -64, -64, -64, -64, -64, 64, -64, -64, -64, -64, -64, -64, -64, 64, 64, -64, 64, 64, 64, -64, -64, -64, -64, -64, -64, 64, 64, -64, 64, -64, -64, -64, 64, -64, -64, -64, 64, -64, -64, -64, 64, -64, -64, 64, -64, -64, 64, -64, -64, -64, 64, -64, 64, 64, 64, 64, -64, -64, 64, -64, 64, -64, -64, -64, 64, 64, -64, -64, -64, -64, 64, -64, 64, -64, -64, -64, -64, -64, -64, -64, 64, 64, 64, -64, 64, -64, 64, 64, -64, -64, -64, 64, -64, 64, -64, -64, -64, 64, -64, 64, -64, -64, 64, -64, -64, -64, -64, -64, -64, -64, 64, 64, -64, 64, -64, -64, -64, -64, -64, 64, -64, 64, -64, -64, -64, 64, -64, 64, 64, 64, -64, 64, -64, -64, -64, -64, 64, 64, 64, 64, -64, -64, 64, 64, -64, -64, -64, -64, -64, -64, -64, -64, -64, -64, 64, -64, -64, 64, 64, -64, -64, -64, 64, 64, 64, 64, -64, 64, -64, -64, -64, -64, -64, -64, -64, -64, -64, 64, -64, 64, 64, 64, -64, 64, -64, -64, -64, -64, 64, 64, -64, 64, -64, 64, -64, -64, 64, -64, -64, 64, -64, -64, -64, -64, 64, -64, 64, 64, -64, 64, 64, 64, 64, 64, 64, -64, 64, -64, 64, 64, -64, -64, -64, -64, -64, -64, -64, -64, -64, -64, -64, 64, -64, -64, 64, 64, 64, -64, -64, -64, 64, 64, 64, -64, -64, -64, 64, 64, -64, -64, -64, -64, -64, 64, 64, -64, -64, -64, 64, -64, -64, -64, 64, 64, 64, -64, 64, -64, 64, -64, 64, 64, -64, -64, -64, 64, 64, 64, -64, 64, 64, 64, -64, 64, -64, -64, 64, 64, -64, 64, -64, 64, 64, 64, -64, -64, 64, 64, -64, -64, 64, 64, 64, 64, 64, -64, -64, -64, -64, 64, -64, -64, -64, -64, -64, -64, 64, 64, 64, -64, 64, 64, -64, 64, 64, -64, 64, 64, -64, 64, 64, 64, 64, -64, -64, -64, -64, 64, 64, -64, -64, 64, 64, -64, 64, 64, 64, -64, 64, 64, -64, -64, -64, 64, 64, 64, -64, -64, 64, 64, 64, 64, -64, -64, 64, 64, 64, -64, -64, -64, 64, -64, -64, -64, -64, -64, -64, -64, 64, 64, 64, 64, 64, 64, -64, -64, 64, 64, 64, -64, 64, -64, -64, 64, -64, -64, 64, 64, 64, 64, 64, -64, 64, -64, 64, 64, -64, -64, 64, -64, 64, -64, -64, -64, 64, -64, 64, -64, -64, 64, -64, 64, 64, -64, 64, 64, -64, -64, -64, -64, 64, 64, 64, -64, -64, 64, 64, -64, 64, 64, -64, 64, 64, 64, -64, -64, -64, 64, -64, -64, -64, -64, -64, 64, 64, 64, 64, -64, -64, 64, -64, -64, -64, 64, 64, -64, 64, 64, 64, -64, -64, 64, -64, 64, -64, -64, 64, 64, 64, -64, -64, 64, 64, 64, 64, -64, -64, 64, -64, -64, -64, 64, 64, 64, 64, 64, 64, 64, 64, 64, -64, 64, -64, -64, 64, 64, 64, 64, 64, 64, 64, -64, -64, -64, -64, -64, -64, 64, 64, -64, 64, 64, 64, 64, 64, -64, -64, 64, 64, -64, -64, -64, 64, 64, 64, -64, 64, 64, -64, 64, -64, -64, -64, 64, 64, -64, -64, 64, 64, 64, 64, 64, 64, -64, 64, 64, -64, -64, -64, -64, -64, 64, 64, -64, -64, 64, 64, 64, -64, -64, -64, 64, -64, -64, -64, -64, 64, 64, 64, 64, 64, 64, 64, -64, -64, -64, -64, -64, -64, -64, -64, -64, -64, 64, 64, 64, 64, 64, 64, -64, -64, 64, -64, -64, -64, -64, 64, 64, 64, -64, 64, -64, -64, -64, -64, -64, -64, 64, 64, 64, 64, 64, 64, 64, 64, 64, 64, 64, 64, 64, 64, 64, -64, -64, -64, 64, 64, 64, -64, -64, -64, -64, -64, -64, -64, -64, 64, 64, 64, -64, -64, 64, 64, 64, 64, 64, 64, 64, 64, 64, -64, -64, 64, 64, 64, 64, -64, -64, -64, 64, -64, 64, 64, 64, 64, 64, -64, -64, -64, -64, 64, 64, 64, 64, -64, 64, -64, 64, 64, 64, -64, 64, 64, -64, 64, 64, 64, -64, 64, 64, 64, 64, -64, -64, 64, 64, 64, -64, 64, 64, 64, 64, -64, 64, -64, -64, 64, 64, 64, 64, 64, -64, 64, 64, 64, 64, 64, 64, -64, -64, -64, 64, 64, 64, 64, 64, 64, 64, 64, 64, 64, -64, -64, -64, 64, 64, 64, -64, -64, -64, -64, 64, 64, 64, 64, 64, 64, -64, -64, -64, -64, 64, 64, -64, -64, -64, 64, 64, 64, 64, -64, -64, -64, 64, -64, -64, 64, 64, 64, 64, 64, 64, 64, 64, -64, -64, -64, -64, -64, 64, 64, -64, 64, 64, -64, 64, -64, -64, -64, -64, -64, -64, -64, -64, 64, 64, 64, 64, 64, 64, 64, -64, -64, -64, -64, 64, -64, 64, 64, 64, 64, 64, -64, 64, -64, 64, -64, -64, -64, -64, -64, -64, 64, 64, 64, 64, 64, 64, 64, -64, -64, -64, -64, -64, -64, -64, 64, 64, 64, 64, 64, 64, -64, 64, 64, -64, -64, 64, 64, 64, 64, 64, 64, 64, 64, 64, -64, -64, -64, -64, -64, -64, -64, 64, 64, 64, 64, 64, -64, 64, 64, -64, -64, 64, -64, 64, 64, 64, 64, 64, 64, 64, 64, -64, -64, -64, -64, -64, -64, -64, -64, -64, 64, 64, 64, -64, -64, 64, -64, -64, 64, 64, -64, 64, 64, 64, 64, 64, 64, 64, 64, 64, -64, -64, -64, -64, -64, -64, 64, 64, 64, 64, -64, 64, -64, 64, 64, 64, -64, 64, -64, 64, 64, 64, -64, -64, -64, 64, 64, -64, -64, -64, -64, -64, 64, -64, -64, -64, 64, -64, -64, 64, 64, -64, -64, -64, -64, -64, 64, -64, 64, -64, 64, 64, 64, 64, 64, 64, 64, -64, 64, -64, -64, -64, -64, 64, -64, -64, 64, 64, 64, -64, -64, -64, -64, 64, -64, -64, 64, 64, 64, 64, 64, 64, 64, -64, 64, 64, -64, 64, 64, -64, -64, 64, 64, 64, -64, 64, 64, 64, -64, 64, 64, -64, -64, -64, -64, 64, 64, 64, -64, -64, 64, -64, 64, -64, -64, 64, -64, 64, 64, -64, 64, 64, -64, 64, -64, 64, -64, 64, 64, -64, 64, 64, 64, 64, -64, 64, -64, -64, 64, 64, 64, -64, -64, -64, 64, 64, -64, 64, -64, -64, 64, 64, 64, 64, 64, 64, -64, -64, 64, 64, 64, 64, 64, -64, 64, -64, 64, 64, 64, 64, 64, 64, -64, -64, -64, -64, -64, 64, 64, 64, -64, -64, 64, 64, 64, 64, 64, 64, -64, 64, -64, 64, 64, 64, -64, 64, 64, -64, -64, -64, 64, -64, -64, -64, -64, -64, -64, 64, 64, -64, -64, 64, 64, 64, 64, 64, 64, -64, -64, 64, 64, 64, -64, 64, 64, 64, -64, -64, -64, 64, -64, -64, -64, -64, -64, -64, -64, -64, -64, -64, 64, 64, 64, -64, -64, 64, 64, 64, 64, 64, -64, 64, -64, -64, -64, -64, -64, -64, -64, 64, -64, 64, -64, -64, -64, -64, -64, 64, 64, -64, -64, -64, 64, 64, -64, -64, -64, -64, -64, -64, -64, -64, -64, -64, -64, 64, -64, -64, -64, -64, -64, 64, -64, -64, 64, -64, -64, -64, -64, 64, -64, -64, -64, -64, -64, -64, -64, -64, 64, -64, 64, 64, 64, -64, -64, 64, 64, -64, -64, 64, 64, 64, 64, -64, 64, -64, -64, -64, 64, -64, -64, 64, -64, -64, -64, 64, -64, -64, -64, -64, -64, -64, -64, -64, -64, -64, 64, 64, -64, 64, 64, 64, 64, -64, 64, 64, -64, 64, -64, -64, 64, 64, -64, -64, -64, -64, 64, 64, -64, -64, -64, -64, -64, 64, -64, -64, -64, -64, 64, -64, -64, -64, -64, 64, 64, -64, 64, 64, -64, -64, -64, -64, -64, -64, -64, -64, -64, -64, 64, -64, -64, -64, -64, -64, 64, -64, 64, 64, 64, 64, -64, -64, -64, -64, -64, 64, 64, 64, 64, 64, -64, 64, -64, -64, -64, -64, -64, 64, 64, -64, -64, -64, -64, -64, 64, -64, 64, -64, 64, -64, -64, 64, 64, 64, -64, -64, 64, 64, -64, 64, 64, -64, 64, 64, 64, 64, -64, -64, -64, 64, 64, 64, -64, 64, 64, 64, 64, -64, -64, 64, -64, -64, -64, -64, -64, -64, -64, 64, -64, -64, 64, 64, 64, -64, -64, 64, 64, 64, 64, 64, -64, -64, 64, -64, 64, -64, 64, -64, -64, -64, -64, -64, 64, 64, 64, -64, 64, 64, 64, 64, 64, -64, 64, -64, -64, 64, -64, -64, -64, 64, -64, -64, -64, -64, -64, -64, -64, 64, -64, 64, 64, 64, -64, -64, -64, -64, -64, -64, -64, -64, -64, 64, -64, 64, -64, 64, -64, -64, 64, -64, -64, -64, -64, -64, -64, 64, 64, 64, -64, -64, 64, 64, 64, -64, -64, -64, 64, -64, -64, -64, 64, 64, -64, -64, -64, 64, 64, 64, -64, 64, -64, -64, -64, -64, -64, -64, 64, -64, 64, 64, -64, -64, -64, -64, -64, -64, -64, -64, -64, -64, -64, -64, 64, -64, -64, 64, -64, -64, -64, -64, -64, -64, -64, 64, 64, -64, 64, 64, -64, -64, -64, -64, -64, 64, -64, -64, -64, -64, -64, -64, 64, 64, 64, 64, -64, 64, -64, -64, -64, -64, 64, -64, -64, -64, 64, -64, -64, 64, 64, -64, -64, -64, -64, 64, -64, -64, 64, 64, 64, -64, -64, -64, 64, -64, 64, -64, -64, -64, -64, -64, 64, -64, 64, -64, -64, 64, -64, -64, -64, -64, -64, -64, -64, 64, 64, 64, 64, 64, 64, -64, -64, 64, -64, -64, -64, -64, -64, -64, -64, -64, -64, -64, -64, -64, 64, -64, -64, 64, 64, 64, 64, 64, 64, -64, -64, -64, 64, 64, 64, 64, -64, 64, -64, 64, -64, -64, -64, -64, -64, -64, -64, -64, -64, -64, 64, -64, -64, -64, 64, -64, -64, 64, 64, 64, 64, -64, -64, -64, -64, -64, -64, -64, -64, -64, 64, -64, 64, -64, -64, 64, -64, -64, -64, 64, -64, 64, -64, 64, 64, 64, -64, -64, 64, -64, -64, 64, 64, 64, 64, 64, -64, -64, 64, 64, -64, -64, -64, 64, 64, -64, -64, -64, -64, 64, -64, -64, 64, -64, -64, -64, 64, -64, 64, -64, 64, 64, -64, 64, -64, 64, -64, -64, -64, 64, -64, 64, -64, -64, -64, 64, 64, 64, 64, -64, 64, 64, -64, 64, -64, 64, 64, -64, 64, -64, -64, -64, -64, -64, 64, 64, -64, 64, 64, -64, -64, 64, 64, 64, 64, -64, -64, 64, 64, -64, 64, 64, -64, 64, -64, -64, -64, 64, -64, 64, -64, 64, 64, 64, 64, 64, 64, 64, -64, 64, 64, 64, 64, 64, 64, 64, 64, -64, -64, 64, 64, -64, 64, -64, 64, 64, 64, 64, -64, 64, 64, 64, -64, 64, -64, -64, 64, 64, -64, 64, 64, -64, -64, 64, 64, -64, -64, -64, -64, -64, -64, -64, -64, 64, 64, 64, 64, -64, -64, 64, -64, 64, -64, 64, -64, -64, -64, -64, -64, -64, -64, -64, -64, -64, -64, -64, -64, -64, -64, 64, 64, 64, -64, -64, -64, -64, -64, 64, -64, 64, -64, -64, 64, 64, 64, 64, 64, 64, 64, 64, -64, 64, 64, 64, -64, 64, 64, 64, -64, 64, -64, 64, -64, 64, 64, -64, 64, 64, -64, 64, 64, -64, -64, 64, 64, 64, 64, 64, 64, -64, -64, 64, -64, -64, -64, 64, -64, -64, -64, -64, 64, 64, -64, 64, 64, 64, 64, -64, 64, -64, -64, 64, 64, 64, 64, 64, -64, 64, 64, 64, -64, -64, -64, 64, -64, -64, -64, -64, 64, -64, 64, 64, 64, 64, 64, 64, 64, 64, 64, 64, -64, -64, -64, -64, 64, -64, -64, 64, -64, 64, -64, -64, 64, -64, 64, 64, 64, -64, 64, 64, 64, 64, 64, 64, 64, 64, -64, 64, -64, -64, 64, -64, 64, 64, -64, 64, -64, -64, -64, 64, 64, 64, 64, 64, 64, 64, 64, 64, 64, 64, 64, 64, 64, 64, -64, -64, -64, 64, 64, 64, 64, 64, -64, -64, 64, -64, -64, 64, 64, 64, 64, -64, 64, 64, 64, 64, 64, 64, 64, -64, -64, 64, -64, -64, -64, -64, -64, -64, -64, -64, -64, -64, 64, 64, -64, 64, 64, -64, 64, 64, 64, 64, 64, 64, -64, -64, -64, -64, -64, -64, -64, -64, -64, -64, -64, -64, -64, 64, -64, -64, 64, 64, -64, -64, -64, -64, 64, 64, 64, 64, -64, -64, -64, -64, -64, -64, -64, -64, -64, 64, -64, -64, -64, -64, -64, -64, 64, -64, -64, -64, -64, -64, 64, 64, -64, 64, -64, -64, -64, -64, -64, -64, -64, 64, -64, -64, -64, -64, -64, -64, -64, -64, -64, -64, -64, 64, 64, -64, -64, 64, -64, -64, -64, -64, -64, -64, -64, -64, 64, -64, 64, 64, 64, -64, 64, -64, 64, -64, 64, -64, -64, -64, -64, 64, -64, -64, -64, 64, 64, -64, -64, -64, -64, -64, 64, -64, 64, 64, 64, 64, 64, 64, 64, -64, 64, 64, 64, 64, 64, -64, 64, 64, 64, -64, 64, 64, -64, -64, -64, -64, -64, -64, -64, -64, 64, 64, 64, 64, 64, 64, 64, 64, 64, 64, 64, -64, -64, -64, 64, -64, 64, -64, 64, -64, -64, 64, 64, -64, 64, 64, 64, 64, 64, 64, 64, 64, 64, 64, 64, 64, 64, 64, -64, 64, -64, 64, -64, 64, -64, 64, 64, -64, -64, -64, -64, 64, 64, 64, 64, 64, 64, 64, 64, 64, 64, 64, 64, 64, 64, 64, -64, 64, 64, 64, 64, 64, 64, 64, 64, 64, -64, 64, 64, 64, 64, 64, 64, 64, 64, -64, -64, -64, 64, 64, -64, 64, 64, 64, -64, -64, 64, 64, 64, -64, 64, 64, -64, 64, 64, 64, 64, 64, 64, 64, 64, -64, 64, -64, -64, -64, -64, 64, 64, 64, 64, -64, 64, 64, -64, -64, -64, -64, -64, -64, 64, -64, -64, -64, -64, 64, 64, -64, 64, 64, -64, -64, 64, -64, 64, 64, 64, 64, 64, -64, -64, -64, -64, 64, 64, -64, 64, -64, -64, -64, -64, -64, -64, -64, -64, 64, 64, 64, -64, -64, 64, -64, 64, -64, 64, 64, -64, -64, 64, -64, -64, 64, -64, 64, -64, 64, -64, -64, -64, -64, -64, 64, -64, -64, -64, -64, 64, 64, 64, 64, 64, -64, -64, -64, -64, -64, 64, 64, 64, 64, 64, -64, 64, -64, -64, -64, -64, -64, -64, 64, -64, 64, 64, 64, 64, 64, 64, 64, 64, -64, 64, 64, 64, 64, 64, -64, -64, -64, -64, -64, 64, -64, -64, 64, 64, 64, 64, 64, -64, 64, 64, -64, 64, -64, 64, 64, -64, -64, -64, -64, -64, 64, 64, 64, -64, -64, 64, -64, 64, 64, -64, -64, 64, 64, 64, 64, 64, -64, -64, 64, 64, 64, 64, 64, -64, 64, 64, 64, -64, 64, 64, 64, 64, 64, 64, -64, -64, -64, -64, 64, 64, 64, 64, 64, 64, 64, -64, -64, -64, 64, -64, -64, 64, -64, -64, -64, 64, 64, 64, 64, 64, -64, -64, -64, 64, -64, -64, 64, 64, 64, -64, -64, -64, -64, -64, 64, 64, 64, 64, 64, 64, 64, -64, -64, -64, 64, 64, 64, -64, -64, 64, 64, -64, 64, -64, -64, -64, 64, 64, 64, 64, -64, -64, 64, 64, -64, -64, 64, 64, -64, 64, 64, 64, -64, 64, -64, 64, 64, 64, 64, -64, 64, -64, -64, 64, -64, -64, -64, 64, -64, -64, -64, -64, 64, 64, -64, 64, -64, -64, 64, 64, -64, -64, 64, 64, 64, -64, 64, 64, -64, -64, -64, 64, 64, 64, -64, -64, 64, -64, 64, 64, -64, -64, 64, -64, 64, 64, -64, 64, -64, 64, 64, 64, 64, 64, 64, 64, 64, -64, 64, -64, 64, -64, -64, -64, -64, -64, -64, -64, -64, 64, 64, 64, 64, 64, -64, -64, 64, -64, 64, -64, 64, 64, 64, -64, -64, 64, -64, 64, -64, 64, -64, -64, -64, -64, -64, 64, -64, -64, -64, -64, -64, -64, 64, -64, -64, 64, 64, 64, 64, -64, -64, -64, 64, 64, 64, -64, -64, -64, 64, 64, 64, 64, 64, -64, 64, 64, 64, 64, -64, -64, -64, 64, 64, 64, 64, 64, 64, -64, 64, -64, 64, 64, -64, 64, -64, -64, 64, 64, 64, 64, 64, -64, -64, 64, -64, 64, -64, 64, -64, 64, 64, 64, 64, 64, 64, -64, -64, -64, 64, -64, -64, -64, -64, -64, 64, -64, -64, -64, -64, -64, 64, -64, -64, -64, -64, -64, -64, 64, 64, 64, 64, -64, -64, 64, -64, -64, 64, -64, -64, 64, 64, 64, 64, 64, -64, -64, -64, -64, 64, -64, -64, -64, -64, -64, -64, -64, 64, 64, 64, 64, -64, 64, -64, -64, -64, -64, 64, 64, 64, -64, -64, 64, -64, -64, 64, 64, -64, 64, -64, 64, -64, -64, -64, -64, 64, 64, 64, 64, 64, -64, 64, 64, 64, -64, 64, 64, 64, 64, -64, -64, 64, 64, 64, 64, 64, 64, 64, -64, -64, -64, -64, -64, -64, -64, 64, 64, 64, -64, -64, -64, 64, 64, 64, -64, 64, 64, 64, 64, 64, 64, 64, 64, 64, 64, 64, -64, -64, -64, -64, -64, -64, -64, 64, -64, -64, 64, 64, -64, 64, 64, 64, 64, 64, 64, 64, 64, 64, 64, 64, 64, 64, 64, -64, -64, -64, -64, -64, -64, -64, -64, 64, -64, -64, 64, -64, -64, 64, -64, -64, -64, -64, 64, 64, 64, 64, 64, 64, 64, -64, 64, 64, -64, -64, -64, 64, -64, -64, -64, 64, -64, -64, -64, -64, -64, 64, 64, -64, 64, 64, 64, -64, 64, 64, 64, 64, 64, 64, -64, -64, -64, -64, 64, 64, -64, -64, -64, 64, -64, 64, -64, -64, 64, -64, 64, -64, 64, 64, -64, 64, -64, -64, 64, 64, -64, -64, 64, 64, -64, 64, 64, 64, 64, -64, 64, -64, -64, -64, 64, 64, 64, 64, -64, -64, 64, 64, 64, 64, 64, 64, 64, 64, -64, -64, -64, -64, 64, -64, 64, 64, -64, -64, -64, 64, 64, -64, 64, 64, 64, -64, -64, 64, 64, -64, 64, 64, 64, 64, 64, -64, -64, -64, 64, 64, 64, -64, 64, 64, 64, 64, 64, 64, 64, -64, -64, 64, -64, -64, -64, -64, 64, 64, 64, 64, 64, -64, -64, -64, -64, 64, 64, 64, 64, -64, 64, 64, 64, 64, -64, -64, -64, 64, -64, -64, 64, -64, -64, 64, -64, -64, 64, 64, 64, -64, -64, -64, 64, 64, 64, 64, 64, 64, 64, 64, 64, 64, -64, -64, -64, -64, -64, 64, -64, -64, -64, -64, -64, -64, 64, -64, -64, -64, -64, -64, 64, 64, 64, 64, 64, 64, -64, 64, 64, 64, 64, -64, -64, 64, -64, 64, 64, -64, -64, -64, -64, -64, 64, 64, -64, -64, -64, 64, 64, 64, 64, 64, 64, 64, 64, -64, -64, 64, 64, -64, -64, -64, -64, 64, 64, -64, -64, -64, -64, -64, -64, -64, -64, -64, 64, 64, 64, -64, 64, 64, 64, -64, 64, -64, -64, -64, -64, -64, -64, 64, 64, 64, 64, 64, -64, -64, -64, -64, -64, -64, -64, -64, -64, 64, 64, 64, 64, 64, -64, -64, 64, 64, 64, 64, -64, -64, 64, 64, 64, -64, -64, 64, -64, 64, 64, -64, -64, 64, -64, 64, 64, 64, 64, 64, 64, 64, -64, 64, -64, 64, 64, -64, -64, -64, -64, 64, -64, 64, 64, -64, -64, -64, 64, -64, 64, -64, -64, -64, -64, 64, 64, 64, 64, 64, 64, 64, 64, 64, 64, -64, -64, -64, 64, 64, -64, 64, -64, -64, -64, -64, -64, -64, 64, -64, -64, -64, -64, 64, 64, -64, -64, 64, -64, 64, 64, 64, 64, -64, -64, -64, -64, 64, 64, 64, -64, 64, -64, -64, -64, -64, 64, 64, 64, 64, 64, 64, -64, -64, -64, -64, 64, 64, 64, 64, -64, -64, 64, 64, 64, -64, 64, -64, 64, 64, 64, 64, 64, -64, 64, -64, 64, -64, -64, 64, 64, -64, 64, 64, -64, 64, 64, 64, -64, -64, -64, 64, 64, 64, 64, -64, 64, 64, -64, 64, -64, 64, 64, 64, 64, -64, 64, 64, 64, 64, 64, -64, 64, 64, -64, -64, -64, 64, 64, -64, 64, 64, -64, 64, -64, 64, -64, 64, -64, -64, 64, 64, -64, -64, 64, -64, -64, 64, 64, -64, 64, -64, -64, -64, -64, 64, 64, 64, 64, 64, 64, -64, 64, 64, 64, 64, -64, -64, 64, -64, -64, -64, -64, -64, -64, -64, 64, -64, -64, -64, -64, 64, 64, -64, 64, 64, -64, 64, 64, -64, 64, 64, 64, 64, -64, -64, 64, -64, -64, -64, 64, -64, -64, 64, 64, 64, 64, -64, 64, 64, -64, -64, -64, 64, 64, 64, -64, -64, 64, -64, -64, -64, -64, 64, 64, -64, 64, -64, 64, -64, -64, -64, 64, -64, 64, -64, -64, 64, -64, 64, 64, 64, 64, 64, -64, -64, -64, -64, 64, 64, -64, 64, -64, 64, -64, 64, -64, -64, -64, -64, 64, 64, 64, -64, -64, 64, 64, 64, 64, 64, 64, 64, 64, -64, 64, 64, 64, 64, 64, 64, 64, 64, 64, 64, 64, 64, -64, 64, -64, 64, 64, -64, 64, 64, 64, 64, 64, 64, -64, 64, 64, 64, -64, 64, -64, 64, 64, 64, 64, 64, -64, 64, 64, 64, 64, -64, 64, -64, -64, -64, -64, 64, 64, 64, 64, 64, 64, 64, 64, 64, -64, -64, -64, 64, 64, 64, 64, 64, 64, -64, -64, -64, -64, -64, 64, 64, -64, 64, 64, 64, 64, 64, 64, 64, 64, 64, -64, 64, -64, 64, 64, 64, -64, 64, 64, 64, 64, -64, 64, 64, -64, -64, -64, 64, -64, -64, 64, 64, 64, 64, 64, 64, 64, -64, 64, -64, -64, -64, 64, 64, 64, 64, -64, -64, -64, 64, 64, 64, -64, -64, -64, -64, 64, -64, 64, 64, 64, 64, 64, 64, -64, -64, 64, -64, -64, 64, 64, 64, 64, -64, -64, -64, 64, 64, 64, 64, 64, -64, -64, 64, 64, 64, 64, 64, 64, 64, 64, 64, -64, -64, -64, 64, 64, -64, 64, -64, -64, -64, 64, 64, 64, 64, 64, 64, -64, 64, -64, 64, 64, 64, 64, 64, 64, 64, 64, -64, -64, -64, -64, 64, -64, 64, 64, 64, 64, 64, 64, 64, 64, 64, 64, 64, -64, -64, 64, 64, 64, 64, 64, 64, 64, 64, -64, -64, -64, -64, -64, 64, -64, 64, -64, 64, 64, 64, 64, 64, 64, 64, -64, 64, -64, -64, -64, -64, 64, 64, 64, 64, -64, -64, -64, -64, -64, -64, -64, 64, -64, 64, -64, -64, -64, 64, 64, 64, 64, -64, -64, -64, -64, -64, 64, 64, 64, 64, 64, -64, -64, -64, 64, -64, -64, -64, 64, 64, -64, 64, -64, 64, 64, -64, 64, -64, -64, -64, -64, 64, 64, -64, 64, 64, 64, 64, 64, -64, -64, -64, -64, -64, -64, -64, -64, -64, 64, 64, 64, 64, 64, 64, -64, -64, -64, 64, 64, -64, -64, -64, -64, 64, 64, 64, 64, 64, -64, -64, -64, -64, -64, 64, 64, 64, -64, -64, -64, -64, 64, -64, 64, -64, -64, -64, -64, -64, -64, 64, 64, 64, 64, 64, 64, 64, -64, -64, 64, -64, -64, -64, -64, 64, 64, 64, -64, 64, 64, 64, 64, 64, 64, 64, -64, -64, -64, 64, 64, 64, 64, 64, 64, 64, 64, 64, -64, -64, 64, -64, -64, -64, -64, 64, -64, 64, 64, 64, 64, 64, 64, 64, -64, -64, 64, -64, 64, 64, 64, 64, -64, 64, 64, 64, -64, -64, -64, -64, -64, 64, 64, 64, -64, -64, 64, 64, 64, 64, 64, -64, -64, -64, 64, 64, -64, 64, -64, -64, -64, -64, 64, -64, -64, -64, -64, -64, 64, -64, -64, 64, 64, 64, 64, 64, 64, 64, 64, -64, -64, 64, 64, 64, -64, 64, -64, 64, 64, -64, -64, -64, -64, -64, -64, -64, 64, 64, 64, 64, -64, -64, 64, -64, 64, 64, 64, 64, -64, -64, 64, 64, 64, 64, -64, 64, 64, 64, -64, -64, 64, -64, 64, 64, 64, 64, -64, -64, 64, -64, 64, 64, 64, -64, -64, 64, 64, 64, 64, 64, 64, 64, -64, -64, 64, -64, 64, -64, 64, 64, -64, -64, -64, 64, -64, 64, -64, -64, -64, 64, -64, -64, -64, 64, -64, -64, 64, 64, 64, 64, -64, 64, 64, 64, 64, 64, -64, -64, 64, 64, -64, -64, 64, 64, -64, -64, 64, 64, -64, -64, -64, 64, 64, -64, -64, -64, -64, 64, -64, 64, 64, 64, 64, 64, 64, -64, -64, -64, 64, -64, 64, 64, -64, -64, -64, -64, 64, 64, 64, -64, -64, 64, 64, 64, 64, 64, -64, 64, 64, -64, 64, -64, -64, -64, -64, 64, 64, 64, -64, -64, -64, 64, 64, 64, -64, -64, -64, 64, -64, -64, -64, 64, 64, -64, 64, -64, -64, 64, 64, -64, 64, -64, -64, -64, 64, 64, 64, 64, -64, 64, -64, 64, -64, 64, -64, 64, 64, -64, -64, -64, -64, 64, 64, 64, -64, -64, 64, 64, 64, 64, 64, -64, -64, -64, -64, 64, -64, 64, 64, 64, 64, -64, -64, 64, 64, 64, 64, 64, 64, 64, 64, 64, 64, 64, 64, -64, -64, -64, -64, 64, 64, -64, -64, -64, 64, -64, 64, 64, 64, 64, 64, -64, 64, 64, 64, 64, 64, 64, 64, 64, -64, 64, 64, 64, -64, 64, 64, 64, -64, -64, -64, -64, -64, -64, -64, -64, -64, -64, -64, 64, 64, 64, -64, -64, -64, -64, -64, 64, 64, 64, 64, 64, 64, 64, 64, 64, 64, 64, 64, -64, 64, 64, -64, 64, -64, 64, -64, -64, -64, 64, 64, -64, -64, -64, 64, 64, 64, -64, -64, 64, 64, 64, 64, 64, 64, 64, -64, 64, -64, -64, -64, -64, 64, 64, -64, -64, -64, -64, 64, -64, -64, 64, -64, 64, -64, 64, -64, 64, -64, 64, 64, -64, 64, 64, -64, -64, -64, -64, -64, -64, -64, -64, -64, -64, -64, -64, -64, 64, 64, 64, 64, 64, -64, -64, 64, -64, -64, 64, 64, 64, -64, 64, 64, 64, 64, -64, 64, -64, 64, -64, -64, -64, -64, -64, -64, 64, -64, -64, 64, -64, -64, 64, -64, -64, 64, 64, 64, 64, 64, -64, 64, 64, 64, 64, 64, -64, -64, 64, -64, -64, 64, 64, 64, 64, -64, -64, -64, -64, 64, -64, -64, 64, 64, 64, 64, 64, -64, -64, 64, -64, 64, 64, -64, -64, -64, 64, 64, 64, 64, 64, -64, 64, 64, 64, 64, -64, -64, 64, -64, 64, 64, 64, 64, 64, -64, 64, 64, 64, -64, -64, 64, -64, 64, 64, 64, 64, 64, -64, 64, 64, 64, -64, 64, -64, -64, 64, 64, 64, 64, 64, 64, 64, 64, -64, 64, 64, 64, -64, -64, 64, 64, 64, 64, 64, 64, 64, 64, 64, 64, 64, -64, -64, -64, -64, 64, 64, 64, 64, 64, -64, 64, -64, 64, 64, 64, 64, -64, -64, 64, -64, 64, 64, 64, 64, 64, 64, 64, -64, 64, 64, -64, 64, 64, 64, 64, -64, 64, -64, -64, 64, 64, 64, 64, 64, -64, -64, 64, 64, 64, 64, 64, 64, 64, 64, -64, 64, -64, -64, -64, 64, 64, 64, -64, -64, -64, 64, 64, 64, -64, -64, 64, -64, 64, 64, 64, 64, 64, 64, 64, -64, 64, 64, 64, -64, 64, 64, 64, 64, 64, 64, 64, 64, 64, -64, 64, 64, 64, 64, -64, -64, 64, 64, 64, -64, 64, 64, 64, -64, -64, -64, 64, 64, 64, -64, -64, 64, 64, 64, 64, 64, -64, -64, 64, -64, 64, 64, 64, -64, -64, -64, -64, -64, 64, -64, -64, -64, -64, 64, 64, 64, 64, 64, 64, -64, 64, 64, 64, -64, -64, -64, 64, 64, -64, -64, 64, 64, 64, 64, 64, -64, -64, -64, -64, -64, -64, 64, 64, 64, 64, 64, 64, 64, 64, 64, 64, 64, 64, 64, -64, -64, 64, 64, 64, 64, 64, 64, 64, 64, -64, -64, 64, 64, -64, 64, 64, 64, 64, 64, 64, 64, 64, 64, 64, -64, 64, -64, -64, 64, 64, -64, 64, 64, -64, -64, 64, 64, 64, 64, -64, 64, 64, 64, 64, 64, 64, 64, 64, 64, -64, -64, -64, -64, -64, -64, 64, 64, 64, -64, 64, -64, -64, -64, -64, 64, 64, 64, 64, -64, 64, 64, 64, 64, -64, 64, -64, -64, -64, -64, -64, -64, 64, -64, -64, 64, 64, -64, -64, -64, -64, 64, 64, 64, 64, -64, -64, 64, 64, -64, -64, -64, -64, -64, -64, -64, -64, -64, -64, -64, -64, -64, -64, -64, -64, 64, -64, 64, 64, 64, -64, 64, -64, 64, -64, -64, -64, -64, -64, -64, -64, -64, -64, -64, -64, -64, -64, 64, -64, 64, 64, -64, 64, 64, 64, 64, 64, 64, 64, 64, 64, 64, 64, 64, -64, 64, -64, -64, -64, -64, -64, -64, -64, -64, -64, 64, 64, 64, 64, -64, -64, -64, -64, 64, -64, 64, -64, 64, 64, 64, 64, 64, 64, -64, -64, -64, -64, 64, -64, 64, -64, -64, 64, -64, -64, -64, -64, 64, -64, -64, 64, -64, 64, -64, -64, -64, 64, -64, 64, 64, 64, 64, 64, -64, 64, 64, 64, 64, 64, -64, -64, -64, 64, 64, 64, -64, 64, 64, 64, -64, -64, 64, -64, 64, -64, -64, 64, -64, 64, -64, -64, -64, 64, 64, 64, 64, 64, 64, 64, -64, 64, 64, 64, -64, 64, -64, 64, 64, -64, -64, 64, -64, 64, -64, -64, 64, 64, -64, -64, 64, -64, -64, -64, 64, -64, 64, -64, -64, -64, -64, -64, 64, 64, -64, -64, 64, -64, 64, 64, -64, 64, 64, 64, 64, 64, 64, -64, 64, -64, -64, 64, -64, 64, -64, 64, 64, -64, 64, 64, 64, -64, -64, -64, 64, 64, -64, 64, -64, 64, -64, 64, 64, -64, 64, 64, 64, -64, -64, 64, -64, 64, 64, -64, -64, 64, 64, 64, -64, 64, 64, -64, -64, -64, 64, -64, -64, -64, -64, -64, 64, -64, -64, 64, -64, 64, -64, -64, -64, -64, 64, -64, -64, 64, 64, 64, -64, -64, 64, 64, -64, -64, -64, -64, -64, -64, 64, 64, -64, 64, -64, -64, -64, 64, -64, -64, -64, 64, -64, 64, 64, 64, 64, 64, -64, 64, -64, 64, 64, 64, 64, -64, 64, -64, -64, 64, -64, -64, 64, 64, 64, -64, 64, 64, 64, 64, 64, -64, 64, -64, -64, -64, 64, -64, 64, 64, -64, 64, 64, -64, 64, 64, 64, -64, -64, 64, 64, 64, 64, 64, 64, 64, 64, -64, 64, 64, 64, 64, -64, -64, -64, -64, -64, 64, 64, -64, 64, 64, 64, -64, -64, 64, 64, -64, 64, 64, 64, 64, 64, 64, -64, 64, 64, 64, 64, 64, 64, -64, 64, -64, 64, -64, 64, 64, -64, -64, 64, 64, 64, 64, 64, -64, -64, 64, -64, 64, 64, 64, 64, -64, -64, 64, -64, 64, -64, 64, -64, 64, 64, 64, -64, 64, -64, 64, 64, 64, 64, 64, 64, 64, 64, -64, 64, 64, 64, -64, -64, 64, 64, -64, -64, -64, -64, -64, -64, -64, 64, 64, 64, -64, -64, 64, 64, 64, 64, -64, 64, 64, 64, 64, 64, -64, 64, 64, -64, -64, 64, -64, -64, 64, 64, 64, 64, 64, 64, -64, 64, 64, -64, 64, -64, 64, 64, 64, 64, 64, 64, 64, 64, -64, 64, -64, 64, -64, -64, 64, 64, 64, -64, -64, -64, 64, -64, -64, 64, 64, -64, -64, 64, 64, -64, 64, -64, 64, 64, 64, 64, 64, 64, -64, -64, -64, 64, -64, 64, -64, 64, -64, 64, -64, 64, 64, -64, 64, 64, -64, 64, 64, -64, -64, 64, -64, 64, 64, -64, 64, 64, -64, -64, 64, 64, 64, -64, 64, 64, -64, 64, -64, 64, 64, 64, 64, -64, 64, 64, 64, 64, 64, 64, 64, -64, 64, -64, 64, 64, -64, 64, 64, 64, -64, 64, 64, 64, -64, -64, -64, 64, -64, -64, -64, -64, -64, -64, 64, -64, 64, 64, -64, 64, 64, 64, -64, -64, 64, 64, 64, 64, 64, 64, 64, -64, 64, 64, 64, -64, -64, -64, -64, -64, -64, 64, 64, -64, 64, 64, 64, 64, 64, 64, 64, -64, 64, 64, -64, 64, 64, -64, -64, 64, -64, 64, 64, -64, -64, -64, -64, 64, -64, -64, 64, 64, 64, 64, 64, -64, 64, 64, 64, 64, 64, -64, -64, 64, 64, -64, -64, -64, 64, -64, -64, -64, 64, 64, 64, 64, 64, 64, -64, 64, 64, 64, 64, 64, 64, 64, 64, 64, -64, -64, 64, -64, 64, -64, 64, -64, -64, 64, 64, 64, -64, 64, 64, 64, 64, 64, 64, 64, 64, -64, 64, 64, 64, 64, 64, 64, 64, 64, 64, -64, 64, -64, -64, -64, 64, -64, -64, 64, 64, -64, 64, 64, 64, 64, 64, -64, 64, 64, 64, 64, 64, 64, 64, 64, 64, 64, -64, 64, -64, 64, 64, 64, -64, 64, 64, -64, 64, -64, -64, 64, -64, -64, 64, 64, 64, -64, -64, 64, 64, 64, 64, -64, 64, 64, -64, 64, 64, 64, -64, -64, -64, -64, 64, -64, -64, 64, -64, 64, 64, 64, -64, 64, 64, 64, -64, 64, 64, -64, 64, -64, 64, 64, -64, 64, 64, 64, 64, 64, 64, 64, 64, 64, 64, 64, 64, 64, 64, 64, -64, -64, 64, 64, -64, 64, 64, 64, 64, 64, -64, 64, -64, -64, 64, 64, 64, -64, 64, -64, 64, 64, -64, -64, 64, -64, 64, 64, 64, 64, 64, 64, 64, -64, 64, 64, 64, 64, 64, 64, 64, -64, -64, -64, -64, 64, -64, 64, 64, 64, -64, 64, -64, -64, 64, 64, -64, -64, 64, 64, 64, -64, 64, -64, 64, -64, 64, 64, 64, -64, 64, -64, 64, 64, -64, 64, 64, 64, 64, -64, 64, -64, 64, -64, 64, 64, 64, -64, 64, 64, 64, 64, -64, -64, -64, -64, -64, -64, -64, -64, 64, -64, -64, 64, 64, -64, 64, -64, -64, 64, -64, 64, 64, 64, -64, -64, 64, -64, 64, -64, -64, -64, 64, 64, 64, -64, -64, -64, 64, -64, 64, -64, -64, 64, 64, 64, 64, -64, -64, 64, 64, -64, -64, -64, 64, 64, -64, -64, 64, 64, -64, 64, 64, -64, -64, 64, 64, -64, -64, -64, 64, 64, -64, 64, -64, -64, 64, -64, -64, 64, 64, -64, 64, 64, -64, 64, -64, 64, -64, 64, 64, 64, 64, -64, -64, 64, -64, -64, 64, 64, 64, -64, -64, 64, 64, -64, -64, -64, 64, 64, -64, 64, 64, -64, 64, -64, 64, -64, 64, 64, -64, 64, -64, -64, -64, 64, 64, 64, 64, -64, 64, -64, 64, -64, -64, -64, -64, -64, -64, -64, 64, 64, 64, 64, 64, 64, -64, 64, 64, -64, -64, -64, 64, -64, 64, 64, -64, 64, -64, -64, -64, -64, -64, -64, -64, -64, -64, -64, -64, 64, 64, -64, 64, 64, 64, 64, 64, -64, 64, -64, 64, 64, 64, 64, -64, 64, -64, -64, -64, -64, -64, -64, -64, -64, -64, -64, -64, -64, -64, -64, -64, 64, 64, 64, 64, 64, -64, 64, 64, 64, -64, 64, 64, 64, -64, -64, -64, -64, -64, 64, 64, -64, -64, -64, 64, 64, -64, 64, -64, 64, 64, 64, 64, -64, -64, 64, -64, -64, 64, -64, 64, -64, -64, -64, -64, -64, -64, 64, 64, 64, 64, 64, 64, 64, 64, 64, 64, 64, -64, 64, -64, -64, -64, -64, -64, 64, 64, -64, 64, -64, -64, -64, -64, 64, 64, 64, 64, 64, 64, 64, 64, 64, -64, -64, 64, 64, 64, 64, -64, -64, -64, -64, 64, -64, 64, 64, -64, -64, -64, -64, 64, 64, 64, 64, 64, -64, 64, 64, 64, 64, -64, -64, -64, -64, -64, -64, 64, -64, -64, -64, -64, -64, -64, 64, -64, -64, 64, -64, 64, 64, 64, 64, -64, -64, -64, -64, 64, -64, -64, 64, -64, -64, 64, 64, -64, -64, 64, 64, -64, 64, 64, -64, 64, 64, 64, 64, 64, 64, 64, 64, 64, -64, -64, -64, -64, -64, -64, 64, 64, 64, 64, 64, 64, 64, -64, -64, 64, -64, -64, 64, -64, -64, 64, 64, 64, 64, 64, -64, 64, -64, -64, -64, -64, -64, -64, 64, 64, 64, 64, 64, 64, 64, -64, 64, -64, -64, -64, -64, -64, 64, 64, 64, 64, 64, 64, 64, 64, -64, -64, -64, -64, -64, 64, 64, 64, 64, -64, 64, 64, 64, 64, 64, 64, 64, -64, -64, -64, 64, 64, 64, 64, 64, 64, 64, 64, 64, 64, -64, 64, 64, 64, 64, 64, 64, 64, 64, 64, 64, -64, 64, 64, -64, -64, -64, 64, 64, 64, 64, 64, 64, 64, 64, 64, 64, -64, -64, 64, -64, 64, 64, 64, -64, 64, 64, -64, -64, -64, -64, -64, 64, -64, -64, -64, -64, 64, 64, 64, 64, 64, 64, 64, 64, 64, 64, 64, -64, 64, 64, 64, 64, -64, 64, -64, -64, -64, 64, -64, -64, 64, -64, -64, -64, -64, 64, 64, 64, 64, 64, 64, 64, -64, 64, -64, -64, -64, 64, 64, 64, -64, -64, -64, 64, 64, -64, 64, 64, 64, -64, -64, -64, -64, -64, 64, 64, 64, 64, 64, 64, 64, 64, -64, -64, -64, -64, 64, 64, -64, -64, 64, 64, 64, 64, -64, 64, 64, -64, 64, -64, -64, -64, -64, -64, 64, -64, 64, 64, -64, -64, -64, -64, -64, -64, -64, -64, -64, -64, -64, -64, 64, -64, -64, -64, 64, -64, -64, -64, -64, -64, -64, -64, -64, -64, -64, -64, 64, 64, -64, -64, -64, -64, -64, -64, -64, -64, 64, 64, -64, 64, -64, 64, -64, 64, -64, -64, 64, -64, -64, -64, 64, -64, -64, -64, -64, -64, -64, -64, -64, -64, -64, -64, -64, 64, -64, 64, -64, 64, -64, 64, -64, 64, 64, 64, 64, -64, -64, 64, -64, -64, -64, -64, -64, -64, -64, -64, 64, -64, -64, -64, 64, -64, -64, -64, -64, 64, -64, 64, 64, -64, -64, 64, 64, 64, -64, 64, 64, -64, -64, -64, -64, -64, 64, 64, 64, 64, -64, 64, 64, 64, -64, -64, -64, 64, 64, -64, -64, -64, 64, 64, 64, 64, -64, -64, -64, 64, 64, 64, 64, 64, 64, 64, 64, 64, 64, 64, 64, 64, -64, -64, 64, -64, 64, -64, -64, -64, 64, -64, 64, 64, -64, -64, 64, 64, 64, 64, 64, 64, 64, 64, 64, 64, -64, -64, 64, 64, -64, 64, -64, -64, 64, -64, -64, -64, 64, 64, -64, -64, -64, 64, 64, 64, 64, -64, 64, 64, 64, 64, 64, 64, 64, 64, -64, -64, -64, 64, -64, 64, 64, 64, -64, 64, 64, -64, 64, 64, -64, -64, -64, -64, 64, 64, -64, 64, 64, -64, -64, -64, 64, 64, 64, -64, -64, -64, 64, -64, -64, -64, -64, 64, -64, 64, 64, 64, -64, 64, 64, 64, -64, 64, -64, -64, 64, -64, 64, -64, -64, -64, -64, -64, -64, -64, 64, -64, 64, 64, -64, 64, -64, 64, 64, -64, -64, -64, 64, 64, 64, 64, 64, 64, 64, 64, -64, 64, 64, -64, -64, 64, 64, -64, -64, -64, 64, -64, -64, -64, -64, 64, 64, 64, -64, 64, 64, 64, 64, 64, -64, 64, 64, -64, -64, 64, 64, -64, -64, 64, 64, 64, -64, 64, -64, -64, -64, -64, -64, 64, 64, 64, -64, -64, 64, 64, 64, 64, 64, 64, 64, 64, -64, 64, 64, 64, 64, 64, -64, 64, 64, -64, 64, 64, 64, -64, 64, 64, -64, -64, 64, 64, 64, 64, 64, 64, -64, 64, 64, 64, -64, 64, 64, 64, 64, 64, 64, -64, -64, -64, 64, 64, 64, -64, 64, 64, 64, -64, -64, 64, 64, 64, -64, -64, 64, -64, 64, -64, -64, -64, 64, 64, 64, -64, -64, -64, -64, -64, 64, 64, -64, -64, 64, 64, -64, -64, -64, -64, 64, 64, 64, 64, -64, -64, -64, -64, -64, -64, 64, 64, -64, 64, -64, -64, -64, 64, -64, 64, -64, 64, 64, 64, -64, -64, -64, -64, -64, 64, 64, 64, 64, 64, -64, -64, -64, -64, 64, 64, 64, -64, -64, 64, -64, -64, 64, 64, -64, -64, 64, 64, 64, 64, -64, -64, 64, 64, 64, 64, 64, 64, -64, -64, -64, 64, 64, 64, -64, 64, 64, 64, -64, -64, -64, 64, -64, -64, 64, 64, 64, -64, -64, -64, 64, 64, 64, 64, 64, -64, -64, 64, -64, 64, 64, 64, 64, 64, 64, 64, 64, -64, -64, 64, 64, 64, 64, 64, -64, -64, -64, -64, -64, 64, 64, 64, 64, -64, -64, -64, -64, 64, -64, 64, 64, -64, 64, -64, -64, -64, -64, -64, -64, 64, -64, -64, -64, -64, -64, 64, -64, 64, 64, 64, 64, -64, -64, -64, 64, 64, 64, -64, -64, 64, 64, -64, -64, 64, -64, 64, 64, 64, -64, -64, -64, -64, -64, -64, 64, 64, 64, -64, -64, -64, -64, -64, -64, -64, 64, -64, -64, 64, -64, -64, -64, 64, 64, 64, 64, 64, -64, -64, 64, 64, -64, -64, -64, 64, -64, -64, -64, -64, -64, -64, -64, -64, -64, -64, -64, 64, -64, 64, -64, -64, 64, -64, 64, 64, -64, -64, 64, 64, 64, -64, 64, 64, -64, -64, -64, -64, -64, -64, -64, -64, -64, -64, 64, 64, 64, 64, 64, -64, -64, 64, -64, 64, -64, -64, 64, 64, 64, 64, 64, 64, -64, -64, -64, -64, -64, -64, 64, 64, 64, 64, 64, -64, 64, 64, 64, -64, 64, 64, -64, 64, 64, -64, 64, 64, 64, 64, 64, 64, -64, -64, -64, 64, -64, -64, -64, 64, 64, -64, 64, 64, 64, 64, 64, -64, 64, -64, -64, 64, 64, -64, 64, 64, 64, 64, 64, 64, -64, -64, -64, -64, -64, -64, 64, 64, 64, 64, 64, -64, 64, 64, 64, -64, 64, -64, 64, 64, -64, 64, 64, 64, 64, 64, 64, -64, -64, -64, -64, 64, -64, 64, 64, 64, 64, 64, 64, 64, 64, 64, 64, 64, 64, 64, -64, -64, 64, 64, 64, 64, 64, -64, -64, 64, 64, 64, 64, 64, 64, 64, 64, 64, 64, 64, -64, -64, 64, 64, 64, -64, 64, 64, 64, -64, 64, -64, 64, 64, 64, 64, -64, 64, 64, 64, 64, 64, 64, 64, -64, 64, -64, 64, -64, -64, -64, -64, -64, -64, -64, -64, 64, -64, -64, 64, 64, 64, -64, -64, -64, -64, -64, -64, 64, 64, 64, -64, -64, 64, -64, -64, -64, -64, -64, 64, 64, 64, -64, 64, -64, 64, 64, 64, 64, -64, -64, -64, -64, -64, -64, 64, -64, -64, -64, -64, -64, -64, -64, -64, -64, -64, 64, 64, 64, -64, 64, -64, -64, -64, -64, 64, 64, -64, -64, -64, -64, -64, -64, -64, 64, 64, 64, 64, -64, -64, -64, -64, -64, 64, -64, 64, -64, -64, 64, -64, 64, -64, 64, 64, 64, -64, -64, -64, -64, -64, 64, 64, 64, 64, -64, -64, -64, -64, -64, -64, -64, -64, 64, 64, -64, -64, 64, -64, 64, 64, 64, -64, -64, -64, -64, -64, -64, 64, 64, -64, 64, -64, -64, 64, 64, -64, -64, -64, 64, 64, 64, -64, 64, 64, -64, 64, -64, 64, 64, 64, -64, -64, -64, -64, -64, -64, 64, 64, 64, -64, -64, 64, 64, -64, -64, -64, 64, 64, 64, 64, -64, 64, 64, -64, -64, -64, -64, 64, -64, -64, -64, -64, 64, 64, 64, 64, 64, 64, 64, -64, 64, -64, 64, 64, -64, 64, 64, -64, -64, 64, 64, 64, -64, 64, -64, 64, 64, -64, 64, 64, -64, 64, 64, 64, -64, 64, -64, -64, 64, -64, -64, 64, -64, -64, -64, -64, 64, -64, 64, -64, 64, -64, 64, 64, -64, -64, -64, 64, 64, -64, 64, -64, -64, -64, 64, 64, -64, -64, 64, 64, -64, -64, 64, 64, 64, 64, -64, 64, -64, 64, -64, 64, -64, -64, 64, -64, 64, -64, 64, 64, 64, -64, -64, -64, -64, -64, -64, 64, -64, -64, 64, 64, -64, 64, 64, 64, -64, 64, 64, 64, -64, 64, 64, -64, -64, 64, 64, 64, 64, -64, 64, -64, -64, -64, 64, -64, 64, 64, -64, 64, 64, -64, -64, -64, 64, -64, -64, 64, -64, 64, -64, 64, 64, 64, -64, 64, -64, -64, 64, 64, 64, 64, -64, 64, 64, 64, 64, 64, -64, 64, 64, 64, 64, 64, -64, 64, -64, -64, 64, 64, -64, -64, -64, 64, 64, -64, -64, -64, 64, -64, 64, 64, -64, -64, 64, -64, -64, 64, -64, -64, 64, -64, 64, -64, -64, 64, -64, -64, -64, -64, -64, 64, -64, 64, 64, 64, 64, 64, 64, 64, -64, -64, 64, 64, 64, -64, 64, 64, -64, -64, 64, 64, -64, -64, -64, -64, 64, -64, 64, 64, -64, 64, -64, 64, 64, 64, 64, 64, 64, -64, 64, -64, 64, 64, 64, 64, -64, 64, 64, 64, -64, -64, -64, -64, -64, -64, 64, 64, -64, -64, 64, 64, -64, 64, -64, 64, 64, 64, -64, -64, 64, 64, 64, -64, 64, 64, 64, 64, -64, -64, -64, -64, -64, 64, 64, -64, 64, 64, 64, -64, 64, -64, -64, 64, 64, -64, -64, 64, 64, -64, 64, -64, -64, -64, 64, 64, 64, -64, -64, 64, 64, 64, 64, 64, 64, 64, 64, 64, -64, -64, 64, 64, 64, 64, 64, 64, 64, 64, 64, 64, 64, -64, 64, 64, 64, -64, -64, 64, 64, 64, 64, 64, 64, 64, 64, 64, 64, -64, -64, 64, -64, 64, 64, 64, 64, 64, 64, 64, -64, -64, -64, -64, 64, 64, 64, 64, 64, 64, 64, 64, 64, 64, 64, 64, 64, 64, 64, 64, 64, 64, -64, -64, -64, 64, -64, -64, -64, -64, -64, 64, -64, 64, 64, 64, 64, 64, 64, 64, 64, 64, 64, 64, 64, -64, -64, 64, -64, -64, -64, -64, 64, 64, -64, 64, 64, -64, 64, -64, -64, 64, -64, 64, 64, 64, 64, 64, 64, 64, 64, 64, 64, 64, 64, 64, -64, -64, -64, -64, -64, -64, -64, 64, 64, 64, -64, 64, 64, 64, 64, 64, 64, 64, 64, 64, 64, 64, 64, 64, 64, 64, 64, 64, 64, -64, -64, -64, -64, -64, -64, -64, 64, -64, 64, 64, 64, 64, -64, 64, 64, 64, -64, 64, 64, 64, 64, 64, 64, 64, 64, 64, 64, -64, -64, -64, -64, -64, -64, 64, 64, 64, -64, 64, -64, 64, -64, 64, 64, 64, -64, -64, 64, 64, 64, 64, 64, 64, 64, 64, 64, -64, 64, -64, -64, -64, -64, -64, -64, 64, 64, -64, 64, -64, -64, 64, 64, -64, -64, 64, -64, 64, 64, 64, 64, 64, 64, 64, 64, 64, 64, 64, -64, -64, 64, -64, -64, -64, -64, 64, 64, 64, -64, -64, 64, -64, -64, -64, -64, -64, 64, 64, -64, 64, 64, 64, 64, -64, -64, -64, -64, -64, -64, -64, -64, -64, 64, 64, 64, 64, 64, 64, 64, -64, -64, -64, -64, -64, -64, -64, 64, 64, 64, -64, -64, -64, 64, -64, -64, -64, 64, 64, -64, 64, 64, 64, 64, 64, 64, 64, -64, -64, -64, -64, -64, -64, -64, -64, -64, 64, 64, -64, -64, -64, 64, -64, 64, -64, -64, 64, 64, -64, 64, 64, 64, 64, 64, 64, -64, -64, -64, -64, -64, -64, -64, -64, -64, -64, 64, -64, -64, -64, -64, 64, -64, -64, 64, -64, -64, 64, -64, 64, 64, 64, 64, 64, -64, -64, -64, -64, -64, -64, -64, -64, -64, -64, 64, -64, -64, -64, -64, -64, 64, 64, -64, 64, -64, -64, 64, 64, 64, 64, 64, 64, 64, 64, 64, 64, 64, -64, -64, -64, -64, -64, -64, 64, -64, -64, -64, -64, -64, 64, 64, -64, 64, 64, -64, -64, 64, -64, 64, 64, 64, -64, -64, 64, 64, 64, -64, -64, -64, -64, 64, 64, 64, -64, 64, -64, -64, -64, 64, 64, 64, -64, -64, -64, -64, -64, -64, -64, 64, 64, -64, 64, 64, -64, 64, 64, 64, -64, -64, 64, 64, -64, -64, -64, -64, -64, 64, 64, -64, 64, 64, 64, -64, 64, 64, -64, 64, -64, -64, -64, 64, 64, -64, -64, 64, 64, 64, 64, -64, 64, -64, 64, 64, -64, -64, 64, -64, -64, -64, -64, 64, 64, -64, 64, 64, -64, -64, 64, 64, 64, -64, 64, 64, -64, -64, -64, 64, 64, 64, 64, 64, -64, 64, 64, 64, -64, 64, 64, -64, -64, -64, -64, -64, 64, -64, 64, 64, -64, -64, 64, 64, 64, 64, 64, 64, 64, -64, -64, -64, 64, -64, -64, 64, -64, -64, -64, 64, -64, 64, 64, 64, 64, 64, 64, 64, 64, -64, 64, 64, 64, 64, -64, 64, 64, -64, -64, 64, 64, 64, 64, -64, -64, 64, 64, -64, -64, 64, -64, 64, 64, 64, 64, -64, -64, 64, -64, 64, 64, 64, -64, 64, 64, 64, 64, 64, 64, -64, 64, 64, 64, -64, -64, 64, 64, -64, -64, -64, -64, 64, 64, 64, 64, -64, 64, -64, 64, 64, 64, 64, 64, 64, -64, 64, -64, 64, -64, -64, -64, -64, 64, 64, -64, 64, -64, -64, -64, 64, 64, -64, 64, 64, 64, 64, 64, -64, 64, 64, -64, 64, -64, 64, 64, 64, 64, 64, -64, 64, -64, 64, 64, 64, -64, -64, 64, -64, -64, -64, 64, 64, 64, -64, 64, -64, -64, -64, -64, 64, 64, 64, 64, -64, 64, -64, -64, -64, -64, 64, 64, 64, 64, 64, 64, 64, 64, -64, 64, 64, 64, 64, 64, 64, 64, 64, 64, 64, 64, 64, 64, 64, -64, 64, -64, 64, -64, 64, -64, 64, 64, 64, 64, 64, 64, 64, 64, 64, 64, 64, -64, 64, 64, 64, 64, 64, 64, 64, 64, -64, -64, -64, -64, 64, 64, 64, 64, -64, 64, 64, 64, 64, 64, 64, 64, 64, 64, 64, 64, 64, 64, 64, 64, 64, 64, 64, 64, 64, 64, -64, 64, 64, -64, 64, 64, 64, -64, -64, 64, 64, -64, 64, 64, 64, 64, 64, -64, 64, -64, 64, -64, 64, 64, -64, 64, 64, 64, 64, -64, -64, -64, 64, -64, -64, 64, 64, 64, 64, -64, 64, 64, 64, 64, 64, -64, -64, -64, -64, -64, 64, 64, 64, -64, 64, 64, -64, -64, -64, -64, -64, -64, 64, -64, -64, 64, -64, 64, 64, 64, -64, 64, 64, -64, -64, -64, 64, -64, 64, 64, 64, -64, 64, 64, -64, 64, -64, 64, -64, -64, 64, -64, 64, 64, -64, 64, 64, 64, 64, -64, -64, -64, -64, -64, -64, -64, 64, -64, 64, 64, -64, -64, -64, -64, -64, 64, -64, -64, 64, 64, -64, 64, 64, 64, 64, 64, 64, -64, -64, -64, 64, -64, -64, -64, -64, -64, 64, 64, -64, -64, 64, -64, -64, 64, -64, 64, -64, 64, 64, 64, 64, 64, 64, -64, -64, -64, -64, -64, -64, -64, 64, 64, 64, 64, -64, -64, 64, 64, 64, 64, -64, 64, -64, -64, 64, 64, 64, 64, 64, 64, 64, -64, -64, -64, -64, 64, -64, -64, -64, 64, 64, 64, 64, 64, -64, 64, -64, 64, -64, 64, 64, 64, 64, 64, 64, 64, 64, 64, 64, 64, 64, -64, -64, 64, -64, -64, 64, 64, -64, -64, 64, 64, 64, -64, 64, -64, -64, 64, 64, 64, 64, 64, 64, 64, 64, -64, -64, 64, 64, 64, 64, 64, -64, 64, 64, 64, 64, 64, 64, -64, 64, -64, 64, 64, 64, -64, 64, -64, 64, 64, 64, 64, 64, 64, 64, 64, 64, 64, 64, -64, 64, 64, 64, 64, 64, 64, 64, 64, 64, -64, 64, 64, -64, -64, -64, 64, 64, -64, 64, 64, -64, -64, 64, 64, 64, 64, 64, 64, 64, 64, 64, 64, 64, 64, 64, -64, -64, 64, 64, -64, -64, -64, 64, 64, 64, 64, 64, 64, -64, 64, 64, 64, 64, 64, 64, 64, 64, 64, 64, 64, 64, 64, 64, 64, 64, 64, -64, -64, 64, -64, -64, -64, 64, 64, 64, -64, -64, 64, 64, 64, 64, 64, 64, 64, -64, 64, 64, 64, 64, 64, 64, 64, 64, 64, 64, -64, -64, 64, 64, 64, 64, 64, 64, 64, -64, 64, -64, -64, -64, 64, -64, -64, -64, 64, 64, 64, 64, 64, 64, -64, 64, -64, 64, -64, 64, -64, -64, -64, -64, -64, -64, -64, 64, 64, -64, -64, 64, -64, -64, -64, 64, -64, 64, 64, -64, 64, -64, -64, -64, -64, 64, -64, -64, -64, -64, -64, -64, -64, -64, -64, -64, 64, 64, 64, -64, -64, 64, 64, -64, -64, 64, 64, 64, 64, 64, 64, -64, -64, -64, 64, -64, -64, -64, 64, -64, -64, 64, -64, -64, 64, 64, 64, 64, -64, 64, 64, 64, -64, -64, -64, 64, -64, 64, -64, 64, -64, -64, 64, -64, 64, -64, -64, -64, 64, -64, 64, 64, -64, -64, 64, -64, -64, -64, -64, 64, 64, 64, -64, 64, -64, 64, -64, 64, -64, -64, 64, 64, -64, -64, 64, -64, -64, 64, -64, 64, 64, 64, -64, 64, 64, 64, 64, 64, -64, 64, 64, 64, -64, 64, 64, 64, -64, -64, -64, 64, 64, -64, 64, 64, -64, 64, 64, 64, -64, 64, 64, 64, 64, 64, -64, -64, 64, 64, 64, -64, -64, -64, -64, 64, -64, -64, 64, -64, 64, -64, -64, -64, -64, -64, 64, 64, -64, 64, -64, -64, 64, 64, 64, -64, 64, -64, 64, -64, 64, 64, 64, 64, -64, 64, -64, -64, -64, -64, -64, -64, -64, -64, -64, -64, 64, -64, 64, 64, 64, 64, -64, 64, 64, -64, -64, 64, 64, 64, 64, 64, 64, 64, 64, 64, 64, 64, 64, 64, 64, -64, -64, 64, 64, 64, 64, -64, 64, 64, -64, 64, -64, -64, 64, 64, 64, 64, -64, -64, 64, -64, -64, -64, -64, 64, 64, 64, -64, -64, -64, 64, -64, 64, 64, 64, 64, -64, -64, 64, 64, 64, -64, 64, 64, -64, -64, 64, -64, 64, 64, 64, -64, -64, 64, 64, -64, -64, 64, 64, -64, -64, -64, 64, 64, 64, 64, 64, 64, 64, 64, 64, -64, -64, 64, -64, 64, 64, 64, -64, -64, 64, 64, 64, 64, 64, 64, 64, -64, 64, 64, 64, 64, 64, 64, 64, 64, 64, 64, 64, 64, 64, -64, 64, -64, 64, -64, 64, 64, 64, 64, 64, 64, -64, 64, -64, 64, 64, 64, 64, 64, 64, 64, 64, 64, 64, 64, 64, 64, -64, -64, 64, -64, -64, -64, 64, -64, -64, 64, 64, 64, -64, 64, -64, 64, 64, 64, 64, -64, -64, 64, -64, 64, 64, 64, 64, 64, -64, -64, -64, -64, -64, 64, 64, -64, -64, -64, -64, -64, -64, -64, -64, -64, -64, 64, 64, -64, -64, -64, -64, 64, 64, -64, 64, -64, -64, 64, 64, 64, -64, 64, -64, -64, -64, -64, -64, -64, -64, 64, -64, -64, -64, -64, -64, -64, -64, -64, -64, -64, -64, -64, 64, -64, -64, -64, 64, 64, -64, 64, -64, -64, -64, 64, -64, -64, -64, -64, -64, -64, -64, -64, -64, -64, -64, -64, -64, -64, -64, -64, -64, 64, 64, -64, 64, 64, 64, -64, -64, -64, -64, -64, -64, -64, 64, -64, -64, -64, -64, -64, -64, -64, -64, -64, -64, -64, -64, -64, -64, -64, 64, -64, 64, 64, -64, 64, -64, -64, -64, -64, -64, -64, -64, -64, -64, -64, -64, 64, 64, -64, -64, -64, -64, -64, 64, -64, -64, -64, -64, 64, -64, -64, 64, -64, -64, -64, -64, -64, -64, -64, -64, -64, -64, -64, -64, -64, -64, -64, -64, -64, -64, -64, -64, 64, -64, 64, -64, 64, 64, -64, 64, 64, -64, 64, -64, -64, -64, 64, 64, 64, -64, -64, -64, -64, -64, -64, -64, -64, -64, -64, -64, 64, 64, 64, 64, -64, -64, -64, -64, 64, -64, 64, -64, -64, 64, -64, -64, -64, -64, -64, -64, -64, -64, -64, -64, -64, 64, -64, -64, -64, 64, -64, -64, 64, -64, 64, -64, 64, -64, -64, -64, 64, -64, -64, -64, -64, -64, -64, -64, -64, -64, -64, -64, 64, 64, 64, -64, -64, -64, 64, -64, 64, 64, 64, 64, 64, -64, 64, 64, 64, -64, -64, -64, 64, 64, 64, -64, -64, -64, -64, 64, 64, 64, 64, -64, -64, -64, -64, -64, 64, -64, -64, 64, 64, 64, 64, -64, -64, 64, -64, 64, -64, 64, -64, 64, -64, -64, -64, -64, 64, 64, -64, -64, 64, -64, -64, -64, -64, 64, -64, -64, 64, 64, 64, -64, 64, 64, 64, 64, 64, 64, -64, 64, 64, -64, -64, 64, 64, 64, -64, -64, 64, -64, -64, -64, 64, 64, 64, 64, -64, -64, 64, -64, 64, 64, 64, 64, 64, 64, 64, 64, 64, -64, 64, 64, -64, 64, -64, -64, -64, -64, 64, -64, -64, 64, 64, 64, 64, 64, 64, 64, 64, 64, 64, -64, -64, -64, 64, 64, 64, 64, 64, 64, 64, 64, -64, -64, -64, 64, 64, 64, -64, -64, -64, -64, 64, 64, 64, 64, 64, 64, 64, -64, 64, 64, 64, 64, 64, 64, 64, 64, -64, 64, 64, -64, -64, 64, 64, -64, 64, -64, -64, 64, -64, 64, 64, 64, -64, -64, -64, 64, -64, 64, 64, 64, 64, 64, 64, 64, 64, -64, 64, 64, 64, 64, 64, 64, -64, 64, -64, 64, -64, 64, 64, -64, 64, 64, 64, 64, 64, -64, -64, -64, -64, 64, 64, 64, 64, 64, -64, -64, 64, 64, -64, 64, 64, -64, -64, 64, -64, 64, -64, 64, -64, 64, -64, -64, 64, -64, -64, -64, -64, -64, 64, 64, -64, 64, 64, -64, 64, -64, -64, -64, 64, 64, 64, 64, 64, 64, -64, 64, 64, 64, -64, 64, 64, -64, 64, 64, -64, -64, -64, -64, -64, -64, 64, 64, 64, 64, -64, -64, 64, 64, 64, -64, -64, 64, 64, -64, -64, 64, 64, 64, 64, -64, 64, 64, -64, 64, -64, -64, 64, 64, 64, 64, 64, 64, -64, 64, -64, 64, -64, -64, 64, -64, 64, -64, -64, -64, 64, -64, -64, 64, 64, -64, -64, 64, -64, -64, -64, -64, -64, 64, -64, -64, -64, -64, 64, -64, -64, -64, -64, -64, 64, -64, -64, 64, -64, 64, -64, -64, 64, 64, 64, 64, 64, 64, -64, -64, 64, -64, -64, -64, 64, -64, -64, -64, -64, 64, 64, 64, 64, 64, -64, 64, -64, -64, -64, -64, 64, 64, 64, 64, -64, -64, -64, -64, 64, -64, 64, -64, 64, -64, 64, -64, 64, 64, -64, 64, 64, 64, -64, -64, 64, -64, -64, -64, 64, 64, 64, -64, 64, -64, 64, -64, 64, 64, 64, -64, -64, -64, -64, -64, -64, -64, -64, -64, -64, -64, 64, 64, -64, -64, 64, 64, -64, 64, -64, -64, 64, -64, 64, -64, 64, 64, -64, 64, 64, -64, -64, 64, -64, -64, -64, -64, -64, -64, -64, -64, -64, 64, -64, -64, 64, -64, -64, -64, -64, -64, 64, -64, -64, 64, -64, -64, -64, -64, 64, -64, 64, -64, -64, -64, 64, -64, 64, 64, -64, -64, -64, -64, -64, 64, 64, -64, -64, -64, -64, 64, 64, -64, 64, 64, 64, 64, 64, 64, 64, 64, -64, -64, 64, 64, -64, -64, -64, -64, 64, 64, -64, 64, 64, 64, -64, 64, -64, -64, 64, 64, -64, -64, 64, -64, -64, -64, -64, -64, -64, 64, 64, -64, -64, -64, -64, -64, 64, -64, -64, -64, -64, -64, 64, -64, 64, 64, 64, 64, 64, -64, 64, 64, 64, -64, 64, -64, -64, 64, -64, 64, 64, -64, -64, 64, 64, 64, 64, -64, 64, -64, -64, -64, -64, -64, 64, -64, -64, -64, 64, -64, -64, -64, 64, -64, -64, 64, -64, 64, -64, 64, -64, 64, -64, 64, -64, 64, 64, 64, -64, 64, -64, 64, -64, -64, -64, -64, -64, 64, -64, 64, -64, 64, 64, 64, 64, -64, 64, 64, -64, -64, 64, -64, -64, 64, -64, 64, -64, -64, -64, 64, -64, -64, 64, -64, 64, -64, 64, 64, 64, 64, -64, 64, -64, 64, 64, -64, 64, 64, 64, -64, -64, -64, 64, 64, -64, -64, -64, -64, -64, -64, -64, 64, -64, 64, 64, -64, 64, -64, 64, -64, -64, 64, 64, 64, -64, -64, 64, -64, -64, -64, -64, 64, -64, -64, -64, 64, -64, -64, -64, 64, 64, 64, 64, 64, -64, 64, -64, 64, 64, -64, -64, -64, -64, -64, -64, -64, -64, -64, -64, -64, -64, -64, 64, -64, -64, 64, -64, 64, 64, 64, 64, 64, -64, 64, -64, 64, -64, -64, 64, -64, -64, 64, 64, -64, -64, -64, -64, 64, 64, -64, -64, -64, -64, -64, 64, -64, 64, 64, -64, 64, -64, -64, -64, -64, 64, -64, 64, -64, -64, -64, -64, -64, -64, -64, -64, -64, -64, 64, -64, -64, 64, -64, -64, -64, 64, -64, 64, -64, 64, 64, -64, -64, 64, -64, -64, -64, -64, -64, -64, 64, 64, -64, 64, 64, -64, 64, -64, 64, 64, -64, -64, 64, -64, -64, 64, 64, -64, 64, -64, 64, 64, -64, -64, -64, -64, -64, -64, 64, -64, -64, -64, -64, 64, 64, -64, -64, -64, -64, 64, -64, -64, 64, 64, -64, 64, 64, 64, -64, 64, -64, 64, -64, -64, -64, -64, 64, -64, 64, -64, -64, -64, -64, -64, 64, -64, -64, -64, -64, 64, 64, -64, -64, 64, -64, -64, -64, 64, -64, 64, -64, -64, -64, -64, -64, -64, -64, 64, 64, 64, -64, 64, 64, 64, 64, -64, 64, 64, 64, 64, -64, -64, 64, -64, 64, 64, -64, 64, -64, 64, -64, -64, 64, -64, -64, 64, -64, -64, -64, -64, 64, -64, 64, 64, 64, -64, -64, 64, -64, -64, -64, -64, -64, 64, -64, -64, 64, 64, -64, -64, 64, 64, -64, 64, -64, -64, 64, 64, -64, -64, -64, 64, 64, 64, 64, 64, -64, 64, 64, -64, -64, -64, -64, -64, -64, 64, -64, -64, -64, 64, -64, -64, 64, 64, 64, 64, 64, 64, -64, 64, -64, -64, 64, -64, -64, -64, -64, 64, -64, -64, -64, -64, 64, 64, 64, -64, 64, 64, -64, 64, -64, 64, 64, 64, -64, -64, -64, -64, -64, 64, 64, -64, -64, 64, 64, 64, 64, -64, -64, 64, 64, 64, 64, 64, 64, -64, -64, 64, -64, -64, -64, -64, -64, -64, -64, -64, 64, 64, 64, -64, -64, 64, -64, 64, 64, -64, -64, 64, -64, -64, 64, 64, 64, 64, 64, 64, 64, -64, -64, 64, 64, 64, -64, -64, 64, -64, -64, -64, 64, -64, -64, 64, -64, 64, -64, 64, 64, -64, -64, -64, 64, -64, -64, -64, 64, 64, 64, 64, -64, 64, 64, 64, 64, 64, 64, -64, 64, 64, -64, -64, 64, 64, 64, 64, -64, -64, -64, 64, -64, 64, 64, 64, 64, -64, -64, 64, 64, 64, -64, -64, 64, -64, 64, 64, 64, -64, 64, -64, -64, -64, 64, -64, 64, 64, -64, -64, 64, 64, 64, 64, -64, -64, -64, -64, -64, -64, -64, 64, 64, 64, 64, 64, 64, -64, -64, 64, -64, -64, -64, 64, 64, -64, 64, -64, 64, 64, 64, 64, -64, 64, -64, -64, 64, -64, -64, 64, 64, 64, -64, 64, -64, -64, 64, -64, 64, 64, 64, 64, 64, -64, -64, 64, 64, 64, 64, -64, -64, -64, -64, 64, -64, -64, -64, 64, 64, -64, -64, -64, -64, 64, -64, -64, 64, 64, 64, -64, -64, -64, 64, -64, 64, -64, 64, -64, -64, -64, -64, 64, -64, -64, -64, -64, -64, -64, 64, -64, -64, 64, -64, 64, -64, 64, -64, -64, -64, -64, 64, -64, -64, -64, 64, -64, 64, 64, -64, 64, -64, -64, -64, -64, -64, -64, -64, 64, -64, -64, 64, 64, -64, -64, 64, 64, 64, 64, -64, -64, 64, -64, 64, 64, -64, -64, -64, -64, -64, 64, -64, -64, -64, -64, -64, 64, 64, 64, -64, 64, 64, 64, -64, 64, 64, -64, -64, 64, 64, -64, -64, 64, 64, -64, -64, 64, 64, -64, 64, -64, -64, -64, 64, -64, -64, 64, 64, 64, 64, -64, 64, -64, -64, -64, -64, -64, 64, -64, -64, 64, -64, 64, -64, -64, 64, 64, -64, -64, -64, -64, -64, -64, -64, -64, -64, 64, 64, 64, 64, 64, -64, -64, -64, -64, 64, 64, -64, 64, -64, -64, -64, 64, 64, -64, -64, 64, -64, 64, 64, 64, 64, -64, 64, 64, -64, 64, -64, -64, -64, -64, -64, -64, -64, -64, -64, -64, 64, -64, -64, -64, 64, 64, 64, -64, -64, -64, -64, -64, 64, 64, 64, 64, 64, 64, 64, -64, 64, 64, 64, -64, -64, -64, -64, -64, 64, -64, 64, -64, 64, 64, -64, -64, 64, 64, -64, -64, -64, 64, -64, -64, 64, 64, -64, -64, 64, -64, 64, -64, 64, -64, -64, 64, 64, 64, -64, -64, -64, 64, 64, 64, -64, 64, 64, 64, 64, -64, -64, 64, -64, -64, -64, -64, -64, -64, -64, -64, -64, 64, -64, -64, -64, -64, 64, -64, -64, -64, -64, -64, -64, -64, -64, 64, -64, 64, -64, 64, 64, 64, -64, -64, 64, 64, 64, -64, 64, -64, -64, 64, 64, 64, -64, -64, -64, -64, 64, -64, -64, -64, -64, 64, -64, 64, 64, -64, 64, 64, 64, -64, 64, -64, -64, -64, 64, -64, -64, 64, -64, 64, -64, 64, -64, -64, -64, 64, -64, -64, -64, 64, 64, -64, 64, 64, 64, 64, -64, -64, -64, 64, -64, -64, 64, -64, -64, -64, -64, 64, 64, 64, -64, -64, 64, 64, 64, -64, -64, -64, 64, -64, 64, 64, 64, 64, 64, -64, -64, -64, -64, -64, 64, -64, -64, -64, -64, 64, -64, -64, 64, 64, -64, 64, 64, 64, 64, 64, -64, 64, -64, -64, 64, 64, 64, -64, 64, -64, -64, -64, -64, 64, -64, -64, -64, -64, -64, 64, 64, 64, -64, -64, 64, 64, 64, -64, 64, 64, 64, 64, 64, -64, 64, 64, 64, -64, -64, -64, 64, -64, -64, 64, -64, -64, -64, 64, 64, -64, -64, -64, 64, 64, 64, -64, -64, -64, 64, 64, -64, 64, 64, -64, -64, -64, -64, -64, -64, -64, 64, -64, -64, -64, -64, -64, 64, 64, -64, -64, -64, 64, -64, -64, -64, 64, 64, 64, 64, 64, 64, -64, 64, 64, -64, -64, -64, -64, -64, -64, -64, 64, 64, 64, -64, -64, -64, 64, 64, 64, -64, 64, -64, 64, 64, 64, 64, -64, 64, -64, -64, 64, -64, -64, 64, -64, 64, -64, -64, -64, -64, -64, -64, 64, -64, 64, -64, -64, 64, -64, 64, 64, 64, -64, 64, -64, -64, 64, -64, 64, 64, 64, -64, 64, 64, 64, 64, 64, -64, -64, 64, -64, -64, -64, 64, -64, 64, 64, -64, 64, -64, -64, -64, -64, -64, 64, -64, -64, 64, -64, -64, 64, 64, 64, -64, -64, -64, -64, 64, -64, 64, -64, 64, -64, 64, 64, 64, -64, 64, 64, -64, -64, -64, -64, 64, 64, 64, -64, -64, -64, -64, 64, -64, -64, -64, 64, 64, 64, -64, -64, 64, 64, -64, -64, -64, 64, -64, 64, -64, -64, -64, -64, 64, 64, 64, -64, 64, -64, -64, 64, 64, -64, 64, 64, 64, -64, 64, -64, -64, 64, -64, 64, -64, -64, 64, -64, -64, -64, -64, 64, 64, -64, 64, -64, -64, 64, 64, 64, -64, 64, 64, 64, -64, -64, 64, 64, -64, 64, -64, -64, -64, -64, -64, -64, -64, -64, 64, -64, 64, 64, -64, 64, -64, 64, 64, 64, 64, -64, 64, -64, 64, -64, -64, 64, -64, -64, 64, 64, -64, -64, 64, 64, -64, 64, 64, -64, 64, -64, 64, -64, 64, 64, 64, 64, 64, 64, -64, 64, 64, 64, 64, 64, -64, 64, -64, -64, -64, -64, 64, 64, -64, 64, 64, -64, -64, 64, -64, 64, 64, -64, -64, -64, -64, 64, -64, 64, 64, -64, 64, -64, -64, 64, -64, 64, -64, 64, -64, 64, 64, 64, -64, -64, 64, 64, 64, 64, 64, 64, 64, 64, 64, 64, 64, -64, 64, 64, 64, -64, 64, 64, -64, -64, -64, -64, 64, 64, 64, -64, -64, -64, -64, 64, -64, -64, -64, -64, 64, 64, -64, 64, 64, 64, 64, -64, 64, 64, -64, 64, 64, 64, 64, -64, 64, 64, 64, -64, -64, -64, 64, -64, -64, -64, -64, -64, 64, -64, 64, 64, 64, 64, -64, 64, 64, -64, -64, -64, 64, -64, 64, 64, -64, 64, -64, 64, -64, -64, -64, 64, 64, -64, 64, 64, -64, 64, 64, -64, 64, 64, 64, 64, -64, -64, 64, -64, 64, -64, 64, 64, 64, -64, -64, -64, 64, 64, -64, 64, -64, -64, 64, -64, 64, -64, 64, -64, 64, 64, 64, 64, 64, -64, -64, -64, -64, 64, -64, 64, -64, 64, 64, 64, 64, 64, 64, 64, 64, 64, 64, 64, 64, 64, 64, -64, -64, -64, -64, 64, 64, 64, 64, 64, 64, -64, 64, -64, -64, -64, -64, 64, 64, 64, -64, 64, 64, -64, 64, 64, 64, 64, 64, -64, 64, 64, 64, 64, 64, 64, 64, -64, -64, -64, -64, 64, -64, 64, 64, 64, 64, 64, 64, 64, 64, -64, 64, -64, 64, 64, 64, -64, 64, 64, -64, -64, -64, 64, -64, 64, -64, 64, -64, 64, -64, 64, 64, -64, -64, 64, 64, 64, -64, 64, 64, -64, -64, -64, 64, 64, -64, 64, 64, 64, -64, 64, -64, -64, -64, -64, -64, 64, -64, 64, -64, -64, 64, 64, 64, 64, 64, 64, 64, 64, -64, 64, -64, -64, 64, 64, -64, 64, -64, 64, 64, -64, 64, -64, -64, 64, -64, 64, 64, 64, 64, 64, -64, 64, 64, 64, 64, 64, 64, 64, -64, 64, 64, -64, -64, 64, 64, 64, -64, -64, -64, 64, -64, 64, -64, 64, 64, -64, -64, 64, -64, 64, 64, -64, 64, 64, 64, 64, 64, 64, 64, 64, -64, -64, 64, 64, 64, 64, 64, 64, -64, 64, -64, 64, -64, 64, -64, -64, 64, 64, 64, 64, 64, 64, -64, -64, -64, 64, 64, 64, 64, 64, 64, 64, 64, 64, -64, 64, 64, 64, 64, -64, 64, 64, 64, -64, 64, -64, 64, 64, 64, 64, 64, 64, 64, 64, 64, 64, 64, -64, -64, 64, 64, -64, -64, 64, -64, -64, -64, 64, 64, 64, 64, 64, 64, 64, 64, 64, -64, 64, -64, -64, 64, 64, 64, 64, 64, -64, -64, -64, 64, -64, -64, -64, -64, -64, 64, 64, -64, 64, -64, 64, 64, 64, 64, 64, -64, -64, -64, -64, 64, 64, 64, 64, -64, 64, -64, 64, -64, -64, -64, 64, -64, -64, 64, 64, 64, -64, -64, 64, 64, -64, 64, 64, 64, 64, -64, -64, -64, 64, 64, 64, 64, 64, -64, 64, -64, -64, -64, 64, -64, 64, 64, 64, -64, -64, -64, 64, 64, -64, 64, 64, 64, -64, -64, 64, -64, 64, 64, 64, 64, 64, 64, 64, 64, -64, -64, -64, -64, 64, 64, 64, -64, -64, -64, 64, -64, 64, -64, -64, 64, 64, 64, -64, -64, -64, 64, 64, 64, -64, 64, 64, 64, -64, -64, -64, 64, -64, -64, -64, 64, 64, -64, -64, -64, 64, 64, 64, 64, 64, -64, 64, -64, -64, -64, 64, 64, 64, 64, 64, 64, 64, 64, 64, -64, -64, 64, 64, -64, 64, 64, -64, 64, 64, -64, 64, 64, 64, 64, -64, -64, 64, 64, 64, -64, -64, 64, -64, -64, 64, 64, -64, -64, -64, -64, 64, 64, 64, 64, -64, -64, 64, 64, -64, 64, 64, 64, 64, -64, 64, -64, 64, 64, -64, 64, -64, -64, -64, -64, -64, 64, 64, -64, 64, 64, -64, 64, -64, -64, 64, -64, -64, 64, -64, 64, 64, 64, -64, 64, 64, 64, -64, -64, -64, 64, -64, 64, -64, 64, 64, 64, -64, -64, 64, -64, -64, 64, 64, 64, -64, 64, 64, 64, 64, 64, -64, 64, 64, -64, -64, 64, 64, -64, -64, -64, -64, -64, -64, -64, -64, 64, 64, -64, 64, 64, -64, 64, -64, -64, -64, -64, -64, -64, 64, 64, -64, -64, 64, -64, -64, -64, 64, -64, -64, 64, -64, 64, 64, -64, -64, -64, 64, 64, 64, 64, 64, 64, 64, -64, 64, 64, 64, -64, -64, 64, -64, -64, 64, 64, -64, 64, -64, -64, -64, -64, -64, 64, 64, 64, 64, 64, 64, 64, -64, 64, -64, 64, -64, -64, -64, -64, 64, -64, -64, -64, -64, -64, 64, -64, 64, -64, -64, 64, -64, 64, 64, 64, -64, -64, 64, 64, 64, 64, 64, 64, -64, -64, 64, 64, -64, -64, -64, 64, -64, -64, -64, -64, 64, 64, -64, 64, 64, -64, 64, -64, -64, 64, 64, 64, 64, 64, 64, 64, 64, -64, -64, 64, 64, 64, 64, 64, -64, -64, -64, -64, -64, -64, -64, -64, 64, 64, 64, 64, 64, 64, 64, 64, 64, -64, -64, -64, 64, 64, -64, 64, -64, 64, 64, 64, 64, -64, -64, -64, -64, 64, -64, 64, 64, -64, 64, 64, -64, -64, -64, 64, -64, -64, -64, 64, 64, 64, 64, 64, 64, 64, 64, 64, -64, -64, -64, -64, -64, 64, -64, 64, 64, -64, -64, 64, 64, -64, 64, 64, -64, -64, 64, 64, -64, 64, 64, -64, -64, 64, -64, -64, -64, -64, -64, -64, -64, -64, 64, -64, -64, -64, 64, 64, 64, 64, 64, -64, -64, 64, 64, 64, 64, 64, 64, -64, -64, -64, -64, -64, -64, -64, -64, -64, -64, 64, 64, -64, -64, 64, 64, 64, 64, 64, 64, 64, 64, 64, 64, 64, 64, -64, -64, -64, -64, -64, -64, -64, -64, -64, -64, -64, -64, -64, -64, -64, 64, -64, 64, 64, 64, 64, -64, -64, -64, 64, 64, 64, -64, -64, -64, 64, -64, -64, -64, -64, -64, -64, -64, -64, 64, -64, -64, -64, -64, 64, 64, 64, -64, -64, -64, -64, -64, -64, -64, 64, -64, 64, 64, 64, 64, 64, 64, 64, 64, 64, 64, 64, 64, 64, -64, 64, 64, 64, -64, 64, 64, -64, -64, -64, -64, -64, -64, 64, -64, 64, 64, 64, 64, 64, 64, 64, 64, 64, -64, 64, -64, -64, -64, -64, -64, 64, -64, 64, 64, -64, -64, -64, -64, -64, -64, -64, 64, 64, 64, 64, 64, 64, 64, 64, 64, 64, 64, 64, -64, 64, -64, 64, 64, 64, 64, -64, -64, 64, -64, -64, -64, -64, -64, -64, 64, 64, 64, 64, 64, 64, 64, 64, 64, 64, 64, 64, 64, -64, 64, 64, 64, 64, -64, -64, -64, 64, -64, -64, -64, -64, -64, -64, -64, -64, -64, 64, 64, 64, 64, 64, -64, 64, 64, 64, 64, -64, 64, -64, -64, -64, -64, -64, 64, -64, 64, -64, -64, -64, -64, -64, -64, -64, -64, 64, 64, 64, 64, 64, 64, -64, 64, -64, 64, 64, 64, -64, 64, 64, 64, -64, -64, -64, -64, -64, -64, -64, -64, -64, -64, -64, 64, 64, 64, 64, 64, 64, 64, 64, 64, 64, 64, 64, 64, 64, 64, -64, 64, 64, 64, 64, -64, -64, -64, -64, -64, -64, 64, -64, -64, -64, 64, 64, 64, 64, 64, 64, 64, -64, 64, -64, -64, 64, -64, 64, 64, 64, 64, 64, 64, -64, -64, -64, 64, 64, 64, -64, -64, -64, -64, 64, 64, 64, 64, -64, -64, 64, 64, 64, -64, -64, 64, 64, 64, -64, 64, -64, -64, -64, -64, 64, 64, 64, 64, 64, -64, -64, 64, 64, 64, -64, -64, -64, -64, -64, 64, -64, -64, -64, 64, 64, -64, 64, 64, 64, 64, 64, 64, 64, 64, 64, 64, 64, 64, -64, 64, -64, 64, 64, 64, -64, -64, -64, -64, -64, 64, 64, 64, 64, 64, 64, 64, 64, -64, 64, -64, 64, 64, 64, -64, -64, -64, 64, 64, -64, -64, 64, 64, -64, 64, -64, -64, 64, -64, -64, -64, 64, 64, 64, 64, 64, -64, -64, 64, 64, -64, -64, -64, -64, 64, 64, -64, -64, -64, 64, -64, 64, -64, -64, 64, 64, -64, 64, 64, -64, -64, -64, -64, 64, -64, 64, 64, -64, -64, 64, -64, -64, 64, -64, -64, -64, -64, -64, -64, -64, -64, -64, -64, 64, 64, 64, -64, -64, 64, -64, -64, 64, -64, 64, 64, -64, 64, 64, 64, 64, 64, -64, 64, 64, 64, -64, 64, -64, -64, 64, -64, 64, 64, -64, -64, 64, 64, -64, 64, -64, 64, 64, 64, -64, 64, -64, 64, -64, -64, -64, 64, -64, 64, -64, -64, -64, 64, 64, -64, -64, -64, 64, 64, -64, 64, 64, -64, 64, -64, 64, -64, -64, 64, -64, 64, -64, 64, -64, 64, -64, -64, 64, 64, -64, 64, 64, -64, -64, -64, 64, -64, -64, -64, -64, 64, 64, -64, -64, -64, -64, 64, -64, 64, 64, -64, -64, 64, -64, -64, -64, 64, -64, -64, 64, 64, 64, -64, -64, -64, 64, -64, -64, 64, 64, -64, -64, -64, -64, -64, 64, -64, -64, 64, 64, 64, 64, -64, -64, -64, -64, -64, -64, -64, 64, 64, 64, 64, 64, 64, -64, -64, -64, -64, 64, -64, 64, 64, 64, 64, 64, 64, 64, -64, 64, 64, 64, 64, 64, 64, 64, -64, -64, 64, 64, 64, -64, 64, -64, 64, -64, -64, -64, -64, 64, 64, 64, -64, 64, -64, 64, -64, -64, -64, 64, 64, 64, 64, 64, 64, -64, -64, -64, -64, 64, 64, -64, -64, 64, 64, 64, 64, 64, 64, -64, 64, -64, -64, -64, -64, 64, 64, 64, 64, 64, 64, 64, -64, -64, 64, 64, 64, 64, 64, 64, 64, 64, 64, 64, 64, 64, 64, -64, -64, -64, 64, -64, 64, -64, -64, -64, -64, 64, 64, 64, -64, -64, -64, -64, -64, -64, -64, 64, 64, -64, 64, 64, 64, 64, -64, -64, -64, -64, -64, 64, 64, 64, -64, -64, 64, 64, 64, 64, 64, -64, 64, 64, -64, -64, 64, 64, 64, 64, 64, 64, -64, 64, -64, -64, -64, -64, -64, 64, 64, 64, -64, 64, 64, 64, 64, 64, -64, -64, -64, 64, 64, 64, 64, 64, 64, 64, 64, 64, 64, -64, -64, -64, -64, -64, 64, 64, 64, -64, 64, 64, -64, 64, -64, -64, -64, 64, -64, -64, 64, 64, 64, 64, 64, 64, -64, 64, 64, 64, -64, -64, -64, -64, 64, 64, -64, 64, 64, -64, -64, -64, -64, -64, -64, 64, -64, 64, 64, 64, 64, 64, 64, 64, 64, 64, -64, -64, -64, -64, -64, -64, 64, -64, -64, -64, -64, -64, -64, -64, 64, -64, -64, -64, 64, -64, 64, -64, 64, 64, -64, 64, 64, -64, 64, -64, -64, -64, -64, -64, -64, -64, -64, -64, -64, -64, 64, 64, 64, 64, -64, 64, 64, -64, 64, -64, 64, 64, 64, 64, 64, -64, -64, -64, -64, -64, -64, -64, 64, 64, -64, -64, -64, -64, -64, 64, 64, -64, -64, -64, 64, 64, 64, -64, 64, 64, 64, 64, 64, -64, -64, -64, -64, -64, -64, -64, 64, 64, -64, 64, 64, 64, 64, 64, 64, -64, -64, 64, -64, -64, -64, -64, 64, 64, 64, 64, -64, -64, -64, -64, 64, 64, -64, 64, -64, 64, 64, 64, -64, -64, 64, 64, 64, -64, -64, 64, -64, 64, 64, -64, -64, 64, 64, 64, 64, -64, -64, -64, -64, -64, -64, 64, 64, 64, -64, 64, -64, -64, 64, 64, 64, 64, -64, 64, 64, 64, 64, 64, 64, 64, 64, 64, 64, 64, -64, -64, -64, -64, -64, 64, -64, 64, 64, 64, -64, 64, 64, 64, 64, 64, 64, 64, -64, -64, 64, -64, 64, -64, -64, -64, -64, 64, -64, -64, -64, -64, 64, 64, 64, 64, 64, 64, -64, 64, 64, 64, 64, 64, 64, -64, -64, -64, -64, -64, -64, -64, -64, -64, -64, 64, -64, 64, 64, 64, 64, -64, 64, 64, -64, -64, -64, -64, -64, 64, 64, 64, 64, 64, 64, 64, 64, -64, -64, -64, -64, -64, -64, -64, -64, -64, 64, 64, 64, 64, 64, 64, 64, -64, -64, -64, -64, 64, 64, -64, 64, -64, -64, -64, -64, -64, -64, -64, -64, -64, -64, 64, 64, 64, -64, 64, 64, 64, 64, -64, -64, -64, -64, -64, -64, 64, 64, 64, -64, -64, -64, -64, -64, -64, -64, -64, -64, -64, -64, -64, -64, -64, -64, -64, -64, -64, 64, -64, -64, -64, 64, -64, -64, 64, 64, 64, -64, -64, 64, -64, -64, -64, 64, 64, 64, 64, 64, 64, -64, -64, -64, -64, -64, -64, -64, 64, 64, 64, -64, -64, -64, -64, -64, -64, -64, -64, 64, -64, 64, 64, 64, 64, 64, -64, -64, -64, -64, 64, 64, 64, 64, 64, -64, -64, 64, -64, -64, 64, -64, -64, 64, -64, 64, 64, 64, -64, 64, -64, -64, 64, 64, 64, -64, -64, -64, 64, -64, -64, -64, 64, -64, 64, 64, -64, -64, 64, 64, -64, 64, -64, 64, 64, 64, 64, -64, 64, -64, 64, -64, 64, 64, -64, -64, 64, -64, -64, 64, 64, -64, -64, 64, 64, 64, -64, -64, -64, 64, 64, 64, 64, 64, -64, -64, 64, 64, 64, 64, 64, -64, -64, 64, 64, -64, 64, 64, -64, 64, 64, 64, 64, 64, 64, -64, -64, 64, 64, 64, -64, -64, -64, -64, 64, 64, -64, -64, 64, 64, -64, 64, -64, 64, 64, 64, -64, -64, 64, -64, 64, 64, -64, -64, 64, -64, -64, 64, 64, 64, -64, 64, 64, 64, 64, 64, 64, 64, -64, 64, -64, 64, 64, 64, -64, -64, -64, -64, 64, -64, 64, 64, -64, 64, -64, 64, 64, 64, -64, -64, -64, -64, -64, -64, 64, -64, 64, 64, -64, 64, 64, 64, 64, -64, 64, 64, 64, 64, 64, 64, -64, 64, 64, -64, 64, -64, 64, -64, -64, -64, 64, -64, 64, -64, 64, 64, -64, 64, 64, 64, 64, 64, -64, 64, -64, 64, 64, 64, 64, 64, 64, 64, -64, -64, 64, 64, 64, 64, 64, 64, 64, 64, 64, 64, 64, 64, 64, 64, 64, -64, -64, -64, 64, 64, -64, 64, -64, -64, 64, -64, 64, 64, -64, 64, -64, 64, 64, 64, 64, 64, 64, 64, -64, 64, 64, 64, 64, 64, 64, 64, 64, -64, -64, -64, -64, 64, -64, 64, 64, -64, -64, -64, 64, 64, 64, -64, -64, 64, 64, 64, 64, 64, 64, 64, -64, 64, -64, 64, -64, -64, -64, 64, -64, -64, -64, -64, 64, -64, -64, 64, -64, 64, 64, 64, 64, 64, 64, 64, -64, 64, -64, -64, 64, 64, 64, 64, 64, -64, -64, -64, -64, -64, 64, -64, 64, -64, -64, -64, 64, 64, 64, 64, 64, 64, -64, -64, -64, -64, -64, -64, -64, -64, 64, 64, 64, -64, 64, 64, 64, -64, -64, 64, 64, -64, 64, -64, 64, 64, 64, 64, -64, -64, -64, -64, -64, -64, -64, -64, 64, 64, 64, 64, -64, -64, 64, 64, -64, -64, 64, -64, 64, 64, 64, -64, 64, 64, 64, -64, 64, 64, -64, -64, -64, -64, -64, -64, -64, 64, 64, 64, 64, 64, 64, 64, -64, -64, 64, 64, 64, 64, 64, -64, 64, 64, 64, -64, -64, -64, -64, -64, -64, -64, -64, 64, 64, -64, 64, 64, 64, 64, -64, -64, -64, -64, -64, -64, -64, -64, -64, 64, 64, 64, 64, -64, -64, -64, -64, -64, 64, 64, 64, 64, 64, 64, 64, 64, 64, 64, -64, -64, -64, -64, -64, 64, 64, -64, -64, 64, -64, 64, -64, -64, -64, -64, -64, -64, 64, 64, -64, 64, -64, 64, 64, 64, 64, 64, -64, -64, -64, -64, -64, 64, 64, -64, -64, -64, -64, 64, 64, -64, -64, -64, -64, -64, -64, 64, -64, -64, -64, 64, 64, 64, 64, 64, 64, 64, -64, -64, -64, -64, -64, -64, 64, -64, 64, 64, 64, -64, -64, -64, -64, -64, 64, -64, -64, -64, -64, -64, -64, 64, 64, 64, -64, -64, -64, 64, 64, -64, 64, 64, 64, 64, 64, 64, 64, -64, -64, 64, -64, 64, -64, -64, -64, -64, -64, -64, -64, 64, 64, 64, 64, 64, 64, 64, -64, -64, -64, -64, -64, 64, 64, 64, 64, 64, 64, 64, -64, 64, -64, 64, -64, -64, -64, -64, -64, -64, 64, 64, 64, 64, 64, -64, -64, -64, 64, 64, -64, 64, 64, 64, 64, 64, 64, 64, 64, 64, 64, -64, -64, -64, -64, 64, 64, 64, 64, 64, 64, -64, 64, 64, -64, -64, -64, 64, 64, 64, 64, 64, 64, 64, 64, 64, 64, 64, 64, 64, 64, 64, -64, -64, 64, 64, 64, 64, 64, 64, 64, -64, 64, 64, -64, 64, -64, 64, 64, 64, 64, 64, 64, 64, 64, 64, 64, 64, -64, 64, 64, 64, -64, 64, 64, 64, 64, 64, -64, -64, 64, 64, -64, -64, 64, -64, 64, 64, 64, 64, 64, 64, 64, 64, 64, 64, 64, 64, 64, 64, 64, 64, -64, -64, 64, -64, -64, -64, 64, 64, -64, 64, 64, 64, -64, 64, 64, 64, -64, 64, 64, 64, -64, -64, 64, 64, -64, 64, -64, -64, -64, -64, -64, -64, -64, -64, -64, 64, 64, -64, -64, 64, 64, 64, 64, 64, -64, -64, -64, -64, 64, 64, 64, 64, -64, -64, -64, -64, -64, 64, -64, -64, -64, -64, 64, 64, 64, -64, -64, -64, 64, 64, 64, 64, 64, -64, -64, -64, 64, -64, -64, -64, 64, -64, 64, -64, -64, -64, 64, 64, 64, 64, -64, 64, 64, -64, 64, 64, -64, -64, -64, -64, -64, -64, -64, -64, 64, 64, -64, -64, -64, -64, -64, -64, -64, 64, -64, -64, 64, 64, 64, 64, 64, -64, 64, 64, 64, 64, -64, -64, -64, -64, -64, 64, 64, 64, -64, 64, 64, 64, -64, -64, -64, -64, 64, -64, -64, -64, -64, -64, 64, -64, -64, 64, 64, 64, -64, -64, -64, 64, -64, 64, -64, -64, 64, 64, -64, -64, 64, -64, 64, 64, 64, 64, -64, 64, 64, -64, -64, 64, -64, 64, -64, -64, 64, 64, 64, -64, 64, 64, 64, -64, -64, 64, 64, -64, 64, -64, 64, -64, -64, 64, -64, 64, -64, -64, 64, -64, 64, -64, -64, 64, 64, -64, -64, -64, -64, 64, 64, -64, 64, -64, 64, -64, 64, -64, 64, -64, -64, -64, -64, -64, 64, -64, 64, -64, -64, 64, 64, -64, 64, 64, 64, 64, -64, -64, 64, -64, -64, -64, -64, -64, -64, 64, 64, 64, -64, -64, -64, -64, -64, -64, 64, -64, 64, -64, -64, 64, -64, 64, -64, -64, -64, -64, -64, -64, -64, -64, 64, -64, -64, -64, 64, 64, 64, 64, 64, 64, -64, 64, -64, 64, 64, 64, -64, -64, -64, 64, -64, -64, -64, -64, -64, -64, -64, 64, 64, 64, -64, 64, 64, -64, 64, -64, -64, 64, 64, 64, -64, 64, 64, 64, 64, -64, -64, -64, -64, -64, -64, -64, -64, 64, 64, 64, 64, 64, -64, 64, -64, 64, -64, 64, -64, -64, 64, 64, 64, -64, -64, 64, -64, -64, -64, -64, -64, -64, -64, -64, -64, 64, -64, 64, 64, -64, -64, -64, -64, -64, -64, 64, -64, 64, 64, 64, 64, 64, -64, 64, -64, -64, -64, -64, -64, -64, -64, -64, 64, 64, 64, 64, 64, 64, 64, -64, -64, -64, -64, 64, 64, 64, 64, 64, 64, 64, -64, 64, -64, -64, -64, -64, -64, 64, -64, 64, 64, 64, 64, -64, -64, 64, -64, 64, 64, 64, 64, 64, 64, 64, 64, 64, 64, -64, -64, 64, -64, -64, -64, -64, -64, -64, 64, 64, 64, 64, 64, -64, -64, -64, 64, 64, -64, 64, -64, -64, 64, 64, 64, 64, -64, -64, -64, -64, -64, -64, -64, -64, 64, -64, 64, 64, 64, 64, 64, -64, -64, -64, -64, 64, 64, 64, 64, 64, 64, 64, 64, 64, 64, -64, 64, 64, -64, -64, -64, -64, 64, -64, -64, 64, 64, 64, 64, -64, -64, -64, -64, -64, -64, -64, -64, 64, 64, 64, 64, 64, -64, 64, 64, -64, 64, -64, 64, -64, -64, -64, -64, 64, 64, 64, 64, 64, -64, -64, 64, -64, -64, -64, -64, 64, 64, 64, -64, 64, -64, -64, -64, -64, -64, -64, -64, -64, -64, -64, -64, 64, 64, 64, 64, 64, 64, -64, -64, -64, 64, -64, -64, -64, -64, -64, -64, -64, 64, 64, -64, 64, -64, 64, -64, -64, -64, -64, -64, 64, 64, -64, -64, 64, 64, -64, -64, 64, 64, 64, -64, -64, 64, 64, -64, -64, -64, 64, 64, 64, -64, -64, 64, -64, -64, -64, 64, -64, 64, -64, -64, 64, -64, -64, -64, -64, 64, 64, -64, -64, -64, 64, 64, -64, -64, -64, -64, 64, -64, -64, -64, 64, -64, -64, -64, -64, -64, -64, 64, -64, -64, -64, -64, -64, -64, -64, -64, -64, -64, 64, -64, -64, -64, -64, 64, 64, -64, -64, 64, -64, -64, -64, 64, -64, -64, -64, -64, 64, 64, -64, -64, -64, -64, -64, -64, -64, -64, -64, -64, -64, -64, 64, 64, -64, -64, -64, -64, 64, -64, 64, 64, 64, 64, -64, 64, -64, -64, -64, -64, -64, -64, -64, -64, -64, -64, -64, -64, 64, 64, 64, -64, 64, -64, -64, 64, 64, 64, -64, 64, -64, -64, -64, -64, -64, -64, -64, 64, -64, -64, -64, -64, -64, 64, -64, 64, -64, -64, 64, 64, -64, -64, -64, -64, 64, -64, 64, -64, 64, 64, -64, 64, -64, -64, -64, -64, 64, 64, -64, -64, -64, -64, 64, 64, 64, 64, 64, -64, -64, -64, -64, -64, -64, -64, -64, 64, 64, 64, 64, -64, -64, 64, -64, -64, 64, -64, -64, -64, -64, -64, 64, 64, 64, -64, 64, 64, 64, -64, -64, -64, -64, -64, -64, 64, 64, 64, 64, 64, 64, -64, -64, -64, -64, -64, -64, -64, -64, -64, 64, 64, -64, 64, -64, -64, -64, -64, -64, 64, -64, -64, -64, 64, 64, 64, 64, 64, 64, 64, 64, 64, -64, -64, -64, -64, -64, -64, 64, 64, -64, 64, -64, 64, -64, 64, -64, -64, -64, -64, -64, -64, 64, -64, 64, 64, 64, 64, 64, -64, -64, 64, 64, -64, -64, 64, 64, -64, -64, -64, 64, 64, 64, -64, -64, -64, -64, -64, -64, -64, 64, -64, 64, 64, 64, -64, -64, -64, 64, 64, 64, 64, 64, 64, -64, -64, -64, -64, -64, 64, -64, 64, -64, -64, -64, -64, -64, -64, -64, -64, 64, -64, -64, -64, -64, 64, 64, 64, 64, 64, -64, -64, 64, 64, 64, 64, -64, -64, 64, -64, -64, -64, -64, 64, -64, -64, -64, -64, -64, -64, -64, 64, -64, -64, 64, 64, -64, 64, 64, 64, 64, 64, -64, -64, -64, -64, -64, -64, -64, 64, 64, 64, -64, 64, -64, -64, -64, 64, -64, 64, -64, 64, 64, -64, -64, 64, -64, 64, -64, -64, 64, 64, 64, 64, -64, 64, -64, 64, -64, 64, -64, 64, 64, 64, 64, 64, -64, -64, 64, 64, -64, -64, 64, 64, 64, -64, 64, 64, -64, 64, 64, -64, -64, 64, 64, -64, 64, -64, -64, -64, 64, 64, -64, -64, 64, 64, 64, 64, 64, 64, 64, -64, 64, -64, -64, -64, 64, -64, -64, -64, 64, -64, -64, -64, -64, -64, 64, -64, -64, 64, -64, -64, -64, 64, -64, 64, 64, 64, 64, 64, 64, 64, 64, -64, -64, -64, -64, -64, -64, 64, 64, 64, 64, -64, 64, -64, -64, 64, -64, -64, -64, -64, -64, 64, 64, 64, 64, 64, 64, 64, -64, 64, -64, -64, -64, -64, 64, 64, 64, 64, 64, 64, -64, -64, -64, 64, 64, 64, -64, 64, 64, 64, 64, 64, 64, 64, 64, 64, -64, -64, -64, -64, 64, -64, 64, 64, -64, 64, 64, 64, -64, 64, -64, 64, 64, -64, -64, 64, 64, 64, 64, 64, -64, -64, -64, -64, 64, -64, -64, 64, -64, -64, 64, 64, -64, 64, 64, -64, 64, 64, 64, 64, -64, -64, 64, 64, 64, 64, -64, -64, 64, -64, -64, -64, -64, -64, -64, 64, 64, -64, -64, 64, 64, -64, -64, -64, 64, -64, -64, -64, -64, -64, 64, 64, 64, -64, -64, 64, -64, -64, 64, -64, -64, -64, -64, 64, 64, 64, 64, 64, 64, 64, -64, 64, 64, -64, -64, 64, 64, -64, 64, 64, -64, -64, -64, -64, -64, -64, -64, -64, -64, -64, 64, -64, -64, -64, -64, 64, 64, 64, 64, 64, -64, -64, -64, 64, 64, 64, 64, 64, -64, 64, -64, -64, -64, 64, -64, -64, -64, 64, 64, -64, 64, -64, 64, 64, 64, 64, -64, 64, 64, 64, -64, 64, 64, 64, 64, 64, 64, -64, -64, -64, 64, 64, 64, -64, 64, -64, -64, -64, -64, 64, 64, 64, 64, 64, -64, 64, -64, 64, 64, 64, 64, 64, 64, 64, 64, 64, -64, 64, 64, 64, 64, 64, 64, 64, -64, -64, -64, 64, 64, 64, 64, 64, 64, 64, 64, 64, 64, 64, -64, -64, 64, 64, 64, 64, -64, 64, 64, 64, -64, 64, 64, -64, 64, 64, -64, 64, 64, -64, -64, 64, 64, -64, -64, 64, 64, 64, 64, 64, 64, 64, 64, 64, 64, 64, 64, 64, -64, 64, -64, -64, -64, -64, -64, 64, 64, 64, -64, 64, -64, 64, 64, 64, 64, 64, 64, 64, -64, -64, 64, 64, 64, 64, 64, 64, 64, -64, 64, -64, -64, -64, 64, -64, -64, 64, 64, 64, 64, 64, 64, 64, -64, 64, -64, -64, -64, -64, -64, -64, -64, 64, 64, -64, 64, -64, -64, -64, -64, 64, -64, 64, 64, -64, -64, -64, 64, 64, 64, 64, 64, 64, -64, -64, -64, -64, 64, 64, 64, 64, 64, 64, 64, -64, -64, -64, -64, 64, -64, 64, -64, -64, 64, 64, 64, 64, 64, 64, 64, 64, -64, 64, -64, 64, 64, 64, 64, 64, 64, 64, 64, 64, -64, -64, -64, -64, -64, -64, 64, 64, -64, 64, 64, 64, 64, 64, 64, 64, -64, 64, -64, 64, 64, 64, 64, 64, 64, -64, 64, -64, 64, -64, -64, 64, 64, -64, 64, -64, -64, -64, 64, 64, 64, 64, 64, 64, -64, 64, 64, 64, 64, -64, 64, 64, 64, -64, -64, -64, 64, 64, -64, 64, 64, -64, -64, -64, -64, -64, 64, 64, 64, 64, -64, -64, -64, 64, 64, 64, -64, 64, 64, 64, 64, -64, 64, -64, -64, -64, -64, -64, 64, 64, -64, -64, -64, -64, -64, 64, 64, 64, -64, 64, 64, 64, 64, 64, -64, 64, 64, -64, 64, 64, 64, 64, 64, -64, -64, 64, -64, -64, 64, -64, -64, 64, 64, 64, -64, -64, -64, -64, 64, 64, 64, 64, -64, -64, 64, 64, 64, 64, 64, 64, 64, -64, 64, 64, 64, -64, -64, -64, 64, 64, -64, 64, -64, -64, -64, 64, -64, 64, -64, -64, 64, -64, -64, -64, 64, -64, -64, 64, -64, 64, 64, 64, 64, 64, 64, -64, 64, 64, 64, 64, -64, -64, 64, 64, 64, 64, 64, -64, -64, -64, 64, -64, 64, 64, 64, 64, 64, 64, 64, 64, -64, 64, -64, 64, -64, 64, 64, 64, 64, 64, 64, 64, -64, -64, 64, 64, 64, 64, 64, 64, 64, 64, -64, -64, 64, 64, 64, -64, -64, -64, 64, -64, 64, 64, 64, -64, -64, 64, -64, 64, 64, 64, 64, -64, 64, 64, 64, -64, 64, -64, -64, 64, 64, -64, -64, -64, -64, 64, 64, 64, -64, 64, 64, 64, 64, 64, -64, -64, 64, -64, 64, 64, 64, -64, 64, -64, -64, -64, 64, 64, 64, 64, 64, 64, -64, 64, -64, -64, 64, -64, 64, 64, -64, -64, -64, 64, -64, 64, -64, 64, 64, 64, -64, -64, 64, 64, -64, 64, -64, -64, -64, -64, 64, 64, -64, 64, -64, -64, 64, 64, -64, -64, 64, 64, -64, -64, -64, -64, -64, -64, -64, 64, -64, 64, 64, 64, -64, -64, 64, -64, -64, -64, -64, -64, 64, 64, 64, -64, 64, -64, 64, 64, -64, 64, -64, -64, -64, -64, -64, -64, -64, 64, 64, -64, 64, -64, -64, -64, 64, 64, -64, -64, -64, 64, -64, -64, 64, -64, 64, -64, -64, -64, -64, -64, 64, -64, -64, 64, 64, 64, 64, 64, 64, 64, 64, -64, -64, -64, -64, -64, -64, -64, -64, -64, -64, -64, -64, -64, -64, -64, -64, -64, -64, -64, -64, 64, 64, 64, 64, 64, 64, 64, 64, 64, 64, -64, 64, -64, 64, 64, -64, 64, -64, -64, -64, -64, -64, -64, -64, -64, -64, 64, -64, -64, 64, 64, 64, 64, 64, 64, 64, 64, -64, -64, -64, -64, -64, 64, -64, -64, -64, -64, -64, -64, -64, -64, -64, -64, 64, 64, 64, -64, -64, 64, 64, -64, -64, 64, 64, -64, 64, 64, 64, 64, -64, 64, 64, -64, -64, -64, -64, -64, -64, -64, -64, -64, 64, 64, -64, 64, -64, 64, -64, -64, 64, 64, -64, -64, -64, -64, 64, 64, -64, 64, -64, 64, -64, -64, -64, -64, -64, -64, -64, 64, 64, -64, 64, -64, -64, 64, -64, 64, -64, 64, 64, 64, 64, -64, -64, -64, 64, -64, 64, -64, -64, 64, -64, -64, -64, -64, 64, 64, 64, -64, -64, -64, -64, 64, -64, 64, 64, -64, -64, -64, -64, 64, -64, -64, 64, -64, -64, -64, -64, -64, -64, -64, -64, 64, 64, 64, 64, 64, -64, -64, -64, -64, -64, 64, 64, 64, 64, 64, 64, -64, -64, -64, -64, 64, 64, -64, -64, -64, 64, 64, 64, 64, 64, -64, -64, 64, -64, -64, -64, -64, -64, 64, 64, 64, -64, -64, -64, -64, -64, 64, -64, 64, 64, -64, -64, -64, -64, 64, 64, 64, -64, -64, -64, -64, -64, -64, -64, -64, 64, 64, 64, -64, -64, -64, 64, -64, 64, -64, -64, -64, 64, -64, 64, 64, -64, -64, 64, 64, -64, -64, -64, -64, -64, -64, -64, -64, -64, -64, 64, -64, 64, 64, 64, 64, -64, -64, -64, 64, -64, -64, 64, 64, -64, 64, -64, -64, -64, -64, -64, -64, -64, 64, -64, -64, -64, -64, -64, 64, 64, -64, 64, -64, 64, -64, 64, 64, -64, 64, -64, -64, -64, 64, 64, -64, 64, 64, -64, -64, -64, -64, -64, -64, -64, -64, -64, 64, 64, 64, -64, -64, -64, -64, -64, 64, 64, 64, -64, -64, -64, 64, 64, -64, -64, -64, -64, -64, -64, -64, -64, -64, -64, -64, -64, 64, 64, -64, 64, 64, -64, -64, -64, 64, -64, -64, -64, -64, 64, 64, 64, -64, -64, -64, -64, -64, -64, -64, 64, 64, -64, -64, 64, -64, -64, 64, -64, 64, -64, -64, -64, 64, 64, -64, -64, -64, 64, 64, 64, -64, -64, -64, -64, -64, -64, -64, -64, -64, -64, -64, -64, -64, -64, -64, 64, -64, 64, -64, -64, -64, -64, -64, -64, -64, 64, 64, -64, -64, -64, -64, -64, -64, -64, -64, 64, 64, -64, -64, -64, -64, -64, -64, 64, 64, -64, 64, 64, -64, 64, -64, -64, -64, -64, 64, -64, 64, -64, -64, -64, -64, -64, -64, -64, 64, 64, 64, -64, -64, -64, 64, 64, -64, 64, -64, 64, 64, -64, -64, -64, -64, 64, 64, -64, -64, -64, 64, -64, -64, -64, 64, -64, -64, -64, 64, -64, -64, -64, -64, -64, 64, -64, -64, 64, 64, -64, -64, 64, 64, 64, -64, -64, -64, 64, -64, -64, 64, 64, -64, -64, 64, 64, 64, -64, 64, -64, 64, 64, -64, -64, -64, 64, 64, -64, 64, -64, 64, -64, -64, 64, -64, 64, -64, 64, -64, -64, -64, -64, 64, 64, 64, 64, -64, -64, -64, -64, 64, 64, 64, -64, -64, 64, -64, -64, 64, -64, 64, -64, -64, 64, -64, -64, 64, 64, -64, 64, -64, 64, -64, -64, 64, -64, -64, 64, 64, 64, -64, -64, -64, -64, 64, -64, -64, -64, -64, -64, -64, -64, 64, -64, -64, -64, -64, -64, 64, 64, 64, -64, 64, 64, 64, -64, 64, -64, -64, -64, -64, 64, 64, -64, 64, 64, -64, -64, 64, 64, -64, -64, -64, -64, 64, -64, -64, -64, 64, 64, -64, 64, 64, 64, -64, -64, 64, 64, -64, 64, 64, 64, -64, 64, 64, 64, -64, 64, 64, -64, 64, -64, -64, -64, 64, 64, 64, 64, 64, 64, -64, 64, 64, -64, -64, 64, -64, -64, -64, -64, -64, 64, 64, -64, 64, -64, -64, -64, -64, 64, 64, -64, 64, -64, 64, -64, -64, -64, -64, 64, 64, 64, 64, -64, 64, 64, 64, -64, -64, 64, 64, -64, 64, -64, 64, 64, 64, 64, 64, 64, 64, -64, -64, 64, -64, -64, 64, 64, -64, 64, 64, -64, 64, -64, -64, 64, 64, 64, 64, 64, 64, -64, 64, 64, 64, 64, 64, 64, -64, 64, 64, 64, -64, 64, 64, -64, -64, 64, 64, -64, 64, 64, -64, 64, -64, -64, 64, -64, 64, -64, 64, -64, -64, 64, 64, -64, -64, -64, 64, 64, 64, -64, 64, -64, -64, -64, 64, 64, 64, 64, 64, -64, 64, -64, -64, -64, 64, -64, -64, -64, 64, -64, -64, -64, -64, -64, -64, 64, -64, -64, 64, -64, -64, -64, -64, -64, -64, 64, 64, 64, 64, -64, -64, -64, -64, -64, -64, -64, 64, 64, -64, -64, -64, -64, 64, 64, -64, -64, 64, -64, 64, -64, 64, -64, -64, 64, -64, -64, -64, 64, -64, -64, -64, -64, -64, -64, -64, -64, -64, -64, -64, -64, -64, -64, -64, 64, 64, 64, -64, 64, 64, -64, -64, 64, -64, -64, 64, -64, -64, -64, -64, -64, 64, -64, 64, -64, -64, -64, -64, -64, 64, -64, -64, 64, -64, 64, 64, -64, -64, 64, -64, -64, -64, -64, -64, -64, -64, -64, -64, -64, -64, -64, -64, 64, 64, 64, -64, -64, 64, -64, -64, 64, -64, 64, 64, -64, 64, -64, -64, -64, -64, -64, 64, -64, -64, -64, -64, 64, 64, -64, 64, -64, -64, -64, -64, 64, 64, 64, 64, 64, 64, 64, 64, 64, 64, -64, 64, -64, 64, -64, -64, -64, -64, -64, 64, -64, -64, 64, 64, -64, -64, -64, -64, 64, -64, 64, -64, 64, -64, 64, -64, 64, 64, 64, 64, -64, -64, -64, -64, -64, -64, -64, -64, -64, -64, -64, -64, 64, -64, -64, -64, -64, 64, 64, -64, -64, 64, 64, -64, -64, 64, -64, -64, 64, -64, -64, -64, -64, -64, -64, -64, 64, 64, -64, -64, -64, -64, 64, 64, 64, 64, -64, -64, -64, -64, 64, -64, -64, -64, -64, -64, -64, -64, 64, -64, -64, -64, -64, -64, 64, -64, -64, -64, -64, -64, -64, -64, 64, -64, -64, -64, -64, 64, -64, -64, 64, -64, 64, 64, -64, 64, -64, 64, -64, -64, -64, 64, 64, -64, -64, -64, -64, -64, -64, -64, -64, 64, 64, 64, 64, 64, 64, 64, -64, 64, 64, -64, -64, -64, -64, 64, -64, -64, 64, 64, 64, -64, -64, -64, -64, -64, -64, -64, 64, -64, -64, -64, -64, 64, 64, -64, 64, 64, -64, -64, -64, 64, 64, 64, 64, 64, 64, 64, 64, -64, -64, -64, -64, -64, -64, -64, -64, -64, 64, 64, 64, -64, 64, 64, -64, -64, 64, -64, -64, 64, 64, -64, -64, 64, 64, 64, -64, -64, 64, -64, -64, 64, -64, -64, -64, -64, 64, 64, -64, 64, 64, 64, 64, -64, -64, -64, -64, -64, 64, -64, -64, 64, -64, -64, -64, -64, -64, -64, 64, -64, -64, 64, -64, 64, -64, -64, 64, 64, -64, 64, -64, 64, 64, -64, -64, -64, -64, -64, 64, 64, -64, 64, -64, -64, 64, -64, 64, 64, 64, -64, 64, 64, 64, 64, -64, 64, -64, -64, -64, -64, 64, -64, -64, -64, -64, -64, 64, -64, -64, -64, 64, 64, -64, 64, -64, 64, -64, 64, -64, 64, 64, 64, 64, 64, -64, 64, -64, 64, 64, 64, -64, -64, -64, -64, -64, -64, -64, -64, -64, -64, -64, -64, 64, 64, 64, 64, -64, 64, -64, -64, -64, -64, -64, 64, -64, -64, 64, 64, 64, 64, -64, -64, -64, -64, -64, -64, -64, -64, 64, -64, -64, -64, 64, -64, -64, 64, 64, -64, -64, -64, 64, -64, 64, -64, 64, -64, 64, 64, -64, -64, -64, -64, -64, -64, -64, -64, -64, -64, 64, -64, 64, 64, 64, 64, -64, 64, -64, 64, 64, 64, 64, 64, -64, -64, -64, -64, -64, -64, 64, -64, -64, 64, 64, 64, 64, -64, 64, 64, -64, -64, -64, 64, 64, 64, -64, 64, -64, 64, 64, 64, 64, 64, -64, -64, 64, 64, -64, 64, 64, -64, 64, 64, -64, -64, 64, 64, 64, -64, -64, -64, -64, -64, 64, 64, 64, -64, -64, 64, 64, 64, -64, 64, -64, -64, -64, -64, -64, -64, -64, 64, -64, -64, 64, -64, -64, -64, 64, 64, -64, -64, 64, -64, -64, 64, 64, -64, 64, 64, 64, 64, 64, 64, 64, -64, -64, -64, -64, 64, 64, 64, 64, -64, -64, 64, -64, 64, -64, -64, -64, -64, 64, -64, 64, 64, -64, 64, -64, 64, -64, -64, -64, -64, 64, 64, 64, -64, 64, -64, -64, -64, -64, 64, 64, 64, 64, 64, -64, -64, -64, -64, -64, 64, 64, -64, -64, -64, 64, 64, 64, -64, 64, 64, 64, -64, -64, 64, 64, -64, -64, 64, 64, 64, 64, -64, 64, -64, -64, 64, -64, 64, 64, -64, -64, -64, 64, 64, -64, -64, -64, 64, 64, 64, 64, 64, 64, -64, 64, 64, 64, -64, 64, -64, 64, -64, 64, -64, -64, -64, 64, 64, -64, 64, 64, 64, 64, -64, -64, 64, 64, 64, 64, 64, -64, -64, -64, 64, -64, -64, 64, 64, 64, -64, 64, 64, 64, 64, -64, -64, 64, 64, -64, -64, -64, -64, 64, 64, 64, -64, 64, -64, 64, -64, 64, 64, 64, 64, 64, 64, 64, -64, -64, 64, -64, 64, -64, -64, -64, 64, -64, 64, 64, 64, -64, 64, 64, -64, -64, 64, 64, 64, 64, 64, 64, 64, 64, -64, -64, 64, -64, 64, 64, 64, -64, 64, 64, 64, 64, 64, -64, 64, -64, 64, 64, 64, -64, -64, -64, -64, 64, -64, -64, -64, 64, 64, -64, -64, 64, -64, 64, 64, 64, 64, 64, 64, -64, 64, 64, 64, 64, -64, -64, -64, 64, 64, 64, 64, -64, 64, 64, 64, -64, -64, -64, 64, 64, -64, 64, 64, 64, 64, 64, -64, 64, -64, 64, 64, -64, 64, -64, 64, 64, 64, -64, 64, 64, 64, 64, 64, -64, 64, 64, -64, -64, 64, 64, 64, 64, -64, -64, 64, 64, 64, -64, 64, 64, 64, 64, -64, -64, 64, -64, -64, -64, 64, -64, 64, -64, -64, -64, 64, -64, -64, 64, -64, -64, -64, 64, -64, -64, 64, 64, 64, 64, 64, -64, -64, 64, -64, 64, -64, -64, 64, 64, 64, 64, -64, -64, 64, 64, -64, 64, 64, 64, 64, 64, 64, 64, 64, 64, 64, 64, 64, -64, -64, -64, 64, 64, -64, -64, 64, 64, 64, 64, -64, 64, 64, 64, 64, 64, 64, -64, -64, -64, -64, -64, -64, 64, 64, 64, 64, 64, 64, 64, 64, 64, 64, 64, 64, 64, 64, -64, 64, -64, -64, 64, -64, 64, 64, 64, -64, -64, 64, -64, -64, 64, 64, -64, 64, 64, 64, 64, 64, -64, -64, 64, 64, 64, -64, -64, -64, -64, 64, -64, 64, 64, 64, 64, 64, -64, -64, 64, 64, 64, 64, 64, 64, -64, -64, -64, 64, 64, -64, 64, 64, 64, 64, -64, -64, -64, 64, -64, -64, 64, 64, -64, -64, -64, -64, 64, 64, 64, -64, 64, -64, -64, -64, -64, 64, 64, -64, 64, 64, 64, 64, -64, 64, -64, -64, 64, 64, -64, 64, 64, 64, -64, -64, 64, -64, 64, -64, -64, -64, 64, 64, 64, -64, 64, 64, 64, 64, -64, 64, -64, -64, -64, -64, 64, -64, 64, 64, 64, 64, 64, 64, 64, 64, 64, 64, 64, 64, -64, -64, 64, 64, 64, 64, 64, 64, 64, 64, -64, 64, 64, -64, -64, 64, -64, 64, 64, 64, 64, -64, 64, -64, -64, 64, 64, 64, 64, -64, -64, 64, 64, 64, 64, 64, 64, 64, 64, -64, -64, 64, 64, -64, 64, 64, 64, 64, -64, 64, 64, -64, -64, 64, 64, 64, 64, -64, 64, 64, 64, 64, 64, 64, 64, -64, -64, 64, 64, -64, -64, -64, 64, 64, 64, 64, -64, -64, 64, 64, 64, 64, 64, 64, 64, 64, 64, 64, 64, 64, 64, 64, 64, -64, -64, 64, 64, 64, -64, 64, 64, -64, -64, 64, 64, -64, -64, 64, 64, 64, 64, 64, 64, 64, 64, 64, -64, 64, -64, 64, 64, -64, -64, -64, 64, 64, -64, 64, -64, 64, -64, -64, 64, -64, -64, -64, 64, 64, -64, 64, 64, 64, 64, 64, 64, 64, 64, -64, -64, -64, -64, 64, -64, 64, 64, 64, 64, -64, 64, 64, 64, -64, 64, -64, 64, -64, 64, -64, 64, 64, 64, 64, -64, -64, -64, -64, 64, -64, 64, -64, 64, 64, 64, -64, 64, 64, -64, -64, -64, 64, -64, 64, 64, 64, 64, 64, 64, -64, -64, -64, 64, -64, -64, -64, -64, 64, -64, 64, 64, -64, -64, -64, 64, -64, -64, -64, -64, 64, -64, -64, -64, 64, 64, -64, -64, -64, -64, -64, 64, 64, -64, 64, -64, -64, 64, -64, -64, -64, -64, 64, -64, 64, 64, -64, 64, -64, -64, 64, -64, -64, -64, 64, 64, -64, -64, 64, 64, -64, -64, 64, -64, 64, -64, 64, 64, 64, -64, -64, 64, 64, 64, 64, 64, 64, 64, -64, -64, 64, 64, -64, -64, -64, 64, -64, 64, 64, -64, 64, 64, 64, -64, 64, -64, 64, 64, 64, 64, -64, -64, -64, -64, 64, -64, -64, 64, 64, -64, -64, 64, -64, -64, 64, 64, -64, -64, -64, -64, 64, -64, -64, 64, -64, 64, -64, 64, -64, 64, 64, -64, -64, -64, -64, 64, -64, 64, 64, 64, 64, -64, 64, -64, 64, -64, -64, -64, 64, -64, 64, 64, 64, -64, -64, 64, -64, 64, -64, 64, 64, -64, 64, 64, -64, -64, -64, -64, -64, 64, -64, -64, 64, -64, 64, -64, 64, -64, 64, -64, -64, -64, -64, -64, -64, -64, -64, 64, 64, -64, -64, -64, 64, 64, 64, -64, -64, -64, -64, 64, 64, 64, -64, 64, -64, 64, 64, -64, -64, -64, -64, -64, 64, 64, -64, -64, -64, 64, 64, -64, 64, 64, -64, -64, 64, -64, -64, 64, -64, 64, 64, 64, 64, 64, -64, 64, 64, 64, -64, -64, 64, 64, 64, -64, 64, 64, -64, 64, 64, 64, -64, 64, 64, 64, -64, 64, 64, 64, 64, 64, 64, -64, 64, 64, 64, 64, -64, 64, 64, 64, -64, -64, 64, 64, 64, 64, 64, -64, -64, 64, 64, 64, 64, 64, 64, 64, -64, 64, 64, 64, 64, -64, -64, 64, -64, 64, 64, -64, 64, 64, -64, 64, 64, 64, 64, 64, -64, 64, 64, 64, 64, 64, 64, 64, 64, -64, -64, -64, -64, -64, 64, -64, -64, -64, -64, -64, -64, 64, 64, 64, 64, 64, 64, -64, 64, 64, -64, -64, -64, -64, -64, -64, 64, -64, -64, -64, 64, 64, -64, -64, -64, 64, -64, 64, 64, -64, 64, 64, 64, 64, 64, 64, 64, 64, 64, 64, -64, -64, 64, 64, -64, -64, -64, -64, 64, 64, 64, 64, -64, -64, -64, 64, 64, 64, 64, -64, 64, 64, -64, -64, -64, 64, -64, 64, 64, 64, 64, 64, 64, -64, 64, 64, -64, -64, 64, 64, 64, 64, 64, -64, 64, 64, 64, 64, 64, 64, 64, 64, 64, 64, 64, 64, 64, 64, 64, 64, -64, 64, 64, 64, 64, 64, -64, -64, 64, 64, -64, -64, -64, 64, -64, -64, 64, 64, -64, 64, 64, 64, 64, 64, -64, -64, 64, 64, 64, 64, 64, 64, -64, 64, 64, -64, 64, 64, 64, 64, 64, 64, 64, 64, 64, -64, -64, 64, 64, -64, -64, 64, 64, 64, 64, 64, -64, 64, -64, -64, 64, 64, 64, 64, 64, -64, 64, -64, 64, -64, 64, -64, -64, -64, -64, -64, -64, 64, -64, 64, 64, 64, 64, -64, 64, 64, 64, 64, -64, -64, 64, 64, -64, -64, 64, 64, 64, 64, -64, -64, 64, 64, 64, 64, 64, -64, -64, 64, 64, 64, 64, 64, 64, 64, -64, 64, -64, -64, -64, 64, 64, 64, -64, 64, -64, -64, -64, 64, 64, 64, 64, 64, -64, 64, -64, -64, -64, -64, 64, 64, -64, -64, 64, 64, -64, 64, -64, 64, -64, -64, -64, 64, 64, 64, -64, 64, 64, 64, 64, 64, 64, 64, 64, 64, -64, 64, 64, 64, 64, 64, -64, -64, 64, -64, -64, 64, -64, 64, -64, 64, 64, 64, 64, 64, -64, 64, -64, 64, 64, 64, 64, 64, 64, 64, 64, -64, 64, 64, 64, -64, -64, -64, 64, 64, 64, 64, 64, 64, 64, -64, 64, 64, 64, 64, -64, -64, 64, 64, -64, 64, -64, 64, 64, 64, 64, -64, 64, 64, -64, -64, 64, 64, -64, -64, -64, -64, 64, 64, -64, 64, 64, 64, 64, 64, 64, 64, -64, 64, 64, 64, 64, 64, -64, 64, 64, -64, 64, 64, -64, 64, -64, 64, -64, -64, 64, 64, 64, -64, 64, -64, 64, -64, 64, 64, -64, -64, 64, 64, -64, 64, 64, -64, 64, 64, 64, -64, -64, 64, -64, 64, -64, -64, -64, -64, 64, 64, 64, -64, -64, 64, 64, 64, -64, -64, 64, 64, 64, -64, -64, -64, 64, 64, -64, 64, 64, 64, -64, -64, -64, 64, -64, 64, 64, 64, 64, 64, 64, 64, 64, 64, -64, 64, 64, -64, 64, -64, -64, 64, 64, 64, -64, -64, 64, 64, -64, -64, 64, -64, 64, -64, -64, -64, -64, -64, 64, 64, 64, -64, 64, -64, 64, -64, 64, 64, -64, 64, 64, 64, 64, 64, 64, 64, -64, -64, -64, -64, -64, -64, 64, 64, 64, 64, 64, 64, 64, -64, 64, 64, -64, 64, 64, -64, -64, -64, 64, 64, -64, 64, -64, -64, 64, -64, 64, -64, 64, -64, 64, 64, 64, 64, -64, -64, 64, -64, -64, 64, -64, -64, 64, 64, -64, 64, 64, 64, -64, -64, 64, 64, 64, 64, 64, 64, 64, 64, -64, -64, 64, 64, 64, 64, -64, -64, 64, -64, 64, 64, 64, 64, 64, -64, 64, -64, 64, 64, -64, -64, 64, 64, -64, -64, -64, 64, -64, -64, -64, -64, -64, -64, -64, -64, -64, -64, -64, 64, -64, 64, 64, -64, 64, -64, 64, -64, -64, 64, -64, -64, -64, 64, -64, -64, -64, -64, 64, 64, -64, 64, -64, -64, -64, -64, -64, 64, -64, -64, -64, -64, -64, 64, -64, 64, 64, 64, -64, 64, 64, 64, -64, -64, 64, -64, 64, 64, 64, 64, 64, 64, 64, -64, 64, -64, -64, -64, -64, -64, -64, -64, -64, 64, 64, -64, -64, -64, -64, 64, 64, 64, 64, 64, 64, 64, -64, 64, -64, 64, 64, -64, -64, -64, -64, -64, -64, -64, -64, -64, 64, 64, 64, -64, -64, 64, 64, 64, 64, 64, 64, 64, 64, 64, 64, 64, 64, 64, 64, 64, -64, -64, -64, -64, -64, -64, -64, -64, 64, 64, -64, -64, 64, -64, 64, 64, 64, 64, 64, 64, -64, 64, 64, 64, -64, 64, -64, 64, -64, -64, -64, -64, -64, -64, -64, -64, 64, 64, -64, 64, 64, -64, 64, -64, 64, -64, 64, 64, 64, 64, 64, 64, 64, -64, 64, 64, 64, -64, -64, -64, -64, -64, -64, -64, -64, -64, -64, 64, 64, -64, 64, 64, -64, 64, -64, -64, -64, -64, -64, -64, 64, 64, 64, 64, 64, -64, -64, -64, -64, -64, -64, -64, -64, -64, -64, 64, 64, 64, -64, -64, -64, -64, -64, -64, -64, -64, -64, -64, 64, 64, 64, 64, 64, -64, -64, -64, -64, -64, -64, -64, -64, -64, -64, 64, 64, -64, 64, -64, -64, -64, -64, -64, -64, -64, 64, -64, 64, 64, 64, 64, 64, -64, -64, -64, -64, -64, -64, -64, -64, -64, 64, 64, -64, -64, 64, -64, -64, -64, -64, -64, -64, -64, 64, 64, 64, 64, 64, 64, 64, -64, -64, -64, -64, 64, -64, -64, -64, -64, -64, -64, -64, 64, 64, 64, -64, 64, -64, -64, 64, 64, 64, 64, 64, 64, 64, 64, 64, -64, -64, -64, -64, -64, 64, 64, -64, 64, -64, 64, -64, 64, -64, 64, 64, -64, -64, -64, 64, 64, -64, -64, 64, 64, 64, 64, 64, -64, -64, 64, 64, -64, 64, 64, 64, 64, 64, 64, 64, -64, 64, 64, 64, -64, -64, 64, -64, -64, 64, 64, -64, 64, 64, -64, 64, -64, -64, -64, -64, -64, 64, -64, 64, 64, 64, 64, -64, -64, 64, 64, -64, 64, -64, 64, -64, -64, 64, -64, -64, 64, 64, 64, 64, -64, -64, 64, 64, 64, -64, -64, -64, 64, 64, 64, 64, 64, 64, -64, -64, -64, 64, -64, 64, -64, -64, -64, -64, -64, 64, -64, -64, -64, -64, 64, 64, 64, 64, 64, 64, 64, 64, 64, -64, -64, 64, -64, -64, -64, 64, -64, 64, 64, -64, -64, 64, 64, 64, -64, 64, -64, -64, 64, 64, 64, 64, 64, 64, 64, 64, -64, -64, 64, 64, -64, -64, -64, -64, 64, 64, -64, -64, -64, 64, 64, -64, -64, -64, -64, -64, 64, -64, -64, -64, -64, 64, 64, -64, -64, -64, -64, -64, -64, -64, -64, -64, 64, 64, -64, -64, -64, 64, 64, 64, 64, 64, 64, 64, -64, -64, -64, 64, 64, -64, 64, -64, -64, 64, -64, 64, -64, -64, -64, 64, 64, -64, -64, -64, -64, 64, 64, 64, 64, 64, -64, -64, 64, 64, -64, -64, -64, 64, 64, 64, 64, 64, 64, -64, -64, -64, -64, -64, -64, -64, 64, -64, -64, -64, -64, 64, 64, 64, 64, 64, -64, -64, -64, -64, 64, -64, 64, -64, -64, -64, 64, -64, 64, 64, -64, -64, -64, -64, -64, -64, -64, -64, -64, -64, 64, -64, 64, -64, -64, -64, 64, -64, 64, -64, 64, -64, 64, -64, -64, -64, -64, -64, 64, -64, -64, -64, 64, -64, -64, -64, -64, -64, 64, 64, 64, 64, -64, -64, 64, -64, -64, 64, -64, 64, -64, 64, 64, 64, -64, 64, 64, -64, 64, -64, -64, -64, -64, 64, 64, 64, 64, 64, 64, -64, -64, 64, -64, -64, -64, 64, -64, -64, 64, -64, 64, -64, -64, 64, -64, 64, -64, 64, 64, 64, -64, 64, 64, -64, -64, -64, -64, -64, -64, -64, 64, -64, -64, 64, -64, 64, -64, -64, -64, -64, 64, -64, -64, -64, -64, 64, 64, 64, 64, 64, -64, -64, -64, -64, 64, 64, -64, 64, -64, 64, 64, 64, -64, -64, 64, -64, -64, 64, -64, -64, -64, 64, 64, 64, 64, -64, -64, -64, -64, 64, -64, 64, -64, 64, 64, 64, 64, 64, 64, -64, 64, -64, 64, -64, 64, 64, 64, 64, -64, 64, -64, -64, -64, 64, -64, 64, -64, 64, -64, -64, -64, 64, -64, 64, -64, -64, 64, -64, 64, -64, -64, -64, 64, 64, 64, 64, 64, -64, -64, -64, 64, -64, -64, -64, -64, 64, -64, -64, -64, -64, 64, 64, -64, 64, 64, 64, -64, -64, -64, -64, 64, -64, 64, 64, 64, -64, 64, -64, -64, -64, -64, -64, -64, 64, 64, 64, -64, -64, -64, 64, -64, -64, -64, 64, -64, 64, 64, 64, 64, 64, 64, -64, 64, 64, -64, 64, 64, 64, -64, -64, 64, 64, 64, -64, 64, 64, 64, 64, 64, -64, -64, -64, -64, 64, -64, 64, 64, -64, -64, 64, 64, 64, 64, -64, -64, -64, -64, -64, 64, -64, 64, -64, -64, 64, 64, -64, 64, 64, 64, 64, 64, 64, -64, -64, -64, -64, -64, 64, 64, 64, -64, -64, -64, -64, -64, -64, 64, -64, -64, -64, 64, 64, 64, 64, 64, 64, 64, 64, -64, 64, -64, -64, -64, 64, -64, 64, 64, -64, -64, -64, 64, 64, 64, -64, 64, 64, 64, 64, -64, 64, 64, 64, 64, 64, 64, 64, 64, -64, -64, 64, 64, 64, -64, -64, -64, 64, -64, 64, 64, 64, 64, 64, 64, 64, 64, 64, 64, 64, 64, 64, 64, 64, 64, 64, -64, 64, -64, -64, 64, -64, -64, -64, -64, -64, 64, -64, 64, -64, -64, 64, 64, -64, 64, -64, 64, -64, 64, 64, 64, -64, 64, 64, 64, 64, 64, 64, -64, -64, -64, -64, -64, -64, 64, -64, 64, -64, -64, 64, -64, -64, -64, -64, -64, -64, 64, 64, 64, -64, -64, 64, 64, 64, -64, 64, -64, -64, 64, -64, 64, 64, 64, -64, 64, -64, -64, -64, 64, -64, -64, -64, -64, -64, 64, 64, -64, 64, 64, 64, 64, -64, -64, 64, 64, -64, -64, 64, 64, 64, 64, -64, -64, -64, -64, -64, 64, 64, -64, -64, 64, 64, 64, -64, -64, 64, 64, 64, 64, 64, -64, -64, -64, -64, -64, 64, 64, 64, 64, -64, -64, -64, 64, 64, 64, 64, 64, 64, 64, 64, 64, -64, -64, -64, -64, 64, 64, -64, 64, -64, -64, 64, -64, -64, 64, -64, -64, -64, -64, 64, 64, 64, 64, 64, 64, 64, 64, 64, 64, -64, -64, 64, -64, -64, -64, -64, 64, 64, -64, -64, 64, -64, -64, -64, -64, -64, -64, 64, 64, 64, 64, 64, 64, 64, 64, 64, -64, -64, 64, -64, 64, 64, 64, -64, -64, 64, 64, 64, -64, -64, -64, 64, -64, 64, -64, 64, 64, 64, 64, 64, 64, 64, -64, 64, -64, -64, 64, -64, -64, 64, 64, 64, -64, -64, -64, 64, -64, -64, 64, 64, -64, -64, 64, 64, 64, 64, 64, 64, 64, 64, -64, -64, -64, -64, -64, -64, -64, 64, 64, 64, -64, 64, 64, -64, -64, 64, 64, -64, 64, -64, 64, 64, 64, 64, 64, 64, 64, 64, 64, -64, -64, -64, -64, -64, 64, 64, 64, 64, -64, 64, 64, 64, -64, 64, 64, -64, -64, -64, 64, 64, 64, 64, 64, 64, 64, 64, 64, 64, -64, -64, -64, -64, 64, 64, -64, -64, 64, 64, 64, 64, -64, 64, 64, 64, 64, 64, 64, 64, 64, 64, 64, 64, 64, 64, -64, -64, -64, -64, -64, 64, 64, 64, 64, 64, 64, 64, 64, 64, -64, 64, -64, 64, 64, 64, -64, 64, -64, 64, -64, 64, -64, 64, -64, -64, -64, -64, 64, -64, 64, 64, 64, 64, -64, -64, 64, 64, 64, 64, 64, -64, 64, 64, -64, 64, 64, -64, -64, 64, -64, -64, -64, -64, 64, 64, 64, 64, -64, 64, -64, 64, 64, 64, -64, 64, 64, 64, 64, 64, -64, 64, -64, -64, 64, 64, -64, -64, -64, 64, -64, 64, 64, 64, 64, 64, 64, 64, -64, 64, 64, 64, 64, 64, -64, 64, 64, 64, 64, 64, 64, -64, 64, 64, -64, -64, -64, -64, 64, 64, 64, 64, -64, 64, 64, 64, -64, -64, -64, -64, 64, 64, 64, 64, 64, -64, 64, 64, 64, 64, 64, -64, -64, -64, 64, 64, 64, 64, 64, -64, -64, 64, 64, 64, 64, -64, 64, -64, 64, 64, -64, -64, -64, -64, 64, 64, 64, 64, -64, 64, -64, 64, 64, 64, -64, 64, 64, -64, -64, -64, -64, 64, 64, 64, 64, 64, -64, 64, 64, 64, 64, -64, -64, 64, -64, 64, 64, -64, 64, 64, -64, 64, -64, -64, -64, -64, -64, -64, -64, 64, 64, 64, -64, 64, -64, 64, -64, 64, 64, -64, 64, 64, -64, 64, 64, -64, -64, -64, -64, 64, -64, -64, 64, -64, -64, 64, -64, -64, 64, -64, 64, 64, 64, -64, 64, 64, 64, -64, -64, -64, 64, 64, 64, 64, -64, -64, 64, 64, -64, -64, -64, 64, 64, 64, -64, 64, -64, -64, -64, -64, 64, -64, -64, -64, -64, -64, 64, -64, 64, -64, 64, -64, 64, -64, 64, 64, 64, -64, -64, -64, 64, 64, -64, -64, 64, 64, 64, -64, 64, -64, -64, 64, -64, 64, 64, -64, -64, 64, -64, -64, -64, 64, -64, -64, 64, 64, 64, 64, -64, 64, -64, -64, -64, 64, 64, 64, -64, 64, 64, 64, 64, 64, -64, 64, 64, -64, -64, -64, 64, 64, 64, 64, 64, 64, 64, 64, -64, 64, -64, 64, -64, -64, -64, -64, -64, -64, 64, -64, 64, -64, -64, -64, -64, -64, -64, 64, -64, -64, -64, 64, 64, 64, 64, 64, 64, 64, -64, 64, -64, 64, 64, 64, -64, 64, -64, -64, 64, -64, -64, -64, -64, -64, -64, -64, 64, -64, -64, 64, 64, 64, 64, 64, 64, 64, 64, 64, 64, -64, 64, 64, 64, -64, 64, -64, -64, -64, -64, -64, -64, -64, 64, -64, 64, 64, -64, 64, -64, 64, 64, 64, 64, 64, 64, 64, 64, 64, 64, 64, 64, 64, -64, -64, -64, -64, -64, -64, -64, -64, 64, 64, 64, 64, -64, -64, 64, -64, 64, 64, 64, 64, 64, -64, -64, -64, 64, 64, -64, 64, 64, 64, -64, -64, -64, -64, -64, -64, -64, 64, 64, -64, -64, -64, -64, 64, -64, 64, -64, 64, 64, -64, 64, 64, 64, -64, 64, -64, 64, -64, -64, -64, -64, -64, -64, -64, 64, 64, 64, 64, -64, -64, -64, -64, -64, 64, -64, -64, -64, -64, -64, -64, -64, -64, 64, -64, -64, -64, -64, -64, -64, -64, -64, -64, 64, 64, 64, -64, -64, -64, -64, -64, -64, -64, -64, 64, -64, -64, 64, -64, -64, 64, 64, 64, -64, -64, -64, -64, -64, -64, -64, -64, 64, -64, 64, 64, -64, -64, -64, -64, -64, -64, 64, 64, 64, -64, 64, -64, 64, -64, 64, 64, 64, -64, -64, -64, -64, -64, -64, -64, -64, 64, 64, 64, -64, -64, -64, -64, -64, -64, -64, -64, -64, -64, 64, 64, 64, -64, -64, -64, 64, -64, -64, -64, -64, -64, -64, -64, -64, 64, 64, -64, -64, -64, -64, 64, -64, 64, -64, -64, -64, -64, 64, 64, -64, -64, 64, 64, 64, -64, -64, -64, -64, -64, -64, 64, 64, 64, 64, -64, -64, -64, 64, -64, -64, -64, -64, 64, -64, -64, 64, -64, -64, -64, 64, -64, 64, -64, -64, -64, -64, -64, -64, 64, 64, -64, 64, 64, -64, -64, -64, -64, -64, -64, -64, -64, -64, -64, -64, 64, -64, 64, -64, 64, -64, -64, -64, 64, -64, 64, 64, 64, 64, -64, 64, 64, -64, -64, -64, -64, -64, -64, -64, -64, -64, -64, -64, -64, -64, -64, -64, 64, 64, -64, 64, 64, 64, 64, 64, 64, -64, -64, -64, -64, -64, -64, -64, -64, -64, -64, -64, -64, -64, -64, 64, -64, 64, -64, -64, -64, 64, -64, -64, 64, 64, 64, 64, -64, -64, -64, -64, -64, 64, -64, 64, -64, -64, 64, -64, -64, -64, 64, -64, -64, -64, -64, 64, 64, -64, -64, 64, 64, 64, 64, 64, -64, -64, -64, -64, 64, 64, 64, -64, -64, 64, -64, -64, 64, 64, 64, -64, -64, 64, -64, 64, -64, 64, 64, 64, 64, 64, 64, 64, 64, 64, -64, -64, 64, 64, -64, -64, -64, 64, -64, -64, 64, 64, 64, 64, 64, -64, 64, 64, -64, -64, -64, 64, 64, 64, 64, 64, 64, 64, 64, 64, 64, 64, -64, -64, 64, 64, 64, -64, 64, 64, 64, -64, 64, -64, 64, -64, -64, -64, -64, 64, 64, 64, 64, 64, 64, -64, 64, -64, 64, -64, -64, -64, 64, -64, -64, 64, -64, -64, 64, -64, 64, 64, -64, 64, -64, -64, -64, 64, 64, 64, 64, -64, -64, 64, -64, -64, -64, -64, -64, -64, -64, -64, -64, -64, -64, -64, 64, 64, 64, -64, -64, -64, -64, -64, -64, -64, -64, -64, 64, 64, -64, 64, 64, 64, -64, -64, -64, -64, -64, -64, -64, -64, -64, -64, -64, -64, 64, -64, 64, -64, -64, -64, -64, -64, -64, -64, -64, -64, -64, -64, -64, -64, -64, 64, 64, -64, -64, 64, -64, 64, 64, -64, -64, 64, 64, 64, 64, 64, -64, 64, 64, -64, 64, -64, -64, 64, 64, 64, -64, -64, -64, -64, -64, -64, -64, 64, -64, 64, 64, -64, 64, 64, 64, 64, -64, -64, -64, -64, -64, -64, -64, -64, -64, -64, 64, -64, 64, -64, -64, 64, -64, -64, -64, -64, 64, 64, 64, -64, 64, -64, 64, -64, -64, 64, -64, 64, 64, -64, 64, -64, 64, -64, -64, 64, 64, -64, -64, -64, -64, 64, -64, 64, 64, -64, -64, -64, -64, 64, -64, 64, 64, -64, -64, -64, 64, 64, -64, -64, 64, 64, -64, 64, 64, 64, 64, -64, -64, 64, 64, -64, -64, 64, -64, -64, 64, 64, 64, 64, 64, -64, -64, -64, -64, 64, -64, 64, 64, 64, 64, 64, -64, 64, -64, -64, -64, -64, 64, -64, -64, -64, -64, 64, 64, -64, -64, -64, -64, 64, -64, -64, -64, -64, 64, 64, -64, 64, 64, 64, 64, -64, -64, -64, 64, 64, -64, 64, 64, 64, 64, -64, -64, 64, -64, 64, 64, 64, 64, -64, -64, -64, 64, 64, 64, -64, 64, -64, 64, 64, 64, 64, -64, -64, 64, 64, 64, 64, -64, 64, -64, -64, -64, 64, 64, -64, 64, 64, 64, 64, 64, 64, -64, 64, 64, 64, -64, 64, 64, 64, -64, 64, 64, 64, -64, 64, -64, -64, -64, 64, 64, 64, -64, 64, -64, -64, 64, 64, -64, -64, 64, 64, -64, -64, -64, 64, 64, 64, 64, 64, 64, 64, -64, 64, 64, 64, 64, -64, -64, 64, -64, 64, -64, -64, 64, 64, 64, 64, 64, 64, -64, 64, -64, 64, -64, -64, 64, 64, 64, -64, 64, -64, 64, 64, 64, -64, -64, 64, -64, -64, -64, 64, -64, -64, 64, -64, 64, -64, 64, -64, 64, -64, 64, -64, 64, 64, 64, 64, -64, -64, 64, -64, 64, -64, -64, 64, 64, 64, 64, 64, 64, -64, 64, 64, 64, -64, -64, -64, 64, 64, 64, -64, 64, 64, 64, 64, 64, 64, 64, 64, 64, -64, 64, 64, -64, 64, 64, 64, -64, 64, -64, 64, 64, 64, 64, 64, -64, 64, 64, -64, -64, 64, 64, -64, 64, -64, 64, -64, -64, -64, 64, 64, 64, 64, 64, -64, 64, 64, 64, 64, 64, -64, 64, 64, 64, 64, 64, 64, 64, 64, 64, 64, 64, 64, -64, -64, 64, 64, 64, 64, -64, -64, 64, -64, 64, -64, 64, -64, -64, 64, 64, 64, 64, 64, 64, -64, -64, 64, 64, 64, 64, -64, -64, -64, -64, -64, 64, 64, 64, -64, -64, 64, 64, 64, 64, 64, -64, 64, 64, 64, 64, 64, 64, -64, 64, -64, -64, 64, -64, 64, -64, -64, -64, -64, 64, 64, -64, 64, -64, 64, -64, -64, -64, 64, 64, 64, 64, 64, 64, 64, 64, -64, -64, -64, 64, -64, 64, -64, -64, -64, -64, 64, 64, -64, 64, -64, 64, 64, 64, 64, 64, 64, -64, 64, 64, -64, 64, 64, 64, 64, 64, 64, 64, -64, 64, -64, -64, 64, 64, 64, 64, 64, 64, -64, -64, -64, -64, 64, 64, 64, -64, 64, 64, -64, 64, 64, 64, 64, -64, 64, 64, 64, 64, 64, -64, -64, 64, -64, -64, 64, 64, 64, -64, -64, 64, -64, 64, 64, -64, 64, 64, 64, 64, -64, 64, 64, 64, -64, 64, 64, 64, 64, 64, 64, 64, -64, -64, -64, 64, -64, 64, -64, -64, -64, -64, 64, -64, 64, 64, 64, 64, 64, 64, 64, 64, 64, 64, 64, 64, 64, -64, 64, -64, -64, -64, 64, 64, 64, -64, -64, 64, -64, 64, 64, 64, 64, 64, 64, 64, 64, 64, 64, 64, 64, 64, 64, 64, 64, -64, 64, -64, 64, -64, 64, -64, -64, -64, 64, 64, 64, -64, -64, 64, -64, 64, -64, 64, 64, -64, 64, 64, 64, -64, 64, 64, -64, 64, 64, -64, -64, 64, 64, -64, -64, -64, 64, 64, 64, -64, -64, -64, 64, 64, 64, 64, 64, -64, 64, -64, 64, 64, -64, -64, -64, -64, -64, -64, -64, 64, -64, -64, -64, 64, 64, 64, 64, -64, 64, 64, 64, 64, 64, -64, 64, 64, -64, 64, 64, -64, 64, 64, -64, -64, 64, 64, 64, 64, -64, 64, 64, -64, -64, -64, 64, -64, -64, 64, -64, -64, 64, -64, -64, 64, 64, -64, -64, 64, 64, -64, 64, -64, 64, 64, -64, 64, 64, -64, 64, 64, -64, 64, 64, -64, 64, 64, 64, 64, -64, -64, 64, -64, 64, 64, 64, 64, 64, -64, -64, 64, -64, 64, -64, -64, 64, 64, -64, 64, 64, -64, 64, 64, 64, -64, 64, 64, -64, -64, 64, 64, 64, -64, 64, 64, -64, 64, -64, 64, -64, -64, 64, -64, -64, 64, -64, -64, 64, 64, -64, 64, 64, -64, -64, 64, 64, 64, 64, -64, -64, -64, -64, -64, -64, -64, 64, -64, -64, 64, -64, 64, -64, 64, 64, 64, -64, -64, 64, -64, 64, -64, 64, 64, -64, -64, 64, 64, -64, 64, 64, 64, 64, 64, -64, 64, -64, 64, 64, 64, -64, -64, -64, -64, -64, -64, -64, -64, -64, 64, -64, 64, 64, 64, -64, -64, 64, 64, 64, -64, -64, -64, 64, -64, 64, -64, 64, 64, -64, -64, -64, 64, 64, -64, 64, -64, -64, 64, 64, -64, -64, -64, -64, 64, 64, 64, -64, -64, -64, -64, -64, 64, 64, -64, -64, 64, 64, -64, -64, -64, -64, 64, -64, -64, 64, 64, 64, -64, 64, -64, 64, 64, 64, -64, -64, 64, 64, 64, 64, -64, -64, -64, -64, -64, -64, -64, -64, 64, -64, -64, 64, 64, 64, 64, -64, 64, 64, 64, -64, 64, 64, 64, -64, -64, 64, 64, 64, 64, 64, 64, 64, 64, -64, 64, -64, -64, -64, -64, 64, -64, -64, -64, 64, 64, 64, -64, -64, 64, -64, -64, 64, -64, 64, 64, 64, -64, -64, 64, 64, -64, -64, 64, 64, -64, -64, -64, 64, 64, 64, 64, -64, -64, 64, 64, 64, -64, 64, -64, -64, -64, -64, 64, 64, 64, -64, -64, 64, 64, -64, 64, 64, -64, -64, -64, -64, -64, -64, -64, -64, -64, -64, 64, 64, -64, -64, -64, -64, -64, -64, -64, -64, 64, -64, -64, -64, -64, 64, -64, -64, -64, -64, 64, -64, -64, 64, -64, -64, -64, -64, 64, -64, 64, 64, 64, -64, -64, 64, -64, 64, 64, 64, -64, -64, 64, -64, -64, 64, -64, 64, 64, -64, -64, -64, -64, -64, 64, 64, -64, -64, -64, -64, 64, -64, -64, -64, -64, 64, 64, 64, 64, -64, -64, 64, -64, -64, -64, 64, 64, -64, -64, -64, -64, -64, 64, 64, -64, -64, 64, -64, -64, -64, -64, -64, -64, 64, 64, 64, 64, 64, 64, -64, 64, -64, 64, 64, -64, -64, -64, 64, -64, -64, 64, 64, 64, -64, -64, -64, -64, -64, 64, -64, -64, 64, 64, 64, 64, -64, 64, 64, -64, -64, -64, -64, -64, 64, 64, -64, -64, 64, 64, 64, -64, -64, -64, -64, -64, -64, -64, -64, 64, -64, 64, -64, -64, -64, 64, -64, -64, 64, 64, 64, -64, -64, -64, -64, 64, 64, 64, -64, -64, -64, -64, -64, -64, 64, -64, 64, -64, -64, 64, 64, -64, 64, 64, -64, 64, 64, 64, -64, -64, -64, -64, -64, 64, 64, -64, -64, -64, -64, -64, -64, -64, 64, -64, -64, -64, 64, -64, -64, -64, -64, -64, 64, 64, -64, -64, 64, 64, -64, 64, -64, -64, 64, -64, -64, -64, -64, -64, -64, -64, -64, -64, -64, 64, 64, -64, -64, 64, -64, 64, 64, -64, -64, -64, 64, -64, -64, 64, -64, -64, 64, -64, -64, -64, -64, -64, -64, -64, -64, -64, -64, -64, -64, 64, -64, -64, 64, 64, 64, -64, -64, 64, 64, 64, 64, -64, -64, -64, -64, -64, -64, -64, -64, -64, -64, -64, -64, -64, 64, -64, 64, -64, 64, 64, 64, 64, 64, -64, -64, -64, 64, 64, -64, -64, 64, -64, 64, 64, 64, -64, 64, -64, -64, -64, -64, -64, -64, 64, 64, 64, 64, 64, 64, -64, 64, -64, -64, -64, -64, 64, 64, 64, 64, -64, 64, 64, 64, 64, -64, -64, -64, -64, -64, 64, -64, -64, 64, -64, -64, 64, 64, -64, -64, -64, -64, -64, -64, 64, -64, 64, 64, -64, -64, 64, -64, 64, 64, -64, -64, -64, -64, -64, -64, 64, 64, 64, 64, 64, -64, -64, 64, 64, -64, 64, 64, -64, -64, 64, 64, 64, 64, 64, 64, -64, -64, -64, -64, -64, -64, -64, 64, 64, -64, 64, -64, 64, -64, -64, 64, 64, 64, 64, 64, 64, 64, -64, -64, -64, 64, 64, 64, -64, -64, -64, -64, 64, -64, -64, -64, 64, -64, 64, -64, 64, -64, -64, -64, -64, -64, 64, 64, -64, 64, 64, -64, -64, 64, 64, -64, 64, -64, -64, 64, 64, -64, -64, 64, 64, 64, 64, -64, 64, 64, 64, 64, 64, 64, -64, -64, -64, -64, -64, 64, 64, 64, 64, 64, -64, 64, -64, -64, -64, -64, -64, 64, -64, 64, -64, -64, 64, 64, -64, 64, -64, -64, -64, -64, -64, -64, -64, -64, 64, 64, -64, -64, -64, -64, -64, -64, -64, 64, 64, 64, 64, -64, -64, 64, 64, -64, 64, 64, 64, 64, 64, -64, -64, -64, -64, -64, 64, 64, -64, -64, -64, -64, -64, -64, -64, 64, 64, 64, -64, 64, 64, -64, 64, 64, 64, 64, -64, 64, -64, 64, -64, -64, -64, 64, 64, -64, -64, 64, -64, -64, -64, 64, 64, 64, 64, 64, 64, 64, -64, -64, 64, -64, -64, -64, -64, 64, -64, 64, 64, -64, -64, -64, 64, 64, -64, -64, -64, 64, 64, -64, -64, 64, 64, -64, 64, 64, 64, -64, 64, -64, 64, -64, 64, 64, -64, 64, -64, -64, 64, -64, 64, 64, -64, 64, -64, 64, -64, -64, 64, 64, 64, -64, -64, 64, 64, 64, -64, -64, 64, -64, 64, 64, -64, 64, -64, -64, -64, -64, -64, 64, 64, 64, 64, 64, 64, -64, -64, -64, -64, -64, 64, -64, -64, -64, 64, 64, 64, -64, 64, -64, -64, 64, 64, 64, -64, 64, -64, 64, -64, 64, 64, -64, -64, -64, -64, -64, -64, 64, -64, -64, -64, -64, -64, 64, -64, -64, -64, 64, -64, 64, -64, 64, -64, 64, -64, -64, -64, -64, 64, -64, -64, -64, -64, -64, -64, -64, -64, -64, -64, 64, -64, -64, 64, -64, -64, 64, 64, 64, -64, 64, 64, 64, 64, -64, -64, -64, -64, -64, -64, -64, -64, -64, -64, -64, -64, -64, -64, -64, 64, -64, -64, 64, -64, -64, 64, 64, -64, 64, 64, -64, -64, -64, 64, -64, 64, 64, -64, -64, -64, -64, -64, -64, -64, -64, -64, -64, -64, -64, -64, 64, -64, -64, -64, 64, 64, -64, -64, -64, -64, -64, -64, -64, 64, 64, 64, 64, 64, -64, -64, -64, -64, -64, -64, -64, -64, -64, -64, -64, 64, -64, -64, 64, -64, -64, -64, -64, -64, -64, 64, 64, 64, 64, 64, 64, 64, 64, -64, -64, -64, -64, 64, 64, -64, 64, 64, -64, 64, -64, -64, -64, -64, -64, -64, -64, -64, 64, 64, 64, 64, 64, 64, 64, 64, 64, 64, 64, -64, -64, -64, -64, -64, -64, -64, -64, 64, 64, -64, -64, -64, -64, -64, -64, 64, 64, 64, 64, 64, -64, 64, 64, 64, 64, 64, -64, -64, 64, -64, -64, -64, -64, 64, 64, 64, -64, -64, 64, -64, 64, -64, -64, -64, -64, 64, -64, -64, -64, -64, 64, 64, 64, 64, 64, 64, 64, -64, -64, -64, -64, -64, 64, -64, 64, 64, -64, -64, 64, -64, -64, -64, -64, -64, -64, -64, -64, -64, -64, -64, 64, -64, 64, -64, 64, -64, -64, -64, -64, -64, -64, 64, -64, -64, 64, -64, 64, 64, 64, -64, -64, -64, -64, -64, -64, -64, 64, -64, -64, 64, 64, -64, -64, -64, -64, -64, -64, 64, -64, 64, 64, 64, -64, 64, -64, -64, -64, -64, 64, -64, -64, 64, -64, 64, -64, -64, 64, -64, 64, 64, -64, 64, 64, 64, 64, 64, -64, 64, -64, -64, 64, -64, -64, -64, -64, 64, -64, -64, -64, -64, -64, -64, 64, -64, -64, -64, -64, -64, -64, -64, -64, 64, 64, 64, -64, -64, 64, -64, -64, 64, -64, -64, -64, -64, 64, -64, -64, -64, 64, 64, 64, 64, -64, -64, -64, -64, -64, -64, 64, 64, 64, -64, -64, 64, -64, -64, 64, -64, -64, -64, 64, -64, -64, 64, 64, -64, -64, -64, 64, 64, -64, -64, -64, -64, -64, -64, 64, -64, 64, 64, -64, -64, -64, 64, 64, -64, -64, -64, -64, 64, -64, 64, 64, -64, -64, 64, -64, -64, -64, -64, -64, -64, -64, -64, -64, -64, 64, 64, 64, -64, 64, -64, -64, -64, -64, -64, -64, 64, 64, 64, 64, 64, 64, 64, -64, -64, -64, -64, -64, -64, -64, -64, -64, -64, 64, 64, -64, 64, -64, 64, -64, -64, 64, -64, -64, -64, -64, -64, 64, 64, -64, -64, 64, -64, -64, -64, -64, -64, -64, -64, -64, -64, 64, -64, 64, -64, 64, -64, -64, -64, 64, -64, -64, -64, -64, 64, -64, -64, -64, -64, 64, 64, -64, -64, -64, -64, -64, 64, -64, 64, 64, -64, -64, -64, -64, 64, -64, 64, 64, 64, -64, -64, -64, -64, 64, -64, -64, 64, 64, -64, -64, -64, -64, -64, 64, 64, -64, -64, -64, -64, 64, -64, 64, 64, 64, 64, 64, 64, 64, 64, -64, -64, -64, -64, 64, -64, -64, 64, 64, -64, -64, -64, 64, -64, -64, -64, -64, 64, 64, 64, -64, 64, 64, 64, 64, 64, 64, -64, -64, 64, 64, -64, 64, -64, -64, -64, -64, -64, 64, 64, 64, 64, 64, -64, -64, 64, -64, 64, -64, 64, 64, 64, 64, -64, 64, 64, 64, -64, 64, -64, 64, -64, -64, -64, 64, 64, 64, 64, 64, 64, -64, 64, 64, -64, 64, 64, -64, 64, 64, 64, -64, -64, 64, 64, 64, 64, 64, -64, 64, 64, 64, -64, 64, -64, 64, 64, 64, 64, 64, -64, -64, -64, 64, -64, 64, -64, 64, 64, 64, -64, 64, 64, 64, 64, 64, 64, 64, -64, 64, 64, 64, 64, -64, -64, -64, 64, -64, -64, -64, 64, -64, 64, -64, -64, 64, -64, 64, 64, 64, -64, -64, -64, -64, -64, 64, -64, -64, -64, -64, -64, 64, -64, 64, -64, -64, -64, 64, -64, 64, -64, -64, 64, 64, -64, -64, -64, -64, -64, -64, -64, 64, -64, 64, -64, 64, 64, 64, -64, -64, -64, -64, -64, 64, -64, -64, -64, 64, -64, -64, -64, -64, 64, -64, 64, -64, 64, 64, 64, 64, 64, -64, 64, -64, 64, 64, 64, -64, 64, -64, -64, 64, 64, 64, 64, -64, -64, 64, -64, 64, -64, 64, 64, -64, -64, 64, -64, -64, 64, -64, -64, -64, -64, -64, -64, -64, -64, -64, 64, -64, -64, 64, -64, 64, -64, -64, 64, -64, 64, 64, 64, 64, -64, -64, 64, -64, 64, -64, -64, -64, 64, -64, -64, -64, -64, -64, -64, -64, -64, -64, 64, 64, -64, 64, 64, 64, 64, 64, 64, 64, -64, -64, -64, -64, -64, -64, -64, 64, -64, -64, -64, -64, 64, -64, -64, 64, -64, -64, -64, -64, 64, 64, 64, 64, 64, -64, 64, 64, 64, -64, 64, 64, 64, 64, 64, 64, -64, -64, -64, -64, 64, 64, 64, 64, 64, -64, -64, -64, -64, 64, -64, -64, 64, 64, -64, 64, 64, -64, -64, 64, 64, -64, -64, 64, -64, -64, -64, 64, 64, 64, 64, 64, 64, 64, 64, -64, 64, -64, -64, 64, 64, 64, -64, -64, -64, -64, -64, -64, 64, -64, -64, -64, 64, -64, -64, -64, 64, 64, 64, 64, 64, -64, -64, 64, -64, -64, 64, 64, 64, -64, 64, -64, -64, -64, -64, 64, 64, -64, -64, -64, -64, -64, -64, 64, 64, 64, 64, 64, 64, -64, 64, 64, 64, -64, -64, -64, 64, -64, -64, -64, 64, -64, 64, 64, -64, 64, -64, -64, -64, -64, -64, 64, 64, 64, 64, 64, 64, 64, -64, -64, -64, -64, 64, -64, 64, 64, -64, -64, -64, -64, 64, 64, 64, 64, -64, -64, -64, -64, -64, 64, 64, -64, 64, 64, 64, -64, -64, 64, 64, -64, -64, -64, 64, -64, 64, -64, -64, 64, 64, 64, 64, -64, -64, -64, -64, -64, -64, -64, -64, -64, 64, 64, 64, -64, -64, 64, 64, -64, -64, -64, -64, 64, 64, 64, -64, -64, 64, 64, 64, -64, -64, -64, -64, 64, -64, -64, -64, -64, -64, -64, -64, -64, -64, -64, 64, -64, 64, -64, 64, 64, -64, 64, -64, 64, 64, 64, 64, -64, -64, -64, -64, -64, -64, -64, -64, -64, -64, -64, -64, -64, -64, -64, 64, 64, -64, -64, 64, 64, 64, 64, 64, 64, 64, 64, 64, -64, 64, -64, 64, -64, -64, -64, 64, 64, -64, -64, -64, -64, -64, 64, -64, 64, 64, -64, 64, 64, 64, 64, 64, 64, 64, 64, -64, 64, -64, 64, -64, 64, -64, -64, -64, 64, -64, -64, -64, -64, 64, -64, 64, -64, 64, 64, 64, -64, -64, 64, 64, 64, -64, -64, -64, -64, 64, 64, 64, 64, -64, -64, -64, 64, -64, -64, -64, 64, -64, 64, -64, -64, -64, 64, -64, -64, -64, -64, -64, -64, -64, -64, -64, -64, 64, 64, 64, 64, 64, 64, -64, -64, -64, -64, 64, 64, -64, -64, 64, -64, -64, -64, -64, -64, -64, -64, -64, -64, -64, -64, -64, 64, 64, 64, 64, 64, 64, 64, -64, -64, -64, -64, -64, -64, 64, 64, -64, -64, 64, -64, -64, -64, -64, -64, -64, -64, -64, -64, -64, 64, 64, 64, 64, -64, 64, 64, 64, -64, 64, -64, 64, -64, 64, -64, -64, 64, 64, 64, -64, -64, -64, -64, -64, -64, -64, -64, -64, 64, 64, 64, -64, 64, 64, 64, 64, 64, 64, 64, -64, -64, 64, 64, -64, 64, -64, 64, -64, -64, -64, -64, 64, -64, -64, 64, -64, 64, 64, 64, 64, -64, -64, 64, -64, 64, 64, 64, 64, 64, -64, 64, -64, 64, 64, 64, -64, -64, -64, 64, -64, -64, 64, 64, 64, 64, 64, 64, 64, -64, -64, -64, 64, -64, 64, 64, -64, 64, 64, 64, 64, 64, 64, 64, 64, 64, -64, 64, 64, 64, 64, 64, 64, 64, 64, 64, -64, -64, -64, -64, 64, -64, 64, 64, -64, 64, -64, 64, 64, 64, 64, 64, 64, 64, 64, 64, 64, 64, 64, 64, 64, 64, -64, -64, -64, -64, -64, 64, -64, 64, 64, 64, -64, 64, 64, 64, 64, -64, 64, -64, -64, 64, 64, 64, 64, -64, 64, -64, -64, -64, -64, -64, -64, 64, -64, 64, 64, 64, 64, 64, -64, -64, -64, 64, 64, 64, -64, 64, -64, -64, 64, 64, 64, -64, 64, -64, -64, -64, -64, -64, -64, -64, -64, 64, -64, -64, 64, 64, -64, -64, -64, 64, 64, 64, 64, 64, 64, 64, -64, 64, -64, -64, -64, 64, 64, 64, 64, -64, 64, -64, -64, 64, 64, -64, -64, 64, 64, -64, 64, 64, -64, -64, -64, 64, -64, 64, 64, 64, -64, -64, -64, -64, 64, -64, 64, -64, 64, -64, 64, -64, 64, -64, 64, 64, -64, -64, 64, -64, -64, 64, -64, 64, 64, 64, 64, -64, -64, -64, -64, -64, 64, 64, -64, -64, 64, -64, 64, 64, -64, 64, -64, -64, -64, 64, 64, -64, -64, -64, -64, 64, 64, 64, 64, -64, -64, -64, -64, -64, -64, -64, 64, 64, 64, 64, 64, 64, 64, 64, -64, -64, 64, 64, 64, 64, -64, -64, -64, -64, -64, -64, -64, -64, -64, -64, -64, -64, -64, 64, 64, 64, -64, -64, -64, -64, 64, 64, -64, -64, -64, 64, -64, -64, -64, 64, -64, 64, 64, -64, -64, -64, -64, -64, 64, -64, 64, 64, 64, -64, -64, -64, -64, -64, 64, -64, -64, -64, -64, 64, -64, 64, 64, -64, -64, 64, -64, -64, 64, -64, 64, 64, 64, 64, -64, -64, -64, -64, -64, -64, -64, -64, -64, -64, 64, 64, 64, -64, 64, -64, -64, 64, -64, -64, -64, -64, -64, -64, 64, 64, 64, 64, -64, -64, -64, -64, -64, -64, 64, -64, 64, -64, 64, 64, -64, 64, -64, 64, -64, -64, 64, 64, 64, -64, -64, 64, 64, 64, 64, 64, 64, -64, -64, -64, -64, -64, -64, -64, -64, 64, -64, 64, -64, -64, -64, 64, 64, -64, 64, 64, -64, 64, 64, 64, 64, 64, 64, 64, -64, -64, 64, 64, -64, -64, 64, -64, 64, 64, -64, 64, -64, -64, -64, 64, -64, -64, 64, 64, -64, 64, 64, 64, 64, -64, -64, 64, -64, -64, -64, 64, 64, 64, -64, -64, -64, -64, 64, 64, 64, 64, -64, 64, 64, -64, 64, 64, -64, 64, 64, 64, 64, -64, -64, -64, -64, -64, 64, -64, 64, 64, 64, -64, -64, -64, -64, 64, 64, 64, 64, -64, -64, 64, 64, 64, 64, 64, 64, 64, -64, -64, -64, -64, -64, -64, 64, -64, -64, -64, 64, -64, -64, -64, 64, 64, 64, -64, 64, -64, -64, -64, 64, 64, 64, 64, 64, 64, 64, -64, -64, -64, -64, -64, -64, -64, -64, -64, -64, 64, 64, 64, 64, -64, -64, -64, -64, 64, -64, -64, 64, 64, 64, 64, 64, 64, 64, -64, -64, -64, -64, -64, -64, -64, -64, -64, -64, 64, 64, 64, 64, -64, -64, -64, 64, -64, -64, -64, 64, 64, 64, -64, -64, 64, -64, -64, 64, -64, 64, -64, -64, -64, 64, 64, 64, 64, 64, 64, -64, -64, -64, -64, -64, -64, 64, -64, 64, 64, 64, 64, 64, -64, -64, 64, 64, 64, 64, -64, 64, 64, 64, 64, 64, -64, 64, 64, -64, -64, -64, -64, -64, 64, 64, 64, 64, 64, 64, 64, -64, 64, 64, -64, -64, 64, -64, -64, -64, -64, -64, 64, 64, 64, -64, -64, -64, 64, -64, -64, -64, 64, 64, -64, 64, -64, 64, 64, 64, 64, -64, -64, 64, -64, 64, -64, -64, -64, 64, 64, 64, 64, -64, -64, -64, 64, -64, -64, -64, -64, 64, -64, -64, -64, -64, 64, 64, 64, 64, -64, 64, -64, -64, -64, 64, -64, -64, -64, 64, 64, -64, -64, 64, 64, 64, 64, -64, 64, -64, 64, -64, -64, 64, -64, -64, 64, 64, 64, 64, -64, -64, -64, -64, -64, -64, -64, 64, 64, -64, -64, 64, 64, -64, -64, 64, 64, -64, -64, -64, 64, -64, -64, -64, -64, -64, 64, -64, -64, -64, -64, -64, -64, -64, -64, 64, 64, 64, -64, 64, -64, -64, -64, 64, 64, -64, 64, 64, 64, -64, -64, -64, -64, -64, -64, -64, -64, -64, -64, -64, -64, -64, -64, 64, 64, 64, 64, 64, 64, -64, -64, 64, -64, 64, -64, -64, -64, -64, -64, -64, -64, -64, -64, -64, -64, -64, -64, -64, -64, -64, -64, 64, 64, 64, 64, 64, 64, 64, -64, 64, -64, -64, -64, -64, -64, -64, 64, -64, -64, -64, -64, 64, -64, -64, -64, 64, -64, -64, -64, 64, 64, 64, 64, 64, 64, -64, -64, -64, 64, -64, -64, -64, -64, 64, -64, 64, -64, 64, -64, -64, -64, -64, 64, -64, -64, -64, 64, 64, 64, 64, 64, 64, 64, -64, -64, -64, 64, 64, -64, 64, 64, 64, -64, -64, -64, 64, -64, -64, 64, 64, -64, -64, -64, 64, -64, 64, 64, 64, 64, 64, 64, 64, -64, 64, 64, -64, 64, 64, 64, 64, -64, -64, -64, 64, 64, -64, 64, 64, -64, -64, -64, -64, -64, 64, 64, -64, 64, -64, -64, -64, 64, -64, -64, -64, -64, -64, 64, 64, 64, 64, -64, 64, 64, 64, -64, -64, 64, -64, -64, -64, 64, 64, 64, 64, -64, 64, 64, -64, 64, -64, 64, -64, 64, 64, 64, -64, 64, -64, -64, 64, 64, -64, 64, 64, 64, 64, -64, -64, 64, -64, -64, -64, -64, -64, -64, 64, -64, -64, -64, -64, -64, -64, 64, 64, -64, -64, -64, -64, -64, 64, -64, 64, 64, 64, -64, -64, 64, 64, -64, -64, 64, 64, 64, -64, -64, 64, -64, 64, -64, -64, -64, 64, 64, 64, -64, -64, -64, -64, -64, -64, -64, 64, -64, 64, 64, 64, -64, -64, 64, -64, 64, -64, -64, 64, 64, 64, -64, 64, -64, -64, 64, -64, -64, 64, -64, -64, -64, 64, 64, -64, 64, 64, 64, -64, -64, -64, -64, -64, -64, -64, 64, 64, 64, 64, -64, 64, 64, -64, 64, -64, 64, 64, -64, 64, 64, -64, -64, -64, 64, -64, -64, -64, -64, -64, 64, -64, 64, -64, -64, 64, 64, -64, 64, 64, 64, -64, 64, -64, 64, 64, 64, 64, -64, -64, 64, 64, 64, -64, 64, -64, 64, -64, -64, -64, -64, -64, -64, -64, 64, 64, 64, 64, -64, -64, -64, 64, 64, 64, 64, 64, 64, 64, -64, 64, -64, -64, 64, -64, 64, -64, -64, -64, -64, -64, -64, 64, -64, 64, 64, 64, 64, 64, 64, 64, 64, 64, 64, 64, 64, 64, -64, 64, -64, -64, -64, -64, -64, -64, -64, -64, -64, -64, -64, 64, 64, 64, 64, 64, 64, 64, 64, 64, 64, 64, 64, 64, -64, 64, 64, -64, 64, 64, 64, 64, 64, -64, -64, -64, -64, -64, -64, -64, -64, 64, 64, 64, 64, 64, 64, 64, -64, 64, -64, 64, 64, -64, 64, 64, 64, 64, 64, -64, -64, 64, -64, -64, -64, -64, -64, -64, -64, 64, 64, 64, 64, 64, 64, 64, 64, 64, -64, -64, 64, 64, 64, 64, 64, 64, 64, 64, 64, 64, 64, -64, -64, -64, -64, 64, 64, 64, 64, 64, 64, 64, 64, -64, -64, 64, 64, -64, -64, -64, -64, 64, 64, 64, 64, 64, 64, -64, 64, -64, -64, -64, 64, -64, 64, -64, 64, -64, 64, 64, 64, -64, 64, -64, -64, -64, -64, -64, -64, -64, -64, 64, 64, 64, 64, 64, -64, -64, -64, -64, -64, -64, -64, -64, 64, 64, 64, 64, -64, 64, 64, -64, -64, -64, -64, -64, -64, -64, -64, -64, 64, 64, 64, 64, 64, -64, -64, -64, 64, 64, 64, 64, 64, 64, 64, 64, 64, 64, 64, -64, 64, -64, 64, -64, 64, 64, 64, -64, 64, 64, 64, -64, 64, 64, -64, -64, 64, -64, -64, 64, 64, 64, 64, 64, 64, 64, 64, 64, 64, 64, 64, 64, 64, 64, 64, 64, -64, -64, -64, -64, 64, -64, 64, 64, -64, 64, -64, 64, 64, 64, 64, -64, 64, 64, 64, 64, 64, 64, 64, 64, 64, 64, -64, -64, 64, 64, -64, 64, -64, 64, 64, 64, 64, 64, 64, 64, -64, -64, -64, 64, 64, 64, 64, 64, 64, 64, 64, 64, 64, 64, 64, -64, 64, -64, -64, 64, 64, 64, 64, 64, -64, 64, -64, 64, 64, 64, -64, -64, -64, -64, 64, 64, 64, 64, 64, 64, 64, 64, 64, -64, -64, -64, 64, 64, 64, 64, 64, 64, -64, 64, -64, 64, 64, -64, -64, -64, -64, 64, 64, 64, 64, 64, 64, 64, 64, 64, -64, -64, -64, 64, -64, 64, 64, 64, 64, 64, 64, 64, -64, -64, -64, -64, -64, -64, -64, 64, -64, -64, 64, 64, 64, 64, 64, 64, -64, -64, 64, -64, 64, 64, 64, 64, 64, 64, 64, 64, -64, -64, -64, -64, -64, -64, 64, -64, -64, -64, -64, -64, -64, 64, 64, -64, -64, -64, 64, 64, 64, 64, 64, 64, 64, 64, -64, -64, 64, 64, 64, 64, 64, 64, 64, -64, -64, -64, -64, -64, -64, 64, -64, 64, 64, 64, 64, 64, 64, 64, 64, 64, 64, 64, 64, 64, -64, -64, -64, -64, 64, 64, 64, -64, -64, -64, -64, -64, 64, -64, -64, -64, -64, -64, -64, 64, 64, 64, 64, 64, 64, 64, 64, 64, -64, -64, 64, -64, -64, -64, -64, -64, -64, -64, -64, -64, 64, -64, -64, 64, -64, -64, 64, 64, 64, 64, 64, 64, 64, -64, -64, 64, 64, 64, -64, 64, 64, -64, -64, -64, -64, -64, 64, -64, -64, -64, -64, 64, 64, 64, 64, 64, 64, 64, 64, 64, 64, -64, 64, 64, -64, 64, -64, 64, 64, -64, -64, 64, 64, -64, -64, -64, -64, 64, -64, -64, 64, 64, -64, 64, -64, -64, -64, 64, -64, -64, -64, -64, 64, 64, 64, 64, -64, 64, -64, -64, 64, 64, 64, -64, 64, -64, 64, 64, 64, 64, -64, 64, -64, -64, -64, -64, 64, 64, 64, 64, 64, -64, -64, 64, -64, 64, -64, 64, -64, -64, 64, 64, -64, 64, 64, 64, -64, -64, 64, -64, -64, 64, 64, -64, 64, 64, -64, -64, -64, -64, 64, 64, -64, 64, -64, 64, -64, -64, -64, -64, -64, -64, -64, 64, 64, 64, 64, -64, -64, -64, -64, -64, 64, 64, -64, 64, -64, 64, -64, -64, 64, 64, -64, -64, -64, -64, -64, -64, 64, -64, -64, 64, 64, 64, -64, 64, 64, 64, -64, -64, 64, 64, -64, 64, -64, -64, 64, 64, 64, -64, 64, -64, -64, -64, -64, -64, -64, -64, -64, 64, -64, 64, -64, -64, -64, -64, -64, -64, -64, -64, 64, 64, 64, -64, -64, 64, -64, -64, -64, -64, -64, -64, -64, -64, 64, 64, -64, -64, 64, 64, -64, -64, -64, -64, -64, -64, -64, -64, -64, -64, -64, 64, -64, -64, -64, -64, -64, -64, 64, -64, -64, -64, -64, -64, -64, -64, 64, 64, 64, -64, -64, -64, 64, -64, 64, -64, 64, 64, -64, -64, -64, -64, -64, -64, -64, 64, 64, -64, -64, -64, -64, -64, -64, -64, 64, 64, -64, -64, -64, -64, -64, -64, 64, -64, 64, -64, -64, -64, -64, -64, -64, -64, -64, -64, 64, -64, -64, 64, -64, -64, -64, -64, -64, 64, -64, -64, -64, -64, 64, 64, 64, 64, 64, -64, 64, 64, -64, -64, -64, -64, -64, -64, -64, 64, -64, -64, -64, -64, -64, -64, 64, 64, -64, -64, 64, -64, 64, 64, -64, 64, -64, 64, 64, -64, -64, 64, -64, 64, -64, 64, 64, -64, 64, -64, -64, -64, 64, 64, -64, -64, -64, -64, 64, -64, -64, 64, -64, -64, -64, 64, 64, 64, -64, -64, -64, 64, -64, 64, 64, 64, -64, -64, -64, -64, 64, 64, -64, 64, -64, -64, 64, 64, -64, 64, -64, 64, -64, -64, -64, -64, -64, -64, -64, -64, -64, 64, 64, 64, -64, -64, -64, -64, -64, 64, 64, 64, -64, 64, -64, -64, -64, 64, -64, 64, 64, -64, 64, -64, 64, -64, -64, -64, 64, 64, 64, 64, -64, -64, -64, -64, -64, -64, 64, 64, -64, 64, 64, -64, -64, -64, -64, 64, 64, -64, -64, 64, 64, 64, 64, 64, -64, 64, 64, 64, 64, 64, 64, -64, 64, 64, 64, 64, 64, 64, -64, -64, -64, -64, 64, 64, 64, 64, 64, 64, -64, 64, 64, -64, 64, 64, 64, 64, 64, 64, 64, 64, -64, 64, 64, 64, 64, 64, -64, -64, -64, 64, 64, 64, -64, 64, -64, 64, 64, 64, 64, 64, 64, 64, 64, 64, 64, 64, 64, 64, 64, 64, 64, 64, 64, 64, -64, -64, -64, 64, 64, -64, 64, 64, 64, -64, 64, -64, -64, 64, 64, 64, 64, 64, 64, 64, 64, 64, 64, 64, 64, 64, -64, 64, -64, 64, 64, 64, 64, -64, 64, 64, 64, -64, 64, -64, -64, 64, 64, 64, -64, 64, -64, 64, 64, 64, 64, 64, -64, 64, -64, 64, 64, 64, 64, 64, 64, 64, 64, 64, 64, -64, 64, -64, 64, 64, 64, 64, 64, 64, 64, -64, -64, -64, 64, 64, -64, -64, 64, 64, 64, 64, 64, 64, 64, -64, -64, -64, 64, 64, 64, -64, 64, -64, -64, 64, 64, -64, -64, -64, -64, -64, -64, -64, -64, -64, 64, 64, 64, -64, -64, -64, -64, 64, -64, -64, 64, -64, 64, 64, -64, -64, -64, -64, -64, -64, -64, -64, -64, -64, -64, -64, -64, 64, 64, -64, -64, -64, -64, -64, -64, -64, 64, -64, 64, -64, -64, -64, -64, -64, -64, -64, -64, -64, -64, -64, -64, -64, -64, -64, -64, -64, -64, 64, -64, 64, -64, -64, -64, -64, 64, -64, -64, -64, -64, -64, -64, -64, -64, -64, -64, -64, -64, -64, -64, -64, -64, -64, -64, -64, 64, 64, -64, 64, 64, -64, -64, 64, 64, -64, -64, 64, -64, -64, -64, -64, -64, -64, 64, -64, -64, -64, -64, -64, -64, -64, -64, -64, 64, 64, 64, 64, 64, -64, -64, -64, -64, 64, -64, -64, -64, -64, -64, -64, -64, 64, 64, -64, -64, -64, -64, -64, -64, -64, -64, -64, 64, 64, 64, 64, 64, -64, -64, -64, -64, -64, 64, -64, 64, 64, 64, 64, 64, 64, 64, -64, -64, -64, -64, -64, -64, -64, 64, 64, -64, 64, 64, -64, 64, 64, 64, 64, 64, -64, -64, 64, 64, 64, 64, 64, 64, -64, 64, -64, -64, -64, -64, -64, -64, 64, -64, -64, 64, 64, 64, 64, 64, 64, -64, -64, 64, 64, 64, -64, -64, -64, -64, -64, -64, -64, -64, -64, 64, -64, -64, -64, -64, -64, -64, 64, -64, 64, -64, -64, 64, -64, 64, 64, 64, 64, -64, -64, -64, -64, 64, 64, 64, 64, 64, 64, -64, 64, -64, 64, -64, 64, -64, -64, -64, 64, -64, 64, -64, 64, -64, -64, -64, 64, 64, -64, 64, -64, -64, -64, -64, 64, -64, 64, 64, -64, -64, -64, -64, 64, -64, -64, -64, -64, -64, -64, 64, -64, -64, -64, -64, 64, 64, -64, 64, -64, 64, 64, -64, -64, 64, 64, -64, 64, -64, -64, -64, -64, 64, 64, 64, -64, 64, 64, 64, 64, -64, 64, -64, -64, 64, -64, -64, -64, 64, -64, -64, 64, -64, -64, 64, -64, -64, 64, 64, 64, -64, 64, 64, 64, 64, 64, -64, 64, -64, 64, 64, -64, 64, -64, -64, -64, 64, -64, 64, 64, -64, 64, 64, -64, -64, -64, -64, 64, 64, -64, 64, 64, -64, -64, -64, 64, -64, -64, -64, -64, -64, 64, -64, 64, -64, -64, -64, 64, 64, -64, -64, 64, 64, -64, -64, 64, 64, -64, 64, 64, 64, -64, -64, -64, 64, 64, 64, -64, 64, -64, -64, -64, -64, -64, -64, 64, -64, -64, -64, 64, -64, -64, -64, 64, -64, -64, 64, -64, 64, -64, 64, 64, 64, 64, 64, -64, 64, -64, 64, 64, -64, 64, -64, -64, -64, 64, -64, 64, 64, -64, 64, -64, -64, -64, -64, 64, -64, -64, -64, 64, 64, 64, -64, 64, 64, -64, -64, 64, -64, 64, -64, -64, -64, -64, -64, -64, -64, -64, -64, 64, -64, -64, -64, -64, -64, -64, 64, -64, -64, 64, -64, -64, 64, -64, 64, 64, 64, -64, 64, -64, 64, -64, 64, 64, 64, -64, 64, -64, 64, 64, 64, -64, 64, -64, -64, 64, -64, -64, -64, -64, -64, -64, -64, -64, -64, -64, -64, -64, -64, -64, 64, -64, -64, -64, -64, -64, -64, -64, -64, -64, -64, 64, 64, 64, -64, 64, -64, -64, 64, -64, -64, 64, -64, -64, -64, -64, 64, 64, -64, -64, 64, 64, -64, -64, 64, 64, 64, -64, 64, -64, -64, -64, -64, 64, 64, 64, -64, -64, 64, -64, 64, 64, -64, 64, 64, -64, -64, 64, -64, -64, 64, -64, 64, -64, -64, -64, -64, -64, 64, -64, -64, -64, -64, -64, 64, 64, -64, 64, 64, -64, -64, 64, -64, 64, -64, -64, -64, -64, -64, 64, -64, -64, 64, -64, 64, 64, -64, -64, 64, 64, -64, 64, 64, -64, 64, -64, -64, -64, -64, -64, -64, 64, -64, -64, -64, 64, -64, -64, 64, 64, -64, 64, -64, -64, 64, 64, 64, 64, 64, -64, -64, -64, -64, 64, -64, 64, -64, 64, -64, 64, -64, 64, -64, -64, 64, -64, -64, -64, 64, -64, 64, 64, -64, 64, 64, -64, -64, 64, 64, -64, -64, 64, -64, 64, -64, 64, -64, -64, 64, -64, -64, 64, 64, 64, -64, -64, -64, -64, -64, -64, 64, -64, -64, -64, 64, -64, 64, -64, 64, 64, 64, 64, 64, -64, -64, -64, 64, -64, 64, 64, -64, -64, -64, -64, -64, -64, -64, 64, 64, -64, -64, -64, 64, -64, -64, 64, -64, -64, 64, 64, -64, -64, -64, 64, -64, -64, -64, -64, -64, 64, 64, 64, 64, 64, 64, -64, -64, -64, 64, 64, 64, -64, 64, 64, -64, 64, 64, -64, -64, -64, -64, -64, -64, 64, -64, -64, -64, -64, 64, 64, -64, 64, -64, 64, -64, 64, -64, 64, 64, 64, 64, 64, 64, 64, -64, -64, 64, 64, -64, -64, -64, 64, 64, 64, -64, 64, -64, -64, 64, -64, -64, -64, 64, 64, -64, 64, -64, 64, 64, -64, -64, -64, 64, -64, 64, 64, -64, -64, -64, 64, -64, -64, -64, 64, -64, 64, 64, -64, -64, -64, -64, 64, -64, 64, -64, -64, -64, -64, 64, -64, -64, -64, -64, -64, 64, -64, -64, -64, 64, -64, 64, -64, -64, 64, -64, -64, -64, 64, 64, -64, -64, -64, 64, -64, -64, 64, 64, -64, -64, -64, 64, -64, -64, 64, -64, -64, -64, 64, 64, -64, 64, -64, 64, 64, 64, 64, -64, 64, -64, 64, -64, 64, -64, -64, -64, -64, -64, 64, -64, -64, 64, -64, -64, -64, -64, 64, -64, -64, 64, -64, 64, -64, -64, 64, -64, 64, -64, 64, 64, 64, -64, 64, 64, 64, 64, 64, -64, 64, 64, 64, 64, -64, -64, -64, 64, -64, -64, 64, -64, 64, -64, 64, 64, 64, -64, -64, 64, -64, -64, 64, 64, -64, 64, 64, 64, 64, -64, -64, -64, -64, 64, -64, 64, -64, -64, 64, 64, 64, 64, 64, -64, 64, -64, -64, 64, -64, -64, -64, 64, 64, -64, -64, 64, 64, -64, -64, 64, -64, 64, 64, -64, 64, -64, 64, -64, 64, -64, 64, -64, -64, -64, 64, -64, 64, -64, -64, -64, 64, -64, -64, -64, -64, 64, -64, 64, -64, -64, -64, -64, -64, -64, -64, -64, 64, 64, 64, -64, -64, -64, 64, -64, -64, 64, -64, 64, 64, 64, 64, 64, 64, 64, -64, -64, 64, 64, 64, -64, -64, 64, -64, -64, -64, -64, 64, -64, -64, 64, -64, 64, 64, 64, -64, 64, -64, 64, 64, -64, 64, 64, 64, -64, 64, -64, -64, 64, -64, 64, 64, -64, 64, 64, 64, -64, -64, 64, -64, 64, 64, 64, 64, 64, 64, -64, 64, 64, 64, -64, 64, 64, 64, -64, 64, -64, -64, -64, -64, -64, -64, -64, -64, -64, 64, -64, 64, -64, 64, -64, -64, 64, -64, 64, -64, 64, 64, 64, 64, 64, 64, 64, 64, -64, -64, 64, -64, 64, -64, 64, -64, 64, 64, -64, 64, -64, 64, 64, 64, -64, -64, -64, -64, -64, 64, 64, 64, 64, 64, 64, 64, 64, 64, 64, 64, 64, 64, 64, 64, 64, 64, 64, -64, -64, -64, 64, -64, -64, -64, -64, -64, -64, -64, 64, 64, 64, 64, 64, 64, 64, 64, 64, 64, -64, -64, 64, 64, -64, -64, -64, 64, -64, 64, -64, -64, -64, -64, -64, -64, -64, -64, -64, -64, 64, 64, 64, 64, 64, 64, 64, 64, -64, -64, -64, -64, -64, -64, 64, 64, 64, 64, -64, 64, -64, -64, -64, -64, -64, -64, 64, 64, -64, 64, -64, 64, 64, -64, 64, 64, -64, -64, -64, -64, -64, -64, -64, -64, -64, 64, -64, -64, -64, 64, -64, 64, -64, -64, 64, 64, 64, -64, -64, -64, -64, -64, -64, -64, -64, -64, -64, -64, -64, -64, -64, -64, -64, -64, 64, -64, -64, 64, -64, -64, 64, 64, -64, -64, -64, -64, -64, -64, -64, -64, -64, -64, 64, -64, -64, -64, -64, -64, -64, -64, -64, -64, -64, -64, -64, 64, -64, -64, -64, -64, -64, -64, -64, -64, -64, -64, -64, -64, -64, -64, 64, 64, 64, 64, -64, -64, -64, -64, -64, 64, -64, -64, -64, -64, 64, 64, 64, -64, -64, -64, -64, 64, -64, -64, -64, 64, 64, -64, 64, 64, 64, -64, -64, -64, -64, -64, -64, 64, -64, 64, 64, -64, -64, -64, -64, -64, -64, -64, -64, 64, 64, 64, 64, 64, 64, 64, 64, -64, 64, 64, 64, 64, -64, 64, 64, -64, -64, -64, -64, -64, -64, -64, -64, 64, -64, 64, 64, 64, 64, -64, 64, 64, 64, 64, 64, -64, -64, 64, 64, -64, -64, 64, 64, 64, -64, 64, -64, -64, -64, -64, -64, 64, 64, 64, 64, -64, -64, 64, 64, 64, 64, 64, 64, 64, 64, 64, 64, 64, 64, 64, 64, -64, 64, 64, -64, -64, -64, 64, 64, 64, 64, 64, 64, -64, -64, -64, 64, 64, 64, -64, 64, 64, -64, 64, 64, -64, 64, -64, 64, -64, -64, -64, -64, -64, -64, -64, 64, 64, 64, 64, 64, -64, -64, -64, 64, 64, 64, 64, 64, 64, -64, -64, 64, 64, 64, 64, -64, 64, -64, 64, -64, 64, -64, -64, 64, 64, 64, 64, 64, 64, 64, -64, 64, 64, 64, 64, -64, -64, -64, -64, -64, 64, 64, 64, 64, -64, 64, -64, -64, -64, -64, 64, -64, -64, 64, -64, 64, 64, -64, -64, -64, -64, 64, 64, -64, -64, -64, -64, 64, 64, 64, 64, -64, -64, 64, 64, -64, 64, -64, 64, 64, -64, 64, 64, 64, -64, -64, -64, 64, 64, 64, -64, -64, -64, -64, 64, 64, 64, 64, -64, -64, 64, -64, -64, -64, 64, 64, 64, 64, 64, 64, 64, 64, 64, 64, 64, 64, -64, -64, -64, 64, 64, 64, 64, 64, 64, -64, 64, 64, 64, 64, 64, -64, 64, 64, 64, 64, 64, -64, -64, 64, 64, 64, -64, 64, -64, 64, -64, 64, 64, 64, 64, 64, 64, -64, -64, 64, 64, 64, -64, 64, -64, 64, 64, -64, 64, 64, -64, -64, -64, 64, 64, -64, -64, -64, 64, -64, 64, -64, 64, 64, 64, 64, 64, 64, -64, -64, -64, 64, -64, 64, -64, 64, 64, 64, -64, -64, 64, 64, -64, 64, -64, -64, -64, 64, 64, 64, 64, 64, 64, -64, -64, 64, 64, 64, -64, 64, -64, -64, -64, -64, 64, 64, -64, -64, -64, -64, -64, -64, -64, -64, 64, 64, -64, 64, 64, 64, 64, -64, 64, -64, 64, 64, -64, -64, -64, 64, -64, 64, 64, 64, 64, -64, 64, -64, -64, 64, 64, -64, -64, -64, -64, -64, -64, -64, -64, 64, -64, 64, -64, -64, -64, 64, -64, -64, -64, -64, -64, 64, 64, 64, 64, 64, 64, 64, -64, -64, -64, 64, 64, -64, -64, -64, -64, -64, -64, -64, 64, 64, 64, -64, 64, 64, 64, 64, 64, -64, 64, -64, -64, -64, -64, 64, 64, 64, 64, -64, -64, 64, -64, 64, -64, 64, -64, 64, 64, 64, 64, -64, -64, -64, -64, 64, 64, 64, 64, 64, 64, 64, -64, 64, 64, -64, 64, -64, -64, 64, -64, 64, -64, -64, -64, -64, -64, -64, 64, 64, 64, 64, -64, -64, -64, 64, 64, 64, 64, 64, 64, 64, 64, 64, -64, -64, 64, -64, 64, 64, 64, 64, -64, -64, -64, 64, 64, 64, -64, 64, -64, -64, 64, -64, 64, 64, 64, 64, 64, 64, 64, -64, -64, -64, -64, -64, -64, -64, 64, -64, 64, -64, -64, -64, -64, 64, -64, 64, 64, -64, 64, 64, -64, 64, -64, -64, -64, -64, -64, -64, -64, -64, -64, -64, 64, 64, 64, 64, 64, 64, -64, 64, -64, 64, -64, 64, 64, 64, 64, 64, 64, 64, 64, -64, -64, -64, -64, -64, 64, 64, 64, 64, 64, 64, 64, 64, 64, 64, 64, 64, 64, -64, -64, 64, 64, 64, 64, 64, 64, 64, 64, -64, -64, 64, -64, 64, -64, 64, 64, 64, 64, 64, 64, 64, -64, 64, -64, 64, -64, 64, 64, 64, 64, 64, 64, 64, 64, 64, -64, -64, 64, 64, -64, -64, -64, -64, 64, 64, -64, 64, 64, -64, -64, 64, -64, -64, -64, -64, 64, 64, 64, 64, 64, 64, -64, -64, -64, 64, 64, 64, 64, -64, 64, -64, -64, -64, 64, 64, 64, 64, 64, -64, 64, -64, 64, -64, 64, 64, 64, 64, -64, 64, -64, -64, 64, 64, 64, 64, -64, 64, -64, -64, -64, -64, -64, 64, 64, 64, 64, -64, -64, 64, -64, -64, -64, -64, 64, 64, -64, 64, 64, -64, -64, 64, 64, -64, -64, -64, -64, -64, -64, -64, 64, 64, 64, -64, 64, 64, -64, -64, -64, -64, -64, -64, -64, -64, -64, 64, -64, 64, -64, 64, -64, -64, -64, -64, -64, -64, 64, -64, -64, 64, 64, 64, 64, -64, -64, -64, 64, -64, -64, -64, -64, -64, -64, -64, 64, -64, 64, -64, -64, -64, -64, -64, 64, -64, -64, -64, 64, -64, -64, -64, 64, -64, -64, 64, 64, -64, -64, -64, -64, -64, -64, -64, -64, -64, -64, 64, -64, -64, -64, -64, 64, 64, -64, 64, 64, 64, -64, 64, -64, 64, 64, 64, 64, -64, -64, -64, -64, -64, -64, -64, 64, -64, 64, 64, -64, -64, -64, -64, 64, 64, 64, 64, 64, 64, -64, 64, -64, 64, -64, -64, -64, 64, -64, -64, -64, 64, -64, 64, -64, 64, 64, 64, 64, 64, -64, 64, 64, 64, 64, 64, 64, 64, -64, -64, -64, 64, -64, -64, -64, 64, 64, 64, -64, 64, -64, -64, 64, 64, 64, 64, 64, -64, 64, 64, 64, 64, 64, 64, -64, -64, -64, -64, -64, -64, 64, -64, 64, 64, 64, 64, -64, 64, -64, 64, -64, 64, 64, 64, 64, -64, 64, 64, 64, 64, 64, -64, -64, -64, -64, -64, -64, 64, -64, 64, 64, -64, -64, -64, -64, -64, 64, 64, 64, 64, 64, 64, 64, -64, 64, 64, 64, 64, 64, -64, -64, -64, -64, 64, -64, -64, 64, 64, 64, -64, -64, -64, 64, 64, 64, 64, 64, 64, 64, 64, 64, 64, 64, 64, 64, 64, 64, 64, -64, -64, 64, 64, 64, 64, -64, -64, -64, 64, 64, 64, 64, 64, 64, 64, 64, 64, 64, 64, 64, 64, 64, 64, 64, -64, -64, 64, 64, 64, 64, 64, 64, 64, -64, -64, -64, 64, 64, 64, 64, 64, 64, 64, 64, 64, 64, 64, 64, 64, -64, -64, -64, -64, 64, 64, 64, 64, 64, 64, 64, 64, 64, -64, 64, -64, -64, 64, 64, 64, 64, 64, 64, 64, 64, 64, 64, -64, -64, -64, -64, -64, 64, 64, 64, 64, 64, 64, 64, -64, -64, -64, 64, -64, 64, 64, -64, -64, 64, 64, 64, 64, 64, 64, -64, -64, -64, -64, -64, 64, 64, 64, 64, 64, -64, 64, -64, -64, 64, -64, -64, 64, 64, 64, 64, 64, 64, 64, 64, 64, 64, -64, -64, -64, 64, -64, -64, 64, 64, 64, -64, 64, -64, 64, 64, -64, 64, -64, 64, 64, 64, -64, -64, 64, 64, 64, -64, -64, -64, -64, -64, 64, -64, -64, -64, -64, -64, 64, -64, -64, -64, 64, 64, 64, -64, -64, 64, -64, -64, 64, 64, -64, -64, -64, -64, -64, -64, -64, 64, 64, -64, -64, -64, -64, 64, -64, -64, -64, -64, -64, -64, 64, 64, -64, -64, 64, -64, 64, -64, 64, 64, -64, -64, -64, -64, -64, 64, 64, -64, -64, -64, -64, -64, -64, -64, 64, -64, 64, -64, -64, -64, 64, 64, -64, 64, -64, -64, 64, -64, -64, -64, -64, 64, -64, -64, 64, 64, 64, 64, -64, -64, -64, -64, 64, -64, -64, -64, -64, 64, 64, 64, -64, -64, -64, 64, 64, -64, -64, 64, 64, 64, -64, -64, 64, -64, -64, -64, 64, 64, 64, 64, -64, 64, 64, -64, 64, -64, 64, 64, 64, 64, 64, -64, 64, -64, 64, 64, -64, -64, -64, -64, -64, -64, -64, -64, 64, 64, 64, 64, 64, 64, 64, 64, -64, -64, -64, -64, 64, 64, -64, -64, -64, -64, -64, -64, -64, 64, -64, -64, -64, -64, -64, -64, 64, 64, 64, 64, 64, 64, 64, -64, 64, 64, -64, -64, 64, 64, -64, -64, -64, 64, -64, -64, 64, -64, -64, -64, -64, -64, -64, 64, -64, 64, 64, -64, 64, 64, 64, -64, 64, 64, 64, -64, 64, 64, -64, -64, -64, -64, -64, -64, -64, -64, -64, -64, -64, -64, -64, -64, 64, -64, -64, 64, 64, 64, -64, -64, 64, -64, -64, -64, 64, 64, 64, -64, 64, -64, -64, -64, -64, -64, -64, -64, -64, -64, -64, -64, -64, -64, -64, -64, 64, -64, 64, 64, 64, -64, -64, -64, -64, 64, -64, -64, -64, -64, -64, -64, -64, -64, -64, -64, -64, -64, -64, 64, 64, 64, -64, -64, 64, 64, 64, -64, -64, 64, -64, -64, 64, -64, 64, 64, -64, -64, -64, -64, -64, -64, -64, -64, -64, -64, 64, 64, 64, -64, 64, -64, 64, 64, 64, -64, -64, -64, 64, -64, 64, 64, -64, -64, -64, -64, -64, -64, -64, -64, -64, -64, -64, 64, 64, 64, 64, -64, 64, -64, -64, 64, 64, 64, 64, 64, -64, 64, -64, -64, -64, -64, -64, -64, -64, -64, -64, -64, -64, -64, 64, 64, 64, 64, 64, 64, 64, 64, 64, 64, 64, 64, 64, -64, -64, 64, -64, -64, 64, -64, -64, -64, -64, -64, -64, -64, -64, 64, 64, 64, 64, 64, -64, -64, -64, -64, -64, -64, 64, 64, 64, -64, 64, -64, 64, -64, -64, -64, 64, -64, -64, -64, -64, -64, 64, 64, 64, 64, 64, 64, -64, -64, -64, -64, -64, 64, 64, 64, 64, 64, 64, 64, -64, 64, -64, -64, -64, 64, -64, -64, 64, 64, 64, -64, -64, 64, 64, -64, -64, -64, -64, -64, -64, -64, -64, -64, 64, 64, -64, 64, 64, 64, -64, 64, -64, -64, -64, -64, -64, 64, 64, -64, -64, -64, 64, -64, -64, 64, -64, -64, -64, -64, -64, -64, 64, -64, 64, -64, -64, 64, 64, -64, -64, -64, -64, -64, -64, 64, 64, 64, 64, -64, -64, -64, -64, -64, -64, 64, -64, -64, -64, -64, -64, 64, 64, 64, 64, 64, -64, 64, -64, -64, -64, -64, -64, 64, 64, -64, 64, -64, -64, 64, -64, -64, -64, -64, -64, -64, -64, -64, -64, 64, 64, 64, -64, 64, 64, 64, 64, 64, -64, -64, 64, -64, 64, -64, 64, 64, -64, -64, -64, -64, -64, -64, -64, -64, -64, -64, 64, 64, 64, -64, 64, -64, 64, -64, -64, 64, -64, 64, 64, 64, 64, 64, 64, -64, -64, -64, -64, -64, -64, -64, -64, -64, -64, -64, -64, -64, 64, 64, -64, -64, 64, -64, -64, -64, 64, 64, -64, 64, 64, 64, -64, -64, 64, -64, -64, -64, -64, -64, -64, 64, -64, 64, -64, 64, 64, -64, 64, 64, -64, 64, 64, 64, 64, 64, 64, 64, 64, -64, -64, -64, -64, -64, -64, -64, -64, -64, -64, 64, -64, -64, 64, 64, 64, -64, -64, 64, -64, -64, -64, 64, 64, -64, 64, -64, -64, 64, -64, -64, -64, -64, -64, -64, -64, -64, -64, -64, -64, -64, -64, 64, -64, -64, 64, 64, -64, 64, 64, 64, 64, -64, -64, 64, -64, -64, -64, -64, -64, -64, 64, -64, -64, -64, -64, 64, -64, -64, -64, -64, 64, -64, -64, -64, -64, 64, 64, -64, -64, -64, -64, -64, 64, -64, -64, -64, -64, -64, -64, -64, -64, 64, -64, -64, -64, -64, 64, -64, -64, 64, -64, 64, -64, 64, -64, -64, -64, -64, -64, -64, 64, 64, -64, 64, -64, -64, -64, 64, -64, -64, -64, 64, 64, 64, -64, 64, 64, 64, 64, 64, -64, -64, -64, -64, -64, -64, -64, -64, 64, -64, 64, -64, -64, -64, -64, -64, 64, 64, -64, 64, 64, -64, -64, 64, -64, -64, -64, 64, -64, -64, 64, -64, -64, -64, -64, 64, -64, 64, -64, -64, -64, -64, -64, -64, 64, 64, 64, -64, 64, -64, -64, -64, 64, -64, -64, -64, -64, -64, -64, -64, 64, 64, -64, 64, -64, 64, 64, 64, -64, 64, -64, 64, 64, -64, -64, -64, 64, 64, 64, 64, 64, 64, -64, 64, -64, 64, -64, 64, -64, -64, 64, 64, 64, 64, 64, -64, -64, 64, 64, 64, -64, 64, 64, -64, 64, 64, 64, -64, -64, -64, 64, 64, 64, -64, 64, -64, -64, 64, 64, -64, 64, 64, -64, 64, 64, 64, -64, -64, 64, 64, 64, 64, -64, -64, -64, -64, -64, -64, 64, -64, 64, 64, -64, 64, 64, -64, -64, -64, -64, 64, 64, 64, 64, 64, -64, -64, 64, 64, -64, -64, 64, -64, 64, 64, 64, -64, 64, 64, 64, -64, -64, -64, -64, -64, -64, -64, -64, -64, -64, 64, 64, 64, -64, -64, -64, -64, -64, -64, -64, 64, -64, -64, 64, 64, -64, 64, 64, 64, -64, 64, -64, -64, 64, 64, 64, 64, 64, 64, 64, 64, -64, -64, -64, 64, 64, 64, 64, -64, -64, -64, -64, 64, 64, 64, 64, 64, 64, -64, 64, -64, 64, -64, 64, -64, 64, 64, 64, 64, -64, -64, 64, -64, 64, 64, 64, 64, -64, -64, 64, 64, -64, 64, 64, 64, 64, 64, 64, -64, -64, 64, -64, -64, -64, -64, 64, 64, 64, 64, -64, 64, 64, 64, 64, 64, 64, 64, 64, 64, 64, 64, 64, 64, 64, 64, 64, 64, -64, -64, -64, -64, -64, -64, 64, 64, -64, -64, -64, 64, 64, 64, 64, 64, 64, -64, -64, -64, 64, 64, 64, 64, 64, -64, 64, -64, -64, -64, -64, -64, -64, 64, 64, 64, 64, -64, -64, -64, -64, -64, 64, 64, 64, -64, -64, -64, 64, -64, 64, -64, -64, -64, -64, 64, -64, -64, -64, -64, -64, 64, 64, 64, -64, -64, -64, -64, -64, -64, 64, 64, 64, -64, -64, -64, 64, -64, 64, 64, -64, -64, -64, 64, -64, -64, -64, -64, 64, 64, 64, 64, -64, -64, -64, -64, -64, -64, -64, 64, 64, 64, -64, -64, 64, 64, -64, 64, -64, -64, -64, -64, -64, -64, -64, -64, 64, 64, 64, 64, 64, -64, -64, -64, -64, -64, -64, 64, -64, -64, 64, 64, -64, 64, 64, -64, -64, -64, -64, 64, -64, -64, -64, -64, 64, 64, 64, 64, -64, 64, -64, -64, -64, -64, -64, -64, -64, -64, -64, 64, 64, 64, 64, 64, -64, -64, 64, 64, -64, -64, -64, -64, -64, 64, 64, 64, -64, -64, -64, -64, -64, 64, -64, 64, -64, 64, -64, -64, 64, -64, 64, 64, -64, 64, -64, -64, 64, -64, -64, -64, 64, 64, -64, -64, -64, -64, -64, -64, -64, 64, -64, 64, -64, -64, -64, -64, -64, 64, -64, -64, -64, -64, 64, 64, 64, -64, -64, 64, 64, 64, 64, 64, -64, -64, -64, 64, -64, 64, 64, -64, -64, 64, -64, 64, 64, -64, 64, -64, 64, -64, 64, -64, -64, -64, -64, 64, 64, -64, -64, -64, -64, -64, -64, -64, -64, 64, 64, -64, 64, 64, 64, 64, 64, 64, 64, -64, 64, 64, -64, 64, 64, 64, 64, 64, 64, 64, -64, -64, -64, -64, -64, -64, -64, -64, 64, 64, -64, -64, 64, 64, 64, 64, 64, -64, 64, -64, -64, 64, -64, 64, 64, 64, 64, -64, 64, -64, -64, -64, -64, -64, -64, -64, -64, -64, 64, -64, -64, 64, 64, -64, 64, 64, -64, 64, -64, 64, 64, 64, 64, 64, 64, 64, 64, 64, 64, -64, -64, 64, 64, -64, 64, 64, 64, 64, 64, -64, 64, 64, 64, 64, 64, 64, 64, 64, 64, 64, -64, -64, 64, 64, -64, 64, 64, 64, 64, 64, 64, 64, -64, -64, -64, 64, -64, 64, 64, 64, 64, 64, 64, 64, -64, -64, 64, -64, -64, -64, -64, 64, 64, 64, 64, 64, -64, 64, 64, 64, 64, 64, 64, 64, -64, 64, 64, 64, 64, 64, 64, 64, -64, -64, -64, -64, -64, -64, 64, -64, -64, 64, 64, 64, 64, -64, 64, -64, -64, 64, 64, -64, 64, 64, -64, 64, 64, 64, -64, 64, 64, -64, -64, -64, -64, -64, -64, -64, -64, 64, 64, -64, 64, 64, -64, 64, 64, 64, 64, -64, 64, 64, 64, -64, -64, -64, -64, 64, 64, 64, -64, -64, -64, -64, 64, -64, -64, 64, 64, 64, 64, -64, -64, 64, 64, -64, 64, -64, 64, -64, 64, -64, -64, -64, -64, -64, -64, -64, -64, 64, -64, -64, -64, 64, -64, 64, 64, -64, 64, 64, 64, -64, -64, 64, -64, -64, 64, -64, 64, 64, 64, 64, -64, 64, -64, 64, -64, -64, -64, 64, 64, -64, -64, -64, -64, 64, -64, -64, -64, 64, 64, -64, 64, 64, -64, 64, -64, -64, -64, -64, 64, 64, 64, 64, -64, -64, 64, 64, -64, 64, -64, -64, -64, -64, -64, -64, 64, 64, 64, 64, 64, 64, -64, -64, -64, 64, 64, 64, 64, 64, 64, 64, 64, -64, -64, -64, -64, -64, -64, 64, -64, -64, 64, 64, -64, -64, 64, 64, -64, -64, -64, -64, -64, -64, -64, -64, -64, 64, 64, -64, 64, -64, -64, 64, 64, 64, -64, -64, 64, -64, -64, -64, -64, -64, 64, 64, -64, -64, -64, -64, -64, 64, 64, -64, -64, -64, 64, 64, -64, 64, 64, 64, -64, -64, 64, -64, 64, -64, 64, -64, 64, -64, -64, 64, -64, -64, 64, -64, 64, 64, 64, 64, 64, -64, 64, 64, -64, -64, 64, 64, 64, 64, -64, 64, 64, -64, -64, 64, 64, -64, -64, -64, 64, 64, -64, -64, 64, -64, 64, -64, 64, 64, 64, 64, 64, -64, 64, -64, -64, -64, -64, -64, -64, -64, 64, -64, 64, -64, -64, 64, -64, 64, -64, -64, -64, 64, -64, -64, -64, 64, 64, 64, 64, -64, -64, 64, -64, -64, -64, -64, -64, -64, 64, -64, -64, -64, -64, -64, 64, 64, 64, -64, -64, -64, -64, -64, -64, 64, 64, 64, -64, 64, 64, 64, -64, -64, 64, -64, -64, 64, 64, 64, 64, -64, -64, -64, 64, 64, -64, 64, 64, 64, 64, -64, -64, 64, 64, 64, 64, 64, 64, -64, 64, 64, 64, 64, 64, 64, 64, 64, 64, 64, -64, -64, 64, 64, -64, 64, 64, 64, -64, -64, 64, 64, 64, 64, 64, 64, 64, -64, -64, -64, 64, -64, 64, 64, 64, 64, -64, -64, 64, -64, -64, -64, -64, -64, 64, 64, -64, -64, -64, -64, 64, 64, 64, -64, 64, -64, -64, -64, -64, -64, -64, 64, 64, 64, 64, 64, 64, 64, 64, 64, 64, 64, 64, 64, -64, -64, -64, -64, 64, -64, -64, -64, -64, -64, -64, -64, -64, 64, -64, 64, 64, -64, 64, 64, -64, -64, 64, 64, -64, 64, -64, 64, -64, -64, -64, 64, -64, -64, -64, -64, -64, -64, -64, -64, -64, -64, -64, 64, -64, -64, -64, 64, 64, -64, -64, 64, -64, -64, 64, -64, -64, 64, -64, -64, -64, -64, -64, 64, -64, -64, -64, -64, -64, -64, 64, 64, 64, 64, -64, 64, -64, 64, 64, -64, -64, -64, 64, 64, -64, -64, -64, -64, -64, -64, -64, -64, -64, -64, -64, -64, -64, 64, 64, 64, 64, -64, 64, -64, 64, -64, 64, -64, -64, -64, 64, -64, -64, -64, 64, 64, -64, -64, -64, -64, -64, -64, -64, -64, -64, -64, -64, 64, 64, -64, 64, -64, -64, 64, 64, -64, 64, -64, 64, -64, -64, -64, 64, -64, -64, -64, -64, -64, -64, -64, -64, -64, -64, 64, -64, -64, -64, 64, -64, -64, 64, 64, 64, 64, 64, -64, -64, -64, 64, -64, 64, -64, -64, -64, -64, -64, -64, -64, -64, -64, -64, -64, -64, -64, -64, -64, 64, 64, 64, 64, 64, 64, 64, 64, -64, 64, -64, -64, -64, -64, -64, -64, -64, -64, -64, -64, 64, 64, -64, -64, -64, -64, 64, -64, 64, 64, -64, -64, -64, 64, -64, 64, -64, -64, -64, -64, 64, -64, -64, -64, 64, -64, -64, -64, 64, 64, -64, -64, -64, -64, 64, -64, 64, -64, -64, -64, -64, 64, -64, -64, -64, -64, -64, -64, -64, 64, -64, -64, -64, -64, 64, -64, -64, 64, -64, -64, 64, -64, 64, 64, -64, -64, -64, 64, -64, -64, -64, -64, -64, -64, -64, 64, -64, 64, 64, 64, -64, -64, -64, 64, 64, -64, -64, -64, -64, -64, -64, 64, 64, 64, 64, 64, 64, -64, 64, -64, -64, -64, -64, 64, 64, 64, 64, 64, 64, 64, 64, 64, -64, -64, -64, -64, -64, -64, -64, 64, 64, -64, 64, 64, 64, -64, -64, 64, 64, -64, -64, -64, 64, 64, 64, -64, 64, -64, -64, -64, -64, -64, -64, -64, -64, -64, 64, 64, 64, 64, -64, -64, -64, -64, -64, 64, 64, 64, 64, 64, -64, 64, 64, 64, 64, -64, -64, -64, -64, -64, -64, -64, -64, -64, -64, 64, 64, 64, 64, -64, 64, 64, -64, -64, 64, 64, -64, 64, 64, 64, 64, 64, -64, -64, -64, -64, -64, -64, -64, -64, 64, -64, -64, 64, 64, -64, 64, 64, 64, 64, 64, -64, -64, 64, 64, 64, 64, 64, 64, 64, -64, -64, 64, 64, 64, -64, 64, 64, 64, 64, -64, -64, -64, -64, -64, 64, 64, 64, 64, -64, -64, 64, 64, -64, 64, 64, -64, -64, 64, 64, 64, 64, 64, 64, -64, 64, 64, 64, -64, 64, 64, -64, 64, -64, 64, -64, -64, 64, 64, 64, 64, 64, 64, 64, -64, -64, -64, -64, -64, -64, -64, 64, 64, -64, -64, -64, -64, -64, -64, 64, -64, 64, -64, -64, 64, 64, -64, -64, -64, -64, -64, -64, -64, -64, -64, 64, -64, 64, 64, -64, 64, 64, 64, -64, -64, 64, -64, 64, 64, 64, 64, -64, -64, 64, 64, -64, -64, 64, 64, -64, 64, 64, 64, -64, -64, -64, 64, -64, -64, -64, 64, -64, -64, 64, 64, -64, -64, 64, -64, 64, -64, -64, -64, -64, -64, -64, 64, 64, 64, 64, 64, -64, 64, 64, 64, 64, -64, -64, 64, 64, -64, -64, 64, 64, -64, -64, 64, 64, 64, 64, 64, 64, -64, 64, -64, -64, -64, -64, 64, -64, 64, 64, 64, 64, 64, 64, 64, 64, -64, -64, -64, 64, 64, -64, -64, 64, 64, -64, 64, -64, 64, -64, -64, 64, 64, -64, 64, 64, -64, 64, 64, 64, 64, -64, -64, -64, -64, 64, -64, -64, -64, 64, 64, 64, 64, -64, 64, -64, -64, 64, -64, 64, -64, 64, 64, 64, 64, 64, 64, 64, 64, -64, 64, 64, -64, 64, 64, 64, 64, 64, -64, 64, 64, -64, -64, -64, -64, 64, 64, -64, -64, 64, -64, 64, 64, 64, 64, 64, 64, 64, 64, 64, 64, 64, 64, -64, -64, -64, -64, -64, -64, -64, 64, -64, -64, 64, 64, -64, 64, 64, 64, 64, 64, 64, 64, -64, 64, 64, 64, 64, -64, -64, 64, -64, -64, -64, -64, -64, -64, -64, 64, -64, 64, -64, -64, -64, -64, -64, 64, 64, 64, -64, 64, -64, 64, 64, -64, 64, 64, 64, -64, -64, -64, -64, -64, -64, -64, -64, -64, 64, -64, -64, -64, 64, 64, 64, 64, -64, 64, 64, 64, 64, 64, 64, 64, -64, 64, -64, -64, -64, -64, -64, -64, 64, 64, 64, 64, -64, -64, 64, -64, 64, 64, -64, 64, 64, 64, 64, 64, -64, -64, 64, 64, 64, -64, -64, -64, -64, -64, -64, 64, -64, -64, 64, 64, -64, 64, 64, 64, 64, -64, 64, 64, 64, 64, -64, 64, -64, 64, -64, 64, 64, 64, -64, 64, -64, -64, -64, -64, 64, 64, -64, -64, -64, 64, 64, -64, -64, 64, 64, 64, 64, 64, -64, -64, 64, -64, 64, 64, 64, 64, 64, 64, 64, 64, -64, 64, -64, 64, -64, 64, -64, 64, 64, -64, 64, 64, 64, 64, -64, -64, -64, -64, -64, -64, 64, 64, 64, -64, 64, 64, 64, 64, -64, 64, 64, -64, -64, 64, -64, 64, 64, 64, 64, -64, -64, 64, -64, -64, -64, -64, 64, 64, -64, 64, -64, 64, -64, 64, 64, -64, -64, 64, 64, -64, 64, -64, -64, 64, 64, 64, 64, -64, -64, 64, 64, 64, 64, 64, 64, -64, 64, 64, 64, 64, 64, 64, 64, 64, -64, 64, 64, 64, -64, 64, -64, 64, 64, -64, 64, -64, 64, 64, -64, 64, 64, -64, -64, -64, -64, 64, 64, 64, 64, -64, 64, 64, 64, 64, 64, -64, 64, -64, 64, -64, 64, 64, -64, 64, 64, 64, 64, 64, 64, 64, -64, 64, 64, 64, 64, 64, 64, -64, -64, -64, -64, -64, 64, 64, 64, -64, 64, 64, -64, -64, -64, 64, 64, 64, 64, 64, 64, -64, -64, 64, 64, 64, 64, -64, 64, -64, 64, 64, 64, -64, -64, 64, -64, 64, -64, -64, 64, 64, -64, -64, 64, 64, 64, 64, -64, 64, 64, 64, -64, 64, -64, 64, 64, 64, 64, 64, 64, -64, -64, 64, 64, -64, 64, 64, -64, -64, -64, -64, -64, -64, 64, -64, -64, 64, -64, -64, -64, 64, 64, 64, -64, 64, -64, 64, 64, -64, -64, 64, 64, 64, 64, 64, -64, 64, -64, -64, -64, -64, 64, 64, 64, 64, 64, -64, -64, 64, 64, 64, 64, 64, 64, 64, -64, -64, 64, 64, -64, -64, 64, 64, -64, 64, 64, 64, 64, 64, 64, 64, 64, 64, 64, 64, 64, 64, 64, 64, 64, 64, 64, 64, -64, 64, 64, 64, 64, -64, 64, 64, -64, 64, -64, 64, -64, 64, 64, 64, 64, 64, 64, -64, -64, 64, 64, -64, 64, 64, 64, -64, -64, 64, -64, 64, -64, -64, -64, -64, -64, -64, 64, 64, 64, 64, 64, -64, 64, -64, -64, 64, -64, 64, -64, 64, 64, 64, -64, -64, 64, 64, -64, 64, -64, 64, 64, -64, 64, -64, -64, 64, 64, 64, 64, -64, -64, -64, -64, -64, -64, -64, 64, -64, 64, 64, 64, 64, 64, -64, 64, -64, -64, -64, -64, -64, 64, -64, 64, -64, -64, 64, 64, 64, 64, -64, -64, -64, -64, 64, -64, 64, 64, 64, 64, 64, 64, 64, 64, -64, 64, 64, 64, 64, 64, 64, 64, -64, -64, -64, -64, 64, -64, -64, 64, 64, 64, -64, 64, 64, -64, -64, 64, -64, -64, 64, -64, -64, -64, 64, -64, -64, -64, 64, -64, 64, 64, -64, 64, -64, -64, -64, -64, -64, 64, -64, 64, 64, -64, -64, 64, 64, 64, -64, 64, 64, 64, 64, 64, 64, -64, -64, -64, 64, 64, 64, -64, -64, -64, -64, -64, -64, 64, 64, -64, -64, -64, -64, -64, 64, 64, -64, -64, 64, 64, 64, -64, 64, 64, 64, 64, -64, 64, 64, 64, 64, -64, 64, 64, 64, 64, 64, -64, -64, 64, 64, 64, -64, 64, 64, -64, 64, 64, 64, 64, -64, -64, -64, -64, -64, -64, 64, 64, 64, 64, -64, 64, -64, 64, -64, -64, -64, -64, 64, -64, 64, -64, -64, -64, -64, -64, 64, -64, -64, -64, -64, -64, -64, -64, -64, 64, -64, -64, -64, -64, -64, -64, 64, 64, 64, -64, -64, 64, 64, 64, 64, -64, -64, -64, 64, -64, -64, 64, -64, -64, -64, -64, -64, -64, -64, -64, -64, 64, -64, -64, 64, 64, 64, 64, 64, 64, 64, 64, 64, -64, -64, 64, 64, -64, -64, 64, -64, -64, 64, -64, -64, -64, -64, -64, 64, 64, 64, 64, -64, -64, 64, 64, 64, 64, 64, -64, -64, -64, 64, -64, -64, -64, 64, -64, 64, 64, -64, -64, -64, -64, -64, -64, 64, -64, -64, -64, -64, -64, 64, 64, 64, 64, -64, -64, -64, 64, -64, 64, 64, -64, 64, 64, 64, 64, -64, -64, -64, -64, -64, -64, -64, 64, -64, -64, -64, -64, 64, 64, -64, 64, 64, 64, 64, -64, 64, -64, 64, 64, 64, -64, -64, 64, -64, -64, 64, -64, 64, -64, 64, -64, -64, 64, 64, -64, 64, 64, -64, 64, 64, -64, -64, -64, -64, -64, 64, 64, 64, 64, -64, 64, -64, -64, -64, 64, -64, -64, -64, -64, -64, 64, -64, 64, 64, 64, 64, 64, 64, 64, -64, 64, -64, -64, -64, -64, -64, -64, 64, 64, -64, 64, 64, 64, -64, -64, -64, 64, 64, -64, 64, 64, 64, 64, 64, 64, -64, -64, 64, 64, 64, -64, -64, 64, 64, 64, 64, 64, 64, 64, 64, -64, -64, -64, 64, -64, -64, -64, -64, -64, -64, 64, -64, 64, 64, 64, 64, -64, 64, -64, 64, 64, 64, 64, 64, 64, -64, 64, -64, -64, 64, 64, -64, -64, -64, -64, -64, -64, 64, 64, 64, 64, 64, -64, 64, 64, 64, 64, 64, 64, 64, 64, 64, 64, 64, -64, -64, -64, -64, -64, 64, 64, 64, -64, -64, -64, 64, 64, 64, 64, -64, 64, 64, 64, 64, 64, -64, 64, 64, 64, 64, 64, 64, -64, -64, -64, -64, 64, 64, 64, -64, -64, -64, -64, 64, 64, 64, 64, 64, -64, 64, -64, 64, -64, -64, 64, 64, 64, 64, 64, -64, -64, 64, -64, 64, -64, 64, -64, -64, 64, -64, -64, -64, 64, 64, 64, -64, -64, 64, 64, 64, 64, 64, 64, 64, 64, 64, 64, -64, 64, -64, -64, -64, 64, 64, -64, -64, -64, -64, -64, -64, -64, -64, -64, 64, 64, 64, -64, 64, 64, 64, 64, 64, 64, 64, 64, -64, -64, 64, -64, -64, -64, 64, 64, 64, 64, 64, -64, 64, -64, -64, -64, 64, -64, 64, -64, -64, 64, 64, 64, 64, 64, 64, 64, -64, -64, 64, 64, 64, -64, -64, 64, -64, 64, 64, -64, -64, -64, -64, -64, 64, 64, -64, -64, -64, -64, -64, 64, -64, -64, 64, 64, 64, -64, 64, -64, 64, -64, -64, 64, 64, 64, -64, 64, -64, 64, 64, -64, 64, 64, 64, -64, -64, -64, -64, -64, -64, 64, 64, 64, 64, -64, 64, 64, -64, -64, -64, -64, 64, -64, 64, -64, 64, 64, -64, -64, -64, 64, -64, 64, 64, -64, 64, 64, 64, 64, -64, -64, -64, -64, -64, 64, -64, -64, -64, -64, -64, -64, 64, -64, -64, -64, 64, -64, -64, 64, 64, 64, -64, 64, 64, 64, 64, 64, 64, -64, 64, 64, -64, 64, -64, -64, -64, -64, -64, -64, -64, -64, 64, -64, 64, 64, 64, -64, 64, -64, -64, -64, -64, 64, -64, -64, 64, 64, -64, -64, -64, -64, 64, -64, 64, -64, -64, 64, 64, 64, -64, 64, 64, 64, 64, -64, 64, -64, 64, 64, 64, 64, -64, -64, 64, 64, 64, -64, -64, 64, 64, -64, -64, -64, -64, -64, 64, -64, -64, 64, 64, 64, -64, 64, -64, -64, -64, -64, 64, -64, -64, -64, 64, -64, 64, -64, 64, -64, -64, -64, 64, 64, 64, -64, -64, -64, -64, 64, 64, 64, -64, 64, 64, -64, -64, 64, -64, -64, 64, -64, -64, 64, 64, 64, 64, 64, -64, -64, 64, -64, -64, 64, -64, -64, -64, 64, 64, -64, 64, 64, 64, -64, 64, -64, 64, -64, -64, 64, 64, -64, 64, -64, -64, 64, 64, -64, 64, -64, -64, 64, 64, 64, -64, -64, -64, 64, 64, 64, 64, -64, -64, 64, -64, 64, -64, 64, -64, -64, -64, -64, 64, 64, -64, -64, -64, -64, 64, 64, -64, 64, -64, -64, 64, 64, 64, 64, -64, 64, -64, 64, 64, -64, 64, -64, -64, -64, -64, 64, 64, -64, -64, 64, -64, -64, 64, -64, 64, -64, -64, -64, -64, 64, -64, 64, 64, 64, 64, -64, 64, -64, 64, -64, 64, -64, 64, 64, 64, 64, 64, 64, -64, -64, -64, -64, 64, -64, -64, -64, -64, -64, -64, 64, 64, -64, -64, 64, 64, 64, -64, 64, 64, 64, 64, 64, 64, 64, 64, 64, 64, 64, 64, 64, 64, -64, -64, -64, -64, -64, 64, 64, 64, -64, -64, -64, 64, 64, 64, 64, -64, -64, 64, 64, 64, 64, 64, 64, 64, 64, 64, 64, 64, -64, -64, -64, -64, 64, -64, -64, 64, 64, 64, -64, -64, -64, 64, 64, -64, -64, -64, 64, 64, 64, 64, 64, 64, 64, -64, 64, -64, -64, 64, -64, 64, 64, 64, -64, 64, 64, 64, 64, -64, -64, 64, 64, 64, 64, -64, 64, 64, 64, 64, -64, -64, -64, -64, -64, -64, -64, -64, 64, 64, -64, -64, 64, 64, -64, -64, 64, -64, -64, 64, 64, 64, 64, 64, 64, 64, 64, 64, 64, -64, 64, -64, 64, 64, 64, 64, 64, -64, -64, -64, 64, 64, 64, 64, -64, 64, -64, 64, 64, 64, 64, 64, 64, 64, -64, -64, -64, -64, 64, 64, 64, 64, 64, 64, 64, 64, 64, 64, 64, -64, 64, 64, 64, 64, 64, 64, 64, 64, 64, 64, 64, -64, -64, -64, -64, 64, 64, 64, 64, 64, 64, 64, 64, -64, -64, 64, 64, 64, -64, -64, 64, -64, 64, 64, 64, 64, 64, 64, -64, -64, -64, -64, -64, -64, 64, 64, 64, -64, 64, -64, -64, -64, 64, 64, 64, 64, 64, -64, -64, -64, 64, 64, 64, 64, 64, 64, -64, -64, -64, 64, 64, 64, 64, 64, 64, -64, 64, 64, -64, 64, -64, 64, 64, 64, 64, -64, 64, 64, -64, 64, 64, 64, 64, -64, -64, 64, 64, 64, -64, 64, -64, -64, 64, 64, 64, 64, 64, 64, 64, 64, 64, 64, -64, -64, 64, -64, 64, -64, 64, 64, -64, -64, -64, 64, 64, 64, 64, -64, -64, 64, 64, 64, 64, 64, 64, 64, 64, 64, 64, 64, -64, 64, -64, -64, -64, -64, 64, 64, -64, -64, 64, 64, 64, 64, 64, -64, 64, 64, 64, 64, 64, 64, 64, -64, 64, 64, 64, 64, 64, 64, 64, -64, -64, 64, 64, 64, -64, -64, -64, 64, 64, 64, -64, 64, -64, -64, 64, 64, 64, 64, -64, -64, 64, -64, 64, 64, -64, 64, -64, 64, 64, 64, 64, 64, 64, -64, -64, -64, -64, -64, -64, -64, -64, -64, 64, 64, 64, -64, 64, 64, -64, -64, 64, 64, 64, -64, 64, -64, 64, 64, 64, 64, 64, -64, 64, 64, 64, -64, -64, -64, -64, -64, 64, 64, 64, 64, 64, 64, 64, 64, -64, -64, 64, -64, 64, -64, 64, 64, 64, 64, 64, 64, 64, 64, -64, -64, -64, -64, -64, 64, 64, 64, 64, 64, 64, 64, 64, 64, 64, 64, 64, -64, 64, -64, 64, 64, 64, 64, 64, 64, 64, 64, -64, 64, -64, 64, 64, -64, 64, 64, -64, 64, 64, 64, 64, 64, 64, 64, 64, -64, -64, 64, 64, 64, 64, 64, 64, 64, 64, 64, 64, -64, -64, 64, 64, 64, -64, 64, -64, -64, 64, 64, 64, 64, 64, -64, 64, -64, -64, -64, 64, 64, 64, 64, 64, 64, 64, 64, 64, 64, -64, 64, 64, -64, -64, 64, 64, 64, 64, 64, -64, 64, -64, -64, 64, -64, 64, 64, -64, -64, 64, 64, 64, -64, -64, 64, 64, 64, 64, 64, 64, 64, 64, 64, 64, 64, -64, 64, -64, -64, 64, -64, -64, 64, 64, 64, 64, 64, 64, -64, -64, -64, -64, -64, -64, 64, 64, 64, -64, 64, -64, 64, 64, 64, 64, 64, 64, 64, -64, -64, -64, -64, -64, 64, 64, 64, -64, -64, -64, -64, -64, 64, -64, -64, -64, 64, -64, -64, 64, 64, 64, 64, 64, 64, -64, -64, -64, -64, -64, 64, -64, -64, 64, 64, -64, -64, -64, -64, -64, 64, 64, 64, 64, 64, -64, 64, -64, -64, 64, 64, 64, 64, 64, -64, 64, -64, -64, -64, 64, -64, 64, 64, -64, 64, 64, 64, -64, 64, 64, -64, -64, -64, -64, -64, -64, 64, -64, -64, -64, -64, -64, -64, 64, 64, 64, -64, 64, 64, 64, 64, 64, 64, -64, -64, 64, -64, 64, -64, -64, -64, 64, 64, -64, -64, 64, -64, 64, 64, -64, -64, -64, -64, 64, 64, -64, -64, -64, 64, 64, -64, -64, -64, 64, 64, 64, -64, 64, 64, -64, 64, -64, -64, 64, 64, 64, 64, 64, -64, 64, 64, 64, 64, 64, 64, 64, 64, -64, -64, -64, -64, -64, -64, 64, 64, 64, 64, -64, 64, -64, -64, 64, -64, -64, 64, 64, 64, -64, 64, 64, 64, 64, -64, -64, -64, -64, -64, -64, 64, 64, 64, 64, 64, -64, 64, -64, 64, -64, -64, -64, -64, -64, -64, -64, 64, 64, -64, 64, -64, -64, -64, -64, 64, -64, 64, -64, -64, -64, -64, -64, 64, 64, 64, 64, 64, 64, -64, 64, -64, -64, -64, -64, -64, -64, -64, 64, 64, 64, 64, -64, 64, -64, -64, 64, -64, -64, -64, 64, 64, 64, 64, -64, -64, -64, -64, 64, -64, -64, -64, -64, -64, 64, 64, 64, 64, 64, 64, 64, 64, 64, -64, 64, -64, -64, -64, -64, -64, -64, 64, -64, -64, -64, -64, 64, 64, -64, -64, -64, -64, -64, 64, -64, 64, 64, -64, -64, -64, 64, -64, 64, -64, -64, 64, -64, -64, -64, -64, -64, -64, 64, -64, -64, -64, -64, 64, -64, -64, 64, 64, 64, -64, 64, 64, -64, 64, -64, -64, -64, 64, -64, -64, -64, -64, -64, -64, -64, -64, -64, -64, 64, 64, -64, 64, 64, -64, -64, -64, 64, -64, -64, -64, 64, -64, -64, -64, -64, -64, -64, -64, -64, -64, 64, -64, -64, 64, 64, -64, -64, 64, -64, 64, -64, -64, -64, -64, 64, 64, -64, -64, 64, -64, -64, 64, -64, -64, -64, 64, 64, -64, 64, -64, -64, 64, -64, 64, 64, 64, 64, 64, 64, -64, 64, -64, -64, 64, -64, 64, -64, -64, -64, 64, -64, 64, 64, -64, 64, -64, -64, -64, 64, -64, 64, -64, 64, 64, -64, -64, 64, -64, 64, -64, 64, -64, -64, -64, -64, 64, 64, 64, 64, -64, -64, 64, 64, 64, -64, -64, 64, 64, 64, -64, 64, 64, -64, -64, -64, -64, 64, 64, -64, 64, -64, 64, 64, 64, -64, -64, 64, 64, 64, 64, -64, -64, -64, -64, -64, -64, -64, 64, 64, 64, -64, -64, -64, -64, 64, -64, -64, 64, 64, -64, -64, -64, -64, -64, -64, -64, 64, 64, -64, -64, -64, 64, 64, -64, -64, -64, 64, 64, -64, 64, -64, -64, 64, -64, 64, -64, -64, -64, 64, 64, -64, 64, -64, 64, 64, -64, -64, 64, 64, 64, -64, -64, -64, 64, -64, -64, 64, -64, -64, 64, 64, -64, 64, -64, 64, -64, -64, -64, 64, -64, -64, 64, 64, 64, -64, -64, -64, 64, 64, 64, -64, 64, -64, -64, -64, -64, -64, -64, 64, 64, 64, 64, 64, -64, 64, -64, -64, -64, -64, 64, -64, -64, -64, 64, 64, -64, -64, -64, -64, -64, -64, -64, -64, -64, -64, -64, -64, -64, -64, -64, 64, -64, 64, -64, 64, -64, 64, 64, -64, -64, 64, -64, -64, -64, 64, -64, -64, -64, -64, -64, -64, -64, -64, -64, -64, -64, 64, 64, 64, 64, -64, 64, 64, -64, -64, -64, -64, -64, -64, -64, -64, -64, 64, -64, -64, -64, -64, 64, 64, -64, -64, 64, -64, -64, -64, 64, 64, 64, -64, -64, 64, -64, -64, -64, -64, 64, -64, -64, -64, -64, -64, 64, -64, -64, -64, 64, -64, 64, -64, 64, 64, -64, -64, -64, -64, 64, -64, -64, 64, -64, -64, -64, -64, -64, 64, -64, -64, 64, -64, -64, -64, 64, 64, 64, -64, 64, -64, -64, -64, 64, -64, 64, -64, -64, -64, 64, 64, 64, 64, 64, -64, -64, 64, -64, 64, -64, 64, 64, 64, 64, 64, -64, -64, 64, 64, 64, 64, -64, -64, 64, 64, 64, 64, 64, 64, 64, -64, -64, -64, -64, -64, -64, -64, -64, -64, 64, 64, -64, -64, 64, -64, -64, -64, 64, 64, 64, 64, -64, -64, -64, 64, -64, 64, -64, -64, -64, 64, 64, 64, 64, -64, -64, 64, -64, -64, 64, -64, 64, 64, 64, 64, 64, -64, 64, -64, -64, -64, 64, 64, 64, -64, 64, 64, 64, 64, -64, -64, 64, 64, 64, -64, -64, 64, 64, 64, 64, 64, 64, -64, 64, 64, -64, -64, 64, 64, 64, -64, -64, 64, -64, -64, 64, -64, 64, -64, -64, -64, -64, 64, -64, 64, 64, 64, 64, 64, -64, 64, 64, -64, -64, -64, -64, 64, -64, 64, -64, 64, -64, 64, 64, 64, 64, 64, -64, -64, 64, -64, -64, 64, -64, -64, -64, 64, 64, -64, 64, -64, 64, 64, 64, 64, -64, -64, 64, -64, -64, 64, -64, -64, 64, -64, -64, -64, -64, 64, -64, 64, -64, 64, -64, 64, 64, -64, 64, 64, -64, 64, -64, 64, 64, 64, -64, 64, 64, 64, -64, 64, -64, -64, -64, -64, -64, -64, 64, -64, -64, 64, 64, 64, -64, -64, -64, -64, 64, 64, -64, 64, -64, 64, 64, -64, 64, -64, 64, -64, 64, -64, -64, 64, 64, 64, 64, 64, -64, -64, -64, -64, 64, -64, 64, 64, 64, 64, -64, -64, -64, 64, -64, 64, 64, -64, 64, 64, -64, -64, -64, -64, -64, -64, 64, -64, -64, 64, 64, -64, 64, 64, 64, -64, 64, -64, 64, -64, 64, 64, 64, -64, 64, 64, 64, -64, -64, -64, -64, 64, -64, -64, -64, -64, -64, -64, 64, -64, -64, -64, -64, 64, -64, -64, -64, 64, 64, -64, -64, 64, 64, 64, 64, -64, -64, -64, 64, -64, -64, -64, -64, -64, -64, -64, -64, -64, -64, -64, -64, 64, -64, -64, 64, -64, -64, 64, -64, 64, 64, -64, -64, 64, 64, 64, 64, -64, -64, 64, 64, -64, -64, 64, 64, 64, 64, -64, -64, -64, 64, 64, -64, -64, -64, -64, 64, -64, -64, -64, 64, 64, 64, 64, 64, 64, 64, 64, 64, 64, 64, 64, 64, 64, -64, -64, -64, -64, 64, -64, -64, 64, 64, 64, 64, -64, -64, 64, 64, -64, 64, 64, 64, 64, 64, 64, 64, 64, 64, 64, 64, -64, -64, -64, -64, -64, 64, -64, -64, -64, 64, -64, -64, -64, 64, 64, 64, 64, 64, 64, 64, -64, 64, 64, 64, 64, 64, 64, 64, 64, 64, -64, -64, -64, -64, 64, -64, -64, 64, -64, 64, 64, -64, 64, -64, -64, 64, -64, 64, 64, 64, -64, 64, 64, 64, 64, 64, 64, 64, 64, 64, -64, -64, 64, -64, -64, 64, 64, -64, 64, 64, -64, 64, 64, -64, -64, -64, -64, -64, -64, 64, 64, 64, 64, 64, 64, -64, 64, -64, -64, -64, 64, -64, -64, 64, 64, 64, 64, 64, 64, 64, 64, 64, 64, 64, -64, 64, 64, 64, 64, 64, 64, 64, 64, 64, -64, -64, -64, -64, 64, 64, 64, 64, 64, -64, -64, -64, 64, 64, 64, 64, -64, -64, -64, -64, 64, 64, -64, 64, 64, 64, 64, 64, -64, -64, 64, -64, 64, 64, -64, 64, -64, 64, 64, -64, 64, 64, 64, 64, 64, -64, 64, 64, 64, 64, 64, 64, 64, 64, 64, 64, 64, -64, -64, 64, -64, -64, 64, 64, -64, 64, -64, -64, -64, 64, 64, 64, -64, -64, 64, 64, 64, 64, 64, 64, 64, 64, 64, 64, -64, -64, -64, -64, -64, -64, 64, -64, 64, -64, 64, -64, 64, 64, 64, 64, 64, -64, 64, 64, 64, 64, 64, -64, 64, 64, 64, 64, 64, -64, 64, 64, -64, -64, -64, -64, 64, 64, 64, 64, 64, 64, 64, 64, -64, -64, 64, 64, 64, 64, 64, -64, 64, -64, 64, 64, -64, 64, 64, 64, 64, -64, 64, 64, -64, 64, -64, 64, 64, 64, -64, -64, -64, -64, 64, 64, 64, 64, 64, 64, 64, -64, 64, 64, -64, 64, 64, 64, -64, -64, -64, -64, -64, 64, -64, 64, 64, 64, -64, 64, -64, 64, -64, -64, 64, 64, 64, -64, -64, 64, -64, -64, 64, -64, 64, 64, 64, 64, -64, -64, 64, 64, -64, -64, -64, 64, 64, -64, -64, 64, 64, -64, -64, 64, 64, -64, -64, 64, -64, 64, 64, 64, 64, 64, 64, -64, -64, -64, -64, -64, -64, -64, 64, 64, 64, 64, 64, -64, -64, -64, 64, -64, -64, -64, -64, 64, -64, 64, 64, -64, -64, 64, 64, 64, -64, 64, -64, 64, 64, 64, 64, 64, -64, 64, 64, -64, -64, -64, -64, -64, -64, 64, 64, -64, -64, -64, -64, 64, 64, -64, 64, -64, 64, 64, 64, 64, 64, 64, 64, 64, 64, 64, 64, 64, -64, -64, 64, 64, 64, 64, -64, 64, -64, -64, -64, -64, -64, 64, 64, 64, 64, 64, 64, 64, 64, 64, 64, 64, 64, 64, 64, 64, 64, 64, 64, -64, 64, -64, 64, -64, 64, 64, 64, 64, 64, -64, 64, 64, 64, -64, 64, 64, 64, 64, 64, 64, 64, 64, 64, 64, 64, 64, -64, 64, 64, -64, -64, -64, 64, 64, 64, 64, -64, -64, 64, 64, -64, 64, -64, -64, 64, 64, 64, 64, -64, -64, -64, 64, 64, 64, 64, -64, -64, 64, 64, 64, 64, 64, 64, -64, 64, -64, -64, 64, 64, 64, -64, 64, -64, -64, -64, -64, 64, 64, -64, 64, -64, 64, -64, -64, 64, -64, -64, -64, -64, 64, 64, 64, -64, 64, -64, -64, 64, -64, -64, -64, -64, -64, 64, -64, -64, -64, -64, 64, 64, 64, -64, -64, 64, -64, -64, -64, 64, -64, 64, 64, -64, -64, 64, -64, 64, 64, -64, -64, 64, -64, 64, -64, 64, 64, -64, 64, -64, 64, -64, 64, -64, -64, 64, 64, 64, 64, 64, -64, -64, 64, 64, 64, -64, -64, 64, -64, 64, -64, -64, -64, 64, -64, -64, 64, -64, -64, 64, -64, 64, -64, 64, -64, 64, 64, 64, 64, 64, -64, 64, 64, 64, 64, -64, -64, -64, -64, 64, 64, -64, 64, 64, 64, 64, 64, 64, 64, 64, 64, 64, 64, 64, 64, 64, -64, 64, 64, 64, 64, -64, 64, 64, 64, 64, 64, 64, -64, -64, 64, 64, 64, 64, 64, -64, 64, 64, -64, -64, -64, -64, -64, -64, -64, -64, 64, -64, 64, -64, -64, 64, -64, 64, -64, 64, 64, 64, 64, 64, 64, 64, -64, 64, -64, -64, -64, -64, -64, -64, -64, -64, -64, -64, 64, 64, -64, -64, -64, -64, -64, -64, 64, -64, -64, -64, 64, 64, 64, -64, 64, 64, -64, -64, 64, -64, -64, -64, -64, -64, -64, -64, -64, 64, 64, 64, -64, 64, -64, -64, 64, 64, -64, 64, 64, 64, -64, 64, 64, 64, 64, 64, 64, 64, -64, -64, -64, -64, -64, 64, 64, 64, -64, -64, -64, 64, 64, 64, 64, -64, 64, -64, -64, 64, 64, 64, 64, 64, 64, 64, 64, -64, -64, -64, -64, -64, -64, -64, -64, -64, -64, 64, 64, 64, 64, 64, -64, -64, -64, -64, -64, -64, 64, 64, -64, -64, 64, 64, -64, -64, -64, -64, -64, -64, -64, -64, -64, 64, 64, -64, 64, -64, 64, 64, -64, 64, -64, -64, 64, -64, -64, 64, 64, 64, -64, -64, 64, -64, -64, -64, -64, -64, -64, -64, -64, 64, 64, -64, 64, 64, 64, 64, -64, -64, 64, 64, 64, 64, -64, 64, 64, 64, 64, 64, 64, -64, -64, -64, 64, -64, -64, -64, -64, 64, -64, -64, 64, 64, 64, -64, -64, -64, 64, 64, -64, 64, 64, -64, 64, -64, 64, 64, 64, -64, -64, -64, -64, -64, -64, 64, -64, 64, 64, -64, -64, 64, 64, 64, 64, 64, 64, 64, 64, -64, 64, -64, 64, 64, 64, 64, 64, 64, -64, -64, -64, 64, 64, 64, 64, -64, -64, -64, -64, -64, -64, 64, 64, 64, 64, 64, 64, 64, 64, 64, 64, 64, 64, 64, 64, 64, -64, -64, 64, 64, 64, 64, 64, -64, 64, 64, -64, -64, -64, -64, 64, 64, 64, 64, 64, 64, -64, 64, 64, 64, 64, 64, 64, 64, 64, -64, -64, 64, 64, 64, 64, 64, 64, -64, -64, -64, -64, -64, 64, 64, 64, -64, -64, -64, -64, 64, 64, -64, -64, 64, 64, 64, 64, 64, 64, 64, 64, 64, 64, 64, -64, 64, -64, -64, -64, -64, -64, -64, -64, 64, 64, -64, 64, -64, -64, -64, -64, 64, 64, 64, -64, -64, -64, 64, 64, 64, 64, -64, 64, 64, -64, -64, -64, -64, -64, -64, -64, -64, -64, 64, -64, 64, -64, -64, 64, -64, 64, -64, 64, -64, 64, 64, 64, 64, -64, 64, 64, -64, -64, -64, -64, -64, -64, -64, -64, -64, -64, -64, -64, 64, -64, -64, 64, 64, -64, 64, 64, 64, -64, 64, 64, 64, 64, -64, 64, -64, -64, -64, -64, -64, -64, -64, -64, -64, -64, -64, 64, -64, -64, -64, -64, -64, 64, 64, 64, 64, 64, -64, 64, 64, 64, 64, -64, 64, -64, 64, 64, -64, -64, -64, -64, -64, -64, -64, -64, -64, -64, 64, 64, 64, 64, 64, -64, 64, 64, -64, -64, -64, 64, 64, 64, 64, 64, -64, -64, -64, -64, -64, -64, -64, -64, -64, -64, -64, -64, 64, 64, 64, 64, -64, -64, 64, 64, -64, -64, 64, 64, -64, 64, -64, -64, 64, -64, 64, 64, -64, -64, -64, -64, -64, -64, 64, -64, 64, 64, 64, 64, 64, -64, 64, -64, 64, -64, -64, 64, 64, -64, -64, -64, 64, 64, 64, 64, -64, -64, -64, 64, -64, 64, 64, 64, 64, 64, 64, -64, 64, -64, 64, -64, 64, -64, 64, 64, 64, 64, 64, -64, 64, 64, 64, 64, 64, 64, 64, -64, -64, 64, -64, 64, -64, -64, -64, -64, -64, 64, 64, 64, 64, -64, 64, -64, -64, -64, -64, -64, 64, 64, 64, 64, 64, 64, 64, 64, 64, 64, 64, -64, 64, -64, 64, -64, 64, 64, 64, 64, 64, -64, 64, 64, 64, -64, 64, 64, -64, -64, -64, -64, 64, 64, 64, 64, 64, 64, 64, -64, 64, -64, -64, 64, 64, 64, -64, -64, 64, 64, -64, 64, -64, -64, 64, -64, -64, -64, -64, -64, 64, -64, 64, -64, -64, -64, -64, 64, -64, -64, 64, -64, -64, -64, -64, -64, -64, 64, -64, -64, 64, 64, 64, 64, -64, 64, -64, -64, 64, -64, -64, 64, 64, -64, 64, -64, 64, 64, 64, -64, -64, 64, 64, 64, 64, -64, -64, 64, 64, -64, -64, -64, -64, -64, -64, 64, 64, -64, -64, -64, -64, 64, 64, 64, 64, 64, 64, 64, -64, -64, 64, 64, 64, -64, -64, -64, 64, -64, -64, 64, -64, 64, -64, -64, 64, -64, 64, 64, 64, 64, 64, -64, -64, -64, -64, 64, -64, -64, 64, -64, -64, -64, 64, -64, -64, -64, -64, 64, -64, -64, 64, -64, 64, 64, 64, 64, -64, 64, -64, -64, -64, 64, -64, -64, -64, -64, -64, -64, 64, 64, -64, 64, 64, -64, -64, -64, 64, -64, 64, 64, 64, 64, -64, 64, -64, 64, -64, -64, -64, -64, -64, -64, -64, -64, 64, 64, 64, -64, -64, 64, -64, 64, -64, 64, -64, 64, 64, 64, -64, -64, 64, 64, 64, 64, 64, -64, 64, -64, 64, 64, -64, -64, 64, 64, 64, 64, 64, 64, 64, -64, 64, 64, -64, 64, 64, 64, -64, 64, 64, 64, 64, 64, 64, -64, -64, -64, -64, -64, -64, -64, 64, 64, 64, -64, -64, 64, 64, -64, 64, -64, 64, 64, 64, 64, 64, -64, 64, 64, -64, -64, 64, 64, -64, -64, -64, 64, -64, -64, 64, -64, 64, -64, -64, 64, -64, 64, 64, 64, 64, 64, 64, 64, 64, 64, 64, -64, -64, -64, -64, -64, -64, -64, 64, 64, 64, -64, -64, -64, -64, -64, -64, 64, 64, 64, -64, 64, 64, -64, 64, 64, 64, 64, -64, -64, 64, -64, -64, -64, -64, 64, 64, 64, 64, 64, 64, -64, -64, -64, -64, -64, 64, -64, -64, 64, 64, 64, 64, 64, 64, 64, -64, 64, 64, -64, 64, -64, -64, -64, 64, 64, 64, -64, 64, -64, -64, -64, -64, -64, 64, 64, 64, -64, 64, 64, -64, -64, 64, 64, -64, -64, 64, -64, -64, -64, -64, 64, 64, 64, -64, 64, -64, -64, -64, -64, -64, -64, -64, -64, -64, 64, 64, 64, -64, 64, 64, 64, 64, -64, 64, -64, -64, -64, 64, 64, 64, 64, 64, 64, 64, 64, -64, 64, -64, 64, 64, -64, 64, -64, -64, -64, -64, 64, 64, 64, 64, -64, -64, -64, -64, 64, -64, -64, -64, 64, 64, 64, 64, 64, 64, 64, -64, -64, -64, -64, -64, -64, -64, -64, -64, 64, 64, 64, 64, 64, -64, -64, -64, -64, -64, -64, -64, 64, 64, 64, 64, 64, 64, 64, 64, -64, 64, 64, -64, 64, 64, -64, 64, 64, -64, 64, 64, -64, -64, -64, -64, -64, -64, -64, -64, 64, -64, -64, 64, 64, 64, 64, 64, 64, 64, 64, -64, 64, 64, -64, 64, -64, 64, -64, -64, 64, -64, -64, -64, -64, -64, -64, -64, -64, -64, -64, 64, 64, 64, 64, 64, 64, 64, -64, 64, 64, -64, 64, -64, -64, -64, -64, -64, -64, -64, -64, -64, -64, -64, 64, 64, -64, -64, -64, 64, 64, 64, 64, 64, -64, -64, 64, 64, -64, 64, -64, 64, -64, -64, -64, -64, -64, -64, -64, -64, -64, -64, -64, 64, -64, -64, -64, -64, 64, 64, 64, 64, 64, -64, -64, 64, 64, 64, -64, 64, 64, 64, 64, 64, -64, -64, -64, -64, 64, 64, 64, 64, 64, -64, -64, -64, 64, 64, 64, -64, -64, -64, -64, -64, 64, 64, 64, 64, -64, 64, 64, 64, 64, -64, 64, -64, 64, 64, 64, 64, -64, -64, -64, -64, 64, 64, 64, 64, 64, 64, -64, -64, -64, -64, 64, 64, 64, 64, 64, 64, 64, 64, 64, -64, 64, 64, 64, -64, 64, -64, 64, 64, 64, 64, 64, -64, -64, -64, -64, 64, 64, 64, 64, 64, 64, 64, 64, 64, 64, 64, 64, 64, 64, 64, 64, -64, 64, 64, 64, 64, 64, 64, 64, 64, -64, 64, -64, -64, -64, -64, 64, -64, 64, -64, 64, 64, 64, 64, 64, -64, -64, -64, 64, 64, 64, -64, 64, 64, 64, 64, 64, -64, -64, 64, 64, 64, -64, -64, 64, 64, 64, -64, 64, -64, -64, -64, 64, 64, -64, -64, 64, 64, 64, 64, -64, 64, -64, 64, 64, -64, -64, 64, -64, 64, -64, -64, 64, 64, -64, -64, 64, -64, -64, -64, -64, -64, -64, 64, 64, 64, 64, 64, 64, 64, -64, 64, -64, -64, 64, -64, -64, 64, -64, 64, -64, -64, -64, 64, 64, 64, -64, 64, 64, -64, -64, -64, 64, -64, -64, 64, 64, -64, -64, 64, 64, -64, -64, -64, -64, 64, -64, -64, 64, 64, 64, 64, 64, -64, 64, 64, -64, -64, 64, -64, 64, -64, -64, -64, 64, -64, -64, -64, 64, 64, -64, -64, 64, 64, -64, 64, -64, 64, -64, -64, -64, -64, -64, -64, 64, -64, 64, 64, 64, 64, 64, 64, -64, -64, 64, 64, -64, 64, -64, -64, 64, 64, 64, 64, 64, 64, -64, -64, -64, -64, -64, 64, 64, -64, -64, -64, 64, 64, -64, -64, -64, -64, 64, -64, 64, -64, 64, 64, -64, -64, -64, -64, 64, 64, -64, 64, 64, -64, -64, 64, 64, -64, 64, 64, -64, -64, -64, -64, -64, -64, 64, 64, -64, 64, -64, 64, 64, -64, 64, 64, 64, 64, 64, 64, 64, 64, 64, 64, 64, 64, 64, 64, -64, -64, -64, -64, -64, -64, -64, -64, -64, -64, -64, 64, -64, 64, 64, -64, 64, 64, 64, 64, -64, 64, 64, 64, 64, 64, 64, 64, 64, 64, -64, -64, -64, -64, -64, -64, -64, -64, -64, 64, -64, 64, -64, 64, -64, 64, -64, 64, 64, 64, 64, 64, 64, 64, 64, 64, 64, -64, -64, -64, -64, -64, -64, -64, -64, -64, -64, -64, -64, -64, -64, 64, 64, 64, -64, -64, 64, 64, 64, 64, 64, 64, 64, 64, 64, 64, -64, -64, -64, 64, 64, -64, -64, -64, -64, -64, -64, 64, -64, 64, 64, 64, -64, -64, -64, 64, -64, 64, 64, 64, 64, 64, 64, 64, 64, 64, -64, 64, -64, -64, -64, -64, -64, -64, -64, -64, -64, 64, 64, 64, 64, 64, 64, -64, 64, 64, 64, 64, 64, 64, -64, -64, 64, 64, -64, -64, -64, -64, -64, -64, -64, -64, 64, 64, -64, 64, -64, -64, 64, 64, 64, 64, 64, 64, 64, 64, -64, -64, -64, 64, 64, 64, -64, -64, 64, -64, -64, -64, -64, -64, -64, 64, 64, 64, 64, 64, 64, 64, 64, 64, 64, 64, 64, 64, -64, -64, 64, 64, 64, 64, -64, -64, -64, 64, -64, 64, 64, -64, 64, -64, -64, 64, 64, 64, -64, 64, 64, 64, 64, 64, -64, -64, -64, -64, 64, 64, 64, 64, -64, -64, -64, 64, 64, 64, 64, 64, 64, 64, 64, 64, 64, -64, 64, -64, 64, 64, 64, -64, -64, -64, 64, 64, 64, 64, -64, -64, -64, -64, 64, 64, 64, 64, 64, -64, -64, 64, 64, -64, 64, -64, 64, -64, 64, 64, 64, 64, 64, -64, 64, -64, 64, 64, -64, -64, -64, 64, 64, 64, 64, 64, 64, -64, -64, 64, -64, -64, -64, -64, 64, -64, 64, 64, 64, 64, 64, 64, -64, 64, 64, 64, -64, -64, -64, 64, 64, 64, 64, -64, 64, -64, 64, 64, 64, 64, 64, -64, -64, 64, 64, 64, 64, 64, 64, 64, 64, -64, -64, -64, -64, -64, 64, 64, 64, 64, 64, 64, 64, 64, 64, -64, -64, 64, -64, -64, -64, -64, 64, 64, 64, 64, 64, -64, 64, 64, -64, 64, -64, 64, 64, 64, 64, -64, 64, -64, 64, -64, 64, -64, 64, 64, 64, -64, -64, 64, -64, -64, -64, -64, 64, -64, -64, -64, 64, 64, 64, 64, 64, 64, 64, 64, 64, 64, -64, 64, 64, -64, 64, 64, 64, 64, -64, -64, -64, -64, -64, -64, -64, -64, 64, 64, 64, 64, 64, 64, 64, 64, 64, 64, -64, 64, -64, 64, -64, 64, -64, -64, 64, 64, -64, -64, -64, 64, -64, -64, -64, 64, 64, 64, 64, 64, 64, 64, 64, 64, 64, -64, -64, -64, -64, -64, 64, 64, -64, -64, -64, 64, 64, -64, -64, -64, -64, -64, -64, -64, 64, 64, 64, -64, 64, 64, 64, 64, 64, 64, -64, 64, 64, -64, -64, -64, 64, 64, 64, 64, 64, 64, 64, -64, 64, -64, 64, -64, 64, 64, 64, 64, -64, 64, 64, -64, -64, -64, 64, 64, 64, 64, -64, -64, -64, 64, 64, -64, 64, 64, 64, 64, 64, 64, 64, 64, 64, 64, -64, -64, -64, -64, 64, -64, -64, -64, -64, 64, 64, -64, 64, -64, 64, -64, 64, 64, 64, 64, 64, -64, 64, -64, 64, 64, 64, 64, -64, -64, -64, 64, 64, -64, -64, 64, 64, -64, 64, 64, 64, 64, 64, 64, 64, 64, 64, 64, -64, -64, 64, -64, 64, -64, -64, -64, 64, -64, 64, -64, 64, -64, -64, -64, 64, -64, 64, 64, -64, 64, 64, -64, -64, -64, -64, -64, 64, 64, 64, 64, 64, 64, 64, 64, -64, -64, -64, 64, 64, -64, -64, -64, 64, 64, -64, -64, -64, -64, 64, 64, 64, 64, 64, 64, -64, 64, -64, 64, 64, 64, -64, 64, -64, 64, -64, -64, 64, -64, -64, 64, -64, -64, 64, -64, -64, 64, -64, -64, -64, 64, -64, 64, -64, -64, -64, 64, 64, 64, -64, -64, -64, 64, 64, -64, 64, 64, 64, -64, 64, -64, 64, 64, 64, -64, 64, 64, -64, -64, -64, 64, -64, -64, -64, -64, -64, -64, 64, -64, -64, -64, 64, 64, 64, 64, -64, 64, -64, -64, 64, -64, -64, -64, -64, -64, -64, 64, -64, -64, -64, -64, -64, 64, 64, 64, 64, 64, 64, -64, -64, -64, -64, -64, -64, -64, 64, -64, 64, -64, -64, 64, -64, -64, -64, -64, -64, -64, -64, -64, -64, -64, -64, 64, 64, 64, 64, 64, 64, -64, -64, -64, -64, -64, 64, 64, -64, 64, 64, -64, 64, -64, -64, -64, -64, -64, -64, -64, -64, -64, -64, 64, 64, 64, 64, 64, -64, -64, -64, -64, -64, -64, -64, -64, 64, -64, -64, 64, 64, 64, 64, -64, -64, -64, -64, -64, -64, -64, -64, 64, 64, 64, 64, 64, 64, 64, -64, 64, -64, -64, -64, -64, 64, -64, 64, -64, -64, 64, -64, 64, -64, -64, -64, -64, -64, -64, 64, 64, 64, 64, 64, 64, 64, 64, -64, -64, -64, -64, -64, -64, -64, -64, -64, 64, 64, -64, -64, -64, -64, -64, -64, -64, 64, -64, 64, -64, 64, 64, 64, -64, -64, -64, 64, -64, -64, -64, -64, -64, -64, -64, -64, 64, 64, -64, -64, -64, -64, -64, -64, 64, 64, 64, 64, 64, 64, -64, -64, -64, -64, -64, -64, -64, 64, -64, -64, -64, -64, 64, -64, 64, 64, 64, 64, -64, 64, 64, 64, 64, -64, -64, -64, -64, 64, -64, 64, 64, 64, 64, -64, 64, 64, 64, -64, -64, -64, -64, 64, 64, 64, 64, 64, -64, 64, 64, 64, -64, -64, -64, -64, -64, -64, 64, 64, 64, 64, 64, 64, 64, 64, 64, -64, -64, -64, 64, -64, -64, 64, 64, 64, 64, 64, 64, -64, -64, -64, -64, -64, -64, 64, 64, 64, -64, -64, 64, 64, 64, 64, 64, 64, -64, -64, -64, -64, -64, 64, 64, 64, 64, 64, -64, -64, -64, -64, -64, -64, -64, -64, -64, -64, -64, 64, 64, 64, 64, 64, 64, 64, 64, 64, -64, -64, -64, 64, 64, 64, 64, -64, 64, -64, -64, -64, -64, -64, -64, -64, -64, -64, 64, -64, 64, -64, 64, 64, 64, 64, 64, 64, 64, -64, -64, 64, 64, 64, 64, -64, 64, 64, -64, -64, -64, -64, -64, -64, -64, -64, 64, 64, -64, -64, 64, -64, -64, 64, 64, 64, -64, -64, 64, 64, 64, -64, -64, -64, -64, -64, -64, -64, -64, -64, -64, -64, -64, -64, 64, -64, -64, -64, -64, 64, -64, 64, 64, 64, -64, -64, 64, -64, -64, 64, 64, 64, -64, 64, -64, -64, 64, 64, 64, -64, 64, 64, 64, -64, 64, -64, -64, 64, 64, -64, 64, 64, 64, -64, -64, -64, -64, -64, 64, 64, -64, 64, 64, 64, -64, 64, 64, -64, -64, -64, 64, -64, 64, -64, -64, 64, -64, 64, 64, 64, 64, -64, 64, 64, -64, 64, 64, -64, -64, 64, 64, 64, 64, 64, 64, 64, 64, -64, -64, 64, -64, -64, -64, -64, 64, -64, -64, 64, 64, -64, 64, -64, -64, -64, -64, 64, -64, -64, -64, 64, -64, -64, -64, -64, 64, -64, -64, 64, -64, -64, -64, 64, -64, 64, 64, 64, -64, 64, 64, -64, -64, 64, 64, 64, 64, -64, 64, -64, -64, -64, -64, -64, -64, 64, -64, -64, -64, -64, -64, 64, -64, -64, 64, -64, -64, 64, 64, -64, 64, 64, 64, 64, -64, -64, -64, -64, -64, -64, -64, -64, -64, -64, -64, -64, -64, -64, -64, -64, 64, 64, 64, -64, -64, 64, 64, 64, 64, 64, 64, 64, 64, 64, -64, -64, -64, -64, -64, -64, -64, 64, -64, -64, -64, -64, -64, -64, -64, -64, 64, -64, -64, 64, 64, -64, 64, -64, 64, 64, -64, 64, -64, -64, -64, -64, 64, 64, -64, 64, -64, 64, -64, -64, -64, 64, 64, -64, 64, -64, -64, -64, -64, 64, 64, 64, 64, -64, -64, 64, -64, -64, -64, 64, 64, -64, 64, 64, 64, 64, 64, -64, 64, 64, 64, -64, 64, -64, -64, -64, -64, 64, -64, 64, 64, 64, 64, -64, -64, -64, -64, 64, 64, -64, 64, -64, 64, 64, 64, 64, 64, 64, -64, 64, 64, 64, 64, 64, -64, -64, -64, 64, 64, 64, 64, 64, 64, 64, 64, 64, 64, 64, 64, 64, 64, 64, 64, -64, -64, 64, -64, -64, 64, 64, 64, 64, -64, -64, -64, -64, -64, 64, 64, 64, 64, 64, 64, 64, 64, -64, 64, 64, 64, 64, 64, -64, 64, 64, -64, -64, 64, -64, -64, 64, 64, 64, -64, 64, -64, 64, 64, 64, -64, 64, -64, -64, 64, 64, 64, -64, -64, -64, -64, -64, -64, -64, 64, -64, -64, 64, 64, 64, -64, 64, 64, 64, 64, -64, 64, 64, 64, 64, 64, -64, -64, 64, 64, -64, -64, 64, 64, 64, 64, -64, -64, -64, -64, -64, 64, -64, 64, 64, 64, -64, -64, 64, 64, 64, 64, 64, 64, 64, 64, 64, 64, 64, 64, 64, 64, -64, 64, 64, -64, -64, -64, 64, 64, 64, 64, 64, 64, -64, -64, -64, 64, -64, 64, -64, -64, -64, -64, -64, 64, 64, 64, 64, 64, 64, -64, -64, 64, -64, -64, -64, 64, 64, 64, 64, -64, -64, -64, 64, 64, -64, -64, -64, -64, -64, -64, -64, 64, 64, 64, 64, 64, 64, 64, -64, -64, -64, 64, -64, 64, -64, -64, -64, -64, -64, -64, -64, -64, -64, 64, 64, -64, -64, -64, -64, 64, -64, -64, 64, 64, 64, -64, 64, -64, -64, 64, 64, 64, 64, -64, 64, -64, -64, -64, -64, -64, -64, -64, -64, -64, -64, -64, 64, 64, 64, 64, -64, 64, -64, -64, -64, -64, 64, 64, 64, -64, -64, 64, -64, -64, -64, -64, -64, -64, 64, 64, 64, 64, -64, -64, 64, -64, -64, 64, 64, 64, -64, 64, -64, -64, -64, 64, 64, -64, -64, 64, 64, 64, 64, 64, -64, -64, 64, 64, 64, 64, -64, -64, 64, -64, -64, -64, -64, -64, -64, -64, -64, -64, -64, 64, 64, 64, 64, 64, -64, -64, -64, 64, 64, 64, 64, 64, -64, -64, 64, -64, -64, -64, -64, -64, -64, -64, -64, -64, -64, -64, 64, 64, 64, 64, -64, -64, 64, 64, -64, 64, 64, 64, 64, -64, -64, 64, 64, -64, 64, -64, -64, -64, -64, -64, -64, -64, -64, -64, -64, -64, 64, -64, 64, 64, -64, 64, 64, 64, 64, 64, 64, 64, -64, 64, 64, 64, -64, -64, -64, -64, -64, -64, -64, 64, 64, -64, -64, -64, -64, 64, 64, 64, -64, -64, 64, 64, 64, 64, 64, 64, -64, 64, 64, -64, -64, 64, 64, 64, 64, -64, 64, -64, -64, -64, -64, -64, -64, 64, 64, -64, 64, -64, 64, 64, 64, 64, 64, 64, 64, 64, -64, -64, -64, -64, -64, -64, -64, 64, 64, 64, 64, -64, -64, -64, 64, 64, -64, -64, -64, -64, 64, 64, 64, 64, 64, -64, -64, 64, -64, -64, 64, -64, 64, 64, -64, 64, 64, 64, -64, 64, -64, 64, 64, -64, 64, 64, -64, -64, 64, 64, 64, -64, 64, -64, -64, -64, -64, -64, -64, -64, 64, -64, 64, 64, 64, -64, -64, -64, 64, -64, 64, 64, -64, 64, -64, 64, 64, -64, 64, -64, -64, -64, -64, -64, -64, -64, 64, -64, 64, -64, 64, 64, 64, 64, -64, 64, -64, 64, 64, -64, -64, 64, -64, -64, 64, 64, -64, -64, -64, 64, -64, -64, -64, 64, 64, 64, 64, 64, -64, -64, 64, -64, -64, -64, -64, 64, 64, -64, 64, 64, -64, -64, 64, -64, -64, -64, -64, -64, -64, -64, -64, -64, 64, 64, 64, 64, 64, 64, -64, -64, -64, -64, 64, 64, 64, -64, 64, -64, 64, -64, -64, -64, -64, -64, -64, -64, -64, -64, -64, 64, 64, 64, -64, -64, -64, -64, -64, -64, -64, -64, -64, 64, -64, 64, 64, -64, 64, -64, 64, -64, 64, -64, -64, -64, -64, -64, -64, 64, -64, -64, 64, -64, -64, -64, -64, -64, -64, -64, -64, 64, 64, -64, 64, 64, 64, -64, -64, -64, -64, -64, -64, -64, -64, 64, 64, 64, 64, 64, -64, -64, -64, -64, -64, -64, 64, 64, 64, 64, -64, 64, -64, -64, -64, -64, -64, -64, -64, 64, 64, -64, -64, -64, 64, 64, 64, 64, -64, -64, -64, -64, 64, 64, 64, -64, 64, 64, 64, 64, 64, -64, 64, -64, -64, -64, 64, 64, -64, -64, 64, -64, -64, -64, -64, 64, 64, -64, 64, 64, 64, 64, 64, -64, 64, 64, 64, 64, -64, 64, 64, -64, -64, -64, -64, 64, 64, 64, -64, -64, 64, 64, -64, 64, 64, -64, 64, 64, 64, -64, 64, 64, 64, 64, -64, 64, -64, 64, 64, -64, -64, 64, -64, 64, 64, 64, -64, 64, 64, 64, 64, 64, 64, -64, 64, 64, -64, 64, 64, 64, 64, 64, 64, -64, 64, -64, 64, 64, 64, -64, -64, -64, -64, 64, -64, 64, 64, -64, 64, 64, 64, 64, -64, 64, 64, -64, -64, -64, -64, 64, -64, -64, 64, 64, -64, -64, 64, -64, -64, -64, -64, 64, 64, 64, 64, -64, 64, -64, 64, 64, 64, 64, -64, 64, -64, -64, 64, 64, 64, 64, -64, -64, 64, -64, 64, -64, 64, -64, 64, 64, -64, -64, 64, 64, -64, -64, -64, 64, 64, 64, 64, -64, -64, -64, 64, -64, -64, -64, 64, 64, -64, -64, -64, -64, 64, -64, -64, -64, -64, -64, 64, -64, 64, -64, -64, -64, -64, 64, -64, 64, 64, 64, 64, -64, 64, -64, 64, 64, 64, -64, -64, -64, -64, -64, 64, 64, -64, -64, -64, -64, -64, -64, 64, -64, -64, -64, -64, -64, -64, -64, -64, 64, 64, 64, -64, -64, 64, 64, 64, 64, -64, -64, -64, -64, -64, 64, 64, 64, 64, -64, -64, -64, 64, 64, -64, -64, 64, -64, -64, -64, -64, 64, 64, -64, -64, 64, 64, -64, -64, 64, 64, 64, 64, 64, 64, 64, 64, -64, -64, -64, -64, -64, -64, -64, -64, -64, -64, 64, -64, 64, 64, 64, -64, 64, -64, -64, 64, -64, 64, 64, 64, 64, 64, -64, 64, 64, -64, -64, -64, -64, -64, -64, 64, -64, -64, -64, -64, -64, 64, -64, -64, -64, 64, -64, -64, -64, -64, -64, 64, 64, 64, 64, 64, 64, 64, -64, 64, 64, -64, 64, -64, 64, 64, 64, 64, 64, -64, 64, 64, 64, -64, -64, -64, -64, 64, 64, 64, 64, 64, 64, -64, 64, -64, -64, -64, -64, 64, 64, 64, 64, 64, 64, -64, 64, 64, -64, -64, -64, 64, 64, 64, 64, -64, 64, 64, 64, 64, 64, -64, -64, 64, 64, -64, -64, 64, 64, 64, 64, 64, 64, 64, -64, 64, -64, -64, 64, 64, 64, 64, 64, 64, 64, 64, 64, -64, -64, -64, 64, 64, 64, 64, -64, -64, 64, 64, 64, 64, 64, 64, -64, -64, -64, 64, -64, 64, 64, 64, 64, 64, 64, 64, 64, -64, -64, 64, 64, 64, 64, 64, -64, 64, 64, 64, 64, 64, 64, 64, -64, -64, 64, 64, 64, 64, 64, 64, 64, 64, 64, 64, -64, -64, -64, 64, 64, 64, 64, 64, 64, 64, 64, 64, 64, 64, 64, 64, 64, -64, 64, 64, -64, 64, 64, 64, 64, 64, 64, -64, -64, -64, 64, 64, 64, 64, 64, 64, -64, -64, 64, 64, 64, 64, 64, 64, -64, 64, 64, -64, 64, 64, 64, 64, 64, 64, -64, -64, -64, 64, 64, 64, 64, 64, 64, -64, -64, -64, 64, 64, 64, 64, 64, 64, -64, -64, 64, 64, 64, -64, 64, 64, 64, -64, -64, -64, -64, 64, 64, 64, 64, 64, -64, -64, -64, -64, 64, 64, 64, 64, -64, -64, 64, -64, 64, 64, -64, -64, 64, 64, 64, -64, -64, -64, -64, -64, 64, -64, 64, 64, -64, -64, 64, -64, -64, 64, 64, -64, -64, -64, 64, 64, -64, -64, 64, -64, -64, 64, -64, -64, -64, -64, -64, 64, 64, 64, -64, -64, -64, -64, -64, -64, -64, -64, 64, -64, -64, 64, 64, 64, -64, 64, 64, 64, 64, 64, -64, -64, -64, -64, 64, 64, 64, -64, -64, -64, -64, -64, 64, -64, -64, -64, -64, 64, -64, 64, 64, 64, 64, 64, 64, 64, 64, 64, -64, -64, -64, 64, 64, 64, 64, -64, -64, 64, 64, 64, -64, -64, -64, -64, -64, 64, 64, -64, 64, -64, 64, 64, -64, 64, 64, 64, -64, 64, 64, 64, -64, -64, -64, 64, 64, 64, 64, -64, -64, -64, -64, -64, -64, 64, -64, -64, 64, -64, -64, 64, -64, 64, 64, 64, -64, 64, -64, 64, -64, -64, 64, -64, 64, 64, 64, 64, -64, -64, -64, -64, -64, -64, -64, -64, -64, 64, 64, 64, 64, 64, 64, 64, 64, 64, -64, 64, -64, -64, -64, 64, 64, 64, 64, 64, -64, -64, 64, 64, -64, -64, -64, -64, 64, -64, -64, 64, 64, -64, 64, 64, 64, -64, -64, -64, -64, -64, 64, 64, 64, 64, 64, 64, 64, -64, -64, 64, 64, 64, 64, -64, 64, -64, -64, 64, 64, 64, 64, 64, -64, -64, 64, -64, -64, 64, 64, -64, -64, 64, 64, 64, 64, -64, 64, 64, 64, 64, 64, 64, 64, -64, -64, -64, 64, 64, -64, -64, -64, -64, -64, -64, -64, 64, 64, 64, -64, 64, 64, 64, 64, 64, 64, 64, 64, 64, -64, -64, -64, -64, 64, 64, 64, -64, -64, -64, -64, -64, -64, -64, 64, 64, 64, 64, -64, 64, 64, 64, 64, 64, 64, -64, 64, -64, -64, 64, -64, -64, -64, -64, -64, -64, -64, -64, 64, -64, -64, -64, 64, 64, -64, 64, -64, -64, 64, 64, 64, -64, -64, 64, -64, 64, 64, 64, -64, -64, -64, -64, -64, 64, 64, -64, 64, -64, -64, -64, 64, 64, 64, -64, 64, -64, -64, -64, -64, -64, -64, -64, 64, 64, -64, 64, -64, 64, -64, -64, -64, 64, 64, 64, 64, -64, -64, -64, -64, 64, -64, 64, 64, 64, 64, 64, -64, -64, 64, 64, 64, -64, 64, -64, 64, 64, -64, 64, -64, -64, 64, 64, -64, 64, -64, 64, 64, 64, 64, -64, -64, 64, 64, 64, -64, -64, 64, 64, 64, 64, 64, -64, -64, -64, -64, 64, 64, 64, -64, 64, -64, 64, 64, 64, -64, -64, 64, -64, -64, 64, -64, 64, 64, 64, 64, -64, 64, -64, 64, 64, -64, -64, -64, -64, 64, -64, -64, 64, 64, 64, -64, -64, 64, -64, 64, -64, 64, -64, -64, 64, -64, 64, -64, -64, -64, -64, 64, -64, -64, 64, -64, -64, 64, 64, 64, 64, 64, -64, 64, 64, 64, -64, 64, 64, 64, 64, -64, 64, 64, 64, 64, 64, -64, 64, -64, 64, 64, -64, 64, -64, 64, 64, -64, -64, -64, 64, 64, 64, 64, 64, -64, 64, -64, -64, -64, -64, -64, -64, -64, -64, 64, 64, 64, 64, -64, -64, 64, -64, -64, -64, -64, 64, 64, 64, 64, 64, 64, 64, 64, 64, -64, -64, 64, -64, -64, 64, 64, -64, -64, -64, -64, 64, -64, -64, -64, -64, 64, -64, 64, 64, 64, 64, 64, 64, 64, 64, -64, 64, -64, -64, -64, -64, -64, -64, -64, -64, 64, -64, 64, -64, 64, 64, -64, 64, 64, 64, 64, 64, 64, 64, -64, 64, -64, -64, -64, -64, -64, -64, -64, -64, -64, 64, -64, -64, -64, -64, -64, 64, -64, -64, -64, -64, 64, 64, 64, 64, -64, 64, -64, -64, 64, -64, -64, -64, -64, -64, 64, -64, -64, -64, 64, -64, -64, -64, -64, -64, -64, -64, 64, 64, -64, 64, 64, -64, 64, -64, -64, 64, -64, -64, -64, -64, -64, -64, -64, -64, -64, -64, 64, -64, -64, -64, -64, 64, -64, -64, -64, 64, 64, 64, -64, -64, -64, 64, -64, -64, 64, -64, -64, -64, -64, -64, -64, 64, -64, -64, -64, 64, -64, 64, 64, -64, -64, -64, -64, -64, 64, 64, 64, -64, -64, -64, -64, -64, -64, -64, -64, -64, -64, -64, -64, -64, -64, -64, -64, 64, 64, -64, 64, 64, 64, 64, 64, 64, 64, -64, -64, -64, -64, -64, -64, 64, -64, -64, -64, 64, -64, -64, -64, -64, 64, 64, 64, 64, 64, 64, -64, -64, 64, -64, 64, -64, -64, -64, -64, 64, -64, 64, -64, -64, -64, -64, -64, -64, -64, -64, -64, 64, -64, 64, 64, 64, 64, -64, 64, -64, -64, 64, 64, -64, 64, -64, -64, -64, -64, -64, -64, -64, 64, -64, -64, -64, -64, -64, 64, 64, 64, -64, 64, 64, 64, -64, 64, 64, 64, 64, -64, -64, -64, -64, 64, -64, -64, 64, -64, -64, -64, 64, -64, 64, -64, -64, -64, 64, -64, 64, 64, -64, 64, 64, 64, -64, 64, 64, 64, -64, -64, -64, -64, -64, -64, -64, 64, 64, 64, 64, 64, -64, -64, 64, 64, 64, -64, 64, 64, -64, 64, 64, -64, -64, 64, 64, -64, 64, -64, -64, -64, -64, 64, -64, -64, -64, 64, -64, 64, -64, -64, -64, 64, -64, -64, 64, -64, 64, -64, -64, -64, -64, 64, -64, 64, -64, -64, -64, -64, -64, 64, -64, -64, 64, 64, -64, -64, -64, -64, -64, 64, 64, -64, -64, 64, -64, 64, 64, -64, 64, 64, 64, -64, 64, 64, -64, 64, 64, -64, 64, -64, 64, -64, 64, 64, -64, 64, -64, -64, -64, 64, -64, -64, -64, -64, -64, 64, -64, -64, 64, -64, 64, 64, 64, -64, 64, -64, 64, 64, -64, -64, -64, -64, -64, -64, 64, -64, -64, -64, -64, -64, -64, -64, -64, -64, -64, 64, 64, -64, 64, 64, -64, -64, 64, 64, 64, -64, -64, 64, 64, 64, -64, -64, -64, -64, -64, -64, -64, -64, -64, 64, 64, 64, -64, 64, 64, 64, 64, -64, 64, 64, 64, -64, -64, -64, 64, -64, 64, -64, -64, 64, 64, -64, -64, -64, 64, -64, -64, -64, -64, 64, 64, -64, 64, -64, -64, 64, 64, -64, 64, -64, -64, -64, -64, 64, -64, -64, -64, 64, -64, 64, -64, -64, -64, -64, -64, -64, 64, -64, -64, -64, -64, -64, -64, -64, -64, 64, -64, -64, 64, -64, -64, 64, -64, -64, 64, 64, -64, 64, 64, -64, -64, -64, -64, 64, 64, 64, -64, -64, -64, -64, 64, 64, -64, -64, 64, 64, -64, 64, -64, 64, -64, -64, -64, -64, -64, -64, -64, 64, -64, -64, 64, 64, 64, 64, -64, 64, -64, 64, 64, -64, -64, 64, -64, 64, -64, -64, -64, -64, 64, -64, 64, -64, -64, 64, -64, 64, -64, -64, 64, 64, 64, -64, 64, -64, -64, 64, -64, 64, 64, 64, -64, 64, 64, 64, 64, -64, 64, -64, -64, -64, 64, -64, -64, -64, 64, -64, 64, 64, -64, 64, -64, -64, -64, 64, 64, 64, 64, -64, -64, 64, 64, -64, 64, -64, -64, 64, -64, 64, -64, -64, 64, -64, 64, -64, 64, 64, -64, -64, -64, 64, -64, -64, -64, 64, 64, 64, 64, -64, 64, -64, -64, -64, -64, -64, 64, -64, -64, -64, -64, -64, -64, -64, -64, 64, -64, 64, -64, 64, -64, 64, 64, -64, -64, -64, -64, 64, -64, -64, 64, -64, -64, -64, -64, -64, -64, -64, -64, -64, -64, -64, -64, -64, -64, 64, 64, -64, 64, 64, 64, -64, 64, -64, -64, -64, -64, -64, -64, -64, -64, 64, 64, -64, -64, -64, -64, -64, -64, -64, -64, 64, 64, -64, -64, -64, 64, 64, -64, -64, -64, -64, -64, -64, -64, -64, -64, -64, 64, 64, 64, 64, -64, -64, 64, -64, -64, -64, -64, 64, -64, -64, -64, -64, 64, -64, -64, 64, -64, 64, -64, -64, -64, -64, -64, -64, -64, -64, 64, 64, -64, 64, 64, -64, -64, 64, -64, -64, -64, -64, -64, 64, 64, -64, -64, 64, -64, 64, -64, -64, -64, 64, 64, -64, -64, 64, -64, -64, -64, -64, -64, -64, 64, 64, 64, -64, -64, -64, -64, -64, -64, -64, -64, -64, -64, 64, -64, -64, -64, 64, -64, 64, -64, -64, 64, 64, 64, 64, 64, -64, 64, 64, 64, -64, -64, -64, -64, -64, 64, -64, -64, 64, -64, -64, -64, -64, -64, 64, 64, 64, 64, 64, 64, 64, 64, 64, 64, 64, 64, -64, 64, -64, -64, -64, 64, 64, 64, 64, -64, -64, 64, -64, 64, 64, -64, 64, 64, 64, 64, 64, 64, 64, 64, 64, 64, 64, 64, -64, -64, 64, -64, -64, -64, 64, -64, 64, -64, -64, -64, 64, 64, 64, 64, 64, 64, 64, 64, 64, 64, 64, 64, 64, 64, 64, 64, 64, 64, -64, -64, -64, -64, -64, -64, 64, -64, 64, 64, 64, 64, 64, 64, 64, 64, 64, 64, 64, 64, 64, 64, 64, 64, 64, 64, 64, -64, 64, -64, -64, 64, 64, -64, -64, 64, 64, 64, 64, -64, -64, 64, 64, 64, -64, -64, -64, -64, 64, 64, 64, 64, 64, 64, 64, 64, 64, -64, 64, -64, 64, -64, 64, 64, 64, 64, 64, -64, 64, 64, 64, 64, 64, -64, -64, -64, -64, -64, 64, 64, 64, 64, 64, 64, 64, 64, 64, 64, 64, -64, -64, 64, 64, 64, 64, 64, 64, 64, 64, -64, 64, -64, -64, -64, -64, 64, 64, 64, 64, 64, 64, 64, 64, -64, -64, 64, 64, -64, -64, 64, 64, 64, -64, 64, 64, 64, 64, 64, -64, -64, -64, -64, -64, -64, 64, 64, 64, 64, -64, 64, 64, 64, -64, 64, -64, -64, -64, -64, 64, 64, 64, -64, -64, 64, 64, 64, -64, -64, -64, -64, 64, 64, 64, -64, 64, -64, -64, -64, -64, -64, -64, 64, 64, -64, 64, 64, -64, 64, 64, -64, -64, -64, 64, -64, 64, -64, -64, 64, 64, 64, -64, -64, -64, -64, -64, -64, -64, -64, -64, -64, -64, 64, 64, -64, -64, 64, -64, -64, -64, -64, -64, 64, -64, -64, -64, 64, 64, 64, -64, -64, -64, -64, -64, -64, -64, -64, -64, 64, -64, -64, 64, -64, -64, 64, -64, -64, -64, -64, -64, -64, 64, -64, -64, 64, -64, -64, -64, -64, -64, -64, -64, -64, -64, -64, -64, -64, -64, -64, 64, -64, -64, -64, -64, -64, -64, -64, -64, -64, 64, 64, -64, -64, 64, -64, -64, -64, -64, -64, -64, -64, -64, -64, -64, 64, 64, -64, 64, -64, -64, -64, -64, 64, -64, -64, -64, -64, -64, -64, -64, -64, -64, -64, 64, -64, -64, 64, -64, 64, -64, -64, 64, 64, 64, -64, 64, 64, 64, 64, 64, 64, 64, -64, -64, -64, -64, -64, -64, -64, 64, -64, -64, -64, -64, 64, 64, -64, 64, 64, -64, 64, 64, 64, -64, 64, -64, 64, 64, 64, -64, 64, -64, -64, 64, 64, -64, -64, -64, -64, -64, -64, -64, 64, 64, 64, 64, 64, -64, 64, 64, 64, 64, 64, 64, 64, 64, 64, 64, 64, -64, 64, -64, -64, -64, -64, 64, -64, -64, 64, 64, 64, 64, 64, 64, 64, -64, -64, -64, -64, 64, 64, -64, 64, -64, 64, 64, 64, 64, 64, -64, 64, -64, 64, -64, 64, -64, 64, 64, 64, 64, 64, 64, 64, 64, -64, -64, -64, 64, -64, -64, -64, -64, -64, -64, 64, 64, -64, -64, 64, 64, 64, 64, 64, 64, 64, -64, 64, 64, -64, 64, -64, 64, -64, -64, 64, 64, -64, 64, 64, 64, -64, 64, -64, 64, -64, -64, 64, -64, -64, 64, 64, -64, 64, 64, 64, 64, 64, -64, -64, 64, 64, 64, -64, 64, -64, -64, -64, -64, -64, 64, 64, 64, 64, 64, -64, 64, 64, 64, -64, 64, 64, -64, 64, -64, -64, 64, 64, 64, 64, 64, 64, 64, -64, 64, 64, -64, 64, -64, -64, 64, 64, -64, -64, 64, 64, 64, 64, 64, 64, -64, 64, 64, 64, 64, 64, 64, 64, -64, -64, -64, -64, -64, 64, 64, 64, -64, -64, 64, -64, 64, -64, 64, -64, 64, 64, 64, -64, -64, 64, 64, 64, -64, 64, -64, -64, -64, 64, -64, -64, 64, 64, 64, 64, 64, -64, -64, -64, -64, -64, 64, 64, 64, 64, 64, -64, -64, -64, 64, 64, 64, 64, -64, -64, -64, -64, -64, -64, 64, 64, 64, 64, 64, -64, -64, -64, -64, 64, 64, 64, 64, 64, -64, -64, -64, -64, 64, -64, -64, 64, -64, -64, 64, -64, 64, 64, 64, 64, 64, -64, -64, 64, 64, -64, 64, 64, 64, -64, 64, -64, -64, -64, -64, -64, -64, -64, -64, 64, -64, -64, -64, 64, 64, -64, 64, 64, 64, 64, 64, -64, -64, -64, 64, 64, 64, 64, 64, -64, -64, -64, -64, -64, -64, -64, 64, 64, 64, -64, 64, 64, 64, 64, 64, 64, 64, 64, -64, -64, -64, -64, -64, 64, 64, 64, 64, 64, -64, -64, -64, -64, -64, 64, -64, 64, 64, 64, -64, 64, -64, -64, 64, 64, 64, 64, -64, -64, -64, -64, -64, 64, 64, 64, 64, 64, -64, -64, -64, -64, -64, 64, 64, 64, 64, -64, -64, 64, 64, -64, 64, -64, -64, -64, -64, -64, -64, -64, -64, 64, 64, 64, -64, -64, -64, -64, -64, 64, -64, 64, -64, -64, -64, -64, 64, -64, -64, -64, -64, 64, -64, -64, -64, -64, -64, -64, 64, 64, 64, 64, -64, 64, -64, -64, 64, -64, -64, 64, 64, 64, -64, -64, 64, -64, 64, -64, -64, -64, -64, -64, -64, -64, -64, 64, 64, 64, 64, -64, -64, -64, -64, -64, -64, 64, 64, -64, -64, 64, -64, -64, 64, 64, -64, -64, -64, -64, -64, -64, -64, 64, -64, 64, 64, 64, -64, -64, -64, -64, -64, -64, 64, -64, 64, 64, 64, 64, -64, -64, -64, 64, -64, 64, -64, -64, 64, -64, 64, -64, 64, 64, 64, -64, 64, -64, -64, -64, -64, -64, -64, 64, 64, 64, 64, 64, -64, -64, 64, 64, 64, -64, -64, -64, 64, 64, 64, -64, 64, -64, -64, -64, 64, -64, -64, -64, -64, 64, 64, 64, 64, 64, -64, -64, -64, 64, -64, -64, 64, 64, 64, -64, 64, 64, 64, 64, -64, -64, -64, -64, -64, 64, -64, -64, -64, 64, 64, 64, 64, 64, -64, -64, -64, -64, -64, -64, 64, 64, 64, 64, 64, 64, 64, 64, -64, -64, -64, -64, 64, 64, 64, 64, 64, -64, 64, 64, -64, 64, -64, -64, -64, -64, 64, 64, -64, 64, 64, 64, -64, -64, 64, 64, -64, -64, 64, 64, 64, -64, 64, 64, -64, 64, 64, 64, 64, 64, -64, -64, -64, 64, 64, -64, 64, 64, -64, -64, -64, -64, 64, 64, 64, 64, 64, 64, 64, 64, -64, 64, -64, 64, 64, 64, -64, -64, -64, -64, 64, -64, 64, -64, -64, 64, -64, -64, -64, -64, -64, -64, 64, 64, 64, -64, 64, 64, 64, 64, 64, -64, 64, -64, -64, -64, -64, -64, -64, -64, -64, 64, 64, -64, -64, -64, -64, -64, -64, -64, 64, 64, 64, 64, 64, 64, 64, 64, 64, 64, 64, 64, -64, -64, -64, -64, 64, 64, 64, 64, -64, -64, 64, -64, -64, -64, -64, -64, -64, 64, 64, 64, -64, 64, 64, 64, -64, 64, -64, -64, -64, -64, -64, -64, -64, 64, 64, -64, -64, 64, 64, -64, -64, -64, 64, -64, 64, -64, 64, 64, -64, -64, 64, -64, -64, -64, -64, -64, -64, -64, -64, -64, 64, -64, -64, -64, -64, -64, -64, -64, -64, -64, -64, 64, 64, 64, 64, -64, -64, -64, -64, -64, 64, -64, -64, -64, -64, -64, -64, -64, -64, 64, 64, 64, 64, -64, 64, -64, -64, -64, 64, 64, -64, -64, -64, -64, -64, -64, -64, -64, -64, -64, -64, -64, -64, -64, 64, 64, -64, -64, 64, 64, 64, 64, -64, 64, -64, 64, -64, -64, -64, 64, 64, -64, -64, -64, -64, -64, -64, -64, -64, -64, -64, 64, 64, 64, 64, 64, -64, 64, -64, 64, -64, 64, -64, 64, 64, 64, 64, 64, -64, -64, 64, -64, 64, 64, -64, 64, 64, 64, -64, -64, -64, -64, -64, 64, 64, 64, 64, -64, -64, 64, 64, 64, -64, -64, -64, 64, -64, 64, 64, 64, 64, 64, 64, -64, -64, 64, -64, 64, -64, 64, 64, 64, 64, -64, -64, -64, -64, 64, -64, 64, 64, -64, 64, 64, 64, -64, -64, -64, -64, 64, 64, -64, 64, -64, -64, -64, 64, -64, 64, -64, -64, 64, 64, -64, 64, -64, -64, 64, -64, -64, -64, -64, 64, -64, -64, 64, 64, -64, 64, 64, 64, 64, -64, -64, -64, 64, -64, -64, -64, -64, -64, -64, 64, 64, -64, 64, 64, -64, 64, 64, -64, 64, -64, 64, -64, -64, 64, 64, -64, -64, -64, 64, 64, -64, 64, 64, 64, -64, 64, 64, -64, 64, -64, 64, 64, -64, 64, 64, 64, -64, -64, -64, -64, 64, -64, -64, 64, -64, 64, 64, -64, 64, -64, 64, 64, -64, 64, -64, 64, -64, -64, 64, 64, 64, -64, -64, -64, 64, 64, 64, -64, -64, 64, 64, 64, -64, 64, -64, -64, -64, -64, -64, -64, -64, -64, 64, -64, 64, 64, -64, -64, 64, -64, 64, 64, -64, 64, -64, 64, -64, 64, -64, 64, 64, 64, -64, -64, -64, -64, 64, -64, 64, 64, -64, -64, 64, 64, -64, 64, 64, 64, 64, -64, -64, 64, -64, -64, 64, 64, -64, 64, 64, 64, 64, 64, 64, 64, 64, -64, 64, 64, -64, -64, -64, -64, 64, 64, 64, 64, -64, -64, 64, 64, 64, -64, 64, 64, -64, 64, 64, 64, 64, 64, 64, 64, -64, -64, 64, 64, 64, 64, 64, -64, 64, 64, 64, 64, -64, -64, 64, -64, 64, 64, 64, -64, 64, -64, 64, 64, -64, -64, -64, -64, 64, -64, 64, -64, 64, -64, 64, -64, -64, 64, 64, -64, 64, 64, 64, 64, 64, -64, -64, -64, 64, 64, 64, 64, 64, 64, 64, 64, 64, 64, 64, -64, -64, -64, 64, 64, 64, 64, -64, -64, 64, 64, -64, -64, 64, -64, 64, 64, 64, 64, 64, 64, 64, -64, 64, -64, 64, 64, 64, -64, 64, 64, -64, 64, 64, 64, 64, 64, 64, 64, 64, 64, 64, 64, 64, 64, 64, 64, -64, -64, 64, 64, -64, -64, -64, 64, -64, -64, -64, 64, -64, 64, 64, 64, 64, 64, 64, 64, 64, 64, 64, -64, 64, -64, -64, 64, 64, 64, -64, 64, -64, 64, 64, -64, 64, -64, -64, -64, -64, -64, -64, 64, 64, 64, 64, -64, 64, 64, 64, -64, 64, 64, 64, 64, 64, 64, -64, 64, 64, 64, -64, -64, -64, 64, 64, -64, 64, 64, 64, 64, 64, 64, 64, 64, 64, 64, 64, 64, 64, 64, 64, 64, 64, 64, 64, -64, 64, 64, -64, -64, 64, -64, -64, -64, 64, 64, -64, 64, 64, 64, -64, 64, 64, 64, 64, -64, -64, -64, 64, -64, -64, 64, 64, 64, -64, 64, -64, 64, -64, 64, 64, -64, 64, -64, 64, 64, 64, 64, -64, 64, 64, -64, 64, 64, 64, 64, 64, -64, 64, -64, 64, 64, 64, -64, 64, 64, -64, -64, 64, -64, 64, -64, 64, -64, -64, 64, 64, 64, 64, 64, 64, -64, -64, -64, 64, 64, 64, 64, 64, 64, 64, 64, -64, -64, 64, -64, 64, 64, 64, 64, 64, 64, 64, -64, 64, 64, -64, 64, 64, -64, -64, 64, 64, 64, 64, -64, 64, 64, -64, -64, -64, -64, 64, -64, -64, 64, -64, -64, -64, -64, 64, 64, 64, 64, 64, 64, 64, -64, -64, 64, 64, 64, 64, 64, 64, 64, 64, -64, -64, -64, -64, -64, -64, 64, -64, -64, 64, 64, -64, -64, -64, 64, -64, 64, 64, -64, 64, 64, 64, 64, 64, 64, 64, 64, -64, -64, 64, -64, -64, -64, 64, -64, 64, -64, 64, -64, -64, -64, 64, 64, 64, 64, -64, -64, -64, 64, 64, 64, -64, -64, -64, 64, -64, -64, 64, 64, -64, -64, 64, 64, -64, 64, -64, 64, -64, 64, 64, 64, -64, 64, 64, -64, 64, 64, 64, 64, -64, -64, 64, -64, 64, -64, 64, -64, -64, 64, 64, -64, 64, 64, 64, 64, -64, -64, 64, 64, -64, -64, -64, 64, -64, 64, 64, 64, -64, -64, 64, -64, 64, -64, -64, 64, 64, -64, 64, 64, 64, 64, 64, 64, 64, 64, -64, 64, 64, 64, -64, -64, -64, 64, 64, 64, 64, -64, -64, -64, -64, -64, -64, 64, 64, -64, -64, 64, 64, 64, 64, -64, -64, 64, -64, 64, -64, -64, -64, 64, -64, 64, -64, 64, -64, -64, 64, 64, -64, 64, -64, 64, 64, -64, -64, -64, 64, 64, 64, 64, 64, 64, -64, -64, -64, 64, 64, 64, 64, 64, -64, -64, 64, 64, 64, 64, -64, 64, 64, 64, 64, -64, -64, -64, 64, 64, 64, -64, 64, -64, 64, 64, -64, 64, -64, 64, 64, -64, -64, 64, -64, -64, -64, 64, -64, -64, -64, -64, 64, 64, 64, -64, -64, -64, -64, 64, 64, 64, -64, -64, 64, 64, -64, 64, 64, -64, 64, 64, -64, -64, 64, -64, -64, -64, 64, -64, -64, -64, -64, 64, 64, 64, 64, -64, 64, 64, -64, 64, -64, -64, 64, -64, -64, -64, 64, 64, 64, 64, 64, -64, -64, -64, -64, 64, -64, -64, -64, -64, -64, 64, 64, 64, 64, -64, 64, 64, -64, -64, -64, -64, 64, -64, 64, 64, 64, 64, 64, 64, 64, 64, -64, 64, -64, -64, -64, 64, 64, 64, 64, 64, 64, -64, -64, -64, -64, 64, -64, 64, -64, 64, 64, 64, 64, 64, 64, 64, -64, 64, 64, -64, 64, -64, -64, 64, 64, 64, 64, 64, 64, -64, -64, -64, -64, 64, 64, 64, -64, -64, 64, -64, 64, 64, 64, 64, 64, 64, 64, 64, 64, -64, -64, -64, 64, -64, -64, 64, -64, -64, 64, 64, -64, -64, -64, -64, -64, -64, -64, -64, -64, 64, 64, 64, 64, 64, -64, 64, 64, 64, -64, -64, 64, -64, 64, 64, 64, -64, -64, -64, -64, -64, -64, -64, -64, -64, -64, -64, 64, -64, 64, 64, 64, 64, 64, -64, -64, 64, 64, 64, 64, -64, 64, -64, -64, -64, -64, -64, -64, -64, -64, -64, -64, -64, -64, -64, 64, 64, 64, 64, 64, 64, -64, -64, 64, -64, 64, -64, 64, -64, -64, -64, -64, -64, -64, -64, -64, -64, -64, -64, -64, -64, -64, -64, -64, 64, -64, 64, 64, -64, -64, -64, 64, -64, -64, -64, 64, -64, 64, -64, -64, -64, 64, -64, 64, 64, -64, -64, -64, -64, -64, -64, -64, -64, 64, 64, -64, -64, -64, -64, 64, 64, -64, -64, -64, -64, -64, -64, 64, 64, -64, -64, -64, 64, -64, -64, -64, -64, -64, -64, -64, -64, -64, -64, 64, -64, -64, 64, -64, 64, 64, -64, 64, -64, -64, -64, -64, -64, -64, -64, 64, -64, -64, -64, -64, -64, -64, -64, -64, -64, -64, -64, -64, 64, 64, -64, 64, 64, 64, -64, -64, 64, 64, -64, 64, -64, -64, 64, 64, 64, 64, -64, -64, 64, -64, -64, -64, -64, -64, -64, 64, 64, -64, 64, -64, -64, -64, 64, -64, -64, 64, 64, -64, -64, 64, 64, 64, 64, 64, 64, 64, 64, -64, -64, 64, -64, -64, 64, -64, -64, 64, 64, 64, -64, -64, 64, -64, -64, 64, -64, -64, -64, 64, 64, 64, 64, 64, 64, -64, -64, 64, 64, -64, -64, -64, 64, 64, -64, -64, -64, -64, 64, -64, 64, 64, -64, -64, -64, -64, -64, 64, -64, 64, -64, -64, 64, 64, 64, -64, -64, -64, -64, 64, -64, -64, -64, 64, -64, -64, 64, 64, 64, -64, -64, 64, -64, -64, -64, -64, 64, 64, -64, 64, -64, 64, 64, -64, -64, -64, -64, 64, -64, 64, -64, -64, 64, 64, -64, -64, -64, -64, -64, -64, 64, 64, -64, -64, 64, -64, 64, -64, 64, 64, -64, -64, -64, -64, -64, 64, 64, 64, -64, 64, 64, 64, -64, 64, -64, -64, 64, 64, -64, -64, -64, 64, -64, 64, 64, -64, -64, -64, -64, 64, -64, -64, -64, -64, 64, 64, 64, -64, 64, -64, -64, -64, -64, -64, -64, 64, 64, 64, 64, -64, 64, -64, -64, -64, 64, -64, -64, 64, 64, -64, -64, 64, 64, -64, 64, -64, -64, 64, 64, -64, -64, 64, -64, -64, -64, 64, 64, -64, -64, -64, -64, 64, -64, -64, 64, 64, -64, -64, -64, -64, 64, -64, 64, 64, -64, -64, -64, 64, 64, 64, 64, 64, 64, 64, 64, -64, -64, -64, 64, 64, 64, -64, 64, -64, 64, 64, 64, 64, 64, 64, 64, -64, -64, -64, -64, -64, 64, 64, 64, -64, 64, -64, -64, -64, -64, -64, 64, 64, 64, -64, -64, 64, 64, 64, 64, -64, -64, 64, 64, -64, 64, 64, 64, -64, -64, 64, -64, -64, -64, -64, -64, -64, -64, -64, -64, -64, -64, -64, -64, 64, 64, -64, -64, -64, -64, -64, -64, -64, 64, 64, 64, 64, -64, -64, -64, -64, 64, 64, -64, -64, -64, -64, -64, -64, -64, -64, 64, 64, -64, 64, -64, -64, 64, -64, -64, -64, 64, -64, -64, 64, -64, -64, -64, 64, -64, -64, -64, -64, -64, -64, -64, -64, -64, -64, -64, -64, -64, -64, -64, 64, -64, 64, 64, -64, -64, 64, 64, 64, 64, 64, -64, 64, 64, -64, -64, -64, -64, 64, -64, -64, 64, -64, -64, -64, 64, 64, -64, 64, -64, -64, -64, 64, 64, -64, -64, 64, 64, -64, 64, -64, -64, 64, 64, -64, -64, 64, -64, -64, 64, -64, -64, -64, 64, 64, 64, 64, -64, 64, 64, 64, -64, -64, -64, -64, -64, 64, 64, 64, -64, -64, -64, -64, 64, 64, -64, -64, 64, 64, 64, 64, 64, 64, 64, 64, -64, 64, -64, -64, -64, -64, -64, -64, 64, 64, -64, -64, 64, -64, -64, -64, -64, 64, -64, -64, 64, -64, 64, -64, 64, 64, 64, 64, 64, 64, -64, 64, -64, -64, 64, 64, 64, 64, 64, -64, 64, 64, 64, -64, -64, -64, -64, 64, -64, 64, -64, 64, -64, -64, -64, 64, -64, 64, 64, -64, 64, -64, -64, 64, -64, 64, 64, 64, -64, -64, -64, 64, -64, -64, -64, -64, -64, -64, 64, -64, -64, -64, -64, -64, -64, -64, -64, -64, -64, 64, -64, -64, -64, 64, 64, 64, -64, -64, -64, -64, -64, -64, -64, -64, -64, -64, -64, 64, 64, -64, -64, -64, -64, 64, 64, -64, -64, 64, -64, 64, 64, 64, 64, 64, -64, -64, -64, 64, -64, -64, -64, -64, -64, -64, 64, 64, 64, -64, -64, -64, 64, -64, 64, 64, 64, 64, 64, 64, -64, -64, 64, -64, 64, -64, -64, 64, -64, 64, 64, 64, 64, 64, -64, 64, 64, -64, -64, 64, -64, -64, -64, -64, -64, 64, 64, 64, -64, -64, -64, -64, 64, -64, 64, 64, -64, -64, 64, 64, 64, 64, 64, 64, 64, -64, -64, 64, 64, 64, 64, -64, -64, 64, -64, 64, -64, -64, -64, 64, 64, -64, -64, 64, -64, -64, 64, 64, 64, 64, 64, 64, -64, 64, 64, 64, 64, 64, 64, -64, -64, -64, 64, -64, 64, 64, -64, 64, 64, -64, -64, 64, 64, 64, 64, 64, 64, 64, -64, 64, 64, 64, 64, 64, -64, -64, -64, 64, 64, -64, 64, -64, -64, 64, 64, 64, -64, 64, 64, 64, 64, 64, 64, -64, 64, 64, -64, -64, 64, 64, 64, 64, 64, 64, -64, 64, 64, -64, 64, 64, -64, 64, 64, 64, 64, -64, -64, -64, 64, 64, -64, 64, 64, 64, -64, 64, 64, 64, 64, 64, -64, 64, -64, -64, 64, 64, -64, 64, -64, 64, 64, 64, -64, 64, 64, 64, 64, 64, -64, 64, 64, 64, 64, 64, 64, 64, -64, 64, 64, -64, -64, -64, 64, -64, -64, 64, -64, 64, 64, 64, -64, -64, 64, 64, 64, 64, 64, 64, 64, 64, 64, 64, 64, 64, -64, -64, 64, 64, -64, 64, -64, 64, -64, 64, 64, 64, 64, 64, -64, 64, -64, -64, -64, 64, 64, 64, 64, 64, 64, 64, 64, 64, 64, 64, -64, -64, 64, 64, -64, 64, -64, 64, -64, 64, 64, 64, 64, 64, 64, 64, -64, -64, 64, 64, 64, 64, -64, 64, 64, 64, 64, 64, -64, 64, -64, -64, -64, 64, -64, -64, 64, 64, 64, 64, 64, 64, 64, 64, -64, -64, 64, 64, 64, 64, 64, 64, 64, 64, 64, 64, 64, -64, -64, 64, -64, -64, 64, 64, -64, 64, 64, 64, 64, 64, 64, 64, -64, 64, 64, 64, 64, 64, 64, 64, -64, 64, -64, 64, -64, -64, -64, -64, 64, 64, 64, -64, -64, -64, 64, 64, 64, -64, -64, 64, 64, 64, 64, 64, -64, 64, 64, -64, 64, 64, -64, -64, -64, -64, 64, 64, -64, 64, -64, 64, 64, 64, 64, 64, -64, -64, -64, 64, 64, 64, 64, -64, -64, -64, 64, -64, -64, -64, -64, -64, 64, 64, -64, 64, 64, 64, -64, -64, -64, 64, 64, -64, -64, -64, -64, -64, -64, -64, -64, -64, -64, -64, -64, -64, -64, -64, -64, -64, -64, 64, 64, -64, 64, 64, -64, -64, 64, -64, -64, -64, -64, -64, 64, 64, -64, -64, 64, -64, -64, -64, -64, -64, -64, -64, -64, 64, -64, -64, 64, 64, 64, 64, 64, 64, -64, -64, -64, -64, -64, -64, -64, -64, -64, -64, -64, -64, 64, -64, -64, -64, 64, -64, -64, -64, -64, 64, -64, -64, 64, -64, -64, 64, 64, 64, 64, 64, 64, 64, 64, 64, -64, -64, 64, -64, 64, -64, 64, -64, -64, 64, -64, -64, 64, 64, 64, 64, -64, 64, -64, 64, -64, -64, -64, 64, 64, 64, 64, 64, -64, 64, 64, -64, -64, 64, 64, 64, -64, -64, 64, -64, -64, 64, -64, 64, 64, -64, 64, -64, -64, -64, 64, 64, -64, 64, 64, 64, -64, -64, 64, 64, 64, -64, 64, 64, 64, -64, 64, -64, 64, -64, 64, -64, -64, 64, -64, -64, -64, 64, 64, -64, 64, 64, 64, 64, -64, -64, -64, 64, -64, -64, 64, -64, -64, -64, -64, 64, -64, -64, 64, 64, 64, -64, -64, -64, -64, -64, 64, 64, -64, 64, 64, 64, 64, 64, 64, -64, 64, -64, -64, 64, -64, 64, 64, -64, -64, -64, 64, -64, -64, -64, -64, 64, -64, 64, 64, -64, -64, -64, -64, -64, -64, -64, -64, 64, 64, -64, 64, -64, -64, 64, 64, -64, -64, 64, 64, 64, 64, 64, -64, 64, 64, 64, 64, -64, 64, 64, 64, 64, 64, 64, 64, 64, -64, -64, 64, -64, -64, -64, -64, -64, 64, 64, -64, 64, 64, 64, -64, 64, 64, -64, -64, -64, 64, -64, 64, 64, 64, 64, -64, 64, 64, -64, 64, 64, 64, -64, -64, 64, -64, 64, -64, -64, 64, -64, -64, -64, 64, 64, 64, -64, 64, 64, 64, 64, 64, 64, 64, 64, -64, 64, -64, 64, 64, -64, -64, -64, 64, 64, 64, 64, 64, -64, 64, -64, 64, -64, -64, -64, 64, 64, 64, 64, 64, 64, 64, 64, -64, 64, 64, -64, -64, 64, -64, -64, 64, 64, 64, 64, -64, -64, 64, 64, 64, 64, -64, -64, 64, 64, 64, 64, 64, 64, 64, 64, -64, 64, 64, -64, 64, 64, 64, -64, -64, -64, -64, 64, -64, 64, -64, 64, -64, 64, 64, 64, -64, 64, 64, 64, 64, 64, 64, 64, 64, -64, -64, 64, 64, 64, 64, -64, 64, 64, 64, -64, -64, 64, 64, 64, 64, -64, 64, 64, 64, 64, 64, 64, 64, 64, 64, -64, -64, 64, -64, 64, 64, 64, 64, 64, 64, -64, -64, 64, 64, -64, -64, -64, -64, -64, -64, -64, 64, 64, 64, 64, 64, 64, -64, 64, -64, 64, 64, -64, 64, 64, 64, 64, 64, -64, 64, -64, 64, 64, -64, -64, 64, 64, 64, 64, 64, 64, 64, 64, 64, 64, -64, -64, 64, 64, 64, 64, 64, 64, 64, 64, 64, -64, -64, 64, 64, -64, -64, -64, 64, 64, 64, 64, 64, 64, 64, 64, 64, 64, -64, 64, -64, -64, 64, -64, 64, 64, 64, 64, 64, 64, 64, -64, 64, 64, -64, -64, 64, 64, 64, -64, 64, 64, 64, 64, 64, -64, -64, 64, -64, 64, 64, 64, 64, 64, -64, -64, 64, 64, 64, -64, -64, -64, 64, -64, -64, 64, -64, -64, 64, 64, 64, 64, 64, -64, 64, -64, 64, 64, 64, 64, 64, 64, 64, 64, 64, 64, 64, 64, -64, 64, -64, 64, -64, -64, -64, -64, -64, 64, 64, -64, -64, -64, 64, -64, 64, 64, 64, 64, 64, 64, 64, 64, -64, -64, 64, -64, -64, 64, -64, 64, -64, -64, 64, 64, 64, 64, 64, 64, -64, -64, 64, 64, 64, 64, 64, 64, 64, 64, -64, 64, 64, 64, -64, 64, -64, 64, 64, 64, 64, 64, 64, 64, 64, 64, 64, -64, -64, -64, -64, 64, 64, 64, 64, 64, 64, 64, 64, 64, 64, -64, 64, 64, -64, -64, -64, 64, 64, 64, 64, 64, 64, 64, 64, 64, -64, -64, -64, 64, 64, 64, 64, 64, 64, 64, 64, 64, 64, 64, 64, 64, 64, 64, 64, -64, -64, -64, -64, -64, 64, 64, 64, 64, 64, 64, -64, -64, 64, 64, 64, 64, 64, 64, 64, 64, 64, 64, 64, 64, 64, -64, 64, -64, -64, -64, -64, 64, 64, 64, 64, -64, -64, -64, 64, -64, 64, 64, 64, -64, 64, 64, 64, 64, 64, -64, 64, 64, -64, 64, 64, -64, -64, 64, -64, -64, 64, 64, -64, 64, -64, -64, 64, -64, -64, 64, 64, -64, -64, 64, 64, 64, -64, 64, -64, 64, -64, 64, -64, -64, 64, 64, -64, 64, 64, 64, -64, 64, 64, -64, -64, 64, 64, 64, 64, 64, 64, 64, 64, 64, 64, 64, -64, 64, 64, -64, -64, -64, -64, -64, -64, 64, 64, 64, 64, -64, 64, -64, 64, 64, 64, 64, 64, 64, 64, -64, -64, 64, 64, -64, -64, -64, 64, -64, 64, -64, 64, -64, 64, 64, 64, 64, -64, 64, 64, -64, 64, 64, 64, -64, 64, 64, 64, 64, 64, 64, 64, -64, 64, -64, 64, -64, -64, -64, 64, -64, -64, 64, 64, 64, 64, 64, 64, 64, 64, 64, 64, 64, -64, -64, -64, -64, 64, -64, 64, -64, 64, -64, 64, 64, -64, 64, -64, -64, 64, 64, 64, 64, 64, 64, -64, -64, -64, 64, 64, -64, 64, -64, -64, -64, -64, 64, -64, -64, -64, 64, 64, 64, -64, 64, 64, -64, -64, -64, 64, 64, 64, 64, 64, -64, -64, -64, -64, -64, 64, -64, -64, 64, -64, 64, 64, 64, -64, -64, -64, 64, -64, 64, -64, -64, 64, 64, 64, 64, 64, 64, -64, 64, -64, -64, -64, 64, 64, 64, -64, -64, 64, 64, -64, 64, 64, 64, -64, 64, -64, 64, -64, -64, 64, 64, -64, -64, -64, -64, 64, 64, -64, -64, -64, 64, -64, -64, -64, 64, -64, -64, -64, -64, -64, -64, -64, -64, -64, -64, 64, -64, -64, 64, -64, -64, 64, 64, -64, -64, 64, -64, 64, -64, -64, -64, -64, 64, 64, 64, 64, 64, 64, -64, 64, -64, 64, 64, -64, -64, 64, 64, 64, -64, 64, 64, 64, 64, -64, 64, 64, -64, 64, -64, -64, 64, -64, -64, -64, -64, -64, 64, 64, -64, -64, 64, 64, 64, -64, -64, -64, 64, 64, 64, 64, -64, 64, 64, 64, 64, -64, 64, 64, 64, 64, -64, -64, -64, 64, -64, -64, 64, 64, 64, -64, -64, 64, 64, 64, 64, 64, 64, -64, 64, 64, 64, 64, 64, 64, 64, 64, 64, 64, 64, 64, 64, -64, 64, 64, 64, -64, 64, -64, 64, -64, 64, 64, 64, 64, 64, 64, 64, 64, -64, 64, 64, 64, 64, 64, 64, 64, 64, 64, -64, -64, 64, 64, -64, 64, 64, 64, 64, 64, -64, 64, 64, 64, 64, -64, 64, 64, 64, 64, 64, 64, 64, 64, 64, 64, 64, 64, 64, 64, -64, -64, -64, 64, 64, 64, 64, 64, 64, -64, 64, 64, 64, -64, 64, -64, -64, -64, 64, -64, 64, 64, 64, 64, 64, 64, 64, -64, -64, 64, -64, -64, 64, 64, -64, 64, 64, 64, 64, 64, 64, 64, 64, 64, 64, 64, -64, 64, 64, 64, 64, 64, 64, 64, -64, 64, 64, 64, 64, -64, -64, 64, 64, -64, 64, -64, 64, 64, -64, -64, -64, -64, 64, -64, 64, -64, 64, -64, 64, 64, 64, 64, 64, 64, -64, -64, 64, -64, 64, 64, -64, 64, 64, 64, -64, 64, 64, 64, -64, -64, -64, -64, -64, -64, -64, -64, 64, 64, 64, -64, 64, 64, 64, 64, 64, 64, -64, -64, -64, 64, 64, -64, 64, -64, -64, 64, -64, -64, -64, -64, 64, 64, 64, -64, -64, 64, 64, 64, 64, 64, -64, 64, -64, 64, -64, 64, 64, 64, 64, 64, -64, -64, 64, 64, -64, 64, 64, 64, 64, 64, -64, -64, 64, -64, 64, 64, 64, -64, 64, 64, -64, -64, -64, 64, -64, -64, -64, -64, 64, 64, 64, 64, 64, -64, 64, 64, 64, 64, -64, -64, -64, -64, 64, -64, -64, -64, 64, -64, 64, 64, -64, -64, -64, -64, -64, 64, -64, -64, 64, 64, 64, 64, -64, 64, -64, 64, 64, -64, -64, 64, -64, 64, -64, 64, -64, -64, 64, -64, -64, -64, -64, -64, 64, 64, -64, -64, 64, -64, -64, -64, 64, 64, -64, 64, 64, 64, -64, -64, 64, 64, 64, 64, -64, -64, -64, 64, 64, 64, -64, -64, -64, 64, 64, 64, -64, 64, -64, 64, 64, 64, -64, 64, 64, 64, -64, 64, 64, 64, 64, -64, 64, 64, -64, 64, -64, -64, 64, -64, 64, -64, 64, -64, -64, 64, -64, 64, 64, -64, 64, 64, 64, 64, -64, 64, 64, -64, 64, 64, 64, 64, 64, 64, -64, -64, -64, -64, 64, 64, 64, 64, 64, -64, 64, 64, 64, -64, 64, -64, 64, 64, -64, -64, -64, -64, 64, -64, 64, -64, 64, -64, -64, 64, -64, 64, -64, -64, 64, 64, 64, 64, 64, 64, 64, 64, 64, 64, 64, 64, -64, -64, -64, -64, -64, 64, -64, -64, -64, 64, 64, -64, 64, 64, 64, 64, 64, 64, 64, 64, 64, 64, -64, 64, -64, 64, 64, 64, -64, -64, -64, -64, -64, 64, 64, -64, -64, -64, -64, 64, 64, 64, 64, 64, -64, 64, 64, 64, 64, 64, 64, 64, 64, 64, -64, 64, 64, -64, -64, -64, 64, 64, -64, -64, 64, 64, -64, 64, 64, 64, 64, 64, 64, 64, 64, 64, -64, 64, -64, 64, 64, 64, 64, 64, -64, -64, -64, -64, -64, 64, -64, -64, -64, -64, -64, 64, 64, -64, 64, 64, 64, 64, 64, 64, -64, -64, -64, 64, 64, 64, 64, 64, 64, 64, -64, -64, 64, 64, -64, -64, 64, 64, 64, 64, 64, 64, -64, -64, 64, 64, 64, 64, 64, 64, 64, 64, -64, 64, -64, 64, 64, -64, -64, -64, 64, -64, -64, -64, -64, 64, 64, 64, -64, -64, 64, -64, -64, -64, -64, -64, 64, 64, -64, 64, -64, 64, 64, -64, 64, 64, -64, -64, -64, 64, -64, 64, -64, -64, 64, -64, 64, -64, -64, -64, -64, -64, -64, -64, 64, -64, 64, 64, 64, 64, 64, 64, -64, -64, 64, 64, 64, -64, 64, -64, 64, 64, -64, -64, -64, -64, -64, 64, -64, 64, -64, 64, 64, -64, -64, 64, 64, 64, -64, -64, -64, 64, 64, 64, 64, 64, -64, 64, -64, 64, -64, 64, -64, 64, -64, 64, 64, -64, 64, -64, 64, 64, -64, -64, 64, -64, 64, -64, -64, 64, -64, -64, 64, 64, -64, -64, 64, 64, -64, -64, 64, -64, -64, 64, -64, 64, -64, 64, -64, 64, 64, 64, 64, -64, 64, -64, -64, -64, 64, 64, 64, -64, 64, 64, -64, -64, 64, 64, -64, -64, 64, -64, -64, 64, 64, 64, -64, -64, 64, 64, 64, 64, 64, 64, -64, 64, 64, -64, -64, -64, 64, -64, 64, 64, 64, -64, -64, -64, 64, 64, -64, -64, 64, -64, 64, 64, 64, 64, 64, 64, 64, 64, 64, 64, 64, 64, -64, 64, 64, 64, 64, 64, 64, -64, -64, -64, -64, 64, 64, 64, 64, 64, 64, 64, 64, 64, 64, -64, 64, -64, 64, -64, -64, -64, -64, -64, 64, 64, 64, -64, -64, 64, -64, -64, 64, 64, 64, 64, 64, 64, 64, -64, 64, -64, -64, 64, 64, 64, -64, -64, -64, -64, -64, -64, 64, 64, 64, -64, 64, -64, 64, 64, 64, 64, 64, 64, 64, 64, 64, 64, -64, 64, 64, 64, 64, 64, 64, -64, -64, -64, -64, 64, -64, -64, -64, 64, -64, -64, 64, -64, 64, 64, 64, 64, 64, 64, 64, -64, 64, 64, 64, 64, 64, 64, 64, 64, 64, 64, -64, 64, -64, -64, 64, 64, 64, -64, 64, 64, 64, 64, 64, 64, 64, 64, 64, -64, 64, 64, -64, -64, 64, -64, -64, 64, 64, 64, 64, -64, -64, -64, -64, -64, 64, 64, 64, -64, -64, -64, 64, 64, 64, -64, 64, -64, -64, 64, 64, 64, -64, 64, 64, 64, 64, -64, 64, 64, 64, -64, -64, 64, 64, 64, 64, -64, 64, 64, 64, 64, 64, 64, 64, -64, -64, -64, 64, 64, -64, 64, 64, 64, 64, -64, 64, 64, 64, -64, -64, -64, -64, 64, -64, 64, 64, 64, 64, 64, 64, 64, -64, -64, -64, -64, 64, 64, -64, 64, -64, -64, 64, 64, 64, 64, 64, 64, 64, 64, -64, -64, 64, -64, 64, 64, 64, 64, 64, 64, 64, -64, -64, -64, -64, -64, -64, 64, 64, 64, 64, 64, -64, -64, 64, -64, -64, 64, 64, 64, -64, 64, 64, 64, 64, 64, 64, 64, -64, -64, -64, -64, -64, 64, 64, 64, 64, 64, 64, -64, 64, 64, 64, 64, -64, -64, -64, -64, 64, 64, 64, 64, 64, 64, 64, 64, -64, -64, -64, -64, -64, 64, 64, 64, -64, 64, 64, 64, 64, 64, 64, 64, -64, -64, -64, 64, 64, 64, 64, 64, 64, 64, 64, 64, -64, -64, 64, 64, -64, 64, 64, 64, 64, -64, 64, 64, 64, 64, -64, 64, -64, 64, -64, 64, 64, 64, 64, 64, 64, -64, -64, 64, -64, 64, 64, 64, 64, 64, 64, 64, 64, 64, 64, 64, -64, 64, 64, 64, 64, 64, 64, 64, 64, 64, 64, 64, 64, -64, -64, -64, 64, 64, 64, 64, 64, 64, 64, 64, 64, -64, 64, 64, 64, -64, -64, -64, 64, 64, 64, 64, 64, 64, 64, 64, 64, -64, -64, -64, 64, 64, 64, 64, 64, 64, -64, -64, 64, 64, 64, 64, -64, -64, 64, 64, -64, -64, -64, 64, 64, -64, 64, -64, -64, -64, -64, -64, 64, 64, 64, 64, 64, -64, 64, 64, 64, 64, 64, 64, -64, -64, 64, 64, 64, -64, 64, 64, 64, -64, 64, -64, -64, 64, 64, 64, 64, 64, 64, 64, 64, 64, 64, 64, 64, 64, 64, 64, -64, -64, 64, 64, -64, -64, -64, 64, 64, 64, 64, -64, -64, 64, 64, -64, 64, 64, 64, 64, 64, 64, 64, 64, 64, 64, 64, -64, 64, 64, -64, -64, 64, 64, 64, 64, 64, 64, 64, -64, -64, 64, 64, -64, 64, -64, 64, -64, 64, 64, 64, 64, 64, 64, 64, 64, 64, 64, -64, 64, 64, -64, 64, 64, 64, 64, -64, -64, -64, -64, -64, -64, -64, -64, 64, 64, 64, 64, 64, 64, 64, -64, 64, -64, -64, -64, 64, -64, -64, 64, -64, 64, -64, 64, 64, 64, 64, 64, 64, 64, 64, 64, 64, -64, -64, 64, 64, 64, 64, -64, 64, -64, 64, 64, 64, 64, -64, -64, -64, -64, 64, 64, 64, 64, 64, 64, 64, 64, 64, 64, 64, -64, 64, 64, 64, 64, 64, 64, 64, -64, -64, -64, -64, -64, 64, -64, 64, -64, 64, 64, -64, -64, 64, 64, 64, 64, -64, -64, 64, 64, 64, -64, -64, -64, 64, 64, -64, 64, 64, -64, -64, 64, 64, -64, -64, 64, 64, 64, -64, -64, -64, 64, 64, -64, -64, 64, -64, -64, -64, -64, 64, -64, -64, 64, 64, -64, -64, -64, 64, -64, 64, 64, 64, -64, -64, -64, -64, -64, -64, -64, -64, -64, -64, 64, -64, -64, 64, -64, -64, 64, 64, -64, -64, -64, 64, -64, -64, -64, 64, 64, 64, 64, 64, -64, 64, 64, 64, 64, 64, -64, -64, 64, -64, 64, -64, 64, -64, -64, -64, 64, 64, 64, -64, -64, -64, 64, -64, 64, 64, -64, -64, 64, -64, -64, 64, 64, 64, 64, -64, -64, -64, 64, 64, 64, 64, -64, -64, -64, 64, 64, 64, -64, 64, -64, 64, -64, 64, -64, 64, -64, -64, 64, 64, -64, 64, 64, 64, -64, -64, -64, -64, -64, -64, -64, -64, -64, -64, 64, 64, 64, 64, 64, 64, 64, -64, -64, -64, 64, -64, -64, 64, 64, 64, 64, -64, -64, -64, -64, -64, -64, -64, -64, -64, -64, -64, 64, -64, -64, 64, 64, 64, -64, -64, 64, -64, -64, -64, -64, 64, 64, 64, -64, -64, -64, -64, -64, -64, -64, -64, -64, -64, -64, -64, -64, 64, 64, 64, -64, 64, -64, -64, -64, -64, -64, -64, -64, -64, 64, -64, -64, -64, -64, -64, -64, -64, -64, -64, -64, -64, -64, -64, -64, -64, 64, 64, 64, 64, -64, -64, 64, 64, -64, -64, -64, 64, -64, -64, 64, 64, -64, -64, -64, 64, -64, 64, 64, 64, 64, -64, 64, 64, -64, -64, -64, -64, -64, -64, 64, -64, -64, -64, 64, 64, 64, 64, 64, 64, 64, 64, 64, -64, 64, 64, 64, 64, -64, 64, 64, 64, 64, -64, -64, -64, 64, 64, 64, 64, -64, 64, 64, 64, 64, 64, 64, 64, 64, 64, 64, 64, 64, 64, 64, -64, 64, 64, 64, -64, 64, 64, 64, -64, -64, 64, -64, 64, 64, -64, 64, -64, 64, 64, 64, 64, 64, 64, 64, 64, 64, 64, 64, -64, -64, 64, 64, 64, -64, 64, 64, 64, 64, 64, -64, -64, 64, 64, -64, 64, -64, 64, -64, -64, -64, -64, -64, -64, 64, 64, -64, 64, -64, -64, -64, -64, 64, -64, -64, 64, 64, 64, 64, -64, -64, -64, -64, -64, -64, -64, -64, -64, -64, -64, -64, -64, -64, -64, -64, -64, -64, -64, -64, -64, 64, 64, 64, -64, 64, 64, 64, -64, -64, -64, -64, -64, -64, -64, -64, -64, -64, -64, -64, -64, -64, -64, -64, -64, -64, -64, -64, 64, -64, 64, -64, 64, -64, -64, -64, -64, -64, -64, -64, -64, -64, -64, -64, -64, -64, -64, -64, -64, 64, -64, -64, -64, -64, -64, -64, 64, -64, -64, -64, -64, -64, 64, -64, -64, -64, -64, -64, -64, -64, -64, -64, -64, -64, -64, -64, -64, -64, 64, -64, -64, -64, -64, -64, 64, 64, 64, -64, 64, -64, 64, 64, 64, 64, -64, -64, -64, -64, -64, 64, -64, 64, 64, -64, 64, -64, -64, 64, -64, -64, -64, -64, 64, 64, 64, 64, 64, 64, -64, -64, 64, 64, -64, -64, -64, 64, 64, 64, 64, -64, 64, 64, -64, 64, -64, -64, -64, 64, -64, 64, 64, 64, 64, 64, 64, 64, 64, -64, 64, 64, -64, -64, -64, -64, 64, -64, -64, 64, -64, -64, -64, 64, -64, -64, 64, -64, -64, 64, 64, 64, 64, -64, -64, -64, 64, -64, 64, -64, 64, -64, 64, -64, -64, -64, -64, -64, -64, -64, 64, -64, 64, -64, -64, -64, 64, -64, 64, 64, 64, 64, 64, 64, 64, 64, 64, 64, 64, -64, 64, 64, -64, 64, 64, 64, 64, -64, 64, 64, -64, -64, -64, -64, -64, 64, 64, 64, 64, 64, 64, 64, 64, -64, 64, -64, -64, 64, -64, -64, -64, 64, 64, 64, 64, 64, -64, -64, -64, -64, -64, -64, -64, 64, -64, 64, 64, -64, -64, -64, 64, 64, 64, 64, -64, -64, -64, -64, -64, -64, 64, -64, 64, 64, 64, -64, 64, -64, -64, -64, -64, 64, -64, -64, -64, 64, -64, -64, 64, -64, -64, 64, 64, -64, 64, -64, 64, 64, -64, -64, -64, -64, -64, 64, 64, -64, -64, -64, 64, -64, 64, 64, 64, -64, -64, 64, 64, -64, -64, -64, 64, 64, 64, -64, 64, 64, 64, 64, -64, -64, -64, -64, -64, -64, -64, -64, -64, -64, 64, -64, 64, -64, 64, -64, 64, 64, -64, -64, 64, 64, 64, 64, 64, 64, 64, 64, -64, -64, 64, 64, 64, 64, -64, -64, -64, 64, 64, -64, -64, -64, -64, -64, 64, -64, 64, 64, -64, -64, -64, -64, -64, 64, 64, 64, -64, -64, 64, 64, 64, 64, 64, -64, -64, -64, -64, 64, -64, 64, 64, 64, 64, 64, 64, 64, -64, 64, 64, 64, -64, -64, 64, -64, -64, 64, -64, -64, 64, 64, -64, 64, -64, 64, -64, 64, 64, 64, -64, 64, -64, -64, -64, -64, 64, -64, 64, 64, 64, -64, 64, -64, 64, 64, 64, -64, 64, -64, 64, -64, -64, -64, -64, 64, -64, -64, 64, -64, -64, -64, -64, 64, -64, -64, 64, -64, 64, 64, 64, -64, 64, -64, 64, -64, 64, 64, -64, 64, 64, 64, -64, -64, 64, -64, -64, 64, 64, -64, 64, 64, -64, -64, -64, 64, -64, -64, -64, 64, 64, 64, 64, -64, -64, 64, -64, -64, -64, -64, 64, -64, -64, 64, -64, -64, 64, -64, -64, -64, -64, -64, -64, -64, -64, -64, -64, 64, 64, -64, -64, -64, -64, -64, -64, -64, -64, -64, -64, 64, -64, -64, 64, 64, -64, 64, -64, -64, -64, 64, -64, 64, 64, -64, 64, -64, -64, -64, -64, -64, -64, -64, -64, -64, -64, -64, 64, 64, -64, 64, -64, -64, 64, 64, -64, 64, 64, 64, -64, -64, 64, 64, 64, -64, 64, -64, -64, -64, -64, -64, 64, -64, 64, 64, 64, -64, -64, -64, 64, 64, -64, -64, 64, 64, 64, 64, -64, 64, -64, -64, 64, 64, 64, -64, -64, -64, -64, -64, -64, -64, -64, 64, -64, 64, -64, -64, 64, 64, -64, -64, 64, -64, 64, 64, 64, -64, 64, -64, -64, -64, -64, -64, -64, -64, -64, -64, -64, 64, -64, 64, 64, -64, 64, -64, 64, 64, -64, 64, -64, -64, -64, 64, -64, -64, 64, 64, 64, 64, -64, 64, -64, -64, -64, -64, -64, -64, -64, -64, -64, -64, -64, 64, -64, -64, -64, -64, -64, -64, 64, 64, -64, 64, -64, 64, 64, -64, -64, -64, -64, -64, 64, -64, -64, 64, -64, -64, -64, -64, -64, 64, 64, 64, 64, -64, -64, -64, 64, -64, -64, -64, 64, 64, -64, -64, -64, 64, 64, -64, 64, -64, -64, -64, -64, -64, -64, -64, -64, -64, -64, -64, -64, -64, -64, -64, -64, -64, -64, -64, -64, 64, -64, -64, -64, 64, -64, 64, 64, 64, -64, -64, -64, -64, -64, -64, -64, 64, -64, -64, -64, -64, -64, -64, -64, -64, 64, 64, 64, 64, -64, -64, -64, -64, 64, 64, 64, 64, -64, -64, -64, 64, -64, 64, 64, 64, 64, -64, -64, 64, -64, -64, -64, -64, -64, -64, 64, 64, -64, -64, 64, 64, 64, 64, 64, -64, -64, -64, -64, -64, 64, -64, 64, -64, -64, -64, 64, 64, 64, -64, -64, -64, 64, -64, -64, 64, 64, 64, -64, 64, 64, 64, 64, 64, -64, -64, -64, -64, -64, -64, -64, 64, -64, -64, -64, 64, -64, 64, -64, -64, -64, 64, -64, 64, -64, 64, 64, 64, 64, 64, 64, 64, 64, -64, -64, -64, -64, -64, 64, -64, -64, -64, -64, -64, 64, -64, -64, -64, -64, -64, -64, -64, -64, -64, 64, -64, 64, 64, 64, 64, -64, -64, -64, -64, -64, -64, -64, -64, 64, 64, 64, -64, -64, -64, -64, -64, -64, -64, -64, -64, -64, 64, 64, -64, -64, -64, 64, 64, -64, -64, -64, -64, 64, -64, -64, -64, 64, -64, -64, -64, -64, -64, -64, -64, -64, -64, -64, -64, 64, 64, 64, 64, -64, -64, 64, 64, -64, -64, -64, -64, -64, -64, 64, 64, 64, 64, 64, -64, -64, -64, 64, -64, -64, -64, -64, -64, 64, 64, 64, -64, -64, -64, 64, -64, -64, -64, -64, -64, -64, -64, -64, -64, 64, -64, 64, -64, -64, -64, -64, -64, -64, -64, -64, -64, -64, -64, -64, -64, -64, -64, 64, -64, -64, -64, -64, -64, -64, 64, 64, 64, 64, 64, -64, -64, -64, -64, -64, -64, -64, 64, -64, -64, -64, -64, 64, -64, -64, 64, 64, 64, 64, 64, -64, -64, 64, -64, 64, 64, -64, 64, 64, -64, -64, -64, -64, -64, -64, 64, -64, -64, -64, -64, -64, 64, -64, 64, -64, 64, 64, 64, -64, -64, -64, 64, 64, -64, 64, -64, -64, -64, 64, 64, -64, -64, -64, -64, -64, -64, -64, -64, -64, -64, -64, -64, 64, 64, 64, 64, -64, 64, -64, -64, -64, 64, 64, -64, 64, 64, -64, -64, -64, 64, -64, -64, -64, -64, -64, -64, -64, -64, 64, -64, -64, 64, -64, 64, -64, 64, 64, 64, -64, -64, -64, -64, 64, 64, 64, -64, -64, 64, -64, 64, -64, -64, -64, -64, -64, 64, -64, -64, -64, -64, -64, 64, -64, 64, 64, 64, -64, 64, -64, -64, 64, -64, 64, 64, 64, 64, 64, 64, 64, 64, 64, -64, -64, -64, -64, -64, -64, -64, -64, 64, 64, 64, 64, -64, 64, 64, 64, 64, 64, -64, -64, 64, 64, -64, 64, -64, -64, -64, 64, 64, 64, -64, -64, 64, -64, 64, -64, -64, 64, -64, -64, 64, 64, 64, 64, 64, -64, 64, -64, 64, 64, -64, -64, 64, -64, -64, -64, -64, -64, 64, -64, -64, 64, 64, 64, 64, -64, -64, 64, -64, 64, 64, -64, -64, 64, -64, 64, -64, -64, -64, -64, 64, 64, -64, 64, 64, -64, 64, -64, 64, 64, -64, -64, 64, -64, 64, 64, 64, 64, -64, -64, 64, -64, -64, 64, -64, -64, 64, 64, 64, 64, -64, 64, 64, -64, 64, -64, 64, 64, -64, 64, -64, 64, 64, 64, -64, 64, -64, -64, -64, -64, -64, -64, -64, -64, -64, -64, 64, 64, 64, 64, -64, -64, -64, 64, 64, 64, 64, 64, 64, -64, 64, -64, 64, 64, 64, -64, -64, -64, 64, -64, -64, 64, 64, -64, 64, 64, 64, -64, -64, 64, -64, 64, 64, 64, 64, 64, 64, 64, 64, 64, 64, -64, 64, -64, -64, -64, 64, 64, 64, 64, 64, -64, -64, 64, 64, 64, 64, 64, 64, 64, 64, 64, 64, 64, -64, 64, -64, -64, 64, 64, -64, -64, 64, 64, 64, -64, 64, -64, -64, 64, -64, -64, -64, 64, -64, -64, 64, 64, 64, -64, 64, 64, -64, 64, 64, 64, -64, 64, -64, -64, -64, -64, -64, -64, 64, 64, 64, 64, 64, 64, 64, 64, 64, -64, 64, 64, 64, -64, 64, -64, 64, 64, 64, 64, -64, 64, -64, 64, 64, 64, -64, 64, 64, 64, 64, 64, 64, -64, 64, 64, 64, 64, 64, 64, -64, -64, 64, 64, 64, -64, -64, 64, 64, -64, -64, 64, 64, 64, -64, 64, -64, 64, 64, -64, 64, -64, 64, -64, 64, 64, 64, 64, -64, 64, -64, 64, -64, 64, 64, 64, -64, 64, -64, -64, -64, -64, -64, -64, 64, 64, 64, 64, -64, 64, -64, 64, 64, 64, -64, 64, -64, 64, -64, -64, -64, -64, -64, -64, 64, 64, 64, 64, -64, -64, -64, -64, -64, -64, 64, 64, 64, 64, 64, -64, 64, 64, 64, -64, 64, 64, -64, -64, -64, 64, -64, 64, -64, 64, -64, -64, 64, 64, -64, -64, -64, 64, 64, 64, -64, -64, 64, 64, -64, 64, 64, 64, 64, 64, 64, 64, 64, 64, 64, 64, -64, 64, 64, 64, -64, 64, -64, -64, 64, 64, 64, 64, -64, 64, 64, 64, 64, 64, 64, 64, 64, 64, 64, -64, 64, -64, -64, -64, -64, -64, 64, 64, -64, -64, -64, 64, 64, -64, -64, 64, -64, 64, 64, 64, 64, 64, -64, -64, 64, 64, 64, 64, 64, 64, 64, 64, -64, 64, 64, 64, 64, -64, 64, 64, -64, -64, 64, 64, 64, 64, 64, 64, -64, 64, 64, -64, 64, 64, 64, -64, 64, 64, 64, 64, -64, -64, -64, 64, 64, -64, -64, 64, 64, -64, 64, 64, 64, 64, 64, -64, -64, -64, 64, 64, 64, 64, -64, -64, 64, 64, -64, -64, -64, -64, -64, -64, 64, -64, -64, -64, -64, -64, -64, -64, 64, 64, 64, 64, 64, 64, 64, 64, 64, -64, 64, 64, 64, 64, -64, -64, -64, -64, 64, 64, 64, 64, 64, 64, 64, 64, -64, 64, 64, 64, 64, 64, 64, 64, -64, 64, 64, -64, -64, 64, 64, 64, 64, 64, -64, -64, 64, -64, -64, -64, 64, 64, 64, -64, -64, 64, 64, 64, 64, -64, 64, -64, 64, 64, 64, 64, 64, 64, -64, 64, 64, 64, 64, 64, 64, 64, 64, 64, -64, -64, 64, 64, -64, -64, 64, 64, 64, 64, 64, 64, 64, 64, 64, 64, 64, 64, -64, 64, 64, -64, 64, 64, -64, -64, 64, 64, 64, 64, 64, 64, 64, -64, 64, -64, 64, -64, -64, 64, -64, 64, 64, 64, -64, 64, 64, -64, 64, -64, -64, -64, -64, -64, -64, -64, -64, -64, 64, 64, -64, 64, -64, -64, 64, -64, 64, 64, -64, -64, 64, 64, 64, 64, -64, 64, 64, -64, -64, -64, -64, -64, -64, -64, -64, 64, 64, -64, -64, 64, -64, 64, -64, 64, -64, 64, 64, -64, 64, -64, 64, 64, 64, 64, 64, -64, -64, -64, -64, -64, -64, 64, -64, -64, 64, 64, 64, -64, -64, -64, 64, 64, -64, 64, 64, 64, 64, -64, 64, -64, 64, 64, -64, -64, 64, -64, -64, 64, -64, -64, 64, 64, -64, -64, -64, -64, 64, 64, 64, -64, 64, -64, -64, 64, -64, -64, -64, -64, 64, 64, -64, 64, -64, 64, 64, 64, 64, 64, -64, -64, -64, 64, -64, -64, 64, -64, 64, -64, -64, 64, 64, 64, -64, -64, 64, -64, 64, -64, -64, -64, -64, -64, -64, -64, 64, 64, 64, 64, 64, 64, 64, -64, 64, -64, -64, -64, 64, 64, 64, -64, 64, -64, 64, -64, -64, -64, 64, -64, 64, -64, -64, 64, -64, -64, -64, -64, 64, -64, 64, -64, 64, -64, 64, 64, 64, -64, -64, 64, -64, 64, -64, 64, -64, 64, -64, 64, -64, -64, 64, -64, 64, 64, -64, -64, -64, 64, 64, 64, 64, -64, -64, -64, -64, -64, 64, 64, 64, 64, 64, -64, -64, 64, -64, 64, 64, -64, 64, -64, 64, 64, 64, 64, 64, 64, -64, 64, 64, 64, 64, -64, -64, 64, 64, 64, 64, 64, 64, 64, 64, -64, 64, 64, -64, -64, 64, 64, 64, 64, 64, 64, -64, 64, 64, 64, 64, -64, -64, 64, 64, -64, 64, 64, 64, 64, 64, 64, 64, 64, 64, 64, 64, 64, 64, -64, 64, -64, 64, 64, 64, 64, -64, -64, 64, 64, 64, 64, -64, 64, 64, 64, -64, 64, -64, 64, 64, 64, 64, -64, 64, 64, 64, 64, 64, 64, 64, 64, 64, 64, 64, 64, 64, 64, -64, -64, -64, 64, 64, 64, 64, 64, 64, 64, 64, -64, 64, 64, 64, 64, 64, 64, 64, -64, 64, 64, -64, 64, 64, 64, -64, 64, -64, -64, 64, 64, 64, 64, 64, -64, -64, 64, 64, -64, 64, 64, 64, -64, -64, 64, -64, -64, 64, -64, -64, 64, 64, -64, 64, 64, -64, -64, 64, 64, 64, 64, -64, 64, -64, -64, -64, -64, 64, 64, 64, -64, -64, 64, -64, 64, 64, 64, -64, 64, 64, 64, -64, 64, -64, -64, -64, 64, 64, 64, -64, -64, -64, 64, 64, -64, -64, 64, -64, 64, 64, 64, 64, -64, -64, -64, -64, -64, -64, 64, -64, 64, -64, -64, -64, -64, -64, -64, -64, -64, -64, -64, -64, -64, -64, 64, 64, -64, -64, 64, -64, -64, 64, -64, -64, 64, 64, -64, -64, -64, -64, -64, -64, 64, -64, -64, -64, -64, -64, -64, 64, -64, -64, -64, 64, 64, 64, -64, -64, 64, -64, -64, -64, -64, 64, -64, -64, -64, -64, -64, -64, -64, 64, -64, -64, -64, -64, -64, -64, 64, 64, 64, 64, 64, -64, 64, 64, -64, 64, 64, -64, -64, 64, -64, -64, -64, -64, -64, 64, 64, 64, -64, -64, -64, -64, -64, 64, 64, 64, 64, -64, 64, -64, -64, -64, 64, 64, -64, 64, -64, -64, 64, -64, -64, -64, 64, 64, 64, 64, 64, -64, -64, -64, -64, 64, -64, 64, 64, -64, 64, 64, -64, 64, 64, 64, -64, -64, -64, -64, -64, -64, 64, 64, 64, 64, 64, 64, 64, -64, -64, -64, -64, 64, -64, 64, 64, 64, 64, -64, 64, 64, -64, 64, -64, -64, -64, 64, -64, -64, 64, 64, -64, 64, 64, 64, -64, -64, -64, -64, -64, -64, -64, 64, 64, 64, 64, -64, 64, -64, 64, 64, -64, -64, -64, -64, -64, 64, 64, 64, 64, 64, 64, 64, -64, -64, -64, -64, -64, 64, 64, 64, 64, 64, 64, -64, -64, -64, -64, 64, -64, -64, -64, 64, 64, 64, 64, 64, 64, 64, 64, 64, -64, -64, -64, 64, 64, 64, 64, 64, 64, 64, 64, -64, 64, -64, -64, 64, -64, -64, 64, 64, 64, 64, 64, 64, 64, 64, 64, -64, -64, -64, -64, 64, -64, -64, 64, 64, 64, 64, -64, 64, -64, 64, -64, -64, -64, -64, -64, 64, 64, 64, 64, 64, 64, 64, -64, -64, 64, 64, 64, 64, 64, 64, 64, 64, 64, 64, 64, -64, -64, -64, -64, -64, -64, -64, -64, -64, 64, 64, 64, 64, 64, 64, 64, 64, 64, 64, -64, 64, 64, 64, 64, 64, 64, 64, 64, -64, 64, -64, 64, 64, -64, -64, -64, -64, -64, 64, 64, 64, 64, 64, 64, -64, -64, 64, -64, 64, 64, -64, 64, 64, 64, 64, -64, 64, -64, 64, 64, 64, -64, -64, 64, -64, -64, -64, 64, 64, 64, 64, 64, 64, -64, 64, -64, 64, 64, 64, 64, 64, 64, -64, -64, -64, -64, 64, 64, 64, 64, -64, -64, -64, -64, 64, 64, -64, 64, 64, 64, -64, -64, 64, -64, -64, -64, 64, 64, 64, -64, -64, 64, 64, -64, 64, -64, -64, -64, -64, -64, -64, 64, 64, 64, 64, 64, 64, 64, 64, -64, -64, 64, -64, -64, -64, 64, 64, -64, -64, 64, 64, -64, -64, 64, -64, -64, -64, -64, 64, 64, 64, -64, 64, 64, 64, -64, -64, -64, -64, -64, -64, -64, -64, -64, 64, 64, 64, 64, 64, 64, -64, -64, -64, 64, 64, -64, -64, -64, -64, -64, -64, 64, -64, 64, -64, 64, 64, -64, 64, -64, -64, -64, 64, -64, -64, -64, -64, 64, -64, 64, 64, 64, 64, -64, 64, 64, 64, -64, 64, 64, -64, -64, -64, -64, -64, 64, 64, -64, 64, 64, 64, -64, -64, 64, -64, -64, -64, 64, -64, -64, 64, 64, -64, -64, -64, -64, 64, -64, 64, 64, 64, -64, -64, -64, 64, 64, 64, 64, -64, -64, 64, 64, 64, -64, -64, -64, -64, -64, -64, -64, -64, 64, 64, -64, 64, 64, 64, 64, -64, 64, -64, 64, 64, 64, 64, -64, -64, -64, -64, -64, -64, -64, 64, -64, 64, -64, -64, -64, -64, -64, -64, -64, 64, -64, -64, 64, -64, 64, 64, 64, 64, -64, 64, 64, 64, 64, -64, -64, -64, 64, 64, 64, -64, 64, 64, -64, -64, 64, -64, -64, 64, -64, -64, 64, 64, 64, -64, 64, -64, -64, 64, 64, -64, 64, 64, -64, -64, 64, 64, -64, -64, -64, 64, -64, -64, 64, 64, 64, -64, -64, -64, 64, -64, -64, -64, -64, -64, 64, -64, -64, -64, -64, -64, -64, 64, -64, 64, -64, -64, 64, 64, -64, 64, 64, 64, 64, 64, 64, 64, 64, -64, -64, -64, 64, 64, 64, 64, -64, -64, -64, -64, 64, 64, 64, -64, -64, -64, -64, -64, -64, -64, -64, -64, 64, -64, -64, -64, 64, -64, -64, -64, 64, -64, -64, -64, -64, -64, -64, -64, -64, 64, -64, 64, 64, -64, -64, -64, 64, 64, 64, -64, -64, -64, -64, -64, 64, 64, 64, -64, 64, 64, -64, -64, -64, -64, 64, 64, -64, 64, 64, -64, 64, -64, -64, 64, 64, -64, -64, -64, -64, -64, -64, -64, -64, 64, -64, -64, -64, -64, -64, -64, -64, 64, -64, -64, 64, -64, 64, 64, 64, 64, 64, 64, -64, -64, 64, -64, 64, -64, -64, 64, -64, -64, -64, -64, -64, -64, -64, -64, 64, 64, 64, 64, -64, 64, 64, 64, -64, 64, -64, 64, -64, 64, -64, 64, 64, -64, 64, -64, -64, -64, -64, 64, -64, -64, -64, 64, -64, -64, -64, 64, 64, 64, 64, -64, 64, 64, 64, 64, -64, 64, -64, -64, 64, -64, -64, -64, -64, 64, -64, -64, 64, 64, -64, -64, -64, 64, 64, 64, -64, -64, -64, -64, 64, 64, 64, 64, -64, -64, 64, -64, -64, 64, -64, -64, 64, -64, -64, -64, -64, -64, 64, 64, 64, 64, -64, -64, 64, 64, -64, 64, 64, -64, -64, -64, -64, -64, -64, -64, 64, -64, 64, -64, -64, -64, 64, -64, -64, -64, -64, 64, -64, -64, 64, 64, 64, 64, 64, -64, -64, -64, 64, 64, -64, -64, -64, 64, 64, -64, -64, -64, 64, 64, -64, -64, 64, 64, 64, -64, -64, -64, 64, -64, -64, -64, 64, 64, 64, -64, 64, -64, -64, -64, -64, -64, 64, -64, -64, 64, -64, -64, -64, 64, -64, 64, -64, 64, -64, -64, 64, -64, 64, 64, 64, 64, 64, -64, 64, 64, -64, -64, 64, -64, -64, -64, 64, 64, 64, -64, -64, -64, -64, 64, 64, -64, 64, -64, -64, 64, -64, 64, 64, -64, 64, -64, -64, 64, 64, 64, -64, -64, -64, 64, -64, 64, -64, -64, -64, -64, -64, 64, 64, 64, -64, -64, 64, -64, 64, 64, 64, 64, -64, -64, -64, -64, -64, -64, -64, -64, -64, -64, -64, -64, 64, -64, 64, -64, 64, -64, -64, -64, -64, -64, -64, -64, 64, -64, 64, 64, 64, 64, -64, 64, 64, -64, 64, 64, 64, 64, -64, 64, 64, -64, -64, 64, 64, -64, 64, 64, -64, -64, -64, -64, -64, 64, -64, 64, -64, 64, 64, 64, 64, -64, 64, -64, -64, -64, 64, 64, 64, -64, -64, 64, 64, -64, -64, 64, -64, 64, -64, -64, 64, 64, -64, 64, -64, 64, 64, 64, 64, 64, 64, -64, -64, 64, -64, -64, -64, -64, -64, 64, -64, -64, -64, 64, 64, -64, -64, -64, 64, 64, -64, 64, 64, 64, 64, 64, -64, -64, -64, -64, -64, -64, -64, -64, -64, 64, -64, -64, -64, -64, -64, -64, -64, -64, -64, -64, -64, 64, 64, 64, 64, -64, 64, 64, -64, -64, 64, -64, -64, -64, -64, 64, 64, -64, -64, -64, 64, 64, -64, -64, 64, -64, -64, 64, 64, 64, -64, -64, -64, 64, -64, -64, -64, -64, 64, 64, 64, 64, -64, 64, 64, 64, 64, -64, 64, 64, 64, -64, 64, 64, 64, -64, -64, -64, 64, 64, 64, 64, -64, 64, 64, 64, 64, -64, -64, 64, 64, 64, -64, -64, 64, 64, -64, -64, 64, 64, 64, 64, -64, 64, -64, 64, 64, -64, 64, -64, -64, 64, -64, -64, 64, -64, 64, 64, -64, 64, 64, 64, -64, 64, 64, -64, 64, -64, -64, 64, 64, 64, -64, -64, -64, -64, -64, -64, 64, -64, 64, -64, 64, 64, -64, -64, -64, -64, -64, 64, 64, 64, -64, -64, -64, -64, 64, 64, 64, -64, -64, 64, -64, 64, -64, 64, 64, -64, -64, 64, 64, -64, 64, -64, -64, 64, -64, 64, -64, -64, 64, -64, -64, -64, 64, 64, 64, -64, 64, -64, -64, -64, 64, -64, -64, -64, 64, 64, -64, 64, -64, 64, -64, -64, 64, 64, -64, -64, 64, 64, 64, 64, -64, -64, 64, 64, -64, 64, 64, 64, 64, 64, -64, -64, 64, 64, 64, 64, -64, -64, -64, 64, -64, -64, -64, -64, -64, 64, 64, 64, -64, 64, -64, -64, 64, -64, 64, -64, -64, -64, 64, -64, 64, 64, 64, -64, -64, -64, 64, -64, -64, -64, 64, -64, 64, -64, -64, -64, -64, 64, -64, -64, -64, 64, 64, 64, 64, -64, -64, 64, 64, 64, 64, 64, -64, -64, 64, -64, 64, 64, -64, 64, -64, 64, 64, -64, -64, -64, 64, 64, -64, -64, 64, 64, 64, 64, 64, 64, 64, -64, 64, 64, -64, -64, 64, -64, 64, 64, -64, 64, -64, 64, 64, -64, -64, -64, -64, 64, 64, 64, -64, -64, 64, 64, 64, 64, 64, -64, -64, 64, 64, -64, -64, -64, 64, -64, 64, 64, -64, -64, 64, 64, 64, -64, -64, -64, -64, 64, 64, 64, 64, 64, 64, 64, 64, 64, -64, 64, -64, -64, -64, -64, -64, 64, 64, 64, 64, -64, 64, 64, 64, -64, -64, -64, -64, -64, -64, 64, 64, 64, 64, 64, 64, 64, 64, 64, 64, 64, -64, 64, 64, -64, -64, 64, 64, 64, 64, 64, 64, -64, -64, 64, 64, -64, 64, 64, 64, 64, -64, -64, 64, 64, 64, -64, -64, -64, -64, 64, 64, 64, 64, 64, 64, 64, 64, 64, 64, 64, 64, -64, 64, -64, -64, -64, 64, -64, -64, 64, 64, -64, 64, 64, 64, -64, 64, 64, 64, 64, 64, 64, 64, 64, 64, 64, 64, -64, -64, -64, -64, -64, 64, -64, 64, -64, -64, -64, 64, 64, 64, 64, 64, -64, 64, 64, 64, 64, 64, 64, 64, 64, 64, 64, -64, 64, 64, -64, -64, -64, 64, -64, 64, 64, 64, 64, 64, 64, 64, 64, 64, 64, -64, 64, 64, 64, 64, 64, 64, 64, 64, 64, 64, 64, 64, -64, 64, 64, -64, 64, 64, 64, 64, 64, 64, 64, 64, 64, -64, 64, 64, 64, 64, 64, 64, 64, 64, 64, 64, 64, 64, 64, 64, -64, -64, -64, -64, -64, 64, 64, 64, 64, 64, 64, 64, 64, 64, -64, 64, 64, 64, 64, 64, 64, 64, 64, 64, 64, 64, 64, -64, -64, -64, 64, 64, -64, -64, 64, 64, 64, -64, -64, 64, 64, 64, 64, 64, 64, 64, -64, 64, 64, 64, 64, -64, 64, 64, -64, -64, -64, -64, 64, -64, 64, 64, 64, 64, 64, 64, 64, -64, 64, -64, -64, 64, 64, 64, 64, 64, 64, 64, 64, 64, 64, -64, -64, 64, -64, 64, 64, -64, -64, 64, 64, 64, 64, -64, -64, 64, 64, -64, -64, 64, 64, 64, 64, -64, 64, -64, -64, -64, -64, 64, -64, -64, 64, 64, 64, -64, 64, -64, 64, 64, 64, 64, -64, 64, 64, -64, 64, 64, -64, 64, 64, 64, 64, 64, 64, -64, -64, -64, -64, -64, -64, -64, 64, -64, 64, 64, -64, -64, -64, 64, 64, 64, 64, 64, -64, 64, 64, 64, 64, 64, 64, 64, -64, -64, -64, -64, -64, -64, -64, -64, -64, -64, -64, 64, -64, 64, -64, 64, 64, 64, 64, 64, -64, 64, -64, 64, -64, 64, 64, -64, 64, -64, -64, 64, -64, -64, -64, -64, 64, 64, -64, 64, 64, -64, -64, -64, 64, 64, 64, 64, 64, -64, 64, -64, 64, -64, 64, -64, -64, -64, 64, 64, -64, -64, -64, 64, -64, -64, 64, -64, 64, 64, -64, 64, 64, 64, 64, 64, 64, -64, -64, 64, 64, 64, -64, -64, -64, -64, -64, -64, -64, -64, 64, -64, 64, -64, -64, 64, -64, 64, 64, 64, -64, 64, -64, -64, -64, -64, 64, 64, 64, 64, -64, -64, 64, -64, 64, 64, 64, 64, -64, 64, -64, -64, -64, -64, 64, 64, -64, 64, -64, 64, 64, 64, -64, -64, 64, 64, 64, 64, -64, 64, 64, 64, 64, 64, -64, -64, -64, -64, 64, -64, 64, -64, 64, 64, 64, -64, 64, -64, 64, -64, -64, -64, 64, 64, 64, -64, -64, 64, 64, -64, -64, -64, -64, -64, -64, 64, 64, -64, 64, 64, -64, 64, 64, -64, 64, -64, 64, 64, -64, 64, -64, -64, 64, -64, 64, 64, -64, -64, 64, -64, -64, 64, 64, -64, -64, 64, 64, 64, -64, -64, -64, 64, 64, -64, -64, -64, 64, 64, -64, 64, -64, -64, -64, 64, 64, 64, 64, 64, -64, 64, 64, 64, 64, 64, -64, 64, -64, 64, 64, 64, -64, -64, -64, 64, 64, 64, 64, -64, -64, 64, -64, 64, -64, 64, 64, -64, 64, -64, -64, 64, 64, -64, 64, 64, 64, -64, 64, 64, -64, -64, -64, -64, 64, 64, 64, -64, 64, 64, -64, 64, 64, 64, -64, -64, 64, 64, 64, 64, -64, 64, 64, -64, 64, -64, -64, 64, -64, -64, 64, -64, 64, 64, 64, 64, -64, 64, -64, 64, 64, 64, 64, 64, -64, 64, -64, 64, -64, -64, 64, 64, 64, 64, -64, 64, 64, -64, -64, 64, -64, -64, 64, -64, -64, -64, 64, -64, 64, 64, 64, -64, -64, -64, 64, 64, -64, 64, -64, 64, 64, -64, 64, 64, 64, -64, -64, -64, 64, 64, -64, -64, -64, -64, -64, -64, -64, -64, -64, -64, 64, 64, 64, 64, -64, 64, 64, -64, -64, 64, -64, -64, -64, 64, 64, 64, -64, -64, -64, -64, -64, -64, -64, -64, -64, -64, -64, -64, -64, -64, -64, 64, 64, 64, -64, -64, -64, 64, 64, -64, -64, 64, 64, -64, -64, -64, -64, -64, -64, -64, -64, -64, -64, -64, -64, 64, -64, 64, -64, 64, 64, -64, 64, 64, 64, 64, 64, 64, 64, 64, -64, 64, -64, -64, -64, -64, -64, -64, -64, -64, -64, -64, -64, -64, -64, -64, -64, -64, 64, 64, 64, -64, 64, -64, 64, 64, -64, -64, 64, 64, 64, 64, -64, -64, -64, -64, -64, -64, 64, 64, 64, -64, 64, 64, 64, -64, 64, 64, 64, -64, 64, -64, 64, 64, -64, -64, 64, -64, -64, -64, -64, -64, -64, 64, 64, 64, 64, -64, 64, 64, -64, 64, 64, 64, 64, 64, -64, -64, -64, -64, 64, -64, -64, -64, -64, -64, -64, -64, -64, 64, 64, -64, 64, 64, -64, 64, 64, -64, 64, 64, 64, -64, -64, 64, 64, -64, 64, -64, 64, 64, -64, -64, -64, -64, -64, -64, -64, 64, -64, 64, 64, -64, -64, 64, 64, 64, 64, 64, 64, -64, 64, -64, 64, 64, 64, -64, 64, -64, -64, -64, -64, -64, -64, -64, -64, -64, -64, -64, -64, -64, -64, 64, -64, -64, 64, -64, 64, -64, 64, 64, 64, -64, 64, 64, 64, 64, -64, 64, -64, -64, -64, -64, -64, 64, 64, 64, 64, -64, 64, -64, -64, -64, -64, -64, 64, 64, -64, -64, -64, 64, 64, 64, 64, -64, -64, 64, -64, -64, -64, -64, -64, -64, -64, -64, 64, 64, 64, -64, -64, 64, 64, -64, -64, -64, 64, -64, -64, -64, -64, -64, -64, -64, -64, -64, -64, -64, -64, -64, -64, 64, -64, -64, -64, -64, 64, -64, -64, 64, -64, -64, -64, -64, -64, 64, -64, 64, 64, -64, -64, -64, -64, -64, -64, -64, -64, -64, -64, 64, -64, -64, -64, -64, 64, 64, 64, 64, -64, -64, -64, -64, -64, -64, 64, -64, -64, -64, -64, 64, -64, -64, -64, 64, -64, 64, -64, -64, 64, -64, 64, -64, -64, -64, 64, -64, -64, -64, -64, -64, 64, -64, -64, -64, -64, -64, -64, -64, -64, 64, -64, 64, -64, -64, 64, 64, 64, 64, 64, -64, 64, -64, -64, -64, -64, -64, -64, 64, -64, 64, 64, -64, -64, -64, -64, -64, -64, -64, -64, 64, -64, -64, 64, 64, -64, -64, 64, -64, -64, -64, -64, -64, 64, -64, -64, 64, -64, -64, 64, 64, -64, -64, -64, -64, -64, -64, 64, -64, -64, 64, 64, -64, 64, 64, -64, -64, -64, -64, -64, -64, -64, -64, 64, -64, -64, 64, 64, -64, 64, -64, -64, 64, -64, 64, 64, -64, -64, -64, -64, 64, 64, -64, -64, -64, -64, -64, -64, -64, -64, -64, 64, -64, -64, 64, -64, 64, -64, -64, -64, 64, -64, -64, -64, -64, -64, -64, -64, -64, -64, 64, -64, -64, -64, -64, -64, -64, -64, -64, 64, 64, 64, 64, -64, 64, -64, -64, -64, -64, 64, 64, 64, 64, -64, 64, -64, 64, -64, 64, 64, -64, 64, -64, -64, -64, -64, 64, -64, 64, -64, -64, -64, 64, 64, 64, 64, -64, 64, -64, 64, -64, -64, -64, -64, 64, 64, -64, -64, -64, -64, -64, -64, -64, 64, -64, -64, -64, 64, 64, -64, 64, 64, 64, 64, 64, -64, -64, -64, -64, -64, -64, 64, 64, 64, 64, 64, 64, -64, -64, -64, -64, -64, 64, -64, 64, -64, -64, 64, 64, 64, 64, -64, 64, -64, -64, 64, -64, 64, 64, 64, 64, -64, 64, -64, 64, -64, 64, 64, 64, 64, 64, 64, 64, -64, -64, 64, 64, -64, -64, 64, 64, -64, 64, 64, -64, -64, 64, 64, 64, 64, 64, 64, 64, -64, -64, -64, -64, 64, 64, -64, 64, -64, 64, 64, -64, 64, 64, -64, 64, -64, 64, 64, -64, -64, 64, 64, -64, 64, 64, -64, -64, -64, -64, 64, 64, -64, -64, 64, 64, -64, 64, -64, -64, 64, 64, -64, 64, 64, -64, -64, -64, -64, -64, -64, 64, 64, -64, -64, -64, 64, 64, -64, -64, 64, 64, 64, 64, -64, 64, -64, 64, -64, 64, 64, 64, 64, 64, -64, 64, 64, 64, -64, -64, 64, -64, -64, -64, -64, 64, 64, 64, 64, 64, 64, 64, 64, -64, 64, 64, -64, -64, -64, -64, -64, -64, 64, -64, 64, -64, -64, 64, 64, -64, -64, 64, 64, -64, 64, 64, -64, 64, -64, -64, 64, 64, -64, 64, -64, 64, -64, -64, -64, 64, 64, -64, -64, -64, -64, 64, -64, 64, -64, 64, -64, -64, -64, -64, -64, 64, -64, 64, -64, 64, 64, 64, 64, 64, -64, 64, -64, -64, -64, -64, 64, -64, 64, -64, -64, -64, 64, 64, 64, 64, -64, 64, 64, -64, -64, 64, 64, 64, 64, 64, -64, 64, -64, -64, 64, 64, -64, -64, 64, -64, -64, -64, 64, -64, 64, 64, -64, 64, 64, 64, -64, -64, -64, -64, 64, 64, 64, -64, 64, -64, 64, -64, -64, -64, -64, -64, -64, -64, 64, 64, -64, 64, 64, -64, -64, 64, -64, -64, 64, -64, -64, 64, 64, 64, -64, -64, -64, -64, -64, -64, -64, -64, -64, -64, -64, -64, -64, 64, 64, -64, 64, -64, -64, 64, 64, 64, 64, -64, 64, -64, -64, -64, -64, 64, -64, -64, -64, -64, -64, -64, -64, 64, -64, 64, -64, -64, 64, -64, -64, -64, -64, -64, -64, 64, 64, 64, 64, -64, 64, 64, -64, -64, -64, -64, -64, -64, -64, -64, 64, 64, 64, -64, 64, 64, -64, 64, 64, -64, -64, -64, -64, 64, 64, 64, 64, 64, -64, 64, 64, -64, 64, -64, -64, -64, -64, 64, 64, -64, 64, -64, 64, -64, -64, -64, -64, -64, -64, -64, -64, -64, 64, 64, 64, -64, 64, -64, 64, -64, -64, -64, -64, -64, -64, -64, 64, -64, -64, 64, -64, -64, -64, -64, -64, -64, -64, -64, 64, -64, -64, -64, -64, -64, -64, 64, 64, -64, -64, -64, -64, 64, 64, -64, -64, 64, 64, -64, -64, -64, -64, -64, 64, -64, 64, -64, -64, 64, 64, 64, 64, 64, 64, 64, -64, 64, 64, -64, -64, 64, 64, 64, -64, -64, -64, -64, -64, -64, -64, -64, -64, 64, -64, -64, -64, 64, 64, 64, 64, -64, -64, 64, -64, 64, -64, -64, -64, 64, 64, -64, -64, -64, -64, -64, -64, -64, -64, -64, -64, -64, -64, -64, 64, 64, 64, 64, -64, -64, -64, -64, -64, 64, -64, 64, 64, 64, -64, -64, -64, -64, 64, -64, -64, -64, -64, -64, -64, -64, -64, -64, -64, 64, 64, -64, -64, -64, 64, -64, 64, -64, 64, -64, 64, 64, -64, -64, 64, 64, -64, 64, -64, -64, -64, -64, -64, -64, 64, 64, 64, 64, 64, -64, -64, 64, -64, 64, 64, -64, 64, 64, 64, 64, -64, -64, -64, 64, -64, -64, -64, -64, -64, -64, -64, -64, -64, 64, -64, 64, 64, 64, 64, -64, 64, -64, 64, 64, -64, -64, 64, 64, 64, 64, 64, -64, -64, -64, -64, -64, -64, -64, 64, 64, -64, -64, 64, 64, -64, 64, -64, -64, -64, -64, 64, 64, -64, 64, 64, 64, 64, 64, -64, -64, -64, 64, -64, 64, -64, 64, -64, 64, -64, -64, -64, 64, -64, -64, -64, -64, -64, 64, 64, 64, 64, -64, 64, 64, 64, -64, 64, -64, -64, 64, -64, -64, 64, -64, -64, -64, -64, -64, 64, 64, -64, 64, -64, 64, -64, -64, -64, 64, -64, -64, -64, 64, 64, 64, -64, -64, 64, -64, 64, -64, -64, -64, -64, -64, -64, -64, -64, 64, -64, -64, -64, -64, -64, -64, -64, 64, -64, -64, -64, 64, 64, 64, 64, -64, 64, 64, -64, -64, -64, -64, -64, -64, -64, -64, -64, -64, -64, -64, -64, -64, 64, -64, -64, 64, 64, -64, 64, -64, 64, 64, 64, -64, -64, -64, -64, -64, -64, -64, -64, -64, -64, 64, -64, -64, -64, -64, 64, 64, -64, -64, -64, 64, 64, -64, -64, 64, -64, 64, 64, -64, -64, 64, 64, 64, 64, -64, -64, -64, -64, -64, 64, -64, -64, -64, -64, 64, 64, -64, 64, 64, -64, -64, 64, 64, 64, -64, -64, -64, -64, 64, 64, -64, -64, -64, 64, -64, -64, -64, 64, -64, 64, 64, -64, -64, -64, -64, -64, 64, 64, -64, -64, 64, -64, -64, 64, -64, 64, -64, 64, 64, -64, 64, 64, -64, -64, -64, 64, -64, 64, 64, 64, -64, -64, -64, -64, 64, -64, 64, 64, -64, -64, 64, -64, 64, -64, -64, -64, 64, -64, 64, -64, 64, -64, 64, -64, 64, -64, -64, 64, 64, 64, -64, -64, -64, 64, -64, 64, 64, 64, 64, 64, 64, 64, -64, -64, -64, 64, 64, -64, 64, -64, 64, -64, -64, 64, -64, -64, 64, 64, -64, 64, 64, -64, 64, 64, -64, -64, -64, -64, -64, -64, -64, -64, -64, -64, 64, -64, -64, -64, 64, -64, 64, -64, 64, 64, -64, 64, 64, -64, -64, -64, -64, 64, -64, -64, -64, -64, -64, -64, 64, -64, 64, -64, 64, -64, -64, -64, -64, -64, 64, -64, -64, -64, 64, 64, 64, 64, 64, -64, 64, 64, -64, -64, -64, -64, -64, -64, -64, -64, -64, -64, -64, -64, -64, -64, -64, -64, -64, -64, -64, 64, -64, -64, -64, -64, -64, -64, -64, 64, -64, -64, -64, 64, -64, -64, -64, -64, -64, 64, 64, -64, -64, -64, -64, -64, -64, -64, -64, -64, -64, -64, -64, -64, -64, 64, 64, -64, 64, -64, -64, -64, -64, -64, -64, -64, 64, 64, 64, 64, 64, 64, 64, -64, -64, -64, -64, -64, 64, -64, -64, -64, -64, -64, -64, 64, 64, -64, -64, 64, -64, -64, -64, 64, -64, 64, 64, 64, 64, 64, -64, -64, -64, -64, -64, 64, -64, 64, 64, 64, 64, 64, 64, 64, 64, 64, 64, -64, -64, -64, 64, -64, -64, -64, -64, 64, 64, 64, -64, 64, -64, 64, 64, 64, 64, 64, 64, -64, 64, 64, 64, 64, 64, -64, 64, 64, 64, 64, -64, 64, 64, 64, -64, -64, 64, 64, -64, 64, 64, -64, -64, 64, 64, -64, 64, 64, -64, 64, 64, 64, 64, 64, 64, 64, -64, 64, -64, -64, 64, -64, -64, 64, 64, 64, 64, 64, 64, 64, -64, -64, -64, -64, -64, -64, 64, 64, 64, 64, 64, 64, 64, -64, -64, -64, -64, -64, -64, 64, -64, 64, -64, 64, 64, 64, 64, 64, 64, -64, -64, -64, 64, 64, -64, 64, -64, 64, -64, 64, -64, -64, 64, -64, -64, -64, 64, 64, -64, -64, -64, 64, 64, 64, 64, -64, 64, 64, -64, -64, -64, -64, -64, 64, -64, 64, -64, -64, -64, 64, -64, -64, -64, -64, 64, -64, 64, -64, 64, 64, -64, 64, 64, -64, 64, -64, -64, -64, -64, 64, 64, 64, -64, 64, 64, 64, -64, -64, -64, -64, -64, -64, -64, 64, -64, 64, -64, -64, 64, 64, -64, -64, 64, -64, -64, -64, -64, -64, -64, 64, 64, 64, -64, -64, -64, 64, -64, -64, -64, -64, -64, -64, -64, 64, 64, -64, -64, -64, -64, -64, 64, -64, -64, 64, 64, -64, -64, -64, 64, 64, -64, -64, -64, 64, 64, -64, -64, -64, -64, -64, -64, 64, 64, -64, -64, -64, 64, -64, 64, -64, -64, -64, -64, 64, -64, -64, -64, 64, 64, 64, 64, 64, -64, 64, -64, -64, -64, -64, -64, -64, 64, -64, -64, -64, 64, 64, 64, 64, 64, -64, 64, -64, 64, -64, -64, 64, -64, 64, 64, 64, 64, 64, -64, -64, -64, -64, -64, -64, -64, -64, -64, -64, -64, 64, 64, -64, -64, 64, 64, -64, 64, -64, -64, -64, -64, 64, -64, 64, 64, -64, 64, -64, -64, 64, -64, -64, -64, -64, -64, -64, -64, -64, -64, -64, 64, 64, -64, -64, -64, -64, -64, -64, -64, -64, -64, -64, -64, -64, 64, -64, -64, -64, -64, 64, -64, -64, -64, -64, -64, -64, 64, 64, -64, 64, -64, -64, -64, -64, -64, -64, -64, -64, -64, -64, -64, -64, -64, -64, -64, 64, 64, -64, -64, -64, -64, -64, -64, 64, 64, 64, -64, -64, 64, 64, -64, -64, -64, -64, -64, -64, -64, 64, -64, -64, -64, 64, 64, 64, -64, -64, -64, -64, -64, -64, 64, 64, 64, -64, 64, -64, 64, 64, -64, -64, -64, -64, -64, -64, -64, -64, 64, 64, 64, -64, 64, 64, -64, -64, -64, -64, -64, -64, -64, -64, -64, 64, -64, -64, -64, -64, -64, -64, -64, -64, 64, 64, 64, 64, 64, 64, 64, 64, -64, 64, -64, -64, -64, -64, -64, -64, 64, 64, 64, 64, 64, 64, -64, -64, 64, -64, 64, 64, -64, 64, -64, -64, 64, 64, -64, 64, 64, -64, 64, -64, -64, 64, 64, -64, 64, 64, 64, 64, 64, -64, -64, -64, 64, 64, -64, 64, 64, -64, 64, 64, 64, -64, 64, 64, 64, 64, -64, -64, 64, -64, 64, 64, 64, -64, -64, 64, -64, 64, 64, -64, -64, -64, -64, -64, 64, -64, 64, 64, 64, 64, -64, -64, 64, -64, 64, 64, 64, 64, 64, 64, -64, -64, -64, 64, -64, -64, 64, 64, -64, 64, 64, -64, 64, 64, 64, 64, 64, 64, 64, -64, 64, 64, 64, -64, 64, -64, -64, 64, -64, -64, -64, -64, -64, 64, 64, -64, 64, -64, -64, 64, -64, -64, -64, -64, -64, -64, 64, -64, -64, 64, -64, -64, 64, -64, -64, 64, 64, 64, 64, -64, 64, -64, 64, -64, -64, -64, 64, -64, -64, -64, -64, 64, -64, -64, -64, -64, -64, -64, 64, -64, -64, 64, 64, -64, 64, -64, 64, -64, -64, 64, 64, 64, 64, 64, 64, -64, -64, 64, -64, -64, -64, -64, -64, -64, -64, -64, 64, -64, -64, 64, 64, -64, -64, -64, 64, 64, 64, -64, -64, -64, -64, -64, 64, -64, 64, 64, 64, -64, -64, -64, -64, -64, -64, -64, -64, -64, -64, -64, 64, -64, 64, -64, -64, -64, -64, -64, 64, -64, -64, -64, -64, 64, 64, 64, 64, 64, -64, -64, -64, -64, -64, -64, -64, -64, -64, -64, -64, -64, -64, -64, -64, -64, -64, -64, 64, 64, -64, -64, 64, 64, 64, 64, 64, -64, 64, -64, -64, 64, -64, -64, -64, -64, -64, -64, -64, -64, -64, -64, 64, -64, -64, -64, -64, 64, 64, -64, 64, 64, 64, 64, -64, 64, 64, 64, 64, -64, -64, 64, -64, -64, -64, -64, -64, -64, -64, 64, -64, 64, 64, -64, -64, 64, 64, -64, 64, -64, -64, -64, 64, 64, 64, 64, 64, 64, 64, 64, 64, -64, -64, -64, -64, -64, -64, -64, -64, -64, -64, 64, 64, 64, 64, 64, 64, 64, 64, -64, 64, 64, 64, 64, 64, 64, 64, 64, -64, 64, -64, -64, -64, -64, 64, -64, -64, 64, 64, -64, 64, 64, 64, -64, 64, 64, -64, 64, 64, 64, -64, 64, 64, 64, 64, 64, -64, -64, -64, -64, -64, -64, -64, -64, 64, -64, 64, 64, 64, 64, 64, 64, 64, 64, -64, 64, -64, 64, -64, -64, -64, -64, -64, 64, -64, -64, -64, -64, -64, -64, 64, -64, -64, -64, 64, -64, -64, 64, 64, -64, 64, -64, -64, -64, -64, -64, -64, -64, -64, 64, 64, -64, -64, -64, -64, -64, -64, -64, -64, 64, 64, -64, 64, -64, 64, -64, 64, 64, -64, -64, -64, -64, -64, -64, -64, -64, -64, -64, -64, -64, -64, -64, -64, -64, -64, -64, -64, 64, 64, 64, 64, 64, -64, -64, -64, 64, -64, -64, -64, -64, -64, -64, -64, -64, -64, 64, 64, 64, 64, -64, 64, 64, 64, 64, 64, 64, 64, 64, 64, 64, -64, -64, 64, -64, -64, -64, -64, -64, -64, -64, 64, -64, 64, 64, -64, -64, -64, 64, 64, 64, 64, 64, 64, 64, 64, -64, 64, -64, 64, 64, -64, -64, -64, -64, 64, -64, 64, 64, -64, 64, 64, 64, 64, 64, -64, -64, 64, 64, 64, 64, 64, 64, 64, 64, 64, 64, 64, -64, 64, -64, -64, -64, -64, 64, 64, -64, 64, -64, 64, -64, 64, 64, -64, 64, 64, 64, 64, 64, 64, 64, -64, 64, 64, 64, -64, -64, -64, -64, 64, 64, 64, -64, 64, -64, -64, -64, -64, -64, 64, 64, 64, 64, 64, 64, -64, -64, 64, 64, 64, -64, 64, 64, -64, 64, -64, -64, 64, 64, -64, -64, -64, -64, 64, -64, -64, -64, 64, 64, -64, -64, -64, 64, -64, 64, -64, 64, -64, -64, 64, -64, 64, -64, -64, -64, 64, 64, -64, -64, -64, -64, -64, -64, 64, -64, -64, -64, 64, -64, -64, -64, -64, -64, -64, 64, -64, 64, 64, -64, 64, 64, -64, 64, 64, 64, 64, -64, -64, -64, -64, -64, -64, -64, -64, -64, 64, -64, 64, -64, -64, -64, -64, -64, -64, 64, -64, 64, 64, 64, -64, 64, 64, 64, 64, -64, -64, -64, -64, -64, -64, -64, -64, 64, -64, -64, -64, 64, -64, -64, -64, -64, -64, -64, 64, 64, 64, -64, 64, 64, 64, -64, 64, 64, -64, -64, -64, 64, -64, -64, -64, -64, -64, -64, -64, 64, -64, 64, -64, -64, -64, 64, 64, -64, 64, 64, -64, 64, -64, -64, 64, 64, 64, 64, 64, 64, -64, -64, -64, -64, 64, 64, -64, -64, -64, -64, 64, -64, -64, -64, -64, 64, -64, -64, -64, 64, 64, -64, -64, -64, -64, -64, -64, -64, 64, -64, -64, -64, 64, 64, -64, -64, -64, -64, -64, -64, -64, 64, -64, 64, -64, 64, 64, -64, 64, -64, 64, -64, 64, -64, -64, 64, -64, -64, 64, 64, 64, 64, 64, -64, -64, -64, -64, -64, 64, 64, -64, -64, -64, -64, -64, 64, -64, 64, 64, -64, -64, 64, -64, -64, 64, -64, 64, -64, -64, 64, -64, 64, -64, -64, -64, 64, 64, -64, 64, -64, -64, 64, -64, 64, -64, 64, 64, -64, 64, -64, -64, 64, -64, 64, -64, -64, 64, -64, 64, -64, 64, -64, 64, 64, -64, -64, -64, -64, -64, -64, 64, 64, 64, -64, 64, 64, -64, -64, -64, 64, -64, -64, 64, -64, 64, -64, -64, -64, 64, -64, 64, -64, -64, -64, 64, 64, -64, 64, 64, -64, -64, 64, -64, 64, -64, 64, 64, 64, 64, -64, -64, -64, -64, 64, 64, -64, -64, 64, 64, -64, 64, 64, 64, 64, 64, 64, -64, -64, 64, -64, -64, -64, 64, 64, 64, -64, -64, -64, -64, -64, -64, 64, 64, 64, 64, 64, 64, -64, 64, 64, 64, -64, 64, 64, 64, 64, -64, 64, -64, -64, -64, -64, -64, 64, -64, -64, -64, 64, 64, 64, 64, 64, 64, 64, 64, 64, 64, -64, -64, -64, 64, -64, -64, -64, 64, 64, -64, -64, 64, 64, -64, 64, 64, 64, -64, -64, 64, 64, 64, 64, 64, 64, 64, 64, 64, 64, 64, -64, 64, -64, -64, -64, -64, -64, 64, 64, 64, -64, -64, 64, -64, -64, -64, -64, -64, -64, -64, 64, 64, 64, 64, 64, 64, 64, 64, -64, -64, 64, 64, -64, -64, -64, 64, 64, -64, -64, 64, -64, -64, -64, -64, -64, -64, -64, -64, 64, 64, 64, 64, 64, 64, 64, -64, -64, 64, -64, 64, -64, -64, -64, -64, -64, -64, -64, 64, 64, 64, -64, -64, -64, -64, -64, 64, 64, -64, 64, 64, 64, 64, 64, 64, -64, 64, 64, 64, -64, -64, -64, -64, 64, -64, 64, 64, 64, 64, 64, -64, -64, -64, -64, 64, 64, 64, 64, -64, 64, 64, 64, -64, -64, 64, -64, -64, 64, -64, -64, -64, 64, -64, -64, 64, 64, 64, 64, -64, -64, -64, -64, -64, -64, 64, 64, 64, 64, 64, -64, 64, -64, -64, 64, 64, -64, 64, -64, 64, 64, 64, 64, 64, 64, 64, 64, -64, -64, -64, -64, -64, -64, -64, 64, 64, 64, 64, -64, 64, -64, -64, -64, -64, 64, 64, -64, 64, 64, 64, -64, -64, 64, 64, 64, -64, -64, -64, -64, 64, 64, 64, 64, 64, 64, 64, 64, 64, -64, 64, -64, -64, -64, 64, 64, 64, -64, -64, -64, -64, -64, -64, -64, -64, -64, -64, -64, -64, -64, 64, 64, 64, 64, 64, 64, 64, -64, -64, -64, 64, 64, 64, 64, 64, -64, -64, -64, -64, -64, -64, -64, -64, -64, 64, -64, -64, 64, -64, 64, 64, 64, 64, 64, -64, 64, -64, -64, 64, 64, 64, 64, 64, 64, -64, -64, -64, -64, 64, -64, -64, -64, -64, 64, -64, 64, -64, -64, -64, 64, 64, 64, -64, -64, 64, 64, 64, 64, 64, 64, 64, 64, 64, -64, 64, -64, -64, -64, -64, -64, 64, 64, 64, 64, 64, 64, -64, 64, -64, 64, -64, 64, -64, 64, 64, -64, 64, 64, 64, 64, 64, 64, 64, 64, 64, 64, 64, 64, 64, -64, 64, -64, 64, -64, -64, -64, 64, 64, -64, 64, 64, 64, -64, -64, 64, 64, 64, 64, 64, 64, 64, 64, 64, 64, 64, -64, -64, -64, -64, -64, -64, -64, -64, -64, 64, 64, -64, -64, 64, 64, -64, -64, -64, 64, 64, 64, 64, 64, 64, 64, 64, 64, 64, -64, 64, -64, -64, -64, -64, -64, -64, -64, 64, 64, -64, 64, 64, 64, -64, -64, -64, 64, 64, 64, 64, 64, 64, 64, 64, 64, -64, 64, -64, -64, -64, -64, -64, -64, 64, 64, 64, -64, 64, -64, -64, 64, -64, -64, -64, -64, -64, 64, 64, 64, -64, -64, -64, -64, -64, 64, 64, -64, -64, -64, -64, -64, -64, 64, 64, 64, -64, 64, -64, 64, -64, -64, -64, -64, -64, -64, 64, 64, 64, -64, 64, -64, 64, 64, 64, -64, -64, 64, -64, -64, -64, 64, 64, 64, -64, 64, -64, -64, -64, -64, -64, -64, -64, -64, 64, 64, -64, 64, 64, 64, 64, -64, -64, -64, -64, -64, -64, 64, -64, 64, 64, 64, -64, -64, -64, -64, -64, -64, -64, -64, -64, -64, -64, 64, -64, 64, 64, 64, 64, 64, -64, -64, -64, -64, -64, -64, -64, -64, 64, 64, 64, -64, 64, 64, 64, 64, -64, -64, -64, -64, -64, -64, -64, -64, -64, -64, 64, -64, -64, -64, -64, -64, -64, -64, -64, -64, -64, -64, -64, 64, -64, 64, 64, -64, 64, -64, -64, -64, -64, -64, -64, -64, -64, -64, -64, 64, -64, -64, -64, -64, -64, -64, -64, -64, 64, -64, 64, 64, -64, 64, 64, 64, 64, 64, -64, 64, -64, -64, 64, -64, 64, -64, -64, 64, 64, 64, -64, -64, -64, -64, -64, -64, 64, -64, 64, 64, -64, 64, 64, -64, 64, 64, 64, -64, 64, 64, -64, 64, -64, 64, -64, 64, 64, -64, 64, 64, -64, 64, -64, -64, 64, -64, -64, -64, 64, 64, -64, 64, -64, 64, -64, -64, -64, 64, 64, 64, -64, -64, 64, 64, -64, -64, -64, -64, -64, -64, -64, -64, -64, -64, -64, -64, -64, 64, -64, 64, 64, -64, -64, -64, 64, 64, 64, 64, 64, 64, 64, 64, 64, 64, -64, -64, -64, -64, -64, 64, 64, -64, 64, 64, 64, 64, 64, 64, -64, -64, 64, -64, -64, -64, 64, 64, 64, 64, 64, 64, 64, 64, 64, -64, -64, 64, 64, 64, -64, -64, 64, 64, 64, 64, -64, -64, 64, -64, -64, 64, 64, 64, 64, 64, 64, 64, 64, 64, 64, 64, 64, 64, 64, 64, 64, 64, 64, 64, 64, 64, 64, 64, -64, -64, -64, -64, 64, 64, 64, 64, 64, 64, 64, 64, 64, 64, 64, 64, 64, 64, -64, 64, 64, 64, -64, 64, 64, -64, 64, -64, 64, -64, 64, 64, -64, -64, 64, 64, 64, -64, 64, 64, 64, 64, 64, 64, 64, 64, -64, -64, -64, -64, -64, -64, 64, -64, 64, -64, 64, 64, 64, 64, -64, -64, -64, 64, -64, -64, 64, 64, 64, 64, 64, 64, 64, -64, -64, -64, -64, -64, -64, -64, -64, -64, 64, -64, 64, 64, 64, -64, -64, -64, 64, 64, 64, 64, 64, 64, 64, 64, 64, -64, 64, -64, -64, -64, -64, -64, -64, -64, -64, -64, 64, -64, -64, 64, 64, 64, 64, 64, 64, 64, 64, 64, 64, 64, 64, -64, 64, -64, -64, -64, -64, -64, -64, -64, -64, -64, -64, -64, -64, 64, 64, -64, 64, 64, 64, 64, -64, -64, 64, 64, 64, -64, -64, -64, -64, -64, -64, 64, -64, -64, -64, -64, -64, -64, -64, 64, -64, 64, -64, -64, 64, -64, -64, -64, -64, -64, 64, -64, -64, -64, 64, 64, 64, 64, 64, 64, -64, -64, -64, -64, -64, -64, 64, 64, -64, 64, -64, -64, -64, -64, -64, -64, -64, -64, -64, -64, -64, 64, 64, 64, 64, 64, 64, 64, -64, -64, -64, -64, -64, 64, 64, 64, -64, 64, 64, -64, -64, -64, -64, -64, -64, -64, -64, -64, -64, 64, -64, -64, -64, 64, 64, -64, -64, -64, -64, -64, -64, 64, 64, 64, 64, -64, 64, 64, -64, -64, -64, -64, -64, -64, -64, -64, 64, -64, 64, 64, 64, -64, 64, -64, 64, 64, 64, -64, -64, 64, 64, 64, -64, 64, -64, -64, 64, -64, 64, 64, -64, -64, -64, 64, 64, 64, 64, 64, 64, 64, -64, -64, 64, 64, 64, -64, -64, -64, -64, 64, -64, -64, -64, -64, 64, -64, 64, 64, -64, -64, 64, 64, 64, -64, -64, 64, 64, 64, 64, -64, 64, 64, 64, -64, -64, -64, 64, -64, 64, -64, 64, 64, 64, 64, 64, -64, -64, 64, 64, -64, -64, -64, -64, 64, 64, 64, 64, 64, -64, -64, 64, 64, -64, 64, 64, -64, 64, -64, 64, 64, 64, 64, -64, 64, 64, -64, 64, -64, -64, -64, 64, 64, 64, 64, -64, 64, 64, -64, -64, 64, -64, 64, -64, 64, -64, -64, 64, 64, 64, 64, 64, 64, -64, 64, -64, -64, -64, 64, 64, 64, 64, -64, 64, 64, 64, 64, 64, 64, -64, 64, 64, 64, -64, -64, 64, 64, 64, 64, 64, -64, 64, 64, -64, -64, -64, -64, 64, 64, -64, 64, 64, 64, 64, 64, 64, 64, -64, -64, 64, 64, 64, 64, 64, 64, 64, 64, 64, -64, -64, -64, 64, -64, -64, 64, 64, -64, 64, 64, 64, 64, 64, 64, 64, -64, 64, 64, -64, -64, -64, 64, 64, 64, 64, 64, -64, 64, -64, -64, -64, 64, 64, 64, -64, 64, 64, 64, 64, 64, 64, 64, 64, 64, -64, -64, 64, -64, -64, -64, 64, 64, 64, 64, 64, -64, -64, -64, 64, -64, -64, 64, -64, 64, 64, 64, 64, 64, 64, 64, 64, 64, -64, -64, -64, 64, -64, -64, 64, 64, -64, -64, 64, -64, -64, -64, -64, -64, -64, -64, -64, -64, 64, 64, 64, 64, 64, 64, 64, 64, 64, -64, 64, -64, 64, 64, 64, -64, -64, 64, 64, -64, -64, 64, 64, -64, -64, -64, -64, -64, -64, -64, 64, 64, 64, 64, -64, 64, 64, -64, 64, 64, -64, -64, -64, -64, 64, 64, -64, -64, 64, 64, 64, 64, 64, 64, 64, 64, -64, -64, -64, -64, -64, -64, 64, -64, 64, -64, 64, 64, -64, -64, -64, -64, -64, -64, 64, 64, 64, -64, 64, -64, 64, -64, -64, 64, -64, 64, 64, 64, 64, -64, -64, -64, 64, 64, 64, 64, 64, -64, -64, -64, 64, 64, -64, -64, 64, 64, -64, -64, -64, 64, 64, 64, -64, -64, -64, 64, 64, 64, 64, 64, -64, -64, -64, -64, 64, 64, -64, 64, 64, 64, -64, -64, -64, -64, -64, 64, 64, 64, 64, 64, -64, -64, 64, 64, -64, -64, -64, -64, 64, 64, 64, 64, -64, 64, -64, 64, -64, -64, -64, -64, 64, -64, -64, 64, -64, -64, -64, 64, 64, -64, 64, -64, 64, 64, 64, 64, 64, 64, 64, -64, -64, 64, 64, 64, 64, -64, -64, 64, -64, -64, 64, -64, 64, 64, 64, 64, 64, 64, 64, -64, 64, 64, 64, -64, -64, 64, 64, -64, -64, -64, 64, 64, 64, 64, 64, 64, -64, -64, -64, 64, 64, -64, -64, 64, -64, 64, -64, -64, 64, 64, 64, -64, -64, -64, 64, -64, 64, -64, 64, -64, 64, -64, 64, -64, -64, 64, -64, 64, -64, 64, 64, -64, 64, -64, -64, -64, -64, -64, -64, -64, -64, 64, -64, 64, -64, 64, -64, -64, 64, -64, 64, 64, 64, -64, 64, 64, 64, 64, 64, 64, -64, 64, 64, 64, 64, 64, -64, -64, 64, -64, -64, -64, 64, -64, -64, 64, -64, 64, 64, -64, 64, -64, 64, -64, 64, 64, 64, 64, 64, 64, 64, -64, 64, 64, 64, 64, -64, -64, 64, -64, -64, -64, -64, 64, 64, 64, 64, -64, -64, -64, -64, -64, -64, -64, -64, -64, 64, 64, 64, -64, 64, 64, 64, -64, -64, 64, -64, -64, -64, 64, 64, 64, 64, 64, 64, 64, 64, 64, 64, 64, 64, 64, 64, 64, 64, 64, 64, 64, 64, -64, 64, 64, 64, -64, -64, -64, -64, 64, -64, 64, -64, 64, 64, 64, -64, -64, 64, 64, -64, 64, 64, 64, 64, -64, -64, -64, -64, -64, -64, -64, 64, 64, -64, -64, 64, -64, -64, 64, 64, 64, 64, -64, -64, 64, 64, 64, 64, 64, 64, 64, 64, 64, 64, 64, 64, -64, -64, -64, 64, 64, 64, 64, -64, -64, 64, -64, 64, 64, 64, -64, -64, -64, -64, -64, -64, 64, 64, 64, -64, 64, -64, 64, 64, 64, 64, -64, 64, -64, 64, -64, -64, -64, -64, 64, -64, 64, 64, 64, -64, -64, 64, 64, 64, 64, 64, 64, 64, 64, 64, -64, 64, -64, -64, 64, 64, 64, 64, 64, -64, -64, 64, 64, 64, 64, 64, 64, 64, 64, 64, -64, 64, 64, 64, 64, 64, 64, 64, 64, 64, 64, -64, 64, 64, -64, -64, 64, 64, -64, 64, -64, -64, 64, 64, 64, 64, 64, -64, 64, 64, 64, 64, -64, -64, 64, 64, 64, -64, -64, -64, 64, -64, 64, -64, -64, 64, -64, -64, -64, -64, -64, 64, 64, -64, 64, 64, 64, 64, 64, -64, 64, 64, 64, 64, 64, 64, -64, -64, -64, -64, -64, 64, 64, -64, 64, 64, -64, -64, -64, -64, -64, 64, 64, 64, 64, 64, 64, -64, 64, 64, -64, 64, 64, -64, -64, -64, 64, 64, 64, -64, -64, 64, -64, -64, -64, 64, -64, -64, 64, -64, -64, 64, 64, -64, 64, 64, 64, 64, 64, 64, -64, 64, -64, -64, -64, -64, -64, -64, 64, -64, -64, 64, -64, 64, -64, 64, -64, -64, 64, 64, -64, -64, -64, -64, -64, 64, 64, 64, -64, 64, -64, 64, 64, -64, -64, 64, 64, 64, -64, 64, -64, -64, 64, -64, -64, 64, -64, 64, 64, -64, 64, 64, -64, 64, 64, -64, 64, -64, 64, 64, -64, -64, -64, 64, 64, -64, -64, -64, 64, 64, -64, -64, -64, 64, -64, -64, -64, 64, 64, 64, -64, 64, 64, 64, -64, -64, -64, 64, 64, -64, 64, -64, -64, 64, -64, 64, 64, 64, -64, 64, -64, 64, 64, 64, 64, -64, 64, 64, -64, 64, 64, 64, 64, 64, 64, 64, -64, -64, 64, 64, 64, -64, 64, 64, -64, 64, -64, -64, 64, 64, 64, 64, 64, 64, 64, 64, 64, 64, -64, -64, -64, 64, 64, -64, 64, 64, -64, 64, -64, 64, -64, -64, 64, -64, -64, 64, -64, 64, -64, 64, 64, 64, -64, 64, 64, -64, -64, 64, -64, -64, -64, 64, -64, 64, 64, 64, -64, 64, -64, -64, -64, -64, -64, -64, -64, 64, 64, 64, -64, -64, -64, -64, 64, 64, -64, 64, -64, 64, 64, -64, 64, -64, 64, 64, 64, -64, 64, 64, -64, -64, 64, -64, 64, -64, -64, 64, -64, -64, 64, 64, 64, -64, -64, -64, 64, 64, 64, -64, -64, 64, 64, 64, 64, 64, 64, 64, -64, 64, -64, 64, 64, -64, 64, -64, 64, 64, 64, -64, 64, -64, 64, -64, 64, -64, 64, 64, 64, -64, -64, 64, -64, 64, -64, -64, 64, 64, 64, 64, 64, -64, -64, -64, -64, -64, -64, -64, 64, 64, 64, 64, -64, 64, -64, 64, -64, -64, -64, 64, -64, -64, -64, -64, 64, 64, -64, 64, 64, 64, 64, 64, 64, -64, 64, -64, 64, -64, -64, -64, 64, 64, -64, -64, -64, -64, -64, 64, -64, -64, -64, -64, 64, 64, 64, 64, -64, 64, 64, 64, -64, -64, -64, 64, -64, -64, -64, 64, 64, 64, -64, 64, 64, 64, 64, -64, -64, -64, 64, 64, -64, -64, 64, -64, 64, -64, -64, -64, 64, 64, -64, 64, -64, 64, -64, 64, 64, 64, 64, -64, 64, 64, -64, 64, 64, 64, -64, 64, -64, -64, -64, -64, -64, -64, 64, 64, 64, 64, 64, 64, 64, 64, -64, -64, -64, 64, -64, 64, 64, 64, 64, -64, 64, 64, 64, 64, -64, 64, 64, -64, -64, 64, 64, 64, 64, -64, 64, 64, 64, -64, 64, 64, 64, 64, -64, -64, 64, -64, 64, 64, -64, -64, -64, -64, 64, -64, -64, -64, 64, -64, -64, 64, -64, 64, 64, -64, -64, -64, 64, 64, 64, 64, 64, 64, -64, -64, 64, -64, 64, -64, 64, 64, 64, 64, 64, 64, 64, -64, 64, 64, 64, -64, -64, -64, -64, -64, -64, 64, 64, 64, 64, -64, 64, -64, -64, -64, -64, 64, 64, -64, 64, -64, 64, -64, -64, 64, 64, 64, -64, -64, -64, -64, 64, -64, -64, -64, 64, 64, 64, 64, -64, -64, 64, -64, 64, 64, 64, 64, 64, 64, 64, 64, 64, -64, 64, -64, 64, -64, -64, 64, -64, 64, -64, -64, -64, 64, -64, -64, -64, 64, 64, 64, 64, 64, -64, -64, 64, 64, -64, 64, 64, -64, -64, 64, -64, -64, 64, -64, 64, 64, 64, -64, -64, 64, 64, 64, 64, 64, -64, -64, 64, -64, -64, 64, 64, 64, 64, 64, -64, -64, -64, -64, -64, 64, 64, 64, 64, 64, 64, -64, 64, 64, 64, 64, 64, 64, 64, -64, -64, 64, 64, -64, 64, 64, 64, 64, 64, 64, -64, -64, -64, -64, -64, 64, 64, -64, 64, -64, 64, -64, 64, 64, 64, 64, -64, 64, -64, -64, -64, 64, 64, -64, 64, 64, -64, -64, -64, -64, -64, -64, 64, 64, -64, -64, -64, -64, 64, 64, 64, 64, 64, 64, 64, 64, 64, -64, -64, 64, -64, 64, 64, 64, 64, 64, -64, 64, -64, 64, 64, 64, 64, -64, 64, 64, 64, 64, 64, 64, -64, -64, 64, -64, -64, 64, -64, 64, 64, -64, 64, 64, 64, 64, 64, 64, -64, 64, 64, -64, 64, -64, -64, 64, -64, 64, 64, 64, -64, -64, 64, 64, 64, -64, -64, 64, -64, 64, 64, 64, -64, 64, -64, -64, -64, 64, -64, 64, -64, -64, -64, -64, -64, 64, 64, 64, 64, 64, -64, 64, -64, -64, 64, -64, 64, 64, 64, 64, 64, -64, -64, -64, -64, 64, -64, -64, -64, -64, -64, -64, 64, 64, 64, 64, 64, -64, -64, 64, 64, 64, 64, -64, 64, 64, 64, 64, 64, 64, -64, -64, 64, 64, -64, 64, -64, -64, 64, 64, 64, 64, 64, 64, 64, -64, 64, -64, 64, 64, 64, 64, -64, 64, 64, 64, 64, 64, 64, -64, 64, 64, -64, -64, -64, 64, -64, 64, 64, 64, 64, 64, 64, 64, -64, -64, 64, 64, -64, -64, -64, 64, 64, 64, 64, 64, 64, 64, -64, 64, 64, -64, -64, -64, 64, 64, 64, 64, -64, 64, 64, 64, -64, 64, 64, -64, 64, -64, 64, 64, 64, 64, 64, 64, 64, 64, 64, 64, -64, -64, 64, -64, 64, 64, 64, 64, 64, -64, 64, -64, -64, -64, -64, 64, 64, -64, 64, 64, 64, 64, 64, 64, 64, 64, 64, -64, -64, -64, 64, -64, 64, 64, 64, 64, -64, 64, 64, 64, 64, 64, -64, 64, -64, -64, -64, -64, -64, 64, 64, 64, -64, 64, -64, -64, -64, -64, -64, 64, -64, -64, 64, 64, 64, -64, 64, -64, 64, 64, -64, 64, -64, -64, 64, 64, 64, -64, 64, 64, 64, 64, -64, 64, -64, -64, -64, 64, -64, 64, -64, 64, 64, -64, 64, 64, 64, -64, 64, -64, 64, -64, -64, 64, 64, -64, 64, -64, 64, 64, 64, -64, -64, -64, -64, 64, -64, -64, 64, -64, -64, 64, 64, -64, -64, 64, 64, 64, -64, 64, -64, 64, 64, 64, -64, -64, 64, 64, -64, 64, -64, -64, 64, 64, -64, -64, -64, 64, 64, -64, -64, -64, 64, 64, 64, 64, 64, -64, 64, -64, -64, 64, -64, -64, -64, 64, -64, 64, 64, -64, 64, 64, 64, -64, -64, 64, -64, 64, 64, 64, -64, -64, 64, -64, 64, 64, -64, -64, -64, -64, 64, 64, -64, 64, 64, 64, -64, 64, -64, 64, 64, 64, -64, 64, -64, -64, -64, 64, -64, 64, 64, 64, 64, -64, 64, -64, -64, 64, 64, -64, 64, -64, -64, 64, 64, -64, 64, 64, 64, 64, -64, -64, -64, 64, -64, -64, -64, 64, -64, 64, -64, 64, -64, -64, -64, 64, 64, 64, -64, 64, -64, -64, -64, -64, -64, -64, 64, 64, 64, -64, 64, -64, -64, -64, 64, -64, 64, -64, 64, -64, 64, -64, -64, 64, -64, -64, -64, -64, -64, -64, -64, -64, 64, 64, -64, -64, -64, -64, 64, -64, 64, 64, 64, 64, -64, 64, -64, 64, -64, -64, 64, 64, 64, 64, 64, 64, 64, 64, 64, 64, 64, -64, -64, -64, -64, -64, -64, 64, 64, 64, 64, 64, 64, -64, 64, -64, -64, -64, -64, 64, 64, 64, 64, 64, 64, 64, 64, 64, 64, 64, 64, -64, -64, -64, -64, 64, 64, 64, 64, -64, 64, -64, -64, 64, -64, 64, 64, -64, -64, 64, 64, 64, 64, 64, 64, 64, 64, 64, -64, -64, -64, -64, -64, 64, 64, 64, 64, -64, 64, -64, 64, 64, -64, 64, 64, 64, 64, 64, 64, 64, 64, 64, 64, 64, 64, -64, -64, -64, -64, -64, -64, 64, 64, 64, 64, -64, 64, -64, -64, -64, -64, 64, -64, 64, 64, 64, 64, 64, 64, -64, 64, 64, 64, 64, -64, -64, -64, -64, -64, -64, 64, 64, 64, -64, 64, 64, -64, -64, 64, 64, 64, 64, 64, -64, -64, 64, 64, 64, -64, -64, -64, -64, -64, -64, -64, -64, -64, -64, -64, 64, 64, 64, -64, -64, -64, -64, -64, 64, 64, 64, 64, 64, -64, 64, -64, 64, 64, -64, -64, -64, -64, -64, -64, -64, -64, 64, 64, 64, 64, 64, -64, -64, -64, 64, -64, -64, -64, -64, -64, -64, 64, 64, 64, 64, 64, -64, -64, -64, -64, -64, 64, -64, 64, 64, -64, 64, 64, 64, 64, 64, 64, -64, -64, -64, -64, -64, 64, 64, 64, -64, 64, 64, 64, -64, -64, -64, -64, -64, -64, -64, -64, 64, -64, 64, 64, 64, -64, -64, 64, 64, -64, -64, -64, -64, -64, 64, 64, -64, 64, 64, 64, -64, 64, 64, -64, -64, -64, -64, 64, 64, -64, -64, -64, 64, 64, 64, -64, 64, -64, -64, -64, -64, -64, -64, -64, -64, 64, 64, -64, 64, -64, 64, -64, -64, -64, -64, -64, 64, 64, 64, 64, -64, 64, 64, -64, -64, 64, -64, -64, -64, -64, 64, 64, 64, 64, -64, -64, 64, 64, -64, -64, -64, -64, -64, -64, 64, -64, -64, -64, -64, 64, -64, -64, -64, -64, -64, -64, -64, 64, -64, 64, 64, 64, 64, 64, -64, 64, 64, -64, -64, -64, -64, 64, 64, 64, -64, -64, 64, -64, -64, -64, -64, -64, -64, -64, 64, -64, 64, 64, 64, 64, 64, -64, -64, 64, -64, -64, -64, -64, -64, -64, 64, 64, 64, 64, -64, 64, 64, -64, -64, -64, -64, -64, 64, 64, 64, -64, 64, -64, -64, -64, -64, -64, -64, -64, -64, -64, 64, 64, 64, 64, 64, 64, -64, -64, -64, 64, -64, -64, -64, 64, -64, -64, -64, 64, -64, -64, -64, -64, -64, -64, -64, 64, 64, 64, 64, 64, 64, 64, 64, 64, 64, 64, 64, 64, -64, -64, -64, -64, -64, -64, -64, -64, -64, -64, -64, -64, -64, -64, 64, 64, 64, 64, 64, 64, 64, 64, 64, 64, 64, -64, -64, 64, -64, -64, -64, -64, -64, -64, 64, 64, -64, -64, -64, -64, -64, -64, 64, 64, 64, 64, 64, 64, 64, -64, 64, 64, -64, 64, -64, 64, -64, 64, -64, -64, -64, 64, -64, -64, -64, -64, -64, 64, 64, 64, 64, 64, 64, 64, 64, 64, 64, 64, 64, 64, 64, 64, -64, -64, -64, -64, -64, -64, -64, 64, 64, -64, -64, 64, 64, -64, 64, 64, 64, 64, 64, 64, 64, 64, 64, -64, 64, 64, 64, -64, 64, -64, 64, -64, -64, -64, -64, -64, -64, -64, 64, 64, 64, 64, 64, 64, 64, 64, 64, 64, 64, -64, 64, 64, -64, 64, 64, 64, 64, 64, 64, 64, -64, 64, -64, 64, 64, 64, 64, 64, -64, -64, 64, -64, -64, -64, 64, 64, -64, -64, -64, 64, 64, 64, 64, -64, 64, 64, -64, 64, 64, 64, 64, -64, -64, -64, -64, -64, -64, -64, -64, -64, -64, -64, -64, -64, 64, 64, 64, 64, 64, -64, -64, -64, -64, -64, -64, -64, 64, 64, 64, 64, 64, 64, -64, -64, -64, -64, 64, -64, -64, -64, 64, 64, -64, -64, -64, 64, 64, -64, -64, 64, 64, -64, 64, 64, -64, -64, 64, -64, -64, 64, 64, 64, 64, -64, -64, -64, -64, 64, 64, 64, 64, 64, -64, 64, -64, 64, 64, 64, 64, -64, 64, 64, -64, 64, 64, 64, 64, 64, -64, 64, 64, 64, -64, -64, 64, 64, 64, 64, -64, 64, -64, -64, -64, 64, -64, -64, 64, 64, -64, -64, 64, 64, -64, 64, -64, 64, 64, 64, 64, -64, 64, 64, 64, 64, 64, 64, 64, 64, 64, -64, 64, 64, -64, 64, -64, 64, -64, -64, 64, -64, -64, 64, 64, 64, -64, 64, 64, 64, -64, 64, 64, -64, 64, 64, -64, 64, 64, 64, -64, 64, 64, -64, 64, -64, 64, -64, -64, 64, 64, 64, 64, 64, 64, -64, 64, -64, 64, -64, -64, -64, -64, -64, -64, -64, 64, -64, -64, -64, 64, 64, -64, -64, -64, -64, -64, 64, 64, 64, 64, 64, 64, -64, 64, 64, -64, -64, -64, -64, -64, -64, -64, -64, 64, -64, -64, -64, 64, 64, 64, -64, 64, 64, 64, 64, 64, 64, 64, -64, 64, -64, -64, -64, -64, -64, -64, -64, -64, -64, -64, -64, -64, -64, -64, -64, 64, -64, 64, 64, 64, 64, 64, 64, -64, 64, -64, -64, -64, -64, 64, -64, -64, -64, -64, -64, -64, -64, -64, -64, -64, -64, -64, -64, -64, -64, -64, 64, -64, -64, -64, 64, -64, 64, 64, -64, 64, 64, -64, -64, -64, -64, -64, -64, -64, -64, -64, -64, -64, -64, -64, -64, -64, -64, 64, 64, -64, -64, -64, 64, -64, -64, -64, -64, -64, 64, -64, -64, -64, -64, -64, -64, -64, 64, -64, -64, -64, -64, -64, -64, 64, -64, 64, 64, 64, -64, 64, -64, -64, -64, -64, -64, -64, 64, 64, -64, -64, -64, -64, 64, 64, 64, 64, 64, -64, -64, 64, -64, -64, 64, 64, -64, 64, -64, 64, -64, -64, 64, 64, -64, 64, 64, -64, -64, -64, -64, 64, 64, 64, 64, 64, -64, -64, 64, 64, -64, 64, -64, 64, 64, -64, -64, 64, -64, -64, -64, -64, -64, 64, -64, -64, -64, -64, -64, 64, 64, 64, 64, 64, 64, 64, 64, -64, -64, -64, -64, -64, 64, -64, -64, -64, 64, 64, 64, 64, 64, -64, -64, -64, -64, -64, 64, 64, 64, 64, 64, 64, 64, 64, 64, 64, -64, -64, -64, 64, -64, 64, -64, -64, -64, -64, 64, -64, 64, -64, 64, -64, 64, 64, 64, 64, -64, -64, -64, 64, 64, 64, 64, 64, -64, -64, -64, 64, -64, 64, -64, 64, -64, 64, 64, 64, -64, -64, -64, -64, 64, 64, -64, 64, -64, -64, -64, 64, 64, 64, -64, -64, -64, -64, 64, -64, 64, -64, 64, -64, -64, 64, -64, 64, -64, -64, -64, -64, -64, -64, -64, -64, -64, 64, -64, -64, 64, -64, 64, -64, -64, -64, 64, 64, -64, 64, 64, 64, -64, -64, 64, 64, 64, -64, 64, -64, 64, 64, 64, 64, 64, -64, 64, -64, -64, -64, -64, -64, 64, -64, 64, 64, 64, -64, -64, -64, 64, -64, 64, 64, 64, -64, 64, -64, 64, -64, 64, 64, 64, 64, 64, 64, -64, 64, -64, -64, -64, -64, -64, 64, -64, 64, -64, -64, 64, -64, 64, 64, -64, -64, 64, -64, 64, 64, 64, 64, 64, -64, -64, -64, 64, -64, -64, -64, -64, 64, -64, -64, 64, 64, 64, 64, -64, -64, 64, -64, 64, -64, -64, 64, 64, 64, 64, -64, 64, -64, 64, -64, -64, -64, -64, -64, 64, 64, 64, 64, 64, 64, -64, 64, 64, 64, -64, -64, 64, -64, -64, -64, 64, 64, 64, 64, 64, -64, -64, -64, -64, -64, -64, -64, 64, -64, 64, -64, 64, -64, 64, -64, -64, -64, 64, 64, 64, -64, -64, -64, -64, -64, -64, -64, -64, -64, -64, -64, -64, -64, -64, -64, -64, 64, -64, 64, 64, 64, -64, -64, 64, -64, -64, -64, -64, -64, -64, -64, -64, -64, -64, -64, -64, -64, 64, -64, -64, -64, -64, -64, 64, -64, -64, -64, 64, -64, 64, 64, -64, 64, -64, -64, -64, -64, -64, -64, -64, -64, -64, -64, -64, 64, -64, -64, 64, -64, -64, 64, 64, -64, 64, -64, 64, 64, 64, -64, -64, 64, -64, -64, 64, -64, 64, -64, 64, 64, 64, -64, 64, -64, 64, 64, -64, 64, -64, 64, 64, -64, 64, -64, -64, -64, -64, -64, 64, -64, -64, 64, 64, 64, 64, 64, -64, -64, 64, 64, 64, -64, -64, -64, 64, 64, 64, -64, -64, -64, 64, 64, 64, 64, 64, -64, -64, -64, -64, 64, 64, -64, 64, -64, -64, -64, 64, -64, -64, 64, -64, -64, 64, 64, -64, 64, 64, 64, 64, 64, 64, -64, -64, 64, -64, -64, 64, 64, -64, 64, 64, -64, 64, 64, -64, -64, -64, -64, -64, 64, -64, -64, -64, -64, 64, -64, -64, -64, 64, 64, 64, -64, -64, -64, -64, 64, -64, 64, -64, -64, 64, -64, 64, -64, 64, -64, 64, 64, -64, 64, 64, -64, 64, -64, 64, 64, 64, -64, 64, -64, 64, -64, -64, 64, -64, -64, -64, -64, -64, -64, -64, -64, -64, -64, -64, -64, -64, -64, -64, -64, -64, -64, 64, -64, 64, 64, 64, 64, -64, -64, -64, -64, 64, -64, -64, -64, -64, -64, -64, -64, -64, 64, 64, -64, -64, 64, 64, 64, -64, -64, -64, 64, -64, -64, -64, -64, 64, 64, -64, -64, -64, 64, -64, -64, -64, -64, 64, -64, -64, -64, -64, -64, -64, 64, 64, 64, 64, 64, 64, 64, -64, 64, 64, 64, 64, -64, -64, -64, 64, 64, 64, 64, -64, 64, -64, 64, -64, -64, -64, -64, -64, -64, 64, -64, -64, -64, -64, -64, -64, 64, -64, 64, 64, -64, 64, 64, 64, -64, -64, -64, -64, -64, -64, -64, -64, -64, -64, -64, -64, 64, 64, -64, 64, 64, -64, -64, -64, 64, -64, 64, -64, -64, -64, 64, 64, -64, 64, -64, 64, -64, -64, -64, -64, -64, -64, -64, -64, -64, -64, -64, -64, 64, -64, 64, 64, -64, -64, -64, 64, -64, -64, -64, -64, -64, 64, 64, -64, -64, -64, -64, -64, -64, -64, -64, -64, -64, 64, 64, 64, -64, -64, 64, 64, 64, -64, -64, 64, -64, 64, -64, 64, 64, 64, -64, 64, 64, -64, -64, -64, -64, -64, -64, -64, -64, -64, -64, 64, 64, -64, 64, -64, -64, 64, -64, -64, 64, -64, 64, 64, 64, 64, -64, -64, 64, -64, 64, 64, -64, -64, 64, -64, -64, 64, 64, 64, -64, -64, 64, 64, 64, -64, -64, 64, -64, -64, 64, 64, -64, -64, 64, 64, 64, -64, -64, 64, -64, -64, -64, 64, -64, 64, 64, 64, 64, -64, 64, 64, 64, -64, -64, 64, -64, 64, -64, -64, -64, -64, 64, 64, 64, 64, -64, -64, -64, -64, 64, 64, 64, 64, 64, -64, -64, 64, -64, 64, 64, 64, -64, -64, -64, 64, -64, -64, -64, 64, 64, 64, -64, -64, -64, -64, -64, -64, -64, -64, 64, 64, 64, -64, 64, 64, 64, -64, -64, 64, -64, 64, 64, -64, -64, -64, -64, 64, 64, -64, -64, -64, -64, -64, -64, -64, -64, 64, 64, 64, 64, 64, 64, 64, -64, 64, -64, 64, 64, -64, -64, -64, -64, 64, -64, 64, -64, 64, -64, -64, -64, -64, -64, 64, -64, 64, 64, 64, 64, 64, 64, -64, 64, 64, -64, -64, -64, -64, -64, -64, 64, 64, 64, 64, 64, 64, 64, -64, 64, 64, 64, 64, 64, 64, 64, 64, 64, -64, -64, 64, 64, -64, -64, -64, -64, 64, -64, 64, 64, 64, -64, 64, 64, -64, 64, 64, 64, -64, 64, -64, -64, 64, -64, -64, 64, 64, -64, 64, -64, -64, -64, -64, -64, -64, 64, 64, 64, 64, 64, 64, 64, -64, -64, -64, -64, 64, -64, -64, -64, -64, -64, -64, -64, 64, 64, 64, 64, 64, -64, 64, 64, -64, -64, -64, 64, -64, 64, 64, -64, -64, -64, -64, -64, -64, -64, -64, -64, -64, 64, -64, -64, 64, 64, -64, 64, 64, -64, -64, -64, -64, -64, -64, -64, -64, -64, -64, -64, -64, -64, -64, -64, -64, -64, -64, -64, 64, -64, -64, -64, 64, 64, 64, -64, 64, -64, -64, -64, -64, -64, -64, -64, -64, -64, -64, -64, -64, -64, -64, -64, -64, -64, -64, -64, 64, -64, -64, -64, -64, -64, 64, -64, 64, -64, -64, -64, -64, 64, -64, -64, 64, -64, -64, -64, -64, 64, -64, -64, -64, 64, -64, -64, 64, -64, -64, -64, 64, -64, -64, -64, 64, -64, -64, -64, -64, -64, -64, -64, -64, 64, -64, -64, -64, -64, -64, -64, -64, -64, 64, 64, 64, -64, -64, 64, -64, -64, 64, 64, 64, -64, 64, -64, -64, -64, -64, -64, -64, -64, -64, -64, -64, -64, 64, -64, 64, -64, -64, -64, -64, 64, 64, -64, 64, -64, -64, 64, -64, 64, 64, 64, -64, -64, 64, 64, -64, -64, 64, -64, -64, -64, 64, -64, -64, -64, -64, -64, -64, 64, -64, 64, -64, -64, 64, 64, 64, -64, -64, 64, -64, 64, 64, -64, -64, -64, 64, 64, 64, 64, -64, -64, 64, -64, -64, -64, -64, -64, 64, -64, -64, -64, -64, -64, 64, 64, 64, -64, -64, -64, -64, -64, -64, -64, 64, 64, 64, -64, 64, 64, 64, -64, 64, 64, -64, -64, -64, 64, 64, 64, 64, -64, 64, 64, 64, 64, 64, 64, 64, -64, -64, 64, -64, -64, -64, 64, 64, -64, -64, -64, -64, 64, -64, 64, -64, 64, 64, -64, -64, -64, 64, -64, 64, 64, 64, -64, -64, -64, -64, 64, 64, 64, -64, 64, 64, 64, 64, 64, -64, -64, 64, -64, -64, -64, 64, 64, 64, -64, 64, 64, 64, 64, -64, 64, 64, 64, 64, 64, 64, 64, -64, 64, -64, 64, -64, -64, 64, -64, 64, -64, 64, 64, 64, -64, 64, 64, -64, -64, -64, 64, -64, -64, 64, 64, 64, 64, 64, -64, 64, 64, 64, 64, -64, 64, -64, -64, 64, -64, -64, 64, 64, 64, 64, -64, -64, 64, -64, -64, -64, 64, 64, 64, 64, -64, -64, 64, 64, 64, 64, 64, -64, -64, 64, -64, -64, -64, -64, -64, -64, -64, -64, 64, -64, 64, 64, -64, 64, 64, 64, 64, 64, -64, -64, 64, -64, 64, -64, 64, 64, -64, 64, -64, -64, -64, -64, -64, 64, 64, -64, -64, 64, 64, 64, -64, -64, -64, 64, 64, 64, -64, -64, 64, -64, 64, -64, -64, -64, -64, -64, -64, -64, -64, -64, -64, -64, -64, 64, 64, 64, -64, 64, -64, -64, -64, 64, -64, 64, -64, 64, 64, 64, -64, -64, -64, -64, -64, -64, -64, -64, -64, -64, -64, -64, 64, 64, -64, 64, 64, 64, -64, -64, 64, -64, -64, 64, -64, 64, -64, -64, -64, -64, -64, -64, -64, -64, -64, -64, -64, -64, -64, 64, -64, 64, -64, -64, 64, -64, 64, -64, -64, 64, 64, 64, 64, -64, -64, -64, -64, -64, -64, -64, 64, -64, -64, -64, -64, -64, -64, -64, -64, 64, -64, -64, -64, 64, -64, -64, -64, -64, 64, 64, -64, -64, -64, -64, -64, -64, -64, -64, -64, -64, 64, 64, -64, -64, 64, -64, -64, -64, 64, 64, 64, 64, -64, -64, 64, 64, 64, 64, -64, -64, -64, -64, -64, -64, -64, -64, 64, 64, 64, -64, -64, 64, 64, 64, -64, -64, 64, 64, -64, 64, -64, -64, -64, 64, 64, -64, -64, -64, -64, -64, -64, -64, -64, 64, -64, 64, -64, 64, 64, 64, 64, 64, -64, 64, -64, 64, 64, 64, -64, -64, 64, 64, 64, -64, -64, -64, -64, -64, -64, 64, -64, 64, -64, 64, 64, -64, -64, 64, 64, 64, 64, 64, 64, 64, -64, -64, -64, -64, -64, 64, 64, -64, -64, -64, -64, -64, -64, -64, -64, -64, -64, -64, -64, -64, 64, 64, 64, 64, -64, 64, 64, 64, 64, -64, -64, 64, -64, -64, -64, -64, -64, -64, -64, 64, -64, -64, 64, -64, 64, -64, -64, 64, 64, 64, 64, 64, 64, 64, -64, 64, -64, -64, -64, 64, 64, 64, -64, -64, -64, -64, 64, 64, -64, -64, -64, -64, -64, -64, -64, 64, 64, 64, 64, 64, 64, 64, -64, -64, 64, -64, 64, 64, 64, 64, -64, -64, -64, 64, -64, -64, -64, -64, -64, -64, 64, 64, 64, -64, 64, 64, 64, 64, 64, 64, 64, 64, -64, -64, -64, 64, -64, -64, -64, -64, -64, 64, 64, -64, -64, 64, -64, 64, -64, -64, 64, 64, -64, -64, -64, 64, -64, 64, 64, -64, -64, -64, -64, -64, -64, -64, -64, 64, -64, 64, -64, 64, -64, -64, 64, 64, -64, 64, 64, -64, 64, -64, -64, 64, 64, 64, 64, 64, 64, -64, -64, -64, 64, -64, 64, 64, 64, 64, 64, 64, 64, 64, 64, -64, -64, 64, 64, -64, 64, -64, 64, -64, -64, -64, -64, -64, -64, -64, 64, 64, -64, -64, 64, -64, -64, -64, 64, -64, 64, -64, 64, -64, 64, -64, -64, -64, 64, 64, 64, -64, -64, 64, 64, 64, 64, -64, 64, 64, -64, -64, 64, 64, -64, -64, -64, -64, -64, -64, -64, -64, -64, -64, -64, -64, -64, -64, -64, -64, -64, 64, -64, 64, -64, -64, 64, -64, 64, 64, -64, -64, 64, -64, -64, -64, -64, -64, -64, -64, -64, -64, -64, -64, -64, -64, -64, -64, -64, -64, 64, -64, -64, 64, 64, -64, -64, -64, 64, 64, -64, -64, -64, -64, -64, -64, -64, -64, -64, -64, 64, -64, 64, -64, -64, -64, -64, -64, -64, 64, 64, -64, -64, -64, 64, -64, -64, 64, -64, 64, -64, 64, -64, -64, -64, -64, 64, 64, -64, -64, -64, -64, -64, -64, 64, -64, -64, -64, 64, 64, -64, -64, -64, 64, -64, 64, 64, -64, 64, 64, 64, 64, 64, -64, 64, -64, 64, 64, 64, 64, -64, 64, -64, -64, 64, -64, 64, -64, -64, -64, 64, 64, -64, -64, -64, 64, 64, -64, -64, 64, -64, 64, 64, -64, -64, -64, 64, -64, -64, 64, -64, 64, 64, 64, -64, 64, 64, -64, 64, 64, 64, -64, 64, 64, -64, -64, -64, -64, 64, -64, -64, -64, -64, -64, -64, 64, -64, -64, 64, 64, -64, -64, 64, 64, 64, -64, -64, 64, 64, 64, 64, -64, 64, -64, 64, 64, 64, 64, -64, -64, -64, 64, -64, 64, 64, 64, -64, 64, 64, 64, 64, 64, -64, -64, -64, -64, 64, 64, 64, 64, -64, -64, -64, 64, 64, 64, 64, 64, 64, -64, -64, 64, 64, -64, -64, 64, -64, -64, 64, 64, -64, 64, 64, 64, 64, 64, 64, 64, -64, -64, 64, 64, 64, 64, 64, 64, 64, 64, -64, 64, 64, 64, -64, 64, -64, 64, 64, 64, -64, -64, 64, 64, 64, -64, -64, -64, -64, -64, -64, -64, 64, 64, -64, 64, -64, -64, -64, 64, 64, -64, 64, 64, 64, -64, -64, 64, 64, 64, -64, 64, 64, -64, -64, -64, -64, -64, -64, -64, 64, 64, -64, 64, -64, -64, -64, -64, 64, 64, -64, -64, -64, 64, -64, 64, 64, 64, -64, 64, -64, -64, -64, -64, -64, -64, -64, -64, 64, 64, 64, -64, 64, -64, -64, -64, -64, -64, 64, -64, 64, 64, 64, -64, 64, -64, -64, -64, -64, -64, -64, 64, 64, -64, -64, -64, -64, 64, 64, -64, -64, -64, -64, -64, -64, -64, 64, -64, -64, 64, 64, -64, -64, -64, -64, -64, -64, -64, 64, -64, -64, -64, -64, -64, 64, 64, 64, -64, -64, -64, -64, -64, -64, -64, -64, -64, 64, 64, 64, 64, -64, 64, -64, -64, -64, 64, 64, 64, -64, -64, -64, -64, -64, 64, 64, 64, -64, -64, -64, -64, -64, -64, -64, 64, 64, -64, 64, 64, 64, 64, 64, -64, 64, 64, -64, -64, -64, -64, 64, -64, 64, -64, 64, 64, -64, -64, -64, -64, -64, -64, -64, -64, -64, -64, 64, 64, 64, 64, -64, -64, -64, -64, -64, -64, -64, -64, -64, -64, 64, -64, -64, 64, -64, -64, -64, -64, -64, -64, -64, 64, 64, -64, 64, 64, 64, 64, -64, -64, -64, -64, -64, 64, -64, -64, -64, -64, -64, 64, -64, 64, 64, -64, 64, -64, -64, -64, -64, 64, 64, 64, 64, 64, -64, -64, -64, -64, -64, 64, -64, -64, -64, -64, -64, -64, -64, 64, 64, 64, 64, -64, 64, 64, 64, -64, 64, -64, 64, 64, 64, -64, -64, 64, -64, 64, 64, 64, -64, -64, -64, -64, -64, -64, -64, 64, 64, 64, 64, -64, -64, -64, 64, -64, 64, -64, 64, 64, -64, 64, 64, -64, 64, -64, 64, -64, 64, -64, -64, -64, -64, -64, 64, 64, 64, -64, -64, -64, 64, -64, -64, -64, 64, -64, 64, 64, -64, 64, -64, -64, 64, 64, 64, 64, -64, 64, 64, -64, 64, -64, 64, 64, 64, -64, 64, -64, -64, -64, -64, -64, -64, 64, -64, 64, 64, 64, 64, 64, -64, 64, 64, -64, 64, 64, -64, -64, -64, -64, 64, 64, 64, -64, -64, -64, -64, -64, -64, 64, 64, 64, 64, -64, 64, 64, 64, 64, -64, -64, -64, 64, -64, 64, -64, -64, -64, -64, -64, -64, 64, -64, -64, -64, -64, -64, -64, -64, 64, 64, -64, -64, 64, 64, -64, -64, -64, -64, 64, -64, -64, -64, -64, -64, -64, -64, 64, 64, 64, -64, -64, -64, -64, -64, -64, -64, -64, -64, -64, 64, -64, 64, -64, -64, -64, -64, -64, -64, -64, -64, -64, -64, -64, -64, -64, -64, 64, 64, -64, -64, -64, -64, -64, -64, 64, 64, 64, -64, -64, 64, -64, -64, -64, -64, -64, -64, -64, -64, -64, -64, 64, 64, -64, -64, -64, -64, -64, -64, -64, -64, -64, 64, -64, -64, 64, -64, -64, 64, 64, -64, -64, -64, -64, -64, 64, -64, -64, -64, -64, -64, -64, -64, -64, -64, 64, 64, -64, 64, -64, 64, 64, -64, 64, -64, 64, -64, 64, -64, -64, -64, -64, -64, 64, 64, -64, -64, -64, -64, -64, -64, -64, 64, 64, -64, -64, -64, -64, 64, -64, -64, 64, 64, 64, 64, 64, -64, -64, -64, 64, 64, 64, 64, 64, 64, -64, 64, -64, -64, -64, 64, 64, 64, 64, -64, 64, 64, 64, 64, 64, 64, -64, -64, -64, -64, 64, 64, -64, 64, -64, 64, -64, 64, 64, 64, -64, -64, -64, 64, 64, 64, -64, -64, 64, -64, -64, -64, -64, 64, -64, 64, -64, -64, 64, 64, 64, -64, -64, -64, 64, 64, 64, 64, 64, -64, 64, -64, 64, 64, -64, -64, 64, -64, 64, 64, -64, -64, -64, -64, 64, 64, 64, -64, 64, 64, -64, -64, -64, -64, -64, -64, 64, -64, 64, 64, 64, 64, 64, 64, -64, 64, 64, -64, 64, -64, -64, -64, 64, 64, -64, -64, 64, -64, -64, 64, 64, -64, -64, -64, -64, -64, -64, -64, -64, 64, -64, -64, -64, 64, 64, 64, -64, 64, 64, -64, 64, -64, -64, 64, 64, -64, -64, -64, 64, -64, 64, 64, 64, 64, -64, 64, 64, 64, -64, -64, 64, -64, 64, -64, -64, -64, -64, -64, -64, -64, -64, -64, 64, -64, 64, 64, 64, -64, -64, -64, 64, 64, -64, 64, 64, 64, -64, -64, 64, -64, 64, -64, -64, -64, 64, -64, -64, 64, 64, 64, -64, -64, -64, 64, 64, 64, 64, -64, -64, 64, -64, -64, -64, 64, -64, 64, -64, 64, 64, -64, -64, 64, -64, 64, -64, -64, -64, -64, 64, 64, 64, 64, 64, -64, -64, -64, 64, 64, 64, 64, -64, -64, -64, -64, -64, -64, 64, 64, 64, -64, -64, -64, 64, 64, 64, 64, 64, -64, 64, 64, 64, -64, 64, -64, 64, 64, 64, 64, 64, 64, 64, 64, -64, 64, -64, -64, -64, -64, -64, 64, -64, -64, 64, 64, 64, -64, -64, 64, 64, 64, 64, 64, 64, 64, 64, 64, -64, 64, 64, -64, -64, 64, 64, -64, -64, 64, -64, 64, 64, 64, 64, 64, -64, -64, 64, 64, 64, 64, -64, -64, -64, 64, 64, 64, 64, 64, -64, 64, -64, 64, -64, 64, -64, 64, -64, -64, -64, 64, -64, 64, -64, 64, 64, -64, -64, 64, -64, 64, 64, 64, 64, 64, -64, 64, -64, -64, 64, -64, -64, -64, -64, 64, -64, -64, 64, -64, -64, 64, 64, -64, -64, -64, 64, -64, -64, 64, 64, 64, 64, 64, 64, 64, 64, -64, -64, 64, 64, -64, -64, -64, -64, 64, -64, -64, -64, 64, 64, 64, 64, 64, 64, 64, -64, 64, 64, 64, 64, 64, -64, -64, 64, 64, 64, -64, -64, 64, -64, 64, 64, 64, 64, 64, -64, 64, -64, -64, 64, 64, -64, -64, 64, 64, 64, 64, 64, 64, 64, 64, -64, 64, -64, 64, -64, 64, 64, -64, 64, 64, 64, -64, 64, 64, 64, 64, 64, 64, 64, 64, -64, 64, 64, 64, -64, 64, 64, -64, -64, 64, 64, -64, -64, -64, 64, -64, -64, -64, 64, -64, 64, -64, 64, -64, 64, 64, 64, -64, -64, 64, 64, 64, 64, 64, 64, 64, 64, -64, 64, -64, -64, -64, -64, -64, -64, -64, -64, 64, -64, 64, -64, -64, 64, 64, -64, -64, -64, 64, 64, 64, 64, -64, -64, 64, -64, -64, -64, 64, 64, 64, 64, 64, -64, -64, -64, 64, 64, 64, 64, 64, 64, 64, 64, -64, -64, 64, -64, 64, 64, 64, 64, 64, 64, -64, 64, -64, 64, -64, 64, -64, 64, -64, 64, 64, -64, -64, -64, -64, 64, -64, 64, -64, -64, 64, -64, 64, -64, 64, -64, 64, -64, -64, 64, 64, 64, -64, 64, 64, 64, 64, 64, -64, 64, 64, 64, -64, 64, 64, 64, 64, -64, -64, 64, -64, 64, 64, 64, 64, 64, 64, -64, 64, -64, 64, 64, -64, 64, -64, 64, 64, 64, 64, -64, -64, 64, -64, 64, 64, 64, 64, 64, 64, 64, 64, 64, -64, 64, -64, -64, 64, 64, 64, 64, 64, 64, -64, 64, 64, 64, 64, 64, 64, -64, 64, -64, 64, -64, 64, 64, 64, 64, -64, -64, -64, -64, 64, 64, 64, 64, -64, -64, -64, 64, 64, 64, -64, -64, -64, 64, -64, 64, -64, -64, -64, 64, -64, 64, -64, 64, 64, -64, 64, 64, 64, 64, 64, 64, 64, 64, -64, 64, -64, 64, -64, 64, 64, 64, 64, 64, 64, -64, 64, -64, -64, 64, 64, 64, 64, 64, 64, 64, 64, -64, -64, 64, 64, 64, -64, 64, -64, -64, 64, 64, 64, 64, 64, 64, 64, -64, 64, -64, -64, 64, 64, -64, 64, 64, 64, 64, 64, 64, -64, 64, 64, -64, 64, 64, 64, -64, -64, 64, 64, -64, -64, 64, 64, 64, 64, 64, 64, 64, -64, -64, 64, -64, 64, 64, 64, -64, 64, -64, 64, -64, -64, 64, 64, 64, 64, -64, 64, 64, 64, 64, 64, 64, 64, -64, 64, 64, -64, 64, 64, 64, -64, -64, -64, -64, -64, -64, -64, -64, -64, -64, 64, 64, 64, 64, 64, 64, 64, -64, 64, 64, 64, -64, 64, -64, 64, 64, -64, 64, -64, 64, -64, 64, -64, -64, 64, -64, 64, -64, -64, -64, -64, -64, -64, 64, -64, -64, 64, 64, -64, -64, 64, 64, 64, 64, 64, -64, 64, -64, -64, 64, -64, -64, -64, -64, 64, -64, -64, -64, -64, -64, -64, -64, -64, 64, -64, -64, -64, -64, -64, 64, 64, 64, -64, -64, -64, -64, -64, 64, 64, -64, -64, -64, -64, -64, 64, 64, 64, 64, -64, -64, -64, 64, -64, -64, 64, 64, 64, -64, -64, -64, 64, 64, -64, -64, 64, -64, 64, 64, 64, -64, -64, -64, 64, -64, 64, 64, 64, -64, -64, -64, 64, 64, -64, -64, -64, -64, -64, 64, -64, -64, 64, 64, -64, 64, -64, 64, 64, 64, -64, 64, 64, 64, -64, -64, -64, -64, -64, -64, -64, -64, -64, -64, -64, -64, -64, -64, -64, -64, -64, -64, -64, 64, -64, -64, 64, 64, -64, -64, 64, 64, -64, -64, -64, -64, -64, -64, -64, -64, -64, -64, -64, -64, -64, 64, -64, 64, -64, 64, -64, 64, -64, -64, -64, 64, 64, -64, 64, 64, 64, 64, 64, 64, 64, 64, 64, 64, 64, 64, 64, -64, -64, -64, -64, 64, -64, -64, -64, -64, 64, -64, 64, -64, 64, -64, 64, 64, -64, 64, 64, 64, 64, -64, -64, 64, 64, -64, 64, -64, -64, -64, -64, -64, -64, -64, -64, 64, -64, -64, 64, 64, 64, -64, 64, -64, -64, 64, -64, 64, 64, 64, 64, 64, -64, 64, -64, -64, -64, -64, -64, -64, -64, -64, -64, -64, -64, -64, -64, 64, 64, -64, 64, 64, 64, -64, -64, -64, -64, -64, 64, 64, -64, 64, -64, 64, -64, -64, -64, -64, -64, -64, -64, -64, -64, -64, -64, -64, -64, 64, 64, 64, -64, -64, -64, -64, -64, -64, -64, -64, -64, -64, 64, -64, 64, 64, -64, -64, -64, -64, -64, -64, -64, 64, -64, -64, -64, 64, -64, -64, -64, -64, -64, -64, -64, -64, -64, -64, -64, -64, 64, 64, 64, 64, -64, -64, -64, -64, -64, -64, -64, -64, -64, -64, 64, -64, 64, -64, -64, -64, -64, -64, -64, 64, -64, -64, 64, 64, 64, 64, 64, -64, -64, -64, 64, 64, -64, -64, -64, -64, 64, -64, -64, 64, 64, -64, -64, -64, -64, -64, -64, 64, 64, 64, 64, 64, -64, 64, 64, -64, 64, -64, 64, -64, -64, -64, -64, -64, -64, 64, -64, -64, -64, -64, -64, -64, -64, 64, 64, 64, 64, -64, -64, 64, -64, 64, -64, 64, -64, -64, -64, -64, -64, 64, 64, 64, 64, 64, -64, 64, 64, -64, -64, -64, 64, 64, 64, 64, -64, -64, -64, 64, 64, 64, 64, 64, -64, -64, -64, -64, -64, -64, -64, -64, -64, -64, -64, 64, 64, -64, -64, 64, 64, 64, -64, 64, -64, 64, 64, 64, 64, 64, 64, 64, -64, -64, 64, -64, -64, 64, 64, 64, 64, -64, -64, -64, 64, -64, -64, -64, -64, -64, -64, 64, 64, 64, 64, 64, -64, -64, -64, 64, -64, 64, 64, -64, 64, -64, -64, 64, 64, 64, -64, -64, 64, -64, -64, -64, -64, -64, -64, -64, 64, -64, -64, -64, -64, 64, 64, -64, -64, -64, 64, -64, -64, -64, -64, -64, -64, -64, 64, -64, -64, 64, -64, -64, -64, -64, -64, -64, -64, -64, 64, -64, -64, -64, 64, -64, -64, -64, -64, 64, -64, -64, -64, -64, 64, 64, 64, -64, -64, -64, -64, -64, -64, -64, -64, -64, -64, -64, -64, 64, -64, -64, -64, -64, -64, -64, -64, -64, -64, -64, -64, 64, -64, 64, 64, -64, 64, 64, -64, -64, -64, -64, -64, -64, -64, -64, -64, -64, -64, -64, -64, 64, 64, -64, -64, -64, -64, -64, -64, -64, 64, 64, -64, -64, 64, 64, 64, -64, -64, -64, -64, -64, -64, -64, -64, -64, -64, -64, -64, -64, -64, -64, -64, -64, -64, -64, -64, -64, -64, 64, 64, -64, 64, 64, -64, -64, -64, -64, 64, -64, -64, 64, -64, -64, -64, -64, -64, -64, -64, -64, -64, -64, -64, -64, -64, -64, -64, 64, 64, 64, -64, -64, -64, -64, 64, 64, 64, 64, 64, 64, 64, -64, -64, -64, -64, -64, -64, -64, -64, -64, 64, 64, -64, 64, -64, -64, 64, 64, -64, -64, -64, 64, 64, 64, 64, 64, -64, 64, -64, -64, 64, -64, -64, -64, -64, 64, 64, -64, -64, -64, -64, -64, -64, -64, 64, 64, 64, 64, 64, 64, 64, 64, 64, 64, 64, 64, -64, -64, -64, -64, -64, -64, -64, 64, 64, 64, -64, -64, -64, 64, -64, -64, 64, -64, -64, 64, 64, 64, 64, 64, 64, 64, 64, -64, 64, -64, -64, -64, 64, 64, 64, 64, 64, -64, 64, 64, 64, -64, -64, -64, -64, 64, -64, -64, -64, -64, -64, -64, 64, -64, 64, 64, -64, -64, 64, -64, -64, -64, -64, -64, -64, -64, -64, -64, -64, 64, -64, -64, 64, 64, -64, 64, -64, 64, -64, -64, -64, -64, -64, 64, -64, -64, 64, -64, -64, 64, 64, -64, -64, -64, 64, 64, -64, 64, 64, -64, 64, -64, 64, -64, -64, -64, -64, 64, -64, -64, -64, -64, 64, 64, 64, 64, 64, 64, 64, 64, 64, 64, -64, 64, -64, 64, -64, -64, 64, -64, -64, -64, -64, -64, 64, -64, -64, -64, -64, 64, -64, -64, -64, -64, -64, 64, 64, -64, 64, 64, -64, -64, -64, 64, 64, -64, 64, 64, -64, -64, -64, -64, 64, -64, -64, -64, 64, -64, 64, 64, 64, 64, 64, 64, 64, -64, -64, -64, -64, -64, -64, 64, -64, -64, 64, -64, -64, -64, 64, -64, -64, -64, -64, 64, -64, -64, -64, -64, 64, 64, 64, 64, 64, 64, 64, -64, -64, -64, -64, 64, 64, 64, 64, -64, -64, -64, 64, -64, 64, 64, -64, -64, 64, -64, 64, 64, 64, 64, 64, 64, -64, 64, -64, -64, -64, -64, -64, 64, -64, 64, 64, -64, 64, 64, 64, 64, 64, -64, -64, -64, -64, 64, 64, -64, 64, 64, 64, 64, -64, -64, 64, -64, -64, -64, 64, 64, 64, 64, -64, -64, -64, -64, 64, -64, 64, 64, 64, -64, -64, 64, -64, 64, 64, -64, -64, -64, -64, -64, -64, 64, 64, 64, 64, 64, 64, 64, -64, -64, -64, -64, -64, 64, 64, 64, 64, -64, -64, 64, -64, 64, 64, 64, 64, -64, 64, 64, -64, 64, 64, -64, 64, 64, 64, -64, 64, 64, 64, -64, -64, 64, -64, -64, -64, -64, -64, -64, 64, 64, 64, -64, -64, 64, -64, 64, -64, 64, -64, -64, 64, 64, 64, -64, 64, -64, 64, -64, -64, -64, -64, -64, -64, -64, -64, -64, 64, 64, 64, 64, -64, -64, 64, 64, -64, -64, -64, -64, -64, 64, -64, -64, -64, -64, -64, 64, -64, -64, -64, -64, -64, -64, -64, -64, 64, 64, 64, -64, -64, 64, 64, -64, -64, -64, -64, -64, 64, 64, -64, -64, 64, -64, 64, -64, -64, -64, -64, -64, -64, -64, 64, -64, 64, 64, 64, 64, -64, 64, 64, -64, -64, -64, -64, -64, 64, 64, -64, -64, 64, 64, -64, -64, -64, -64, -64, -64, -64, -64, 64, -64, -64, 64, 64, 64, 64, 64, -64, -64, -64, -64, -64, -64, 64, 64, -64, 64, -64, -64, -64, -64, -64, -64, -64, -64, -64, -64, 64, 64, 64, 64, 64, 64, 64, 64, -64, -64, -64, -64, -64, -64, -64, 64, 64, 64, 64, 64, 64, 64, -64, -64, -64, -64, -64, -64, 64, 64, 64, 64, 64, 64, 64, 64, -64, -64, -64, -64, 64, 64, 64, -64, -64, -64, 64, 64, 64, 64, 64, -64, -64, -64, -64, 64, 64, 64, 64, 64, 64, 64, 64, -64, 64, -64, 64, -64, -64, 64, 64, 64, 64, 64, -64, 64, 64, 64, 64, -64, -64, -64, -64, 64, 64, 64, 64, 64, 64, 64, 64, -64, 64, -64, -64, 64, 64, 64, 64, -64, -64, -64, 64, 64, 64, 64, 64, -64, 64, -64, -64, -64, 64, -64, 64, 64, 64, 64, -64, -64, -64, -64, -64, 64, 64, 64, 64, 64, 64, -64, -64, 64, 64, 64, 64, 64, -64, -64, -64, -64, -64, 64, 64, 64, 64, -64, -64, -64, -64, -64, 64, 64, 64, 64, 64, 64, 64, 64, 64, 64, 64, 64, 64, -64, 64, -64, -64, 64, -64, -64, 64, 64, 64, -64, 64, 64, -64, -64, -64, 64, 64, 64, 64, -64, 64, 64, 64, 64, 64, 64, 64, 64, -64, 64, 64, 64, 64, -64, -64, -64, -64, -64, 64, -64, 64, 64, -64, -64, 64, 64, 64, -64, 64, -64, -64, 64, 64, 64, -64, -64, 64, -64, 64, 64, 64, 64, 64, -64, -64, 64, 64, -64, -64, 64, -64, 64, 64, 64, 64, 64, 64, 64, 64, 64, -64, 64, -64, -64, -64, -64, -64, 64, 64, 64, -64, -64, -64, -64, -64, -64, 64, -64, -64, 64, 64, -64, 64, -64, 64, 64, 64, 64, 64, 64, -64, -64, -64, -64, -64, -64, -64, -64, -64, -64, -64, 64, -64, -64, 64, -64, -64, 64, 64, -64, 64, 64, 64, 64, 64, -64, -64, -64, -64, -64, 64, -64, 64, 64, 64, 64, 64, -64, -64, -64, -64, -64, -64, -64, -64, -64, -64, -64, -64, -64, 64, -64, 64, 64, 64, -64, 64, 64, 64, 64, 64, 64, 64, 64, 64, -64, -64, 64, -64, -64, -64, -64, -64, 64, 64, -64, -64, 64, -64, 64, -64, -64, -64, -64, -64, -64, 64, -64, 64, 64, 64, 64, 64, -64, 64, -64, -64, 64, 64, -64, 64, 64, 64, -64, -64, -64, 64, 64, 64, -64, -64, -64, 64, 64, -64, 64, 64, 64, 64, 64, -64, -64, -64, -64, -64, -64, 64, -64, 64, 64, 64, 64, -64, 64, -64, 64, -64, -64, -64, 64, -64, 64, -64, -64, 64, -64, 64, 64, -64, -64, -64, -64, -64, -64, -64, -64, -64, -64, 64, -64, 64, -64, -64, -64, 64, -64, 64, -64, -64, 64, 64, 64, 64, 64, 64, 64, 64, 64, 64, -64, 64, 64, -64, -64, 64, 64, -64, -64, 64, -64, -64, 64, -64, -64, 64, 64, -64, 64, 64, 64, -64, 64, 64, 64, 64, -64, 64, 64, 64, 64, 64, 64, -64, -64, -64, -64, 64, -64, 64, 64, 64, -64, -64, 64, -64, 64, 64, 64, 64, -64, -64, 64, 64, 64, 64, 64, 64, 64, 64, 64, 64, -64, 64, 64, -64, 64, 64, -64, 64, -64, -64, -64, -64, 64, -64, 64, 64, -64, -64, -64, -64, -64, -64, -64, -64, 64, -64, -64, -64, 64, 64, 64, 64, 64, 64, -64, -64, 64, 64, -64, -64, 64, 64, 64, -64, -64, -64, -64, -64, 64, -64, -64, -64, -64, -64, -64, -64, 64, 64, 64, 64, -64, -64, -64, -64, 64, 64, 64, 64, -64, 64, 64, -64, -64, -64, -64, 64, -64, -64, -64, -64, -64, 64, 64, -64, -64, 64, -64, -64, -64, -64, 64, 64, 64, 64, -64, -64, 64, 64, 64, -64, 64, 64, 64, 64, -64, 64, 64, -64, 64, 64, 64, -64, 64, -64, -64, -64, 64, 64, 64, -64, 64, 64, 64, 64, 64, -64, -64, -64, -64, -64, 64, 64, 64, -64, 64, -64, -64, -64, -64, -64, -64, -64, 64, 64, 64, 64, 64, 64, 64, -64, -64, -64, -64, -64, -64, -64, -64, -64, -64, 64, 64, 64, 64, 64, 64, 64, -64, 64, -64, 64, 64, 64, -64, -64, -64, -64, 64, -64, -64, -64, -64, -64, -64, -64, -64, 64, 64, 64, 64, 64, 64, 64, -64, 64, -64, -64, -64, -64, 64, 64, 64, 64, -64, -64, 64, 64, 64, -64, -64, -64, -64, -64, -64, 64, 64, 64, 64, 64, 64, 64, 64, 64, -64, -64, 64, 64, 64, 64, -64, 64, -64, 64, 64, -64, -64, -64, -64, -64, -64, -64, -64, 64, 64, 64, 64, 64, 64, 64, -64, -64, -64, -64, 64, 64, 64, 64, -64, 64, -64, 64, -64, 64, -64, -64, 64, -64, -64, -64, -64, -64, -64, -64, -64, 64, 64, -64, -64, -64, 64, 64, -64, 64, 64, -64, -64, 64, -64, -64, 64, 64, -64, -64, 64, -64, -64, -64, -64, -64, 64, -64, -64, -64, -64, 64, 64, 64, 64, 64, 64, -64, 64, 64, 64, 64, 64, 64, 64, -64, 64, -64, -64, 64, -64, -64, 64, 64, 64, -64, 64, 64, -64, 64, -64, -64, 64, 64, -64, 64, 64, -64, 64, 64, 64, -64, -64, -64, 64, -64, -64, -64, 64, 64, 64, 64, -64, 64, 64, -64, 64, 64, 64, -64, -64, -64, -64, 64, 64, 64, 64, 64, -64, -64, -64, -64, 64, 64, -64, 64, 64, 64, 64, 64, 64, 64, 64, 64, -64, -64, -64, 64, -64, 64, -64, -64, 64, 64, 64, -64, 64, 64, 64, -64, -64, -64, -64, -64, -64, 64, 64, 64, 64, 64, 64, 64, 64, -64, -64, -64, -64, -64, -64, 64, 64, 64, -64, -64, -64, 64, 64, -64, -64, -64, 64, -64, -64, -64, 64, 64, 64, 64, 64, 64, 64, -64, -64, -64, -64, -64, -64, -64, 64, 64, -64, 64, 64, -64, 64, 64, -64, 64, 64, 64, -64, -64, 64, 64, 64, 64, 64, 64, 64, -64, -64, -64, -64, -64, -64, 64, -64, -64, 64, -64, -64, -64, 64, -64, 64, 64, 64, 64, -64, 64, -64, 64, 64, 64, 64, -64, -64, -64, -64, -64, -64, -64, -64, -64, 64, -64, 64, -64, 64, -64, -64, 64, 64, 64, 64, -64, 64, -64, -64, -64, 64, -64, -64, -64, -64, -64, -64, -64, -64, -64, -64, -64, 64, -64, -64, -64, -64, 64, 64, -64, -64, 64, 64, -64, -64, 64, 64, -64, -64, 64, -64, -64, -64, -64, -64, -64, -64, -64, -64, -64, -64, -64, -64, 64, 64, -64, 64, 64, 64, -64, -64, 64, -64, -64, -64, -64, 64, -64, -64, -64, -64, -64, -64, -64, -64, -64, -64, -64, 64, -64, -64, 64, 64, 64, -64, -64, 64, -64, -64, -64, -64, -64, -64, -64, 64, -64, -64, -64, -64, -64, -64, -64, -64, 64, -64, 64, -64, 64, 64, 64, -64, -64, 64, -64, -64, -64, -64, -64, -64, 64, 64, 64, 64, 64, 64, -64, -64, -64, -64, 64, 64, -64, 64, 64, 64, -64, 64, -64, 64, -64, -64, -64, -64, 64, 64, 64, 64, -64, 64, 64, -64, -64, -64, 64, -64, -64, -64, 64, 64, 64, -64, -64, 64, -64, 64, 64, -64, 64, -64, 64, -64, -64, -64, -64, 64, 64, -64, -64, -64, -64, -64, -64, -64, -64, -64, -64, 64, -64, 64, -64, 64, -64, -64, -64, -64, 64, 64, -64, 64, -64, -64, 64, -64, 64, 64, -64, 64, -64, 64, -64, 64, -64, -64, 64, -64, 64, 64, 64, -64, 64, -64, -64, 64, -64, 64, 64, -64, -64, 64, 64, 64, 64, -64, 64, 64, 64, -64, -64, -64, -64, 64, 64, -64, 64, 64, 64, 64, -64, -64, -64, -64, -64, 64, 64, 64, -64, -64, -64, -64, 64, 64, 64, -64, 64, 64, 64, 64, -64, -64, -64, 64, -64, 64, -64, 64, 64, -64, -64, -64, -64, 64, -64, 64, -64, -64, 64, -64, -64, -64, 64, 64, -64, -64, 64, -64, -64, 64, 64, -64, -64, -64, 64, -64, -64, -64, 64, -64, 64, 64, -64, -64, 64, -64, -64, -64, -64, -64, -64, -64, -64, 64, 64, -64, 64, -64, -64, -64, -64, -64, -64, -64, -64, -64, -64, -64, -64, -64, -64, -64, -64, 64, 64, 64, -64, 64, -64, 64, 64, 64, -64, -64, -64, -64, 64, -64, -64, -64, -64, -64, 64, -64, 64, -64, 64, 64, -64, 64, 64, -64, 64, -64, 64, -64, 64, -64, 64, -64, -64, -64, -64, -64, -64, -64, -64, -64, -64, -64, -64, -64, 64, -64, 64, -64, 64, 64, 64, -64, -64, -64, -64, 64, 64, -64, 64, -64, 64, -64, -64, 64, 64, -64, -64, -64, -64, -64, -64, -64, -64, -64, 64, 64, 64, -64, 64, -64, 64, 64, -64, -64, -64, 64, -64, 64, -64, 64, -64, -64, 64, -64, -64, 64, -64, -64, -64, -64, -64, -64, 64, 64, 64, 64, -64, -64, 64, -64, -64, 64, -64, 64, 64, -64, -64, -64, -64, 64, 64, 64, -64, 64, -64, -64, -64, -64, -64, -64, -64, -64, 64, -64, 64, 64, 64, -64, -64, -64, 64, -64, -64, -64, -64, -64, -64, 64, -64, -64, -64, 64, -64, -64, 64, -64, -64, -64, -64, -64, 64, -64, -64, -64, 64, -64, -64, 64, -64, -64, 64, -64, -64, 64, -64, -64, -64, -64, -64, -64, 64, -64, -64, -64, 64, -64, 64, -64, -64, 64, -64, -64, -64, -64, -64, -64, -64, -64, -64, 64, 64, 64, -64, 64, 64, 64, -64, 64, 64, 64, -64, -64, 64, 64, -64, -64, -64, -64, -64, -64, -64, -64, -64, 64, 64, -64, -64, 64, 64, 64, -64, 64, -64, -64, -64, -64, 64, -64, -64, -64, 64, 64, 64, -64, 64, -64, -64, -64, -64, -64, 64, -64, -64, -64, -64, -64, -64, -64, 64, 64, -64, 64, -64, -64, 64, -64, -64, 64, 64, -64, -64, -64, 64, 64, -64, -64, -64, -64, -64, 64, -64, 64, -64, -64, -64, -64, 64, -64, -64, -64, -64, 64, 64, -64, -64, 64, 64, -64, -64, 64, 64, 64, -64, -64, -64, 64, -64, 64, -64, 64, -64, -64, -64, 64, -64, -64, -64, -64, 64, 64, -64, 64, -64, 64, 64, 64, 64, 64, -64, 64, 64, -64, -64, -64, -64, 64, -64, -64, -64, -64, 64, -64, 64, -64, -64, -64, -64, -64, -64, 64, 64, 64, -64, -64, -64, 64, -64, 64, -64, -64, 64, -64, 64, 64, -64, 64, -64, -64, -64, -64, 64, 64, 64, 64, -64, -64, -64, -64, 64, -64, -64, -64, 64, -64, -64, 64, 64, -64, -64, -64, -64, 64, -64, 64, -64, -64, -64, -64, 64, 64, -64, 64, 64, -64, -64, 64, -64, -64, 64, -64, 64, -64, 64, 64, 64, -64, -64, -64, 64, -64, -64, -64, -64, -64, -64, -64, 64, -64, -64, 64, -64, 64, 64, 64, 64, 64, -64, 64, -64, 64, -64, 64, 64, -64, -64, -64, -64, -64, -64, 64, -64, -64, -64, 64, -64, 64, 64, -64, -64, -64, -64, 64, 64, 64, 64, -64, 64, 64, -64, 64, -64, -64, -64, 64, 64, -64, -64, -64, 64, 64, 64, 64, 64, 64, -64, -64, 64, 64, -64, -64, -64, 64, -64, 64, 64, 64, 64, 64, 64, -64, 64, -64, 64, 64, -64, -64, -64, 64, 64, 64, -64, -64, 64, -64, 64, -64, -64, 64, 64, -64, -64, 64, -64, 64, -64, 64, -64, -64, -64, -64, -64, 64, 64, 64, 64, 64, 64, -64, -64, 64, -64, 64, 64, -64, -64, 64, 64, -64, -64, 64, -64, -64, -64, 64, -64, -64, 64, -64, 64, 64, -64, 64, 64, -64, -64, -64, 64, -64, 64, -64, -64, 64, 64, -64, -64, 64, 64, -64, -64, 64, 64, 64, 64, 64, 64, -64, -64, -64, -64, -64, 64, 64, 64, 64, 64, -64, 64, 64, -64, -64, 64, 64, -64, 64, 64, 64, -64, -64, 64, 64, -64, 64, -64, 64, -64, 64, -64, -64, 64, 64, 64, 64, 64, 64, -64, 64, 64, -64, 64, 64, -64, -64, 64, -64, 64, 64, 64, -64, 64, 64, 64, 64, 64, 64, 64, -64, 64, -64, -64, 64, 64, 64, 64, 64, 64, 64, -64, 64, 64, 64, -64, 64, -64, 64, -64, 64, -64, 64, 64, -64, 64, 64, 64, 64, -64, 64, 64, 64, 64, 64, 64, 64, 64, 64, 64, 64, 64, -64, -64, 64, 64, -64, 64, -64, 64, 64, 64, 64, 64, 64, 64, 64, 64, -64, -64, 64, -64, -64, -64, -64, 64, -64, -64, 64, -64, -64, -64, 64, -64, 64, 64, -64, 64, 64, 64, 64, 64, 64, 64, -64, 64, 64, -64, 64, 64, -64, 64, 64, 64, 64, 64, 64, 64, 64, 64, -64, 64, -64, 64, -64, 64, 64, 64, 64, -64, 64, -64, 64, 64, 64, 64, 64, 64, 64, 64, -64, 64, 64, 64, 64, -64, -64, -64, -64, 64, 64, 64, 64, -64, 64, 64, -64, 64, -64, -64, -64, -64, 64, 64, -64, -64, 64, 64, 64, -64, -64, -64, -64, -64, -64, -64, 64, -64, -64, -64, -64, -64, 64, -64, -64, -64, -64, -64, 64, 64, 64, 64, 64, 64, -64, -64, -64, -64, -64, -64, -64, -64, -64, -64, 64, 64, -64, 64, -64, 64, 64, -64, -64, -64, 64, 64, 64, 64, 64, 64, 64, 64, -64, -64, -64, -64, -64, -64, -64, -64, 64, -64, 64, -64, -64, -64, 64, 64, 64, 64, 64, 64, 64, 64, 64, 64, 64, 64, 64, 64, 64, -64, -64, -64, -64, 64, -64, -64, -64, 64, 64, 64, 64, 64, -64, 64, -64, 64, -64, 64, -64, -64, 64, 64, 64, -64, -64, -64, 64, -64, -64, 64, -64, -64, -64, -64, -64, -64, -64, 64, 64, -64, 64, -64, -64, -64, 64, -64, -64, -64, 64, -64, -64, -64, -64, -64, -64, -64, -64, 64, 64, 64, 64, 64, -64, 64, 64, -64, 64, 64, -64, 64, 64, -64, -64, -64, -64, -64, -64, -64, -64, -64, -64, 64, -64, 64, 64, 64, 64, 64, -64, -64, -64, -64, 64, 64, -64, -64, -64, -64, -64, -64, -64, -64, -64, 64, 64, 64, -64, -64, -64, 64, -64, -64, 64, 64, 64, 64, -64, 64, 64, 64, 64, -64, 64, -64, 64, 64, -64, -64, -64, -64, 64, -64, 64, -64, -64, -64, -64, -64, -64, 64, -64, 64, 64, -64, 64, 64, -64, 64, -64, 64, -64, 64, 64, 64, -64, 64, 64, -64, -64, -64, -64, -64, -64, -64, -64, -64, -64, 64, 64, -64, -64, -64, 64, 64, 64, 64, 64, 64, -64, 64, 64, 64, 64, 64, -64, -64, 64, -64, -64, -64, -64, -64, -64, -64, -64, 64, 64, 64, 64, 64, 64, 64, 64, 64, 64, 64, 64, 64, 64, 64, 64, 64, 64, 64, 64, 64, 64, -64, -64, -64, -64, -64, 64, 64, 64, 64, 64, 64, 64, 64, 64, -64, 64, -64, 64, 64, 64, 64, 64, 64, 64, 64, 64, 64, 64, -64, -64, -64, 64, -64, 64, 64, -64, 64, 64, 64, 64, 64, -64, -64, -64, -64, 64, 64, 64, 64, 64, 64, 64, 64, 64, 64, 64, 64, -64, 64, 64, 64, 64, 64, 64, 64, 64, 64, 64, 64, 64, -64, 64, 64, 64, 64, -64, 64, -64, 64, 64, 64, 64, 64, 64, 64, 64, 64, 64, 64, 64, -64, 64, 64, 64, 64, 64, 64, 64, 64, -64, -64, 64, 64, -64, -64, 64, -64, 64, 64, 64, 64, 64, 64, 64, 64, 64, 64, -64, 64, 64, 64, 64, 64, 64, -64, 64, -64, 64, 64, 64, -64, -64, -64, -64, 64, -64, 64, -64, 64, 64, -64, -64, -64, 64, 64, -64, 64, 64, 64, 64, 64, 64, 64, 64, 64, -64, 64, -64, -64, -64, -64, -64, 64, -64, -64, 64, 64, -64, -64, -64, -64, -64, -64, 64, 64, 64, 64, 64, 64, 64, 64, -64, 64, 64, 64, -64, -64, -64, 64, -64, -64, -64, -64, -64, -64, -64, -64, -64, 64, -64, 64, 64, 64, 64, 64, 64, 64, 64, 64, -64, 64, 64, 64, 64, -64, -64, -64, -64, 64, -64, -64, -64, -64, -64, -64, -64, 64, 64, 64, 64, 64, 64, 64, 64, -64, 64, -64, -64, 64, -64, -64, 64, 64, 64, 64, 64, 64, 64, 64, 64, -64, -64, -64, -64, 64, 64, 64, 64, -64, 64, 64, 64, 64, 64, 64, -64, -64, -64, -64, 64, -64, -64, -64, -64, -64, 64, -64, -64, -64, -64, 64, -64, 64, -64, 64, -64, -64, 64, -64, -64, -64, -64, -64, -64, 64, 64, 64, -64, 64, -64, -64, -64, 64, 64, -64, 64, 64, -64, -64, -64, -64, -64, 64, -64, -64, -64, -64, -64, -64, -64, 64, 64, 64, -64, 64, 64, -64, -64, 64, -64, 64, 64, 64, 64, -64, 64, -64, -64, 64, 64, -64, -64, 64, 64, 64, 64, -64, -64, 64, 64, 64, 64, -64, 64, -64, -64, 64, 64, -64, 64, 64, 64, 64, 64, -64, -64, -64, 64, -64, 64, 64, 64, -64, 64, -64, -64, 64, 64, -64, 64, -64, -64, -64, -64, -64, 64, 64, 64, 64, 64, 64, 64, 64, 64, -64, -64, 64, 64, -64, 64, 64, -64, -64, 64, -64, -64, 64, -64, 64, 64, -64, 64, -64, 64, 64, 64, 64, 64, 64, 64, 64, 64, 64, 64, 64, 64, 64, 64, 64, 64, 64, 64, 64, -64, -64, -64, 64, 64, 64, -64, 64, 64, 64, 64, 64, 64, 64, 64, -64, 64, 64, 64, 64, 64, 64, 64, 64, 64, 64, -64, 64, -64, 64, 64, 64, -64, -64, 64, 64, 64, -64, 64, -64, 64, -64, -64, -64, -64, -64, -64, -64, 64, 64, 64, 64, -64, -64, -64, 64, 64, -64, -64, 64, -64, 64, 64, 64, 64, -64, -64, 64, -64, -64, -64, -64, -64, -64, -64, -64, -64, -64, -64, 64, -64, 64, 64, -64, -64, -64, 64, 64, 64, 64, 64, -64, -64, -64, -64, -64, -64, -64, -64, -64, 64, -64, 64, 64, -64, -64, 64, 64, -64, 64, 64, 64, -64, -64, 64, -64, 64, 64, 64, -64, -64, -64, -64, -64, -64, -64, 64, -64, 64, 64, 64, 64, 64, 64, 64, 64, -64, 64, 64, -64, 64, 64, 64, 64, -64, -64, 64, -64, -64, -64, -64, -64, -64, -64, -64, 64, 64, 64, -64, 64, 64, -64, 64, -64, -64, 64, 64, -64, -64, 64, 64, -64, 64, 64, 64, -64, -64, 64, -64, -64, -64, -64, 64, 64, 64, 64, 64, -64, -64, -64, -64, 64, -64, 64, 64, 64, -64, -64, 64, -64, 64, -64, -64, 64, -64, 64, -64, -64, -64, -64, -64, 64, 64, 64, 64, 64, 64, -64, 64, 64, -64, -64, 64, -64, 64, -64, -64, -64, 64, -64, -64, 64, -64, 64, 64, -64, -64, -64, 64, 64, 64, 64, 64, 64, -64, -64, -64, -64, -64, 64, 64, -64, 64, 64, -64, 64, -64, -64, -64, 64, 64, -64, -64, -64, 64, 64, 64, 64, 64, 64, 64, -64, -64, -64, -64, -64, 64, 64, -64, 64, 64, 64, 64, -64, -64, -64, -64, -64, 64, -64, -64, -64, -64, 64, 64, 64, -64, 64, -64, -64, -64, -64, -64, -64, 64, -64, -64, 64, -64, -64, -64, 64, -64, -64, -64, 64, 64, -64, -64, 64, 64, -64, -64, -64, 64, -64, 64, -64, 64, -64, -64, -64, 64, -64, -64, -64, -64, -64, -64, 64, 64, -64, -64, 64, 64, 64, -64, -64, -64, 64, -64, 64, -64, 64, 64, -64, -64, -64, 64, 64, -64, -64, -64, -64, -64, -64, -64, -64, 64, 64, -64, 64, 64, 64, -64, -64, -64, -64, -64, 64, 64, 64, 64, 64, 64, 64, 64, 64, -64, -64, -64, -64, 64, 64, -64, -64, 64, -64, -64, 64, 64, 64, -64, -64, -64, -64, -64, -64, -64, -64, 64, 64, 64, 64, 64, -64, 64, 64, 64, 64, 64, -64, -64, -64, -64, -64, 64, -64, 64, 64, 64, 64, 64, 64, 64, 64, -64, 64, 64, 64, -64, 64, 64, 64, 64, 64, 64, -64, 64, -64, 64, -64, -64, -64, 64, 64, 64, 64, 64, 64, 64, 64, 64, 64, 64, 64, 64, 64, 64, 64, 64, 64, -64, 64, 64, 64, 64, -64, 64, -64, -64, 64, 64, -64, 64, 64, 64, 64, 64, 64, 64, 64, 64, 64, 64, 64, 64, -64, 64, -64, -64, 64, -64, -64, -64, 64, -64, 64, 64, -64, -64, 64, 64, -64, 64, -64, -64, -64, -64, -64, -64, 64, 64, -64, 64, 64, -64, -64, -64, -64, -64, 64, -64, -64, 64, -64, -64, -64, 64, 64, 64, 64, -64, -64, -64, -64, -64, -64, 64, -64, -64, -64, 64, -64, 64, -64, -64, -64, 64, -64, -64, 64, 64, 64, -64, -64, -64, 64, -64, -64, -64, -64, -64, -64, -64, 64, -64, -64, -64, -64, -64, 64, 64, 64, 64, -64, 64, 64, -64, 64, 64, -64, -64, -64, 64, 64, 64, -64, 64, -64, -64, 64, -64, 64, 64, 64, 64, -64, -64, -64, -64, 64, 64, -64, -64, -64, -64, 64, 64, -64, 64, -64, 64, 64, -64, 64, 64, 64, -64, 64, 64, -64, 64, -64, -64, -64, 64, 64, -64, 64, -64, 64, -64, -64, 64, 64, 64, 64, 64, 64, 64, -64, 64, -64, -64, -64, 64, 64, 64, 64, -64, -64, -64, 64, 64, 64, -64, -64, 64, 64, 64, -64, -64, 64, 64, -64, -64, 64, -64, -64, -64, 64, -64, -64, -64, -64, 64, 64, 64, -64, 64, -64, -64, -64, 64, 64, -64, 64, 64, 64, -64, 64, 64, 64, 64, -64, 64, -64, 64, -64, 64, 64, 64, 64, 64, -64, 64, -64, 64, 64, 64, 64, 64, 64, 64, 64, -64, -64, -64, 64, 64, -64, -64, 64, 64, -64, -64, -64, -64, -64, -64, 64, 64, 64, -64, 64, 64, 64, 64, 64, 64, 64, -64, 64, -64, 64, 64, 64, -64, -64, 64, 64, 64, -64, -64, -64, 64, 64, 64, 64, -64, 64, 64, -64, 64, 64, 64, 64, 64, 64, -64, -64, -64, -64, 64, 64, 64, 64, -64, 64, 64, -64, -64, -64, -64, 64, -64, -64, -64, -64, -64, -64, 64, 64, 64, 64, 64, 64, 64, 64, -64, 64, 64, 64, -64, 64, -64, 64, 64, 64, -64, 64, 64, 64, 64, 64, -64, -64, -64, -64, -64, 64, 64, 64, 64, 64, -64, -64, -64, -64, 64, -64, 64, 64, 64, 64, 64, 64, 64, 64, 64, -64, 64, 64, 64, 64, -64, -64, 64, 64, 64, 64, 64, 64, -64, -64, -64, -64, 64, -64, 64, 64, 64, -64, 64, -64, 64, -64, 64, -64, -64, 64, 64, -64, -64, 64, -64, 64, -64, 64, 64, -64, -64, -64, -64, -64, -64, -64, -64, 64, -64, -64, -64, -64, -64, 64, 64, -64, -64, 64, -64, 64, 64, 64, -64, -64, -64, 64, 64, 64, -64, -64, -64, -64, 64, 64, -64, -64, -64, -64, -64, -64, -64, -64, -64, 64, -64, -64, -64, -64, -64, -64, -64, -64, 64, 64, 64, 64, 64, -64, -64, -64, 64, -64, -64, 64, 64, 64, -64, -64, -64, 64, 64, 64, 64, -64, -64, 64, -64, 64, -64, -64, 64, 64, 64, -64, 64, 64, 64, -64, -64, 64, 64, 64, -64, -64, -64, -64, 64, 64, -64, 64, -64, 64, -64, 64, -64, 64, 64, -64, -64, 64, 64, 64, 64, 64, 64, -64, 64, 64, 64, -64, -64, 64, 64, 64, 64, 64, 64, 64, 64, 64, 64, 64, 64, 64, 64, 64, 64, -64, 64, 64, 64, 64, 64, -64, -64, -64, -64, 64, 64, 64, 64, 64, 64, 64, 64, 64, 64, 64, 64, 64, 64, 64, -64, -64, 64, 64, 64, 64, 64, 64, 64, -64, -64, -64, 64, 64, 64, -64, -64, 64, 64, 64, 64, 64, 64, 64, 64, 64, -64, 64, 64, -64, -64, 64, 64, 64, 64, 64, -64, 64, 64, -64, -64, 64, 64, -64, 64, 64, -64, 64, 64, 64, 64, 64, 64, -64, 64, 64, -64, -64, -64, -64, 64, 64, 64, 64, -64, -64, 64, -64, 64, 64, -64, -64, 64, 64, 64, -64, 64, 64, 64, 64, -64, 64, -64, 64, -64, -64, 64, 64, 64, 64, 64, 64, -64, 64, -64, 64, -64, -64, -64, -64, 64, 64, -64, 64, 64, 64, 64, 64, 64, -64, 64, 64, -64, -64, 64, 64, 64, 64, -64, 64, -64, -64, 64, -64, -64, 64, -64, -64, 64, 64, 64, 64, 64, 64, 64, -64, 64, -64, 64, -64, -64, 64, 64, 64, 64, 64, -64, -64, -64, -64, -64, -64, -64, -64, 64, -64, 64, -64, 64, 64, 64, 64, 64, 64, -64, 64, 64, 64, -64, -64, -64, 64, 64, -64, 64, -64, 64, -64, -64, 64, -64, 64, 64, -64, -64, 64, 64, 64, 64, 64, 64, 64, 64, 64, 64, -64, 64, 64, -64, -64, 64, 64, -64, -64, -64, -64, 64, -64, 64, 64, -64, 64, 64, -64, 64, 64, 64, 64, 64, 64, -64, 64, -64, 64, 64, 64, 64, -64, -64, -64, -64, -64, -64, -64, -64, 64, 64, -64, 64, 64, -64, 64, -64, -64, 64, 64, 64, 64, 64, -64, 64, 64, 64, 64, -64, 64, -64, -64, 64, -64, -64, -64, 64, -64, 64, -64, -64, 64, -64, 64, -64, 64, 64, 64, 64, 64, -64, 64, 64, -64, 64, -64, -64, 64, 64, 64, -64, 64, -64, -64, -64, -64, -64, 64, -64, -64, 64, 64, -64, 64, 64, 64, 64, 64, -64, -64, 64, -64, -64, -64, -64, 64, -64, 64, -64, -64, 64, 64, 64, 64, 64, 64, 64, -64, 64, 64, 64, 64, -64, 64, -64, 64, 64, -64, -64, -64, -64, -64, -64, -64, -64, -64, 64, -64, -64, 64, 64, -64, 64, -64, 64, -64, -64, 64, -64, -64, -64, 64, -64, -64, 64, -64, -64, -64, -64, 64, -64, 64, 64, 64, -64, 64, 64, -64, -64, 64, 64, 64, -64, -64, -64, -64, 64, -64, -64, -64, 64, -64, 64, -64, -64, -64, -64, -64, -64, -64, -64, 64, 64, -64, 64, -64, 64, 64, 64, -64, 64, -64, 64, 64, -64, -64, -64, -64, 64, 64, -64, -64, -64, -64, 64, 64, -64, -64, 64, -64, -64, 64, 64, 64, -64, -64, -64, 64, -64, 64, -64, 64, 64, -64, -64, 64, -64, -64, 64, -64, -64, -64, -64, -64, -64, -64, -64, -64, -64, 64, -64, -64, 64, -64, 64, 64, 64, -64, -64, -64, -64, 64, 64, 64, 64, -64, 64, -64, -64, -64, 64, -64, -64, -64, -64, -64, -64, 64, 64, -64, -64, -64, -64, -64, 64, -64, 64, -64, 64, 64, 64, 64, 64, -64, -64, -64, -64, -64, -64, -64, -64, -64, 64, -64, -64, -64, -64, -64, -64, 64, 64, 64, -64, 64, -64, -64, -64, -64, 64, 64, 64, 64, -64, -64, -64, -64, -64, -64, -64, -64, 64, -64, -64, -64, -64, -64, 64, -64, 64, -64, -64, 64, -64, -64, -64, 64, 64, 64, 64, -64, 64, 64, -64, -64, -64, 64, -64, -64, 64, -64, -64, -64, -64, -64, -64, -64, -64, 64, -64, -64, -64, -64, 64, 64, 64, -64, -64, -64, -64, 64, 64, 64, 64, 64, -64, -64, -64, -64, -64, -64, -64, 64, 64, -64, -64, -64, 64, -64, 64, 64, 64, 64, -64, -64, -64, -64, -64, 64, 64, 64, 64, -64, -64, -64, -64, -64, -64, 64, -64, -64, 64, -64, 64, -64, 64, -64, -64, -64, 64, 64, -64, -64, 64, 64, 64, 64, 64, 64, 64, -64, -64, 64, -64, -64, -64, -64, 64, -64, 64, -64, -64, -64, -64, -64, -64, -64, 64, -64, -64, -64, 64, 64, -64, -64, -64, -64, -64, -64, -64, 64, -64, -64, -64, 64, 64, 64, 64, -64, 64, 64, -64, -64, 64, 64, 64, 64, 64, -64, -64, 64, 64, -64, -64, -64, -64, -64, -64, -64, -64, 64, -64, -64, 64, 64, 64, 64, -64, -64, 64, -64, 64, 64, 64, 64, -64, -64, 64, -64, -64, -64, -64, -64, -64, -64, 64, 64, -64, 64, 64, 64, 64, 64, -64, -64, 64, -64, 64, 64, -64, -64, 64, -64, 64, 64, 64, 64, -64, -64, 64, -64, 64, 64, -64, -64, -64, -64, 64, 64, -64, 64, -64, -64, 64, -64, -64, 64, 64, 64, 64, -64, 64, 64, 64, 64, 64, 64, -64, -64, 64, 64, 64, -64, -64, -64, -64, -64, -64, -64, 64, -64, -64, 64, 64, 64, 64, -64, -64, -64, 64, 64, 64, 64, 64, 64, -64, -64, -64, 64, 64, 64, 64, 64, -64, -64, -64, -64, -64, 64, -64, -64, 64, 64, 64, -64, 64, 64, 64, 64, 64, 64, 64, 64, 64, 64, 64, -64, -64, 64, 64, -64, -64, -64, 64, 64, 64, -64, 64, -64, 64, 64, 64, -64, 64, -64, 64, 64, 64, 64, 64, 64, 64, 64, 64, 64, -64, -64, -64, 64, 64, 64, 64, 64, -64, -64, -64, -64, -64, -64, 64, -64, -64, 64, -64, -64, 64, 64, 64, 64, 64, -64, 64, -64, -64, 64, 64, 64, 64, 64, 64, 64, 64, 64, 64, 64, -64, 64, -64, -64, -64, -64, -64, -64, -64, -64, 64, 64, 64, 64, 64, -64, -64, 64, 64, 64, 64, 64, 64, -64, 64, 64, -64, -64, 64, 64, -64, -64, -64, -64, -64, -64, -64, -64, 64, 64, 64, -64, -64, -64, -64, -64, -64, 64, 64, 64, 64, -64, -64, 64, 64, 64, 64, -64, 64, -64, -64, -64, -64, -64, -64, -64, 64, -64, -64, -64, -64, -64, -64, -64, -64, 64, 64, 64, -64, 64, -64, -64, -64, 64, -64, 64, -64, -64, -64, -64, -64, -64, 64, -64, 64, -64, -64, -64, -64, -64, -64, 64, 64, -64, 64, 64, 64, 64, -64, 64, -64, -64, 64, 64, 64, 64, -64, -64, -64, -64, -64, -64, -64, -64, -64, -64, -64, -64, -64, -64, 64, 64, 64, 64, 64, 64, 64, -64, 64, -64, -64, -64, 64, 64, 64, 64, -64, -64, -64, 64, 64, -64, 64, -64, 64, -64, -64, 64, 64, 64, 64, 64, 64, -64, -64, 64, -64, -64, 64, -64, 64, 64, 64, 64, -64, -64, 64, 64, 64, 64, 64, -64, 64, -64, 64, 64, 64, 64, 64, -64, -64, -64, -64, -64, 64, -64, 64, -64, 64, 64, 64, -64, -64, 64, 64, 64, 64, 64, 64, 64, 64, -64, 64, 64, 64, 64, 64, 64, -64, 64, -64, -64, -64, -64, -64, 64, -64, -64, -64, -64, -64, 64, -64, 64, 64, 64, 64, -64, -64, -64, -64, -64, -64, -64, -64, 64, 64, 64, -64, -64, 64, -64, 64, 64, -64, -64, -64, 64, -64, -64, 64, -64, 64, -64, 64, -64, -64, -64, 64, 64, -64, -64, 64, -64, -64, -64, -64, 64, 64, 64, -64, 64, 64, -64, 64, -64, 64, 64, 64, 64, 64, -64, 64, -64, 64, -64, 64, 64, -64, -64, -64, -64, -64, 64, -64, -64, 64, 64, 64, 64, 64, 64, 64, 64, 64, 64, -64, -64, -64, 64, 64, 64, 64, 64, 64, -64, 64, -64, -64, 64, -64, 64, -64, 64, 64, -64, -64, 64, 64, -64, 64, 64, -64, -64, -64, -64, -64, -64, -64, -64, 64, 64, 64, 64, 64, 64, -64, 64, -64, -64, 64, -64, -64, 64, 64, 64, 64, 64, -64, -64, -64, -64, -64, -64, -64, -64, -64, -64, 64, 64, 64, 64, -64, 64, -64, 64, -64, 64, 64, 64, 64, 64, -64, 64, -64, -64, -64, -64, -64, -64, -64, -64, -64, 64, -64, -64, 64, 64, 64, 64, 64, 64, 64, -64, -64, -64, 64, -64, -64, -64, -64, -64, -64, -64, -64, -64, -64, -64, 64, 64, 64, 64, 64, 64, 64, 64, 64, 64, 64, 64, 64, -64, -64, -64, -64, -64, -64, -64, -64, 64, -64, -64, -64, -64, -64, -64, 64, 64, 64, 64, 64, 64, 64, 64, 64, 64, 64, 64, -64, -64, -64, -64, -64, -64, 64, -64, 64, 64, 64, 64, -64, -64, -64, 64, 64, 64, 64, 64, -64, 64, 64, 64, 64, 64, 64, -64, -64, -64, -64, -64, -64, 64, 64, 64, -64, 64, 64, -64, 64, 64, -64, -64, 64, -64, -64, -64, -64, -64, 64, -64, -64, 64, -64, -64, -64, 64, -64, 64, -64, -64, 64, -64, -64, 64, 64, 64, 64, 64, 64, 64, 64, 64, -64, -64, -64, -64, -64, 64, 64, 64, 64, 64, 64, 64, 64, -64, -64, 64, -64, 64, -64, 64, 64, 64, 64, 64, -64, -64, 64, -64, -64, 64, 64, 64, 64, 64, 64, 64, 64, 64, 64, 64, 64, -64, -64, -64, 64, 64, -64, 64, 64, 64, 64, 64, 64, 64, -64, -64, -64, 64, 64, 64, -64, 64, 64, 64, 64, 64, 64, 64, 64, -64, 64, 64, 64, 64, 64, -64, 64, 64, 64, 64, 64, -64, 64, -64, -64, 64, 64, 64, 64, 64, 64, 64, 64, 64, 64, 64, 64, 64, -64, 64, -64, 64, -64, 64, 64, 64, 64, 64, 64, 64, -64, 64, 64, -64, 64, -64, 64, -64, 64, 64, 64, 64, 64, -64, 64, 64, 64, -64, -64, 64, -64, -64, 64, 64, 64, 64, -64, -64, 64, 64, 64, 64, 64, 64, 64, 64, -64, 64, 64, 64, -64, -64, 64, -64, 64, -64, 64, -64, -64, -64, -64, 64, 64, 64, 64, 64, 64, 64, 64, 64, 64, 64, 64, 64, 64, -64, 64, 64, -64, -64, -64, -64, -64, -64, -64, -64, 64, 64, 64, -64, 64, 64, 64, 64, 64, -64, -64, -64, 64, 64, 64, 64, 64, 64, -64, 64, 64, -64, -64, -64, -64, -64, -64, -64, -64, 64, 64, 64, 64, 64, -64, 64, 64, -64, -64, -64, 64, 64, 64, 64, 64, -64, -64, -64, -64, -64, -64, -64, -64, 64, -64, -64, 64, -64, 64, 64, 64, 64, 64, -64, -64, -64, -64, -64, -64, 64, 64, -64, 64, -64, 64, -64, -64, -64, -64, -64, 64, -64, -64, 64, 64, -64, -64, 64, 64, 64, 64, 64, 64, 64, -64, 64, 64, 64, -64, 64, 64, -64, -64, -64, -64, -64, -64, -64, -64, -64, -64, -64, 64, 64, -64, -64, 64, 64, 64, 64, -64, 64, -64, -64, 64, 64, -64, -64, -64, -64, -64, -64, -64, -64, 64, -64, 64, -64, 64, -64, -64, -64, 64, -64, 64, -64, -64, -64, 64, 64, -64, -64, 64, -64, 64, -64, 64, -64, -64, -64, -64, 64, -64, -64, 64, -64, 64, -64, 64, -64, 64, 64, 64, 64, 64, 64, 64, 64, 64, 64, 64, 64, 64, 64, 64, -64, -64, -64, -64, 64, 64, 64, -64, -64, -64, 64, 64, 64, 64, -64, -64, -64, 64, 64, 64, 64, 64, 64, 64, 64, 64, 64, 64, 64, 64, -64, -64, -64, -64, -64, -64, -64, 64, -64, -64, -64, 64, 64, -64, 64, -64, -64, 64, 64, -64, -64, 64, -64, 64, 64, -64, 64, 64, 64, 64, -64, -64, 64, -64, 64, -64, 64, -64, 64, 64, -64, -64, 64, 64, 64, -64, 64, 64, 64, -64, 64, 64, 64, 64, -64, 64, 64, 64, -64, 64, -64, 64, -64, -64, -64, -64, -64, 64, -64, -64, 64, 64, -64, 64, -64, 64, 64, -64, -64, 64, -64, -64, 64, 64, 64, 64, -64, -64, -64, -64, -64, 64, -64, -64, -64, -64, -64, -64, 64, -64, -64, -64, 64, -64, 64, 64, 64, -64, -64, 64, -64, 64, 64, 64, -64, -64, -64, -64, 64, 64, 64, 64, 64, -64, -64, -64, 64, -64, -64, -64, -64, -64, -64, 64, -64, 64, 64, -64, -64, -64, -64, -64, 64, 64, -64, 64, 64, -64, -64, -64, 64, -64, -64, -64, 64, 64, -64, 64, 64, 64, 64, 64, -64, -64, 64, 64, -64, -64, 64, -64, 64, 64, 64, -64, -64, -64, -64, -64, 64, -64, 64, 64, 64, 64, -64, -64, -64, 64, 64, -64, -64, -64, 64, -64, -64, 64, 64, 64, 64, -64, -64, -64, 64, -64, 64, 64, -64, -64, 64, -64, 64, -64, -64, -64, -64, -64, 64, -64, -64, -64, -64, -64, -64, -64, -64, 64, 64, 64, -64, 64, 64, -64, -64, -64, -64, 64, -64, -64, -64, -64, -64, -64, -64, -64, -64, -64, -64, -64, -64, -64, -64, -64, 64, 64, -64, 64, 64, 64, -64, -64, 64, -64, 64, -64, -64, -64, 64, -64, -64, -64, -64, -64, -64, -64, -64, -64, -64, -64, -64, 64, -64, 64, -64, 64, 64, 64, 64, -64, 64, -64, -64, -64, -64, -64, -64, -64, -64, -64, -64, -64, 64, 64, 64, 64, -64, -64, -64, -64, -64, -64, -64, -64, -64, 64, 64, -64, -64, -64, -64, 64, -64, -64, -64, -64, -64, 64, 64, 64, -64, 64, 64, 64, -64, -64, -64, -64, -64, -64, -64, -64, 64, -64, -64, 64, 64, 64, 64, -64, 64, -64, -64, -64, 64, 64, 64, 64, -64, 64, 64, 64, 64, 64, 64, -64, -64, -64, -64, -64, -64, -64, -64, 64, -64, -64, -64, 64, -64, 64, -64, -64, -64, 64, -64, -64, -64, -64, -64, -64, -64, -64, -64, -64, -64, -64, -64, 64, 64, -64, 64, 64, -64, -64, 64, -64, -64, -64, 64, -64, -64, -64, -64, -64, -64, -64, -64, -64, -64, -64, -64, -64, -64, 64, 64, 64, 64, -64, -64, -64, 64, -64, 64, -64, -64, -64, -64, -64, -64, -64, -64, -64, -64, -64, -64, -64, -64, -64, -64, -64, -64, -64, -64, 64, 64, -64, -64, -64, 64, 64, 64, -64, 64, 64, -64, -64, 64, -64, -64, -64, -64, -64, -64, -64, -64, -64, -64, -64, -64, 64, 64, 64, 64, 64, -64, 64, 64, 64, 64, -64, -64, -64, -64, -64, 64, 64, -64, 64, -64, -64, -64, -64, -64, -64, -64, 64, 64, 64, 64, 64, 64, 64, -64, -64, 64, -64, 64, -64, -64, -64, -64, -64, -64, -64, 64, 64, 64, -64, 64, -64, -64, -64, -64, -64, 64, 64, 64, 64, 64, 64, 64, 64, 64, -64, 64, -64, 64, -64, -64, -64, -64, 64, 64, 64, 64, 64, -64, -64, -64, -64, -64, -64, -64, 64, 64, 64, 64, 64, -64, -64, 64, -64, -64, 64, 64, 64, 64, 64, 64, -64, -64, 64, 64, -64, -64, 64, -64, -64, -64, -64, -64, 64, -64, 64, 64, -64, -64, 64, 64, -64, -64, 64, 64, 64, 64, 64, -64, -64, -64, 64, 64, 64, -64, 64, -64, -64, -64, -64, -64, 64, -64, -64, 64, 64, 64, 64, -64, -64, 64, -64, -64, 64, -64, -64, -64, -64, -64, -64, 64, 64, 64, -64, -64, -64, -64, -64, -64, -64, -64, 64, -64, -64, -64, 64, -64, -64, 64, -64, -64, 64, -64, -64, -64, -64, -64, 64, 64, 64, -64, -64, -64, -64, -64, -64, -64, -64, -64, 64, 64, -64, 64, -64, -64, -64, -64, -64, -64, -64, -64, -64, -64, -64, -64, 64, 64, -64, -64, -64, -64, -64, -64, -64, -64, -64, -64, 64, 64, 64, -64, 64, -64, 64, 64, 64, -64, 64, -64, -64, -64, -64, -64, 64, -64, 64, -64, -64, -64, -64, 64, -64, -64, -64, -64, -64, 64, 64, -64, 64, -64, 64, -64, -64, 64, 64, 64, 64, -64, -64, -64, 64, -64, -64, -64, -64, -64, -64, -64, -64, 64, -64, -64, -64, -64, -64, 64, -64, 64, 64, -64, 64, 64, 64, 64, -64, -64, -64, -64, 64, 64, 64, 64, -64, -64, 64, 64, 64, 64, -64, -64, -64, 64, -64, -64, 64, -64, 64, 64, 64, -64, -64, -64, -64, -64, -64, -64, 64, 64, 64, 64, -64, 64, 64, 64, -64, -64, 64, -64, 64, 64, 64, -64, 64, -64, -64, -64, -64, 64, -64, -64, -64, -64, 64, -64, -64, 64, 64, -64, -64, -64, 64, 64, -64, -64, 64, -64, 64, 64, 64, 64, 64, 64, 64, 64, 64, -64, -64, 64, -64, -64, -64, 64, 64, 64, -64, 64, 64, 64, 64, 64, -64, -64, -64, -64, -64, 64, -64, 64, -64, 64, -64, -64, 64, -64, 64, -64, 64, 64, 64, 64, -64, 64, -64, 64, 64, -64, 64, 64, -64, -64, 64, 64, 64, -64, -64, 64, 64, 64, 64, 64, 64, 64, 64, 64, -64, 64, -64, -64, 64, 64, -64, 64, 64, 64, -64, -64, -64, -64, -64, 64, -64, 64, 64, -64, -64, 64, -64, -64, 64, -64, -64, 64, 64, 64, 64, 64, -64, 64, 64, 64, -64, 64, 64, 64, 64, 64, -64, 64, 64, 64, 64, 64, 64, -64, -64, -64, 64, 64, 64, -64, -64, -64, -64, -64, -64, -64, -64, 64, 64, 64, 64, 64, -64, 64, -64, 64, 64, -64, 64, 64, 64, 64, -64, 64, 64, -64, -64, -64, -64, -64, -64, -64, -64, -64, 64, 64, 64, 64, 64, 64, 64, -64, -64, -64, 64, 64, 64, 64, 64, 64, 64, 64, -64, 64, 64, 64, -64, -64, -64, -64, 64, -64, 64, -64, -64, -64, -64, -64, 64, -64, -64, -64, -64, -64, 64, 64, -64, -64, 64, 64, -64, 64, 64, -64, -64, -64, -64, -64, -64, 64, 64, -64, -64, -64, -64, 64, -64, -64, -64, -64, -64, -64, -64, 64, 64, 64, 64, 64, -64, -64, -64, -64, -64, 64, 64, -64, 64, 64, 64, -64, -64, -64, -64, -64, -64, 64, 64, -64, -64, -64, -64, 64, 64, 64, 64, -64, -64, -64, 64, 64, 64, 64, 64, 64, -64, 64, 64, -64, -64, -64, -64, -64, 64, -64, -64, -64, -64, -64, 64, 64, -64, -64, -64, -64, 64, 64, -64, 64, 64, 64, 64, 64, 64, -64, -64, -64, -64, -64, -64, -64, 64, -64, -64, -64, -64, -64, -64, 64, 64, -64, -64, -64, -64, 64, 64, 64, 64, 64, 64, 64, 64, -64, -64, 64, -64, -64, 64, 64, -64, -64, -64, -64, -64, -64, -64, -64, 64, 64, 64, -64, 64, -64, 64, 64, -64, -64, 64, 64, -64, -64, -64, -64, -64, 64, 64, 64, -64, -64, -64, -64, -64, -64, -64, -64, 64, 64, -64, 64, -64, -64, 64, 64, -64, -64, -64, -64, -64, -64, -64, -64, -64, 64, -64, -64, 64, 64, 64, 64, -64, -64, -64, -64, -64, -64, 64, -64, 64, -64, -64, -64, -64, -64, -64, -64, -64, -64, -64, 64, -64, -64, -64, -64, 64, 64, -64, -64, 64, -64, 64, 64, -64, 64, 64, -64, -64, -64, -64, -64, -64, -64, -64, 64, -64, -64, -64, -64, -64, -64, -64, -64, -64, -64, -64, -64, -64, 64, 64, 64, 64, -64, -64, -64, -64, -64, -64, -64, 64, -64, -64, 64, -64, 64, 64, 64, 64, 64, -64, -64, -64, -64, -64, -64, -64, 64, -64, -64, -64, -64, -64, -64, -64, -64, -64, -64, 64, 64, 64, 64, 64, 64, 64, 64, 64, -64, -64, -64, -64, -64, -64, -64, -64, 64, 64, -64, 64, -64, -64, -64, -64, -64, -64, -64, 64, 64, 64, 64, 64, 64, 64, 64, 64, 64, -64, -64, -64, -64, -64, -64, -64, 64, 64, 64, -64, 64, 64, -64, -64, -64, -64, -64, -64, 64, 64, 64, 64, 64, 64, -64, 64, -64, -64, 64, -64, -64, -64, -64, 64, 64, 64, 64, 64, 64, -64, -64, -64, -64, -64, -64, -64, -64, 64, 64, -64, 64, -64, 64, 64, -64, -64, -64, -64, -64, -64, 64, 64, 64, 64, 64, 64, -64, -64, -64, -64, -64, -64, -64, 64, -64, -64, -64, -64, -64, 64, 64, -64, -64, -64, -64, 64, -64, -64, -64, 64, 64, 64, 64, -64, -64, 64, -64, -64, -64, -64, -64, -64, -64, -64, -64, -64, -64, -64, -64, -64, -64, -64, -64, 64, -64, -64, -64, -64, 64, -64, -64, 64, 64, -64, -64, -64, -64, -64, -64, -64, -64, -64, -64, -64, -64, 64, -64, -64, -64, 64, -64, 64, -64, 64, -64, -64, 64, 64, 64, 64, 64, -64, -64, -64, -64, -64, -64, -64, -64, -64, -64, -64, 64, -64, -64, 64, -64, -64, -64, 64, 64, -64, -64, -64, -64, 64, -64, 64, 64, -64, 64, -64, -64, 64, 64, -64, -64, 64, 64, -64, -64, -64, 64, -64, 64, 64, 64, 64, 64, 64, 64, 64, 64, 64, -64, -64, 64, 64, 64, -64, 64, 64, 64, -64, 64, 64, 64, 64, 64, 64, 64, -64, -64, 64, 64, 64, 64, 64, -64, -64, -64, 64, -64, 64, 64, 64, 64, -64, 64, 64, -64, 64, 64, 64, 64, -64, 64, -64, 64, -64, -64, -64, -64, 64, -64, 64, 64, 64, 64, 64, 64, 64, -64, 64, 64, 64, -64, -64, 64, 64, 64, -64, -64, -64, -64, 64, 64, 64, 64, 64, 64, -64, 64, -64, 64, -64, 64, 64, -64, 64, 64, -64, 64, -64, 64, -64, -64, 64, -64, -64, -64, 64, 64, 64, -64, -64, 64, 64, -64, 64, 64, -64, -64, 64, -64, 64, 64, -64, -64, -64, -64, 64, 64, 64, 64, 64, -64, 64, 64, 64, 64, -64, -64, -64, 64, -64, 64, 64, 64, -64, -64, -64, 64, 64, 64, -64, -64, -64, 64, -64, -64, 64, 64, 64, 64, 64, -64, 64, 64, 64, 64, -64, 64, 64, 64, 64, 64, -64, 64, -64, 64, 64, -64, 64, 64, 64, 64, -64, 64, 64, 64, -64, 64, 64, 64, -64, 64, 64, 64, -64, 64, 64, 64, 64, 64, 64, -64, 64, 64, 64, 64, 64, 64, 64, 64, -64, 64, 64, 64, 64, -64, -64, -64, -64, -64, -64, 64, 64, -64, -64, 64, -64, 64, 64, 64, -64, -64, -64, -64, 64, 64, 64, 64, 64, 64, 64, 64, 64, 64, -64, -64, -64, 64, -64, -64, -64, -64, -64, 64, 64, 64, 64, -64, 64, -64, 64, 64, 64, 64, -64, 64, -64, 64, 64, 64, 64, 64, -64, -64, -64, 64, 64, 64, -64, -64, -64, 64, -64, 64, 64, 64, 64, 64, -64, 64, 64, -64, -64, 64, -64, 64, 64, 64, -64, -64, -64, -64, -64, 64, 64, -64, -64, -64, -64, -64, -64, -64, -64, 64, 64, 64, -64, 64, -64, 64, 64, 64, 64, 64, 64, 64, 64, -64, -64, -64, -64, 64, 64, -64, -64, -64, -64, -64, -64, -64, -64, 64, 64, 64, -64, -64, 64, -64, 64, 64, 64, -64, -64, -64, -64, -64, 64, 64, -64, 64, -64, -64, -64, -64, -64, -64, -64, -64, -64, -64, -64, -64, 64, 64, 64, 64, -64, 64, 64, 64, -64, -64, -64, 64, 64, 64, 64, -64, -64, -64, 64, -64, -64, -64, -64, -64, 64, -64, -64, 64, -64, 64, -64, 64, -64, 64, 64, 64, -64, 64, 64, 64, 64, -64, 64, -64, -64, -64, 64, 64, -64, -64, -64, -64, -64, 64, -64, -64, -64, -64, -64, 64, -64, -64, 64, 64, 64, 64, 64, 64, 64, 64, -64, -64, -64, 64, 64, 64, 64, -64, -64, -64, 64, 64, -64, 64, -64, -64, -64, -64, -64, -64, 64, 64, 64, 64, 64, 64, -64, -64, -64, -64, 64, -64, 64, 64, -64, 64, 64, 64, 64, 64, -64, 64, -64, -64, -64, 64, 64, -64, 64, 64, 64, 64, 64, -64, -64, -64, -64, -64, -64, -64, -64, -64, 64, 64, 64, 64, 64, 64, 64, 64, -64, -64, 64, -64, -64, 64, 64, -64, 64, 64, 64, -64, -64, -64, -64, -64, -64, -64, -64, -64, 64, 64, 64, 64, 64, 64, -64, -64, -64, 64, -64, 64, 64, -64, -64, 64, 64, 64, 64, 64, 64, -64, 64, -64, -64, -64, -64, 64, -64, 64, 64, 64, -64, -64, -64, -64, -64, -64, -64, -64, 64, -64, 64, -64, 64, 64, 64, 64, 64, 64, 64, -64, -64, -64, -64, 64, -64, 64, -64, 64, -64, 64, -64, -64, -64, -64, -64, 64, -64, -64, -64, 64, 64, -64, 64, -64, -64, 64, 64, -64, -64, -64, 64, -64, 64, -64, -64, 64, 64, -64, -64, -64, -64, -64, 64, -64, 64, 64, -64, -64, -64, -64, 64, -64, -64, 64, -64, -64, -64, 64, 64, 64, 64, 64, 64, 64, 64, -64, 64, -64, 64, -64, -64, 64, -64, 64, -64, -64, -64, 64, -64, -64, -64, -64, -64, -64, -64, -64, 64, 64, 64, 64, -64, -64, -64, -64, -64, -64, -64, 64, -64, 64, -64, -64, -64, -64, -64, -64, -64, -64, -64, -64, -64, -64, 64, 64, 64, 64, 64, 64, -64, -64, -64, -64, -64, 64, -64, 64, -64, 64, -64, -64, -64, -64, -64, -64, -64, -64, -64, -64, -64, 64, -64, 64, 64, 64, -64, 64, -64, -64, -64, -64, -64, -64, -64, -64, 64, 64, 64, 64, 64, -64, -64, -64, -64, -64, -64, -64, 64, 64, -64, -64, 64, -64, -64, -64, -64, 64, -64, 64, 64, 64, -64, 64, 64, 64, -64, -64, -64, -64, 64, -64, 64, -64, 64, 64, 64, 64, 64, 64, 64, 64, 64, -64, 64, -64, -64, 64, 64, 64, 64, 64, 64, 64, -64, -64, 64, 64, 64, 64, 64, -64, -64, 64, 64, 64, 64, 64, 64, 64, 64, 64, 64, 64, 64, 64, -64, -64, -64, 64, 64, 64, 64, -64, 64, -64, -64, -64, 64, -64, -64, -64, 64, 64, 64, 64, 64, 64, 64, 64, 64, 64, -64, 64, -64, 64, -64, -64, -64, -64, 64, -64, 64, -64, -64, 64, -64, -64, -64, 64, 64, -64, -64, -64, 64, 64, -64, 64, -64, 64, -64, -64, 64, -64, 64, -64, 64, 64, -64, 64, -64, 64, -64, 64, 64, 64, -64, -64, -64, -64, -64, 64, -64, -64, 64, 64, 64, 64, -64, -64, -64, 64, -64, -64, 64, -64, -64, 64, -64, 64, -64, -64, -64, 64, -64, 64, 64, 64, 64, 64, -64, -64, 64, 64, -64, 64, -64, -64, 64, -64, -64, -64, 64, -64, -64, 64, -64, 64, -64, 64, -64, 64, 64, 64, 64, 64, 64, 64, -64, -64, 64, 64, 64, 64, 64, -64, -64, 64, -64, 64, -64, 64, -64, 64, 64, 64, -64, 64, -64, -64, -64, -64, -64, -64, -64, 64, -64, -64, 64, 64, 64, 64, 64, 64, 64, 64, 64, 64, -64, -64, -64, 64, 64, -64, -64, -64, -64, -64, -64, -64, -64, -64, -64, -64, -64, -64, -64, 64, 64, 64, 64, 64, 64, 64, -64, 64, -64, 64, -64, 64, 64, -64, -64, -64, -64, -64, -64, -64, -64, -64, -64, -64, -64, 64, 64, 64, 64, 64, 64, 64, 64, -64, 64, -64, 64, 64, -64, 64, 64, -64, -64, -64, -64, -64, -64, -64, -64, -64, -64, -64, -64, 64, -64, -64, 64, 64, 64, 64, 64, 64, -64, 64, 64, 64, -64, 64, 64, -64, -64, 64, -64, -64, 64, 64, -64, -64, -64, -64, -64, 64, -64, 64, 64, -64, 64, 64, 64, 64, 64, -64, -64, 64, -64, 64, 64, 64, 64, 64, 64, 64, 64, 64, 64, -64, -64, -64, -64, -64, -64, 64, -64, -64, 64, 64, 64, 64, 64, 64, -64, -64, -64, -64, 64, 64, 64, 64, 64, 64, 64, 64, 64, 64, 64, -64, -64, -64, -64, 64, -64, -64, 64, -64, -64, 64, 64, -64, 64, -64, 64, -64, 64, 64, 64, 64, 64, 64, 64, 64, 64, 64, 64, 64, -64, -64, -64, -64, -64, -64, 64, 64, 64, 64, 64, -64, 64, -64, 64, -64, 64, -64, 64, 64, 64, 64, 64, 64, 64, 64, 64, 64, 64, -64, 64, -64, 64, -64, -64, -64, 64, 64, 64, 64, 64, 64, -64, 64, 64, 64, 64, 64, -64, 64, 64, 64, 64, 64, 64, 64, -64, -64, -64, 64, 64, -64, -64, 64, 64, 64, -64, -64, 64, -64, -64, 64, 64, 64, 64, 64, -64, 64, -64, 64, 64, 64, 64, 64, 64, 64, 64, 64, 64, -64, -64, 64, 64, 64, 64, 64, 64, 64, -64, -64, -64, -64, -64, 64, 64, -64, 64, 64, 64, 64, 64, 64, 64, 64, -64, -64, -64, -64, 64, 64, 64, 64, 64, -64, 64, -64, -64, -64, -64, 64, -64, 64, 64, -64, 64, 64, 64, 64, 64, 64, 64, 64, -64, -64, -64, -64, 64, 64, 64, 64, -64, -64, 64, -64, 64, -64, -64, 64, 64, 64, -64, 64, 64, 64, 64, 64, 64, 64, 64, -64, -64, 64, -64, 64, 64, 64, 64, -64, -64, -64, -64, 64, -64, -64, -64, 64, 64, 64, 64, 64, 64, 64, 64, 64, 64, 64, -64, 64, 64, 64, 64, 64, 64, 64, 64, 64, -64, 64, -64, 64, 64, 64, -64, -64, -64, 64, 64, 64, -64, 64, -64, 64, 64, 64, -64, 64, -64, -64, -64, 64, 64, 64, 64, -64, 64, 64, 64, 64, -64, 64, -64, -64, -64, -64, -64, -64, -64, -64, -64, -64, 64, -64, 64, 64, 64, 64, -64, 64, 64, 64, 64, 64, 64, 64, -64, -64, -64, 64, 64, -64, -64, -64, -64, -64, -64, -64, 64, -64, 64, -64, -64, -64, -64, 64, 64, 64, 64, 64, -64, 64, -64, 64, -64, -64, 64, -64, 64, -64, -64, -64, -64, 64, -64, 64, 64, 64, -64, -64, -64, -64, 64, 64, 64, 64, -64, -64, -64, -64, 64, -64, 64, 64, -64, -64, -64, -64, -64, -64, -64, -64, 64, -64, 64, 64, -64, -64, -64, -64, -64, -64, 64, 64, -64, -64, -64, 64, -64, -64, -64, -64, -64, -64, -64, -64, -64, -64, -64, -64, -64, -64, 64, -64, 64, -64, 64, 64, -64, 64, 64, 64, -64, -64, 64, 64, 64, 64, 64, 64, -64, 64, -64, -64, 64, -64, 64, 64, 64, 64, 64, -64, -64, -64, -64, -64, 64, 64, 64, 64, -64, -64, -64, 64, -64, -64, -64, 64, -64, 64, 64, -64, -64, 64, -64, -64, 64, 64, 64, 64, -64, -64, -64, -64, 64, 64, 64, -64, 64, -64, 64, -64, -64, -64, 64, 64, 64, -64, -64, 64, -64, 64, 64, -64, 64, -64, -64, -64, -64, -64, 64, 64, -64, 64, -64, -64, -64, 64, -64, 64, 64, 64, 64, -64, 64, -64, -64, 64, 64, -64, -64, -64, 64, 64, 64, 64, -64, 64, -64, 64, -64, -64, 64, 64, 64, 64, -64, -64, 64, -64, 64, -64, 64, 64, -64, -64, 64, -64, -64, -64, -64, 64, 64, -64, 64, -64, 64, -64, -64, 64, -64, -64, -64, 64, 64, 64, 64, 64, 64, -64, 64, -64, -64, 64, 64, 64, 64, 64, 64, 64, 64, -64, -64, -64, -64, -64, -64, 64, -64, 64, 64, -64, -64, 64, -64, 64, -64, -64, -64, -64, -64, -64, -64, -64, -64, -64, -64, -64, -64, -64, -64, -64, -64, -64, -64, -64, -64, -64, -64, 64, 64, -64, 64, 64, -64, 64, 64, -64, 64, -64, 64, 64, 64, 64, 64, 64, 64, 64, -64, -64, 64, -64, -64, -64, -64, -64, -64, -64, -64, 64, 64, 64, 64, -64, -64, -64, -64, -64, -64, -64, -64, 64, 64, 64, 64, -64, -64, -64, -64, -64, -64, -64, -64, -64, -64, -64, -64, -64, -64, -64, 64, 64, -64, 64, -64, 64, 64, 64, 64, 64, 64, 64, 64, 64, -64, 64, 64, 64, -64, -64, -64, -64, -64, -64, -64, -64, -64, 64, -64, 64, -64, 64, 64, 64, 64, 64, 64, 64, 64, -64, -64, 64, 64, 64, -64, 64, -64, -64, -64, -64, -64, -64, -64, -64, -64, 64, 64, -64, 64, -64, 64, -64, -64, 64, 64, -64, 64, -64, -64, -64, -64, -64, -64, 64, -64, -64, -64, -64, -64, -64, -64, -64, -64, 64, 64, -64, 64, 64, 64, 64, 64, 64, 64, 64, 64, -64, -64, 64, -64, 64, 64, -64, -64, -64, -64, -64, -64, -64, -64, -64, -64, 64, -64, -64, -64, -64, 64, 64, 64, -64, 64, -64, 64, -64, -64, -64, -64, 64, 64, 64, 64, -64, 64, -64, -64, 64, -64, -64, -64, -64, -64, 64, 64, 64, 64, 64, -64, 64, -64, -64, -64, -64, -64, 64, 64, 64, 64, 64, 64, 64, 64, 64, 64, 64, 64, -64, 64, 64, 64, -64, 64, 64, -64, 64, 64, -64, -64, -64, -64, -64, -64, 64, 64, 64, 64, 64, 64, 64, 64, 64, 64, 64, 64, -64, -64, 64, -64, 64, 64, 64, -64, 64, -64, -64, -64, -64, -64, -64, 64, 64, 64, 64, 64, 64, 64, 64, 64, 64, 64, 64, 64, 64, 64, 64, 64, -64, -64, -64, 64, 64, -64, -64, -64, 64, 64, 64, 64, 64, 64, 64, 64, -64, 64, 64, 64, 64, 64, -64, 64, 64, -64, 64, 64, 64, 64, 64, -64, 64, -64, -64, -64, 64, -64, 64, 64, 64, 64, -64, -64, -64, 64, -64, 64, 64, 64, 64, 64, 64, -64, -64, -64, -64, 64, 64, 64, 64, -64, -64, -64, -64, -64, -64, -64, -64, 64, 64, -64, -64, -64, -64, 64, -64, 64, 64, 64, 64, 64, 64, 64, -64, -64, 64, 64, 64, -64, -64, -64, -64, -64, -64, -64, -64, -64, -64, -64, -64, -64, -64, 64, 64, 64, 64, 64, 64, 64, 64, -64, 64, 64, 64, 64, 64, -64, -64, -64, -64, -64, -64, -64, 64, 64, 64, -64, -64, -64, -64, 64, 64, 64, 64, 64, 64, 64, 64, 64, -64, -64, 64, 64, 64, 64, 64, -64, 64, 64, -64, 64, 64, -64, 64, -64, -64, -64, -64, 64, 64, 64, -64, 64, 64, 64, 64, 64, -64, -64, 64, 64, 64, 64, 64, 64, 64, 64, 64, 64, -64, -64, -64, -64, -64, -64, -64, -64, 64, 64, 64, 64, 64, 64, 64, -64, -64, -64, -64, 64, 64, 64, 64, 64, 64, 64, 64, 64, -64, -64, 64, -64, -64, -64, -64, 64, 64, 64, -64, -64, 64, 64, -64, -64, 64, -64, -64, 64, 64, 64, 64, 64, 64, 64, 64, -64, -64, -64, -64, -64, 64, -64, -64, 64, 64, 64, -64, -64, -64, 64, 64, -64, 64, 64, -64, 64, 64, 64, 64, 64, 64, 64, -64, -64, -64, -64, -64, -64, 64, -64, -64, 64, 64, 64, -64, -64, -64, 64, -64, -64, -64, -64, 64, 64, 64, 64, 64, 64, 64, 64, -64, -64, -64, 64, 64, 64, 64, -64, -64, -64, 64, 64, -64, -64, -64, -64, -64, -64, 64, -64, 64, -64, 64, 64, -64, -64, 64, -64, 64, 64, -64, 64, 64, 64, -64, -64, 64, -64, 64, -64, 64, -64, 64, 64, -64, -64, -64, 64, 64, 64, -64, -64, -64, -64, -64, -64, -64, -64, -64, -64, -64, -64, -64, -64, -64, 64, -64, -64, -64, -64, 64, -64, 64, 64, -64, 64, -64, 64, 64, -64, 64, -64, -64, -64, 64, -64, -64, -64, -64, -64, -64, -64, -64, -64, 64, 64, 64, 64, 64, 64, -64, 64, -64, 64, -64, -64, 64, -64, 64, 64, 64, -64, -64, -64, 64, -64, -64, -64, -64, -64, 64, -64, -64, 64, -64, 64, 64, -64, -64, -64, 64, -64, -64, -64, -64, 64, 64, -64, -64, -64, 64, -64, 64, -64, -64, -64, 64, 64, 64, 64, -64, 64, -64, -64, 64, 64, -64, 64, 64, 64, 64, 64, 64, -64, 64, -64, 64, 64, -64, 64, -64, 64, 64, 64, 64, -64, -64, -64, 64, 64, 64, 64, -64, -64, 64, -64, -64, -64, 64, -64, -64, 64, 64, 64, 64, 64, 64, 64, -64, 64, 64, -64, -64, 64, 64, -64, -64, -64, 64, -64, -64, -64, -64, -64, 64, -64, -64, -64, -64, -64, -64, -64, -64, -64, -64, 64, 64, 64, 64, -64, -64, 64, -64, -64, 64, -64, -64, -64, 64, -64, -64, -64, -64, 64, -64, -64, -64, -64, -64, 64, -64, -64, 64, 64, -64, 64, -64, -64, -64, -64, -64, -64, -64, -64, -64, -64, 64, 64, 64, -64, -64, 64, -64, 64, -64, 64, 64, -64, -64, 64, 64, 64, -64, -64, -64, -64, -64, -64, -64, -64, -64, -64, -64, -64, -64, -64, -64, 64, -64, -64, -64, -64, -64, -64, 64, 64, 64, -64, -64, -64, -64, 64, -64, -64, 64, 64, -64, 64, -64, -64, -64, -64, 64, 64, -64, -64, 64, -64, 64, 64, 64, 64, 64, -64, 64, -64, -64, 64, -64, 64, 64, -64, -64, -64, 64, -64, -64, -64, -64, 64, 64, 64, -64, -64, -64, -64, 64, -64, 64, 64, -64, -64, -64, -64, -64, -64, 64, -64, 64, -64, -64, 64, -64, -64, -64, 64, 64, 64, -64, 64, -64, -64, 64, 64, -64, -64, 64, -64, -64, 64, -64, 64, -64, -64, -64, 64, 64, -64, 64, -64, -64, -64, 64, -64, 64, -64, 64, 64, -64, 64, -64, 64, 64, -64, -64, -64, -64, -64, 64, -64, 64, 64, 64, -64, -64, -64, 64, 64, -64, -64, 64, -64, -64, -64, -64, 64, 64, -64, 64, -64, 64, -64, 64, -64, -64, -64, 64, -64, -64, -64, 64, -64, -64, 64, -64, -64, -64, -64, 64, 64, -64, 64, -64, 64, 64, -64, -64, 64, 64, -64, -64, -64, -64, -64, -64, -64, 64, 64, -64, -64, -64, 64, -64, 64, -64, -64, -64, -64, -64, -64, 64, -64, 64, -64, -64, 64, 64, 64, -64, 64, -64, -64, 64, -64, 64, -64, -64, -64, 64, -64, -64, -64, -64, -64, 64, -64, -64, -64, -64, 64, -64, 64, 64, 64, -64, 64, -64, -64, -64, 64, -64, -64, 64, 64, -64, -64, -64, -64, -64, 64, -64, 64, -64, -64, -64, 64, 64, -64, -64, -64, -64, 64, -64, -64, -64, -64, -64, -64, 64, -64, -64, -64, -64, -64, -64, -64, -64, -64, 64, -64, -64, -64, -64, 64, -64, -64, 64, 64, -64, -64, 64, -64, -64, -64, 64, 64, -64, -64, -64, -64, -64, -64, -64, 64, -64, -64, 64, 64, 64, 64, 64, -64, -64, -64, 64, 64, 64, -64, -64, -64, -64, -64, 64, 64, -64, 64, -64, -64, -64, -64, -64, -64, 64, -64, -64, -64, -64, -64, -64, 64, 64, -64, -64, -64, 64, -64, -64, -64, 64, -64, -64, 64, 64, -64, -64, -64, 64, -64, -64, -64, 64, -64, -64, 64, 64, -64, -64, -64, -64, 64, 64, 64, 64, 64, 64, 64, -64, -64, -64, -64, 64, -64, -64, -64, -64, -64, 64, -64, -64, -64, 64, 64, 64, -64, -64, -64, 64, 64, 64, 64, 64, -64, -64, 64, -64, 64, -64, -64, -64, 64, -64, -64, 64, -64, -64, -64, -64, -64, -64, -64, -64, -64, -64, 64, 64, 64, 64, -64, 64, -64, -64, 64, -64, -64, -64, -64, -64, -64, -64, -64, -64, -64, 64, -64, -64, -64, 64, 64, -64, -64, -64, 64, -64, 64, -64, 64, -64, 64, 64, -64, -64, -64, -64, -64, -64, -64, -64, -64, 64, 64, -64, -64, -64, -64, -64, -64, 64, -64, -64, -64, -64, -64, -64, 64, 64, -64, 64, 64, -64, -64, -64, 64, -64, 64, -64, -64, 64, -64, 64, -64, -64, 64, 64, -64, -64, 64, -64, -64, -64, -64, -64, 64, 64, 64, 64, 64, -64, 64, -64, -64, -64, 64, 64, -64, -64, 64, -64, -64, 64, 64, -64, -64, -64, -64, -64, 64, -64, -64, 64, -64, -64, 64, -64, -64, 64, 64, 64, -64, 64, 64, -64, 64, 64, -64, 64, 64, 64, 64, -64, 64, -64, -64, 64, 64, -64, 64, -64, -64, 64, -64, 64, -64, -64, -64, 64, -64, 64, 64, 64, 64, -64, 64, -64, 64, -64, -64, 64, 64, -64, 64, 64, 64, 64, 64, -64, 64, -64, 64, -64, 64, 64, -64, 64, -64, 64, 64, 64, -64, -64, -64, 64, 64, -64, 64, -64, -64, 64, -64, 64, 64, -64, -64, -64, 64, 64, 64, 64, -64, -64, 64, -64, -64, -64, -64, 64, 64, 64, -64, -64, 64, -64, 64, 64, -64, -64, -64, -64, 64, -64, 64, 64, 64, -64, -64, 64, 64, -64, 64, -64, -64, 64, 64, -64, 64, -64, -64, 64, -64, -64, -64, -64, 64, 64, -64, 64, -64, -64, 64, -64, 64, -64, -64, -64, -64, -64, 64, -64, -64, -64, -64, -64, -64, -64, 64, -64, -64, -64, -64, -64, -64, 64, -64, -64, -64, 64, 64, -64, -64, 64, -64, 64, -64, 64, -64, 64, -64, 64, -64, 64, 64, 64, -64, -64, -64, -64, 64, 64, 64, 64, 64, -64, 64, -64, -64, 64, 64, 64, -64, 64, 64, -64, -64, -64, -64, -64, 64, 64, 64, 64, -64, -64, -64, -64, -64, -64, 64, -64, 64, 64, -64, -64, 64, -64, 64, 64, 64, 64, -64, -64, -64, 64, -64, 64, -64, -64, -64, -64, -64, -64, -64, -64, -64, -64, 64, 64, -64, 64, -64, -64, -64, -64, 64, 64, 64, 64, -64, -64, -64, 64, 64, 64, 64, -64, -64, -64, -64, -64, -64, -64, 64, 64, 64, -64, -64, 64, -64, 64, -64, -64, 64, -64, 64, 64, -64, -64, 64, 64, 64, -64, -64, -64, -64, -64, -64, 64, -64, 64, 64, 64, 64, 64, 64, 64, 64, 64, -64, -64, -64, -64, 64, -64, 64, -64, 64, 64, -64, -64, -64, -64, -64, 64, 64, 64, 64, 64, 64, 64, 64, 64, -64, 64, 64, 64, -64, -64, -64, -64, -64, 64, 64, -64, 64, 64, -64, -64, -64, -64, 64, 64, 64, 64, 64, 64, 64, 64, 64, 64, -64, -64, 64, -64, -64, 64, -64, 64, 64, 64, 64, -64, 64, 64, -64, -64, -64, -64, 64, -64, 64, 64, 64, 64, 64, 64, 64, -64, -64, 64, 64, -64, -64, -64, 64, -64, 64, 64, -64, -64, 64, -64, -64, -64, -64, -64, 64, 64, 64, 64, 64, 64, 64, 64, 64, -64, -64, -64, 64, -64, -64, 64, -64, 64, 64, 64, -64, 64, 64, 64, 64, 64, 64, -64, -64, -64, -64, -64, -64, 64, 64, 64, 64, 64, -64, -64, -64, -64, -64, 64, -64, -64, 64, 64, -64, -64, 64, -64, 64, 64, 64, 64, -64, 64, 64, 64, -64, -64, -64, 64, 64, 64, -64, 64, 64, 64, -64, -64, 64, 64, -64, 64, 64, 64, 64, 64, 64, 64, -64, 64, -64, -64, 64, 64, 64, 64, -64, 64, 64, 64, 64, 64, -64, -64, 64, -64, -64, -64, 64, 64, -64, 64, 64, 64, 64, 64, 64, 64, -64, -64, -64, 64, 64, 64, 64, 64, 64, 64, 64, -64, 64, -64, 64, 64, -64, 64, 64, 64, 64, 64, 64, 64, 64, 64, 64, -64, -64, -64, -64, 64, 64, 64, 64, 64, -64, 64, 64, 64, 64, -64, 64, 64, 64, 64, -64, -64, -64, 64, 64, 64, 64, 64, -64, 64, -64, -64, -64, 64, 64, 64, 64, 64, 64, 64, 64, 64, 64, -64, -64, -64, 64, 64, -64, -64, 64, 64, 64, 64, 64, -64, 64, -64, -64, -64, -64, 64, 64, 64, 64, 64, -64, -64, 64, 64, 64, -64, 64, -64, 64, -64, -64, 64, 64, 64, 64, 64, 64, 64, -64, -64, -64, -64, -64, 64, -64, -64, 64, -64, -64, 64, -64, -64, 64, 64, -64, -64, -64, -64, -64, 64, -64, 64, 64, 64, 64, -64, -64, -64, -64, -64, -64, -64, -64, -64, -64, 64, -64, 64, -64, -64, -64, 64, -64, 64, -64, -64, 64, 64, 64, 64, 64, 64, 64, 64, -64, -64, -64, -64, -64, -64, -64, -64, 64, -64, -64, 64, -64, -64, -64, -64, -64, -64, 64, -64, 64, 64, 64, 64, 64, 64, 64, 64, 64, -64, -64, -64, -64, 64, -64, -64, 64, 64, -64, -64, -64, -64, -64, 64, 64, -64, 64, 64, 64, 64, 64, 64, 64, 64, 64, -64, 64, 64, -64, -64, -64, -64, -64, -64, 64, -64, -64, -64, -64, -64, 64, 64, -64, 64, -64, -64, -64, 64, -64, -64, 64, 64, 64, 64, 64, 64, -64, 64, -64, -64, -64, 64, 64, 64, 64, 64, -64, -64, -64, -64, 64, -64, -64, -64, -64, -64, 64, -64, -64, 64, 64, 64, 64, 64, 64, 64, -64, -64, -64, -64, 64, 64, -64, 64, -64, -64, -64, -64, -64, -64, -64, -64, -64, -64, -64, 64, 64, -64, -64, 64, 64, 64, 64, 64, 64, 64, -64, 64, -64, 64, -64, -64, 64, -64, -64, 64, 64, -64, 64, -64, 64, 64, 64, -64, -64, 64, 64, -64, -64, -64, -64, -64, -64, -64, -64, 64, 64, -64, -64, -64, -64, 64, 64, 64, -64, 64, -64, -64, 64, -64, -64, 64, -64, 64, 64, -64, 64, 64, 64, -64, 64, 64, 64, 64, -64, 64, -64, -64, 64, -64, -64, 64, -64, -64, -64, 64, -64, 64, -64, -64, 64, -64, -64, 64, -64, -64, -64, -64, -64, 64, 64, -64, -64, 64, -64, 64, 64, -64, 64, 64, 64, -64, -64, 64, -64, -64, -64, -64, -64, -64, 64, 64, -64, 64, -64, -64, -64, 64, 64, 64, 64, 64, -64, 64, -64, 64, 64, 64, 64, 64, -64, -64, 64, -64, 64, 64, -64, -64, 64, -64, 64, -64, -64, 64, 64, 64, 64, -64, -64, 64, -64, -64, 64, 64, 64, 64, 64, -64, -64, 64, 64, 64, 64, -64, -64, 64, 64, 64, -64, 64, -64, 64, 64, 64, 64, 64, 64, 64, -64, -64, 64, -64, -64, 64, 64, 64, -64, 64, 64, 64, -64, -64, 64, 64, 64, 64, 64, -64, 64, -64, 64, 64, 64, 64, -64, -64, 64, 64, 64, -64, -64, 64, 64, -64, -64, -64, -64, 64, 64, 64, -64, -64, -64, -64, -64, -64, 64, 64, 64, 64, 64, 64, -64, -64, -64, -64, 64, 64, -64, -64, 64, 64, 64, -64, -64, -64, 64, -64, -64, -64, -64, -64, 64, 64, 64, 64, 64, 64, 64, -64, -64, -64, -64, -64, 64, 64, 64, 64, 64, 64, 64, -64, 64, -64, 64, -64, -64, -64, -64, -64, -64, -64, 64, -64, -64, 64, -64, 64, -64, -64, -64, 64, 64, 64, 64, 64, 64, -64, -64, 64, -64, 64, -64, -64, -64, -64, -64, -64, 64, 64, -64, 64, 64, 64, 64, -64, -64, -64, -64, 64, 64, 64, 64, 64, 64, -64, 64, -64, 64, 64, -64, -64, -64, -64, -64, 64, 64, 64, 64, 64, 64, 64, -64, -64, -64, -64, -64, 64, 64, 64, 64, 64, 64, -64, -64, 64, -64, -64, -64, -64, -64, 64, 64, 64, 64, 64, 64, 64, -64, -64, -64, -64, -64, -64, -64, 64, 64, 64, 64, 64, 64, -64, -64, -64, -64, -64, 64, 64, -64, 64, 64, 64, 64, 64, 64, 64, -64, -64, -64, -64, -64, -64, 64, 64, 64, 64, 64, -64, 64, -64, -64, -64, 64, -64, -64, -64, -64, -64, 64, 64, -64, 64, -64, 64, -64, -64, -64, -64, -64, -64, -64, -64, 64, 64, -64, 64, 64, 64, 64, -64, -64, -64, -64, 64, 64, 64, 64, -64, -64, -64, -64, 64, 64, -64, -64, -64, 64, -64, -64, -64, -64, 64, 64, 64, 64, -64, 64, -64, -64, -64, 64, -64, 64, 64, 64, -64, -64, -64, 64, -64, -64, -64, -64, -64, -64, -64, -64, 64, 64, 64, 64, 64, -64, 64, 64, 64, -64, 64, 64, -64, 64, 64, 64, 64, 64, 64, 64, -64, -64, -64, -64, -64, 64, -64, -64, 64, 64, 64, 64, 64, 64, -64, 64, -64, -64, 64, 64, 64, 64, 64, 64, 64, 64, 64, 64, 64, -64, -64, 64, -64, 64, 64, 64, 64, 64, 64, 64, 64, 64, -64, -64, 64, -64, 64, -64, 64, 64, 64, 64, 64, 64, 64, 64, 64, 64, 64, -64, 64, -64, 64, 64, 64, 64, 64, 64, 64, -64, -64, 64, -64, 64, -64, -64, 64, 64, 64, 64, 64, 64, 64, 64, 64, 64, -64, 64, 64, 64, 64, 64, 64, 64, 64, 64, 64, -64, 64, -64, -64, -64, -64, 64, -64, 64, 64, 64, 64, 64, 64, 64, 64, -64, 64, -64, -64, 64, 64, 64, 64, 64, 64, 64, 64, 64, 64, 64, 64, -64, -64, -64, -64, -64, 64, 64, 64, 64, 64, 64, 64, 64, 64, 64, -64, 64, -64, 64, 64, 64, 64, 64, 64, 64, 64, -64, 64, -64, 64, -64, -64, -64, -64, -64, -64, 64, 64, 64, 64, 64, -64, -64, 64, -64, 64, 64, 64, 64, 64, 64, 64, 64, 64, 64, 64, -64, -64, -64, -64, -64, -64, -64, -64, -64, 64, -64, 64, 64, 64, 64, 64, 64, 64, 64, 64, 64, 64, 64, 64, 64, -64, 64, -64, 64, -64, -64, -64, -64, -64, -64, -64, 64, -64, 64, -64, -64, -64, -64, -64, -64, 64, 64, 64, -64, 64, 64, 64, -64, 64, -64, 64, -64, 64, -64, -64, -64, -64, -64, -64, 64, -64, -64, -64, -64, -64, -64, -64, 64, 64, -64, -64, 64, 64, -64, -64, 64, 64, -64, -64, 64, -64, 64, -64, -64, 64, -64, -64, -64, -64, -64, -64, -64, -64, -64, -64, -64, 64, 64, -64, -64, 64, 64, 64, -64, -64, -64, -64, 64, 64, -64, -64, -64, -64, -64, -64, 64, -64, 64, -64, 64, -64, -64, -64, -64, 64, -64, 64, -64, -64, 64, 64, 64, 64, -64, -64, -64, -64, 64, -64, 64, 64, -64, 64, 64, -64, -64, 64, -64, 64, 64, -64, -64, -64, -64, 64, -64, 64, 64, -64, -64, -64, -64, -64, -64, 64, -64, 64, -64, -64, 64, 64, -64, 64, 64, -64, -64, 64, 64, -64, -64, 64, -64, -64, -64, -64, -64, -64, -64, 64, -64, -64, 64, 64, -64, -64, -64, 64, 64, 64, -64, 64, -64, 64, -64, -64, -64, 64, 64, 64, 64, -64, 64, 64, -64, -64, -64, 64, 64, 64, -64, -64, -64, 64, 64, 64, 64, 64, 64, 64, 64, -64, -64, 64, 64, -64, 64, -64, -64, -64, 64, -64, -64, -64, 64, 64, 64, -64, -64, 64, -64, 64, 64, -64, -64, -64, 64, 64, 64, -64, 64, 64, 64, 64, 64, -64, -64, 64, 64, 64, 64, -64, -64, -64, -64, -64, -64, -64, 64, -64, 64, -64, 64, 64, -64, 64, 64, 64, -64, 64, 64, 64, 64, -64, 64, 64, -64, 64, -64, -64, 64, -64, -64, 64, -64, 64, 64, 64, 64, 64, 64, 64, 64, -64, 64, -64, -64, 64, 64, 64, 64, -64, -64, 64, 64, 64, -64, 64, 64, 64, -64, 64, 64, -64, 64, 64, 64, 64, -64, -64, -64, -64, 64, 64, 64, -64, 64, 64, 64, -64, 64, 64, -64, 64, 64, -64, -64, 64, -64, -64, 64, 64, -64, 64, 64, -64, 64, 64, 64, -64, 64, 64, -64, -64, 64, 64, -64, 64, 64, -64, -64, -64, 64, 64, -64, 64, -64, -64, 64, -64, -64, 64, 64, -64, -64, -64, 64, 64, 64, -64, 64, 64, 64, 64, -64, 64, 64, 64, -64, -64, -64, -64, -64, 64, 64, 64, 64, -64, 64, -64, 64, -64, 64, -64, -64, -64, 64, 64, 64, 64, 64, 64, 64, 64, 64, 64, 64, 64, 64, 64, 64, -64, 64, 64, 64, 64, 64, 64, -64, 64, 64, 64, -64, 64, 64, -64, -64, 64, -64, 64, 64, 64, 64, -64, 64, -64, -64, 64, 64, 64, 64, 64, -64, 64, -64, 64, 64, -64, -64, 64, 64, 64, 64, -64, 64, -64, -64, 64, 64, -64, -64, 64, -64, -64, 64, 64, 64, 64, -64, 64, 64, -64, -64, 64, 64, 64, 64, 64, -64, 64, -64, 64, 64, 64, 64, 64, 64, 64, -64, 64, 64, 64, -64, -64, 64, -64, 64, -64, 64, 64, 64, -64, -64, 64, -64, 64, -64, 64, -64, 64, 64, 64, 64, 64, 64, -64, 64, 64, -64, 64, -64, -64, -64, 64, 64, 64, -64, -64, -64, 64, 64, -64, -64, 64, 64, -64, 64, -64, -64, 64, 64, -64, 64, 64, 64, -64, -64, 64, -64, -64, -64, 64, 64, -64, -64, 64, 64, 64, 64, 64, 64, -64, 64, 64, 64, 64, 64, 64, 64, -64, 64, 64, 64, 64, 64, 64, -64, -64, 64, 64, 64, 64, -64, 64, 64, 64, -64, -64, 64, 64, 64, 64, 64, 64, 64, 64, -64, 64, -64, 64, -64, 64, 64, -64, 64, -64, 64, 64, 64, -64, 64, 64, 64, -64, -64, -64, 64, 64, 64, -64, 64, -64, 64, 64, 64, 64, -64, 64, 64, 64, 64, 64, 64, 64, 64, -64, 64, 64, 64, -64, -64, -64, 64, -64, -64, -64, 64, 64, -64, -64, -64, 64, -64, -64, 64, -64, 64, -64, -64, -64, -64, -64, -64, 64, 64, 64, -64, 64, -64, 64, -64, 64, 64, -64, 64, 64, -64, 64, -64, 64, 64, 64, -64, 64, 64, -64, -64, -64, 64, 64, -64, 64, -64, -64, 64, -64, 64, -64, 64, -64, 64, -64, -64, -64, -64, 64, 64, -64, 64, -64, -64, -64, 64, -64, 64, 64, 64, -64, 64, -64, 64, 64, -64, -64, 64, -64, 64, 64, -64, 64, -64, -64, 64, -64, 64, 64, 64, -64, 64, 64, 64, -64, 64, 64, 64, 64, 64, 64, 64, -64, 64, -64, -64, 64, -64, 64, 64, -64, 64, 64, -64, -64, -64, -64, -64, 64, -64, 64, 64, -64, 64, 64, 64, 64, 64, -64, -64, 64, 64, -64, -64, -64, 64, 64, 64, -64, 64, 64, 64, -64, 64, -64, 64, 64, -64, -64, -64, 64, -64, -64, -64, 64, -64, -64, -64, 64, -64, 64, -64, 64, -64, -64, 64, 64, 64, -64, 64, -64, -64, -64, 64, -64, 64, 64, 64, 64, -64, -64, -64, -64, -64, 64, 64, -64, 64, -64, -64, -64, 64, -64, 64, -64, 64, 64, 64, 64, -64, -64, 64, -64, 64, 64, -64, -64, -64, 64, 64, 64, 64, 64, 64, 64, 64, -64, -64, 64, 64, -64, 64, -64, 64, -64, -64, 64, 64, -64, -64, -64, 64, -64, -64, -64, -64, 64, -64, 64, -64, 64, 64, -64, 64, 64, 64, 64, 64, 64, -64, 64, -64, -64, -64, -64, -64, -64, -64, 64, -64, 64, -64, 64, 64, -64, -64, -64, -64, 64, 64, -64, 64, 64, 64, -64, -64, -64, 64, -64, 64, -64, 64, -64, 64, -64, 64, 64, 64, -64, 64, 64, -64, -64, -64, -64, 64, -64, -64, -64, 64, 64, 64, 64, -64, -64, 64, -64, 64, 64, 64, 64, -64, 64, -64, 64, 64, 64, -64, 64, 64, 64, 64, -64, -64, -64, -64, 64, 64, -64, -64, 64, 64, -64, -64, 64, -64, -64, 64, -64, 64, -64, 64, -64, 64, 64, 64, 64, -64, -64, -64, -64, 64, -64, -64, 64, -64, -64, 64, -64, -64, -64, -64, 64, -64, -64, 64, 64, 64, 64, 64, 64, 64, -64, 64, -64, 64, 64, -64, 64, -64, 64, -64, 64, 64, 64, -64, -64, -64, 64, 64, 64, 64, 64, 64, 64, 64, 64, 64, 64, 64, -64, 64, -64, 64, 64, -64, 64, 64, -64, 64, 64, 64, 64, -64, 64, 64, 64, 64, 64, 64, 64, -64, -64, 64, 64, 64, -64, -64, 64, 64, 64, -64, 64, -64, -64, -64, 64, 64, -64, -64, 64, -64, 64, 64, -64, 64, 64, 64, 64, -64, -64, -64, 64, 64, -64, 64, -64, 64, -64, -64, -64, -64, -64, 64, 64, -64, -64, -64, -64, 64, 64, -64, -64, -64, -64, 64, -64, -64, -64, -64, 64, 64, 64, -64, -64, -64, -64, -64, -64, -64, 64, -64, 64, 64, -64, -64, -64, -64, -64, -64, -64, -64, -64, -64, -64, -64, -64, 64, 64, 64, -64, 64, -64, -64, -64, -64, -64, 64, 64, 64, -64, 64, -64, 64, -64, -64, -64, -64, -64, -64, -64, -64, -64, -64, 64, -64, -64, 64, -64, -64, -64, -64, -64, -64, 64, -64, 64, 64, -64, -64, 64, -64, -64, -64, -64, -64, -64, -64, -64, -64, 64, 64, -64, -64, 64, 64, 64, -64, -64, -64, -64, -64, -64, 64, 64, 64, 64, 64, -64, 64, -64, -64, -64, -64, -64, 64, 64, -64, -64, -64, -64, -64, 64, 64, -64, -64, -64, -64, 64, -64, 64, 64, 64, -64, 64, -64, 64, 64, -64, -64, -64, -64, -64, -64, -64, -64, -64, -64, 64, -64, 64, 64, -64, -64, 64, -64, -64, 64, -64, 64, -64, 64, 64, 64, -64, 64, 64, 64, -64, -64, -64, -64, -64, -64, -64, -64, -64, 64, 64, 64, -64, -64, -64, -64, -64, 64, -64, -64, 64, 64, 64, -64, -64, -64, 64, 64, -64, -64, -64, -64, -64, -64, -64, 64, 64, 64, 64, 64, -64, -64, -64, -64, -64, -64, -64, -64, -64, -64, -64, -64, 64, 64, -64, 64, -64, -64, -64, -64, -64, 64, -64, -64, 64, 64, 64, -64, 64, -64, -64, -64, -64, 64, 64, -64, -64, -64, 64, 64, 64, -64, 64, 64, -64, -64, -64, -64, -64, -64, -64, -64, 64, 64, 64, 64, -64, -64, -64, 64, -64, -64, -64, -64, -64, 64, -64, 64, -64, 64, -64, -64, -64, -64, -64, -64, -64, 64, -64, 64, -64, 64, 64, 64, 64, -64, -64, -64, -64, -64, 64, 64, 64, -64, 64, 64, -64, -64, -64, 64, -64, -64, 64, -64, -64, 64, 64, 64, 64, 64, 64, 64, -64, -64, 64, 64, -64, -64, 64, 64, -64, 64, 64, 64, -64, 64, -64, 64, 64, -64, 64, 64, -64, -64, 64, 64, 64, 64, 64, 64, 64, -64, 64, 64, 64, -64, 64, -64, -64, 64, 64, 64, 64, -64, -64, 64, 64, -64, 64, 64, 64, 64, 64, 64, 64, 64, 64, -64, 64, -64, 64, -64, -64, 64, -64, -64, 64, 64, -64, 64, -64, 64, 64, 64, 64, -64, -64, 64, 64, 64, 64, -64, 64, -64, -64, 64, -64, -64, -64, -64, -64, -64, -64, -64, 64, 64, 64, -64, 64, -64, 64, -64, -64, 64, -64, -64, 64, 64, 64, 64, -64, 64, 64, 64, -64, 64, -64, -64, -64, -64, -64, -64, 64, -64, -64, 64, -64, 64, 64, 64, -64, -64, -64, -64, -64, -64, 64, 64, 64, 64, 64, -64, -64, -64, 64, -64, -64, -64, 64, 64, 64, -64, 64, -64, -64, 64, -64, -64, -64, -64, -64, 64, -64, -64, 64, 64, -64, -64, -64, -64, -64, -64, -64, -64, 64, -64, -64, -64, -64, 64, -64, 64, -64, 64, -64, -64, 64, -64, -64, -64, 64, -64, -64, -64, -64, -64, -64, -64, -64, -64, 64, -64, 64, 64, -64, -64, -64, 64, -64, 64, -64, 64, 64, 64, -64, 64, -64, -64, -64, 64, 64, 64, 64, -64, 64, -64, -64, -64, -64, 64, -64, -64, -64, -64, 64, -64, -64, -64, 64, -64, -64, 64, 64, 64, 64, 64, -64, 64, -64, 64, 64, -64, -64, 64, 64, -64, -64, 64, 64, 64, -64, -64, 64, -64, -64, 64, -64, 64, -64, 64, -64, 64, 64, -64, 64, -64, -64, 64, -64, -64, -64, 64, 64, 64, 64, -64, 64, 64, 64, -64, 64, 64, -64, -64, -64, -64, -64, 64, 64, -64, -64, 64, 64, -64, 64, -64, 64, 64, -64, 64, 64, 64, -64, -64, 64, 64, 64, -64, 64, -64, 64, 64, -64, -64, -64, -64, -64, 64, -64, -64, 64, -64, -64, -64, 64, 64, 64, 64, 64, 64, 64, 64, 64, 64, 64, 64, -64, 64, -64, -64, 64, 64, 64, 64, -64, -64, -64, 64, -64, 64, -64, -64, 64, -64, -64, -64, 64, 64, -64, -64, -64, -64, 64, 64, 64, 64, -64, -64, 64, 64, 64, 64, 64, -64, -64, 64, -64, 64, -64, -64, -64, -64, -64, -64, 64, -64, 64, -64, 64, -64, 64, 64, -64, -64, 64, 64, 64, -64, -64, 64, -64, -64, -64, 64, 64, -64, 64, -64, -64, -64, 64, -64, -64, 64, 64, -64, -64, -64, 64, 64, -64, 64, 64, -64, 64, 64, -64, -64, -64, -64, -64, 64, 64, -64, -64, 64, 64, -64, 64, -64, -64, -64, -64, -64, -64, -64, -64, 64, 64, 64, 64, -64, 64, -64, -64, -64, -64, -64, -64, -64, -64, -64, -64, -64, -64, -64, -64, -64, 64, -64, -64, -64, -64, -64, -64, -64, 64, 64, 64, -64, -64, 64, -64, -64, 64, 64, -64, 64, -64, -64, -64, -64, -64, -64, -64, 64, -64, 64, -64, 64, -64, 64, 64, 64, 64, 64, 64, 64, 64, -64, -64, -64, -64, -64, -64, 64, -64, -64, -64, 64, 64, -64, -64, -64, -64, -64, -64, -64, 64, 64, 64, 64, 64, 64, -64, 64, 64, -64, -64, -64, -64, 64, -64, 64, -64, -64, -64, -64, -64, -64, -64, 64, 64, -64, -64, -64, 64, -64, -64, 64, -64, -64, 64, 64, -64, 64, -64, -64, -64, -64, -64, -64, -64, -64, -64, -64, -64, 64, 64, -64, -64, 64, 64, -64, -64, -64, -64, -64, 64, -64, 64, 64, -64, 64, -64, 64, -64, -64, -64, -64, 64, -64, -64, -64, 64, -64, -64, -64, -64, -64, 64, -64, -64, 64, 64, -64, -64, 64, -64, 64, -64, -64, -64, -64, 64, -64, -64, -64, -64, -64, -64, 64, -64, -64, -64, -64, -64, 64, 64, -64, -64, -64, 64, -64, -64, -64, -64, -64, -64, 64, -64, -64, -64, 64, -64, -64, 64, -64, -64, 64, -64, -64, -64, -64, -64, -64, -64, 64, -64, 64, -64, -64, 64, -64, -64, 64, 64, -64, 64, -64, -64, -64, 64, -64, 64, 64, -64, 64, -64, -64, 64, -64, 64, -64, -64, -64, -64, -64, 64, -64, 64, 64, -64, 64, 64, -64, -64, -64, 64, -64, -64, -64, -64, 64, -64, -64, 64, 64, -64, -64, -64, -64, -64, -64, -64, -64, -64, -64, 64, 64, -64, -64, 64, -64, -64, 64, 64, -64, 64, 64, -64, -64, 64, 64, 64, 64, 64, -64, -64, -64, -64, 64, 64, 64, 64, 64, 64, -64, 64, -64, -64, 64, -64, -64, -64, -64, 64, 64, 64, -64, 64, 64, 64, 64, -64, -64, -64, 64, 64, -64, 64, 64, -64, -64, 64, 64, 64, 64, 64, -64, -64, -64, -64, 64, -64, 64, -64, 64, -64, 64, 64, -64, -64, -64, -64, -64, 64, -64, 64, 64, 64, -64, 64, -64, 64, 64, -64, 64, -64, -64, 64, -64, -64, -64, 64, 64, -64, 64, 64, 64, -64, 64, -64, 64, 64, -64, 64, 64, 64, -64, -64, -64, -64, -64, -64, -64, -64, 64, -64, -64, -64, -64, -64, -64, -64, 64, -64, -64, -64, 64, -64, -64, 64, -64, 64, -64, -64, -64, 64, -64, -64, 64, -64, -64, -64, -64, -64, -64, -64, -64, 64, -64, -64, 64, -64, -64, 64, -64, -64, 64, -64, 64, -64, -64, -64, -64, 64, 64, -64, 64, 64, 64, -64, -64, -64, -64, -64, -64, 64, 64, -64, 64, 64, 64, -64, -64, 64, 64, 64, 64, 64, -64, -64, 64, 64, -64, -64, -64, 64, -64, -64, 64, 64, -64, 64, -64, 64, -64, 64, -64, 64, -64, 64, -64, -64, -64, 64, 64, -64, -64, -64, -64, -64, 64, 64, 64, -64, -64, 64, 64, 64, 64, -64, -64, -64, -64, -64, -64, 64, 64, -64, -64, -64, -64, -64, -64, 64, -64, -64, -64, -64, -64, -64, 64, 64, 64, -64, 64, 64, -64, -64, -64, -64, 64, 64, 64, 64, 64, 64, 64, -64, -64, -64, -64, 64, -64, -64, 64, 64, 64, 64, 64, -64, 64, 64, 64, -64, 64, -64, 64, 64, 64, 64, -64, -64, -64, -64, 64, 64, -64, 64, 64, 64, 64, 64, -64, -64, 64, -64, -64, -64, -64, 64, -64, -64, 64, 64, 64, -64, -64, -64, 64, -64, -64, -64, -64, -64, 64, 64, 64, -64, 64, 64, 64, -64, -64, -64, 64, 64, 64, 64, -64, 64, -64, -64, -64, -64, -64, -64, -64, 64, -64, -64, -64, -64, 64, 64, -64, 64, -64, -64, 64, 64, 64, -64, -64, 64, -64, 64, 64, -64, 64, -64, -64, -64, -64, -64, -64, -64, -64, -64, 64, 64, -64, 64, -64, 64, -64, -64, -64, 64, 64, -64, -64, 64, 64, 64, 64, 64, -64, 64, -64, -64, 64, -64, 64, 64, -64, 64, -64, 64, -64, 64, 64, -64, -64, 64, 64, 64, -64, -64, -64, 64, -64, -64, -64, 64, 64, -64, -64, -64, -64, 64, -64, -64, -64, 64, -64, -64, -64, 64, 64, 64, 64, 64, -64, -64, -64, 64, -64, 64, -64, -64, -64, 64, 64, 64, 64, -64, -64, -64, -64, -64, -64, -64, -64, -64, 64, -64, 64, 64, 64, -64, 64, -64, 64, 64, -64, -64, 64, 64, 64, 64, 64, 64, 64, -64, -64, -64, -64, -64, -64, -64, 64, -64, -64, 64, -64, 64, -64, 64, 64, -64, 64, -64, -64, 64, 64, 64, 64, 64, 64, 64, 64, 64, -64, -64, -64, -64, -64, -64, -64, -64, -64, -64, -64, 64, -64, -64, -64, 64, 64, 64, -64, 64, -64, 64, 64, 64, 64, 64, -64, -64, -64, -64, -64, -64, -64, -64, -64, -64, -64, 64, -64, -64, 64, 64, 64, 64, 64, -64, -64, 64, 64, 64, 64, 64, 64, 64, -64, 64, -64, -64, -64, -64, -64, 64, 64, 64, -64, -64, -64, 64, 64, 64, 64, 64, 64, -64, -64, -64, -64, 64, 64, 64, 64, -64, 64, 64, 64, -64, -64, 64, -64, 64, 64, -64, 64, -64, -64, 64, 64, 64, 64, -64, 64, -64, -64, 64, 64, -64, 64, 64, -64, 64, -64, -64, 64, -64, -64, -64, 64, 64, -64, -64, 64, -64, -64, 64, 64, -64, 64, -64, 64, -64, 64, 64, 64, -64, 64, 64, 64, -64, -64, -64, -64, -64, -64, -64, 64, -64, -64, -64, -64, -64, -64, -64, -64, -64, -64, -64, 64, -64, -64, -64, 64, -64, 64, 64, 64, -64, -64, 64, -64, -64, 64, -64, -64, -64, -64, -64, -64, -64, -64, -64, -64, -64, -64, -64, -64, 64, 64, 64, -64, 64, 64, 64, 64, -64, -64, -64, 64, 64, -64, -64, 64, -64, -64, 64, 64, -64, -64, -64, -64, -64, -64, -64, -64, 64, 64, 64, 64, 64, 64, 64, 64, 64, -64, 64, -64, -64, 64, -64, -64, -64, 64, -64, -64, -64, 64, -64, -64, -64, -64, -64, -64, -64, 64, -64, 64, 64, 64, 64, 64, 64, -64, -64, -64, -64, 64, -64, -64, -64, -64, -64, 64, 64, 64, -64, -64, -64, -64, -64, -64, -64, 64, -64, -64, 64, -64, -64, 64, 64, 64, -64, -64, -64, -64, -64, -64, -64, -64, -64, 64, 64, 64, -64, -64, -64, -64, -64, -64, -64, -64, -64, 64, 64, -64, 64, -64, -64, -64, -64, -64, -64, -64, -64, -64, -64, -64, -64, -64, 64, 64, -64, -64, 64, -64, 64, -64, 64, 64, -64, 64, -64, -64, -64, -64, -64, -64, -64, -64, -64, -64, -64, -64, -64, -64, -64, -64, -64, -64, 64, -64, -64, -64, 64, 64, -64, -64, -64, 64, -64, -64, -64, 64, -64, -64, -64, -64, -64, -64, -64, -64, -64, 64, -64, 64, -64, 64, 64, -64, -64, -64, -64, -64, 64, -64, 64, 64, -64, -64, -64, -64, -64, -64, -64, -64, -64, -64, -64, -64, 64, -64, -64, -64, 64, 64, 64, 64, -64, -64, -64, 64, -64, 64, -64, -64, 64, -64, 64, -64, -64, -64, -64, -64, -64, -64, 64, -64, -64, 64, -64, 64, -64, 64, 64, 64, -64, -64, 64, -64, 64, 64, 64, 64, -64, -64, 64, 64, -64, -64, -64, -64, -64, -64, -64, -64, -64, 64, 64, 64, 64, -64, 64, -64, 64, -64, 64, -64, 64, 64, -64, -64, -64, 64, -64, -64, 64, -64, 64, -64, -64, -64, -64, -64, -64, -64, 64, 64, 64, -64, -64, -64, -64, 64, -64, 64, 64, -64, 64, -64, 64, -64, -64, -64, -64, -64, -64, 64, 64, 64, -64, 64, -64, -64, -64, -64, 64, -64, -64, -64, -64, 64, -64, 64, 64, -64, -64, -64, 64, 64, -64, -64, -64, -64, -64, 64, 64, -64, 64, 64, -64, 64, -64, -64, -64, 64, 64, 64, -64, -64, 64, -64, 64, 64, -64, 64, 64, 64, -64, 64, -64, 64, -64, 64, -64, 64, -64, -64, 64, -64, 64, -64, 64, -64, -64, 64, 64, 64, -64, -64, -64, -64, 64, -64, -64, 64, -64, 64, 64, -64, -64, 64, 64, -64, -64, 64, 64, 64, -64, -64, 64, -64, -64, -64, -64, 64, 64, 64, 64, -64, 64, -64, -64, -64, -64, -64, -64, -64, 64, -64, -64, -64, -64, 64, 64, -64, -64, 64, -64, -64, 64, 64, -64, -64, -64, -64, -64, 64, 64, 64, 64, -64, 64, 64, -64, -64, -64, -64, -64, 64, 64, 64, 64, -64, 64, 64, 64, 64, 64, 64, -64, -64, -64, 64, 64, 64, 64, -64, -64, 64, 64, -64, -64, 64, 64, -64, 64, 64, 64, 64, 64, 64, 64, 64, -64, -64, -64, -64, -64, -64, 64, -64, 64, 64, 64, 64, -64, 64, 64, 64, -64, -64, 64, -64, 64, -64, 64, 64, 64, 64, 64, 64, -64, -64, -64, -64, -64, 64, 64, -64, 64, -64, 64, -64, 64, -64, 64, 64, -64, -64, -64, 64, 64, 64, 64, 64, 64, 64, -64, 64, -64, -64, -64, -64, -64, -64, 64, 64, -64, -64, 64, -64, 64, 64, -64, 64, -64, 64, 64, -64, 64, 64, 64, 64, 64, 64, -64, -64, -64, -64, -64, -64, -64, 64, 64, -64, 64, 64, 64, 64, -64, -64, 64, 64, -64, -64, 64, 64, 64, 64, 64, 64, 64, 64, -64, -64, -64, 64, 64, 64, 64, 64, 64, -64, 64, 64, -64, 64, 64, 64, 64, 64, 64, 64, 64, 64, 64, 64, 64, 64, 64, -64, -64, 64, -64, 64, 64, 64, -64, 64, 64, 64, -64, -64, 64, 64, 64, 64, -64, 64, 64, 64, 64, 64, 64, 64, 64, -64, 64, -64, -64, -64, -64, 64, 64, -64, -64, 64, 64, 64, 64, 64, 64, -64, 64, 64, 64, 64, 64, -64, 64, 64, 64, 64, 64, 64, 64, 64, -64, 64, -64, 64, 64, -64, -64, -64, 64, -64, 64, 64, 64, 64, 64, -64, 64, 64, 64, 64, -64, -64, 64, 64, 64, 64, 64, 64, -64, 64, 64, 64, 64, -64, -64, 64, 64, 64, 64, -64, -64, -64, -64, 64, 64, 64, 64, -64, -64, 64, 64, 64, 64, 64, -64, 64, -64, 64, 64, 64, -64, -64, -64, 64, 64, 64, -64, 64, 64, -64, 64, 64, 64, 64, -64, -64, -64, 64, 64, 64, 64, 64, 64, 64, 64, 64, 64, 64, 64, -64, 64, 64, -64, 64, -64, -64, -64, -64, 64, 64, 64, 64, -64, -64, 64, 64, 64, -64, -64, 64, 64, 64, 64, 64, -64, -64, -64, 64, -64, 64, 64, 64, -64, -64, -64, 64, 64, 64, -64, -64, -64, 64, 64, 64, -64, 64, -64, 64, 64, 64, 64, 64, -64, 64, -64, 64, 64, 64, 64, -64, -64, -64, 64, -64, -64, -64, -64, -64, -64, 64, 64, 64, 64, -64, 64, 64, 64, 64, 64, 64, 64, -64, -64, 64, 64, 64, 64, 64, -64, -64, 64, -64, -64, -64, -64, -64, 64, 64, 64, -64, 64, -64, 64, 64, 64, 64, 64, -64, 64, 64, -64, 64, 64, 64, 64, 64, -64, -64, -64, 64, 64, -64, -64, -64, 64, -64, 64, -64, -64, -64, 64, 64, 64, -64, -64, 64, 64, -64, 64, 64, -64, -64, -64, -64, -64, -64, 64, 64, 64, 64, 64, 64, -64, 64, 64, -64, -64, 64, -64, 64, 64, -64, 64, 64, -64, 64, 64, -64, 64, 64, 64, -64, 64, 64, -64, 64, -64, -64, -64, -64, -64, -64, 64, -64, 64, 64, 64, 64, 64, 64, 64, 64, 64, -64, 64, 64, -64, 64, 64, -64, 64, -64, -64, 64, 64, 64, -64, 64, -64, 64, -64, 64, 64, 64, 64, 64, 64, 64, 64, 64, 64, -64, 64, -64, 64, 64, -64, 64, 64, -64, 64, -64, 64, 64, 64, -64, -64, -64, -64, -64, -64, 64, 64, 64, 64, -64, 64, 64, -64, -64, -64, -64, 64, -64, 64, 64, 64, -64, -64, 64, -64, 64, 64, 64, -64, -64, 64, -64, -64, -64, -64, -64, 64, 64, 64, 64, -64, -64, 64, -64, 64, -64, 64, -64, -64, -64, -64, 64, -64, 64, -64, 64, 64, 64, -64, 64, 64, 64, -64, 64, 64, 64, 64, -64, 64, -64, -64, -64, 64, 64, 64, 64, 64, 64, 64, -64, -64, 64, 64, 64, 64, -64, 64, -64, -64, -64, 64, 64, 64, 64, -64, -64, 64, -64, -64, 64, 64, 64, 64, -64, 64, -64, 64, 64, -64, 64, 64, -64, -64, -64, 64, 64, 64, -64, -64, 64, -64, 64, -64, 64, 64, 64, -64, 64, -64, -64, 64, 64, -64, -64, 64, 64, -64, 64, -64, 64, 64, 64, -64, 64, -64, -64, 64, -64, -64, 64, 64, 64, 64, -64, -64, 64, 64, 64, -64, -64, 64, 64, 64, 64, 64, -64, 64, -64, -64, -64, -64, -64, 64, 64, -64, -64, -64, -64, 64, 64, 64, -64, 64, -64, -64, 64, 64, -64, 64, -64, 64, 64, -64, 64, 64, 64, 64, -64, 64, 64, 64, 64, -64, -64, -64, 64, 64, -64, -64, -64, -64, 64, 64, -64, -64, 64, 64, 64, -64, 64, -64, 64, 64, -64, -64, -64, 64, 64, 64, 64, -64, -64, 64, 64, -64, 64, -64, -64, -64, -64, -64, 64, -64, -64, 64, -64, 64, 64, 64, 64, -64, -64, 64, -64, -64, 64, -64, 64, 64, -64, -64, -64, -64, -64, 64, 64, -64, 64, 64, 64, -64, 64, 64, -64, 64, 64, 64, 64, -64, -64, -64, 64, 64, 64, 64, -64, -64, -64, 64, -64, -64, 64, -64, 64, 64, -64, -64, -64, 64, -64, -64, -64, -64, -64, -64, 64, -64, -64, -64, -64, -64, -64, 64, -64, -64, -64, 64, 64, 64, -64, -64, 64, -64, -64, 64, 64, 64, 64, -64, -64, -64, 64, 64, -64, 64, 64, 64, 64, -64, -64, -64, -64, -64, 64, -64, -64, -64, -64, -64, -64, -64, -64, 64, -64, 64, 64, -64, -64, -64, -64, 64, -64, -64, 64, -64, -64, -64, -64, -64, -64, -64, -64, -64, -64, -64, 64, -64, 64, -64, -64, -64, 64, 64, 64, 64, -64, 64, 64, 64, 64, 64, -64, 64, -64, 64, 64, -64, -64, -64, 64, -64, -64, -64, -64, 64, -64, -64, 64, 64, -64, -64, 64, -64, 64, -64, 64, 64, 64, 64, 64, -64, -64, 64, 64, 64, -64, -64, -64, -64, 64, -64, -64, 64, 64, 64, -64, 64, -64, 64, -64, 64, -64, -64, -64, -64, -64, 64, -64, -64, 64, -64, 64, -64, -64, 64, -64, -64, -64, -64, -64, -64, -64, 64, -64, -64, -64, 64, 64, -64, 64, -64, 64, 64, -64, -64, -64, -64, 64, -64, -64, -64, -64, -64, -64, -64, -64, -64, -64, 64, -64, -64, -64, 64, -64, 64, 64, 64, -64, -64, -64, -64, -64, -64, 64, -64, 64, 64, 64, -64, -64, 64, 64, -64, -64, 64, 64, -64, -64, -64, -64, 64, 64, -64, -64, 64, 64, 64, -64, -64, -64, -64, -64, -64, 64, -64, -64, 64, -64, -64, -64, -64, 64, -64, 64, -64, -64, 64, 64, -64, 64, -64, -64, 64, -64, 64, 64, 64, -64, -64, -64, -64, 64, -64, 64, -64, 64, -64, -64, -64, -64, 64, -64, 64, -64, 64, 64, 64, -64, 64, 64, 64, -64, 64, 64, -64, -64, 64, -64, 64, -64, 64, -64, 64, -64, -64, -64, 64, 64, -64, -64, -64, -64, -64, -64, -64, 64, -64, 64, 64, -64, 64, 64, -64, -64, -64, 64, -64, -64, -64, 64, 64, -64, 64, -64, -64, 64, 64, -64, 64, 64, -64, 64, 64, -64, 64, -64, -64, -64, 64, -64, 64, -64, 64, -64, 64, -64, -64, -64, 64, 64, -64, 64, -64, -64, -64, -64, -64, 64, -64, -64, 64, -64, 64, 64, -64, 64, 64, 64, -64, -64, 64, 64, -64, -64, 64, -64, -64, -64, 64, -64, 64, 64, 64, -64, 64, -64, -64, 64, -64, 64, -64, -64, -64, 64, 64, 64, -64, -64, -64, -64, -64, -64, 64, 64, -64, -64, 64, -64, -64, 64, 64, 64, -64, 64, -64, 64, -64, 64, 64, 64, 64, 64, 64, -64, 64, 64, 64, 64, 64, 64, 64, 64, -64, -64, -64, -64, 64, -64, -64, -64, -64, -64, 64, -64, -64, -64, 64, 64, 64, 64, -64, -64, -64, 64, 64, 64, -64, -64, 64, -64, 64, -64, -64, -64, -64, -64, 64, -64, -64, -64, -64, -64, -64, 64, -64, 64, 64, -64, -64, -64, 64, -64, -64, -64, 64, -64, 64, -64, 64, -64, 64, -64, -64, 64, 64, 64, 64, 64, -64, 64, -64, 64, 64, 64, 64, 64, 64, -64, 64, 64, 64, -64, -64, -64, -64, 64, 64, -64, -64, -64, -64, -64, 64, -64, -64, -64, 64, 64, 64, 64, -64, 64, -64, -64, 64, 64, 64, 64, 64, 64, 64, 64, 64, -64, -64, 64, -64, -64, -64, 64, 64, -64, -64, 64, 64, 64, 64, 64, -64, -64, -64, 64, -64, 64, 64, -64, 64, -64, -64, -64, 64, -64, 64, -64, -64, -64, 64, -64, -64, -64, -64, -64, -64, 64, -64, -64, 64, 64, 64, -64, -64, -64, -64, -64, 64, 64, 64, 64, -64, -64, 64, 64, 64, 64, 64, 64, 64, -64, 64, 64, -64, -64, -64, -64, -64, -64, -64, -64, -64, -64, -64, -64, -64, -64, -64, 64, 64, 64, 64, 64, 64, -64, 64, 64, 64, -64, -64, 64, -64, -64, -64, 64, 64, 64, 64, 64, 64, 64, 64, 64, -64, 64, -64, 64, -64, -64, -64, -64, -64, -64, 64, 64, -64, 64, -64, 64, -64, -64, -64, -64, 64, -64, -64, 64, -64, 64, 64, -64, -64, 64, -64, -64, 64, 64, -64, 64, 64, 64, 64, -64, 64, 64, -64, 64, -64, -64, -64, 64, -64, 64, -64, 64, -64, 64, -64, -64, -64, 64, 64, 64, 64, -64, 64, -64, 64, -64, 64, 64, 64, 64, 64, 64, -64, -64, -64, 64, 64, 64, -64, -64, 64, 64, 64, -64, 64, 64, 64, 64, -64, -64, 64, 64, -64, -64, 64, -64, 64, -64, 64, 64, 64, 64, -64, -64, -64, 64, -64, -64, 64, 64, -64, 64, 64, -64, 64, -64, 64, -64, 64, -64, -64, 64, -64, -64, -64, -64, -64, -64, -64, -64, -64, -64, 64, 64, -64, 64, -64, -64, -64, -64, 64, 64, -64, -64, -64, -64, 64, -64, -64, -64, -64, 64, -64, 64, -64, 64, -64, 64, 64, 64, -64, -64, -64, -64, 64, -64, 64, -64, -64, -64, -64, 64, -64, 64, -64, -64, -64, -64, 64, 64, -64, -64, -64, 64, 64, -64, -64, -64, -64, 64, 64, 64, -64, 64, 64, 64, 64, -64, -64, -64, 64, -64, -64, -64, 64, -64, 64, 64, -64, 64, 64, 64, 64, -64, -64, 64, 64, -64, 64, 64, -64, 64, 64, 64, -64, 64, 64, 64, -64, -64, -64, -64, -64, -64, -64, 64, -64, -64, 64, -64, -64, -64, -64, -64, -64, -64, 64, 64, 64, -64, 64, 64, -64, -64, -64, 64, 64, 64, -64, -64, 64, 64, -64, -64, 64, -64, -64, -64, 64, 64, -64, 64, -64, 64, -64, 64, 64, -64, -64, 64, -64, -64, -64, -64, 64, -64, -64, -64, -64, -64, -64, -64, -64, 64, 64, 64, -64, 64, -64, -64, -64, -64, 64, 64, 64, -64, -64, 64, 64, 64, -64, -64, -64, 64, -64, -64, 64, 64, 64, -64, -64, -64, 64, 64, -64, 64, -64, 64, -64, -64, 64, -64, -64, 64, -64, 64, 64, -64, -64, 64, -64, -64, -64, -64, -64, -64, 64, -64, -64, 64, -64, -64, -64, -64, 64, -64, -64, 64, -64, -64, -64, 64, 64, 64, 64, -64, -64, -64, -64, 64, 64, 64, -64, -64, -64, 64, -64, 64, 64, 64, 64, -64, -64, 64, 64, 64, -64, -64, 64, -64, -64, -64, 64, -64, -64, -64, 64, -64, -64, 64, 64, -64, 64, 64, -64, -64, -64, -64, -64, -64, 64, 64, -64, -64, -64, 64, 64, -64, -64, 64, -64, -64, -64, -64, -64, 64, 64, -64, -64, -64, -64, 64, -64, 64, -64, 64, 64, -64, 64, 64, -64, -64, 64, -64, 64, 64, -64, -64, 64, -64, -64, -64, 64, -64, 64, -64, -64, -64, -64, -64, -64, -64, 64, -64, 64, -64, -64, -64, -64, 64, -64, 64, 64, -64, 64, 64, -64, 64, -64, -64, 64, -64, -64, -64, 64, 64, 64, -64, 64, -64, -64, -64, -64, 64, 64, 64, -64, -64, -64, 64, -64, 64, 64, -64, 64, -64, 64, -64, 64, 64, -64, -64, -64, -64, -64, -64, -64, 64, 64, 64, 64, -64, 64, 64, 64, -64, 64, 64, 64, 64, -64, 64, -64, 64, -64, -64, 64, 64, -64, -64, 64, -64, -64, -64, -64, -64, 64, -64, 64, -64, 64, 64, 64, 64, -64, 64, -64, 64, -64, -64, 64, 64, 64, -64, -64, -64, -64, -64, -64, -64, -64, -64, -64, -64, -64, -64, -64, -64, 64, 64, -64, 64, 64, -64, -64, 64, -64, 64, 64, 64, -64, -64, -64, 64, -64, -64, -64, -64, -64, 64, 64, 64, -64, -64, -64, -64, -64, -64, -64, 64, 64, -64, -64, 64, -64, -64, -64, 64, 64, 64, -64, 64, -64, -64, -64, -64, -64, 64, -64, 64, -64, 64, -64, 64, -64, -64, 64, 64, 64, -64, -64, 64, -64, 64, 64, -64, 64, -64, -64, 64, -64, -64, -64, 64, 64, -64, 64, 64, -64, 64, -64, 64, -64, -64, 64, 64, 64, -64, 64, 64, 64, -64, 64, 64, -64, -64, -64, -64, -64, 64, 64, 64, 64, 64, 64, 64, 64, 64, 64, 64, -64, -64, -64, -64, 64, 64, -64, 64, 64, -64, 64, 64, 64, 64, -64, -64, -64, -64, -64, -64, -64, 64, 64, -64, 64, 64, 64, 64, 64, -64, -64, -64, 64, -64, 64, 64, -64, -64, -64, 64, -64, -64, 64, 64, 64, -64, -64, 64, -64, 64, -64, 64, -64, -64, -64, -64, 64, -64, 64, -64, 64, -64, -64, -64, -64, 64, -64, -64, -64, 64, -64, 64, -64, 64, 64, 64, 64, -64, -64, 64, 64, 64, -64, 64, -64, 64, -64, -64, 64, -64, -64, 64, 64, 64, 64, -64, -64, 64, 64, -64, -64, 64, 64, 64, 64, -64, -64, 64, -64, 64, 64, 64, -64, 64, -64, 64, 64, 64, 64, 64, 64, -64, -64, -64, -64, -64, -64, -64, 64, -64, 64, 64, -64, -64, 64, -64, -64, 64, 64, -64, 64, -64, 64, -64, -64, 64, 64, 64, -64, 64, 64, 64, -64, -64, -64, -64, 64, -64, -64, -64, 64, -64, -64, 64, 64, 64, 64, 64, 64, 64, -64, 64, 64, -64, -64, -64, -64, -64, -64, 64, -64, 64, -64, -64, -64, -64, -64, -64, -64, 64, 64, 64, 64, 64, 64, 64, 64, 64, -64, 64, -64, -64, 64, 64, 64, -64, 64, 64, -64, -64, 64, -64, -64, -64, -64, 64, -64, -64, -64, 64, 64, 64, 64, -64, 64, 64, -64, 64, 64, -64, 64, 64, 64, 64, 64, -64, 64, -64, -64, -64, -64, -64, -64, 64, -64, 64, 64, 64, 64, -64, 64, -64, 64, 64, 64, 64, 64, -64, 64, 64, 64, 64, -64, -64, -64, 64, -64, 64, 64, -64, -64, 64, 64, -64, -64, 64, -64, 64, 64, 64, 64, 64, 64, -64, 64, -64, 64, -64, 64, 64, -64, -64, 64, -64, 64, -64, -64, -64, -64, -64, 64, -64, -64, -64, -64, 64, 64, -64, 64, -64, 64, -64, 64, 64, 64, -64, 64, -64, 64, -64, -64, -64, -64, 64, -64, -64, -64, -64, -64, -64, -64, -64, 64, 64, -64, -64, 64, 64, 64, -64, -64, -64, -64, 64, 64, -64, -64, 64, 64, 64, -64, -64, -64, -64, -64, -64, -64, -64, -64, -64, -64, 64, -64, -64, 64, 64, -64, -64, -64, -64, -64, -64, -64, -64, 64, 64, -64, -64, -64, -64, -64, -64, 64, 64, -64, -64, -64, -64, -64, -64, -64, -64, 64, -64, -64, 64, -64, 64, -64, -64, -64, -64, -64, 64, -64, 64, -64, 64, -64, 64, 64, 64, -64, -64, -64, -64, -64, 64, 64, -64, -64, -64, 64, 64, 64, 64, 64, 64, 64, 64, -64, -64, -64, -64, 64, 64, 64, 64, 64, -64, -64, 64, -64, -64, -64, 64, 64, -64, -64, -64, -64, -64, 64, 64, 64, 64, -64, -64, -64, -64, -64, -64, 64, 64, 64, 64, 64, 64, 64, 64, -64, -64, -64, 64, 64, -64, 64, -64, 64, -64, -64, -64, -64, -64, -64, -64, 64, -64, -64, -64, -64, 64, -64, -64, -64, 64, -64, 64, 64, 64, 64, -64, -64, -64, 64, -64, -64, 64, -64, -64, -64, 64, 64, -64, -64, -64, -64, -64, -64, 64, -64, -64, -64, -64, -64, -64, 64, 64, -64, -64, -64, -64, -64, 64, 64, 64, 64, 64, 64, -64, 64, -64, -64, -64, -64, -64, 64, -64, -64, -64, 64, -64, -64, -64, 64, -64, -64, -64, -64, 64, 64, -64, 64, -64, 64, -64, 64, -64, 64, -64, -64, -64, -64, 64, -64, -64, -64, -64, -64, -64, -64, 64, 64, -64, -64, 64, -64, -64, -64, 64, 64, -64, 64, -64, -64, 64, 64, -64, 64, -64, 64, 64, -64, 64, -64, -64, -64, -64, 64, 64, 64, 64, -64, -64, -64, -64, -64, -64, 64, 64, -64, 64, 64, -64, 64, 64, 64, -64, 64, 64, -64, -64, 64, -64, -64, 64, -64, -64, -64, -64, -64, -64, 64, 64, 64, -64, -64, -64, -64, 64, 64, 64, 64, 64, -64, -64, 64, -64, -64, -64, -64, -64, -64, -64, 64, -64, -64, -64, 64, -64, -64, -64, -64, 64, 64, 64, -64, 64, 64, 64, -64, -64, -64, -64, 64, 64, 64, -64, -64, -64, 64, 64, -64, -64, -64, -64, -64, 64, -64, -64, -64, 64, -64, -64, -64, -64, 64, 64, 64, -64, -64, 64, 64, -64, -64, 64, -64, 64, 64, 64, 64, -64, -64, -64, -64, 64, -64, -64, -64, 64, -64, 64, 64, 64, 64, -64, -64, 64, 64, 64, 64, 64, 64, 64, 64, 64, 64, -64, 64, -64, -64, 64, 64, 64, 64, -64, -64, 64, -64, 64, -64, -64, -64, 64, -64, 64, 64, 64, 64, 64, 64, 64, 64, -64, -64, 64, -64, -64, -64, 64, -64, 64, 64, -64, 64, 64, -64, -64, -64, -64, -64, -64, 64, 64, -64, 64, -64, -64, -64, -64, -64, -64, 64, -64, -64, -64, 64, -64, -64, 64, -64, 64, -64, -64, -64, 64, -64, -64, 64, 64, 64, -64, 64, -64, -64, -64, 64, 64, -64, 64, -64, 64, 64, -64, 64, 64, -64, -64, -64, -64, 64, 64, 64, 64, -64, 64, 64, -64, 64, 64, 64, -64, -64, -64, 64, -64, -64, -64, 64, -64, 64, 64, -64, 64, 64, -64, -64, -64, 64, -64, -64, 64, 64, 64, 64, -64, -64, 64, -64, 64, 64, -64, 64, 64, 64, -64, 64, 64, 64, -64, 64, 64, -64, 64, -64, 64, -64, -64, 64, -64, -64, 64, 64, -64, -64, -64, -64, 64, 64, 64, 64, -64, -64, 64, -64, 64, -64, -64, 64, 64, 64, 64, 64, -64, 64, 64, -64, 64, -64, -64, 64, -64, -64, 64, 64, -64, -64, 64, -64, -64, -64, 64, -64, -64, 64, 64, -64, 64, 64, -64, -64, 64, 64, 64, -64, 64, 64, 64, 64, 64, 64, -64, -64, -64, -64, -64, -64, 64, -64, 64, -64, -64, -64, -64, -64, -64, -64, -64, -64, 64, 64, 64, -64, -64, -64, -64, 64, 64, -64, 64, -64, -64, -64, -64, -64, -64, -64, -64, -64, -64, -64, -64, -64, -64, -64, -64, 64, -64, -64, 64, 64, 64, 64, 64, -64, -64, 64, -64, -64, -64, 64, 64, -64, -64, -64, -64, 64, -64, -64, -64, -64, -64, -64, -64, -64, 64, 64, 64, -64, 64, -64, 64, -64, 64, -64, 64, -64, -64, -64, 64, -64, -64, -64, 64, -64, 64, 64, 64, -64, -64, -64, -64, -64, -64, 64, 64, 64, 64, 64, 64, -64, 64, -64, 64, 64, -64, -64, 64, -64, 64, 64, 64, 64, 64, 64, -64, -64, -64, -64, -64, -64, -64, -64, 64, -64, -64, -64, 64, -64, -64, -64, -64, 64, 64, 64, 64, -64, -64, -64, -64, -64, -64, -64, -64, 64, 64, -64, -64, -64, -64, -64, -64, 64, -64, -64, -64, 64, -64, -64, -64, -64, -64, 64, -64, 64, -64, -64, -64, -64, -64, -64, 64, -64, 64, -64, -64, -64, 64, -64, -64, 64, 64, 64, -64, -64, -64, 64, 64, 64, 64, 64, -64, -64, -64, -64, -64, -64, -64, -64, -64, -64, -64, -64, -64, -64, 64, 64, 64, 64, 64, -64, 64, -64, -64, -64, -64, 64, 64, 64, -64, -64, -64, -64, -64, -64, -64, -64, -64, -64, 64, -64, -64, -64, -64, 64, -64, -64, -64, -64, 64, 64, -64, 64, -64, 64, 64, 64, 64, -64, -64, -64, -64, -64, -64, -64, 64, 64, 64, 64, 64, -64, -64, -64, 64, -64, -64, -64, 64, -64, 64, 64, 64, 64, 64, 64, 64, -64, -64, -64, -64, -64, -64, 64, 64, -64, -64, 64, -64, -64, 64, 64, 64, -64, -64, -64, -64, -64, -64, 64, -64, -64, 64, 64, 64, 64, 64, -64, -64, 64, -64, -64, 64, -64, -64, -64, -64, 64, -64, -64, 64, 64, 64, -64, 64, 64, -64, -64, 64, -64, -64, 64, -64, 64, -64, -64, 64, -64, -64, -64, -64, 64, -64, -64, -64, -64, -64, -64, -64, 64, 64, 64, -64, -64, -64, -64, -64, 64, 64, -64, -64, -64, 64, -64, -64, -64, 64, -64, -64, 64, 64, 64, 64, -64, -64, -64, -64, 64, 64, -64, -64, -64, -64, -64, -64, -64, 64, 64, -64, -64, 64, -64, -64, 64, -64, -64, -64, 64, 64, 64, 64, -64, 64, -64, -64, 64, -64, 64, 64, -64, -64, 64, -64, 64, -64, -64, -64, -64, -64, -64, 64, -64, -64, -64, -64, -64, 64, -64, -64, -64, 64, -64, -64, -64, -64, -64, 64, -64, -64, -64, -64, 64, 64, -64, -64, -64, -64, -64, -64, -64, -64, -64, 64, 64, -64, -64, 64, -64, -64, -64, 64, -64, -64, -64, 64, 64, 64, -64, 64, -64, -64, -64, -64, -64, -64, -64, -64, -64, -64, -64, 64, -64, 64, 64, -64, -64, -64, -64, -64, 64, -64, -64, 64, -64, -64, -64, -64, -64, -64, -64, -64, -64, -64, -64, -64, -64, -64, -64, -64, 64, 64, -64, -64, -64, -64, -64, 64, 64, -64, -64, -64, -64, -64, -64, -64, -64, -64, -64, -64, -64, -64, -64, -64, -64, -64, -64, -64, 64, 64, 64, 64, 64, 64, 64, 64, -64, -64, -64, -64, 64, 64, -64, -64, -64, -64, -64, -64, -64, -64, -64, -64, -64, -64, 64, 64, -64, 64, -64, 64, 64, 64, 64, -64, 64, 64, 64, 64, 64, 64, -64, -64, -64, -64, -64, -64, -64, -64, -64, -64, 64, 64, 64, 64, 64, -64, 64, 64, 64, 64, 64, 64, -64, -64, -64, 64, -64, -64, -64, 64, -64, -64, -64, 64, 64, -64, -64, -64, -64, -64, 64, 64, -64, -64, -64, -64, 64, 64, 64, 64, -64, -64, -64, -64, -64, -64, 64, 64, -64, 64, 64, -64, 64, -64, -64, -64, -64, -64, -64, -64, 64, 64, -64, 64, -64, 64, -64, -64, 64, -64, -64, -64, -64, -64, -64, -64, -64, 64, 64, -64, 64, -64, -64, -64, 64, 64, 64, -64, -64, -64, 64, -64, -64, -64, -64, -64, 64, -64, -64, -64, 64, 64, -64, 64, 64, 64, 64, -64, -64, 64, -64, 64, 64, -64, 64, -64, 64, 64, -64, 64, 64, 64, -64, -64, 64, 64, 64, -64, -64, -64, -64, -64, -64, 64, -64, -64, 64, -64, 64, 64, 64, 64, 64, 64, -64, -64, -64, 64, 64, -64, -64, 64, 64, 64, -64, -64, 64, -64, 64, 64, 64, -64, -64, 64, -64, 64, 64, 64, -64, 64, 64, 64, 64, 64, 64, -64, -64, 64, 64, 64, 64, -64, -64, -64, 64, 64, 64, -64, -64, -64, -64, -64, -64, -64, 64, 64, 64, 64, 64, 64, 64, 64, 64, 64, -64, -64, 64, 64, 64, 64, -64, 64, -64, 64, 64, -64, -64, -64, 64, 64, 64, 64, 64, 64, 64, 64, 64, 64, 64, 64, 64, 64, 64, 64, 64, 64, 64, 64, -64, 64, 64, 64, 64, 64, 64, 64, 64, 64, 64, 64, 64, 64, 64, 64, 64, -64, -64, -64, -64, -64, -64, 64, 64, 64, -64, 64, 64, 64, 64, -64, 64, -64, 64, 64, 64, 64, 64, 64, 64, 64, -64, -64, -64, -64, -64, -64, -64, -64, 64, -64, 64, 64, 64, 64, -64, 64, -64, -64, 64, -64, 64, 64, 64, 64, -64, 64, -64, 64, -64, 64, -64, -64, -64, 64, -64, -64, -64, -64, 64, 64, 64, 64, -64, 64, -64, -64, 64, 64, 64, 64, 64, 64, 64, -64, -64, -64, 64, -64, 64, -64, 64, 64, 64, -64, 64, -64, -64, 64, 64, 64, 64, -64, 64, 64, 64, -64, 64, 64, -64, 64, -64, -64, 64, 64, -64, 64, 64, 64, 64, 64, 64, 64, -64, 64, 64, 64, 64, 64, -64, -64, -64, 64, 64, -64, -64, -64, 64, -64, -64, -64, -64, 64, 64, 64, 64, 64, -64, -64, -64, -64, 64, -64, 64, 64, 64, 64, -64, -64, 64, -64, -64, -64, 64, 64, 64, -64, -64, -64, 64, 64, 64, 64, 64, 64, -64, 64, -64, 64, 64, -64, -64, 64, 64, -64, -64, 64, 64, 64, -64, -64, -64, 64, 64, 64, 64, -64, 64, 64, 64, 64, -64, -64, -64, -64, -64, -64, -64, -64, -64, -64, -64, -64, 64, 64, 64, -64, -64, -64, 64, -64, 64, -64, -64, 64, 64, 64, 64, -64, -64, -64, -64, -64, -64, 64, 64, -64, 64, 64, -64, -64, -64, -64, -64, -64, 64, 64, -64, 64, -64, 64, -64, -64, 64, -64, -64, -64, -64, -64, -64, -64, 64, 64, 64, -64, -64, 64, 64, 64, -64, 64, -64, 64, 64, -64, 64, -64, -64, -64, -64, -64, -64, -64, 64, -64, -64, -64, 64, 64, 64, 64, 64, 64, 64, 64, 64, -64, -64, 64, 64, 64, 64, 64, 64, 64, 64, -64, -64, 64, 64, -64, -64, -64, -64, 64, -64, 64, 64, 64, 64, 64, 64, 64, 64, -64, 64, 64, 64, 64, 64, 64, 64, 64, 64, 64, 64, 64, 64, -64, 64, 64, 64, 64, 64, 64, 64, 64, 64, 64, 64, 64, 64, 64, -64, 64, 64, 64, 64, 64, 64, 64, 64, 64, 64, 64, 64, 64, -64, -64, 64, -64, -64, 64, 64, 64, 64, 64, 64, 64, 64, -64, -64, -64, 64, 64, 64, -64, 64, 64, 64, 64, 64, -64, -64, 64, -64, 64, 64, 64, -64, 64, 64, 64, 64, 64, 64, 64, 64, -64, -64, 64, -64, 64, 64, 64, 64, 64, 64, 64, 64, 64, 64, 64, 64, 64, 64, 64, 64, 64, 64, 64, -64, 64, 64, 64, 64, -64, -64, 64, 64, -64, 64, -64, 64, 64, -64, -64, -64, 64, 64, 64, 64, 64, 64, 64, 64, 64, 64, 64, 64, 64, 64, -64, 64, -64, 64, 64, -64, -64, -64, 64, -64, -64, -64, -64, 64, -64, 64, 64, 64, 64, 64, 64, -64, 64, 64, 64, -64, 64, -64, 64, -64, 64, 64, 64, -64, 64, 64, 64, -64, -64, -64, -64, -64, 64, 64, 64, 64, 64, 64, 64, 64, -64, 64, -64, 64, 64, 64, 64, 64, 64, -64, 64, 64, 64, -64, -64, -64, -64, -64, -64, -64, -64, -64, -64, 64, -64, -64, -64, -64, -64, 64, -64, 64, 64, 64, -64, 64, 64, 64, -64, -64, 64, 64, 64, -64, -64, -64, -64, -64, -64, -64, -64, 64, -64, -64, -64, -64, 64, 64, -64, -64, 64, 64, 64, 64, -64, -64, -64, 64, -64, 64, -64, 64, -64, 64, 64, -64, -64, -64, -64, 64, -64, 64, -64, 64, -64, -64, 64, -64, -64, 64, -64, -64, 64, -64, 64, 64, 64, -64, -64, 64, -64, 64, -64, 64, -64, -64, -64, -64, -64, 64, 64, 64, 64, -64, 64, -64, 64, 64, 64, 64, -64, -64, -64, -64, -64, -64, 64, -64, -64, -64, 64, 64, 64, 64, 64, -64, -64, -64, 64, -64, -64, -64, -64, 64, 64, 64, 64, -64, 64, -64, -64, -64, 64, 64, 64, 64, -64, -64, 64, 64, 64, -64, 64, 64, -64, -64, -64, 64, 64, 64, 64, -64, 64, 64, 64, -64, -64, -64, 64, 64, 64, -64, 64, -64, -64, -64, 64, 64, 64, -64, -64, -64, -64, -64, -64, -64, 64, 64, 64, -64, -64, 64, 64, 64, 64, -64, -64, -64, 64, 64, -64, -64, -64, -64, 64, -64, 64, -64, -64, -64, -64, -64, -64, -64, -64, -64, -64, -64, 64, -64, 64, 64, -64, -64, 64, 64, -64, -64, 64, 64, 64, -64, -64, 64, 64, -64, -64, -64, -64, -64, -64, -64, -64, -64, -64, -64, -64, 64, 64, 64, 64, -64, 64, -64, -64, -64, -64, -64, -64, -64, 64, 64, -64, -64, -64, -64, -64, -64, -64, -64, -64, -64, -64, -64, -64, -64, 64, -64, -64, 64, 64, 64, -64, 64, -64, 64, 64, 64, 64, 64, 64, -64, -64, -64, -64, -64, -64, -64, -64, -64, -64, 64, -64, -64, 64, -64, -64, -64, 64, 64, -64, -64, 64, -64, 64, 64, 64, 64, -64, -64, -64, -64, -64, -64, -64, -64, -64, -64, 64, -64, -64, -64, -64, -64, -64, 64, 64, -64, 64, -64, 64, -64, -64, 64, 64, -64, -64, -64, 64, 64, -64, -64, -64, -64, -64, -64, 64, 64, -64, -64, 64, -64, -64, 64, 64, 64, 64, 64, 64, -64, -64, 64, 64, 64, 64, 64, 64, 64, 64, -64, -64, -64, 64, 64, 64, 64, 64, 64, 64, -64, 64, 64, 64, -64, -64, 64, 64, 64, 64, 64, 64, 64, 64, -64, 64, -64, 64, 64, 64, -64, -64, 64, 64, 64, 64, 64, 64, -64, 64, -64, 64, 64, 64, 64, 64, 64, 64, 64, 64, 64, 64, -64, 64, -64, 64, 64, 64, 64, 64, 64, 64, 64, 64, 64, 64, 64, -64, 64, -64, -64, 64, 64, 64, 64, 64, 64, 64, -64, -64, 64, 64, -64, 64, 64, -64, -64, 64, 64, 64, 64, 64, 64, -64, 64, -64, -64, -64, 64, 64, -64, 64, 64, 64, 64, -64, -64, -64, 64, 64, -64, -64, 64, -64, 64, 64, 64, -64, -64, 64, -64, -64, 64, -64, -64, 64, -64, 64, 64, -64, 64, -64, 64, -64, -64, -64, -64, -64, -64, -64, -64, -64, -64, -64, -64, 64, 64, 64, -64, -64, -64, 64, -64, -64, -64, 64, 64, -64, 64, -64, 64, -64, -64, -64, -64, -64, -64, -64, -64, 64, -64, -64, 64, 64, -64, -64, -64, -64, -64, -64, -64, 64, -64, -64, -64, -64, -64, -64, -64, 64, -64, -64, -64, -64, -64, -64, -64, -64, 64, 64, 64, -64, -64, 64, -64, -64, -64, 64, 64, 64, 64, -64, -64, -64, -64, -64, 64, 64, -64, -64, -64, -64, 64, -64, 64, -64, -64, -64, -64, 64, -64, -64, -64, -64, 64, 64, 64, -64, -64, -64, 64, -64, -64, -64, -64, -64, -64, 64, -64, -64, 64, -64, -64, -64, -64, -64, -64, -64, -64, -64, -64, -64, -64, 64, 64, -64, -64, 64, -64, 64, -64, 64, -64, -64, -64, -64, -64, -64, 64, 64, 64, 64, -64, 64, -64, -64, -64, -64, -64, -64, 64, 64, 64, 64, -64, 64, -64, -64, -64, 64, -64, -64, -64, -64, -64, -64, -64, -64, -64, -64, 64, 64, -64, -64, -64, -64, -64, -64, -64, -64, 64, 64, 64, -64, -64, -64, -64, 64, 64, -64, 64, -64, -64, -64, -64, -64, -64, -64, 64, -64, -64, -64, -64, -64, -64, -64, 64, -64, -64, 64, -64, 64, 64, -64, -64, 64, 64, -64, -64, -64, 64, -64, -64, -64, -64, -64, 64, 64, -64, -64, -64, -64, -64, -64, -64, 64, -64, 64, -64, -64, -64, -64, -64, 64, -64, -64, -64, 64, 64, 64, -64, 64, -64, 64, 64, -64, 64, 64, 64, -64, -64, 64, 64, -64, 64, -64, -64, 64, 64, 64, 64, -64, -64, 64, 64, 64, 64, 64, 64, -64, 64, -64, -64, 64, -64, -64, -64, 64, -64, 64, 64, 64, 64, 64, 64, -64, 64, 64, 64, -64, 64, 64, 64, 64, 64, 64, 64, -64, -64, 64, 64, 64, 64, 64, -64, 64, 64, 64, -64, -64, -64, -64, 64, -64, 64, -64, 64, -64, -64, 64, 64, 64, 64, 64, 64, 64, 64, 64, 64, 64, -64, 64, 64, 64, -64, -64, 64, -64, 64, 64, 64, -64, 64, -64, 64, -64, 64, 64, 64, 64, 64, 64, -64, 64, 64, 64, 64, 64, 64, 64, -64, 64, -64, 64, -64, -64, 64, 64, -64, -64, 64, 64, 64, 64, 64, -64, -64, 64, -64, -64, 64, 64, 64, 64, 64, -64, -64, -64, -64, -64, -64, 64, 64, 64, -64, -64, 64, -64, -64, 64, -64, 64, 64, 64, 64, 64, 64, -64, -64, 64, 64, 64, -64, -64, -64, -64, -64, -64, -64, -64, 64, -64, 64, -64, -64, 64, -64, -64, -64, -64, 64, -64, -64, 64, 64, 64, 64, 64, 64, -64, -64, -64, -64, 64, 64, -64, -64, 64, 64, 64, 64, 64, 64, 64, -64, 64, 64, 64, -64, 64, 64, 64, -64, 64, -64, -64, -64, -64, -64, -64, -64, -64, -64, 64, -64, 64, 64, 64, 64, -64, -64, -64, 64, -64, 64, 64, 64, 64, -64, 64, 64, -64, 64, -64, 64, 64, 64, 64, 64, 64, -64, -64, -64, -64, 64, -64, -64, 64, 64, -64, -64, -64, -64, 64, 64, 64, 64, 64, 64, 64, 64, 64, -64, -64, -64, -64, 64, -64, -64, -64, -64, -64, 64, 64, 64, 64, -64, -64, 64, 64, -64, 64, 64, 64, 64, 64, 64, 64, 64, 64, 64, 64, 64, 64, 64, 64, -64, -64, -64, -64, -64, 64, 64, -64, -64, -64, -64, -64, 64, 64, 64, 64, 64, 64, 64, 64, 64, 64, 64, 64, 64, 64, -64, 64, -64, -64, -64, -64, 64, 64, -64, 64, -64, 64, -64, -64, -64, 64, -64, -64, -64, -64, -64, -64, -64, 64, -64, 64, -64, -64, -64, 64, -64, 64, 64, -64, -64, -64, 64, 64, -64, 64, -64, -64, 64, -64, -64, -64, -64, -64, -64, -64, -64, -64, -64, 64, -64, -64, -64, -64, -64, -64, 64, -64, -64, 64, -64, -64, -64, -64, 64, -64, 64, -64, -64, -64, -64, -64, -64, -64, -64, -64, -64, -64, -64, -64, -64, -64, -64, -64, 64, 64, -64, -64, -64, -64, 64, -64, -64, -64, -64, -64, -64, -64, -64, -64, -64, -64, -64, -64, -64, -64, -64, -64, -64, -64, -64, -64, -64, 64, -64, 64, 64, -64, 64, 64, -64, 64, -64, -64, -64, -64, -64, -64, -64, -64, -64, -64, -64, -64, -64, -64, -64, -64, -64, -64, 64, 64, 64, 64, 64, 64, -64, -64, -64, -64, -64, 64, -64, -64, -64, -64, -64, -64, 64, 64, 64, -64, -64, -64, 64, 64, 64, 64, 64, 64, 64, 64, -64, -64, 64, 64, -64, 64, 64, 64, -64, 64, 64, 64, -64, 64, 64, 64, -64, -64, -64, -64, 64, 64, 64, 64, 64, -64, 64, -64, -64, 64, -64, 64, 64, 64, 64, 64, 64, 64, 64, 64, 64, 64, 64, 64, 64, 64, -64, -64, 64, 64, 64, -64, 64, 64, 64, -64, -64, -64, -64, 64, -64, 64, 64, 64, 64, 64, 64, -64, -64, 64, 64, -64, 64, 64, -64, 64, 64, 64, 64, 64, 64, 64, 64, -64, 64, 64, 64, -64, 64, 64, 64, -64, 64, 64, -64, 64, -64, -64, -64, 64, -64, -64, 64, 64, 64, 64, 64, 64, 64, 64, 64, 64, 64, -64, 64, 64, 64, 64, 64, 64, -64, -64, -64, -64, -64, -64, -64, -64, -64, -64, -64, 64, 64, -64, -64, -64, 64, 64, 64, -64, -64, 64, 64, -64, -64, 64, -64, -64, -64, -64, -64, -64, -64, 64, -64, -64, -64, -64, -64, -64, -64, -64, -64, -64, -64, -64, 64, 64, 64, -64, 64, -64, -64, -64, 64, -64, -64, -64, -64, -64, -64, -64, 64, -64, -64, -64, -64, -64, -64, -64, -64, -64, -64, 64, 64, 64, -64, -64, 64, -64, 64, -64, -64, -64, -64, 64, -64, -64, -64, -64, 64, -64, -64, -64, -64, -64, 64, 64, -64, 64, -64, 64, 64, -64, -64, -64, 64, 64, 64, -64, -64, -64, -64, 64, 64, -64, -64, -64, -64, -64, 64, 64, 64, 64, 64, -64, 64, -64, -64, -64, 64, -64, 64, 64, 64, 64, 64, -64, -64, -64, 64, -64, 64, -64, -64, 64, 64, -64, 64, -64, 64, -64, 64, 64, 64, -64, 64, -64, 64, 64, -64, 64, -64, -64, 64, 64, -64, 64, 64, 64, 64, 64, 64, 64, 64, 64, -64, -64, 64, -64, 64, 64, 64, 64, 64, -64, 64, -64, 64, -64, 64, -64, 64, 64, 64, -64, -64, -64, -64, 64, 64, 64, -64, 64, 64, -64, 64, 64, 64, -64, -64, -64, 64, 64, 64, 64, 64, 64, -64, -64, -64, 64, 64, 64, 64, 64, -64, -64, -64, 64, -64, -64, 64, 64, -64, -64, 64, -64, 64, 64, -64, 64, -64, -64, 64, -64, 64, -64, 64, -64, 64, -64, 64, -64, -64, 64, 64, -64, -64, -64, 64, -64, 64, 64, -64, 64, 64, -64, 64, 64, 64, 64, 64, 64, -64, -64, -64, -64, -64, 64, 64, -64, 64, 64, 64, -64, 64, -64, 64, -64, -64, 64, -64, -64, -64, 64, 64, -64, 64, 64, 64, 64, -64, -64, -64, -64, -64, -64, 64, 64, -64, 64, -64, -64, -64, -64, -64, 64, -64, -64, -64, -64, -64, -64, -64, -64, -64, -64, 64, -64, 64, 64, -64, -64, -64, -64, -64, -64, -64, -64, 64, -64, -64, -64, -64, -64, -64, -64, -64, -64, -64, 64, 64, -64, 64, -64, 64, -64, 64, 64, -64, -64, 64, 64, -64, -64, -64, -64, 64, 64, 64, 64, 64, 64, 64, -64, 64, 64, 64, -64, 64, -64, 64, 64, 64, 64, 64, -64, -64, 64, 64, -64, -64, 64, 64, 64, 64, 64, 64, 64, 64, -64, 64, 64, 64, 64, 64, 64, 64, 64, -64, 64, -64, 64, 64, 64, 64, 64, 64, 64, 64, 64, 64, -64, 64, 64, 64, 64, 64, 64, 64, 64, 64, 64, 64, 64, 64, 64, 64, 64, -64, 64, 64, 64, -64, -64, 64, -64, -64, 64, 64, 64, -64, 64, 64, 64, 64, 64, 64, 64, -64, 64, 64, 64, 64, 64, -64, 64, -64, -64, -64, -64, -64, 64, 64, 64, 64, -64, -64, -64, 64, -64, 64, 64, 64, 64, -64, -64, -64, 64, 64, 64, 64, -64, 64, -64, -64, 64, -64, -64, -64, -64, -64, -64, -64, -64, -64, -64, -64, -64, -64, -64, 64, 64, -64, -64, -64, -64, 64, 64, 64, -64, 64, -64, 64, -64, 64, -64, -64, -64, -64, -64, -64, -64, -64, -64, -64, -64, -64, -64, 64, -64, -64, -64, -64, 64, 64, 64, 64, -64, 64, -64, -64, -64, -64, -64, 64, -64, -64, -64, -64, -64, -64, 64, -64, -64, -64, -64, 64, 64, -64, -64, -64, 64, 64, 64, -64, 64, 64, -64, -64, -64, 64, -64, -64, -64, -64, -64, -64, -64, -64, -64, -64, -64, 64, 64, 64, 64, -64, -64, -64, -64, 64, -64, 64, 64, -64, -64, -64, 64, -64, -64, -64, -64, -64, 64, -64, -64, -64, -64, -64, -64, -64, 64, -64, 64, 64, -64, -64, 64, 64, -64, 64, -64, 64, -64, 64, 64, 64, -64, -64, 64, 64, 64, 64, 64, 64, 64, -64, -64, -64, 64, 64, 64, 64, -64, -64, -64, -64, -64, -64, -64, -64, 64, -64, 64, -64, -64, 64, 64, 64, 64, 64, 64, 64, 64, 64, 64, 64, 64, 64, 64, -64, -64, -64, -64, -64, -64, -64, 64, 64, 64, -64, -64, -64, 64, 64, -64, 64, 64, 64, 64, 64, 64, 64, 64, 64, 64, 64, 64, -64, -64, 64, 64, 64, 64, 64, -64, 64, -64, 64, -64, 64, -64, -64, -64, 64, 64, 64, 64, 64, 64, 64, 64, 64, 64, 64, -64, -64, -64, -64, -64, 64, 64, 64, -64, -64, 64, -64, -64, -64, 64, 64, -64, 64, -64, 64, 64, 64, 64, 64, 64, 64, 64, -64, -64, -64, -64, -64, -64, -64, 64, 64, 64, 64, 64, -64, 64, -64, -64, -64, 64, 64, -64, -64, 64, 64, 64, 64, 64, 64, 64, -64, 64, -64, 64, 64, -64, -64, 64, -64, -64, 64, -64, -64, 64, -64, 64, 64, 64, -64, -64, 64, 64, 64, 64, 64, -64, -64, -64, 64, 64, -64, -64, 64, -64, -64, 64, 64, 64, -64, 64, -64, -64, 64, -64, 64, -64, -64, -64, 64, -64, 64, -64, -64, -64, 64, 64, -64, 64, -64, -64, -64, -64, 64, 64, 64, -64, -64, -64, 64, 64, -64, 64, -64, 64, -64, -64, 64, 64, 64, 64, 64, 64, 64, 64, -64, 64, 64, 64, -64, -64, 64, 64, 64, -64, 64, -64, 64, -64, -64, 64, -64, 64, -64, -64, 64, -64, 64, 64, -64, 64, 64, 64, -64, -64, -64, 64, -64, 64, -64, -64, 64, 64, 64, 64, -64, 64, 64, -64, -64, -64, -64, -64, -64, 64, 64, 64, -64, -64, -64, -64, -64, -64, 64, 64, -64, -64, -64, 64, 64, 64, 64, 64, 64, 64, -64, -64, -64, 64, 64, 64, -64, -64, -64, -64, -64, -64, -64, -64, -64, -64, -64, -64, -64, -64, -64, -64, -64, 64, -64, -64, 64, 64, 64, -64, 64, -64, 64, -64, -64, 64, -64, -64, -64, -64, -64, -64, -64, -64, -64, -64, -64, -64, -64, 64, -64, 64, 64, 64, -64, -64, -64, -64, -64, -64, 64, 64, 64, 64, 64, -64, 64, 64, 64, -64, -64, -64, -64, -64, -64, -64, -64, -64, -64, 64, -64, -64, -64, -64, -64, 64, 64, -64, 64, 64, 64, 64, 64, -64, -64, 64, -64, 64, 64, -64, -64, -64, 64, 64, -64, 64, 64, -64, 64, -64, 64, -64, 64, 64, 64, 64, -64, -64, 64, -64, -64, 64, -64, 64, -64, 64, 64, -64, 64, 64, -64, -64, -64, -64, 64, 64, -64, 64, 64, 64, 64, 64, 64, 64, -64, 64, 64, 64, -64, 64, 64, 64, 64, -64, -64, -64, -64, -64, -64, 64, 64, 64, 64, 64, -64, 64, 64, -64, 64, -64, 64, 64, -64, 64, -64, 64, -64, 64, 64, -64, -64, -64, 64, -64, -64, 64, 64, 64, -64, 64, -64, 64, -64, 64, 64, -64, 64, -64, 64, -64, -64, 64, 64, 64, -64, -64, 64, -64, -64, -64, 64, 64, -64, -64, 64, 64, -64, 64, 64, -64, 64, -64, -64, 64, 64, -64, 64, -64, -64, 64, 64, 64, 64, -64, -64, 64, -64, 64, -64, 64, -64, -64, 64, -64, -64, 64, -64, -64, 64, 64, 64, -64, 64, 64, 64, 64, -64, -64, -64, 64, 64, -64, -64, -64, -64, -64, 64, -64, -64, 64, 64, 64, -64, -64, -64, 64, 64, -64, 64, 64, 64, 64, -64, 64, 64, -64, -64, -64, 64, 64, -64, 64, -64, -64, 64, 64, 64, -64, 64, -64, 64, 64, 64, -64, -64, 64, 64, -64, -64, 64, 64, 64, -64, -64, 64, -64, 64, 64, -64, 64, -64, -64, -64, 64, -64, -64, -64, -64, -64, 64, -64, 64, -64, -64, -64, -64, 64, 64, -64, 64, -64, 64, -64, 64, -64, -64, 64, -64, -64, 64, 64, 64, -64, -64, -64, -64, -64, 64, -64, -64, 64, 64, -64, -64, -64, -64, -64, 64, 64, -64, -64, 64, 64, -64, -64, -64, -64, -64, 64, -64, 64, -64, 64, -64, -64, -64, 64, -64, -64, -64, -64, -64, -64, 64, -64, 64, -64, 64, -64, 64, -64, 64, -64, 64, 64, -64, -64, 64, -64, 64, -64, 64, -64, 64, 64, 64, -64, -64, 64, -64, 64, 64, 64, 64, 64, -64, 64, -64, -64, -64, -64, -64, 64, -64, -64, -64, 64, -64, -64, 64, -64, -64, 64, -64, 64, -64, 64, -64, 64, -64, 64, 64, 64, 64, -64, -64, -64, -64, -64, 64, -64, 64, 64, -64, 64, -64, -64, -64, -64, 64, -64, 64, -64, -64, 64, 64, 64, -64, 64, 64, -64, 64, 64, 64, -64, -64, -64, -64, 64, -64, -64, -64, 64, 64, -64, -64, 64, -64, 64, 64, 64, 64, -64, 64, 64, -64, -64, -64, 64, -64, -64, -64, 64, -64, -64, 64, -64, -64, -64, -64, -64, -64, 64, 64, -64, -64, -64, -64, -64, 64, -64, 64, 64, 64, 64, -64, 64, -64, -64, -64, -64, -64, -64, 64, 64, -64, -64, -64, -64, 64, -64, 64, 64, -64, -64, -64, -64, 64, -64, -64, 64, -64, -64, 64, -64, -64, -64, 64, 64, 64, -64, -64, -64, -64, -64, -64, -64, -64, -64, 64, -64, 64, 64, 64, 64, -64, -64, 64, -64, -64, -64, 64, -64, -64, 64, -64, -64, -64, 64, -64, 64, 64, -64, -64, 64, 64, -64, -64, -64, -64, -64, 64, -64, -64, -64, 64, -64, -64, -64, -64, -64, -64, -64, 64, -64, 64, -64, -64, 64, 64, 64, -64, 64, 64, -64, -64, -64, -64, -64, 64, -64, 64, -64, -64, 64, -64, 64, -64, 64, -64, -64, -64, -64, -64, 64, -64, -64, 64, -64, -64, -64, -64, -64, -64, -64, 64, 64, -64, 64, -64, 64, -64, -64, -64, 64, 64, -64, -64, -64, -64, 64, -64, -64, -64, 64, -64, -64, -64, 64, -64, -64, -64, 64, -64, 64, 64, 64, -64, -64, 64, 64, 64, 64, 64, -64, 64, -64, 64, -64, 64, -64, -64, 64, -64, -64, -64, 64, -64, -64, -64, -64, 64, -64, -64, -64, 64, -64, -64, 64, -64, 64, 64, -64, -64, -64, 64, -64, -64, -64, -64, 64, -64, -64, -64, -64, -64, -64, -64, 64, 64, -64, 64, 64, 64, 64, -64, 64, -64, 64, 64, -64, 64, -64, -64, 64, -64, 64, -64, -64, 64, -64, -64, -64, 64, -64, 64, -64, -64, 64, -64, 64, 64, -64, 64, 64, -64, 64, -64, -64, 64, 64, -64, -64, -64, 64, 64, 64, 64, -64, -64, 64, 64, -64, -64, 64, -64, 64, 64, 64, 64, 64, 64, 64, -64, -64, 64, -64, -64, 64, -64, -64, -64, 64, 64, -64, -64, 64, 64, -64, -64, 64, -64, 64, 64, -64, 64, 64, 64, -64, -64, -64, 64, -64, 64, 64, -64, 64, 64, 64, 64, 64, 64, -64, -64, 64, -64, -64, -64, 64, 64, -64, -64, 64, -64, 64, 64, -64, 64, 64, 64, -64, 64, -64, 64, -64, -64, -64, 64, 64, 64, 64, 64, 64, 64, -64, -64, -64, 64, -64, 64, -64, -64, -64, 64, 64, -64, 64, -64, 64, 64, -64, 64, -64, 64, -64, 64, 64, -64, -64, -64, 64, -64, 64, -64, 64, -64, 64, 64, 64, -64, -64, 64, 64, -64, 64, 64, 64, -64, -64, 64, 64, -64, -64, 64, -64, 64, 64, -64, -64, -64, -64, -64, -64, 64, -64, -64, -64, 64, 64, 64, 64, -64, 64, -64, 64, 64, 64, -64, -64, 64, 64, -64, 64, 64, -64, -64, 64, -64, 64, -64, -64, 64, 64, -64, -64, -64, 64, 64, 64, 64, 64, -64, 64, -64, 64, 64, 64, -64, 64, 64, -64, -64, -64, -64, -64, 64, 64, -64, -64, 64, 64, 64, -64, 64, -64, -64, 64, 64, -64, 64, -64, -64, 64, 64, 64, -64, -64, -64, -64, -64, 64, -64, 64, 64, -64, 64, -64, -64, 64, -64, -64, 64, -64, -64, 64, 64, 64, 64, -64, 64, -64, -64, -64, -64, -64, -64, -64, 64, -64, 64, -64, -64, -64, -64, -64, 64, 64, -64, 64, 64, 64, 64, 64, 64, -64, 64, 64, 64, 64, -64, -64, -64, -64, -64, 64, -64, -64, -64, -64, -64, 64, 64, 64, -64, -64, 64, -64, -64, -64, -64, 64, 64, -64, -64, 64, -64, 64, -64, -64, -64, 64, -64, -64, 64, -64, -64, -64, -64, -64, -64, -64, -64, 64, -64, -64, -64, -64, 64, 64, -64, 64, 64, -64, -64, 64, -64, 64, -64, -64, -64, -64, 64, 64, -64, 64, -64, -64, -64, -64, -64, -64, -64, 64, -64, 64, 64, -64, -64, -64, 64, 64, 64, 64, 64, 64, 64, 64, 64, -64, -64, 64, -64, 64, -64, -64, 64, -64, 64, -64, 64, -64, -64, 64, 64, 64, 64, -64, 64, 64, 64, 64, 64, -64, 64, 64, 64, 64, 64, -64, -64, -64, -64, -64, 64, 64, -64, -64, 64, 64, 64, -64, -64, -64, -64, 64, -64, 64, 64, 64, 64, 64, 64, -64, 64, 64, -64, 64, -64, -64, -64, 64, 64, -64, 64, -64, 64, 64, 64, -64, 64, 64, -64, -64, 64, -64, 64, 64, 64, -64, -64, -64, -64, 64, 64, 64, -64, -64, -64, -64, -64, 64, -64, 64, 64, 64, 64, 64, 64, 64, -64, 64, 64, 64, -64, -64, -64, -64, -64, -64, 64, -64, -64, -64, -64, -64, -64, 64, -64, 64, -64, -64, -64, 64, 64, 64, 64, 64, 64, -64, 64, -64, 64, -64, 64, -64, -64, -64, -64, 64, -64, -64, 64, 64, 64, 64, 64, -64, -64, -64, 64, 64, 64, 64, -64, -64, -64, -64, 64, -64, -64, -64, -64, -64, -64, 64, -64, -64, -64, -64, -64, -64, 64, -64, -64, -64, -64, -64, 64, 64, 64, 64, 64, 64, -64, 64, 64, -64, -64, -64, 64, -64, -64, -64, 64, -64, -64, -64, -64, -64, -64, -64, -64, -64, -64, -64, -64, 64, 64, -64, 64, -64, 64, 64, 64, -64, 64, 64, -64, -64, 64, -64, 64, -64, -64, 64, -64, -64, -64, 64, -64, 64, -64, -64, 64, -64, 64, 64, 64, 64, 64, -64, 64, 64, 64, 64, -64, -64, -64, 64, -64, -64, -64, -64, -64, -64, -64, -64, 64, -64, -64, -64, 64, -64, 64, -64, -64, -64, -64, -64, -64, -64, -64, -64, 64, 64, -64, -64, -64, 64, -64, -64, -64, -64, -64, -64, -64, -64, -64, -64, -64, -64, -64, -64, -64, 64, 64, -64, 64, -64, 64, -64, 64, -64, -64, 64, 64, -64, -64, 64, -64, -64, -64, -64, -64, -64, 64, 64, 64, -64, -64, -64, -64, 64, -64, 64, -64, -64, -64, -64, -64, 64, -64, 64, -64, 64, -64, -64, -64, -64, -64, -64, -64, 64, 64, 64, -64, -64, 64, -64, 64, 64, 64, -64, 64, 64, -64, 64, 64, -64, -64, 64, -64, 64, 64, -64, -64, 64, -64, 64, 64, 64, 64, -64, -64, -64, 64, 64, -64, 64, -64, 64, 64, 64, 64, 64, -64, -64, -64, 64, -64, -64, -64, 64, -64, -64, 64, 64, 64, 64, 64, -64, -64, -64, -64, -64, -64, 64, -64, 64, -64, 64, 64, -64, -64, -64, -64, -64, -64, -64, 64, -64, -64, 64, -64, 64, 64, 64, -64, -64, -64, 64, -64, -64, -64, -64, 64, 64, -64, 64, -64, -64, -64, -64, -64, -64, 64, 64, 64, 64, 64, 64, 64, 64, 64, 64, -64, -64, -64, 64, -64, 64, -64, -64, 64, -64, 64, 64, -64, 64, -64, 64, -64, 64, -64, 64, 64, 64, 64, 64, 64, 64, 64, 64, -64, -64, -64, -64, 64, 64, -64, 64, 64, -64, 64, -64, -64, 64, -64, 64, -64, -64, 64, -64, 64, 64, -64, -64, 64, -64, -64, 64, -64, 64, 64, 64, -64, 64, 64, -64, 64, 64, -64, 64, -64, 64, -64, 64, 64, -64, 64, -64, 64, 64, 64, 64, 64, -64, -64, -64, 64, 64, 64, -64, 64, 64, -64, -64, -64, 64, 64, 64, -64, 64, 64, -64, 64, 64, -64, -64, 64, -64, 64, 64, 64, -64, -64, 64, 64, 64, -64, 64, 64, 64, -64, -64, -64, -64, -64, -64, -64, 64, 64, -64, -64, 64, -64, 64, 64, 64, -64, 64, 64, -64, -64, -64, -64, -64, 64, -64, -64, -64, -64, 64, 64, -64, 64, 64, -64, -64, 64, 64, -64, -64, -64, 64, -64, -64, -64, -64, 64, -64, 64, -64, 64, -64, -64, -64, -64, -64, -64, -64, -64, 64, 64, -64, -64, 64, -64, -64, -64, -64, -64, -64, -64, 64, -64, -64, 64, -64, 64, 64, -64, 64, -64, -64, -64, -64, -64, -64, -64, -64, 64, 64, -64, 64, -64, 64, -64, 64, 64, 64, 64, 64, 64, -64, 64, -64, 64, 64, 64, -64, -64, -64, -64, -64, -64, -64, 64, 64, -64, 64, -64, 64, 64, 64, 64, -64, 64, -64, 64, -64, -64, 64, 64, 64, 64, 64, 64, -64, -64, -64, -64, -64, -64, 64, -64, 64, 64, 64, -64, -64, -64, 64, 64, 64, 64, 64, 64, 64, 64, 64, 64, 64, -64, 64, 64, -64, 64, -64, -64, -64, 64, 64, -64, 64, 64, -64, -64, -64, 64, 64, 64, 64, 64, 64, 64, 64, -64, 64, 64, 64, 64, 64, 64, 64, 64, -64, -64, -64, 64, 64, 64, -64, -64, -64, 64, 64, 64, 64, 64, 64, 64, 64, 64, 64, 64, 64, 64, 64, 64, 64, 64, 64, 64, -64, -64, 64, -64, 64, -64, -64, -64, 64, -64, -64, 64, 64, 64, 64, 64, 64, 64, 64, 64, 64, 64, 64, 64, 64, 64, 64, 64, 64, 64, -64, -64, -64, -64, -64, -64, 64, -64, 64, 64, 64, 64, -64, 64, 64, 64, 64, -64, 64, 64, 64, 64, 64, 64, 64, 64, -64, -64, -64, -64, -64, -64, -64, -64, 64, 64, 64, 64, 64, 64, 64, -64, -64, 64, 64, -64, -64, 64, 64, 64, 64, 64, 64, 64, -64, -64, 64, -64, 64, -64, 64, 64, -64, 64, 64, 64, 64, 64, 64, -64, 64, 64, 64, -64, -64, 64, 64, 64, 64, 64, 64, 64, 64, 64, -64, -64, -64, 64, 64, -64, 64, 64, 64, -64, 64, 64, 64, 64, 64, 64, 64, -64, 64, -64, 64, 64, -64, 64, 64, 64, 64, 64, -64, 64, 64, 64, -64, 64, 64, 64, 64, -64, 64, 64, -64, -64, -64, -64, 64, 64, -64, 64, 64, 64, -64, 64, 64, 64, 64, 64, -64, 64, -64, 64, -64, 64, -64, 64, 64, 64, 64, 64, -64, -64, -64, -64, 64, 64, 64, 64, 64, 64, 64, 64, 64, 64, -64, 64, 64, 64, -64, 64, -64, 64, -64, 64, -64, 64, 64, 64, -64, -64, 64, 64, 64, 64, -64, 64, 64, 64, 64, -64, 64, -64, 64, -64, -64, 64, 64, 64, -64, 64, 64, 64, -64, 64, 64, -64, 64, 64, 64, 64, -64, 64, 64, -64, 64, 64, 64, -64, -64, 64, 64, 64, -64, -64, -64, 64, -64, -64, 64, 64, -64, 64, 64, 64, -64, -64, 64, 64, 64, 64, -64, -64, -64, 64, -64, 64, -64, -64, -64, 64, 64, 64, 64, -64, -64, -64, -64, 64, 64, 64, 64, 64, 64, 64, 64, 64, 64, -64, -64, -64, 64, 64, -64, 64, -64, -64, -64, -64, -64, 64, 64, -64, -64, 64, -64, -64, 64, 64, -64, 64, -64, -64, -64, 64, -64, -64, -64, -64, -64, 64, 64, 64, 64, -64, -64, 64, 64, -64, -64, 64, -64, 64, 64, -64, 64, -64, -64, -64, 64, 64, -64, -64, -64, -64, 64, 64, 64, 64, 64, 64, 64, -64, -64, -64, 64, 64, 64, -64, -64, -64, -64, 64, 64, -64, -64, -64, -64, 64, 64, 64, 64, 64, 64, 64, 64, 64, 64, 64, 64, -64, 64, -64, -64, -64, -64, 64, -64, -64, 64, 64, -64, -64, -64, -64, 64, -64, 64, 64, 64, 64, 64, 64, 64, -64, -64, -64, -64, -64, 64, -64, -64, 64, 64, 64, 64, -64, -64, -64, -64, 64, -64, -64, -64, 64, -64, 64, 64, 64, -64, 64, -64, -64, -64, -64, 64, -64, -64, 64, -64, 64, -64, 64, -64, 64, 64, 64, 64, 64, -64, 64, 64, 64, -64, 64, -64, 64, 64, 64, -64, 64, 64, -64, -64, 64, -64, 64, -64, 64, -64, 64, 64, -64, -64, 64, -64, -64, 64, -64, 64, 64, -64, 64, 64, -64, 64, 64, -64, 64, -64, -64, 64, 64, -64, 64, -64, -64, 64, -64, 64, -64, -64, -64, 64, -64, 64, -64, -64, -64, -64, 64, 64, -64, 64, 64, -64, -64, -64, 64, -64, -64, -64, 64, -64, -64, 64, 64, -64, -64, 64, 64, -64, 64, -64, 64, -64, 64, 64, 64, 64, 64, 64, 64, 64, -64, -64, -64, -64, 64, 64, -64, 64, -64, -64, -64, -64, -64, 64, -64, -64, -64, 64, -64, 64, 64, 64, 64, 64, 64, 64, 64, -64, -64, -64, 64, -64, -64, -64, 64, 64, -64, 64, 64, 64, -64, 64, 64, -64, -64, 64, -64, -64, 64, 64, -64, -64, 64, 64, 64, 64, 64, 64, 64, -64, -64, 64, -64, -64, 64, -64, -64, 64, -64, 64, 64, -64, -64, -64, 64, 64, -64, -64, -64, -64, -64, -64, -64, -64, -64, 64, 64, -64, -64, 64, 64, -64, -64, -64, 64, -64, -64, -64, 64, -64, -64, -64, -64, -64, -64, -64, -64, -64, -64, -64, -64, -64, 64, 64, 64, 64, -64, -64, 64, -64, -64, -64, -64, -64, 64, 64, -64, -64, -64, -64, -64, -64, -64, -64, -64, -64, -64, -64, 64, -64, -64, 64, 64, -64, 64, -64, -64, 64, 64, 64, -64, -64, 64, 64, -64, -64, -64, -64, -64, -64, -64, 64, 64, 64, 64, 64, 64, -64, 64, -64, 64, -64, -64, -64, 64, -64, -64, -64, 64, 64, -64, -64, 64, -64, -64, -64, -64, 64, 64, 64, -64, 64, 64, 64, 64, 64, -64, -64, -64, -64, -64, -64, -64, -64, 64, 64, -64, 64, -64, 64, -64, 64, -64, -64, -64, 64, 64, 64, -64, -64, 64, -64, -64, 64, -64, -64, -64, -64, -64, -64, -64, -64, -64, -64, -64, -64, -64, -64, -64, -64, 64, 64, -64, 64, 64, 64, -64, -64, -64, -64, 64, 64, -64, -64, -64, -64, -64, -64, 64, -64, 64, -64, -64, -64, -64, 64, -64, 64, 64, -64, -64, -64, 64, -64, -64, -64, -64, -64, 64, -64, -64, -64, -64, -64, -64, -64, -64, -64, 64, -64, 64, -64, 64, 64, -64, 64, 64, -64, -64, -64, 64, -64, -64, -64, -64, -64, -64, -64, -64, -64, -64, -64, -64, -64, 64, 64, 64, 64, -64, -64, -64, 64, 64, 64, 64, 64, -64, -64, -64, -64, -64, -64, -64, -64, -64, -64, -64, -64, -64, -64, -64, -64, -64, 64, 64, 64, 64, 64, 64, -64, -64, 64, 64, 64, -64, 64, 64, -64, -64, -64, -64, -64, -64, -64, 64, 64, -64, -64, -64, -64, -64, 64, 64, 64, -64, -64, 64, 64, -64, 64, -64, -64, -64, -64, -64, -64, -64, -64, -64, -64, 64, -64, 64, 64, 64, -64, -64, -64, -64, 64, -64, 64, -64, -64, 64, 64, -64, 64, -64, 64, 64, -64, 64, 64, 64, -64, -64, 64, -64, -64, -64, -64, -64, -64, -64, -64, 64, 64, -64, -64, 64, -64, 64, 64, -64, 64, -64, -64, -64, 64, -64, -64, 64, 64, 64, 64, -64, 64, -64, -64, -64, -64, -64, -64, 64, 64, -64, 64, 64, 64, -64, -64, -64, -64, -64, -64, -64, 64, -64, 64, 64, 64, 64, -64, -64, 64, 64, -64, -64, -64, -64, 64, 64, 64, 64, -64, 64, -64, 64, 64, 64, -64, 64, -64, 64, -64, 64, 64, 64, 64, -64, -64, -64, 64, 64, -64, -64, -64, -64, -64, 64, 64, 64, -64, 64, -64, -64, -64, 64, 64, 64, -64, -64, 64, 64, -64, -64, -64, -64, 64, -64, 64, -64, -64, -64, -64, -64, 64, 64, 64, 64, 64, -64, -64, -64, 64, -64, 64, -64, 64, -64, 64, -64, -64, -64, 64, 64, -64, -64, -64, -64, -64, -64, -64, -64, -64, 64, -64, -64, -64, -64, -64, -64, 64, 64, -64, -64, -64, -64, -64, -64, 64, -64, -64, -64, -64, -64, -64, -64, -64, 64, -64, -64, -64, -64, -64, -64, -64, -64, 64, -64, 64, -64, -64, -64, -64, 64, 64, -64, -64, -64, -64, -64, -64, -64, -64, 64, 64, -64, -64, 64, 64, 64, -64, 64, -64, 64, -64, 64, -64, 64, 64, 64, -64, -64, -64, -64, -64, 64, 64, -64, 64, 64, 64, -64, -64, 64, -64, -64, 64, 64, 64, 64, 64, -64, -64, 64, 64, 64, -64, 64, -64, 64, -64, 64, 64, 64, 64, -64, 64, 64, 64, 64, 64, 64, -64, 64, 64, -64, 64, -64, -64, 64, -64, 64, -64, 64, -64, 64, -64, 64, -64, 64, -64, -64, 64, 64, 64, 64, 64, -64, 64, -64, -64, 64, -64, 64, -64, -64, -64, -64, 64, 64, -64, 64, 64, 64, 64, -64, 64, -64, 64, -64, -64, -64, -64, 64, 64, 64, 64, -64, 64, -64, -64, 64, -64, 64, -64, 64, -64, -64, 64, -64, 64, -64, 64, -64, 64, 64, 64, -64, -64, -64, -64, 64, 64, 64, -64, -64, -64, 64, 64, 64, -64, 64, 64, -64, -64, 64, -64, 64, -64, -64, 64, -64, -64, 64, 64, -64, -64, -64, -64, -64, -64, 64, 64, 64, 64, -64, -64, 64, 64, -64, 64, -64, 64, -64, 64, 64, -64, 64, 64, -64, -64, 64, -64, 64, -64, 64, 64, -64, 64, -64, -64, -64, -64, -64, 64, -64, -64, -64, 64, 64, -64, 64, -64, -64, -64, 64, 64, 64, -64, 64, -64, -64, -64, 64, -64, 64, 64, -64, -64, 64, 64, 64, -64, -64, 64, 64, 64, 64, -64, 64, -64, 64, 64, -64, -64, -64, -64, 64, -64, -64, -64, 64, 64, 64, 64, 64, -64, -64, -64, -64, -64, 64, -64, -64, -64, -64, -64, -64, 64, 64, -64, 64, 64, 64, -64, -64, 64, -64, 64, -64, 64, 64, -64, 64, 64, 64, 64, 64, 64, -64, 64, 64, 64, -64, 64, -64, 64, 64, 64, 64, 64, 64, 64, 64, 64, 64, 64, 64, -64, 64, 64, -64, -64, -64, 64, -64, -64, -64, -64, 64, 64, -64, -64, 64, -64, -64, -64, 64, -64, -64, 64, 64, -64, -64, 64, -64, -64, 64, -64, -64, 64, -64, 64, -64, -64, -64, 64, 64, 64, -64, -64, 64, -64, -64, 64, 64, -64, 64, -64, 64, -64, 64, -64, 64, 64, -64, 64, 64, 64, 64, 64, -64, 64, 64, 64, 64, 64, -64, -64, -64, 64, -64, 64, 64, 64, 64, 64, 64, 64, 64, 64, 64, 64, 64, -64, 64, 64, 64, -64, -64, 64, -64, -64, -64, -64, 64, 64, -64, -64, 64, 64, 64, 64, -64, 64, 64, 64, 64, 64, -64, 64, 64, -64, -64, -64, 64, 64, 64, 64, -64, 64, 64, -64, 64, -64, 64, 64, -64, 64, -64, -64, -64, 64, 64, 64, 64, 64, 64, 64, 64, -64, -64, 64, 64, 64, 64, -64, 64, -64, 64, 64, 64, 64, 64, -64, 64, -64, 64, 64, 64, -64, 64, 64, -64, -64, -64, 64, 64, 64, -64, 64, 64, -64, 64, 64, -64, 64, -64, -64, 64, -64, 64, 64, 64, 64, 64, 64, 64, -64, -64, 64, 64, 64, 64, 64, -64, 64, 64, 64, -64, -64, 64, 64, 64, 64, -64, -64, 64, 64, 64, -64, -64, 64, 64, -64, 64, 64, 64, 64, 64, 64, 64, -64, -64, 64, -64, 64, 64, -64, -64, -64, 64, -64, 64, -64, 64, 64, -64, 64, 64, 64, -64, 64, 64, 64, 64, 64, -64, 64, 64, 64, -64, 64, -64, -64, -64, -64, -64, 64, 64, -64, 64, 64, 64, -64, -64, -64, 64, 64, 64, 64, 64, 64, -64, 64, 64, -64, -64, -64, 64, 64, 64, -64, 64, -64, 64, 64, -64, 64, -64, 64, -64, 64, -64, 64, -64, 64, 64, 64, 64, 64, 64, -64, -64, 64, 64, 64, 64, 64, 64, 64, 64, -64, -64, 64, 64, -64, 64, -64, 64, -64, -64, 64, -64, 64, -64, -64, 64, -64, 64, -64, 64, 64, -64, 64, 64, 64, 64, 64, 64, 64, 64, 64, 64, -64, -64, 64, 64, 64, -64, 64, 64, 64, -64, 64, -64, -64, 64, 64, -64, -64, 64, 64, 64, 64, -64, 64, -64, 64, -64, 64, -64, -64, 64, -64, 64, -64, 64, -64, 64, 64, 64, -64, 64, 64, -64, -64, -64, -64, 64, 64, 64, -64, 64, -64, 64, 64, -64, -64, 64, -64, -64, -64, 64, 64, -64, 64, -64, 64, -64, 64, 64, 64, 64, 64, 64, -64, 64, 64, 64, 64, -64, 64, 64, 64, -64, -64, 64, 64, 64, -64, 64, 64, 64, -64, -64, -64, -64, 64, -64, 64, -64, -64, 64, 64, 64, 64, 64, -64, 64, 64, -64, 64, -64, -64, 64, 64, -64, -64, -64, 64, -64, 64, 64, 64, -64, 64, 64, -64, -64, -64, 64, 64, 64, 64, 64, 64, -64, -64, 64, -64, -64, 64, 64, -64, 64, 64, -64, -64, -64, 64, -64, 64, -64, -64, 64, 64, 64, 64, 64, 64, 64, 64, -64, -64, -64, 64, 64, -64, 64, -64, 64, 64, -64, -64, 64, 64, 64, -64, -64, -64, -64, 64, 64, 64, -64, 64, 64, 64, -64, -64, 64, 64, 64, 64, -64, -64, -64, 64, -64, 64, 64, 64, 64, -64, -64, 64, -64, -64, 64, -64, 64, 64, -64, 64, -64, 64, -64, 64, -64, 64, -64, -64, 64, 64, -64, -64, 64, 64, -64, 64, -64, -64, 64, 64, 64, 64, -64, 64, 64, 64, 64, 64, 64, 64, 64, 64, -64, 64, -64, 64, -64, 64, -64, -64, 64, -64, -64, 64, 64, 64, -64, 64, -64, -64, 64, -64, 64, -64, 64, -64, 64, 64, 64, 64, 64, -64, -64, 64, -64, 64, -64, 64, 64, -64, 64, -64, 64, -64, 64, -64, -64, 64, 64, -64, 64, 64, 64, 64, -64, 64, -64, -64, -64, -64, -64, 64, -64, -64, 64, 64, 64, -64, 64, -64, 64, 64, -64, 64, -64, 64, -64, -64, -64, 64, 64, 64, -64, -64, 64, -64, 64, -64, -64, -64, 64, -64, 64, -64, -64, -64, -64, -64, 64, 64, -64, 64, -64, 64, -64, -64, -64, -64, 64, 64, 64, 64, 64, 64, -64, -64, 64, 64, -64, -64, -64, -64, -64, -64, 64, 64, 64, -64, -64, 64, 64, 64, -64, -64, 64, 64, 64, 64, 64, 64, -64, -64, 64, -64, 64, 64, 64, -64, -64, -64, -64, -64, 64, -64, 64, 64, -64, -64, -64, -64, -64, -64, -64, -64, 64, 64, 64, 64, 64, 64, -64, 64, 64, -64, 64, -64, -64, 64, -64, -64, -64, -64, -64, 64, 64, 64, -64, 64, -64, -64, -64, -64, 64, 64, 64, 64, 64, 64, 64, -64, 64, -64, -64, 64, -64, 64, 64, 64, -64, -64, -64, -64, 64, -64, -64, -64, -64, -64, 64, 64, 64, -64, 64, 64, -64, -64, 64, -64, -64, 64, 64, 64, 64, 64, -64, -64, 64, 64, -64, -64, 64, -64, -64, -64, 64, -64, 64, 64, -64, 64, 64, -64, -64, 64, -64, -64, 64, -64, -64, -64, 64, -64, -64, 64, -64, -64, -64, 64, -64, -64, -64, 64, 64, -64, -64, 64, 64, 64, -64, -64, -64, -64, -64, -64, 64, 64, -64, -64, -64, 64, -64, 64, -64, -64, -64, 64, -64, -64, 64, 64, 64, 64, 64, 64, -64, -64, -64, -64, -64, -64, -64, -64, -64, -64, 64, 64, 64, 64, 64, -64, -64, -64, -64, 64, 64, 64, 64, 64, 64, 64, 64, 64, -64, -64, -64, -64, -64, -64, -64, -64, -64, -64, 64, 64, 64, 64, -64, -64, 64, -64, 64, -64, -64, 64, 64, 64, 64, 64, -64, -64, -64, -64, -64, -64, -64, -64, -64, -64, -64, -64, -64, 64, 64, 64, -64, 64, -64, 64, 64, 64, -64, -64, 64, 64, 64, 64, -64, 64, -64, -64, -64, -64, -64, -64, -64, -64, -64, -64, 64, 64, 64, -64, -64, -64, 64, 64, -64, -64, -64, -64, -64, 64, -64, -64, -64, -64, -64, -64, -64, -64, -64, -64, -64, -64, -64, 64, 64, 64, 64, 64, -64, 64, -64, -64, -64, -64, -64, -64, 64, 64, 64, 64, -64, -64, -64, -64, -64, -64, -64, -64, -64, -64, -64, -64, 64, 64, 64, 64, -64, 64, 64, 64, 64, 64, -64, -64, 64, 64, 64, 64, 64, -64, -64, -64, -64, -64, -64, -64, -64, -64, -64, 64, 64, 64, 64, 64, 64, -64, -64, -64, 64, 64, -64, -64, 64, 64, 64, 64, 64, 64, -64, -64, -64, -64, -64, -64, -64, 64, -64, -64, 64, 64, 64, 64, -64, 64, -64, -64, -64, 64, -64, -64, 64, 64, -64, 64, 64, -64, 64, -64, -64, -64, -64, -64, -64, -64, 64, -64, 64, 64, -64, 64, -64, -64, -64, -64, 64, -64, -64, -64, 64, -64, -64, 64, -64, 64, 64, 64, -64, 64, -64, -64, -64, 64, 64, -64, 64, 64, -64, -64, -64, 64, -64, 64, 64, -64, 64, -64, 64, 64, 64, 64, -64, 64, 64, -64, 64, -64, -64, -64, 64, 64, -64, 64, 64, 64, 64, 64, -64, -64, -64, -64, -64, 64, -64, -64, 64, 64, 64, 64, 64, -64, 64, 64, 64, -64, -64, 64, -64, -64, -64, -64, 64, 64, 64, -64, 64, 64, 64, 64, 64, -64, 64, 64, -64, -64, -64, -64, -64, -64, 64, 64, 64, 64, 64, 64, -64, -64, -64, 64, 64, -64, -64, -64, 64, -64, 64, 64, -64, -64, 64, -64, -64, 64, 64, 64, -64, 64, 64, 64, 64, -64, 64, 64, 64, 64, 64, 64, 64, -64, -64, 64, -64, -64, 64, 64, 64, -64, 64, 64, -64, -64, -64, -64, 64, -64, -64, -64, -64, -64, -64, 64, 64, -64, -64, 64, 64, -64, 64, -64, -64, -64, -64, 64, -64, -64, 64, -64, 64, -64, 64, -64, -64, -64, -64, -64, -64, -64, 64, 64, -64, -64, -64, 64, 64, 64, 64, 64, -64, 64, 64, 64, -64, 64, 64, 64, 64, 64, -64, -64, 64, 64, 64, 64, 64, -64, -64, -64, -64, 64, -64, -64, 64, 64, -64, 64, 64, 64, -64, -64, 64, 64, -64, -64, -64, 64, 64, 64, 64, -64, 64, 64, -64, 64, 64, 64, -64, 64, -64, -64, -64, -64, 64, 64, 64, 64, 64, 64, 64, -64, 64, 64, -64, -64, -64, 64, 64, -64, -64, -64, -64, -64, -64, -64, 64, -64, 64, 64, 64, -64, -64, 64, 64, 64, -64, -64, 64, 64, 64, -64, -64, 64, -64, -64, -64, -64, 64, 64, 64, -64, 64, -64, 64, 64, -64, -64, 64, -64, -64, -64, -64, 64, -64, -64, -64, -64, 64, 64, 64, -64, -64, -64, 64, 64, 64, 64, -64, 64, -64, -64, -64, -64, -64, 64, -64, 64, -64, -64, -64, -64, -64, 64, 64, -64, 64, 64, -64, -64, 64, 64, 64, 64, 64, 64, 64, 64, -64, -64, 64, -64, 64, 64, 64, -64, 64, -64, -64, 64, -64, 64, -64, -64, -64, 64, 64, 64, -64, 64, 64, 64, 64, 64, 64, 64, -64, -64, -64, 64, 64, -64, 64, -64, 64, 64, -64, 64, -64, -64, -64, 64, 64, 64, 64, 64, 64, 64, 64, 64, 64, 64, 64, 64, 64, -64, -64, -64, -64, -64, -64, -64, 64, 64, 64, -64, 64, 64, 64, -64, -64, 64, 64, 64, 64, 64, 64, 64, 64, 64, 64, -64, 64, -64, -64, -64, -64, -64, -64, -64, 64, 64, 64, -64, 64, -64, -64, -64, 64, 64, 64, 64, 64, 64, 64, 64, 64, 64, -64, 64, -64, 64, -64, -64, -64, -64, -64, -64, -64, 64, -64, -64, -64, 64, 64, 64, 64, 64, 64, 64, 64, 64, 64, 64, -64, -64, 64, -64, 64, 64, 64, 64, 64, -64, -64, -64, -64, 64, -64, 64, -64, 64, 64, -64, 64, 64, 64, 64, 64, -64, 64, -64, -64, -64, -64, 64, 64, 64, 64, 64, -64, -64, 64, -64, -64, 64, 64, 64, 64, -64, 64, 64, 64, 64, 64, 64, 64, -64, 64, 64, -64, -64, -64, -64, -64, -64, 64, 64, -64, 64, 64, -64, -64, 64, -64, 64, -64, -64, -64, 64, 64, 64, 64, 64, 64, -64, 64, -64, -64, -64, -64, -64, -64, -64, 64, -64, 64, 64, 64, -64, -64, 64, 64, 64, 64, -64, -64, 64, -64, 64, -64, -64, 64, 64, -64, 64, -64, -64, -64, -64, -64, -64, 64, -64, 64, 64, 64, 64, 64, 64, 64, 64, -64, -64, -64, 64, 64, -64, -64, 64, 64, 64, 64, 64, 64, 64, -64, -64, 64, 64, -64, 64, 64, 64, 64, 64, -64, 64, 64, 64, 64, 64, 64, 64, -64, -64, -64, -64, 64, 64, 64, 64, 64, -64, 64, 64, 64, 64, 64, 64, 64, -64, -64, 64, 64, 64, 64, 64, -64, 64, 64, 64, -64, -64, -64, -64, 64, 64, 64, 64, 64, -64, 64, 64, 64, 64, 64, 64, 64, -64, -64, -64, -64, 64, 64, 64, 64, 64, 64, -64, -64, -64, -64, -64, -64, -64, 64, 64, 64, -64, -64, 64, 64, -64, 64, 64, 64, 64, -64, 64, 64, 64, 64, 64, 64, 64, -64, -64, -64, 64, -64, -64, -64, -64, 64, 64, 64, 64, 64, 64, 64, -64, -64, 64, 64, 64, 64, 64, 64, 64, 64, 64, -64, -64, 64, -64, -64, 64, -64, -64, 64, 64, -64, 64, -64, -64, -64, 64, 64, -64, -64, -64, 64, 64, 64, 64, 64, 64, 64, 64, -64, -64, -64, -64, -64, -64, -64, -64, -64, -64, -64, 64, -64, 64, 64, 64, -64, -64, 64, 64, 64, 64, 64, 64, 64, 64, 64, 64, 64, -64, 64, -64, -64, -64, 64, 64, 64, 64, -64, 64, 64, 64, 64, -64, 64, 64, 64, 64, 64, 64, 64, 64, 64, 64, 64, 64, 64, -64, -64, 64, 64, 64, 64, 64, 64, -64, 64, 64, 64, -64, -64, -64, -64, 64, 64, 64, 64, 64, 64, 64, 64, 64, -64, 64, 64, 64, -64, -64, -64, -64, 64, 64, 64, -64, -64, -64, -64, -64, -64, -64, -64, -64, 64, 64, 64, 64, 64, 64, 64, -64, -64, 64, 64, 64, 64, 64, -64, -64, 64, -64, 64, 64, -64, -64, -64, -64, -64, -64, -64, -64, 64, 64, 64, 64, 64, 64, -64, -64, 64, -64, 64, -64, 64, 64, -64, 64, -64, -64, -64, 64, 64, 64, 64, -64, -64, -64, -64, 64, 64, 64, -64, 64, 64, -64, -64, -64, -64, -64, -64, -64, -64, -64, 64, 64, -64, -64, -64, -64, 64, -64, -64, -64, -64, -64, -64, 64, 64, 64, 64, 64, 64, -64, 64, 64, 64, -64, 64, 64, -64, 64, 64, -64, 64, 64, -64, 64, 64, -64, -64, -64, 64, 64, -64, -64, 64, -64, -64, -64, 64, 64, -64, -64, 64, -64, 64, -64, 64, -64, -64, 64, 64, 64, 64, 64, 64, -64, 64, -64, 64, -64, 64, -64, -64, -64, 64, 64, -64, 64, 64, -64, 64, -64, -64, -64, -64, -64, -64, -64, -64, -64, -64, -64, -64, -64, -64, 64, -64, 64, 64, -64, -64, -64, 64, 64, -64, -64, -64, -64, 64, 64, -64, 64, 64, -64, -64, 64, 64, 64, 64, -64, 64, -64, -64, -64, -64, 64, -64, 64, 64, 64, -64, 64, -64, -64, -64, -64, -64, 64, -64, -64, -64, 64, -64, 64, -64, 64, 64, -64, -64, 64, -64, -64, -64, -64, 64, -64, 64, -64, 64, 64, -64, -64, 64, -64, 64, 64, 64, 64, 64, -64, 64, 64, 64, -64, -64, -64, -64, 64, -64, 64, -64, -64, -64, -64, -64, -64, -64, -64, 64, 64, 64, 64, 64, 64, 64, 64, -64, 64, -64, -64, 64, -64, -64, 64, 64, 64, -64, -64, -64, -64, -64, -64, -64, -64, -64, -64, 64, 64, 64, -64, 64, -64, 64, 64, -64, 64, 64, -64, -64, 64, 64, 64, 64, 64, -64, -64, -64, -64, -64, -64, -64, -64, -64, -64, -64, 64, -64, -64, 64, -64, 64, -64, 64, -64, 64, 64, 64, -64, 64, -64, -64, 64, 64, -64, -64, -64, -64, -64, -64, -64, 64, -64, -64, -64, -64, 64, -64, -64, -64, 64, -64, -64, 64, 64, -64, 64, 64, -64, -64, -64, 64, -64, -64, -64, -64, -64, -64, -64, -64, -64, -64, -64, -64, -64, -64, -64, 64, 64, -64, 64, -64, 64, -64, -64, 64, 64, 64, -64, 64, -64, -64, -64, -64, -64, -64, -64, -64, -64, -64, -64, -64, -64, -64, -64, -64, -64, -64, 64, -64, -64, -64, 64, 64, -64, 64, 64, 64, 64, 64, 64, 64, -64, -64, -64, -64, -64, -64, -64, -64, -64, -64, -64, 64, 64, 64, -64, 64, -64, -64, 64, 64, -64, 64, 64, 64, 64, 64, 64, 64, 64, -64, -64, -64, -64, -64, 64, -64, -64, -64, 64, 64, 64, 64, 64, 64, -64, 64, 64, -64, 64, 64, 64, -64, 64, 64, 64, 64, 64, -64, 64, 64, -64, -64, -64, 64, -64, 64, 64, 64, -64, -64, 64, 64, 64, 64, 64, 64, -64, -64, -64, 64, -64, -64, 64, 64, 64, -64, 64, 64, -64, 64, 64, -64, -64, 64, 64, -64, -64, -64, 64, 64, 64, 64, -64, 64, -64, -64, -64, 64, -64, 64, -64, 64, -64, -64, -64, 64, -64, 64, 64, 64, 64, 64, -64, 64, 64, -64, -64, 64, -64, -64, 64, 64, -64, -64, -64, -64, -64, 64, 64, -64, 64, 64, -64, -64, 64, 64, 64, 64, 64, 64, 64, 64, -64, 64, 64, 64, 64, -64, 64, -64, -64, -64, 64, -64, 64, 64, -64, 64, 64, 64, -64, 64, 64, 64, 64, 64, 64, 64, -64, -64, 64, -64, -64, -64, -64, 64, -64, -64, -64, 64, 64, 64, 64, -64, 64, -64, -64, 64, 64, 64, 64, 64, 64, 64, -64, 64, -64, 64, 64, 64, 64, 64, -64, 64, 64, -64, -64, -64, -64, -64, 64, -64, -64, -64, -64, -64, 64, 64, 64, 64, 64, -64, -64, -64, 64, 64, -64, -64, -64, 64, -64, -64, 64, -64, 64, -64, -64, -64, -64, -64, -64, -64, -64, 64, 64, 64, -64, 64, -64, -64, -64, -64, 64, 64, 64, -64, -64, -64, 64, 64, -64, -64, -64, 64, -64, -64, -64, -64, -64, -64, -64, 64, 64, -64, -64, 64, 64, -64, -64, -64, -64, -64, -64, -64, -64, 64, 64, -64, 64, 64, -64, -64, -64, -64, -64, -64, -64, -64, -64, -64, -64, -64, 64, 64, 64, -64, -64, -64, 64, -64, 64, 64, 64, -64, -64, 64, -64, -64, -64, -64, -64, -64, 64, -64, -64, -64, -64, -64, -64, 64, 64, 64, 64, -64, -64, -64, 64, 64, 64, 64, -64, 64, 64, -64, -64, -64, -64, -64, -64, -64, -64, -64, -64, 64, -64, -64, -64, 64, -64, 64, -64, 64, -64, -64, 64, -64, -64, 64, -64, 64, 64, -64, 64, 64, -64, 64, -64, -64, 64, -64, 64, -64, -64, 64, -64, 64, -64, -64, -64, 64, -64, -64, -64, 64, -64, 64, -64, 64, -64, -64, 64, 64, 64, -64, 64, -64, -64, 64, -64, -64, -64, -64, 64, -64, -64, -64, 64, 64, -64, 64, -64, -64, 64, -64, 64, 64, -64, -64, -64, -64, -64, -64, -64, 64, 64, -64, -64, 64, 64, -64, -64, -64, -64, -64, -64, 64, 64, -64, -64, 64, -64, -64, -64, -64, 64, 64, 64, -64, 64, 64, 64, -64, -64, 64, 64, 64, 64, 64, -64, -64, -64, -64, 64, 64, 64, -64, -64, 64, 64, 64, -64, -64, 64, 64, -64, -64, -64, 64, 64, 64, 64, 64, -64, 64, 64, 64, 64, -64, 64, -64, 64, -64, 64, 64, 64, 64, -64, 64, -64, -64, 64, -64, 64, -64, -64, 64, -64, -64, 64, 64, 64, -64, 64, -64, -64, 64, 64, -64, 64, 64, 64, 64, -64, 64, 64, 64, 64, -64, 64, 64, -64, -64, 64, 64, -64, 64, -64, 64, 64, 64, -64, -64, -64, -64, 64, 64, 64, 64, 64, 64, 64, 64, -64, 64, 64, 64, -64, -64, 64, -64, -64, 64, 64, 64, -64, -64, -64, -64, -64, -64, -64, -64, 64, -64, 64, 64, -64, -64, 64, 64, -64, 64, -64, 64, 64, 64, 64, -64, -64, -64, -64, -64, -64, -64, 64, 64, 64, 64, -64, -64, -64, 64, -64, 64, -64, -64, -64, -64, -64, 64, 64, -64, -64, -64, 64, -64, -64, -64, -64, -64, -64, 64, 64, 64, 64, 64, -64, 64, -64, -64, -64, -64, -64, -64, 64, 64, -64, 64, -64, 64, -64, -64, 64, -64, -64, -64, -64, -64, -64, -64, 64, 64, -64, 64, -64, -64, -64, -64, -64, -64, -64, -64, 64, -64, 64, 64, -64, -64, 64, -64, -64, -64, -64, -64, -64, -64, -64, -64, 64, -64, 64, -64, -64, -64, -64, -64, -64, 64, 64, 64, 64, 64, 64, -64, -64, 64, -64, -64, -64, -64, -64, -64, 64, 64, 64, -64, 64, -64, -64, 64, -64, 64, -64, 64, -64, 64, 64, 64, 64, 64, 64, -64, 64, -64, -64, 64, 64, 64, 64, 64, 64, 64, 64, 64, 64, -64, -64, -64, 64, -64, 64, 64, 64, 64, 64, 64, 64, 64, 64, -64, -64, 64, 64, -64, 64, 64, 64, 64, 64, 64, 64, 64, 64, -64, -64, -64, 64, 64, 64, 64, 64, 64, 64, 64, 64, 64, -64, 64, 64, -64, 64, 64, -64, 64, 64, 64, 64, 64, 64, 64, 64, -64, -64, -64, 64, 64, 64, 64, 64, 64, 64, 64, 64, 64, 64, -64, 64, -64, 64, 64, 64, 64, -64, 64, 64, 64, 64, 64, -64, -64, -64, 64, 64, 64, 64, 64, -64, -64, -64, 64, -64, 64, 64, 64, 64, -64, -64, 64, 64, 64, 64, 64, 64, 64, 64, 64, -64, -64, -64, 64, 64, 64, 64, 64, 64, -64, 64, -64, 64, -64, 64, -64, -64, 64, -64, -64, 64, 64, 64, 64, 64, 64, -64, 64, -64, -64, -64, -64, 64, 64, 64, 64, 64, 64, 64, 64, 64, 64, -64, 64, -64, -64, -64, -64, 64, 64, 64, 64, 64, 64, -64, -64, -64, -64, -64, 64, 64, 64, 64, 64, 64, 64, 64, 64, 64, 64, -64, -64, 64, -64, 64, -64, 64, 64, 64, 64, -64, -64, -64, 64, -64, -64, -64, 64, 64, 64, 64, 64, 64, -64, -64, 64, 64, -64, -64, -64, -64, 64, 64, -64, 64, 64, 64, 64, 64, -64, 64, -64, -64, -64, -64, -64, 64, 64, 64, 64, 64, -64, -64, 64, -64, 64, 64, 64, 64, -64, 64, 64, 64, 64, 64, -64, -64, 64, 64, -64, -64, -64, -64, -64, 64, 64, 64, 64, -64, 64, 64, 64, -64, -64, -64, -64, 64, 64, 64, 64, 64, -64, 64, -64, -64, 64, -64, -64, -64, -64, -64, 64, -64, 64, -64, 64, -64, 64, -64, 64, -64, -64, 64, -64, 64, 64, 64, 64, 64, 64, -64, -64, -64, 64, 64, -64, 64, -64, -64, 64, -64, 64, -64, -64, -64, -64, 64, -64, -64, 64, 64, 64, -64, 64, 64, 64, 64, -64, -64, -64, -64, -64, -64, 64, 64, -64, -64, -64, -64, -64, -64, -64, -64, 64, 64, -64, 64, -64, -64, 64, -64, -64, 64, 64, -64, -64, -64, -64, -64, 64, 64, 64, 64, 64, -64, -64, -64, -64, -64, -64, 64, 64, 64, -64, 64, -64, -64, 64, 64, 64, 64, -64, -64, -64, -64, -64, -64, -64, 64, 64, 64, 64, -64, -64, 64, 64, 64, -64, 64, 64, 64, 64, 64, -64, -64, 64, -64, -64, -64, -64, -64, -64, -64, 64, -64, -64, 64, 64, 64, 64, 64, 64, 64, 64, 64, -64, -64, -64, -64, 64, 64, -64, -64, -64, -64, -64, 64, 64, 64, 64, 64, -64, 64, 64, 64, 64, 64, 64, 64, -64, -64, 64, -64, 64, -64, 64, 64, 64, 64, -64, -64, -64, -64, 64, 64, -64, -64, -64, -64, 64, 64, 64, 64, 64, 64, -64, 64, 64, -64, 64, 64, 64, -64, -64, 64, 64, 64, -64, 64, -64, 64, 64, -64, 64, 64, 64, -64, 64, -64, 64, 64, 64, -64, 64, -64, -64, -64, 64, -64, -64, -64, 64, 64, 64, -64, 64, 64, 64, 64, 64, 64, 64, 64, 64, 64, -64, 64, 64, 64, 64, -64, -64, 64, 64, -64, 64, -64, 64, -64, -64, -64, -64, -64, -64, -64, 64, 64, -64, -64, -64, -64, -64, -64, -64, -64, 64, -64, 64, 64, -64, -64, -64, 64, 64, -64, -64, 64, 64, 64, -64, -64, -64, -64, -64, 64, -64, -64, 64, -64, -64, -64, -64, 64, -64, -64, -64, 64, -64, -64, -64, 64, -64, 64, 64, -64, 64, 64, -64, -64, 64, -64, -64, 64, 64, 64, -64, 64, 64, -64, 64, 64, -64, -64, -64, -64, -64, 64, -64, -64, 64, 64, 64, 64, 64, 64, 64, -64, 64, -64, -64, 64, -64, 64, -64, 64, 64, 64, -64, 64, 64, 64, -64, -64, 64, 64, 64, 64, 64, 64, 64, 64, 64, 64, 64, 64, 64, -64, -64, -64, 64, 64, 64, -64, -64, 64, 64, 64, 64, -64, -64, 64, -64, 64, 64, 64, 64, 64, 64, 64, 64, 64, 64, -64, -64, -64, -64, 64, 64, 64, 64, 64, 64, 64, 64, 64, -64, -64, 64, 64, 64, 64, -64, 64, 64, 64, 64, 64, 64, -64, 64, -64, -64, 64, -64, 64, -64, 64, 64, 64, 64, -64, 64, 64, 64, 64, 64, 64, 64, -64, -64, 64, 64, -64, -64, -64, -64, 64, -64, -64, -64, -64, 64, 64, -64, 64, -64, 64, 64, 64, 64, 64, 64, 64, 64, 64, 64, 64, 64, -64, 64, -64, -64, -64, 64, 64, -64, 64, -64, -64, 64, 64, -64, -64, -64, 64, 64, 64, 64, -64, 64, -64, 64, 64, -64, 64, 64, -64, 64, 64, -64, -64, -64, -64, 64, -64, -64, -64, -64, -64, 64, 64, 64, -64, -64, -64, -64, -64, -64, -64, -64, -64, -64, -64, -64, 64, 64, 64, -64, -64, 64, -64, 64, -64, -64, 64, 64, -64, 64, 64, -64, -64, -64, -64, -64, -64, -64, 64, -64, -64, -64, -64, -64, -64, 64, 64, 64, 64, -64, -64, -64, -64, -64, -64, -64, -64, 64, 64, -64, -64, 64, -64, -64, -64, -64, 64, -64, -64, -64, -64, -64, -64, -64, 64, -64, -64, -64, -64, 64, -64, 64, 64, -64, 64, 64, -64, -64, -64, 64, -64, -64, -64, -64, 64, 64, -64, -64, -64, -64, -64, 64, 64, 64, 64, -64, -64, 64, 64, -64, 64, -64, 64, 64, 64, -64, -64, -64, -64, -64, -64, -64, -64, -64, -64, -64, -64, -64, -64, -64, -64, 64, 64, -64, -64, -64, -64, 64, 64, -64, 64, 64, -64, -64, 64, -64, -64, -64, -64, -64, -64, 64, -64, -64, -64, -64, -64, -64, -64, -64, 64, 64, 64, 64, -64, 64, -64, 64, 64, 64, -64, 64, 64, -64, -64, -64, -64, -64, -64, -64, -64, -64, -64, -64, -64, -64, -64, 64, 64, -64, -64, 64, 64, -64, 64, 64, 64, 64, 64, 64, 64, -64, -64, -64, -64, -64, -64, -64, -64, -64, -64, -64, -64, 64, -64, 64, 64, 64, -64, -64, -64, -64, -64, -64, 64, -64, 64, 64, -64, -64, -64, -64, -64, -64, -64, -64, -64, -64, -64, -64, -64, -64, -64, 64, -64, 64, -64, 64, 64, -64, 64, -64, 64, 64, 64, 64, 64, -64, -64, -64, -64, -64, -64, -64, -64, -64, -64, 64, -64, 64, 64, -64, -64, 64, 64, -64, -64, -64, 64, -64, -64, -64, 64, 64, -64, -64, -64, -64, -64, 64, 64, 64, 64, 64, 64, 64, 64, 64, 64, -64, -64, 64, 64, -64, -64, 64, 64, 64, -64, 64, 64, -64, 64, -64, 64, 64, 64, 64, 64, 64, 64, 64, 64, 64, 64, 64, 64, 64, 64, 64, -64, -64, 64, -64, 64, -64, 64, -64, -64, -64, -64, -64, 64, 64, -64, 64, 64, 64, 64, 64, 64, 64, 64, 64, 64, 64, 64, -64, -64, -64, 64, -64, 64, -64, -64, 64, 64, -64, -64, 64, 64, 64, 64, 64, 64, 64, 64, 64, 64, 64, 64, 64, 64, -64, -64, 64, -64, 64, 64, -64, -64, 64, 64, 64, 64, -64, 64, -64, 64, 64, 64, 64, 64, -64, 64, 64, 64, 64, 64, 64, 64, -64, -64, 64, 64, -64, -64, 64, 64, 64, 64, -64, 64, -64, -64, -64, -64, 64, 64, 64, 64, 64, 64, 64, 64, -64, 64, 64, 64, 64, -64, -64, 64, 64, -64, 64, -64, -64, -64, -64, -64, 64, -64, 64, -64, -64, -64, 64, 64, 64, 64, -64, -64, 64, -64, 64, -64, -64, -64, -64, -64, -64, 64, -64, 64, -64, -64, -64, 64, -64, 64, 64, 64, -64, 64, 64, 64, -64, -64, 64, 64, -64, 64, 64, -64, 64, 64, -64, -64, 64, 64, 64, 64, -64, -64, -64, -64, 64, -64, -64, -64, 64, 64, -64, -64, 64, -64, 64, -64, 64, 64, 64, 64, -64, 64, 64, 64, 64, 64, -64, 64, 64, 64, 64, 64, 64, 64, -64, 64, 64, -64, -64, 64, 64, 64, 64, -64, -64, -64, 64, -64, -64, -64, -64, 64, 64, -64, -64, 64, 64, 64, -64, 64, 64, -64, -64, -64, 64, 64, 64, -64, 64, 64, 64, -64, 64, -64, -64, -64, 64, -64, 64, 64, 64, 64, 64, 64, 64, -64, 64, -64, -64, 64, 64, 64, 64, 64, -64, 64, 64, -64, 64, -64, 64, 64, 64, 64, 64, -64, -64, -64, -64, -64, 64, -64, -64, 64, -64, -64, -64, -64, 64, 64, -64, -64, -64, 64, 64, 64, -64, 64, 64, 64, 64, 64, 64, 64, 64, -64, 64, -64, 64, -64, 64, -64, 64, 64, -64, 64, 64, 64, 64, 64, 64, 64, -64, -64, 64, 64, 64, 64, 64, 64, 64, 64, -64, 64, -64, 64, 64, 64, -64, -64, 64, -64, 64, -64, -64, -64, 64, 64, 64, -64, 64, -64, 64, -64, 64, 64, 64, 64, 64, -64, -64, 64, 64, 64, 64, -64, -64, -64, 64, 64, 64, 64, -64, 64, -64, 64, 64, 64, 64, -64, 64, 64, 64, -64, 64, 64, -64, -64, -64, -64, -64, 64, -64, 64, -64, -64, -64, 64, -64, 64, -64, 64, 64, 64, 64, 64, 64, 64, 64, 64, 64, 64, 64, -64, -64, -64, 64, 64, -64, -64, -64, -64, -64, 64, -64, -64, -64, 64, 64, -64, -64, 64, 64, 64, -64, 64, -64, -64, -64, 64, 64, -64, 64, -64, -64, -64, -64, -64, 64, -64, -64, 64, -64, -64, 64, 64, -64, 64, 64, 64, -64, -64, 64, 64, -64, -64, 64, 64, 64, 64, 64, 64, 64, 64, -64, -64, 64, 64, -64, 64, 64, 64, -64, -64, -64, 64, -64, 64, 64, 64, -64, -64, 64, -64, -64, 64, 64, -64, -64, -64, 64, 64, -64, -64, 64, 64, -64, -64, -64, 64, 64, -64, 64, -64, 64, 64, 64, -64, 64, -64, -64, -64, 64, -64, 64, 64, -64, 64, 64, 64, -64, 64, -64, -64, -64, -64, -64, 64, -64, 64, 64, -64, -64, 64, -64, -64, -64, 64, -64, 64, 64, 64, 64, 64, 64, -64, 64, 64, -64, 64, -64, 64, -64, 64, -64, 64, 64, 64, -64, -64, 64, 64, 64, 64, 64, 64, 64, 64, -64, 64, 64, 64, 64, -64, -64, 64, 64, -64, -64, -64, 64, 64, 64, 64, 64, -64, -64, 64, 64, 64, 64, 64, 64, 64, 64, -64, 64, 64, -64, 64, 64, -64, -64, -64, -64, -64, 64, -64, 64, 64, 64, 64, -64, 64, -64, 64, 64, -64, 64, 64, 64, 64, 64, 64, 64, -64, -64, 64, 64, 64, -64, -64, -64, 64, 64, 64, -64, 64, 64, 64, 64, -64, 64, 64, -64, -64, 64, 64, 64, 64, -64, 64, -64, 64, 64, -64, -64, 64, 64, -64, 64, -64, -64, -64, 64, -64, 64, 64, 64, -64, 64, 64, 64, -64, 64, 64, 64, -64, -64, -64, 64, -64, 64, -64, 64, 64, 64, -64, -64, 64, -64, 64, -64, 64, 64, 64, 64, 64, -64, -64, -64, 64, 64, 64, 64, 64, 64, 64, 64, 64, 64, 64, -64, 64, -64, 64, -64, -64, -64, 64, -64, 64, 64, 64, -64, -64, -64, 64, 64, 64, 64, 64, 64, 64, 64, 64, 64, -64, -64, 64, 64, 64, -64, 64, -64, -64, -64, 64, -64, -64, 64, -64, 64, -64, -64, -64, -64, 64, 64, -64, 64, 64, 64, 64, 64, -64, -64, -64, -64, 64, 64, 64, -64, -64, 64, 64, -64, -64, 64, -64, 64, 64, 64, -64, 64, 64, 64, 64, -64, -64, 64, 64, -64, -64, 64, 64, 64, -64, 64, 64, -64, -64, 64, -64, -64, -64, -64, -64, 64, 64, 64, -64, 64, 64, 64, -64, 64, 64, 64, -64, 64, 64, 64, -64, -64, -64, 64, 64, -64, 64, -64, -64, -64, 64, -64, -64, -64, 64, -64, 64, 64, -64, 64, 64, 64, 64, 64, 64, 64, 64, 64, 64, -64, 64, -64, -64, -64, -64, 64, 64, -64, 64, 64, -64, 64, -64, 64, -64, -64, -64, -64, -64, -64, 64, 64, 64, -64, 64, -64, 64, 64, -64, -64, 64, -64, -64, -64, -64, -64, -64, -64, 64, 64, -64, 64, -64, -64, -64, -64, -64, 64, 64, -64, 64, -64, 64, -64, 64, -64, 64, -64, 64, 64, -64, -64, -64, -64, 64, -64, -64, -64, -64, 64, -64, -64, -64, 64, -64, -64, 64, -64, -64, -64, -64, -64, -64, 64, -64, 64, -64, 64, -64, -64, -64, 64, 64, 64, 64, 64, 64, -64, 64, 64, 64, -64, 64, 64, 64, 64, 64, 64, -64, -64, -64, -64, -64, 64, 64, -64, -64, -64, -64, 64, 64, -64, 64, -64, 64, -64, 64, -64, 64, 64, 64, 64, 64, -64, -64, 64, -64, -64, -64, 64, 64, 64, -64, -64, -64, 64, -64, -64, 64, -64, -64, 64, 64, 64, -64, 64, 64, 64, -64, -64, -64, -64, -64, -64, -64, -64, 64, 64, 64, 64, 64, 64, 64, 64, 64, -64, -64, -64, -64, 64, 64, -64, -64, -64, -64, -64, -64, -64, 64, 64, -64, -64, -64, -64, -64, 64, -64, -64, -64, -64, 64, 64, 64, 64, -64, 64, -64, 64, 64, -64, -64, -64, -64, -64, -64, -64, -64, -64, -64, -64, -64, -64, -64, -64, -64, 64, 64, 64, 64, 64, -64, 64, 64, -64, 64, -64, -64, -64, -64, -64, 64, -64, -64, -64, -64, -64, -64, -64, -64, -64, -64, 64, -64, -64, 64, 64, -64, 64, -64, -64, 64, 64, 64, -64, -64, -64, -64, -64, -64, -64, -64, -64, -64, -64, -64, -64, -64, -64, 64, -64, 64, -64, 64, 64, -64, 64, -64, -64, -64, 64, -64, -64, 64, 64, -64, 64, 64, 64, 64, 64, 64, 64, -64, 64, 64, 64, 64, 64, -64, 64, 64, -64, -64, 64, -64, 64, -64, 64, -64, -64, -64, 64, -64, 64, 64, 64, 64, 64, 64, 64, 64, 64, -64, -64, 64, -64, 64, 64, -64, -64, 64, -64, 64, -64, 64, 64, -64, -64, -64, 64, -64, 64, 64, -64, 64, 64, 64, 64, 64, 64, -64, -64, -64, -64, 64, 64, -64, -64, 64, -64, 64, 64, 64, 64, -64, -64, -64, -64, 64, -64, -64, 64, -64, 64, 64, 64, 64, 64, -64, -64, -64, -64, -64, 64, 64, -64, -64, -64, 64, 64, -64, 64, -64, -64, -64, 64, 64, -64, -64, 64, 64, 64, -64, -64, -64, 64, -64, -64, -64, -64, 64, 64, -64, -64, -64, 64, 64, 64, 64, -64, 64, 64, -64, -64, -64, -64, -64, 64, 64, -64, -64, -64, -64, -64, -64, -64, -64, -64, -64, -64, 64, -64, -64, 64, -64, 64, -64, 64, 64, -64, 64, -64, 64, -64, -64, 64, 64, 64, -64, -64, -64, -64, -64, -64, 64, -64, 64, 64, 64, 64, -64, -64, 64, 64, 64, -64, -64, -64, 64, -64, 64, 64, 64, -64, 64, 64, -64, -64, -64, 64, -64, -64, 64, -64, 64, 64, 64, 64, 64, 64, -64, -64, 64, -64, -64, -64, 64, -64, 64, 64, 64, 64, -64, -64, -64, -64, 64, 64, 64, 64, -64, -64, 64, 64, 64, 64, 64, 64, 64, -64, 64, -64, -64, -64, 64, -64, -64, -64, 64, 64, 64, -64, -64, -64, -64, 64, 64, -64, -64, -64, -64, 64, -64, 64, -64, 64, 64, 64, 64, 64, 64, -64, 64, -64, -64, -64, 64, 64, -64, -64, -64, -64, -64, -64, -64, -64, -64, -64, 64, 64, 64, 64, -64, 64, -64, 64, 64, 64, -64, 64, -64, -64, -64, -64, 64, 64, -64, -64, -64, 64, 64, -64, 64, 64, -64, -64, -64, -64, 64, -64, -64, 64, 64, -64, 64, 64, -64, 64, -64, -64, -64, -64, -64, -64, -64, -64, -64, 64, 64, 64, -64, -64, -64, -64, -64, -64, -64, 64, -64, -64, -64, -64, 64, 64, -64, -64, -64, -64, -64, -64, -64, -64, -64, -64, 64, 64, 64, -64, -64, -64, -64, -64, -64, -64, -64, 64, -64, -64, 64, -64, -64, 64, -64, -64, -64, -64, -64, -64, -64, -64, -64, -64, 64, 64, 64, -64, -64, -64, -64, -64, -64, 64, -64, 64, -64, -64, 64, -64, 64, 64, -64, 64, 64, -64, 64, -64, -64, 64, -64, -64, 64, -64, -64, -64, -64, -64, -64, -64, -64, -64, 64, 64, 64, -64, 64, -64, -64, -64, -64, 64, 64, 64, 64, 64, 64, 64, 64, 64, 64, 64, -64, -64, -64, -64, -64, -64, -64, -64, 64, -64, 64, -64, -64, 64, -64, -64, 64, 64, 64, 64, 64, 64, 64, 64, 64, 64, 64, 64, 64, 64, 64, -64, -64, -64, -64, -64, -64, -64, -64, 64, 64, 64, -64, -64, 64, 64, 64, -64, -64, -64, 64, 64, 64, 64, 64, 64, 64, 64, -64, -64, -64, 64, 64, -64, 64, -64, 64, -64, -64, -64, 64, -64, -64, 64, 64, -64, 64, 64, 64, 64, 64, 64, 64, 64, 64, -64, -64, -64, -64, -64, -64, 64, -64, 64, 64, -64, -64, -64, 64, 64, -64, -64, 64, -64, -64, -64, 64, 64, 64, 64, 64, 64, -64, -64, 64, 64, -64, -64, -64, 64, 64, 64, -64, 64, 64, -64, -64, -64, 64, -64, -64, -64, 64, -64, -64, -64, -64, -64, -64, -64, -64, 64, -64, -64, 64, 64, -64, 64, 64, -64, -64, 64, -64, -64, -64, -64, 64, 64, 64, -64, -64, 64, 64, -64, 64, -64, -64, -64, 64, 64, 64, 64, 64, -64, 64, -64, 64, 64, -64, -64, 64, 64, 64, -64, -64, -64, 64, 64, 64, 64, -64, 64, 64, 64, 64, 64, 64, 64, 64, 64, 64, -64, 64, 64, 64, -64, -64, 64, -64, -64, 64, -64, 64, 64, 64, 64, 64, 64, 64, 64, 64, 64, 64, 64, 64, 64, 64, 64, -64, -64, -64, 64, 64, 64, -64, -64, 64, 64, -64, -64, 64, 64, -64, 64, 64, 64, 64, -64, 64, -64, 64, -64, 64, -64, -64, -64, -64, 64, -64, -64, 64, 64, -64, -64, 64, 64, -64, -64, 64, -64, 64, 64, 64, 64, -64, -64, 64, 64, 64, 64, 64, -64, -64, -64, -64, -64, -64, -64, 64, -64, -64, 64, 64, -64, 64, 64, -64, 64, 64, 64, 64, 64, -64, -64, -64, 64, 64, 64, 64, 64, 64, -64, -64, -64, -64, -64, -64, 64, -64, 64, 64, 64, -64, -64, -64, -64, 64, 64, -64, -64, -64, -64, 64, 64, 64, 64, 64, 64, -64, -64, 64, 64, -64, -64, -64, -64, -64, -64, 64, 64, 64, 64, 64, 64, 64, -64, -64, -64, -64, -64, 64, 64, 64, 64, 64, 64, 64, 64, 64, -64, 64, -64, -64, -64, 64, 64, -64, 64, -64, 64, 64, -64, -64, -64, 64, -64, 64, -64, -64, 64, 64, 64, 64, 64, 64, -64, 64, -64, -64, -64, 64, 64, -64, 64, -64, 64, -64, 64, -64, 64, 64, 64, -64, 64, -64, -64, -64, -64, 64, 64, 64, 64, 64, 64, -64, 64, 64, 64, 64, -64, -64, -64, 64, 64, 64, 64, -64, -64, 64, 64, -64, -64, -64, -64, -64, -64, 64, -64, 64, 64, -64, 64, 64, 64, 64, 64, 64, -64, -64, 64, -64, 64, -64, -64, 64, 64, 64, 64, -64, -64, -64, -64, -64, -64, -64, 64, 64, -64, -64, 64, -64, 64, 64, 64, 64, -64, -64, -64, -64, -64, 64, -64, -64, 64, 64, -64, -64, -64, 64, -64, -64, -64, 64, -64, 64, 64, 64, -64, 64, -64, -64, 64, 64, 64, 64, -64, 64, -64, 64, -64, 64, 64, 64, 64, 64, 64, 64, -64, -64, 64, -64, 64, 64, 64, 64, -64, 64, -64, 64, 64, -64, 64, 64, 64, -64, -64, -64, 64, -64, -64, 64, 64, -64, 64, -64, 64, -64, -64, 64, -64, 64, 64, 64, -64, -64, -64, -64, -64, 64, 64, 64, 64, 64, 64, -64, -64, -64, -64, -64, 64, 64, 64, -64, 64, 64, 64, 64, -64, -64, -64, -64, 64, -64, -64, 64, -64, -64, -64, 64, -64, 64, -64, 64, 64, 64, 64, 64, -64, -64, 64, 64, 64, 64, 64, 64, 64, 64, 64, -64, -64, 64, -64, -64, 64, -64, -64, 64, -64, -64, -64, -64, 64, -64, -64, -64, -64, 64, 64, 64, 64, 64, 64, 64, 64, 64, 64, 64, 64, -64, -64, 64, 64, -64, -64, -64, -64, 64, 64, 64, -64, 64, 64, -64, 64, 64, -64, -64, 64, 64, 64, 64, 64, 64, 64, -64, 64, -64, -64, 64, 64, 64, -64, 64, 64, -64, 64, -64, 64, 64, 64, 64, 64, 64, 64, 64, 64, 64, 64, 64, 64, 64, 64, 64, -64, -64, -64, -64, 64, -64, 64, 64, 64, 64, 64, 64, -64, 64, -64, 64, 64, 64, 64, 64, 64, 64, 64, -64, -64, 64, 64, 64, -64, -64, -64, -64, -64, -64, -64, 64, -64, -64, -64, 64, -64, -64, -64, 64, 64, 64, -64, 64, 64, 64, 64, 64, 64, 64, -64, -64, -64, -64, -64, -64, 64, 64, -64, 64, 64, -64, -64, -64, 64, -64, 64, 64, -64, 64, 64, 64, 64, 64, -64, 64, -64, -64, -64, -64, -64, -64, -64, -64, 64, -64, 64, 64, -64, -64, -64, -64, 64, 64, 64, 64, -64, 64, 64, -64, -64, -64, 64, 64, 64, 64, -64, -64, 64, 64, 64, 64, 64, -64, -64, 64, -64, 64, 64, 64, -64, 64, 64, 64, 64, 64, 64, 64, -64, 64, 64, 64, 64, 64, 64, 64, 64, -64, -64, 64, 64, -64, 64, 64, -64, 64, -64, -64, 64, -64, -64, 64, 64, -64, 64, 64, 64, 64, 64, 64, 64, 64, 64, 64, 64, 64, 64, 64, 64, -64, -64, -64, 64, -64, 64, -64, -64, 64, -64, 64, -64, 64, 64, 64, -64, -64, 64, -64, 64, 64, 64, 64, 64, -64, -64, 64, 64, 64, -64, 64, 64, -64, -64, -64, 64, 64, -64, 64, 64, 64, 64, -64, 64, 64, -64, -64, 64, -64, 64, -64, -64, -64, -64, -64, -64, 64, -64, -64, 64, -64, 64, -64, 64, 64, -64, 64, 64, 64, -64, 64, 64, 64, -64, 64, 64, -64, -64, -64, -64, 64, 64, 64, 64, 64, 64, 64, 64, 64, 64, -64, -64, 64, 64, 64, 64, 64, -64, 64, -64, -64, -64, 64, -64, -64, -64, -64, 64, -64, -64, 64, 64, 64, -64, -64, 64, -64, 64, 64, -64, -64, 64, -64, 64, -64, -64, 64, 64, 64, -64, -64, 64, -64, -64, 64, -64, 64, 64, -64, 64, -64, 64, -64, -64, -64, 64, -64, 64, -64, -64, 64, 64, -64, 64, -64, 64, -64, 64, 64, -64, 64, -64, 64, 64, -64, 64, -64, 64, 64, 64, -64, 64, -64, -64, -64, 64, -64, -64, -64, 64, 64, -64, 64, -64, -64, 64, 64, 64, -64, -64, -64, 64, 64, 64, 64, 64, -64, -64, 64, 64, 64, -64, 64, -64, 64, 64, -64, 64, 64, 64, -64, -64, 64, 64, -64, -64, 64, 64, 64, -64, 64, 64, 64, -64, -64, 64, -64, 64, 64, -64, -64, 64, 64, 64, 64, 64, 64, -64, 64, 64, 64, -64, 64, 64, -64, -64, 64, 64, 64, 64, 64, 64, 64, -64, 64, 64, -64, 64, -64, -64, 64, -64, -64, 64, 64, -64, 64, -64, 64, 64, 64, 64, -64, 64, 64, 64, 64, 64, 64, -64, 64, 64, 64, 64, -64, -64, -64, -64, -64, 64, 64, 64, 64, 64, 64, -64, 64, -64, 64, -64, 64, 64, 64, 64, 64, 64, 64, -64, 64, 64, -64, 64, -64, 64, 64, -64, 64, -64, -64, 64, 64, -64, 64, 64, 64, 64, -64, -64, 64, 64, -64, 64, 64, 64, -64, 64, -64, -64, -64, 64, -64, 64, -64, -64, 64, 64, 64, -64, 64, 64, 64, -64, -64, -64, -64, -64, -64, 64, 64, 64, 64, -64, -64, 64, -64, 64, 64, -64, -64, 64, -64, -64, 64, -64, 64, -64, 64, -64, 64, -64, 64, 64, 64, 64, 64, 64, -64, -64, 64, 64, -64, -64, 64, 64, -64, 64, 64, -64, -64, 64, -64, -64, -64, -64, 64, 64, 64, 64, 64, 64, 64, -64, 64, 64, 64, 64, 64, -64, 64, 64, 64, 64, 64, 64, 64, -64, 64, -64, 64, -64, 64, 64, 64, 64, 64, 64, -64, 64, 64, 64, 64, 64, 64, -64, 64, 64, 64, 64, -64, -64, -64, 64, -64, 64, 64, 64, -64, 64, -64, 64, 64, 64, -64, 64, -64, 64, 64, 64, 64, 64, 64, 64, 64, -64, 64, -64, 64, 64, -64, -64, -64, 64, -64, 64, -64, 64, 64, 64, 64, 64, 64, 64, -64, 64, 64, 64, 64, 64, -64, -64, -64, 64, 64, 64, 64, 64, -64, -64, -64, -64, 64, -64, -64, -64, -64, 64, 64, 64, 64, 64, 64, 64, 64, 64, -64, 64, 64, 64, 64, 64, -64, 64, 64, -64, -64, -64, -64, 64, 64, 64, -64, 64, 64, 64, 64, -64, -64, -64, -64, 64, 64, -64, 64, 64, 64, 64, -64, 64, -64, -64, -64, -64, 64, -64, 64, 64, -64, -64, -64, 64, -64, 64, 64, 64, -64, 64, -64, 64, 64, -64, 64, -64, 64, 64, -64, 64, 64, 64, 64, 64, 64, -64, 64, -64, -64, -64, -64, 64, -64, 64, 64, 64, 64, 64, 64, 64, -64, -64, 64, 64, -64, 64, 64, 64, 64, 64, 64, 64, -64, -64, 64, 64, -64, 64, -64, -64, 64, -64, 64, -64, 64, 64, -64, -64, 64, -64, 64, 64, 64, 64, -64, 64, 64, 64, -64, 64, -64, -64, 64, -64, -64, 64, 64, 64, 64, 64, 64, 64, 64, -64, 64, 64, -64, 64, -64, 64, -64, 64, -64, 64, 64, -64, 64, -64, 64, -64, -64, -64, 64, -64, -64, 64, -64, 64, 64, -64, 64, -64, -64, 64, -64, 64, -64, 64, 64, 64, -64, -64, -64, 64, 64, -64, 64, -64, -64, 64, -64, 64, 64, 64, -64, -64, -64, -64, -64, 64, 64, -64, 64, 64, -64, -64, 64, -64, 64, 64, 64, -64, 64, -64, -64, -64, -64, -64, -64, 64, -64, 64, 64, 64, -64, 64, 64, -64, -64, 64, 64, -64, 64, 64, -64, 64, -64, 64, -64, 64, -64, -64, 64, -64, -64, -64, 64, 64, -64, -64, -64, 64, -64, 64, -64, 64, -64, -64, -64, -64, 64, -64, -64, 64, -64, 64, 64, -64, 64, 64, 64, -64, -64, 64, -64, 64, 64, 64, 64, 64, 64, -64, 64, -64, 64, 64, 64, -64, -64, 64, 64, 64, 64, 64, -64, 64, 64, 64, -64, 64, 64, 64, -64, -64, -64, 64, 64, -64, 64, 64, 64, -64, 64, 64, 64, 64, -64, -64, 64, -64, 64, 64, -64, -64, 64, -64, 64, 64, 64, -64, -64, -64, 64, -64, 64, 64, -64, 64, 64, -64, -64, 64, 64, -64, -64, 64, -64, 64, 64, 64, -64, -64, -64, 64, -64, 64, -64, 64, 64, -64, -64, 64, -64, 64, -64, -64, -64, 64, 64, -64, -64, -64, 64, -64, -64, 64, 64, -64, 64, 64, -64, 64, -64, -64, -64, 64, 64, 64, -64, -64, -64, -64, 64, -64, -64, 64, -64, -64, 64, -64, 64, -64, 64, -64, 64, 64, 64, -64, 64, -64, -64, -64, -64, 64, -64, 64, -64, -64, 64, 64, -64, 64, 64, 64, -64, -64, -64, 64, -64, -64, 64, -64, -64, -64, 64, 64, 64, -64, -64, 64, -64, 64, -64, 64, -64, 64, 64, 64, 64, -64, -64, 64, 64, -64, 64, 64, 64, 64, 64, 64, 64, 64, 64, 64, 64, 64, 64, -64, 64, -64, 64, 64, -64, 64, -64, -64, 64, 64, -64, -64, 64, 64, -64, 64, 64, 64, 64, 64, -64, 64, 64, 64, 64, 64, -64, 64, -64, 64, -64, -64, 64, 64, -64, 64, 64, 64, -64, 64, 64, 64, 64, 64, 64, 64, -64, 64, 64, -64, 64, 64, 64, -64, 64, -64, -64, -64, -64, -64, 64, -64, -64, 64, -64, -64, 64, -64, -64, -64, 64, -64, 64, 64, 64, -64, -64, 64, 64, 64, 64, 64, 64, 64, 64, -64, 64, -64, 64, -64, 64, 64, -64, 64, -64, 64, -64, 64, -64, 64, -64, 64, 64, 64, -64, 64, 64, -64, 64, 64, 64, 64, -64, 64, 64, 64, 64, 64, 64, 64, 64, 64, -64, -64, 64, 64, 64, 64, 64, 64, 64, 64, -64, -64, -64, -64, 64, 64, 64, -64, -64, 64, 64, -64, -64, -64, 64, -64, 64, 64, 64, -64, -64, 64, 64, -64, -64, 64, -64, 64, 64, -64, 64, 64, -64, 64, 64, 64, 64, -64, -64, 64, 64, 64, 64, -64, -64, 64, 64, 64, 64, 64, 64, 64, 64, 64, 64, -64, -64, 64, 64, 64, -64, -64, -64, -64, -64, -64, -64, 64, -64, 64, 64, 64, 64, -64, -64, 64, 64, -64, -64, 64, -64, -64, -64, 64, -64, 64, 64, 64, 64, 64, -64, 64, 64, 64, 64, 64, -64, -64, 64, 64, 64, 64, 64, 64, 64, 64, 64, 64, 64, -64, 64, -64, 64, 64, 64, -64, 64, -64, 64, 64, -64, 64, 64, -64, -64, 64, -64, 64, -64, 64, 64, -64, -64, 64, -64, -64, 64, -64, 64, 64, -64, -64, 64, 64, -64, 64, 64, 64, -64, 64, 64, -64, 64, 64, 64, -64, -64, 64, 64, -64, -64, -64, 64, 64, -64, 64, 64, -64, 64, 64, -64, 64, 64, 64, -64, -64, 64, 64, -64, 64, 64, -64, 64, 64, 64, 64, 64, 64, 64, -64, 64, 64, 64, -64, 64, 64, 64, -64, 64, -64, -64, -64, 64, 64, -64, -64, 64, -64, -64, -64, 64, 64, 64, 64, 64, -64, 64, 64, 64, 64, 64, 64, -64, -64, -64, -64, 64, 64, 64, 64, 64, 64, -64, -64, -64, 64, -64, -64, 64, 64, -64, -64, 64, -64, -64, -64, -64, 64, 64, -64, 64, 64, -64, 64, -64, 64, 64, 64, 64, -64, -64, 64, -64, 64, 64, -64, 64, 64, -64, 64, 64, 64, -64, -64, -64, -64, 64, -64, 64, -64, 64, -64, -64, 64, 64, -64, -64, 64, -64, 64, -64, -64, -64, 64, -64, -64, 64, -64, 64, 64, -64, 64, 64, 64, 64, 64, -64, 64, 64, -64, 64, 64, -64, -64, -64, -64, 64, -64, -64, -64, -64, 64, 64, 64, 64, -64, 64, 64, 64, 64, 64, 64, 64, 64, -64, 64, -64, -64, -64, -64, 64, -64, -64, -64, -64, -64, -64, 64, 64, 64, -64, -64, -64, 64, -64, -64, 64, -64, 64, 64, 64, -64, 64, 64, 64, -64, -64, -64, 64, 64, 64, -64, 64, 64, -64, -64, -64, -64, -64, 64, 64, 64, 64, 64, -64, -64, -64, -64, 64, 64, 64, -64, -64, 64, 64, 64, 64, -64, 64, -64, -64, -64, 64, -64, 64, 64, -64, -64, -64, -64, -64, -64, -64, 64, 64, 64, -64, 64, 64, -64, -64, 64, -64, -64, -64, 64, 64, 64, -64, 64, 64, 64, -64, -64, -64, -64, -64, -64, -64, -64, -64, -64, 64, 64, 64, -64, -64, -64, 64, 64, -64, -64, -64, 64, 64, 64, -64, -64, 64, -64, 64, 64, -64, 64, 64, 64, 64, -64, -64, 64, 64, -64, 64, -64, -64, -64, -64, -64, -64, -64, -64, -64, -64, 64, 64, 64, -64, 64, -64, 64, -64, 64, 64, -64, 64, -64, 64, 64, -64, -64, -64, -64, -64, -64, 64, -64, -64, 64, 64, 64, 64, -64, 64, 64, 64, -64, -64, 64, -64, 64, -64, 64, -64, 64, -64, -64, 64, -64, -64, -64, 64, 64, 64, 64, 64, -64, -64, 64, 64, -64, -64, -64, 64, -64, -64, -64, 64, 64, 64, -64, 64, 64, -64, -64, -64, 64, -64, -64, 64, -64, 64, 64, 64, -64, 64, -64, 64, 64, 64, -64, -64, 64, 64, 64, -64, 64, 64, 64, 64, 64, -64, -64, 64, -64, 64, 64, 64, -64, 64, 64, 64, 64, -64, 64, 64, -64, -64, 64, -64, -64, 64, 64, 64, 64, 64, 64, 64, 64, 64, 64, 64, 64, 64, 64, 64, 64, 64, 64, 64, 64, -64, -64, -64, -64, 64, -64, 64, 64, 64, 64, 64, 64, 64, 64, 64, 64, 64, 64, 64, 64, 64, 64, 64, 64, 64, -64, -64, -64, -64, -64, -64, 64, 64, -64, 64, 64, 64, -64, 64, 64, 64, 64, 64, -64, -64, 64, -64, 64, 64, 64, 64, 64, 64, -64, -64, -64, -64, -64, 64, -64, -64, 64, 64, -64, 64, 64, -64, -64, -64, -64, 64, -64, -64, -64, -64, 64, 64, -64, -64, -64, -64, 64, -64, 64, -64, -64, -64, -64, -64, 64, 64, 64, -64, -64, -64, -64, 64, -64, -64, -64, -64, -64, -64, -64, 64, -64, -64, 64, 64, -64, -64, 64, 64, -64, -64, -64, 64, -64, 64, -64, -64, -64, -64, -64, -64, 64, -64, -64, -64, -64, -64, 64, -64, -64, -64, -64, -64, -64, -64, -64, -64, -64, -64, -64, -64, -64, -64, -64, 64, -64, -64, 64, -64, -64, -64, -64, -64, -64, -64, 64, 64, -64, -64, 64, -64, -64, 64, -64, -64, -64, -64, -64, -64, 64, -64, 64, -64, 64, 64, 64, -64, -64, -64, -64, -64, -64, 64, 64, 64, 64, -64, -64, -64, -64, 64, -64, 64, -64, -64, 64, 64, 64, -64, -64, -64, 64, 64, 64, -64, -64, -64, -64, -64, -64, 64, 64, 64, 64, 64, -64, -64, 64, -64, -64, -64, 64, -64, -64, -64, -64, -64, 64, -64, 64, 64, -64, -64, -64, -64, -64, -64, -64, 64, 64, -64, -64, -64, -64, -64, -64, 64, -64, 64, 64, -64, -64, -64, 64, 64, -64, 64, 64, 64, 64, -64, -64, -64, -64, -64, -64, 64, 64, -64, -64, -64, 64, -64, -64, 64, -64, -64, -64, -64, -64, -64, 64, -64, -64, 64, 64, 64, 64, 64, -64, -64, -64, -64, -64, -64, 64, 64, 64, -64, 64, 64, -64, -64, 64, 64, 64, 64, 64, 64, -64, 64, 64, 64, 64, 64, 64, 64, -64, -64, -64, 64, -64, 64, -64, -64, -64, 64, -64, -64, -64, 64, 64, 64, -64, -64, 64, 64, 64, -64, -64, 64, 64, 64, 64, 64, -64, 64, -64, 64, -64, -64, -64, -64, -64, 64, 64, 64, 64, 64, 64, 64, -64, 64, 64, -64, 64, 64, -64, 64, 64, 64, 64, 64, -64, -64, 64, 64, -64, -64, -64, -64, -64, 64, 64, 64, 64, 64, 64, 64, -64, 64, 64, -64, -64, -64, 64, 64, 64, 64, 64, 64, 64, 64, 64, -64, -64, -64, 64, 64, 64, 64, 64, 64, 64, 64, -64, -64, -64, 64, -64, -64, 64, 64, 64, -64, 64, 64, 64, 64, -64, 64, 64, -64, -64, -64, 64, 64, 64, 64, 64, 64, 64, 64, 64, -64, 64, -64, 64, 64, 64, -64, 64, -64, 64, 64, 64, -64, 64, 64, -64, -64, 64, 64, 64, -64, -64, 64, 64, 64, -64, 64, 64, -64, -64, 64, 64, 64, 64, 64, 64, 64, 64, 64, 64, 64, 64, 64, -64, -64, -64, 64, -64, -64, -64, 64, 64, 64, 64, 64, 64, 64, 64, 64, 64, -64, 64, 64, -64, -64, 64, 64, -64, 64, 64, 64, -64, -64, -64, -64, -64, -64, -64, 64, 64, 64, 64, -64, -64, 64, 64, 64, 64, 64, -64, -64, -64, 64, -64, 64, 64, -64, 64, -64, -64, -64, 64, 64, -64, -64, -64, 64, 64, 64, 64, 64, 64, 64, -64, 64, 64, 64, 64, -64, 64, 64, 64, 64, 64, -64, 64, -64, -64, -64, 64, 64, 64, -64, -64, -64, 64, 64, 64, 64, 64, -64, 64, 64, 64, -64, 64, -64, -64, -64, -64, 64, 64, 64, 64, 64, 64, -64, -64, 64, 64, -64, -64, -64, 64, 64, 64, 64, 64, 64, -64, -64, -64, -64, 64, -64, -64, 64, 64, 64, 64, -64, 64, -64, 64, -64, -64, 64, 64, 64, 64, 64, -64, 64, 64, 64, 64, 64, -64, 64, 64, -64, 64, -64, -64, 64, 64, -64, -64, -64, 64, -64, -64, 64, -64, -64, 64, -64, -64, -64, -64, 64, 64, 64, -64, -64, -64, -64, 64, 64, 64, -64, 64, -64, -64, 64, 64, -64, 64, 64, 64, -64, 64, 64, 64, -64, -64, -64, -64, -64, 64, 64, -64, 64, 64, -64, 64, 64, 64, 64, 64, 64, -64, 64, -64, -64, 64, -64, 64, -64, -64, 64, -64, 64, -64, 64, 64, -64, 64, -64, 64, 64, 64, -64, 64, -64, 64, -64, -64, -64, -64, -64, -64, 64, 64, 64, 64, 64, 64, 64, 64, 64, 64, 64, -64, 64, -64, -64, 64, 64, -64, -64, -64, 64, -64, -64, 64, 64, -64, -64, -64, 64, 64, 64, 64, 64, 64, 64, 64, 64, 64, 64, 64, -64, 64, -64, 64, -64, 64, -64, 64, -64, 64, -64, 64, -64, 64, -64, -64, -64, 64, 64, 64, 64, 64, 64, 64, 64, 64, -64, 64, 64, 64, 64, 64, 64, 64, 64, -64, 64, 64, 64, 64, 64, 64, -64, -64, 64, -64, -64, 64, 64, 64, -64, 64, 64, 64, 64, -64, 64, 64, 64, 64, 64, -64, 64, 64, -64, -64, 64, 64, 64, 64, -64, -64, 64, -64, 64, 64, 64, 64, 64, 64, 64, 64, -64, 64, 64, 64, 64, 64, 64, 64, -64, -64, -64, 64, -64, -64, 64, -64, 64, 64, -64, 64, 64, 64, -64, 64, 64, 64, 64, 64, 64, 64, 64, 64, 64, 64, 64, 64, 64, 64, -64, -64, -64, 64, 64, -64, -64, -64, 64, 64, -64, 64, -64, 64, 64, -64, 64, 64, 64, 64, 64, 64, 64, 64, -64, 64, 64, -64, -64, -64, -64, -64, -64, -64, 64, -64, 64, 64, 64, -64, 64, 64, 64, -64, -64, 64, 64, 64, 64, 64, 64, 64, -64, -64, 64, -64, 64, -64, 64, 64, 64, 64, 64, -64, 64, 64, -64, 64, 64, 64, -64, 64, -64, 64, 64, 64, 64, 64, 64, 64, 64, -64, 64, 64, -64, 64, 64, -64, 64, 64, 64, -64, 64, 64, 64, 64, 64, -64, -64, 64, 64, 64, 64, 64, 64, 64, 64, 64, 64, 64, 64, -64, 64, -64, 64, -64, 64, 64, 64, 64, 64, 64, 64, 64, 64, 64, -64, 64, 64, 64, 64, 64, -64, -64, -64, 64, 64, -64, 64, -64, -64, -64, -64, 64, 64, 64, 64, 64, 64, 64, 64, 64, 64, 64, -64, -64, 64, 64, 64, 64, -64, 64, 64, -64, 64, 64, -64, 64, 64, -64, -64, -64, -64, 64, 64, 64, 64, -64, 64, 64, 64, 64, -64, 64, 64, 64, 64, 64, 64, 64, 64, -64, 64, 64, 64, 64, 64, 64, 64, 64, 64, 64, -64, 64, 64, 64, 64, 64, 64, 64, -64, 64, 64, 64, 64, 64, 64, -64, 64, -64, -64, -64, -64, 64, 64, 64, -64, 64, 64, -64, 64, 64, 64, 64, -64, 64, 64, 64, -64, -64, 64, 64, 64, 64, -64, -64, 64, 64, 64, 64, 64, 64, -64, 64, -64, 64, 64, 64, -64, 64, -64, -64, 64, 64, 64, -64, 64, 64, 64, 64, 64, 64, -64, 64, 64, 64, -64, 64, -64, -64, 64, -64, -64, -64, 64, -64, -64, 64, 64, 64, 64, 64, 64, 64, -64, -64, 64, 64, 64, 64, -64, 64, 64, 64, -64, 64, -64, -64, 64, -64, 64, -64, 64, 64, -64, 64, -64, 64, -64, 64, 64, 64, 64, -64, -64, 64, 64, 64, 64, -64, 64, 64, -64, -64, 64, -64, 64, 64, 64, 64, -64, 64, 64, -64, 64, 64, 64, 64, 64, 64, 64, -64, -64, 64, 64, 64, 64, -64, -64, 64, -64, 64, -64, -64, -64, 64, -64, 64, 64, -64, 64, 64, 64, -64, 64, 64, 64, 64, 64, -64, -64, -64, 64, 64, 64, -64, -64, 64, -64, 64, 64, -64, -64, -64, 64, 64, -64, 64, 64, 64, 64, 64, 64, 64, 64, 64, 64, 64, -64, -64, 64, 64, 64, 64, 64, 64, 64, -64, -64, 64, -64, 64, 64, -64, -64, -64, -64, 64, 64, 64, 64, 64, 64, 64, 64, 64, -64, -64, 64, 64, -64, 64, 64, 64, 64, 64, 64, 64, 64, -64, 64, -64, 64, 64, -64, -64, 64, 64, -64, 64, -64, -64, -64, 64, 64, -64, -64, -64, -64, 64, 64, 64, -64, -64, -64, -64, -64, -64, 64, 64, -64, -64, 64, 64, -64, -64, 64, 64, -64, 64, -64, -64, 64, -64, 64, -64, -64, 64, -64, 64, -64, 64, 64, 64, -64, 64, -64, -64, -64, -64, 64, -64, -64, -64, 64, -64, 64, -64, -64, -64, -64, 64, 64, 64, 64, -64, -64, -64, 64, -64, 64, -64, 64, -64, -64, -64, -64, -64, 64, -64, 64, 64, -64, 64, 64, -64, 64, 64, 64, 64, 64, 64, -64, -64, -64, -64, -64, -64, -64, 64, -64, 64, -64, -64, -64, -64, -64, -64, -64, -64, -64, -64, -64, -64, 64, 64, 64, 64, 64, 64, 64, -64, -64, 64, -64, 64, 64, 64, -64, 64, 64, -64, 64, 64, 64, -64, 64, 64, 64, 64, -64, -64, 64, -64, -64, -64, -64, -64, 64, 64, 64, -64, -64, -64, 64, -64, -64, 64, 64, -64, -64, 64, 64, 64, -64, -64, -64, -64, -64, -64, -64, -64, -64, -64, -64, -64, 64, 64, 64, -64, 64, 64, -64, 64, -64, 64, 64, -64, -64, 64, 64, 64, 64, -64, -64, 64, -64, 64, 64, -64, -64, -64, -64, 64, 64, 64, -64, -64, 64, 64, 64, 64, 64, 64, -64, -64, 64, 64, -64, 64, -64, 64, -64, -64, -64, -64, 64, -64, -64, -64, 64, -64, -64, -64, -64, 64, 64, 64, 64, -64, 64, -64, -64, 64, 64, -64, -64, -64, 64, 64, 64, 64, -64, -64, 64, -64, 64, -64, 64, -64, 64, 64, 64, -64, 64, -64, 64, 64, -64, -64, 64, 64, 64, -64, -64, -64, -64, 64, -64, -64, 64, 64, -64, -64, 64, 64, -64, 64, 64, 64, 64, -64, -64, -64, 64, 64, -64, 64, -64, 64, -64, -64, 64, -64, -64, -64, 64, -64, -64, -64, -64, 64, -64, -64, -64, 64, 64, 64, 64, 64, 64, 64, 64, 64, 64, -64, -64, -64, -64, -64, -64, 64, -64, -64, 64, 64, 64, -64, -64, -64, -64, -64, -64, -64, -64, 64, 64, -64, 64, -64, -64, -64, -64, -64, 64, -64, 64, 64, 64, -64, -64, -64, 64, -64, -64, 64, -64, -64, -64, -64, -64, -64, 64, -64, -64, 64, 64, 64, 64, -64, 64, 64, 64, 64, 64, 64, -64, -64, -64, -64, 64, 64, 64, 64, -64, -64, -64, -64, -64, -64, 64, 64, 64, -64, -64, -64, -64, 64, 64, -64, 64, -64, 64, 64, -64, 64, -64, -64, 64, 64, -64, -64, -64, -64, -64, -64, -64, 64, 64, -64, 64, -64, -64, -64, -64, -64, -64, 64, -64, -64, 64, 64, -64, 64, -64, -64, 64, 64, 64, -64, -64, -64, -64, 64, 64, -64, -64, -64, 64, 64, 64, -64, -64, -64, 64, -64, -64, 64, 64, 64, 64, 64, -64, 64, -64, 64, -64, -64, -64, -64, -64, 64, 64, -64, 64, 64, 64, 64, 64, -64, -64, -64, 64, -64, -64, -64, -64, -64, 64, 64, 64, 64, 64, -64, -64, -64, -64, -64, 64, 64, 64, 64, -64, -64, -64, -64, 64, -64, -64, -64, 64, -64, -64, 64, -64, -64, 64, 64, 64, 64, -64, -64, -64, -64, -64, -64, 64, 64, 64, 64, 64, -64, 64, -64, 64, -64, -64, -64, -64, -64, 64, 64, -64, -64, 64, 64, 64, 64, -64, -64, -64, -64, 64, -64, -64, 64, 64, 64, 64, -64, 64, -64, -64, -64, -64, 64, 64, 64, 64, -64, -64, -64, -64, -64, 64, -64, -64, -64, -64, 64, 64, 64, 64, -64, 64, 64, -64, -64, -64, -64, -64, -64, -64, 64, -64, -64, -64, 64, -64, -64, -64, -64, -64, -64, -64, 64, 64, -64, 64, -64, -64, -64, -64, -64, -64, -64, -64, -64, -64, -64, -64, 64, -64, 64, 64, -64, -64, -64, -64, -64, -64, -64, -64, 64, 64, -64, 64, -64, -64, -64, -64, -64, -64, -64, -64, -64, -64, -64, 64, -64, -64, 64, 64, -64, -64, -64, -64, -64, -64, -64, -64, -64, -64, 64, -64, -64, -64, -64, -64, -64, -64, -64, 64, -64, -64, -64, -64, 64, 64, -64, 64, 64, -64, -64, -64, -64, 64, 64, -64, 64, 64, 64, -64, -64, -64, -64, 64, -64, -64, -64, 64, 64, 64, 64, 64, 64, 64, 64, 64, -64, 64, -64, -64, 64, 64, -64, 64, 64, 64, -64, -64, -64, -64, -64, -64, -64, -64, 64, -64, 64, 64, 64, -64, 64, -64, 64, 64, 64, 64, 64, 64, 64, -64, 64, 64, 64, -64, -64, -64, -64, -64, 64, 64, -64, -64, 64, 64, -64, 64, 64, -64, 64, -64, 64, -64, -64, 64, 64, 64, 64, 64, 64, 64, 64, 64, 64, 64, 64, -64, -64, -64, -64, -64, 64, -64, 64, 64, 64, -64, -64, 64, 64, -64, -64, 64, -64, 64, 64, 64, 64, 64, -64, 64, -64, -64, -64, -64, -64, -64, -64, -64, 64, -64, -64, 64, -64, 64, 64, 64, 64, 64, -64, 64, -64, -64, 64, 64, 64, -64, 64, -64, 64, 64, -64, 64, 64, -64, -64, 64, -64, -64, 64, -64, -64, -64, 64, -64, -64, 64, 64, 64, 64, -64, -64, 64, 64, 64, -64, -64, 64, -64, 64, 64, -64, -64, -64, 64, 64, -64, 64, 64, 64, 64, -64, 64, -64, -64, -64, 64, -64, 64, -64, 64, 64, -64, -64, -64, 64, -64, 64, 64, 64, -64, 64, -64, -64, 64, -64, 64, 64, 64, 64, -64, 64, 64, 64, 64, -64, -64, -64, 64, -64, -64, -64, 64, 64, 64, -64, 64, -64, -64, -64, 64, 64, 64, 64, -64, -64, 64, -64, -64, 64, -64, -64, 64, 64, 64, -64, 64, -64, -64, -64, -64, 64, 64, 64, 64, -64, 64, -64, 64, 64, -64, 64, -64, -64, -64, 64, -64, 64, -64, -64, -64, 64, -64, 64, 64, -64, 64, 64, 64, -64, -64, 64, 64, -64, -64, -64, 64, 64, 64, 64, -64, 64, 64, 64, 64, -64, 64, -64, -64, -64, 64, -64, -64, 64, -64, 64, 64, 64, 64, 64, 64, 64, -64, 64, 64, 64, 64, -64, -64, -64, -64, -64, -64, 64, 64, -64, -64, -64, -64, 64, -64, -64, -64, -64, 64, 64, 64, 64, -64, -64, 64, 64, 64, 64, 64, 64, 64, 64, -64, -64, -64, -64, -64, -64, -64, -64, -64, -64, 64, -64, 64, 64, 64, -64, 64, 64, 64, -64, 64, -64, -64, -64, 64, 64, 64, 64, -64, -64, 64, 64, -64, -64, -64, -64, -64, -64, -64, -64, 64, 64, 64, -64, -64, -64, 64, 64, -64, 64, 64, -64, 64, 64, -64, 64, -64, -64, -64, -64, -64, 64, -64, -64, -64, -64, -64, -64, -64, 64, 64, 64, -64, 64, 64, 64, -64, -64, 64, 64, -64, -64, -64, 64, -64, -64, -64, -64, 64, -64, -64, -64, 64, -64, 64, 64, 64, 64, 64, 64, -64, 64, -64, -64, -64, 64, 64, -64, 64, -64, -64, -64, -64, 64, -64, 64, -64, -64, -64, -64, 64, 64, 64, 64, 64, 64, 64, 64, 64, -64, -64, -64, 64, 64, 64, -64, -64, -64, -64, 64, -64, 64, -64, 64, -64, -64, -64, 64, 64, 64, 64, 64, 64, 64, 64, 64, -64, -64, -64, -64, -64, -64, 64, -64, -64, -64, -64, 64, -64, 64, -64, -64, -64, 64, -64, 64, 64, 64, 64, 64, 64, 64, 64, -64, -64, -64, -64, -64, -64, 64, 64, 64, 64, 64, 64, -64, 64, -64, 64, 64, -64, -64, 64, 64, 64, 64, 64, 64, 64, 64, -64, -64, -64, -64, -64, -64, 64, 64, -64, -64, 64, 64, 64, 64, -64, -64, 64, 64, -64, 64, 64, 64, 64, 64, 64, 64, 64, 64, -64, -64, -64, -64, -64, -64, 64, -64, -64, -64, -64, -64, -64, -64, -64, -64, -64, -64, 64, -64, 64, 64, 64, -64, 64, 64, 64, 64, -64, -64, -64, -64, -64, -64, 64, -64, -64, -64, -64, 64, -64, 64, 64, 64, -64, 64, 64, -64, 64, -64, 64, 64, -64, -64, -64, 64, -64, -64, -64, -64, 64, 64, 64, 64, -64, -64, 64, -64, -64, 64, 64, -64, -64, -64, 64, -64, -64, 64, -64, 64, -64, -64, 64, -64, -64, -64, -64, -64, 64, 64, 64, 64, 64, 64, -64, -64, -64, -64, -64, -64, -64, -64, -64, -64, -64, 64, 64, -64, -64, -64, -64, -64, -64, -64, -64, -64, 64, 64, -64, 64, 64, -64, 64, 64, -64, -64, -64, -64, 64, 64, 64, -64, -64, 64, 64, -64, -64, 64, 64, -64, -64, 64, 64, -64, -64, 64, 64, -64, 64, 64, 64, 64, 64, 64, 64, -64, -64, -64, -64, 64, 64, 64, 64, 64, -64, -64, 64, -64, 64, 64, 64, -64, -64, -64, 64, 64, 64, 64, 64, 64, -64, 64, 64, -64, -64, -64, -64, -64, -64, 64, 64, 64, -64, 64, -64, 64, 64, 64, -64, -64, -64, 64, 64, 64, 64, 64, 64, 64, -64, -64, -64, -64, -64, -64, 64, -64, 64, 64, 64, -64, -64, -64, 64, 64, 64, 64, 64, 64, -64, -64, 64, 64, -64, 64, 64, -64, -64, 64, 64, -64, -64, 64, 64, 64, 64, -64, -64, -64, -64, -64, -64, -64, 64, 64, -64, 64, -64, 64, -64, 64, -64, 64, 64, 64, 64, 64, -64, 64, 64, 64, -64, -64, -64, 64, -64, -64, -64, -64, 64, 64, 64, 64, 64, -64, -64, 64, -64, 64, 64, 64, 64, 64, -64, 64, -64, -64, -64, 64, 64, 64, -64, 64, 64, 64, 64, 64, -64, 64, 64, 64, 64, 64, -64, -64, 64, 64, 64, 64, 64, -64, 64, -64, 64, 64, -64, 64, 64, 64, 64, -64, 64, -64, -64, -64, 64, -64, 64, 64, -64, 64, -64, -64, -64, 64, 64, -64, 64, 64, 64, 64, 64, 64, -64, -64, 64, 64, -64, 64, -64, -64, -64, -64, -64, -64, 64, 64, -64, -64, -64, 64, 64, 64, -64, 64, -64, -64, -64, -64, 64, 64, -64, 64, -64, 64, 64, -64, -64, 64, -64, 64, 64, -64, -64, -64, -64, -64, 64, -64, 64, -64, -64, 64, 64, 64, 64, -64, -64, 64, -64, -64, -64, 64, -64, 64, 64, -64, -64, -64, 64, -64, 64, -64, 64, -64, 64, -64, -64, -64, -64, -64, -64, -64, 64, 64, -64, -64, -64, 64, -64, 64, 64, 64, 64, 64, -64, -64, -64, -64, -64, -64, 64, 64, 64, 64, 64, 64, 64, -64, -64, 64, 64, -64, -64, -64, -64, 64, 64, -64, 64, -64, 64, 64, -64, -64, -64, -64, -64, -64, 64, 64, 64, -64, 64, -64, 64, 64, -64, -64, 64, -64, 64, -64, 64, -64, 64, 64, -64, -64, -64, 64, -64, 64, -64, -64, 64, 64, -64, 64, -64, 64, 64, 64, 64, -64, 64, -64, 64, 64, -64, 64, -64, -64, -64, 64, -64, 64, -64, -64, 64, 64, -64, -64, -64, 64, -64, 64, -64, 64, 64, -64, -64, 64, -64, 64, -64, -64, 64, -64, 64, 64, -64, 64, -64, -64, -64, -64, -64, 64, 64, -64, 64, -64, 64, -64, 64, -64, -64, 64, -64, 64, 64, -64, 64, -64, -64, -64, 64, 64, -64, 64, -64, -64, -64, -64, -64, 64, 64, 64, 64, 64, -64, -64, -64, -64, -64, -64, -64, -64, -64, -64, 64, 64, 64, 64, -64, 64, -64, 64, -64, 64, -64, -64, -64, 64, -64, -64, 64, 64, -64, -64, 64, 64, -64, -64, -64, -64, -64, 64, 64, 64, 64, 64, -64, 64, -64, -64, 64, -64, -64, 64, -64, -64, -64, -64, 64, -64, -64, 64, 64, -64, -64, -64, -64, -64, 64, 64, -64, 64, 64, 64, -64, 64, 64, -64, -64, 64, -64, -64, -64, 64, 64, -64, -64, 64, -64, 64, -64, -64, -64, -64, -64, -64, -64, 64, -64, 64, -64, 64, 64, 64, 64, -64, -64, -64, -64, -64, 64, -64, -64, 64, -64, -64, 64, 64, -64, -64, -64, -64, -64, -64, -64, 64, 64, 64, -64, 64, 64, 64, 64, 64, 64, -64, -64, -64, 64, 64, 64, -64, 64, -64, 64, -64, 64, 64, -64, 64, -64, 64, 64, 64, -64, -64, -64, 64, -64, 64, 64, -64, -64, -64, -64, 64, -64, 64, -64, -64, 64, 64, -64, -64, -64, -64, -64, -64, -64, 64, 64, -64, -64, -64, 64, 64, 64, 64, -64, -64, 64, 64, -64, -64, -64, -64, -64, 64, -64, 64, 64, -64, 64, -64, -64, -64, 64, -64, -64, -64, 64, 64, 64, -64, 64, -64, 64, -64, 64, 64, -64, -64, -64, 64, -64, 64, -64, -64, 64, -64, -64, -64, -64, -64, -64, -64, -64, -64, 64, -64, -64, 64, 64, 64, 64, 64, -64, 64, 64, -64, -64, -64, -64, -64, 64, -64, -64, 64, -64, -64, -64, -64, -64, -64, -64, -64, -64, -64, -64, 64, -64, 64, -64, 64, 64, -64, 64, -64, 64, -64, 64, -64, -64, -64, -64, -64, -64, -64, -64, -64, -64, -64, 64, -64, 64, -64, 64, 64, -64, 64, 64, -64, 64, -64, -64, -64, -64, -64, -64, -64, -64, -64, -64, -64, -64, 64, -64, 64, 64, -64, -64, 64, -64, 64, -64, 64, -64, -64, -64, -64, -64, -64, -64, 64, -64, -64, 64, -64, -64, -64, 64, -64, -64, 64, -64, -64, -64, -64, -64, -64, -64, -64, -64, 64, 64, -64, 64, 64, 64, -64, -64, -64, 64, -64, 64, -64, -64, -64, -64, 64, -64, -64, -64, 64, -64, -64, -64, -64, 64, 64, -64, 64, -64, 64, -64, -64, -64, -64, -64, 64, -64, 64, -64, -64, 64, -64, -64, -64, -64, -64, -64, -64, -64, -64, 64, -64, -64, -64, -64, -64, 64, -64, -64, 64, 64, -64, 64, -64, 64, 64, -64, 64, -64, -64, -64, -64, 64, 64, 64, -64, 64, -64, 64, 64, 64, -64, 64, 64, -64, -64, 64, 64, 64, 64, -64, -64, -64, -64, 64, 64, 64, 64, -64, 64, 64, -64, -64, -64, -64, -64, 64, 64, 64, -64, -64, -64, -64, -64, -64, 64, 64, -64, -64, -64, -64, 64, -64, -64, -64, -64, -64, -64, 64, 64, -64, -64, 64, -64, -64, -64, -64, 64, 64, -64, 64, -64, 64, 64, -64, -64, -64, -64, 64, -64, -64, 64, -64, 64, 64, 64, -64, -64, -64, 64, -64, 64, -64, 64, -64, -64, -64, -64, 64, -64, -64, -64, 64, 64, -64, 64, 64, 64, -64, 64, -64, 64, 64, 64, 64, -64, -64, -64, -64, -64, 64, 64, 64, -64, -64, 64, -64, -64, -64, -64, 64, 64, -64, -64, -64, 64, 64, 64, -64, 64, -64, 64, -64, 64, -64, 64, -64, 64, 64, 64, -64, -64, 64, -64, -64, -64, -64, -64, 64, 64, 64, -64, -64, 64, 64, 64, -64, 64, -64, 64, -64, -64, -64, 64, 64, 64, 64, -64, -64, -64, 64, 64, 64, -64, 64, 64, -64, -64, 64, 64, -64, 64, -64, 64, 64, 64, 64, 64, 64, 64, 64, 64, 64, 64, 64, 64, -64, 64, 64, -64, -64, -64, -64, 64, -64, -64, -64, 64, -64, 64, 64, 64, 64, 64, 64, 64, -64, 64, -64, 64, -64, 64, 64, -64, 64, 64, 64, -64, 64, 64, 64, 64, 64, 64, 64, 64, 64, 64, 64, 64, -64, 64, -64, 64, 64, 64, 64, 64, -64, 64, -64, 64, -64, 64, 64, -64, 64, 64, -64, -64, 64, -64, -64, -64, 64, 64, 64, -64, 64, -64, 64, 64, -64, 64, -64, 64, 64, -64, 64, 64, 64, 64, 64, 64, -64, -64, 64, 64, -64, 64, 64, 64, -64, -64, 64, 64, -64, 64, -64, -64, -64, 64, -64, -64, 64, 64, -64, 64, -64, 64, -64, 64, 64, -64, -64, 64, 64, -64, -64, 64, 64, 64, -64, -64, 64, -64, -64, 64, -64, 64, 64, -64, 64, -64, 64, 64, -64, 64, -64, 64, 64, 64, -64, 64, -64, 64, 64, 64, 64, -64, -64, 64, -64, 64, 64, 64, -64, 64, 64, 64, 64, 64, 64, -64, -64, -64, 64, 64, 64, 64, 64, -64, 64, -64, 64, -64, 64, 64, 64, 64, 64, 64, 64, 64, 64, 64, -64, 64, -64, 64, 64, 64, 64, 64, -64, 64, 64, 64, 64, 64, 64, 64, 64, 64, 64, 64, -64, 64, 64, 64, -64, 64, 64, 64, 64, 64, 64, -64, -64, -64, 64, 64, -64, 64, 64, -64, 64, 64, -64, 64, 64, 64, 64, 64, 64, 64, -64, 64, 64, 64, 64, 64, -64, 64, 64, 64, -64, 64, -64, 64, 64, 64, -64, 64, -64, 64, -64, 64, -64, 64, -64, 64, -64, 64, 64, 64, -64, 64, -64, 64, 64, 64, 64, -64, -64, 64, 64, -64, -64, -64, 64, -64, -64, 64, 64, -64, 64, 64, 64, 64, 64, 64, -64, -64, -64, 64, -64, -64, 64, 64, 64, 64, -64, 64, 64, 64, 64, -64, -64, -64, 64, -64, 64, 64, -64, -64, 64, 64, -64, 64, -64, -64, 64, 64, 64, 64, 64, 64, 64, 64, 64, 64, 64, -64, -64, -64, 64, -64, -64, 64, 64, 64, 64, -64, -64, -64, 64, 64, 64, 64, 64, -64, 64, 64, 64, -64, 64, 64, -64, 64, -64, 64, -64, -64, -64, 64, 64, -64, 64, -64, -64, -64, 64, 64, -64, -64, -64, -64, -64, -64, 64, -64, -64, -64, 64, 64, -64, 64, -64, -64, -64, 64, 64, -64, -64, -64, 64, 64, -64, -64, -64, 64, -64, 64, 64, 64, -64, 64, 64, -64, 64, 64, 64, -64, 64, -64, -64, -64, -64, -64, 64, -64, 64, 64, 64, -64, -64, -64, 64, 64, -64, 64, 64, 64, 64, -64, 64, 64, 64, -64, 64, 64, -64, -64, 64, 64, 64, -64, -64, -64, -64, -64, 64, 64, -64, -64, 64, -64, -64, 64, 64, -64, 64, -64, 64, 64, 64, 64, -64, 64, -64, 64, 64, 64, 64, -64, -64, 64, -64, -64, 64, -64, -64, 64, 64, -64, 64, -64, -64, -64, -64, 64, -64, -64, 64, 64, -64, -64, -64, 64, 64, 64, -64, -64, -64, 64, -64, 64, 64, -64, -64, 64, -64, 64, 64, 64, 64, 64, 64, 64, 64, 64, 64, 64, -64, -64, -64, -64, -64, -64, 64, 64, 64, 64, -64, -64, -64, 64, -64, -64, -64, 64, 64, 64, 64, 64, -64, -64, -64, 64, 64, -64, -64, 64, -64, 64, -64, 64, 64, 64, 64, -64, -64, 64, 64, -64, 64, -64, 64, 64, -64, 64, 64, -64, 64, 64, -64, 64, -64, -64, 64, 64, 64, -64, -64, 64, 64, 64, -64, 64, 64, 64, 64, -64, 64, 64, -64, 64, 64, -64, 64, 64, 64, -64, 64, 64, 64, 64, -64, 64, -64, 64, -64, 64, -64, -64, -64, -64, 64, -64, -64, -64, 64, 64, 64, 64, 64, 64, 64, -64, 64, 64, -64, 64, 64, 64, 64, 64, 64, 64, 64, -64, -64, 64, 64, 64, -64, 64, 64, -64, -64, 64, -64, 64, -64, 64, -64, -64, -64, 64, 64, 64, 64, 64, 64, 64, -64, 64, 64, 64, -64, 64, 64, 64, -64, 64, -64, -64, 64, 64, 64, 64, -64, -64, -64, 64, 64, 64, -64, 64, -64, -64, 64, -64, 64, -64, -64, -64, -64, 64, 64, -64, 64, 64, 64, -64, 64, 64, -64, -64, -64, -64, -64, -64, 64, 64, -64, 64, 64, -64, 64, 64, -64, -64, 64, 64, -64, 64, -64, 64, 64, -64, -64, 64, 64, 64, -64, -64, -64, -64, -64, -64, -64, 64, -64, -64, 64, 64, 64, 64, -64, 64, 64, 64, -64, -64, -64, 64, 64, -64, -64, 64, 64, 64, -64, 64, -64, -64, 64, 64, -64, 64, -64, -64, -64, 64, 64, 64, -64, 64, -64, -64, -64, -64, 64, 64, 64, 64, 64, 64, -64, -64, 64, 64, -64, -64, -64, 64, -64, 64, -64, 64, 64, 64, 64, 64, 64, -64, -64, 64, 64, -64, 64, -64, -64, 64, 64, 64, -64, -64, -64, -64, -64, -64, -64, 64, 64, -64, 64, 64, 64, 64, 64, 64, 64, 64, -64, 64, -64, -64, 64, -64, -64, 64, -64, 64, -64, 64, -64, 64, -64, -64, -64, -64, -64, -64, -64, -64, -64, -64, 64, 64, 64, 64, 64, 64, -64, -64, 64, -64, 64, -64, 64, -64, 64, 64, 64, 64, 64, -64, -64, -64, -64, -64, -64, -64, 64, 64, 64, 64, 64, 64, 64, 64, 64, 64, 64, 64, 64, 64, -64, 64, 64, 64, -64, -64, 64, -64, -64, 64, 64, 64, -64, 64, 64, 64, 64, 64, 64, 64, 64, 64, 64, 64, 64, 64, -64, 64, 64, 64, 64, -64, -64, -64, 64, -64, 64, 64, 64, -64, -64, -64, -64, 64, 64, 64, 64, 64, 64, 64, 64, 64, 64, -64, -64, -64, -64, 64, -64, -64, -64, -64, 64, -64, -64, 64, -64, -64, -64, -64, -64, -64, -64, 64, -64, 64, 64, 64, 64, 64, 64, 64, 64, -64, -64, -64, -64, -64, 64, -64, -64, -64, -64, -64, 64, -64, -64, -64, -64, 64, -64, -64, -64, -64, 64, 64, 64, 64, -64, 64, -64, 64, -64, -64, -64, -64, -64, -64, -64, -64, 64, 64, 64, -64, -64, -64, -64, 64, 64, -64, -64, -64, -64, 64, 64, 64, 64, -64, -64, 64, -64, -64, -64, -64, -64, 64, -64, 64, 64, 64, -64, 64, -64, -64, 64, 64, -64, -64, -64, -64, -64, 64, 64, 64, -64, -64, 64, 64, 64, -64, -64, -64, -64, -64, 64, 64, 64, 64, 64, -64, 64, 64, 64, 64, -64, -64, -64, -64, -64, 64, 64, -64, 64, 64, 64, -64, -64, -64, -64, -64, -64, 64, 64, 64, 64, 64, 64, 64, 64, 64, 64, 64, -64, -64, -64, -64, -64, 64, 64, -64, 64, 64, -64, 64, 64, 64, -64, -64, -64, -64, 64, -64, 64, 64, -64, 64, -64, 64, -64, 64, -64, -64, -64, -64, 64, 64, 64, 64, -64, -64, 64, -64, -64, -64, 64, -64, -64, -64, -64, -64, 64, -64, 64, -64, 64, 64, -64, -64, -64, -64, 64, 64, -64, -64, -64, -64, 64, 64, 64, 64, -64, -64, 64, -64, -64, -64, -64, -64, -64, -64, -64, -64, 64, 64, -64, -64, -64, -64, -64, -64, 64, -64, 64, -64, 64, -64, 64, 64, -64, 64, 64, -64, -64, -64, -64, -64, -64, -64, 64, 64, 64, -64, -64, -64, -64, -64, -64, 64, 64, -64, 64, -64, -64, -64, 64, -64, -64, 64, 64, -64, -64, 64, -64, 64, -64, 64, 64, 64, 64, -64, -64, -64, -64, -64, -64, 64, 64, -64, 64, -64, -64, 64, -64, 64, -64, 64, 64, 64, 64, 64, -64, -64, 64, 64, 64, 64, 64, -64, -64, -64, -64, -64, 64, -64, -64, -64, 64, 64, 64, -64, 64, 64, 64, -64, -64, 64, 64, 64, 64, 64, 64, 64, 64, 64, 64, -64, -64, -64, -64, -64, 64, 64, -64, -64, 64, 64, 64, 64, 64, -64, -64, 64, 64, 64, 64, 64, 64, 64, 64, 64, 64, 64, 64, -64, -64, -64, 64, -64, -64, 64, 64, 64, 64, -64, 64, 64, 64, 64, -64, 64, 64, 64, 64, 64, 64, 64, 64, 64, 64, 64, 64, -64, 64, 64, 64, -64, -64, -64, -64, 64, 64, -64, 64, 64, -64, 64, 64, 64, 64, 64, 64, 64, 64, 64, 64, 64, 64, 64, 64, -64, -64, -64, -64, -64, -64, 64, -64, 64, 64, -64, 64, -64, 64, -64, 64, 64, 64, -64, 64, -64, 64, 64, 64, -64, 64, 64, 64, -64, -64, -64, -64, 64, -64, -64, 64, 64, -64, -64, 64, -64, -64, 64, -64, 64, -64, 64, -64, 64, 64, 64, 64, -64, 64, -64, -64, -64, -64, 64, -64, -64, -64, 64, 64, 64, -64, -64, -64, -64, -64, 64, -64, -64, -64, 64, -64, 64, 64, 64, 64, -64, -64, -64, -64, -64, -64, 64, 64, 64, 64, 64, -64, -64, -64, 64, -64, 64, 64, 64, -64, -64, -64, 64, -64, 64, 64, 64, -64, 64, 64, -64, 64, -64, -64, 64, -64, 64, 64, 64, -64, 64, 64, -64, -64, 64, -64, -64, 64, 64, -64, -64, -64, 64, -64, 64, -64, 64, 64, 64, -64, -64, -64, -64, -64, -64, -64, -64, -64, -64, 64, -64, 64, 64, 64, -64, 64, -64, -64, 64, -64, 64, -64, 64, -64, 64, -64, -64, -64, 64, -64, 64, 64, -64, -64, -64, -64, -64, 64, -64, 64, -64, -64, -64, -64, 64, 64, 64, 64, -64, -64, -64, -64, 64, -64, -64, 64, 64, 64, 64, 64, -64, -64, -64, -64, -64, 64, -64, -64, 64, -64, -64, -64, -64, -64, -64, -64, -64, -64, -64, -64, -64, 64, 64, -64, 64, -64, -64, 64, -64, 64, 64, 64, 64, 64, 64, -64, 64, -64, 64, -64, -64, 64, -64, -64, -64, 64, -64, 64, 64, 64, 64, 64, -64, 64, 64, 64, -64, -64, -64, -64, 64, -64, 64, 64, 64, -64, -64, 64, 64, -64, 64, 64, 64, 64, 64, 64, 64, 64, 64, 64, -64, 64, 64, -64, 64, 64, -64, -64, 64, 64, -64, 64, 64, 64, -64, -64, 64, -64, -64, 64, 64, -64, 64, 64, 64, 64, 64, 64, -64, 64, -64, 64, 64, 64, 64, -64, -64, -64, 64, -64, 64, 64, 64, -64, -64, -64, 64, 64, 64, 64, 64, 64, 64, 64, -64, 64, 64, 64, 64, -64, 64, -64, 64, -64, 64, 64, 64, 64, -64, 64, -64, 64, 64, 64, 64, 64, 64, -64, 64, 64, 64, 64, 64, 64, -64, 64, 64, -64, 64, 64, -64, 64, -64, -64, 64, -64, 64, 64, -64, -64, 64, -64, 64, -64, -64, -64, -64, 64, 64, 64, 64, 64, 64, 64, -64, 64, 64, 64, 64, -64, 64, 64, -64, 64, 64, 64, 64, -64, -64, 64, -64, 64, -64, 64, 64, 64, -64, 64, 64, 64, 64, 64, 64, -64, 64, 64, -64, -64, 64, 64, 64, 64, -64, -64, 64, -64, -64, -64, -64, -64, -64, -64, -64, -64, 64, 64, 64, 64, 64, 64, 64, -64, 64, -64, -64, -64, 64, -64, 64, 64, -64, 64, -64, 64, -64, -64, 64, 64, 64, 64, -64, 64, 64, 64, 64, 64, -64, -64, 64, -64, -64, -64, -64, -64, -64, 64, 64, 64, -64, 64, -64, -64, -64, -64, 64, 64, -64, 64, 64, 64, 64, 64, 64, 64, -64, -64, -64, -64, 64, 64, -64, -64, 64, -64, 64, -64, -64, 64, 64, 64, 64, 64, -64, -64, 64, 64, 64, 64, 64, 64, 64, -64, -64, -64, 64, 64, 64, 64, 64, 64, 64, -64, 64, 64, 64, 64, 64, 64, -64, 64, -64, -64, 64, -64, 64, 64, 64, 64, 64, 64, 64, -64, 64, 64, 64, 64, -64, -64, -64, 64, 64, 64, 64, -64, -64, 64, 64, 64, 64, 64, 64, 64, 64, 64, 64, 64, 64, 64, 64, 64, 64, 64, -64, 64, -64, 64, -64, -64, -64, -64, -64, 64, -64, 64, 64, 64, 64, 64, 64, 64, 64, 64, 64, 64, -64, 64, -64, -64, 64, 64, 64, -64, 64, 64, 64, 64, -64, 64, 64, -64, -64, 64, 64, -64, 64, 64, 64, 64, -64, -64, -64, 64, 64, -64, -64, -64, 64, -64, 64, -64, -64, -64, -64, -64, 64, -64, 64, -64, -64, 64, -64, -64, -64, 64, 64, 64, -64, -64, 64, -64, -64, 64, -64, -64, -64, -64, 64, 64, -64, 64, 64, 64, -64, 64, 64, -64, -64, 64, -64, -64, 64, -64, 64, 64, -64, 64, 64, -64, -64, 64, -64, 64, 64, 64, 64, 64, -64, 64, -64, -64, 64, -64, 64, 64, -64, 64, -64, -64, -64, -64, -64, 64, 64, 64, 64, 64, -64, 64, 64, 64, 64, 64, 64, 64, -64, 64, -64, -64, 64, -64, 64, 64, -64, 64, 64, 64, 64, 64, 64, -64, 64, -64, 64, 64, 64, 64, 64, 64, 64, -64, 64, 64, 64, 64, -64, 64, 64, -64, 64, 64, -64, 64, 64, 64, 64, 64, -64, 64, 64, -64, 64, 64, 64, 64, -64, 64, -64, -64, 64, 64, 64, 64, 64, 64, 64, 64, -64, 64, -64, 64, -64, -64, 64, 64, 64, 64, 64, 64, 64, 64, 64, -64, -64, -64, -64, 64, 64, -64, 64, 64, -64, 64, -64, -64, 64, -64, -64, -64, 64, 64, 64, -64, 64, -64, 64, 64, 64, 64, 64, 64, -64, 64, -64, -64, 64, 64, -64, 64, -64, -64, -64, -64, 64, -64, -64, -64, 64, -64, 64, 64, 64, 64, 64, 64, -64, -64, -64, -64, 64, 64, -64, -64, -64, 64, 64, -64, 64, 64, 64, 64, 64, 64, 64, -64, 64, -64, 64, 64, 64, -64, 64, -64, -64, -64, -64, 64, 64, 64, -64, -64, -64, 64, 64, -64, 64, 64, -64, -64, -64, 64, 64, -64, 64, 64, 64, -64, -64, 64, 64, -64, 64, 64, -64, 64, 64, -64, 64, 64, -64, 64, -64, -64, 64, 64, 64, -64, 64, -64, -64, -64, -64, 64, 64, 64, 64, -64, 64, -64, 64, 64, 64, 64, 64, 64, 64, 64, 64, 64, 64, -64, 64, 64, 64, -64, -64, -64, -64, -64, -64, 64, -64, 64, 64, 64, 64, 64, -64, -64, -64, 64, 64, 64, 64, 64, 64, -64, 64, 64, -64, -64, -64, -64, -64, 64, -64, -64, 64, 64, 64, 64, 64, 64, 64, 64, -64, -64, -64, -64, -64, 64, -64, 64, -64, 64, 64, -64, -64, -64, -64, -64, 64, -64, -64, 64, 64, 64, 64, 64, 64, 64, 64, 64, -64, -64, -64, 64, -64, -64, -64, -64, -64, -64, -64, 64, -64, -64, 64, 64, 64, -64, -64, 64, 64, 64, 64, 64, 64, 64, -64, -64, -64, -64, 64, -64, 64, 64, -64, -64, -64, -64, -64, -64, -64, -64, -64, 64, -64, -64, -64, 64, -64, 64, 64, 64, 64, 64, -64, -64, -64, -64, -64, -64, -64, -64, -64, -64, -64, -64, -64, -64, -64, -64, -64, -64, -64, 64, 64, 64, -64, -64, 64, 64, 64, 64, -64, -64, -64, -64, -64, -64, -64, 64, -64, -64, -64, -64, -64, -64, -64, -64, -64, -64, -64, -64, -64, -64, -64, -64, 64, 64, 64, 64, -64, -64, -64, -64, -64, -64, -64, 64, -64, -64, -64, -64, -64, -64, -64, -64, -64, -64, 64, -64, 64, -64, -64, -64, 64, -64, -64, -64, -64, -64, -64, -64, -64, -64, -64, 64, 64, 64, -64, -64, -64, -64, -64, -64, -64, -64, -64, -64, 64, -64, -64, -64, -64, -64, 64, 64, -64, -64, -64, -64, -64, -64, 64, 64, 64, 64, 64, 64, 64, -64, -64, -64, -64, -64, 64, 64, 64, -64, -64, 64, -64, 64, 64, -64, 64, 64, -64, -64, -64, -64, 64, 64, 64, 64, -64, 64, 64, -64, -64, -64, -64, -64, 64, -64, -64, 64, 64, 64, -64, 64, 64, 64, -64, 64, -64, 64, -64, 64, 64, 64, 64, -64, 64, 64, 64, -64, -64, -64, -64, 64, -64, -64, 64, 64, 64, 64, -64, 64, 64, -64, 64, -64, -64, -64, 64, -64, 64, 64, 64, 64, 64, -64, 64, 64, 64, 64, 64, 64, 64, -64, -64, 64, 64, 64, 64, 64, 64, 64, 64, 64, -64, -64, -64, 64, -64, 64, 64, 64, 64, 64, -64, 64, 64, 64, 64, 64, 64, -64, -64, -64, -64, -64, 64, 64, 64, 64, -64, 64, -64, -64, -64, 64, 64, 64, 64, 64, 64, 64, -64, -64, -64, 64, 64, 64, 64, -64, -64, -64, -64, -64, -64, 64, 64, -64, 64, -64, -64, -64, -64, 64, 64, 64, 64, 64, 64, -64, -64, -64, -64, 64, 64, -64, 64, -64, -64, -64, -64, -64, 64, 64, -64, -64, -64, -64, -64, -64, 64, -64, 64, 64, 64, 64, -64, -64, -64, -64, -64, 64, 64, 64, -64, 64, -64, -64, -64, -64, -64, 64, -64, -64, -64, -64, -64, -64, 64, 64, 64, 64, 64, 64, -64, -64, -64, -64, 64, 64, 64, 64, -64, 64, 64, 64, -64, -64, -64, -64, -64, -64, -64, -64, -64, 64, 64, -64, 64, 64, -64, -64, -64, -64, -64, -64, -64, 64, 64, 64, 64, 64, 64, -64, -64, -64, -64, -64, -64, -64, -64, -64, -64, 64, 64, -64, -64, -64, -64, -64, -64, -64, -64, -64, 64, 64, -64, 64, 64, 64, 64, -64, -64, -64, -64, -64, -64, -64, -64, -64, 64, -64, -64, -64, 64, -64, -64, -64, -64, 64, -64, -64, 64, -64, -64, 64, 64, -64, -64, -64, -64, -64, -64, -64, -64, -64, 64, -64, 64, 64, -64, 64, 64, 64, -64, -64, -64, -64, 64, -64, -64, 64, -64, 64, 64, 64, -64, -64, -64, -64, -64, 64, -64, 64, -64, -64, -64, -64, -64, -64, 64, 64, 64, 64, -64, 64, 64, 64, -64, 64, 64, -64, -64, 64, -64, -64, -64, -64, -64, 64, 64, 64, -64, 64, 64, -64, 64, -64, 64, -64, -64, -64, 64, -64, -64, -64, 64, 64, -64, 64, 64, -64, -64, 64, 64, 64, 64, 64, 64, -64, 64, 64, 64, -64, 64, -64, 64, -64, -64, -64, 64, 64, -64, 64, 64, 64, 64, 64, 64, -64, -64, 64, -64, 64, -64, -64, -64, 64, 64, 64, 64, 64, 64, 64, 64, 64, 64, -64, 64, 64, 64, -64, 64, 64, 64, 64, -64, 64, 64, -64, 64, 64, -64, 64, -64, -64, 64, -64, -64, -64, 64, 64, 64, 64, 64, -64, 64, 64, 64, -64, -64, -64, 64, 64, 64, 64, 64, -64, -64, -64, 64, 64, 64, 64, -64, -64, 64, 64, 64, 64, 64, 64, -64, 64, 64, 64, -64, -64, 64, 64, -64, 64, 64, -64, -64, -64, -64, 64, 64, 64, 64, 64, 64, 64, 64, 64, 64, 64, -64, 64, -64, -64, -64, -64, -64, 64, -64, -64, -64, 64, 64, 64, 64, 64, 64, 64, -64, 64, 64, 64, 64, 64, -64, 64, 64, 64, 64, 64, 64, -64, -64, 64, -64, -64, -64, 64, 64, 64, -64, 64, 64, -64, 64, 64, 64, 64, 64, 64, 64, 64, 64, 64, -64, 64, 64, 64, 64, -64, 64, 64, 64, 64, 64, -64, 64, 64, -64, 64, 64, -64, 64, -64, -64, -64, -64, 64, 64, -64, -64, -64, -64, 64, -64, 64, 64, -64, 64, 64, -64, -64, -64, -64, 64, 64, -64, 64, 64, 64, 64, 64, -64, -64, -64, 64, 64, 64, 64, -64, 64, 64, -64, -64, -64, 64, 64, 64, 64, 64, 64, 64, -64, 64, -64, 64, 64, 64, -64, 64, -64, 64, 64, -64, 64, -64, -64, -64, 64, 64, 64, 64, -64, 64, 64, 64, 64, -64, 64, -64, -64, -64, -64, -64, 64, 64, 64, -64, -64, -64, 64, -64, 64, 64, 64, 64, 64, -64, 64, 64, 64, 64, 64, 64, 64, -64, 64, -64, -64, 64, 64, -64, 64, 64, 64, -64, 64, 64, 64, 64, 64, 64, -64, -64, -64, 64, -64, 64, 64, 64, 64, 64, -64, -64, -64, 64, 64, 64, -64, -64, -64, 64, 64, 64, 64, 64, -64, -64, 64, 64, -64, -64, -64, -64, 64, 64, 64, 64, 64, 64, 64, -64, 64, -64, 64, 64, 64, 64, 64, 64, 64, 64, 64, 64, 64, 64, 64, 64, 64, -64, -64, -64, 64, 64, 64, -64, 64, 64, -64, 64, 64, 64, 64, 64, -64, 64, -64, 64, 64, -64, -64, -64, -64, 64, 64, 64, -64, -64, -64, -64, 64, 64, -64, -64, 64, 64, 64, -64, -64, 64, -64, -64, 64, 64, 64, 64, 64, 64, 64, 64, 64, -64, -64, 64, -64, -64, -64, 64, -64, -64, -64, -64, -64, 64, -64, -64, 64, 64, -64, -64, 64, 64, 64, -64, -64, -64, -64, 64, -64, -64, 64, 64, -64, -64, -64, 64, -64, -64, -64, -64, 64, 64, 64, 64, 64, 64, 64, -64, 64, 64, 64, -64, 64, 64, -64, -64, 64, 64, 64, 64, 64, -64, 64, -64, -64, 64, -64, -64, -64, 64, 64, 64, 64, 64, 64, -64, -64, 64, 64, -64, 64, 64, 64, 64, -64, 64, 64, 64, 64, -64, -64, -64, 64, -64, -64, 64, -64, 64, 64, 64, 64, -64, -64, 64, 64, -64, -64, -64, -64, 64, 64, 64, 64, 64, 64, 64, -64, -64, -64, -64, -64, 64, 64, -64, 64, 64, -64, 64, 64, -64, -64, 64, 64, -64, -64, -64, 64, 64, 64, 64, 64, 64, 64, 64, 64, -64, -64, -64, 64, 64, 64, 64, 64, 64, -64, 64, -64, 64, -64, 64, 64, -64, 64, -64, -64, 64, 64, 64, 64, 64, 64, 64, -64, -64, -64, -64, 64, 64, 64, 64, 64, 64, 64, 64, -64, -64, 64, 64, -64, 64, 64, 64, 64, 64, 64, 64, 64, 64, 64, -64, -64, -64, -64, -64, 64, 64, 64, 64, 64, 64, 64, 64, -64, -64, 64, -64, 64, -64, 64, 64, 64, 64, 64, 64, 64, 64, 64, -64, -64, 64, 64, -64, 64, 64, -64, 64, 64, 64, 64, 64, -64, 64, 64, 64, 64, -64, 64, -64, 64, 64, 64, 64, 64, -64, 64, -64, -64, 64, 64, -64, -64, 64, 64, 64, 64, 64, -64, -64, 64, -64, -64, -64, -64, 64, 64, -64, 64, 64, 64, 64, 64, -64, -64, -64, -64, 64, 64, -64, -64, 64, 64, 64, 64, -64, 64, -64, -64, 64, -64, -64, -64, -64, -64, -64, -64, 64, 64, 64, 64, -64, -64, -64, 64, 64, 64, -64, 64, 64, -64, -64, -64, -64, 64, 64, 64, -64, 64, -64, 64, 64, 64, 64, 64, -64, 64, 64, -64, -64, -64, 64, 64, 64, 64, 64, -64, -64, 64, 64, -64, -64, -64, -64, 64, -64, -64, 64, -64, 64, 64, 64, -64, 64, 64, 64, 64, 64, 64, 64, 64, 64, 64, 64, 64, 64, 64, -64, -64, 64, -64, -64, -64, 64, -64, 64, -64, 64, 64, 64, 64, 64, -64, 64, -64, 64, 64, 64, -64, -64, -64, 64, -64, 64, -64, 64, -64, 64, 64, 64, 64, 64, 64, -64, 64, -64, 64, -64, -64, -64, 64, 64, -64, -64, 64, -64, 64, -64, 64, -64, 64, -64, -64, -64, 64, 64, 64, -64, -64, 64, -64, -64, 64, 64, -64, 64, 64, -64, 64, -64, 64, -64, -64, 64, 64, 64, 64, -64, -64, -64, -64, -64, 64, 64, 64, 64, -64, -64, -64, 64, 64, -64, 64, -64, -64, 64, 64, -64, -64, 64, -64, -64, -64, 64, 64, -64, -64, 64, 64, 64, -64, -64, -64, -64, -64, -64, -64, 64, 64, 64, -64, -64, 64, 64, 64, -64, 64, 64, -64, -64, 64, 64, 64, -64, -64, -64, 64, 64, -64, 64, -64, 64, -64, -64, -64, 64, 64, -64, -64, -64, 64, -64, -64, -64, 64, -64, -64, -64, -64, 64, 64, -64, -64, -64, -64, 64, 64, 64, -64, 64, -64, -64, 64, -64, 64, -64, -64, 64, 64, 64, -64, -64, 64, 64, 64, 64, 64, -64, -64, 64, 64, -64, -64, -64, -64, 64, -64, 64, 64, -64, 64, 64, -64, -64, 64, -64, 64, 64, 64, -64, -64, 64, 64, -64, -64, 64, -64, 64, -64, 64, 64, -64, -64, 64, -64, 64, -64, -64, -64, -64, -64, 64, 64, 64, -64, 64, -64, -64, 64, -64, 64, -64, 64, -64, -64, -64, -64, -64, -64, 64, -64, 64, -64, -64, -64, -64, 64, 64, -64, 64, -64, 64, -64, -64, -64, -64, -64, -64, 64, -64, -64, -64, -64, -64, -64, -64, 64, -64, -64, -64, 64, 64, 64, 64, -64, -64, 64, -64, 64, 64, 64, 64, -64, 64, -64, 64, 64, -64, -64, -64, 64, -64, -64, -64, 64, -64, -64, 64, -64, 64, 64, 64, 64, 64, 64, 64, 64, -64, 64, -64, 64, -64, 64, 64, -64, -64, 64, 64, 64, -64, 64, -64, -64, 64, -64, -64, 64, 64, -64, 64, 64, 64, -64, 64, 64, -64, 64, 64, -64, 64, 64, 64, -64, -64, -64, -64, 64, -64, -64, 64, -64, -64, -64, -64, -64, 64, -64, 64, -64, 64, -64, 64, 64, 64, -64, -64, 64, -64, -64, -64, -64, -64, 64, -64, 64, -64, -64, -64, -64, -64, -64, -64, -64, -64, -64, 64, -64, -64, -64, 64, -64, -64, -64, -64, -64, -64, 64, 64, -64, -64, -64, -64, 64, -64, -64, -64, 64, 64, 64, 64, -64, -64, 64, -64, 64, -64, -64, 64, -64, -64, 64, -64, 64, -64, -64, 64, -64, 64, -64, 64, -64, 64, -64, 64, -64, 64, -64, -64, 64, 64, -64, 64, -64, -64, 64, -64, -64, 64, -64, -64, -64, 64, -64, 64, 64, 64, -64, -64, 64, -64, -64, -64, -64, -64, -64, -64, 64, -64, -64, -64, 64, 64, 64, -64, -64, -64, 64, 64, 64, -64, -64, -64, -64, -64, -64, 64, -64, -64, -64, 64, 64, -64, -64, -64, -64, 64, 64, -64, 64, -64, -64, 64, -64, -64, 64, 64, 64, -64, -64, -64, -64, -64, 64, -64, 64, -64, -64, -64, -64, -64, 64, 64, -64, -64, 64, -64, -64, 64, 64, -64, -64, 64, 64, 64, -64, -64, -64, 64, 64, -64, -64, -64, 64, 64, -64, 64, -64, -64, -64, 64, -64, 64, -64, -64, 64, -64, -64, 64, 64, 64, -64, -64, -64, -64, 64, -64, -64, 64, -64, -64, -64, -64, 64, -64, -64, 64, -64, 64, 64, 64, 64, -64, -64, -64, 64, -64, -64, -64, 64, -64, 64, -64, 64, -64, -64, -64, -64, -64, 64, -64, 64, -64, -64, -64, -64, -64, 64, -64, -64, -64, 64, -64, 64, 64, 64, 64, 64, -64, -64, -64, 64, 64, 64, -64, -64, -64, -64, -64, 64, -64, -64, 64, -64, -64, -64, 64, 64, 64, 64, 64, 64, 64, -64, -64, 64, -64, -64, -64, -64, -64, 64, -64, 64, -64, -64, 64, -64, -64, 64, -64, -64, 64, 64, -64, -64, 64, -64, -64, -64, -64, -64, -64, 64, -64, -64, 64, 64, -64, -64, -64, -64, -64, 64, -64, -64, -64, 64, -64, 64, 64, 64, -64, -64, -64, -64, 64, -64, -64, -64, 64, -64, 64, 64, -64, 64, 64, 64, -64, -64, -64, -64, 64, -64, -64, 64, 64, 64, -64, 64, 64, -64, -64, -64, 64, -64, -64, -64, 64, 64, 64, 64, 64, -64, 64, 64, 64, -64, 64, -64, -64, -64, -64, -64, -64, 64, 64, -64, -64, -64, -64, -64, 64, 64, 64, 64, 64, -64, -64, 64, -64, -64, -64, 64, -64, 64, -64, -64, -64, 64, 64, 64, 64, 64, -64, -64, 64, -64, 64, -64, -64, -64, 64, 64, 64, 64, 64, 64, 64, -64, -64, -64, -64, -64, -64, -64, 64, 64, 64, -64, -64, -64, -64, -64, 64, 64, -64, -64, -64, -64, -64, -64, -64, 64, 64, 64, 64, 64, 64, -64, 64, -64, 64, 64, 64, -64, -64, -64, -64, 64, -64, -64, 64, 64, 64, 64, -64, 64, 64, -64, 64, -64, 64, -64, 64, 64, 64, -64, -64, -64, 64, 64, -64, -64, 64, -64, 64, 64, -64, 64, -64, -64, 64, 64, 64, -64, 64, 64, 64, -64, 64, 64, 64, -64, -64, 64, -64, -64, 64, 64, -64, 64, -64, -64, -64, 64, 64, 64, -64, -64, -64, 64, 64, -64, -64, -64, -64, 64, 64, -64, -64, -64, -64, -64, -64, -64, 64, -64, -64, 64, 64, -64, -64, -64, 64, -64, -64, -64, -64, 64, 64, 64, 64, 64, -64, -64, -64, 64, -64, -64, -64, -64, 64, 64, -64, -64, -64, -64, -64, -64, -64, -64, -64, -64, 64, 64, -64, -64, 64, -64, -64, -64, -64, 64, 64, 64, -64, 64, 64, 64, 64, 64, 64, 64, -64, -64, -64, -64, -64, -64, -64, -64, -64, 64, -64, 64, -64, -64, -64, -64, 64, 64, 64, 64, 64, 64, 64, 64, 64, 64, -64, -64, -64, -64, -64, -64, -64, -64, -64, 64, -64, 64, 64, 64, -64, -64, 64, 64, 64, 64, -64, 64, 64, 64, 64, 64, 64, 64, 64, 64, 64, 64, -64, 64, -64, -64, -64, -64, -64, 64, 64, 64, -64, -64, 64, -64, 64, 64, 64, 64, -64, -64, 64, -64, -64, 64, 64, 64, 64, 64, 64, -64, -64, -64, -64, -64, -64, -64, 64, 64, -64, 64, 64, 64, 64, -64, -64, 64, -64, -64, 64, 64, 64, 64, 64, 64, 64, 64, 64, -64, -64, -64, -64, -64, 64, 64, 64, -64, -64, -64, -64, -64, 64, -64, -64, -64, -64, 64, 64, -64, 64, -64, 64, 64, 64, -64, 64, -64, -64, -64, -64, -64, 64, -64, 64, 64, -64, -64, -64, -64, -64, 64, -64, -64, -64, -64, -64, -64, -64, 64, -64, 64, 64, 64, -64, -64, -64, 64, -64, -64, -64, -64, -64, -64, 64, 64, 64, -64, -64, -64, -64, -64, -64, 64, -64, 64, 64, -64, 64, 64, -64, 64, -64, 64, -64, 64, -64, -64, -64, -64, 64, -64, -64, -64, -64, -64, -64, -64, -64, -64, -64, 64, 64, -64, 64, 64, 64, -64, -64, -64, -64, -64, -64, -64, -64, -64, -64, -64, 64, -64, 64, 64, 64, -64, 64, 64, -64, -64, 64, 64, -64, -64, -64, -64, -64, -64, -64, 64, 64, -64, -64, -64, -64, -64, 64, 64, 64, 64, 64, 64, -64, 64, 64, -64, -64, -64, -64, -64, -64, -64, -64, -64, -64, -64, -64, 64, -64, 64, -64, -64, -64, -64, -64, -64, 64, 64, 64, 64, -64, -64, -64, -64, -64, -64, -64, -64, -64, -64, -64, -64, -64, -64, 64, -64, -64, 64, -64, -64, 64, -64, -64, 64, 64, -64, -64, -64, 64, -64, -64, -64, 64, -64, -64, -64, -64, -64, -64, -64, 64, 64, -64, 64, -64, -64, -64, -64, -64, 64, 64, 64, 64, -64, 64, -64, -64, 64, 64, 64, -64, 64, 64, -64, -64, -64, -64, 64, 64, 64, 64, 64, -64, -64, -64, 64, -64, 64, -64, 64, -64, -64, -64, 64, -64, -64, -64, 64, 64, 64, 64, -64, -64, -64, -64, 64, 64, 64, 64, -64, 64, -64, 64, 64, -64, 64, 64, 64, -64, -64, -64, 64, 64, -64, -64, -64, -64, 64, -64, -64, -64, -64, -64, 64, 64, 64, 64, 64, -64, -64, -64, 64, -64, 64, -64, 64, -64, 64, 64, -64, 64, 64, 64, -64, -64, -64, 64, -64, -64, -64, -64, -64, -64, 64, -64, -64, -64, -64, -64, 64, 64, -64, 64, 64, 64, 64, 64, 64, -64, 64, -64, -64, -64, -64, 64, -64, -64, -64, -64, -64, -64, -64, 64, -64, -64, -64, 64, 64, 64, 64, 64, 64, -64, -64, -64, 64, 64, -64, 64, 64, 64, -64, 64, 64, -64, -64, 64, 64, -64, -64, 64, 64, -64, 64, 64, 64, 64, 64, 64, 64, -64, -64, -64, -64, 64, 64, -64, 64, -64, 64, 64, 64, 64, 64, 64, 64, -64, 64, -64, -64, 64, 64, 64, 64, 64, 64, 64, -64, -64, -64, 64, 64, -64, -64, -64, 64, 64, -64, 64, 64, 64, 64, 64, 64, 64, 64, 64, 64, 64, 64, 64, 64, 64, 64, 64, -64, 64, -64, -64, -64, -64, -64, -64, -64, -64, -64, -64, -64, -64, -64, 64, -64, -64, 64, 64, 64, -64, -64, -64, -64, -64, -64, 64, -64, -64, 64, 64, -64, -64, -64, 64, -64, 64, 64, -64, 64, 64, 64, -64, -64, -64, 64, 64, 64, -64, -64, 64, -64, 64, -64, -64, -64, -64, -64, 64, -64, -64, -64, 64, -64, 64, -64, 64, -64, -64, -64, 64, -64, -64, 64, -64, -64, -64, 64, 64, -64, -64, -64, 64, 64, -64, 64, -64, -64, 64, 64, 64, -64, 64, -64, -64, -64, -64, 64, -64, 64, -64, 64, 64, 64, 64, -64, -64, -64, -64, -64, 64, -64, -64, -64, 64, 64, -64, 64, 64, 64, -64, 64, 64, -64, -64, 64, 64, -64, -64, 64, -64, -64, -64, -64, -64, -64, -64, 64, 64, 64, 64, -64, 64, 64, 64, -64, -64, 64, 64, 64, -64, -64, -64, -64, 64, -64, 64, 64, 64, 64, -64, 64, -64, -64, -64, 64, 64, 64, 64, -64, 64, 64, 64, 64, 64, -64, 64, -64, -64, -64, -64, -64, 64, -64, 64, 64, 64, 64, -64, -64, -64, 64, -64, 64, -64, 64, -64, 64, -64, 64, -64, -64, -64, -64, -64, -64, -64, 64, -64, -64, 64, 64, 64, -64, 64, 64, -64, -64, -64, -64, -64, -64, -64, -64, -64, 64, 64, -64, 64, 64, -64, 64, -64, -64, -64, -64, -64, -64, 64, 64, 64, 64, 64, -64, -64, -64, -64, -64, -64, -64, -64, -64, -64, -64, 64, -64, -64, -64, 64, -64, -64, -64, -64, -64, 64, 64, 64, 64, 64, 64, 64, 64, -64, -64, -64, -64, -64, -64, -64, -64, -64, 64, -64, 64, 64, 64, 64, -64, -64, -64, -64, -64, 64, 64, 64, -64, -64, 64, 64, -64, -64, 64, -64, -64, -64, -64, -64, -64, -64, 64, 64, -64, 64, 64, 64, 64, 64, -64, -64, -64, 64, 64, -64, -64, 64, 64, 64, -64, -64, -64, -64, -64, -64, -64, -64, -64, -64, -64, -64, 64, 64, 64, 64, 64, -64, -64, -64, -64, 64, -64, 64, -64, -64, 64, 64, 64, -64, 64, -64, -64, -64, -64, -64, -64, -64, 64, -64, 64, 64, 64, 64, 64, -64, -64, -64, -64, 64, 64, -64, -64, 64, -64, 64, 64, 64, -64, -64, 64, -64, -64, -64, -64, -64, 64, 64, -64, -64, -64, -64, -64, -64, -64, -64, 64, 64, 64, -64, 64, -64, -64, 64, 64, 64, 64, -64, -64, -64, 64, 64, -64, 64, 64, 64, -64, 64, -64, 64, -64, -64, -64, -64, -64, -64, -64, -64, -64, -64, -64, 64, 64, -64, 64, -64, 64, -64, -64, -64, 64, 64, 64, -64, -64, 64, -64, -64, 64, -64, -64, -64, -64, -64, -64, -64, 64, -64, -64, -64, 64, -64, -64, -64, -64, -64, 64, -64, -64, -64, -64, 64, 64, 64, -64, -64, -64, -64, -64, -64, -64, 64, 64, -64, 64, -64, -64, -64, -64, -64, 64, -64, -64, -64, 64, -64, -64, -64, -64, -64, -64, -64, 64, -64, -64, 64, -64, -64, -64, -64, 64, -64, -64, -64, -64, 64, -64, 64, -64, -64, -64, -64, -64, -64, -64, -64, -64, -64, -64, 64, 64, -64, -64, -64, -64, -64, -64, -64, -64, -64, -64, -64, -64, 64, 64, -64, 64, -64, -64, -64, -64, -64, 64, -64, -64, 64, 64, -64, -64, -64, 64, -64, -64, -64, -64, -64, -64, -64, -64, -64, 64, 64, 64, -64, -64, -64, -64, -64, -64, -64, -64, 64, 64, -64, -64, -64, 64, -64, -64, -64, -64, 64, -64, -64, -64, -64, -64, -64, -64, 64, 64, 64, -64, 64, -64, -64, -64, 64, -64, -64, 64, -64, 64, 64, -64, -64, -64, -64, -64, 64, 64, -64, -64, -64, -64, -64, 64, 64, 64, 64, -64, -64, -64, -64, -64, -64, -64, -64, -64, 64, 64, 64, 64, 64, 64, 64, 64, 64, -64, -64, -64, -64, -64, -64, 64, 64, 64, -64, 64, -64, -64, -64, -64, -64, -64, 64, -64, 64, 64, 64, 64, -64, -64, 64, -64, 64, -64, -64, -64, -64, -64, -64, 64, 64, 64, -64, -64, -64, -64, -64, -64, -64, 64, 64, 64, -64, 64, 64, 64, -64, -64, -64, -64, -64, -64, -64, -64, -64, -64, -64, -64, 64, 64, -64, -64, -64, -64, -64, -64, 64, 64, -64, -64, -64, -64, 64, -64, -64, -64, 64, -64, -64, -64, -64, -64, -64, -64, -64, 64, -64, -64, -64, -64, -64, 64, -64, -64, -64, -64, 64, 64, -64, 64, 64, -64, -64, -64, 64, -64, -64, -64, -64, -64, -64, -64, -64, 64, 64, 64, -64, -64, 64, 64, 64, -64, -64, 64, 64, -64, -64, 64, 64, -64, -64, 64, 64, -64, -64, 64, 64, 64, -64, -64, 64, 64, 64, 64, 64, 64, 64, 64, -64, 64, -64, -64, 64, -64, 64, 64, -64, 64, 64, -64, -64, -64, 64, -64, -64, 64, 64, -64, 64, 64, 64, -64, -64, 64, 64, -64, 64, -64, -64, -64, 64, -64, 64, -64, -64, -64, 64, -64, 64, 64, -64, -64, 64, 64, -64, 64, -64, 64, -64, -64, -64, 64, 64, -64, -64, -64, -64, -64, 64, -64, 64, -64, -64, 64, -64, 64, -64, -64, 64, 64, -64, -64, -64, -64, 64, 64, 64, -64, 64, -64, 64, 64, 64, -64, -64, -64, -64, 64, 64, 64, 64, -64, -64, 64, 64, -64, 64, -64, -64, -64, -64, 64, -64, -64, 64, 64, -64, -64, 64, -64, 64, 64, 64, 64, -64, 64, 64, 64, -64, 64, -64, -64, -64, -64, 64, 64, -64, -64, -64, -64, -64, -64, -64, -64, -64, -64, 64, -64, -64, -64, -64, 64, -64, 64, 64, -64, -64, -64, -64, 64, -64, -64, 64, -64, 64, 64, 64, -64, 64, 64, -64, -64, 64, 64, 64, -64, -64, 64, 64, 64, 64, -64, 64, -64, 64, -64, 64, -64, -64, 64, -64, -64, 64, -64, -64, -64, -64, -64, -64, -64, -64, -64, -64, -64, -64, -64, 64, 64, 64, 64, 64, -64, 64, 64, -64, -64, -64, -64, -64, -64, 64, -64, 64, 64, -64, 64, -64, -64, -64, -64, -64, 64, 64, -64, -64, 64, 64, 64, -64, -64, -64, -64, -64, -64, -64, -64, -64, -64, 64, 64, 64, -64, 64, -64, -64, -64, -64, -64, 64, -64, 64, -64, 64, 64, 64, -64, -64, 64, -64, -64, -64, -64, 64, 64, 64, -64, 64, 64, -64, -64, -64, -64, -64, -64, -64, 64, -64, -64, 64, -64, 64, 64, 64, 64, 64, -64, 64, -64, -64, 64, 64, 64, -64, 64, 64, -64, -64, -64, -64, -64, -64, -64, -64, -64, -64, -64, -64, -64, 64, -64, 64, -64, 64, 64, -64, 64, -64, -64, -64, 64, 64, -64, -64, -64, -64, -64, 64, -64, -64, -64, -64, -64, 64, -64, -64, -64, -64, 64, 64, -64, 64, 64, 64, 64, 64, -64, 64, -64, 64, 64, 64, 64, -64, 64, 64, -64, -64, -64, -64, -64, -64, -64, -64, -64, -64, -64, 64, 64, 64, 64, 64, -64, 64, -64, -64, -64, 64, 64, -64, -64, 64, 64, 64, -64, -64, 64, 64, -64, -64, -64, 64, 64, 64, -64, -64, -64, -64, -64, 64, 64, -64, -64, -64, -64, 64, -64, -64, -64, -64, 64, -64, -64, 64, 64, -64, -64, -64, -64, 64, 64, 64, -64, -64, -64, -64, 64, 64, 64, -64, -64, -64, -64, -64, -64, 64, -64, 64, 64, 64, -64, -64, -64, 64, -64, -64, -64, -64, -64, 64, -64, -64, -64, -64, -64, 64, -64, -64, -64, -64, -64, -64, -64, 64, -64, 64, -64, -64, -64, 64, 64, 64, -64, -64, -64, -64, -64, 64, -64, 64, -64, -64, -64, 64, -64, -64, -64, -64, -64, -64, -64, -64, -64, 64, -64, -64, -64, 64, 64, -64, -64, -64, -64, -64, 64, -64, 64, -64, -64, -64, -64, 64, -64, -64, -64, -64, -64, -64, -64, -64, 64, 64, 64, 64, 64, 64, 64, -64, -64, -64, -64, -64, 64, -64, 64, -64, -64, 64, 64, 64, 64, -64, -64, -64, -64, -64, 64, -64, 64, -64, -64, 64, 64, -64, 64, -64, -64, -64, -64, -64, -64, -64, -64, 64, 64, -64, 64, 64, 64, -64, -64, -64, -64, -64, -64, -64, 64, 64, -64, -64, 64, -64, -64, -64, -64, -64, -64, -64, 64, -64, 64, 64, -64, -64, 64, 64, -64, -64, -64, -64, -64, -64, -64, -64, -64, 64, -64, -64, -64, -64, -64, 64, -64, -64, -64, -64, 64, 64, -64, 64, -64, -64, 64, -64, -64, -64, -64, -64, -64, -64, -64, -64, -64, -64, -64, 64, -64, -64, -64, -64, -64, -64, 64, -64, -64, 64, -64, -64, -64, -64, 64, 64, -64, -64, -64, -64, -64, -64, -64, -64, -64, -64, -64, -64, -64, 64, 64, 64, 64, -64, -64, 64, -64, 64, 64, 64, 64, -64, 64, -64, -64, -64, -64, 64, -64, -64, -64, -64, -64, 64, 64, -64, -64, -64, -64, 64, 64, -64, -64, -64, 64, 64, -64, 64, -64, -64, 64, -64, -64, -64, 64, -64, 64, 64, -64, -64, 64, 64, -64, -64, -64, 64, -64, 64, 64, 64, 64, 64, 64, 64, 64, 64, -64, -64, -64, -64, 64, 64, 64, 64, 64, 64, 64, -64, -64, -64, -64, -64, -64, 64, -64, 64, 64, 64, 64, 64, 64, -64, 64, -64, 64, -64, -64, 64, 64, -64, -64, 64, 64, 64, 64, 64, 64, -64, -64, 64, -64, -64, -64, 64, 64, -64, 64, -64, -64, -64, 64, -64, -64, -64, 64, 64, 64, -64, -64, -64, -64, -64, 64, 64, 64, -64, -64, 64, 64, 64, 64, 64, -64, 64, -64, -64, -64, -64, 64, 64, 64, 64, 64, 64, -64, -64, 64, -64, 64, -64, -64, 64, -64, -64, -64, -64, 64, 64, -64, 64, 64, 64, -64, 64, 64, -64, 64, -64, -64, -64, -64, -64, 64, 64, -64, 64, -64, -64, -64, 64, 64, 64, -64, 64, 64, 64, -64, 64, -64, -64, 64, 64, 64, -64, 64, 64, -64, 64, 64, 64, 64, -64, -64, -64, 64, 64, 64, -64, 64, 64, -64, 64, 64, -64, -64, -64, -64, -64, -64, 64, 64, 64, 64, 64, 64, 64, 64, 64, 64, 64, 64, -64, 64, 64, 64, -64, 64, 64, 64, 64, 64, 64, -64, 64, -64, 64, -64, -64, -64, -64, 64, -64, 64, 64, 64, -64, 64, 64, -64, -64, 64, 64, 64, 64, 64, -64, -64, 64, 64, -64, 64, -64, -64, -64, -64, -64, -64, 64, -64, 64, 64, 64, -64, -64, 64, 64, -64, 64, 64, 64, 64, 64, -64, 64, 64, -64, -64, 64, -64, -64, -64, -64, -64, -64, 64, -64, -64, -64, -64, 64, -64, 64, -64, 64, -64, 64, -64, 64, 64, 64, 64, -64, -64, 64, -64, -64, -64, 64, 64, -64, -64, -64, 64, -64, 64, 64, -64, -64, 64, -64, -64, 64, -64, -64, 64, 64, 64, 64, 64, 64, -64, -64, 64, 64, 64, -64, -64, -64, -64, -64, -64, -64, 64, 64, 64, 64, 64, 64, 64, 64, 64, 64, -64, 64, 64, 64, -64, -64, -64, 64, 64, 64, 64, 64, 64, 64, -64, -64, -64, -64, -64, -64, 64, -64, 64, -64, -64, -64, 64, 64, 64, -64, -64, 64, 64, -64, 64, 64, -64, 64, 64, 64, 64, 64, 64, -64, -64, -64, -64, -64, -64, -64, 64, 64, -64, 64, 64, 64, 64, -64, -64, 64, 64, 64, -64, 64, 64, 64, 64, 64, 64, 64, 64, -64, -64, -64, -64, -64, -64, 64, 64, 64, 64, 64, -64, -64, 64, 64, 64, -64, 64, -64, -64, 64, -64, 64, 64, 64, 64, 64, -64, 64, -64, -64, -64, -64, 64, -64, -64, -64, 64, 64, 64, -64, 64, 64, 64, 64, 64, 64, 64, -64, 64, 64, 64, 64, 64, 64, 64, 64, -64, -64, -64, -64, -64, -64, 64, 64, 64, 64, -64, -64, 64, -64, -64, 64, 64, 64, -64, 64, 64, 64, 64, 64, 64, 64, 64, -64, 64, -64, -64, -64, -64, 64, -64, 64, 64, 64, 64, -64, 64, 64, 64, 64, 64, 64, 64, 64, 64, 64, 64, 64, 64, 64, 64, 64, -64, -64, -64, -64, 64, -64, 64, 64, 64, -64, 64, 64, 64, 64, 64, 64, 64, 64, 64, -64, 64, 64, 64, 64, 64, 64, 64, 64, -64, -64, -64, 64, 64, -64, 64, 64, -64, -64, -64, -64, -64, -64, 64, 64, 64, 64, -64, -64, -64, 64, 64, 64, 64, 64, -64, -64, -64, -64, -64, -64, 64, -64, -64, -64, 64, 64, 64, -64, -64, -64, 64, 64, 64, 64, 64, 64, 64, 64, 64, 64, 64, 64, 64, 64, 64, -64, -64, -64, 64, -64, -64, 64, 64, -64, 64, -64, -64, -64, -64, 64, 64, 64, 64, 64, 64, 64, 64, 64, 64, 64, -64, -64, 64, 64, 64, 64, 64, -64, 64, 64, -64, 64, 64, -64, -64, -64, -64, 64, 64, -64, 64, 64, 64, -64, -64, 64, -64, -64, 64, 64, -64, -64, -64, 64, -64, -64, 64, 64, 64, -64, 64, -64, -64, -64, -64, 64, 64, 64, 64, 64, -64, -64, -64, -64, -64, 64, -64, -64, -64, -64, -64, 64, -64, -64, 64, -64, -64, 64, 64, 64, -64, 64, -64, 64, -64, 64, 64, 64, 64, 64, 64, 64, 64, -64, -64, -64, -64, -64, -64, 64, -64, -64, 64, 64, 64, 64, -64, -64, -64, -64, -64, -64, 64, 64, -64, -64, -64, -64, -64, 64, 64, -64, 64, 64, -64, -64, -64, -64, 64, 64, 64, 64, -64, -64, 64, -64, 64, -64, -64, 64, -64, 64, -64, -64, 64, 64, -64, 64, 64, -64, 64, 64, -64, -64, 64, -64, 64, -64, -64, -64, -64, -64, 64, 64, 64, 64, 64, 64, 64, -64, 64, -64, -64, -64, -64, 64, 64, 64, -64, 64, 64, -64, -64, -64, 64, 64, 64, -64, -64, -64, 64, 64, 64, 64, 64, 64, -64, 64, 64, -64, -64, -64, -64, 64, 64, -64, -64, -64, 64, 64, 64, 64, -64, -64, -64, 64, 64, 64, -64, 64, 64, -64, 64, 64, 64, 64, 64, 64, -64, -64, -64, 64, -64, -64, 64, -64, -64, -64, -64, 64, 64, -64, 64, -64, -64, 64, -64, -64, -64, 64, 64, 64, 64, -64, -64, 64, 64, -64, 64, 64, -64, 64, 64, 64, 64, -64, 64, 64, -64, 64, 64, -64, -64, -64, 64, 64, 64, 64, 64, 64, 64, 64, 64, -64, 64, -64, -64, 64, -64, -64, -64, 64, -64, -64, 64, -64, -64, 64, 64, 64, -64, -64, 64, 64, -64, 64, -64, 64, 64, -64, -64, 64, -64, 64, -64, 64, 64, -64, 64, 64, -64, 64, -64, -64, 64, -64, -64, 64, -64, -64, -64, -64, 64, 64, -64, -64, 64, 64, -64, -64, -64, -64, -64, 64, 64, -64, -64, 64, -64, 64, 64, 64, 64, 64, -64, 64, -64, 64, 64, 64, 64, 64, -64, 64, -64, -64, -64, -64, -64, -64, -64, -64, -64, 64, 64, 64, 64, -64, 64, -64, 64, -64, -64, 64, 64, 64, 64, 64, 64, -64, -64, -64, -64, -64, 64, 64, 64, 64, -64, -64, -64, -64, -64, -64, -64, 64, 64, 64, -64, -64, -64, -64, 64, -64, -64, -64, 64, -64, -64, -64, -64, 64, 64, -64, -64, 64, 64, -64, -64, -64, -64, 64, 64, -64, 64, 64, 64, -64, -64, -64, 64, -64, 64, -64, -64, 64, -64, -64, -64, -64, -64, -64, 64, 64, 64, 64, 64, -64, -64, -64, -64, -64, 64, 64, -64, 64, 64, 64, -64, -64, -64, -64, 64, -64, -64, -64, -64, -64, 64, 64, -64, 64, 64, -64, -64, -64, -64, -64, -64, 64, 64, 64, -64, -64, -64, -64, -64, -64, 64, 64, 64, -64, 64, -64, -64, -64, -64, -64, -64, -64, 64, -64, -64, -64, -64, -64, -64, -64, 64, 64, -64, 64, 64, -64, -64, 64, -64, 64, 64, 64, -64, -64, 64, 64, -64, -64, -64, -64, 64, -64, -64, -64, -64, -64, -64, -64, 64, -64, -64, -64, -64, 64, 64, 64, 64, -64, -64, -64, -64, 64, 64, -64, -64, -64, -64, 64, 64, -64, -64, -64, -64, -64, -64, -64, -64, -64, -64, 64, -64, -64, -64, 64, 64, -64, -64, 64, 64, 64, -64, 64, 64, 64, 64, 64, 64, -64, -64, -64, -64, -64, -64, -64, -64, -64, -64, 64, -64, -64, -64, 64, 64, -64, -64, -64, -64, 64, -64, -64, 64, 64, 64, 64, 64, 64, -64, -64, -64, -64, 64, 64, 64, 64, 64, -64, 64, 64, -64, -64, 64, -64, -64, -64, -64, 64, 64, 64, 64, 64, 64, 64, 64, -64, -64, -64, -64, -64, -64, -64, 64, 64, 64, -64, 64, -64, 64, 64, 64, 64, -64, -64, -64, 64, -64, -64, -64, 64, 64, -64, -64, -64, -64, -64, -64, -64, -64, -64, -64, -64, -64, 64, -64, -64, -64, 64, -64, -64, -64, -64, -64, -64, -64, -64, -64, 64, 64, 64, 64, -64, -64, -64, -64, -64, -64, -64, -64, -64, -64, -64, -64, 64, -64, -64, -64, -64, 64, -64, -64, -64, -64, -64, -64, -64, 64, 64, -64, -64, -64, -64, -64, -64, -64, -64, -64, -64, 64, 64, -64, -64, 64, -64, -64, -64, -64, -64, -64, -64, -64, -64, -64, -64, 64, 64, 64, -64, -64, -64, -64, -64, -64, -64, -64, 64, -64, -64, 64, 64, -64, -64, -64, -64, -64, -64, -64, -64, -64, -64, -64, -64, -64, 64, -64, -64, -64, -64, -64, -64, -64, -64, -64, -64, -64, -64, -64, 64, 64, 64, -64, -64, -64, -64, -64, -64, -64, -64, -64, -64, 64, -64, 64, 64, -64, -64, 64, -64, -64, -64, -64, 64, 64, -64, 64, -64, -64, -64, -64, -64, -64, -64, -64, -64, -64, 64, 64, 64, -64, 64, -64, 64, -64, 64, -64, -64, 64, -64, 64, 64, 64, -64, 64, 64, -64, 64, -64, -64, -64, -64, -64, -64, -64, -64, -64, 64, -64, -64, -64, 64, -64, -64, -64, 64, 64, -64, -64, -64, 64, 64, -64, -64, -64, -64, -64, -64, -64, -64, -64, -64, -64, -64, 64, 64, 64, -64, 64, -64, 64, 64, 64, 64, 64, 64, -64, 64, 64, 64, 64, -64, 64, 64, -64, -64, -64, -64, -64, -64, -64, -64, -64, -64, 64, -64, -64, 64, 64, 64, 64, 64, 64, -64, -64, -64, -64, -64, 64, 64, 64, -64, -64, -64, -64, -64, -64, -64, 64, -64, -64, -64, -64, -64, 64, 64, 64, 64, 64, 64, 64, 64, 64, 64, 64, -64, 64, 64, -64, 64, -64, -64, -64, 64, -64, 64, 64, -64, -64, 64, -64, -64, 64, 64, 64, -64, -64, -64, -64, 64, -64, 64, 64, -64, 64, 64, 64, 64, 64, -64, 64, -64, -64, -64, -64, -64, -64, 64, -64, -64, -64, 64, -64, -64, -64, -64, -64, 64, -64, 64, -64, -64, -64, -64, 64, -64, 64, -64, 64, -64, -64, -64, -64, 64, -64, -64, -64, -64, 64, -64, 64, -64, 64, -64, 64, -64, 64, 64, -64, -64, 64, 64, 64, 64, 64, -64, -64, 64, -64, -64, -64, -64, 64, 64, -64, 64, -64, 64, -64, 64, 64, 64, -64, -64, 64, -64, 64, 64, -64, -64, 64, 64, -64, -64, -64, 64, 64, 64, 64, 64, -64, -64, -64, 64, -64, 64, 64, -64, 64, -64, 64, 64, -64, 64, 64, -64, -64, 64, -64, 64, 64, 64, -64, -64, 64, 64, 64, -64, 64, -64, -64, 64, 64, 64, 64, 64, -64, 64, 64, -64, -64, 64, -64, -64, 64, -64, -64, -64, -64, -64, 64, 64, 64, -64, -64, 64, 64, 64, 64, 64, 64, 64, 64, -64, 64, -64, -64, 64, -64, 64, 64, 64, 64, 64, -64, -64, -64, 64, -64, -64, -64, -64, -64, -64, -64, 64, 64, -64, 64, -64, 64, 64, 64, -64, 64, 64, 64, -64, -64, -64, -64, -64, 64, 64, -64, -64, -64, 64, 64, 64, -64, -64, 64, 64, -64, 64, -64, 64, -64, 64, -64, 64, 64, 64, -64, -64, 64, 64, -64, 64, -64, -64, -64, -64, 64, -64, 64, -64, -64, 64, -64, -64, 64, 64, 64, 64, 64, 64, -64, 64, 64, -64, 64, -64, 64, -64, 64, -64, 64, -64, 64, 64, -64, 64, 64, -64, 64, 64, 64, 64, -64, 64, 64, -64, 64, -64, -64, -64, 64, -64, 64, -64, 64, 64, -64, -64, -64, 64, 64, -64, 64, -64, 64, 64, -64, 64, 64, 64, 64, 64, 64, -64, 64, 64, 64, -64, -64, 64, 64, -64, 64, -64, 64, 64, 64, -64, 64, 64, 64, 64, 64, -64, 64, -64, -64, -64, -64, 64, 64, -64, 64, -64, 64, 64, 64, 64, 64, -64, -64, -64, -64, -64, -64, 64, 64, 64, -64, -64, 64, 64, 64, 64, -64, -64, 64, 64, -64, 64, 64, -64, -64, -64, -64, 64, 64, -64, -64, -64, -64, -64, -64, 64, 64, -64, 64, 64, -64, 64, 64, 64, -64, -64, 64, -64, -64, -64, -64, 64, 64, -64, -64, -64, 64, -64, 64, 64, 64, -64, 64, 64, 64, 64, -64, -64, 64, 64, 64, 64, -64, -64, -64, -64, -64, -64, -64, -64, 64, 64, 64, 64, 64, 64, -64, -64, 64, 64, 64, -64, -64, -64, -64, 64, 64, 64, -64, -64, 64, 64, -64, 64, 64, -64, 64, 64, -64, 64, 64, 64, 64, -64, -64, -64, -64, 64, -64, 64, 64, 64, -64, -64, 64, 64, -64, -64, 64, 64, 64, 64, -64, -64, 64, 64, 64, -64, 64, 64, 64, 64, 64, -64, -64, -64, -64, -64, -64, 64, 64, 64, 64, 64, 64, -64, 64, -64, 64, 64, -64, -64, -64, -64, -64, -64, 64, 64, 64, 64, 64, 64, 64, -64, -64, -64, -64, -64, 64, -64, 64, 64, 64, 64, 64, 64, 64, 64, -64, -64, 64, -64, -64, 64, 64, 64, -64, 64, -64, 64, -64, -64, -64, 64, -64, -64, -64, 64, -64, 64, 64, 64, 64, 64, -64, 64, 64, -64, -64, -64, 64, 64, 64, 64, -64, 64, 64, 64, -64, -64, -64, -64, 64, -64, 64, 64, 64, 64, 64, 64, 64, -64, 64, 64, 64, -64, 64, 64, 64, -64, 64, 64, 64, -64, -64, -64, 64, -64, -64, -64, -64, 64, 64, 64, 64, 64, 64, 64, 64, 64, 64, -64, 64, 64, 64, -64, 64, 64, 64, 64, -64, 64, -64, -64, 64, 64, -64, -64, 64, -64, -64, -64, -64, 64, 64, 64, 64, 64, 64, 64, 64, 64, -64, 64, -64, 64, 64, 64, 64, 64, 64, 64, 64, -64, 64, -64, -64, -64, 64, 64, 64, 64, 64, 64, 64, 64, 64, 64, -64, 64, 64, -64, 64, 64, 64, 64, 64, -64, -64, 64, -64, 64, 64, 64, -64, 64, 64, 64, 64, 64, 64, -64, 64, -64, -64, 64, -64, 64, 64, 64, 64, -64, 64, 64, -64, 64, 64, -64, -64, 64, -64, -64, -64, -64, -64, 64, 64, -64, 64, -64, 64, 64, 64, 64, -64, 64, -64, -64, 64, 64, 64, -64, -64, -64, -64, -64, -64, -64, -64, -64, -64, 64, 64, 64, 64, -64, -64, 64, -64, 64, -64, 64, -64, -64, 64, 64, -64, -64, 64, -64, 64, -64, 64, -64, -64, 64, -64, -64, -64, -64, 64, -64, 64, -64, -64, -64, 64, 64, -64, -64, 64, -64, -64, -64, -64, -64, -64, 64, -64, -64, 64, 64, 64, 64, 64, -64, 64, -64, -64, 64, 64, 64, 64, -64, -64, -64, -64, -64, 64, -64, -64, 64, -64, -64, -64, -64, -64, -64, 64, 64, -64, -64, -64, 64, 64, 64, 64, -64, 64, -64, -64, -64, -64, 64, 64, 64, 64, -64, 64, -64, 64, -64, -64, -64, 64, 64, 64, 64, -64, -64, -64, 64, -64, 64, -64, 64, -64, -64, -64, -64, 64, -64, -64, 64, -64, 64, 64, -64, 64, 64, -64, -64, -64, 64, -64, -64, 64, -64, 64, 64, 64, -64, -64, -64, -64, 64, -64, 64, -64, 64, 64, -64, -64, -64, 64, -64, -64, -64, -64, 64, 64, -64, -64, -64, -64, -64, 64, 64, 64, 64, 64, 64, 64, 64, 64, 64, 64, -64, 64, -64, -64, 64, -64, -64, 64, 64, -64, -64, -64, 64, 64, 64, 64, 64, -64, -64, 64, -64, -64, -64, -64, -64, -64, 64, 64, -64, 64, 64, -64, 64, -64, -64, -64, 64, 64, -64, 64, -64, 64, -64, -64, -64, -64, 64, 64, 64, 64, 64, 64, 64, -64, 64, -64, -64, -64, -64, -64, -64, -64, -64, 64, 64, -64, -64, 64, 64, -64, -64, -64, 64, -64, -64, 64, 64, 64, 64, -64, -64, 64, -64, -64, -64, -64, 64, -64, 64, 64, 64, -64, 64, 64, 64, -64, -64, -64, 64, -64, -64, 64, -64, 64, -64, 64, -64, -64, -64, -64, -64, 64, -64, -64, -64, -64, -64, -64, -64, -64, 64, -64, -64, 64, -64, -64, -64, -64, 64, 64, -64, 64, -64, -64, 64, -64, -64, 64, -64, 64, -64, -64, -64, -64, -64, 64, 64, 64, 64, 64, 64, 64, 64, -64, 64, 64, 64, 64, -64, 64, 64, 64, -64, -64, 64, -64, 64, -64, -64, -64, 64, -64, 64, -64, 64, -64, -64, 64, -64, -64, 64, 64, -64, 64, 64, 64, -64, -64, 64, -64, -64, -64, 64, -64, -64, -64, -64, -64, 64, 64, -64, -64, 64, -64, 64, -64, -64, -64, -64, -64, -64, 64, -64, -64, 64, 64, -64, -64, -64, -64, 64, -64, -64, -64, 64, 64, 64, -64, -64, 64, -64, 64, 64, -64, -64, 64, -64, -64, 64, 64, -64, -64, -64, -64, -64, -64, -64, 64, -64, -64, -64, 64, -64, 64, 64, -64, -64, -64, -64, -64, -64, -64, -64, 64, -64, -64, 64, 64, -64, 64, -64, -64, -64, -64, -64, -64, -64, 64, 64, -64, 64, 64, 64, -64, -64, -64, -64, -64, -64, -64, 64, 64, -64, 64, 64, 64, 64, 64, -64, 64, -64, 64, 64, 64, 64, -64, -64, 64, -64, -64, -64, -64, 64, -64, 64, -64, -64, 64, -64, 64, 64, 64, -64, -64, -64, 64, -64, 64, -64, -64, -64, 64, -64, -64, -64, -64, -64, -64, 64, -64, 64, -64, 64, -64, -64, 64, -64, 64, -64, 64, -64, 64, 64, -64, -64, -64, -64, 64, -64, -64, 64, -64, 64, -64, -64, 64, 64, -64, -64, -64, -64, -64, -64, 64, 64, -64, -64, -64, 64, -64, -64, 64, 64, -64, -64, -64, 64, -64, -64, -64, -64, -64, 64, -64, -64, 64, -64, -64, -64, -64, 64, -64, 64, 64, -64, -64, -64, -64, -64, 64, 64, 64, 64, -64, -64, 64, -64, -64, -64, -64, -64, -64, 64, -64, 64, 64, 64, -64, -64, 64, -64, 64, 64, -64, 64, 64, -64, 64, -64, 64, 64, 64, 64, -64, -64, 64, -64, -64, -64, -64, -64, -64, -64, 64, 64, -64, 64, 64, 64, 64, 64, 64, 64, 64, -64, 64, -64, -64, -64, 64, 64, -64, 64, -64, -64, -64, -64, 64, -64, 64, -64, 64, -64, -64, 64, 64, 64, -64, -64, -64, -64, -64, 64, -64, 64, -64, -64, 64, -64, -64, -64, 64, -64, -64, 64, 64, -64, -64, 64, -64, 64, -64, -64, -64, -64, -64, 64, 64, -64, 64, -64, 64, -64, -64, -64, -64, -64, -64, 64, 64, -64, 64, -64, -64, -64, 64, -64, -64, -64, 64, -64, -64, 64, 64, -64, -64, -64, -64, 64, 64, 64, -64, -64, -64, 64, 64, -64, -64, -64, 64, -64, 64, -64, 64, -64, -64, 64, -64, 64, -64, 64, 64, 64, -64, -64, -64, 64, -64, 64, 64, -64, -64, 64, 64, -64, -64, -64, -64, 64, 64, -64, -64, -64, 64, -64, -64, 64, -64, -64, 64, -64, -64, -64, -64, -64, -64, 64, -64, 64, -64, 64, 64, -64, -64, -64, -64, 64, -64, 64, -64, -64, 64, 64, -64, -64, 64, 64, 64, 64, -64, -64, -64, -64, -64, 64, 64, 64, 64, -64, -64, -64, -64, 64, 64, -64, 64, -64, -64, -64, 64, 64, -64, -64, 64, 64, 64, 64, 64, 64, 64, -64, 64, 64, 64, -64, -64, -64, 64, 64, -64, -64, 64, 64, 64, 64, -64, 64, 64, 64, 64, 64, -64, 64, -64, 64, 64, -64, -64, 64, 64, -64, -64, 64, 64, -64, -64, 64, -64, 64, -64, 64, -64, -64, 64, 64, 64, 64, 64, 64, -64, -64, 64, -64, 64, -64, 64, 64, 64, -64, 64, 64, 64, -64, 64, -64, 64, -64, 64, 64, 64, -64, 64, -64, 64, -64, 64, 64, 64, 64, -64, -64, 64, -64, 64, -64, 64, -64, 64, 64, -64, -64, 64, -64, -64, 64, 64, -64, -64, 64, -64, -64, -64, -64, -64, 64, -64, 64, 64, -64, 64, 64, 64, -64, -64, 64, -64, 64, -64, 64, -64, 64, 64, 64, 64, 64, -64, 64, -64, 64, 64, -64, 64, 64, -64, 64, 64, -64, -64, -64, -64, 64, -64, 64, 64, 64, 64, -64, -64, -64, -64, 64, -64, -64, 64, -64, 64, 64, 64, -64, 64, 64, 64, 64, 64, -64, 64, 64, 64, -64, 64, -64, 64, 64, -64, -64, -64, -64, -64, -64, -64, -64, 64, 64, 64, 64, -64, 64, -64, -64, -64, 64, -64, -64, 64, 64, 64, 64, 64, 64, -64, -64, -64, -64, -64, -64, 64, 64, -64, 64, -64, -64, -64, 64, -64, 64, -64, 64, -64, 64, -64, -64, -64, 64, 64, 64, 64, -64, -64, 64, -64, -64, -64, -64, -64, 64, 64, -64, 64, -64, -64, -64, 64, -64, -64, 64, 64, 64, 64, 64, -64, 64, -64, -64, -64, 64, 64, 64, -64, -64, 64, -64, -64, 64, 64, 64, 64, 64, -64, -64, -64, -64, -64, 64, 64, 64, 64, 64, 64, 64, 64, 64, -64, 64, 64, -64, -64, -64, -64, 64, -64, 64, 64, 64, -64, 64, 64, 64, -64, -64, -64, 64, 64, 64, 64, 64, 64, -64, -64, -64, -64, 64, 64, -64, -64, -64, -64, 64, 64, 64, 64, 64, 64, -64, 64, 64, 64, -64, -64, 64, 64, 64, 64, 64, -64, -64, -64, -64, -64, 64, 64, -64, -64, 64, 64, 64, 64, 64, 64, 64, -64, -64, -64, 64, 64, 64, 64, 64, 64, 64, 64, 64, -64, -64, -64, 64, 64, 64, 64, 64, 64, 64, 64, 64, 64, 64, 64, 64, -64, -64, -64, 64, 64, 64, -64, 64, 64, 64, 64, -64, -64, -64, -64, -64, 64, -64, 64, 64, 64, 64, 64, 64, 64, 64, 64, -64, -64, -64, 64, 64, 64, 64, -64, 64, 64, -64, -64, -64, 64, 64, 64, 64, 64, -64, 64, 64, 64, 64, 64, 64, 64, 64, 64, -64, -64, -64, -64, 64, 64, 64, 64, 64, -64, -64, -64, 64, 64, 64, -64, 64, -64, -64, 64, 64, 64, 64, 64, 64, 64, 64, -64, -64, -64, -64, 64, 64, 64, 64, 64, -64, -64, 64, 64, 64, 64, 64, -64, 64, -64, -64, -64, 64, 64, 64, 64, -64, 64, 64, -64, -64, -64, -64, 64, 64, 64, 64, 64, -64, 64, 64, 64, 64, 64, 64, -64, -64, -64, -64, 64, -64, 64, -64, 64, -64, 64, -64, -64, -64, -64, -64, 64, 64, 64, 64, 64, 64, 64, 64, 64, 64, 64, -64, 64, -64, -64, 64, 64, 64, -64, -64, 64, 64, -64, -64, -64, -64, -64, 64, 64, 64, 64, 64, 64, 64, 64, -64, -64, -64, -64, -64, 64, -64, -64, 64, 64, 64, 64, 64, 64, 64, 64, -64, 64, -64, -64, 64, -64, -64, 64, 64, 64, -64, 64, 64, 64, 64, -64, 64, 64, -64, -64, 64, 64, 64, 64, 64, 64, 64, 64, -64, -64, -64, 64, 64, -64, -64, -64, -64, 64, 64, 64, 64, 64, 64, 64, -64, -64, 64, -64, -64, -64, 64, 64, -64, 64, 64, 64, 64, -64, -64, 64, 64, 64, -64, 64, -64, 64, 64, -64, 64, 64, -64, 64, 64, -64, -64, 64, -64, -64, -64, 64, 64, -64, 64, 64, 64, 64, 64, -64, 64, 64, -64, -64, 64, 64, 64, 64, 64, -64, 64, -64, -64, -64, -64, -64, -64, -64, 64, -64, -64, 64, 64, -64, 64, -64, -64, -64, 64, 64, -64, -64, 64, 64, 64, 64, 64, 64, 64, 64, 64, 64, -64, -64, 64, 64, 64, 64, -64, -64, -64, -64, 64, -64, -64, 64, 64, 64, 64, 64, 64, 64, 64, 64, 64, 64, 64, 64, -64, 64, -64, -64, -64, -64, -64, -64, -64, -64, -64, -64, -64, 64, 64, -64, 64, 64, 64, 64, 64, 64, -64, 64, 64, -64, -64, -64, -64, 64, 64, 64, -64, -64, -64, 64, -64, -64, -64, -64, -64, 64, 64, 64, 64, 64, 64, 64, -64, 64, 64, 64, 64, 64, -64, 64, 64, 64, 64, 64, 64, 64, 64, 64, 64, 64, 64, 64, 64, 64, 64, 64, 64, 64, 64, -64, 64, -64, 64, -64, 64, -64, -64, 64, -64, 64, 64, -64, 64, -64, 64, -64, -64, -64, 64, -64, -64, -64, -64, 64, 64, 64, 64, 64, -64, 64, 64, 64, 64, -64, -64, -64, -64, 64, 64, 64, -64, -64, 64, 64, -64, 64, 64, 64, 64, -64, 64, -64, 64, -64, 64, -64, -64, -64, -64, -64, 64, 64, 64, -64, -64, 64, -64, -64, -64, -64, 64, -64, -64, 64, -64, 64, -64, 64, -64, -64, -64, -64, -64, -64, 64, 64, -64, -64, -64, -64, 64, 64, -64, -64, 64, 64, -64, 64, 64, -64, -64, -64, -64, -64, -64, -64, -64, -64, -64, 64, 64, 64, 64, -64, -64, -64, -64, 64, -64, 64, 64, -64, 64, 64, 64, 64, 64, 64, -64, -64, -64, -64, -64, -64, -64, -64, 64, 64, 64, 64, 64, -64, 64, -64, 64, -64, -64, -64, 64, -64, 64, -64, 64, 64, -64, -64, -64, 64, -64, -64, 64, -64, 64, 64, 64, 64, 64, 64, -64, -64, -64, -64, -64, -64, 64, -64, 64, -64, 64, -64, 64, -64, 64, -64, -64, -64, 64, -64, -64, -64, -64, 64, 64, 64, 64, 64, -64, -64, -64, -64, 64, 64, 64, 64, -64, -64, -64, 64, 64, 64, 64, 64, 64, 64, -64, 64, 64, 64, 64, 64, 64, 64, 64, 64, 64, 64, 64, -64, 64, 64, 64, 64, -64, 64, -64, -64, 64, 64, 64, 64, 64, 64, 64, 64, 64, -64, 64, 64, 64, 64, 64, 64, 64, 64, -64, -64, 64, 64, -64, 64, -64, -64, 64, -64, -64, 64, 64, -64, -64, 64, 64, 64, -64, -64, 64, 64, 64, 64, 64, 64, -64, 64, -64, -64, -64, -64, 64, -64, -64, 64, 64, -64, -64, -64, -64, -64, 64, -64, -64, 64, -64, 64, 64, 64, 64, 64, 64, -64, -64, 64, -64, -64, -64, 64, 64, 64, 64, 64, 64, -64, -64, -64, 64, 64, 64, -64, 64, 64, -64, 64, 64, 64, 64, -64, -64, 64, -64, -64, -64, -64, -64, -64, -64, -64, -64, -64, 64, -64, -64, -64, 64, -64, -64, -64, 64, -64, 64, -64, 64, 64, 64, 64, -64, -64, 64, -64, -64, -64, -64, -64, 64, -64, 64, -64, 64, 64, 64, 64, -64, -64, -64, -64, -64, 64, -64, 64, 64, 64, 64, 64, -64, -64, 64, -64, -64, -64, -64, 64, 64, -64, -64, 64, -64, 64, 64, -64, 64, -64, -64, -64, -64, -64, 64, 64, 64, 64, 64, -64, 64, 64, -64, -64, -64, -64, -64, -64, -64, -64, -64, 64, 64, -64, 64, 64, -64, 64, 64, 64, 64, 64, 64, 64, -64, -64, 64, -64, -64, 64, 64, 64, -64, -64, 64, 64, 64, 64, 64, 64, 64, 64, 64, 64, -64, 64, -64, 64, 64, 64, 64, 64, 64, -64, -64, 64, 64, 64, 64, 64, 64, -64, -64, 64, 64, 64, 64, 64, -64, 64, 64, 64, 64, 64, 64, 64, 64, 64, 64, 64, 64, 64, 64, 64, 64, 64, 64, 64, 64, -64, -64, 64, 64, 64, -64, 64, -64, -64, 64, 64, 64, 64, -64, 64, 64, 64, 64, 64, 64, 64, 64, 64, 64, 64, 64, 64, 64, -64, 64, 64, 64, -64, 64, 64, -64, -64, -64, 64, 64, 64, 64, 64, 64, 64, 64, 64, 64, -64, -64, -64, 64, 64, 64, -64, 64, 64, 64, 64, 64, -64, 64, -64, 64, 64, -64, 64, -64, 64, -64, 64, 64, 64, 64, 64, 64, -64, 64, 64, 64, 64, 64, 64, 64, 64, 64, 64, -64, -64, 64, -64, -64, 64, -64, 64, -64, 64, -64, 64, 64, 64, 64, 64, -64, 64, 64, 64, -64, 64, 64, 64, 64, 64, 64, 64, 64, 64, -64, 64, 64, -64, 64, -64, -64, 64, 64, 64, 64, 64, 64, 64, -64, 64, 64, 64, -64, 64, 64, 64, 64, 64, 64, 64, 64, -64, 64, -64, 64, 64, 64, -64, -64, 64, -64, 64, 64, 64, 64, -64, 64, -64, 64, -64, 64, 64, 64, 64, 64, 64, 64, -64, 64, 64, 64, 64, -64, -64, -64, -64, -64, -64, -64, -64, 64, -64, -64, -64, 64, 64, 64, 64, 64, 64, 64, 64, 64, 64, 64, 64, 64, 64, -64, 64, -64, -64, 64, -64, -64, -64, -64, -64, -64, -64, -64, -64, -64, 64, -64, -64, -64, 64, 64, 64, -64, -64, -64, 64, 64, 64, 64, 64, -64, -64, -64, 64, -64, 64, 64, -64, -64, -64, -64, -64, -64, 64, 64, -64, 64, 64, 64, 64, 64, 64, 64, 64, 64, -64, -64, 64, -64, 64, -64, -64, -64, 64, 64, -64, -64, 64, 64, 64, -64, 64, -64, -64, -64, -64, 64, 64, 64, 64, 64, -64, -64, -64, 64, -64, 64, 64, 64, -64, 64, 64, 64, 64, 64, 64, -64, -64, -64, -64, 64, -64, -64, 64, -64, 64, -64, 64, 64, -64, 64, 64, 64, 64, -64, -64, -64, -64, -64, -64, 64, -64, 64, -64, 64, -64, -64, -64, 64, 64, 64, 64, 64, 64, 64, 64, 64, -64, -64, 64, -64, -64, -64, -64, -64, 64, -64, 64, -64, -64, -64, -64, -64, 64, -64, 64, -64, 64, -64, -64, -64, 64, 64, -64, -64, 64, -64, -64, -64, -64, 64, -64, -64, 64, 64, -64, 64, -64, 64, 64, -64, -64, -64, 64, -64, -64, 64, -64, 64, -64, -64, -64, 64, -64, -64, -64, -64, 64, -64, -64, 64, 64, 64, -64, 64, 64, -64, -64, 64, -64, -64, -64, 64, 64, 64, -64, 64, 64, 64, -64, -64, 64, 64, 64, 64, -64, 64, -64, 64, 64, -64, 64, 64, -64, -64, -64, -64, -64, -64, 64, 64, 64, 64, -64, 64, -64, -64, -64, -64, 64, -64, 64, 64, -64, -64, -64, -64, -64, -64, -64, 64, -64, -64, -64, 64, -64, 64, 64, -64, -64, -64, 64, -64, -64, 64, -64, -64, -64, -64, -64, -64, 64, 64, 64, -64, -64, -64, 64, -64, 64, -64, -64, -64, -64, 64, -64, -64, 64, 64, 64, 64, 64, -64, -64, -64, 64, 64, -64, 64, -64, 64, -64, -64, -64, -64, -64, 64, 64, 64, 64, 64, 64, -64, 64, 64, 64, 64, 64, -64, 64, -64, 64, 64, -64, 64, 64, -64, 64, 64, 64, -64, -64, 64, 64, 64, 64, 64, 64, -64, 64, 64, 64, 64, 64, 64, 64, 64, 64, -64, 64, 64, 64, 64, 64, -64, 64, 64, -64, 64, -64, 64, -64, 64, 64, 64, 64, 64, 64, 64, -64, 64, 64, 64, 64, 64, 64, 64, 64, 64, 64, -64, 64, -64, 64, 64, -64, -64, -64, 64, 64, 64, -64, 64, 64, 64, 64, 64, 64, 64, 64, 64, -64, 64, -64, 64, 64, -64, 64, 64, -64, 64, 64, 64, 64, 64, -64, -64, 64, -64, 64, 64, 64, 64, 64, 64, 64, 64, 64, 64, 64, 64, 64, -64, 64, 64, 64, 64, 64, 64, 64, -64, -64, 64, 64, -64, 64, -64, 64, 64, -64, 64, 64, 64, 64, 64, 64, 64, 64, 64, 64, 64, -64, 64, 64, -64, 64, -64, 64, 64, -64, 64, -64, 64, 64, 64, -64, -64, -64, -64, -64, 64, 64, 64, 64, 64, -64, 64, 64, -64, -64, -64, 64, 64, 64, -64, -64, -64, 64, -64, -64, 64, 64, 64, 64, 64, -64, -64, 64, 64, 64, 64, 64, -64, 64, 64, 64, -64, -64, -64, 64, -64, 64, 64, 64, 64, -64, 64, 64, 64, 64, 64, -64, 64, 64, 64, -64, -64, -64, 64, 64, 64, 64, -64, 64, 64, -64, -64, 64, 64, 64, 64, 64, 64, 64, -64, 64, 64, 64, 64, 64, 64, 64, -64, -64, 64, 64, 64, -64, 64, 64, -64, 64, -64, -64, 64, -64, -64, 64, 64, -64, 64, 64, 64, -64, 64, 64, 64, 64, 64, 64, 64, 64, 64, 64, 64, 64, 64, 64, -64, 64, -64, -64, -64, -64, -64, -64, -64, -64, -64, -64, -64, -64, -64, 64, 64, 64, 64, 64, 64, 64, 64, 64, -64, -64, 64, 64, -64, 64, 64, -64, 64, -64, -64, 64, -64, -64, 64, 64, -64, -64, -64, 64, 64, 64, 64, 64, 64, 64, 64, 64, -64, 64, 64, 64, 64, 64, -64, 64, 64, -64, 64, 64, -64, -64, 64, 64, 64, 64, -64, 64, -64, -64, 64, 64, 64, 64, -64, 64, 64, 64, 64, 64, 64, 64, -64, 64, 64, -64, 64, -64, -64, -64, 64, 64, 64, -64, -64, -64, -64, -64, -64, -64, -64, -64, -64, -64, 64, -64, 64, 64, 64, -64, -64, 64, -64, -64, 64, -64, 64, 64, 64, 64, -64, -64, -64, -64, -64, -64, 64, 64, 64, -64, -64, 64, 64, 64, 64, 64, -64, 64, 64, 64, 64, -64, -64, -64, 64, 64, 64, -64, -64, 64, -64, -64, -64, 64, -64, 64, -64, 64, -64, 64, 64, 64, 64, 64, -64, 64, 64, 64, 64, 64, -64, 64, 64, 64, 64, -64, -64, -64, 64, 64, 64, 64, 64, 64, -64, -64, 64, 64, 64, 64, 64, 64, 64, 64, 64, 64, 64, 64, -64, -64, -64, 64, -64, 64, -64, 64, 64, 64, -64, 64, -64, 64, 64, 64, 64, 64, 64, 64, 64, 64, 64, 64, 64, 64, 64, 64, 64, -64, -64, 64, 64, 64, 64, 64, -64, -64, -64, -64, -64, 64, 64, 64, 64, 64, 64, 64, 64, 64, 64, 64, -64, -64, -64, 64, -64, -64, -64, 64, 64, -64, -64, 64, -64, 64, 64, -64, -64, 64, 64, 64, 64, -64, 64, 64, -64, -64, -64, 64, -64, -64, 64, -64, -64, -64, 64, -64, 64, -64, 64, -64, 64, 64, -64, 64, 64, -64, 64, 64, 64, -64, 64, -64, 64, -64, -64, 64, 64, -64, -64, 64, 64, 64, 64, 64, -64, -64, -64, -64, -64, 64, -64, 64, 64, 64, -64, -64, 64, -64, -64, -64, -64, 64, 64, 64, -64, -64, -64, -64, -64, 64, -64, -64, -64, -64, -64, -64, -64, -64, 64, -64, 64, -64, -64, -64, -64, -64, 64, -64, -64, 64, -64, -64, -64, -64, -64, -64, -64, -64, 64, -64, 64, 64, -64, 64, -64, 64, 64, -64, -64, -64, 64, -64, -64, 64, -64, -64, 64, -64, -64, 64, -64, -64, -64, -64, -64, -64, -64, 64, 64, 64, -64, 64, 64, 64, 64, 64, -64, 64, 64, -64, -64, -64, -64, -64, 64, 64, 64, -64, 64, 64, 64, 64, 64, 64, -64, -64, -64, -64, -64, 64, 64, 64, -64, -64, 64, 64, 64, 64, -64, -64, -64, -64, -64, -64, -64, 64, 64, -64, -64, -64, -64, -64, -64, 64, -64, 64, 64, 64, 64, 64, 64, 64, 64, 64, -64, 64, -64, -64, -64, -64, 64, -64, -64, -64, -64, -64, -64, -64, -64, -64, -64, 64, -64, -64, 64, 64, 64, 64, 64, 64, 64, 64, -64, -64, -64, -64, -64, -64, 64, -64, -64, -64, -64, -64, 64, 64, -64, 64, -64, 64, 64, 64, 64, 64, 64, -64, -64, 64, 64, -64, -64, -64, -64, -64, -64, -64, -64, -64, -64, 64, 64, -64, -64, -64, -64, -64, -64, 64, 64, 64, -64, 64, -64, -64, 64, -64, 64, 64, -64, -64, -64, -64, -64, -64, -64, 64, 64, -64, 64, 64, 64, -64, 64, 64, -64, -64, -64, 64, 64, 64, -64, 64, 64, 64, 64, 64, -64, -64, -64, -64, -64, -64, -64, 64, 64, -64, 64, 64, 64, -64, -64, -64, 64, 64, 64, 64, 64, -64, 64, 64, 64, 64, 64, -64, -64, -64, -64, -64, -64, -64, -64, 64, 64, 64, 64, 64, 64, -64, -64, -64, 64, 64, 64, 64, 64, 64, 64, 64, 64, 64, -64, 64, 64, -64, -64, -64, -64, -64, -64, -64, 64, 64, 64, -64, 64, 64, -64, -64, -64, 64, -64, 64, 64, 64, 64, 64, 64, 64, -64, -64, -64, -64, -64, -64, -64, -64, -64, 64, -64, -64, 64, 64, 64, -64, -64, -64, 64, 64, -64, 64, 64, 64, 64, 64, 64, -64, -64, -64, -64, -64, -64, -64, -64, -64, -64, -64, -64, 64, 64, 64, 64, 64, 64, 64, 64, 64, 64, -64, 64, 64, 64, 64, 64, 64, -64, -64, -64, -64, -64, -64, -64, -64, -64, 64, 64, 64, -64, 64, 64, -64, 64, 64, 64, -64, 64, 64, -64, 64, 64, 64, 64, 64, -64, -64, -64, 64, -64, -64, -64, -64, 64, 64, 64, 64, 64, 64, 64, 64, 64, 64, 64, 64, 64, -64, -64, 64, 64, 64, 64, 64, 64, 64, -64, 64, -64, -64, -64, -64, 64, 64, 64, 64, 64, -64, 64, 64, 64, 64, 64, 64, 64, 64, 64, 64, -64, 64, 64, -64, 64, 64, 64, 64, 64, -64, -64, 64, 64, 64, 64, -64, -64, 64, -64, -64, -64, 64, 64, 64, 64, 64, 64, 64, -64, -64, 64, 64, -64, -64, -64, -64, -64, -64, 64, 64, 64, 64, 64, 64, 64, 64, -64, -64, -64, -64, -64, -64, 64, 64, 64, 64, -64, 64, -64, 64, 64, -64, -64, -64, -64, -64, 64, 64, -64, -64, -64, 64, 64, -64, -64, -64, -64, 64, -64, 64, -64, -64, -64, 64, -64, -64, -64, -64, -64, -64, -64, -64, -64, -64, -64, 64, -64, -64, 64, 64, 64, -64, -64, -64, -64, 64, -64, -64, -64, 64, 64, -64, 64, -64, -64, -64, -64, -64, -64, -64, -64, -64, -64, 64, -64, 64, 64, 64, -64, -64, -64, -64, 64, -64, 64, -64, -64, 64, 64, -64, -64, -64, -64, -64, -64, -64, -64, -64, -64, -64, -64, 64, 64, 64, -64, -64, 64, 64, -64, -64, 64, 64, -64, -64, -64, 64, 64, -64, -64, 64, 64, -64, 64, -64, -64, -64, -64, -64, -64, -64, -64, -64, -64, 64, 64, 64, -64, -64, 64, -64, -64, -64, -64, -64, 64, -64, 64, -64, -64, 64, -64, 64, -64, -64, -64, -64, -64, -64, 64, -64, -64, 64, -64, 64, -64, 64, -64, 64, -64, -64, 64, 64, 64, -64, 64, -64, 64, 64, -64, 64, 64, 64, -64, -64, 64, 64, 64, 64, -64, 64, 64, -64, -64, 64, -64, 64, -64, 64, 64, 64, 64, -64, 64, -64, -64, 64, 64, 64, 64, 64, -64, 64, 64, 64, 64, 64, 64, 64, 64, -64, -64, 64, -64, 64, -64, 64, 64, 64, -64, -64, 64, -64, -64, 64, -64, 64, 64, 64, -64, 64, -64, -64, -64, -64, 64, -64, 64, -64, -64, -64, -64, -64, 64, -64, -64, 64, -64, 64, 64, 64, 64, 64, -64, -64, -64, -64, 64, 64, 64, 64, 64, -64, -64, 64, 64, 64, -64, 64, -64, 64, 64, 64, 64, -64, 64, 64, 64, -64, -64, -64, -64, 64, -64, 64, 64, 64, 64, 64, -64, -64, -64, 64, 64, 64, -64, 64, -64, -64, -64, -64, -64, -64, -64, -64, 64, 64, 64, 64, -64, 64, -64, -64, 64, -64, -64, -64, -64, -64, 64, -64, -64, -64, 64, 64, -64, -64, 64, 64, 64, 64, -64, 64, -64, -64, -64, 64, 64, 64, 64, 64, 64, -64, -64, -64, -64, -64, -64, -64, -64, -64, -64, 64, -64, -64, -64, 64, -64, -64, -64, 64, 64, 64, -64, 64, 64, 64, 64, 64, 64, -64, -64, -64, -64, -64, -64, -64, -64, -64, -64, 64, -64, -64, -64, 64, 64, 64, 64, 64, 64, -64, 64, 64, 64, 64, 64, -64, -64, 64, 64, 64, -64, -64, -64, -64, -64, -64, -64, -64, -64, -64, 64, -64, 64, 64, 64, 64, -64, 64, 64, 64, 64, -64, -64, 64, 64, 64, -64, 64, -64, -64, -64, -64, -64, -64, -64, -64, -64, -64, -64, 64, -64, -64, 64, 64, 64, 64, 64, 64, 64, 64, -64, -64, 64, 64, 64, -64, 64, -64, -64, -64, -64, -64, -64, -64, -64, 64, 64, 64, 64, 64, 64, 64, 64, -64, 64, 64, 64, 64, 64, 64, 64, 64, 64, 64, 64, -64, -64, -64, -64, -64, -64, -64, -64, -64, 64, -64, 64, 64, 64, 64, 64, -64, 64, -64, -64, -64, 64, 64, 64, 64, 64, 64, 64, -64, -64, -64, -64, -64, -64, -64, -64, -64, -64, -64, 64, 64, 64, -64, 64, -64, -64, -64, -64, -64, 64, 64, 64, 64, 64, 64, 64, 64, -64, -64, -64, -64, -64, -64, -64, -64, 64, -64, -64, -64, -64, -64, -64, -64, -64, 64, -64, -64, 64, -64, 64, 64, 64, -64, -64, -64, -64, -64, -64, -64, 64, 64, -64, -64, -64, -64, -64, 64, -64, -64, -64, -64, -64, 64, -64, -64, -64, -64, -64, 64, -64, -64, -64, -64, -64, -64, 64, -64, 64, -64, 64, -64, -64, -64, -64, -64, 64, -64, -64, -64, -64, -64, 64, 64, 64, -64, 64, 64, -64, 64, 64, 64, -64, -64, -64, -64, -64, -64, 64, 64, 64, 64, -64, -64, 64, -64, -64, -64, -64, -64, -64, -64, -64, -64, -64, -64, 64, 64, 64, -64, -64, 64, 64, 64, 64, -64, -64, -64, 64, 64, -64, 64, -64, 64, -64, -64, -64, -64, -64, -64, -64, 64, -64, -64, 64, -64, -64, -64, -64, 64, -64, 64, -64, -64, -64, -64, 64, 64, 64, 64, -64, 64, -64, -64, -64, -64, -64, -64, -64, 64, -64, -64, 64, 64, -64, 64, -64, -64, -64, 64, -64, -64, -64, 64, -64, -64, -64, -64, -64, 64, -64, -64, -64, -64, -64, -64, -64, -64, -64, -64, 64, 64, -64, -64, -64, 64, -64, -64, -64, -64, -64, -64, 64, 64, 64, -64, -64, -64, -64, -64, -64, -64, -64, -64, -64, -64, -64, 64, 64, 64, 64, -64, 64, 64, 64, 64, -64, -64, -64, -64, -64, 64, 64, 64, -64, 64, -64, -64, -64, -64, -64, -64, -64, -64, -64, -64, 64, 64, -64, -64, -64, 64, 64, 64, -64, 64, -64, 64, 64, -64, 64, -64, -64, -64, -64, -64, -64, -64, -64, -64, -64, -64, -64, 64, 64, 64, 64, -64, -64, 64, -64, 64, -64, -64, 64, 64, -64, 64, 64, 64, -64, 64, -64, -64, -64, -64, -64, -64, -64, -64, -64, 64, 64, 64, -64, -64, 64, 64, 64, -64, -64, -64, -64, 64, -64, -64, 64, -64, -64, -64, -64, 64, 64, -64, -64, -64, -64, -64, 64, 64, 64, 64, 64, 64, 64, 64, -64, -64, -64, -64, 64, -64, 64, 64, 64, -64, -64, 64, -64, 64, 64, 64, -64, -64, -64, -64, 64, 64, 64, 64, 64, -64, -64, 64, -64, -64, -64, -64, -64, 64, -64, 64, 64, -64, 64, 64, 64, -64, -64, 64, -64, 64, -64, 64, 64, 64, 64, 64, 64, -64, 64, 64, -64, 64, 64, 64, -64, -64, 64, 64, 64, -64, -64, 64, 64, -64, -64, 64, 64, 64, 64, 64, 64, 64, 64, 64, 64, 64, -64, 64, 64, 64, 64, -64, 64, -64, 64, 64, 64, 64, 64, -64, -64, 64, -64, 64, 64, 64, 64, 64, -64, -64, 64, 64, 64, -64, -64, 64, -64, -64, -64, 64, -64, 64, 64, 64, 64, 64, -64, 64, 64, -64, -64, -64, 64, 64, 64, 64, -64, 64, -64, -64, -64, -64, -64, 64, -64, 64, -64, 64, -64, 64, 64, 64, -64, 64, -64, 64, 64, -64, 64, -64, -64, -64, -64, -64, 64, -64, -64, -64, -64, 64, -64, -64, -64, -64, -64, 64, 64, 64, -64, 64, -64, -64, 64, 64, -64, 64, 64, 64, -64, -64, -64, -64, -64, 64, -64, -64, -64, 64, 64, -64, -64, -64, 64, -64, 64, -64, -64, -64, 64, -64, 64, 64, 64, -64, -64, 64, -64, -64, -64, -64, 64, 64, 64, 64, 64, -64, -64, -64, -64, 64, -64, -64, 64, -64, -64, -64, 64, 64, 64, -64, 64, -64, 64, -64, -64, -64, -64, -64, 64, 64, 64, 64, 64, 64, 64, -64, -64, -64, 64, -64, -64, -64, 64, 64, 64, -64, 64, -64, -64, 64, -64, 64, 64, 64, 64, 64, 64, 64, 64, 64, -64, -64, 64, 64, -64, -64, -64, -64, 64, 64, -64, 64, 64, 64, 64, 64, 64, 64, -64, 64, -64, 64, 64, 64, 64, 64, 64, -64, -64, -64, -64, -64, -64, -64, -64, -64, 64, 64, 64, 64, 64, 64, -64, -64, 64, -64, -64, 64, 64, 64, 64, 64, 64, 64, 64, -64, -64, 64, 64, 64, -64, -64, -64, -64, -64, -64, 64, -64, 64, -64, -64, -64, 64, -64, 64, 64, 64, 64, 64, 64, 64, 64, -64, -64, -64, 64, 64, -64, -64, -64, -64, -64, 64, -64, -64, 64, 64, 64, 64, 64, -64, 64, 64, 64, 64, 64, 64, 64, 64, 64, -64, -64, -64, -64, -64, -64, 64, -64, -64, -64, -64, -64, -64, 64, -64, 64, -64, -64, 64, 64, 64, 64, 64, 64, 64, 64, -64, -64, -64, -64, 64, 64, 64, 64, -64, -64, -64, -64, -64, -64, 64, 64, 64, -64, -64, 64, 64, 64, 64, 64, 64, -64, -64, -64, -64, -64, -64, -64, 64, 64, 64, 64, 64, -64, -64, -64, -64, -64, -64, 64, 64, 64, -64, -64, 64, 64, 64, 64, 64, -64, -64, 64, -64, 64, 64, 64, 64, 64, 64, 64, 64, 64, -64, -64, -64, 64, -64, 64, -64, -64, 64, 64, 64, 64, 64, 64, -64, -64, 64, 64, 64, 64, 64, 64, 64, 64, 64, 64, 64, 64, -64, -64, -64, -64, -64, 64, 64, 64, -64, 64, 64, 64, 64, 64, 64, -64, -64, -64, 64, 64, 64, 64, 64, 64, 64, 64, 64, -64, 64, -64, -64, -64, -64, -64, 64, 64, 64, 64, 64, 64, -64, 64, 64, -64, -64, -64, -64, -64, -64, 64, 64, 64, 64, 64, 64, 64, -64, -64, -64, -64, -64, 64, 64, -64, -64, -64, -64, 64, 64, 64, 64, -64, 64, -64, -64, -64, -64, -64, -64, 64, -64, 64, 64, 64, -64, -64, -64, 64, -64, 64, -64, 64, -64, -64, -64, -64, 64, -64, -64, 64, -64, -64, -64, -64, -64, -64, -64, 64, 64, -64, 64, 64, 64, 64, 64, -64, -64, 64, -64, 64, 64, 64, -64, 64, -64, 64, -64, -64, 64, -64, -64, -64, -64, -64, -64, -64, 64, 64, 64, 64, 64, 64, -64, 64, -64, 64, -64, 64, -64, 64, 64, 64, -64, 64, 64, 64, 64, -64, -64, -64, -64, -64, -64, 64, 64, 64, 64, 64, 64, 64, -64, 64, 64, -64, -64, 64, -64, 64, 64, 64, -64, -64, -64, 64, -64, -64, -64, -64, -64, -64, -64, 64, 64, 64, 64, 64, 64, 64, -64, 64, 64, 64, 64, 64, 64, -64, -64, -64, -64, -64, 64, -64, -64, 64, -64, -64, -64, 64, 64, 64, 64, 64, 64, 64, 64, 64, -64, 64, 64, 64, -64, 64, -64, 64, -64, -64, -64, 64, -64, 64, 64, 64, -64, 64, 64, 64, 64, 64, 64, 64, 64, 64, 64, 64, 64, 64, -64, -64, 64, -64, -64, 64, -64, 64, 64, -64, 64, 64, 64, 64, 64, 64, 64, 64, 64, 64, 64, 64, 64, 64, -64, 64, -64, 64, -64, -64, 64, 64, 64, 64, 64, -64, 64, 64, 64, 64, 64, 64, 64, 64, 64, 64, 64, 64, -64, 64, 64, -64, -64, 64, 64, 64, -64, -64, -64, -64, 64, 64, 64, -64, 64, 64, 64, 64, -64, -64, -64, 64, -64, 64, 64, -64, 64, 64, -64, -64, -64, 64, -64, 64, 64, -64, 64, 64, 64, -64, 64, 64, 64, 64, 64, 64, -64, 64, 64, 64, 64, 64, 64, -64, 64, -64, 64, 64, -64, -64, -64, -64, -64, 64, -64, -64, 64, 64, -64, 64, -64, 64, 64, -64, 64, -64, 64, 64, 64, -64, 64, 64, -64, 64, 64, -64, -64, 64, -64, -64, 64, -64, 64, -64, 64, 64, 64, 64, 64, 64, -64, 64, -64, 64, -64, -64, -64, -64, 64, 64, -64, 64, 64, 64, -64, -64, -64, -64, -64, 64, -64, 64, -64, -64, 64, -64, -64, 64, 64, 64, -64, 64, 64, 64, 64, 64, 64, -64, 64, -64, -64, -64, 64, -64, 64, 64, -64, 64, 64, 64, 64, -64, 64, -64, 64, 64, -64, 64, -64, -64, -64, 64, 64, 64, -64, -64, 64, -64, 64, -64, -64, 64, -64, -64, -64, 64, 64, -64, -64, -64, -64, -64, 64, -64, 64, -64, 64, 64, 64, -64, 64, 64, 64, 64, 64, 64, -64, 64, 64, -64, 64, 64, 64, -64, 64, 64, -64, -64, -64, 64, -64, -64, -64, -64, -64, 64, 64, 64, 64, 64, 64, 64, -64, 64, 64, 64, 64, 64, -64, -64, 64, 64, 64, 64, -64, 64, -64, -64, 64, 64, 64, 64, -64, 64, 64, 64, 64, 64, 64, 64, -64, -64, 64, 64, 64, 64, -64, -64, -64, -64, -64, 64, -64, -64, 64, -64, 64, -64, -64, -64, -64, -64, 64, 64, -64, 64, 64, -64, 64, 64, 64, 64, -64, -64, -64, 64, 64, -64, 64, 64, 64, -64, 64, 64, 64, 64, 64, 64, 64, -64, -64, 64, 64, -64, 64, -64, 64, 64, 64, 64, -64, -64, 64, 64, -64, -64, 64, -64, -64, -64, 64, 64, 64, 64, -64, -64, -64, 64, 64, 64, -64, 64, 64, 64, 64, 64, -64, 64, 64, 64, -64, -64, 64, 64, 64, 64, 64, -64, 64, 64, 64, 64, 64, 64, 64, 64, -64, 64, 64, -64, -64, 64, 64, 64, -64, -64, 64, 64, 64, 64, 64, -64, 64, -64, -64, -64, 64, -64, 64, 64, 64, 64, -64, 64, 64, 64, -64, -64, 64, 64, 64, -64, 64, 64, -64, 64, 64, 64, 64, -64, -64, 64, -64, -64, -64, 64, 64, 64, 64, 64, 64, 64, 64, -64, -64, 64, 64, -64, 64, 64, 64, -64, 64, -64, 64, 64, 64, -64, -64, 64, 64, 64, 64, 64, 64, -64, 64, 64, 64, -64, 64, -64, 64, -64, -64, 64, 64, -64, -64, -64, -64, 64, 64, -64, 64, -64, -64, 64, 64, 64, 64, 64, -64, 64, 64, 64, -64, 64, 64, -64, 64, 64, -64, 64, 64, 64, -64, -64, 64, 64, 64, -64, 64, -64, -64, -64, -64, 64, 64, 64, -64, -64, -64, -64, -64, 64, 64, 64, 64, 64, 64, -64, 64, 64, 64, 64, 64, 64, 64, -64, 64, -64, 64, -64, -64, -64, 64, 64, -64, -64, -64, 64, -64, 64, 64, 64, 64, -64, 64, -64, 64, 64, 64, 64, 64, 64, -64, -64, 64, 64, 64, 64, -64, -64, 64, 64, -64, -64, -64, 64, -64, -64, 64, 64, -64, 64, 64, 64, -64, 64, -64, 64, -64, -64, -64, 64, -64, 64, -64, 64, -64, -64, 64, 64, 64, -64, 64, -64, -64, 64, 64, -64, -64, -64, 64, 64, 64, -64, -64, -64, -64, 64, -64, -64, -64, 64, 64, -64, -64, 64, -64, 64, 64, 64, 64, 64, 64, -64, 64, 64, 64, -64, 64, 64, 64, -64, -64, -64, 64, -64, 64, -64, -64, 64, 64, 64, -64, 64, 64, 64, 64, -64, -64, 64, 64, 64, -64, 64, 64, -64, 64, -64, -64, 64, -64, -64, -64, -64, -64, -64, -64, -64, 64, -64, 64, 64, -64, 64, -64, 64, 64, 64, 64, 64, 64, 64, -64, 64, 64, -64, 64, -64, 64, 64, -64, -64, -64, 64, 64, -64, -64, -64, -64, -64, -64, 64, 64, 64, 64, 64, 64, 64, 64, 64, -64, -64, 64, 64, -64, 64, -64, -64, -64, -64, -64, -64, 64, 64, -64, 64, -64, -64, 64, -64, 64, -64, -64, -64, -64, -64, -64, 64, 64, 64, 64, 64, 64, -64, 64, 64, 64, 64, 64, 64, -64, -64, -64, -64, 64, 64, 64, -64, -64, 64, 64, 64, -64, 64, 64, 64, 64, 64, 64, 64, -64, 64, 64, 64, 64, -64, -64, 64, 64, 64, 64, 64, 64, 64, 64, -64, 64, 64, 64, -64, -64, 64, 64, -64, -64, 64, 64, -64, 64, -64, 64, 64, 64, -64, -64, 64, -64, 64, 64, 64, -64, 64, 64, -64, -64, 64, 64, 64, -64, 64, 64, 64, 64, 64, 64, 64, -64, 64, 64, -64, -64, 64, 64, 64, -64, -64, -64, -64, -64, -64, -64, 64, -64, 64, 64, -64, -64, 64, -64, -64, -64, 64, 64, 64, 64, 64, 64, 64, -64, 64, 64, 64, 64, 64, -64, -64, 64, 64, -64, 64, -64, -64, -64, -64, 64, -64, -64, -64, -64, 64, -64, -64, -64, 64, -64, 64, 64, 64, -64, -64, -64, -64, -64, -64, -64, -64, 64, -64, -64, 64, 64, 64, -64, 64, -64, 64, -64, 64, -64, 64, 64, -64, -64, 64, -64, -64, -64, -64, 64, -64, 64, -64, -64, 64, -64, -64, -64, -64, -64, -64, -64, -64, 64, -64, -64, 64, -64, -64, -64, -64, 64, 64, -64, 64, -64, -64, -64, 64, 64, -64, 64, 64, -64, -64, -64, -64, -64, -64, -64, 64, -64, 64, -64, -64, -64, -64, -64, -64, -64, -64, -64, 64, -64, -64, 64, 64, 64, 64, 64, -64, -64, 64, 64, 64, 64, 64, 64, 64, -64, 64, 64, 64, 64, -64, -64, 64, -64, -64, -64, 64, -64, 64, 64, -64, 64, 64, 64, 64, 64, 64, 64, 64, 64, 64, 64, 64, 64, 64, -64, 64, 64, 64, 64, -64, -64, 64, -64, 64, -64, -64, -64, -64, -64, -64, 64, -64, 64, 64, 64, -64, -64, -64, -64, -64, -64, 64, -64, -64, -64, -64, -64, -64, -64, -64, 64, -64, 64, -64, 64, 64, 64, -64, -64, 64, 64, 64, -64, 64, -64, -64, -64, -64, -64, -64, 64, -64, 64, -64, -64, -64, 64, -64, -64, -64, -64, -64, 64, -64, -64, -64, 64, -64, 64, 64, 64, -64, 64, -64, -64, -64, -64, -64, -64, -64, -64, 64, -64, -64, 64, -64, -64, 64, 64, 64, -64, -64, 64, 64, 64, -64, 64, -64, 64, -64, -64, -64, -64, -64, 64, 64, -64, 64, -64, 64, -64, 64, 64, 64, 64, -64, -64, -64, 64, 64, -64, 64, 64, 64, 64, -64, 64, -64, -64, -64, 64, 64, 64, 64, 64, 64, 64, 64, 64, 64, 64, -64, -64, 64, -64, 64, 64, -64, 64, 64, 64, -64, 64, -64, 64, 64, 64, -64, 64, 64, 64, -64, -64, 64, 64, 64, 64, -64, 64, 64, 64, 64, 64, 64, 64, 64, -64, -64, 64, 64, 64, -64, -64, -64, -64, 64, 64, -64, -64, -64, -64, 64, -64, -64, 64, -64, -64, -64, -64, -64, 64, 64, 64, -64, -64, -64, -64, 64, -64, -64, 64, -64, -64, 64, -64, -64, -64, -64, -64, 64, -64, 64, -64, -64, -64, -64, -64, -64, -64, 64, 64, -64, 64, -64, 64, 64, -64, -64, -64, -64, -64, -64, -64, -64, 64, -64, 64, 64, 64, -64, -64, -64, -64, -64, -64, -64, -64, 64, -64, -64, 64, 64, -64, 64, -64, -64, 64, -64, -64, -64, -64, -64, -64, -64, -64, -64, 64, -64, -64, -64, 64, 64, -64, 64, 64, 64, -64, 64, -64, -64, 64, 64, 64, -64, -64, -64, -64, -64, -64, -64, -64, -64, -64, -64, -64, 64, 64, 64, 64, -64, 64, 64, -64, 64, -64, 64, 64, 64, 64, 64, 64, 64, 64, -64, -64, -64, -64, -64, -64, -64, -64, -64, -64, -64, 64, 64, 64, 64, 64, 64, 64, -64, -64, -64, 64, 64, 64, 64, 64, 64, 64, 64, -64, -64, -64, -64, -64, -64, -64, -64, -64, -64, 64, 64, 64, 64, 64, 64, 64, 64, 64, 64, -64, -64, 64, 64, 64, 64, 64, 64, 64, 64, -64, -64, -64, 64, 64, -64, 64, 64, -64, 64, 64, 64, 64, 64, 64, 64, -64, -64, 64, -64, -64, 64, 64, 64, 64, 64, 64, 64, 64, -64, -64, 64, -64, -64, -64, -64, 64, 64, 64, 64, 64, 64, 64, 64, -64, 64, 64, 64, -64, -64, 64, 64, 64, -64, 64, 64, 64, 64, -64, -64, -64, -64, -64, -64, 64, 64, 64, 64, 64, 64, 64, -64, -64, -64, -64, -64, 64, -64, -64, -64, -64, -64, -64, -64, -64, -64, 64, 64, -64, -64, -64, 64, 64, 64, 64, 64, 64, 64, 64, 64, 64, 64, -64, -64, 64, -64, -64, -64, -64, -64, -64, -64, -64, -64, -64, -64, 64, -64, 64, 64, 64, -64, 64, 64, 64, 64, 64, 64, -64, -64, 64, 64, -64, 64, -64, -64, -64, -64, -64, -64, -64, -64, 64, -64, -64, -64, -64, 64, 64, 64, -64, 64, -64, 64, 64, 64, -64, -64, 64, 64, 64, -64, 64, 64, -64, -64, -64, -64, -64, 64, -64, -64, -64, -64, -64, 64, 64, 64, 64, 64, 64, 64, 64, -64, -64, -64, -64, -64, -64, 64, 64, 64, 64, -64, 64, 64, 64, 64, 64, 64, 64, 64, 64, 64, 64, -64, 64, 64, 64, 64, -64, -64, -64, -64, 64, 64, -64, 64, -64, 64, 64, 64, 64, 64, -64, 64, 64, 64, 64, 64, 64, 64, 64, 64, 64, 64, 64, -64, -64, -64, -64, 64, -64, 64, -64, -64, -64, -64, -64, 64, 64, -64, 64, 64, -64, 64, 64, 64, -64, -64, 64, 64, 64, 64, 64, 64, 64, 64, 64, 64, -64, 64, -64, -64, 64, -64, 64, -64, -64, -64, -64, -64, -64, 64, 64, -64, -64, -64, 64, 64, -64, -64, -64, 64, -64, -64, -64, 64, -64, -64, 64, 64, -64, 64, 64, 64, 64, 64, 64, -64, -64, -64, 64, 64, -64, -64, -64, -64, -64, -64, -64, 64, -64, -64, -64, -64, -64, -64, 64, -64, -64, 64, 64, 64, 64, -64, -64, 64, -64, 64, 64, 64, 64, 64, 64, 64, -64, -64, 64, 64, -64, -64, -64, -64, -64, 64, -64, -64, -64, -64, 64, -64, 64, 64, 64, 64, 64, 64, 64, -64, 64, -64, 64, 64, -64, 64, -64, -64, 64, 64, -64, 64, 64, -64, 64, 64, 64, 64, 64, -64, -64, 64, -64, 64, 64, 64, 64, 64, 64, 64, 64, 64, -64, -64, -64, -64, -64, -64, 64, -64, 64, -64, 64, 64, 64, 64, 64, -64, -64, 64, -64, -64, -64, 64, 64, -64, -64, 64, 64, 64, 64, -64, 64, 64, 64, -64, 64, 64, 64, -64, -64, -64, 64, 64, 64, -64, -64, 64, 64, 64, 64, 64, 64, 64, 64, 64, 64, 64, -64, -64, 64, -64, -64, 64, 64, -64, 64, 64, 64, -64, -64, 64, 64, 64, 64, 64, 64, 64, 64, 64, -64, -64, -64, -64, 64, 64, 64, -64, -64, -64, -64, 64, 64, 64, 64, -64, -64, -64, -64, 64, 64, 64, 64, -64, 64, 64, 64, -64, -64, -64, -64, -64, 64, -64, -64, 64, -64, -64, -64, 64, -64, 64, -64, 64, -64, -64, -64, 64, -64, 64, -64, -64, 64, 64, 64, 64, -64, -64, 64, 64, 64, 64, -64, -64, -64, -64, -64, 64, -64, 64, -64, 64, -64, 64, 64, -64, -64, -64, -64, 64, -64, 64, -64, -64, -64, -64, -64, 64, 64, 64, 64, 64, -64, 64, -64, -64, 64, 64, -64, -64, -64, -64, 64, 64, 64, 64, 64, 64, 64, -64, -64, -64, -64, 64, -64, 64, 64, 64, 64, -64, 64, 64, -64, -64, 64, -64, -64, 64, -64, 64, 64, -64, 64, 64, -64, 64, 64, -64, -64, 64, -64, -64, -64, 64, 64, 64, -64, -64, 64, 64, 64, 64, 64, -64, 64, -64, -64, 64, 64, 64, 64, 64, 64, -64, -64, -64, -64, 64, 64, -64, -64, -64, 64, 64, 64, 64, 64, 64, 64, 64, 64, -64, -64, -64, -64, 64, 64, 64, 64, 64, 64, 64, -64, -64, -64, -64, -64, 64, -64, -64, 64, 64, 64, 64, 64, 64, 64, 64, 64, -64, 64, -64, 64, 64, 64, -64, 64, 64, 64, 64, 64, -64, -64, -64, -64, -64, 64, 64, 64, 64, 64, 64, -64, -64, 64, 64, -64, -64, 64, -64, -64, -64, -64, -64, 64, 64, 64, 64, 64, 64, 64, 64, -64, 64, 64, 64, 64, 64, 64, 64, 64, 64, 64, 64, 64, 64, -64, -64, -64, -64, -64, 64, 64, 64, 64, 64, 64, 64, -64, -64, 64, 64, 64, 64, 64, 64, 64, 64, 64, 64, 64, -64, -64, 64, 64, 64, 64, -64, -64, -64, 64, -64, 64, 64, 64, -64, 64, 64, 64, 64, 64, 64, 64, 64, 64, 64, 64, 64, 64, 64, -64, 64, -64, -64, -64, -64, -64, -64, -64, 64, 64, 64, -64, -64, 64, 64, 64, 64, 64, 64, 64, 64, 64, 64, 64, 64, 64, -64, 64, 64, 64, -64, 64, 64, -64, 64, 64, 64, 64, 64, -64, -64, 64, 64, 64, -64, -64, 64, 64, -64, -64, -64, -64, 64, 64, 64, 64, -64, 64, 64, 64, 64, -64, 64, 64, 64, 64, 64, -64, -64, 64, 64, 64, 64, -64, 64, -64, 64, -64, -64, 64, -64, 64, -64, -64, -64, -64, 64, 64, -64, -64, 64, 64, 64, 64, 64, -64, 64, 64, 64, 64, -64, -64, -64, 64, 64, -64, 64, -64, -64, 64, -64, 64, 64, -64, -64, -64, -64, -64, 64, 64, 64, 64, 64, 64, 64, 64, 64, -64, -64, -64, -64, 64, 64, -64, 64, -64, 64, 64, -64, -64, -64, 64, -64, 64, -64, -64, 64, -64, 64, 64, 64, -64, 64, 64, -64, 64, -64, -64, 64, 64, 64, 64, -64, -64, 64, 64, -64, 64, 64, -64, 64, 64, 64, 64, -64, 64, -64, 64, -64, -64, 64, 64, 64, 64, 64, -64, -64, -64, 64, 64, 64, -64, -64, 64, -64, 64, -64, -64, -64, -64, -64, -64, 64, 64, -64, 64, 64, 64, -64, 64, -64, 64, 64, 64, -64, 64, 64, -64, -64, -64, 64, 64, 64, -64, -64, -64, -64, -64, 64, 64, -64, -64, 64, -64, 64, 64, 64, 64, 64, 64, -64, -64, -64, -64, -64, -64, -64, -64, 64, 64, 64, 64, -64, 64, -64, -64, 64, -64, 64, 64, 64, -64, 64, 64, 64, -64, -64, 64, 64, -64, 64, -64, -64, -64, 64, -64, 64, 64, -64, 64, 64, 64, -64, 64, -64, 64, 64, -64, 64, 64, 64, -64, -64, 64, -64, 64, -64, 64, 64, -64, 64, 64, 64, -64, 64, 64, 64, 64, 64, 64, 64, 64, -64, -64, -64, -64, -64, 64, -64, 64, -64, -64, -64, -64, 64, 64, 64, 64, -64, -64, -64, -64, 64, 64, -64, -64, -64, -64, -64, 64, -64, 64, -64, -64, -64, -64, -64, -64, -64, -64, -64, -64, -64, -64, -64, -64, 64, -64, -64, -64, -64, 64, 64, 64, -64, -64, -64, 64, 64, 64, 64, 64, -64, 64, -64, 64, 64, -64, 64, -64, 64, 64, -64, 64, 64, -64, -64, 64, 64, 64, -64, -64, -64, 64, 64, 64, 64, 64, 64, 64, -64, -64, 64, 64, 64, 64, -64, -64, -64, -64, -64, 64, 64, -64, -64, 64, 64, 64, -64, -64, 64, 64, 64, 64, 64, 64, 64, -64, -64, -64, -64, -64, -64, 64, -64, 64, -64, 64, -64, -64, -64, -64, -64, 64, 64, 64, 64, -64, 64, -64, 64, -64, -64, -64, 64, -64, -64, 64, -64, -64, 64, 64, -64, -64, -64, 64, -64, -64, -64, -64, -64, -64, 64, 64, 64, 64, -64, 64, -64, 64, -64, -64, 64, 64, -64, -64, -64, -64, -64, 64, -64, 64, -64, -64, -64, -64, 64, -64, -64, -64, 64, 64, 64, -64, -64, -64, -64, -64, -64, 64, -64, -64, -64, -64, -64, 64, -64, -64, -64, -64, -64, -64, -64, -64, -64, -64, -64, 64, 64, 64, 64, -64, 64, -64, -64, -64, -64, -64, 64, -64, -64, -64, 64, 64, -64, -64, -64, -64, -64, -64, -64, -64, 64, -64, -64, 64, -64, 64, 64, 64, 64, 64, 64, -64, -64, -64, -64, -64, -64, 64, 64, -64, -64, -64, -64, 64, -64, 64, -64, -64, -64, -64, -64, 64, -64, 64, -64, -64, -64, -64, -64, 64, 64, 64, 64, -64, -64, -64, 64, 64, 64, -64, 64, 64, 64, 64, -64, -64, -64, -64, -64, 64, -64, -64, -64, 64, 64, -64, 64, 64, 64, 64, 64, -64, 64, -64, -64, 64, -64, -64, 64, -64, -64, 64, 64, -64, -64, 64, -64, -64, 64, -64, -64, -64, -64, 64, 64, 64, -64, 64, 64, 64, 64, -64, 64, -64, -64, -64, -64, -64, -64, -64, -64, -64, -64, -64, -64, -64, -64, -64, -64, 64, -64, -64, -64, -64, -64, 64, -64, -64, -64, -64, 64, -64, 64, -64, 64, -64, -64, -64, -64, 64, -64, 64, 64, -64, 64, -64, -64, 64, 64, 64, -64, -64, -64, -64, -64, -64, -64, -64, -64, -64, -64, 64, -64, -64, -64, -64, -64, -64, -64, -64, -64, 64, -64, -64, -64, 64, 64, 64, -64, 64, -64, -64, -64, -64, -64, 64, -64, -64, -64, -64, -64, -64, -64, 64, 64, -64, -64, -64, 64, 64, -64, -64, 64, 64, 64, 64, -64, 64, -64, 64, 64, 64, -64, -64, -64, -64, -64, -64, -64, 64, 64, -64, 64, -64, -64, 64, 64, 64, 64, 64, -64, -64, 64, 64, -64, -64, -64, -64, 64, -64, -64, 64, -64, -64, -64, -64, -64, -64, -64, -64, -64, -64, -64, 64, 64, 64, 64, -64, -64, 64, -64, 64, -64, -64, 64, 64, -64, -64, -64, -64, -64, 64, -64, 64, -64, -64, 64, 64, -64, 64, -64, -64, -64, -64, 64, -64, -64, 64, -64, -64, -64, -64, -64, -64, -64, -64, -64, 64, 64, -64, 64, -64, 64, 64, 64, -64, 64, 64, 64, -64, -64, -64, 64, -64, -64, 64, -64, 64, 64, -64, -64, -64, -64, -64, -64, -64, 64, -64, -64, -64, -64, 64, 64, 64, -64, -64, 64, -64, -64, 64, -64, -64, -64, -64, -64, 64, -64, -64, -64, -64, -64, -64, -64, 64, -64, -64, -64, -64, -64, -64, -64, -64, 64, -64, -64, -64, -64, -64, -64, 64, -64, -64, 64, -64, 64, -64, -64, -64, -64, 64, -64, -64, -64, -64, -64, -64, -64, -64, -64, 64, -64, -64, 64, 64, -64, -64, 64, -64, 64, -64, 64, 64, 64, -64, -64, -64, -64, 64, 64, 64, 64, -64, 64, 64, 64, -64, -64, 64, 64, 64, 64, -64, 64, 64, 64, -64, 64, 64, -64, -64, 64, 64, -64, -64, 64, 64, -64, -64, -64, 64, 64, -64, -64, -64, -64, 64, -64, 64, 64, 64, 64, 64, 64, -64, 64, -64, -64, -64, -64, -64, -64, 64, -64, -64, 64, -64, 64, 64, 64, -64, 64, -64, -64, -64, 64, -64, 64, -64, -64, 64, -64, -64, -64, 64, 64, 64, 64, -64, 64, 64, -64, -64, -64, -64, 64, -64, -64, 64, 64, -64, -64, -64, -64, -64, -64, -64, 64, 64, 64, -64, 64, -64, 64, -64, -64, -64, -64, 64, 64, 64, 64, 64, -64, 64, -64, 64, -64, 64, 64, 64, -64, -64, 64, -64, 64, -64, 64, 64, -64, 64, -64, 64, -64, 64, -64, -64, -64, 64, 64, 64, 64, 64, 64, 64, 64, -64, -64, 64, -64, 64, -64, -64, -64, 64, 64, 64, -64, -64, -64, -64, 64, -64, 64, -64, -64, 64, -64, 64, 64, 64, 64, 64, 64, 64, -64, 64, -64, 64, 64, 64, 64, 64, 64, 64, -64, -64, -64, 64, 64, -64, -64, -64, -64, -64, -64, 64, -64, 64, 64, 64, 64, 64, 64, 64, 64, -64, -64, -64, 64, 64, -64, 64, 64, 64, -64, -64, 64, 64, -64, -64, -64, -64, -64, -64, 64, 64, 64, 64, 64, 64, -64, -64, 64, -64, -64, -64, 64, 64, -64, 64, 64, -64, 64, -64, -64, -64, -64, -64, -64, -64, -64, 64, 64, 64, 64, 64, 64, 64, 64, 64, -64, -64, 64, -64, -64, -64, -64, 64, -64, -64, 64, 64, 64, -64, -64, -64, -64, -64, -64, 64, 64, 64, 64, 64, 64, 64, 64, -64, 64, 64, -64, -64, -64, -64, 64, 64, -64, -64, -64, -64, -64, -64, -64, -64, -64, -64, 64, -64, 64, -64, -64, 64, 64, -64, -64, 64, 64, -64, -64, -64, -64, -64, 64, 64, -64, 64, 64, 64, 64, -64, -64, 64, -64, 64, 64, 64, 64, 64, 64, 64, 64, -64, -64, -64, 64, 64, -64, -64, -64, 64, -64, 64, 64, 64, -64, 64, 64, 64, 64, 64, 64, 64, -64, 64, 64, 64, 64, -64, -64, -64, -64, -64, -64, -64, -64, -64, -64, 64, 64, 64, 64, -64, -64, -64, 64, 64, 64, 64, 64, 64, 64, 64, 64, 64, 64, -64, -64, -64, -64, 64, 64, -64, -64, -64, 64, 64, 64, 64, 64, 64, 64, -64, 64, 64, 64, 64, 64, 64, 64, 64, 64, -64, -64, -64, -64, -64, -64, 64, -64, -64, -64, 64, 64, 64, 64, 64, 64, 64, 64, 64, 64, -64, 64, 64, 64, -64, -64, -64, -64, -64, -64, -64, -64, -64, -64, -64, -64, -64, 64, -64, 64, 64, 64, 64, 64, -64, 64, -64, -64, -64, -64, 64, -64, -64, -64, -64, -64, -64, -64, -64, -64, -64, -64, -64, -64, -64, -64, -64, -64, 64, 64, 64, 64, -64, 64, -64, 64, 64, -64, -64, 64, 64, -64, 64, -64, -64, -64, -64, -64, -64, -64, 64, -64, -64, -64, -64, 64, -64, 64, 64, -64, -64, 64, -64, -64, 64, -64, 64, 64, 64, 64, 64, 64, 64, -64, -64, -64, -64, -64, 64, 64, -64, -64, -64, 64, -64, 64, 64, -64, -64, 64, -64, -64, -64, -64, 64, 64, 64, 64, 64, 64, 64, 64, 64, 64, -64, -64, -64, -64, -64, -64, -64, -64, -64, -64, 64, -64, 64, 64, -64, -64, -64, -64, -64, -64, -64, 64, 64, 64, 64, 64, 64, 64, 64, -64, 64, -64, -64, -64, -64, -64, 64, 64, 64, -64, 64, 64, -64, -64, -64, -64, -64, -64, -64, 64, 64, 64, 64, 64, 64, 64, -64, -64, 64, 64, -64, 64, -64, 64, 64, 64, 64, 64, -64, -64, 64, -64, -64, -64, -64, -64, -64, -64, 64, 64, 64, 64, 64, -64, -64, -64, 64, -64, -64, 64, 64, 64, 64, 64, -64, -64, -64, -64, -64, 64, 64, -64, -64, -64, -64, -64, 64, -64, 64, 64, -64, -64, -64, 64, -64, -64, -64, -64, 64, 64, 64, 64, 64, -64, -64, 64, -64, 64, 64, -64, -64, -64, -64, -64, -64, 64, -64, -64, -64, 64, 64, -64, 64, -64, -64, -64, 64, 64, 64, 64, 64, -64, -64, 64, 64, 64, -64, 64, -64, -64, -64, -64, -64, -64, 64, 64, 64, 64, 64, -64, -64, 64, -64, 64, -64, 64, 64, -64, -64, -64, -64, -64, 64, -64, -64, -64, -64, -64, -64, -64, -64, -64, -64, 64, -64, 64, 64, 64, 64, 64, 64, 64, 64, 64, 64, 64, -64, -64, 64, -64, -64, -64, 64, -64, -64, -64, -64, -64, -64, -64, 64, 64, -64, -64, -64, 64, 64, 64, -64, 64, 64, 64, 64, 64, -64, -64, -64, -64, -64, 64, 64, -64, -64, -64, -64, 64, 64, 64, 64, 64, 64, 64, -64, -64, 64, 64, -64, -64, 64, 64, -64, 64, 64, 64, 64, -64, -64, -64, -64, 64, 64, 64, -64, -64, -64, -64, 64, 64, 64, 64, 64, 64, -64, 64, -64, 64, 64, 64, 64, -64, 64, -64, 64, 64, -64, 64, -64, 64, 64, -64, -64, -64, -64, -64, -64, -64, -64, -64, 64, -64, 64, 64, -64, -64, 64, 64, -64, 64, 64, -64, -64, 64, -64, 64, -64, -64, 64, 64, 64, -64, -64, 64, 64, 64, 64, -64, 64, -64, 64, 64, 64, -64, 64, 64, -64, -64, 64, -64, -64, 64, -64, 64, 64, 64, 64, 64, -64, 64, 64, 64, 64, 64, 64, 64, 64, 64, 64, 64, 64, -64, -64, 64, 64, 64, -64, 64, 64, -64, -64, 64, -64, 64, 64, 64, 64, 64, 64, 64, -64, -64, 64, 64, 64, -64, 64, 64, 64, 64, 64, 64, 64, 64, -64, 64, 64, -64, 64, 64, 64, 64, 64, -64, 64, 64, 64, -64, 64, -64, -64, -64, 64, 64, 64, -64, -64, -64, -64, 64, -64, 64, 64, -64, -64, -64, 64, -64, -64, 64, -64, -64, 64, -64, -64, -64, 64, 64, -64, -64, -64, 64, 64, -64, -64, -64, -64, -64, -64, 64, 64, 64, 64, -64, 64, -64, 64, 64, -64, -64, -64, -64, 64, 64, 64, 64, -64, -64, 64, 64, 64, 64, -64, -64, -64, -64, -64, 64, 64, -64, -64, 64, 64, 64, -64, -64, -64, -64, -64, -64, -64, 64, -64, -64, -64, 64, 64, 64, 64, 64, 64, -64, -64, -64, -64, 64, 64, 64, -64, 64, -64, 64, -64, -64, -64, -64, -64, 64, 64, -64, -64, -64, 64, 64, 64, 64, 64, 64, -64, -64, -64, -64, 64, 64, 64, 64, 64, 64, 64, -64, -64, -64, -64, -64, 64, 64, -64, -64, 64, -64, -64, 64, 64, 64, 64, -64, -64, -64, -64, -64, 64, 64, 64, -64, -64, -64, -64, -64, -64, -64, -64, -64, 64, 64, 64, 64, -64, -64, -64, 64, 64, 64, -64, 64, -64, -64, 64, 64, 64, 64, 64, 64, 64, 64, 64, -64, -64, 64, 64, 64, 64, 64, 64, 64, -64, 64, 64, 64, 64, 64, 64, -64, 64, 64, 64, 64, 64, 64, 64, 64, 64, -64, 64, 64, -64, 64, 64, 64, 64, 64, 64, 64, 64, 64, 64, 64, 64, 64, 64, -64, -64, 64, 64, 64, 64, 64, 64, 64, -64, 64, 64, -64, -64, 64, 64, 64, 64, -64, 64, 64, 64, 64, 64, 64, 64, 64, -64, 64, -64, 64, 64, 64, -64, -64, 64, 64, -64, 64, 64, -64, 64, 64, 64, 64, -64, -64, 64, 64, -64, 64, 64, 64, 64, 64, 64, -64, -64, -64, 64, 64, -64, -64, -64, -64, -64, -64, -64, -64, -64, -64, -64, -64, 64, -64, -64, -64, 64, 64, 64, 64, 64, 64, -64, -64, -64, -64, -64, -64, -64, -64, -64, -64, -64, 64, 64, -64, -64, -64, -64, -64, -64, -64, 64, -64, 64, 64, 64, 64, 64, -64, -64, -64, -64, 64, -64, -64, -64, -64, -64, 64, -64, 64, 64, 64, 64, -64, -64, -64, -64, -64, 64, 64, 64, 64, 64, 64, 64, -64, -64, -64, 64, -64, -64, -64, -64, -64, 64, -64, -64, 64, 64, -64, 64, -64, -64, -64, -64, -64, 64, 64, 64, 64, 64, 64, 64, 64, 64, -64, -64, 64, -64, -64, 64, 64, 64, -64, -64, -64, -64, 64, -64, -64, -64, -64, -64, 64, 64, 64, -64, 64, 64, 64, -64, -64, -64, -64, -64, 64, -64, -64, -64, -64, 64, -64, 64, -64, -64, 64, -64, -64, 64, -64, -64, -64, 64, -64, -64, -64, -64, 64, -64, -64, -64, -64, -64, -64, -64, -64, 64, -64, -64, -64, 64, 64, 64, 64, -64, -64, -64, 64, 64, -64, -64, -64, -64, 64, 64, 64, 64, 64, -64, -64, -64, -64, -64, -64, 64, -64, -64, -64, 64, 64, -64, -64, 64, -64, 64, 64, -64, -64, -64, -64, 64, -64, 64, 64, 64, -64, -64, -64, -64, 64, -64, -64, -64, -64, -64, 64, 64, -64, 64, -64, -64, -64, -64, -64, -64, -64, -64, 64, -64, 64, 64, 64, 64, 64, 64, 64, 64, 64, 64, 64, 64, -64, -64, -64, -64, -64, -64, -64, -64, -64, -64, -64, -64, 64, 64, 64, 64, 64, 64, 64, 64, 64, 64, 64, 64, 64, 64, -64, -64, -64, -64, -64, -64, -64, 64, -64, -64, 64, -64, 64, 64, 64, 64, 64, 64, 64, 64, 64, 64, 64, 64, 64, 64, 64, 64, -64, -64, -64, -64, -64, 64, 64, 64, -64, 64, -64, 64, 64, 64, 64, -64, 64, 64, 64, 64, 64, 64, 64, 64, 64, 64, 64, 64, -64, 64, 64, -64, 64, 64, -64, -64, -64, -64, -64, -64, 64, 64, -64, -64, 64, 64, 64, 64, 64, 64, 64, -64, 64, 64, -64, -64, 64, 64, 64, 64, -64, -64, 64, -64, 64, 64, -64, -64, -64, -64, -64, -64, 64, 64, 64, -64, -64, 64, 64, 64, 64, -64, -64, -64, -64, -64, 64, -64, -64, -64, 64, -64, -64, -64, 64, -64, -64, 64, -64, 64, -64, 64, 64, -64, -64, -64, 64, 64, 64, 64, 64, 64, -64, -64, -64, -64, -64, -64, 64, -64, 64, -64, -64, -64, -64, 64, 64, 64, -64, -64, -64, 64, -64, 64, 64, -64, -64, -64, -64, 64, 64, -64, 64, -64, -64, -64, 64, -64, 64, -64, 64, 64, -64, 64, 64, -64, 64, 64, 64, -64, 64, -64, -64, -64, -64, -64, -64, -64, -64, 64, -64, 64, 64, -64, 64, -64, 64, -64, -64, 64, 64, 64, 64, 64, 64, 64, 64, 64, -64, -64, -64, -64, -64, -64, 64, -64, 64, 64, -64, 64, -64, 64, 64, 64, 64, -64, -64, 64, 64, 64, 64, 64, 64, 64, 64, 64, 64, -64, -64, -64, 64, -64, -64, 64, 64, -64, -64, 64, 64, -64, -64, 64, 64, -64, 64, -64, 64, 64, 64, 64, 64, 64, 64, -64, -64, -64, 64, 64, 64, -64, -64, -64, 64, 64, -64, -64, 64, -64, -64, 64, -64, -64, -64, 64, 64, 64, 64, -64, -64, 64, 64, 64, 64, 64, -64, -64, -64, 64, -64, -64, 64, -64, -64, -64, -64, 64, 64, 64, -64, -64, -64, 64, 64, 64, 64, -64, 64, -64, -64, 64, -64, 64, 64, 64, 64, -64, 64, -64, -64, -64, -64, -64, -64, -64, 64, -64, -64, 64, 64, 64, 64, -64, 64, -64, -64, -64, 64, -64, 64, 64, 64, -64, -64, -64, -64, -64, -64, -64, -64, -64, -64, -64, 64, 64, -64, 64, 64, 64, -64, -64, 64, 64, -64, -64, -64, -64, -64, 64, -64, -64, 64, 64, 64, 64, 64, 64, -64, -64, -64, 64, -64, 64, -64, -64, 64, 64, 64, 64, 64, -64, -64, -64, -64, -64, -64, -64, -64, -64, -64, -64, -64, 64, 64, 64, 64, -64, 64, 64, 64, 64, -64, 64, 64, 64, 64, 64, 64, -64, -64, -64, -64, -64, -64, -64, -64, -64, -64, -64, -64, 64, 64, 64, -64, -64, -64, 64, -64, 64, -64, 64, 64, 64, 64, 64, 64, -64, -64, -64, -64, -64, -64, -64, -64, -64, -64, -64, -64, 64, 64, 64, 64, 64, 64, -64, -64, -64, 64, 64, 64, 64, 64, -64, -64, -64, -64, -64, -64, -64, -64, -64, -64, -64, -64, -64, -64, 64, 64, 64, 64, 64, -64, -64, -64, -64, 64, -64, -64, 64, -64, -64, -64, -64, 64, -64, -64, -64, -64, -64, -64, -64, -64, -64, -64, 64, 64, 64, 64, 64, -64, 64, 64, -64, -64, 64, 64, 64, -64, -64, 64, 64, -64, 64, 64, 64, -64, -64, -64, -64, -64, -64, -64, 64, 64, 64, 64, 64, 64, -64, -64, -64, -64, -64, 64, 64, -64, -64, -64, 64, -64, 64, 64, 64, -64, -64, -64, -64, -64, 64, 64, 64, 64, 64, -64, -64, 64, 64, -64, 64, 64, -64, 64, -64, -64, -64, 64, 64, 64, 64, 64, -64, -64, -64, -64, -64, -64, -64, 64, 64, 64, 64, 64, 64, -64, 64, 64, -64, 64, -64, 64, -64, -64, -64, 64, 64, -64, 64, -64, -64, -64, -64, -64, 64, 64, 64, 64, 64, 64, 64, 64, 64, -64, 64, -64, 64, -64, -64, -64, -64, -64, -64, 64, -64, -64, 64, 64, 64, 64, 64, -64, 64, 64, 64, 64, 64, 64, 64, 64, 64, 64, 64, 64, 64, -64, -64, 64, -64, 64, 64, -64, 64, 64, 64, -64, 64, -64, -64, 64, 64, -64, 64, 64, 64, 64, 64, 64, 64, -64, -64, -64, 64, 64, -64, -64, 64, -64, 64, 64, -64, 64, 64, 64, 64, -64, -64, -64, 64, -64, 64, -64, 64, -64, 64, 64, 64, 64, -64, -64, 64, -64, -64, 64, -64, -64, -64, -64, 64, -64, -64, 64, -64, -64, 64, 64, -64, -64, -64, -64, 64, 64, 64, -64, -64, 64, -64, 64, -64, -64, -64, -64, -64, -64, -64, -64, -64, -64, -64, -64, -64, -64, -64, -64, -64, -64, -64, -64, -64, 64, 64, 64, -64, -64, 64, 64, -64, -64, -64, -64, -64, -64, -64, -64, -64, -64, -64, -64, -64, -64, -64, -64, -64, -64, 64, 64, 64, -64, 64, -64, 64, -64, -64, -64, -64, 64, 64, 64, 64, -64, 64, 64, -64, -64, -64, -64, -64, -64, -64, 64, -64, 64, -64, -64, 64, -64, -64, 64, -64, -64, -64, 64, 64, -64, -64, -64, -64, 64, -64, 64, 64, -64, -64, 64, 64, 64, 64, 64, -64, -64, 64, -64, 64, 64, 64, -64, -64, 64, -64, -64, -64, -64, -64, 64, -64, 64, -64, 64, -64, 64, -64, 64, -64, 64, -64, 64, 64, 64, -64, -64, -64, 64, -64, 64, 64, 64, 64, -64, 64, 64, -64, 64, -64, -64, -64, -64, 64, -64, -64, -64, 64, -64, 64, 64, 64, 64, -64, -64, 64, -64, -64, -64, 64, -64, 64, 64, -64, 64, -64, 64, 64, -64, -64, 64, -64, -64, -64, 64, 64, 64, -64, 64, -64, 64, 64, -64, -64, 64, -64, 64, -64, 64, -64, -64, -64, -64, 64, -64, 64, 64, 64, 64, 64, 64, 64, 64, 64, 64, -64, 64, 64, -64, -64, -64, -64, -64, 64, 64, -64, -64, 64, -64, 64, -64, 64, -64, 64, -64, 64, 64, 64, 64, 64, 64, 64, 64, -64, 64, -64, -64, -64, 64, -64, 64, -64, -64, 64, 64, -64, 64, 64, -64, -64, 64, 64, 64, 64, 64, 64, -64, -64, 64, 64, 64, 64, -64, -64, -64, 64, 64, -64, 64, -64, -64, 64, -64, 64, 64, 64, -64, 64, 64, 64, 64, 64, 64, -64, 64, 64, 64, -64, 64, -64, -64, -64, -64, -64, 64, -64, 64, -64, -64, -64, 64, -64, -64, -64, 64, -64, 64, 64, 64, 64, 64, 64, 64, 64, 64, 64, -64, 64, -64, 64, -64, 64, -64, 64, -64, -64, -64, -64, -64, 64, -64, 64, 64, 64, 64, 64, 64, 64, 64, 64, 64, 64, 64, -64, 64, -64, -64, 64, -64, 64, 64, 64, -64, -64, -64, -64, -64, -64, 64, 64, 64, -64, 64, 64, 64, 64, 64, 64, 64, 64, 64, 64, -64, -64, -64, -64, 64, 64, 64, 64, 64, -64, -64, -64, -64, -64, -64, 64, 64, -64, 64, 64, 64, 64, 64, 64, 64, 64, -64, 64, -64, 64, 64, 64, 64, 64, 64, 64, 64, 64, 64, 64, 64, 64, 64, -64, -64, 64, -64, 64, 64, 64, 64, 64, 64, 64, 64, -64, 64, -64, 64, 64, 64, 64, 64, 64, 64, 64, 64, 64, -64, 64, -64, -64, -64, 64, 64, 64, 64, 64, 64, 64, -64, 64, -64, -64, -64, -64, -64, -64, 64, 64, 64, 64, 64, 64, 64, -64, 64, 64, 64, 64, 64, -64, 64, 64, 64, 64, 64, 64, -64, -64, -64, -64, -64, 64, -64, 64, 64, -64, 64, 64, 64, 64, 64, 64, -64, -64, -64, 64, 64, 64, 64, 64, 64, 64, 64, 64, 64, -64, -64, -64, 64, 64, 64, 64, 64, -64, 64, 64, 64, 64, 64, 64, 64, -64, -64, 64, 64, 64, 64, 64, 64, 64, 64, 64, 64, -64, 64, 64, 64, 64, 64, 64, -64, -64, 64, 64, 64, 64, 64, 64, 64, 64, -64, -64, -64, 64, -64, 64, 64, 64, 64, 64, 64, 64, 64, 64, -64, 64, 64, 64, -64, -64, 64, 64, 64, 64, -64, 64, 64, -64, -64, -64, -64, -64, -64, 64, 64, 64, 64, 64, 64, 64, 64, 64, 64, -64, -64, -64, -64, -64, -64, 64, 64, 64, 64, 64, -64, 64, 64, -64, -64, -64, -64, -64, -64, 64, 64, 64, 64, 64, 64, 64, 64, -64, -64, -64, -64, -64, -64, 64, 64, 64, 64, 64, -64, 64, -64, -64, -64, -64, -64, -64, -64, 64, -64, 64, 64, 64, 64, 64, 64, -64, -64, -64, -64, 64, 64, 64, 64, 64, 64, 64, 64, 64, 64, -64, 64, 64, -64, -64, -64, -64, -64, 64, -64, -64, -64, -64, -64, 64, -64, -64, -64, 64, 64, 64, 64, 64, 64, 64, 64, -64, -64, -64, 64, -64, -64, -64, 64, -64, -64, 64, -64, -64, -64, -64, -64, -64, -64, 64, 64, 64, 64, 64, 64, 64, 64, 64, -64, -64, -64, 64, -64, 64, 64, 64, 64, 64, -64, -64, -64, -64, -64, 64, -64, 64, 64, 64, 64, 64, 64, 64, 64, 64, 64, 64, -64, 64, -64, -64, -64, -64, -64, -64, 64, -64, -64, 64, 64, -64, 64, 64, 64, 64, 64, 64, 64, 64, 64, 64, 64, 64, 64, 64, 64, -64, 64, -64, -64, -64, -64, -64, -64, -64, -64, -64, -64, 64, 64, 64, 64, 64, 64, 64, 64, 64, -64, 64, 64, 64, -64, 64, 64, 64, 64, 64, 64, -64, -64, -64, -64, 64, -64, -64, -64, -64, 64, 64, 64, 64, 64, 64, 64, 64, -64, -64, 64, -64, 64, -64, -64, -64, -64, -64, -64, -64, 64, 64, 64, 64, 64, -64, 64, 64, 64, 64, 64, 64, 64, 64, -64, 64, -64, -64, -64, 64, 64, 64, -64, -64, -64, -64, -64, -64, -64, -64, -64, -64, -64, 64, -64, 64, 64, 64, -64, 64, -64, 64, -64, -64, 64, 64, 64, -64, 64, 64, 64, -64, 64, -64, 64, -64, -64, -64, 64, 64, 64, 64, -64, -64, -64, -64, 64, -64, -64, -64, 64, 64, 64, -64, -64, -64, -64, 64, -64, 64, 64, -64, 64, 64, -64, -64, -64, -64, -64, -64, -64, -64, 64, 64, -64, 64, -64, 64, 64, 64, -64, 64, 64, 64, -64, -64, 64, -64, -64, 64, 64, 64, 64, 64, 64, 64, 64, 64, 64, 64, 64, -64, 64, 64, 64, 64, -64, -64, -64, 64, 64, -64, 64, 64, -64, -64, -64, -64, 64, 64, 64, 64, 64, -64, -64, -64, -64, -64, 64, -64, 64, 64, 64, 64, -64, -64, -64, -64, 64, 64, -64, 64, -64, 64, -64, 64, -64, 64, -64, -64, 64, -64, 64, -64, 64, 64, 64, 64, 64, 64, -64, 64, -64, -64, 64, -64, -64, 64, 64, 64, -64, -64, 64, 64, -64, 64, 64, 64, 64, 64, 64, 64, 64, 64, 64, 64, 64, 64, 64, 64, 64, -64, -64, -64, -64, 64, 64, 64, 64, 64, 64, -64, 64, -64, 64, 64, 64, 64, -64, 64, 64, 64, 64, 64, -64, -64, 64, 64, 64, -64, -64, -64, -64, 64, -64, 64, 64, 64, 64, 64, 64, 64, 64, 64, 64, 64, 64, 64, 64, 64, 64, -64, 64, 64, -64, 64, -64, -64, -64, -64, -64, -64, -64, -64, 64, 64, 64, 64, 64, -64, 64, -64, -64, -64, -64, -64, 64, -64, -64, -64, -64, -64, -64, 64, -64, -64, -64, 64, -64, -64, -64, -64, 64, 64, -64, 64, 64, 64, 64, -64, 64, 64, 64, 64, -64, -64, -64, -64, -64, -64, 64, -64, -64, -64, -64, 64, -64, -64, -64, -64, -64, 64, -64, 64, -64, -64, -64, 64, 64, 64, 64, 64, -64, -64, -64, -64, -64, -64, 64, -64, 64, 64, -64, -64, -64, -64, 64, -64, -64, -64, 64, -64, -64, -64, -64, 64, 64, 64, 64, -64, 64, -64, -64, -64, -64, -64, -64, -64, -64, 64, -64, -64, -64, 64, -64, -64, -64, 64, 64, -64, -64, 64, 64, 64, 64, 64, 64, 64, -64, -64, 64, 64, 64, 64, -64, -64, 64, -64, -64, -64, 64, 64, 64, -64, -64, -64, -64, 64, 64, 64, 64, 64, 64, 64, 64, -64, 64, 64, 64, 64, 64, -64, 64, -64, 64, -64, 64, -64, 64, 64, 64, 64, -64, 64, 64, 64, 64, 64, 64, 64, -64, -64, -64, 64, 64, 64, 64, 64, -64, 64, -64, 64, 64, -64, -64, 64, 64, -64, 64, -64, 64, -64, -64, 64, -64, 64, 64, 64, 64, 64, -64, 64, 64, 64, 64, -64, 64, -64, -64, -64, 64, 64, 64, 64, 64, -64, 64, 64, 64, -64, 64, -64, 64, 64, 64, 64, 64, 64, 64, -64, -64, 64, -64, -64, 64, -64, -64, 64, -64, 64, 64, 64, 64, 64, 64, 64, -64, -64, -64, -64, 64, 64, 64, 64, 64, 64, 64, 64, -64, -64, -64, -64, -64, -64, -64, -64, 64, 64, 64, 64, 64, 64, 64, 64, -64, -64, -64, -64, -64, 64, 64, 64, 64, 64, 64, -64, 64, 64, -64, -64, -64, -64, -64, 64, 64, 64, 64, 64, 64, 64, 64, 64, -64, -64, -64, -64, 64, 64, 64, 64, 64, 64, 64, 64, 64, 64, 64, 64, 64, 64, 64, 64, 64, 64, 64, 64, 64, 64, -64, 64, 64, -64, -64, 64, 64, 64, 64, 64, 64, 64, 64, 64, 64, 64, 64, -64, -64, -64, 64, 64, 64, 64, 64, 64, 64, 64, -64, 64, 64, -64, -64, 64, -64, 64, 64, 64, -64, 64, 64, 64, 64, 64, 64, -64, -64, 64, -64, 64, 64, 64, 64, 64, 64, 64, 64, 64, -64, -64, 64, -64, -64, -64, -64, 64, -64, -64, -64, 64, 64, -64, -64, -64, -64, -64, -64, 64, 64, 64, 64, 64, 64, 64, -64, -64, 64, 64, -64, -64, 64, 64, -64, -64, -64, -64, -64, -64, -64, -64, -64, -64, 64, -64, 64, 64, 64, 64, 64, 64, 64, -64, 64, 64, -64, 64, -64, -64, -64, 64, -64, -64, -64, -64, -64, -64, -64, 64, -64, -64, -64, -64, -64, 64, 64, 64, 64, -64, 64, 64, 64, -64, -64, -64, -64, 64, -64, 64, -64, -64, 64, 64, -64, -64, -64, -64, -64, -64, -64, 64, -64, -64, 64, 64, 64, -64, -64, 64, 64, -64, 64, -64, -64, 64, -64, -64, 64, 64, -64, -64, -64, -64, -64, -64, -64, -64, -64, -64, -64, -64, 64, 64, 64, -64, 64, -64, 64, 64, -64, 64, 64, -64, 64, -64, 64, -64, -64, -64, -64, 64, -64, 64, -64, 64, -64, -64, 64, 64, -64, 64, -64, -64, -64, -64, 64, 64, 64, -64, -64, 64, -64, -64, -64, -64, -64, 64, -64, -64, -64, 64, 64, -64, 64, -64, -64, 64, 64, -64, 64, 64, 64, 64, 64, 64, -64, 64, -64, 64, 64, -64, 64, 64, 64, -64, 64, -64, -64, 64, 64, 64, 64, -64, -64, 64, -64, -64, 64, -64, -64, 64, 64, -64, 64, -64, 64, 64, 64, -64, 64, 64, -64, 64, -64, 64, 64, -64, -64, -64, -64, 64, -64, 64, 64, 64, 64, 64, 64, 64, -64, 64, 64, 64, 64, -64, 64, -64, -64, -64, 64, -64, -64, 64, -64, 64, -64, -64, -64, -64, -64, -64, 64, -64, -64, -64, 64, -64, -64, -64, -64, -64, 64, -64, 64, 64, -64, 64, 64, 64, 64, -64, -64, -64, 64, 64, -64, 64, -64, -64, -64, -64, 64, 64, -64, -64, 64, 64, 64, 64, 64, 64, -64, 64, -64, 64, -64, 64, -64, -64, -64, -64, 64, -64, -64, -64, -64, -64, 64, 64, -64, -64, -64, -64, 64, 64, -64, -64, 64, -64, -64, 64, 64, 64, -64, -64, 64, -64, 64, -64, -64, -64, -64, 64, -64, 64, 64, -64, 64, -64, 64, -64, -64, -64, 64, 64, -64, -64, 64, -64, -64, 64, -64, -64, -64, 64, -64, -64, -64, 64, -64, 64, -64, -64, -64, -64, -64, -64, -64, 64, 64, 64, -64, -64, 64, -64, -64, 64, -64, -64, -64, -64, 64, 64, 64, 64, -64, -64, -64, -64, -64, 64, -64, -64, -64, 64, -64, -64, 64, 64, -64, -64, 64, -64, -64, -64, 64, -64, 64, -64, -64, -64, -64, -64, 64, -64, -64, -64, -64, -64, -64, -64, 64, 64, -64, -64, -64, -64, -64, 64, 64, 64, -64, -64, -64, -64, 64, -64, -64, 64, -64, -64, -64, -64, -64, 64, 64, 64, 64, -64, 64, 64, -64, 64, -64, -64, -64, 64, 64, 64, -64, 64, 64, -64, -64, -64, 64, 64, 64, -64, -64, -64, -64, -64, -64, -64, 64, -64, 64, -64, -64, -64, 64, -64, 64, -64, -64, -64, -64, 64, -64, -64, 64, 64, -64, -64, -64, -64, -64, 64, -64, 64, 64, -64, -64, 64, -64, -64, -64, -64, -64, 64, -64, -64, -64, -64, 64, 64, 64, -64, 64, -64, -64, -64, 64, 64, -64, -64, 64, -64, -64, 64, 64, 64, 64, -64, 64, -64, 64, 64, 64, 64, -64, 64, -64, 64, 64, -64, 64, 64, -64, 64, 64, -64, 64, 64, -64, 64, -64, 64, -64, -64, 64, -64, -64, -64, 64, -64, -64, 64, 64, -64, -64, 64, 64, 64, 64, -64, -64, 64, -64, 64, -64, -64, 64, 64, -64, 64, -64, -64, -64, 64, 64, -64, -64, -64, 64, -64, -64, 64, -64, 64, 64, -64, 64, -64, -64, -64, -64, -64, 64, -64, -64, -64, -64, 64, -64, -64, -64, -64, 64, 64, -64, -64, -64, 64, 64, 64, 64, 64, 64, -64, -64, -64, 64, -64, -64, -64, 64, 64, -64, -64, -64, 64, 64, -64, 64, -64, -64, 64, 64, -64, 64, 64, 64, 64, 64, 64, -64, -64, -64, -64, -64, -64, -64, -64, -64, 64, -64, 64, -64, -64, -64, -64, 64, -64, 64, -64, 64, 64, -64, -64, 64, 64, -64, 64, -64, -64, 64, -64, 64, -64, -64, -64, -64, -64, -64, -64, 64, -64, 64, -64, -64, -64, -64, -64, 64, -64, -64, 64, -64, 64, 64, -64, 64, -64, -64, -64, -64, 64, -64, -64, 64, -64, 64, -64, -64, 64, 64, -64, 64, -64, -64, -64, -64, -64, -64, 64, -64, -64, 64, -64, 64, 64, 64, -64, -64, -64, -64, 64, -64, 64, -64, -64, -64, 64, -64, -64, -64, -64, -64, -64, 64, -64, 64, 64, 64, 64, 64, -64, 64, -64, -64, 64, -64, -64, -64, 64, -64, -64, 64, -64, -64, -64, 64, -64, -64, 64, -64, 64, -64, -64, 64, 64, -64, 64, 64, 64, 64, 64, -64, 64, 64, -64, 64, -64, -64, -64, 64, -64, -64, -64, 64, 64, -64, 64, 64, -64, 64, 64, 64, -64, -64, 64, 64, 64, -64, -64, -64, -64, 64, -64, 64, -64, -64, -64, 64, 64, 64, -64, 64, -64, 64, -64, 64, 64, -64, 64, -64, 64, 64, 64, 64, -64, -64, 64, -64, -64, -64, 64, 64, -64, -64, -64, 64, -64, -64, 64, -64, -64, -64, 64, -64, -64, -64, 64, 64, -64, -64, -64, 64, -64, 64, -64, -64, -64, 64, -64, -64, -64, 64, -64, -64, -64, -64, -64, 64, 64, 64, 64, -64, -64, 64, -64, -64, 64, 64, -64, 64, 64, 64, -64, 64, 64, -64, -64, 64, -64, 64, -64, 64, -64, -64, 64, 64, -64, 64, 64, 64, -64, -64, 64, 64, 64, 64, 64, 64, -64, 64, 64, 64, 64, -64, -64, -64, -64, 64, -64, 64, -64, -64, -64, 64, -64, 64, 64, -64, 64, -64, -64, 64, -64, 64, 64, 64, -64, 64, 64, -64, 64, 64, -64, 64, -64, -64, -64, 64, 64, 64, -64, -64, -64, 64, 64, 64, -64, -64, -64, 64, 64, 64, -64, -64, -64, -64, -64, -64, 64, -64, 64, -64, -64, -64, 64, 64, 64, -64, 64, 64, 64, -64, 64, -64, 64, -64, -64, 64, -64, -64, 64, -64, 64, 64, 64, 64, 64, -64, -64, 64, -64, -64, 64, 64, 64, 64, 64, 64, 64, 64, 64, 64, 64, 64, -64, -64, -64, -64, 64, 64, 64, 64, 64, 64, -64, -64, 64, -64, -64, 64, 64, -64, 64, -64, 64, 64, 64, 64, 64, 64, -64, 64, 64, -64, -64, -64, 64, -64, 64, -64, 64, 64, -64, -64, 64, 64, -64, 64, 64, -64, 64, 64, 64, 64, 64, 64, 64, -64, 64, 64, -64, 64, -64, -64, 64, 64, -64, 64, 64, 64, 64, -64, -64, 64, 64, -64, 64, 64, -64, 64, -64, -64, 64, 64, 64, 64, 64, -64, -64, 64, 64, -64, -64, -64, -64, 64, -64, 64, 64, 64, 64, 64, -64, 64, -64, 64, 64, 64, -64, 64, 64, 64, 64, -64, -64, -64, 64, -64, 64, -64, -64, 64, 64, 64, 64, -64, -64, -64, 64, 64, -64, 64, 64, 64, 64, -64, 64, -64, 64, 64, 64, 64, 64, -64, -64, -64, 64, 64, 64, 64, 64, 64, 64, 64, 64, 64, 64, 64, 64, -64, 64, -64, 64, 64, -64, -64, 64, -64, -64, 64, -64, -64, 64, 64, 64, 64, 64, 64, -64, -64, -64, 64, -64, 64, 64, 64, 64, 64, 64, -64, 64, 64, 64, -64, 64, 64, 64, -64, -64, 64, 64, -64, 64, -64, 64, -64, -64, -64, 64, 64, -64, 64, 64, -64, 64, 64, 64, -64, 64, 64, -64, 64, 64, 64, -64, 64, -64, 64, 64, 64, 64, 64, 64, 64, 64, -64, 64, -64, -64, 64, -64, 64, 64, 64, 64, -64, 64, -64, -64, -64, 64, 64, 64, 64, 64, 64, -64, 64, 64, -64, -64, -64, 64, 64, 64, 64, 64, -64, 64, 64, 64, -64, 64, 64, 64, -64, -64, 64, -64, -64, 64, 64, -64, 64, -64, -64, -64, 64, -64, 64, 64, 64, 64, -64, 64, 64, 64, 64, 64, -64, 64, 64, 64, 64, 64, -64, 64, 64, 64, 64, 64, 64, 64, 64, -64, 64, 64, 64, -64, 64, 64, 64, 64, 64, -64, -64, -64, -64, 64, -64, 64, 64, 64, 64, 64, 64, 64, 64, 64, 64, 64, -64, 64, -64, 64, -64, 64, 64, -64, 64, 64, -64, 64, -64, -64, 64, -64, -64, 64, 64, 64, -64, 64, -64, 64, 64, -64, 64, -64, -64, 64, -64, 64, 64, -64, 64, -64, 64, 64, 64, 64, 64, 64, 64, 64, -64, 64, 64, -64, 64, 64, 64, 64, 64, -64, -64, 64, 64, -64, -64, -64, -64, 64, 64, -64, -64, -64, 64, 64, -64, 64, 64, -64, -64, 64, 64, 64, -64, 64, 64, 64, 64, 64, 64, -64, -64, -64, -64, -64, -64, 64, -64, 64, -64, -64, 64, 64, -64, -64, 64, 64, -64, -64, 64, 64, -64, -64, -64, 64, 64, 64, 64, -64, -64, 64, -64, -64, 64, -64, -64, 64, -64, 64, 64, 64, 64, -64, -64, -64, 64, -64, 64, 64, -64, 64, -64, -64, 64, 64, -64, -64, -64, 64, -64, -64, 64, -64, -64, -64, 64, 64, -64, 64, 64, 64, 64, -64, 64, -64, 64, 64, -64, 64, -64, -64, -64, -64, -64, 64, 64, -64, -64, -64, 64, -64, 64, -64, -64, 64, -64, 64, -64, -64, 64, 64, 64, -64, 64, 64, -64, -64, -64, 64, 64, 64, -64, 64, 64, 64, -64, 64, 64, 64, 64, 64, 64, -64, 64, 64, -64, 64, -64, 64, 64, -64, 64, -64, -64, 64, 64, -64, -64, -64, -64, -64, -64, -64, 64, 64, 64, 64, -64, -64, -64, -64, 64, -64, -64, 64, 64, -64, 64, 64, -64, 64, 64, 64, 64, -64, -64, 64, -64, -64, 64, 64, 64, 64, -64, 64, 64, 64, -64, 64, -64, -64, -64, 64, 64, -64, 64, 64, 64, 64, 64, -64, 64, 64, 64, 64, 64, -64, 64, -64, -64, 64, -64, 64, -64, -64, 64, 64, 64, 64, -64, 64, 64, 64, 64, 64, 64, 64, -64, -64, 64, 64, 64, -64, -64, -64, -64, -64, 64, 64, 64, -64, -64, 64, -64, -64, 64, -64, -64, 64, -64, -64, 64, -64, -64, -64, -64, -64, 64, -64, 64, 64, 64, 64, -64, 64, -64, -64, 64, -64, -64, 64, -64, 64, -64, -64, -64, 64, -64, 64, -64, 64, 64, -64, 64, 64, 64, -64, 64, 64, -64, -64, 64, -64, -64, 64, 64, 64, -64, 64, -64, 64, -64, -64, 64, 64, 64, 64, -64, 64, 64, -64, 64, 64, -64, 64, 64, 64, -64, -64, -64, 64, 64, -64, 64, 64, 64, -64, -64, 64, 64, 64, 64, 64, 64, 64, 64, 64, 64, 64, 64, 64, -64, 64, -64, 64, -64, -64, 64, -64, -64, -64, 64, -64, -64, -64, 64, -64, 64, 64, 64, 64, -64, 64, 64, 64, -64, -64, 64, 64, -64, -64, 64, 64, 64, -64, -64, 64, -64, 64, 64, 64, -64, -64, 64, 64, -64, 64, 64, 64, 64, -64, 64, -64, -64, -64, -64, 64, -64, 64, -64, 64, 64, 64, -64, 64, 64, 64, -64, 64, -64, 64, 64, 64, 64, 64, 64, 64, 64, 64, -64, -64, 64, 64, -64, -64, -64, -64, -64, -64, 64, 64, 64, -64, -64, 64, 64, -64, -64, -64, -64, 64, 64, 64, 64, -64, -64, 64, -64, 64, 64, 64, 64, -64, 64, -64, -64, -64, -64, 64, 64, -64, -64, -64, 64, 64, -64, 64, 64, 64, 64, 64, 64, 64, -64, -64, -64, 64, 64, -64, 64, -64, -64, -64, -64, 64, 64, 64, 64, -64, -64, -64, 64, -64, -64, 64, 64, 64, 64, 64, 64, -64, -64, -64, -64, -64, -64, -64, -64, -64, -64, -64, 64, 64, 64, 64, 64, -64, -64, 64, 64, -64, -64, 64, 64, 64, 64, -64, -64, -64, 64, -64, -64, -64, -64, -64, 64, -64, 64, 64, 64, 64, 64, 64, 64, 64, 64, 64, 64, -64, -64, -64, -64, 64, 64, 64, 64, 64, 64, -64, 64, 64, 64, 64, 64, 64, 64, 64, 64, 64, 64, 64, 64, 64, -64, -64, -64, -64, -64, -64, 64, 64, 64, 64, 64, -64, 64, 64, 64, 64, -64, 64, 64, 64, 64, 64, 64, 64, 64, 64, 64, -64, -64, -64, -64, -64, -64, 64, 64, 64, 64, 64, -64, 64, 64, 64, 64, 64, 64, 64, 64, -64, -64, 64, 64, 64, 64, 64, -64, 64, 64, 64, -64, 64, -64, -64, -64, 64, 64, 64, 64, 64, 64, 64, 64, 64, 64, 64, -64, -64, -64, 64, 64, 64, 64, 64, -64, -64, 64, -64, 64, -64, -64, 64, 64, 64, 64, 64, 64, 64, 64, 64, 64, 64, 64, -64, -64, -64, -64, 64, -64, 64, 64, 64, -64, 64, 64, 64, 64, -64, -64, -64, 64, 64, 64, 64, -64, 64, 64, 64, 64, 64, 64, -64, 64, -64, 64, 64, 64, 64, 64, 64, 64, -64, 64, 64, 64, 64, -64, 64, 64, 64, 64, -64, 64, 64, 64, 64, 64, 64, 64, -64, -64, -64, -64, -64, 64, 64, 64, 64, 64, 64, 64, 64, 64, 64, 64, -64, -64, 64, 64, -64, 64, 64, 64, 64, 64, 64, 64, 64, -64, 64, 64, -64, -64, 64, 64, -64, 64, 64, -64, 64, 64, 64, 64, 64, -64, 64, -64, 64, 64, 64, 64, 64, 64, 64, -64, 64, 64, 64, 64, -64, 64, 64, -64, -64, -64, -64, 64, 64, 64, 64, 64, -64, 64, -64, -64, 64, 64, 64, 64, 64, 64, 64, -64, -64, 64, 64, 64, 64, -64, 64, 64, 64, 64, 64, -64, -64, 64, -64, -64, 64, 64, 64, 64, 64, 64, 64, 64, 64, 64, 64, 64, 64, 64, 64, 64, 64, 64, 64, -64, -64, 64, 64, -64, -64, -64, 64, -64, -64, 64, 64, -64, 64, 64, 64, 64, 64, 64, 64, -64, 64, 64, 64, 64, 64, -64, 64, -64, -64, 64, 64, 64, 64, -64, -64, -64, -64, -64, -64, 64, -64, 64, -64, -64, -64, -64, 64, 64, 64, 64, -64, 64, 64, -64, -64, -64, 64, 64, 64, -64, 64, 64, 64, 64, 64, 64, 64, -64, 64, -64, -64, 64, 64, 64, -64, -64, -64, 64, 64, -64, -64, -64, -64, -64, -64, -64, 64, -64, -64, 64, -64, -64, 64, -64, 64, -64, -64, -64, 64, 64, 64, -64, -64, 64, 64, 64, -64, -64, -64, -64, 64, 64, -64, 64, 64, -64, 64, -64, -64, 64, -64, -64, -64, 64, 64, 64, -64, -64, -64, -64, -64, -64, -64, 64, -64, -64, -64, 64, -64, -64, 64, 64, 64, -64, 64, 64, 64, -64, 64, -64, -64, -64, -64, 64, -64, -64, -64, -64, -64, -64, -64, -64, -64, -64, -64, -64, -64, -64, 64, 64, -64, 64, 64, -64, -64, 64, -64, 64, -64, 64, -64, 64, -64, -64, -64, -64, -64, 64, -64, 64, 64, -64, -64, -64, 64, -64, 64, -64, 64, 64, 64, -64, -64, -64, -64, 64, -64, -64, 64, 64, 64, 64, -64, -64, -64, 64, -64, 64, -64, -64, -64, 64, -64, 64, 64, 64, -64, -64, 64, 64, -64, 64, 64, 64, 64, -64, -64, 64, 64, 64, 64, 64, 64, -64, -64, 64, 64, 64, -64, -64, 64, 64, 64, 64, -64, 64, 64, 64, 64, 64, 64, -64, -64, 64, -64, 64, 64, -64, 64, 64, -64, -64, -64, 64, -64, 64, -64, 64, 64, 64, 64, -64, 64, 64, 64, 64, -64, -64, 64, 64, -64, 64, 64, 64, 64, 64, 64, 64, 64, 64, 64, 64, 64, -64, -64, -64, -64, -64, -64, 64, 64, -64, -64, -64, -64, -64, -64, -64, -64, 64, 64, 64, 64, 64, 64, 64, 64, 64, 64, 64, 64, -64, -64, -64, -64, -64, -64, -64, 64, -64, -64, -64, 64, -64, -64, -64, -64, -64, 64, 64, 64, 64, 64, 64, 64, -64, -64, 64, -64, -64, 64, -64, -64, -64, -64, 64, -64, 64, 64, 64, -64, -64, 64, 64, -64, 64, 64, 64, 64, 64, 64, 64, 64, 64, -64, 64, 64, 64, 64, 64, -64, -64, -64, -64, -64, 64, 64, 64, 64, 64, 64, 64, 64, 64, 64, 64, 64, 64, -64, 64, 64, -64, 64, 64, -64, 64, 64, 64, -64, -64, -64, -64, -64, 64, -64, 64, -64, 64, -64, 64, 64, 64, 64, 64, -64, -64, 64, 64, -64, -64, -64, -64, -64, -64, -64, 64, 64, -64, -64, -64, -64, 64, 64, 64, 64, 64, -64, -64, 64, 64, 64, -64, -64, 64, -64, -64, -64, -64, -64, -64, -64, 64, -64, -64, -64, -64, -64, -64, -64, 64, -64, 64, 64, 64, -64, 64, 64, 64, 64, -64, -64, -64, -64, -64, -64, -64, -64, -64, 64, 64, 64, 64, -64, -64, -64, -64, -64, 64, 64, 64, -64, 64, 64, 64, 64, 64, 64, -64, -64, -64, -64, -64, -64, -64, -64, 64, 64, 64, 64, -64, -64, -64, -64, -64, -64, 64, 64, -64, 64, -64, -64, 64, 64, 64, 64, -64, -64, -64, -64, -64, -64, 64, 64, 64, 64, -64, -64, -64, -64, -64, -64, -64, -64, 64, 64, -64, 64, -64, 64, -64, 64, 64, -64, -64, -64, -64, 64, 64, 64, 64, 64, 64, 64, 64, -64, -64, -64, -64, -64, 64, -64, 64, 64, 64, 64, 64, -64, -64, -64, -64, -64, -64, -64, -64, -64, 64, 64, 64, 64, 64, 64, 64, -64, -64, -64, -64, 64, 64, 64, -64, -64, 64, 64, -64, -64, -64, 64, -64, -64, -64, 64, -64, -64, 64, 64, 64, 64, 64, 64, -64, -64, 64, -64, -64, -64, -64, -64, 64, 64, 64, 64, -64, -64, -64, -64, -64, -64, -64, 64, 64, 64, 64, 64, 64, -64, 64, 64, 64, 64, 64, -64, -64, 64, -64, 64, 64, 64, 64, 64, -64, -64, -64, -64, -64, 64, 64, 64, -64, -64, -64, 64, -64, -64, 64, 64, 64, 64, -64, -64, 64, -64, -64, 64, -64, -64, -64, 64, -64, -64, -64, -64, -64, 64, 64, -64, -64, 64, -64, -64, 64, -64, 64, 64, 64, 64, 64, 64, 64, 64, 64, 64, 64, 64, 64, 64, 64, -64, -64, -64, -64, 64, 64, -64, 64, 64, -64, 64, 64, 64, 64, 64, 64, 64, 64, 64, 64, 64, 64, 64, 64, -64, 64, 64, 64, -64, -64, -64, -64, -64, -64, -64, -64, -64, -64, 64, 64, 64, 64, 64, 64, 64, -64, -64, 64, 64, -64, 64, -64, 64, 64, 64, 64, 64, -64, -64, -64, -64, 64, -64, 64, -64, 64, 64, 64, 64, 64, 64, 64, 64, 64, 64, 64, 64, -64, -64, -64, -64, 64, 64, 64, 64, 64, 64, -64, 64, 64, -64, 64, -64, -64, 64, 64, 64, 64, 64, 64, 64, 64, -64, 64, -64, -64, -64, -64, 64, 64, 64, 64, 64, -64, -64, -64, 64, -64, -64, -64, 64, -64, 64, 64, 64, 64, 64, 64, 64, -64, -64, -64, 64, 64, -64, -64, 64, -64, 64, 64, 64, 64, 64, -64, 64, 64, 64, -64, -64, 64, -64, -64, 64, 64, 64, 64, 64, 64, -64, 64, 64, -64, 64, 64, -64, 64, -64, -64, -64, 64, 64, 64, 64, 64, -64, 64, 64, -64, 64, -64, -64, -64, 64, -64, -64, -64, -64, -64, -64, -64, 64, -64, -64, -64, 64, -64, -64, 64, -64, 64, -64, -64, 64, -64, 64, 64, -64, -64, -64, -64, 64, -64, 64, -64, -64, 64, 64, -64, 64, -64, 64, 64, 64, -64, 64, -64, -64, -64, -64, -64, -64, 64, -64, 64, -64, 64, 64, 64, -64, -64, 64, 64, 64, -64, -64, -64, 64, -64, -64, 64, -64, 64, -64, 64, -64, 64, -64, 64, -64, 64, 64, -64, -64, 64, 64, -64, 64, -64, 64, 64, 64, -64, -64, 64, -64, -64, 64, 64, 64, -64, -64, -64, 64, 64, 64, 64, -64, 64, -64, -64, -64, -64, -64, -64, -64, -64, 64, -64, 64, -64, 64, 64, -64, -64, 64, -64, 64, 64, -64, -64, -64, -64, 64, 64, -64, 64, 64, -64, -64, -64, -64, -64, 64, 64, 64, -64, 64, -64, -64, -64, 64, 64, -64, 64, 64, 64, -64, -64, 64, -64, -64, -64, 64, 64, 64, 64, -64, 64, 64, 64, 64, 64, 64, 64, 64, -64, -64, -64, -64, 64, -64, -64, 64, 64, 64, -64, -64, -64, 64, -64, -64, -64, 64, -64, 64, 64, -64, 64, 64, 64, 64, 64, 64, 64, -64, 64, -64, 64, 64, 64, 64, -64, -64, -64, -64, -64, 64, -64, 64, -64, -64, 64, -64, -64, 64, 64, 64, 64, -64, 64, 64, -64, 64, -64, -64, 64, 64, -64, 64, 64, -64, -64, -64, -64, -64, 64, -64, -64, -64, -64, -64, -64, -64, -64, -64, 64, 64, 64, 64, 64, -64, 64, 64, 64, 64, 64, -64, -64, -64, -64, -64, 64, -64, -64, -64, -64, -64, -64, -64, -64, -64, -64, -64, -64, 64, -64, 64, 64, 64, -64, -64, -64, 64, -64, -64, -64, -64, -64, -64, 64, -64, -64, -64, -64, -64, -64, -64, -64, -64, -64, -64, 64, -64, 64, 64, 64, -64, -64, -64, -64, 64, -64, -64, -64, -64, -64, -64, -64, -64, 64, -64, -64, -64, -64, -64, -64, -64, -64, -64, -64, -64, -64, -64, -64, -64, -64, -64, -64, -64, -64, 64, -64, -64, 64, -64, -64, -64, 64, -64, -64, -64, -64, -64, -64, -64, -64, -64, -64, -64, -64, -64, -64, -64, -64, 64, -64, -64, -64, 64, 64, -64, -64, 64, 64, -64, 64, -64, -64, -64, -64, -64, -64, -64, -64, -64, -64, -64, 64, 64, -64, -64, -64, 64, -64, -64, -64, -64, -64, -64, -64, 64, 64, -64, -64, -64, -64, -64, -64, -64, 64, -64, -64, -64, -64, -64, -64, -64, 64, -64, -64, 64, 64, -64, 64, -64, -64, -64, -64, 64, 64, -64, -64, 64, -64, -64, -64, 64, 64, -64, -64, 64, -64, 64, -64, 64, 64, -64, 64, -64, -64, 64, -64, -64, -64, -64, 64, 64, 64, 64, -64, -64, -64, -64, 64, -64, 64, -64, -64, 64, -64, 64, 64, -64, 64, 64, -64, 64, 64, 64, -64, -64, -64, -64, 64, 64, -64, 64, -64, -64, -64, -64, -64, -64, -64, 64, -64, 64, 64, 64, 64, 64, -64, 64, 64, 64, -64, 64, -64, 64, -64, 64, 64, 64, -64, -64, -64, 64, -64, -64, -64, -64, -64, -64, 64, -64, -64, -64, -64, 64, -64, 64, -64, -64, 64, -64, 64, -64, -64, 64, 64, -64, -64, -64, -64, 64, -64, -64, 64, 64, -64, -64, -64, -64, 64, 64, -64, -64, -64, 64, -64, 64, -64, 64, -64, -64, -64, 64, -64, 64, 64, 64, 64, 64, 64, -64, 64, 64, 64, -64, -64, 64, -64, 64, -64, -64, -64, 64, 64, 64, -64, 64, 64, 64, 64, -64, -64, -64, 64, -64, -64, 64, -64, -64, -64, -64, 64, 64, -64, -64, 64, -64, 64, -64, -64, -64, 64, 64, -64, -64, -64, -64, -64, -64, -64, -64, -64, -64, -64, -64, 64, 64, -64, -64, 64, -64, -64, -64, -64, -64, 64, 64, -64, -64, -64, -64, -64, -64, 64, 64, 64, -64, -64, -64, -64, -64, -64, 64, 64, -64, -64, -64, 64, -64, -64, -64, -64, -64, 64, 64, -64, -64, 64, -64, 64, 64, 64, -64, -64, -64, -64, -64, -64, -64, 64, 64, -64, 64, -64, 64, 64, -64, -64, -64, -64, -64, 64, 64, 64, 64, -64, -64, 64, -64, 64, -64, 64, -64, -64, -64, -64, -64, -64, 64, -64, -64, -64, -64, -64, -64, -64, -64, 64, 64, 64, 64, -64, 64, -64, -64, 64, -64, 64, 64, -64, -64, -64, 64, 64, -64, -64, 64, -64, -64, -64, -64, -64, -64, -64, -64, -64, -64, -64, 64, -64, 64, 64, -64, 64, -64, 64, -64, -64, -64, -64, -64, -64, -64, 64, -64, -64, -64, -64, -64, -64, -64, -64, -64, -64, -64, -64, 64, 64, 64, -64, -64, -64, -64, -64, -64, 64, 64, -64, 64, 64, 64, 64, 64, -64, -64, -64, -64, -64, -64, 64, 64, -64, 64, 64, 64, 64, 64, -64, -64, -64, 64, -64, 64, 64, -64, -64, 64, 64, 64, -64, -64, 64, -64, 64, -64, -64, -64, -64, 64, -64, 64, -64, 64, -64, 64, -64, 64, -64, -64, 64, 64, -64, 64, 64, -64, 64, 64, 64, 64, 64, 64, 64, -64, 64, 64, 64, -64, 64, -64, -64, -64, -64, 64, -64, -64, 64, 64, 64, 64, -64, -64, 64, 64, -64, -64, -64, -64, 64, 64, 64, -64, 64, -64, 64, -64, 64, 64, 64, 64, -64, -64, 64, 64, -64, -64, 64, -64, 64, -64, -64, 64, -64, 64, 64, 64, 64, -64, 64, 64, 64, 64, 64, 64, 64, 64, 64, -64, 64, -64, -64, 64, -64, 64, 64, 64, 64, -64, -64, -64, -64, -64, -64, -64, -64, -64, -64, -64, 64, -64, -64, 64, -64, 64, 64, 64, 64, 64, 64, 64, -64, 64, 64, -64, -64, -64, -64, -64, -64, -64, -64, -64, -64, -64, -64, -64, -64, 64, 64, 64, 64, 64, 64, 64, 64, -64, 64, -64, -64, 64, -64, -64, -64, -64, 64, -64, -64, -64, -64, -64, -64, -64, -64, -64, -64, -64, 64, 64, 64, 64, 64, 64, 64, -64, -64, -64, -64, 64, -64, 64, -64, -64, -64, -64, -64, -64, -64, -64, -64, -64, -64, 64, -64, -64, -64, 64, 64, 64, 64, 64, 64, -64, -64, -64, -64, -64, -64, 64, -64, -64, -64, -64, -64, -64, -64, -64, -64, -64, 64, 64, -64, -64, -64, 64, -64, 64, 64, 64, 64, -64, 64, 64, 64, -64, 64, -64, -64, -64, -64, -64, -64, -64, -64, 64, 64, 64, 64, 64, -64, 64, -64, -64, -64, -64, 64, 64, 64, -64, -64, 64, 64, -64, 64, 64, -64, -64, -64, -64, -64, -64, -64, 64, 64, 64, 64, 64, -64, -64, -64, -64, -64, -64, -64, -64, -64, -64, 64, 64, 64, -64, -64, -64, -64, -64, -64, -64, -64, -64, -64, 64, 64, 64, 64, 64, 64, -64, -64, -64, -64, -64, 64, -64, -64, -64, 64, 64, 64, 64, 64, -64, -64, -64, -64, -64, -64, -64, 64, 64, 64, 64, 64, 64, 64, 64, -64, -64, -64, -64, -64, -64, -64, -64, -64, -64, 64, 64, -64, -64, -64, -64, -64, -64, -64, 64, 64, 64, 64, -64, -64, 64, -64, 64, 64, -64, -64, -64, -64, -64, -64, -64, -64, -64, 64, 64, -64, -64, -64, -64, 64, -64, -64, 64, 64, 64, -64, 64, 64, -64, 64, 64, 64, 64, -64, 64, -64, -64, -64, -64, -64, -64, 64, 64, -64, -64, 64, -64, -64, -64, -64, 64, 64, 64, 64, -64, 64, -64, 64, 64, -64, 64, 64, -64, -64, -64, -64, -64, -64, -64, -64, 64, 64, -64, -64, -64, -64, -64, 64, 64, 64, 64, 64, 64, 64, 64, 64, 64, 64, 64, 64, -64, -64, -64, -64, -64, -64, -64, -64, 64, -64, -64, -64, -64, -64, -64, 64, 64, 64, 64, 64, -64, 64, -64, 64, 64, -64, -64, -64, -64, -64, -64, -64, -64, -64, -64, -64, 64, -64, -64, -64, -64, -64, -64, 64, -64, 64, 64, -64, -64, 64, 64, -64, 64, 64, -64, -64, -64, -64, -64, -64, 64, -64, -64, -64, -64, -64, -64, 64, -64, -64, 64, -64, 64, -64, -64, -64, 64, 64, -64, -64, -64, -64, -64, 64, -64, -64, -64, -64, -64, -64, 64, 64, 64, -64, -64, -64, -64, -64, -64, -64, -64, -64, 64, 64, 64, 64, 64, -64, -64, -64, -64, -64, -64, -64, -64, -64, 64, -64, 64, 64, 64, 64, -64, -64, 64, -64, -64, 64, 64, 64, 64, 64, 64, 64, 64, -64, 64, -64, -64, -64, -64, -64, -64, -64, 64, -64, -64, 64, 64, -64, -64, -64, 64, 64, 64, 64, 64, 64, 64, 64, 64, -64, 64, -64, -64, -64, 64, -64, -64, -64, -64, -64, 64, -64, 64, -64, -64, 64, -64, 64, 64, -64, 64, 64, 64, 64, -64, 64, -64, 64, -64, -64, -64, -64, 64, -64, 64, -64, -64, -64, 64, 64, -64, 64, -64, 64, -64, 64, 64, -64, 64, 64, -64, 64, -64, -64, -64, -64, 64, 64, 64, -64, 64, -64, -64, 64, -64, -64, 64, -64, -64, -64, 64, -64, -64, -64, 64, -64, 64, 64, 64, -64, -64, -64, -64, -64, -64, -64, -64, -64, 64, 64, -64, -64, -64, -64, 64, 64, 64, 64, 64, 64, -64, 64, 64, 64, 64, 64, 64, -64, -64, -64, -64, -64, -64, 64, -64, -64, 64, -64, 64, -64, -64, 64, 64, 64, 64, -64, -64, -64, 64, -64, -64, 64, 64, -64, 64, -64, -64, 64, 64, 64, 64, 64, 64, 64, -64, -64, -64, 64, 64, 64, 64, 64, 64, -64, 64, -64, -64, -64, 64, 64, 64, 64, 64, 64, -64, -64, 64, -64, -64, 64, -64, -64, -64, -64, -64, 64, 64, 64, 64, 64, -64, -64, 64, -64, 64, 64, -64, -64, -64, 64, -64, -64, 64, 64, 64, -64, -64, 64, 64, 64, 64, -64, -64, -64, -64, -64, 64, 64, -64, -64, 64, 64, -64, 64, 64, -64, -64, 64, 64, 64, -64, 64, 64, -64, -64, -64, 64, 64, 64, -64, 64, -64, -64, 64, 64, -64, 64, -64, -64, -64, 64, -64, -64, 64, -64, -64, -64, -64, -64, -64, -64, -64, 64, -64, 64, -64, 64, 64, 64, -64, 64, 64, -64, -64, 64, -64, -64, -64, -64, -64, -64, 64, -64, 64, -64, -64, -64, -64, -64, -64, -64, 64, -64, -64, -64, 64, 64, 64, 64, 64, 64, 64, -64, -64, -64, -64, 64, -64, 64, 64, -64, -64, -64, -64, -64, -64, -64, -64, -64, -64, -64, -64, 64, -64, -64, 64, 64, -64, -64, -64, -64, -64, 64, -64, 64, 64, 64, 64, 64, -64, -64, -64, -64, -64, -64, -64, -64, -64, -64, 64, 64, -64, 64, 64, 64, -64, 64, 64, -64, -64, -64, -64, 64, -64, 64, 64, 64, 64, -64, -64, -64, -64, -64, -64, -64, -64, 64, 64, 64, 64, 64, 64, 64, 64, -64, 64, 64, 64, 64, 64, 64, 64, 64, 64, 64, 64, 64, -64, -64, -64, -64, -64, -64, 64, -64, 64, -64, -64, 64, 64, 64, -64, -64, 64, -64, 64, 64, 64, 64, 64, 64, 64, -64, 64, 64, -64, -64, -64, -64, -64, -64, 64, 64, -64, 64, -64, -64, 64, 64, 64, 64, -64, -64, -64, -64, -64, 64, 64, 64, 64, 64, 64, 64, -64, -64, -64, -64, -64, 64, -64, -64, -64, -64, -64, 64, 64, 64, 64, -64, -64, -64, 64, -64, 64, 64, 64, 64, 64, -64, 64, 64, -64, -64, 64, 64, 64, -64, -64, -64, -64, -64, 64, 64, 64, -64, 64, -64, 64, 64, 64, 64, 64, 64, 64, 64, 64, 64, 64, -64, 64, 64, -64, 64, -64, -64, -64, -64, -64, -64, 64, 64, 64, -64, 64, -64, -64, -64, 64, 64, 64, 64, 64, -64, 64, -64, 64, -64, -64, -64, -64, 64, -64, -64, -64, -64, 64, -64, 64, 64, 64, -64, -64, -64, -64, -64, 64, 64, 64, 64, -64, 64, 64, 64, 64, -64, -64, -64, 64, -64, -64, -64, -64, -64, -64, 64, -64, -64, 64, 64, -64, -64, 64, -64, -64, -64, 64, 64, 64, 64, 64, 64, 64, 64, -64, -64, -64, -64, -64, -64, -64, -64, -64, -64, 64, 64, 64, 64, 64, 64, -64, -64, 64, -64, 64, 64, 64, 64, 64, 64, -64, -64, -64, -64, -64, -64, -64, -64, -64, -64, 64, -64, -64, -64, 64, -64, -64, -64, -64, -64, -64, 64, -64, 64, 64, -64, 64, 64, -64, -64, -64, -64, -64, -64, -64, -64, -64, -64, -64, -64, -64, 64, -64, 64, -64, -64, 64, 64, 64, 64, -64, 64, 64, 64, 64, -64, -64, -64, -64, -64, -64, -64, -64, -64, -64, 64, 64, -64, 64, 64, 64, 64, -64, -64, 64, -64, 64, -64, 64, -64, -64, 64, 64, 64, 64, -64, -64, -64, -64, -64, -64, -64, -64, -64, -64, -64, -64, 64, 64, -64, -64, -64, -64, 64, -64, 64, -64, -64, 64, -64, 64, 64, -64, -64, -64, -64, -64, -64, 64, -64, -64, -64, -64, -64, 64, 64, 64, -64, -64, -64, -64, -64, -64, -64, 64, -64, -64, 64, 64, -64, 64, 64, -64, -64, -64, 64, -64, 64, -64, 64, -64, 64, -64, -64, 64, 64, 64, 64, -64, -64, -64, 64, -64, 64, -64, 64, 64, 64, 64, 64, 64, -64, -64, -64, -64, -64, -64, -64, 64, -64, -64, 64, 64, -64, 64, -64, -64, 64, 64, 64, -64, -64, -64, 64, -64, 64, 64, 64, -64, -64, -64, -64, -64, -64, -64, -64, -64, -64, 64, 64, 64, 64, 64, -64, 64, 64, -64, -64, -64, 64, 64, 64, -64, 64, 64, 64, -64, 64, -64, 64, 64, -64, -64, 64, 64, -64, 64, 64, 64, 64, 64, -64, 64, -64, 64, 64, -64, -64, 64, -64, -64, -64, -64, -64, -64, 64, -64, 64, -64, -64, -64, -64, 64, 64, 64, 64, 64, -64, -64, 64, -64, -64, 64, -64, -64, 64, -64, 64, -64, -64, -64, -64, -64, -64, -64, -64, -64, -64, -64, 64, 64, 64, -64, -64, -64, -64, -64, 64, -64, 64, 64, -64, -64, 64, -64, 64, 64, 64, 64, -64, 64, 64, 64, 64, -64, -64, -64, -64, -64, -64, -64, -64, -64, -64, -64, -64, -64, 64, 64, -64, -64, 64, 64, -64, -64, -64, 64, -64, 64, 64, 64, 64, 64, 64, 64, -64, -64, 64, 64, 64, -64, -64, 64, 64, -64, -64, 64, 64, 64, -64, 64, -64, -64, 64, -64, 64, -64, -64, 64, 64, 64, 64, -64, 64, -64, 64, -64, 64, 64, 64, -64, -64, -64, -64, 64, 64, -64, 64, -64, 64, -64, -64, -64, -64, 64, 64, -64, -64, -64, -64, 64, -64, 64, -64, 64, 64, -64, -64, -64, -64, 64, 64, -64, -64, -64, -64, 64, 64, -64, 64, -64, -64, -64, -64, -64, -64, -64, -64, -64, -64, -64, 64, -64, -64, 64, -64, -64, -64, 64, 64, 64, -64, 64, -64, 64, -64, 64, 64, -64, -64, 64, 64, -64, -64, -64, -64, 64, 64, -64, 64, 64, 64, -64, 64, 64, 64, -64, -64, -64, -64, -64, 64, -64, -64, -64, -64, -64, -64, -64, -64, -64, -64, -64, 64, 64, -64, -64, -64, 64, 64, 64, 64, 64, 64, 64, 64, 64, -64, -64, -64, -64, 64, -64, -64, -64, 64, -64, -64, -64, -64, -64, -64, 64, -64, -64, -64, -64, -64, -64, 64, -64, -64, 64, 64, -64, -64, 64, -64, 64, 64, -64, -64, -64, 64, 64, -64, -64, -64, -64, -64, 64, 64, -64, -64, -64, 64, 64, 64, -64, -64, -64, -64, 64, -64, 64, 64, 64, 64, 64, 64, -64, -64, -64, 64, -64, -64, -64, -64, 64, 64, 64, 64, -64, -64, 64, -64, -64, -64, 64, 64, -64, 64, 64, 64, -64, 64, 64, 64, 64, 64, 64, 64, -64, -64, -64, 64, 64, 64, 64, 64, 64, -64, -64, -64, -64, -64, -64, 64, -64, 64, 64, 64, -64, -64, -64, -64, -64, -64, -64, -64, -64, -64, -64, 64, 64, 64, 64, 64, 64, -64, 64, 64, 64, -64, -64, -64, 64, 64, 64, -64, -64, -64, -64, -64, -64, -64, 64, -64, -64, -64, 64, 64, 64, 64, 64, 64, 64, 64, 64, 64, -64, 64, 64, 64, 64, -64, 64, 64, -64, -64, -64, -64, -64, -64, -64, -64, -64, -64, -64, 64, 64, 64, 64, 64, 64, 64, 64, 64, 64, -64, -64, 64, 64, 64, -64, 64, -64, -64, -64, 64, -64, 64, -64, 64, 64, -64, -64, 64, 64, 64, 64, 64, 64, 64, 64, 64, 64, 64, 64, 64, -64, -64, 64, 64, 64, -64, -64, 64, 64, 64, 64, 64, -64, -64, -64, -64, -64, 64, 64, 64, 64, 64, 64, 64, 64, 64, 64, -64, 64, 64, 64, 64, 64, 64, 64, 64, 64, 64, 64, 64, 64, 64, -64, -64, 64, 64, 64, 64, 64, 64, 64, 64, 64, 64, -64, -64, -64, -64, 64, 64, 64, 64, 64, 64, 64, 64, 64, -64, -64, -64, -64, -64, -64, 64, 64, 64, 64, 64, 64, 64, 64, 64, -64, 64, 64, 64, -64, 64, 64, 64, 64, 64, 64, 64, 64, -64, -64, -64, -64, -64, -64, 64, 64, 64, 64, 64, 64, -64, -64, -64, -64, -64, 64, -64, 64, -64, 64, 64, 64, 64, 64, 64, -64, -64, -64, -64, -64, -64, -64, 64, 64, 64, -64, -64, -64, -64, -64, -64, -64, -64, 64, 64, -64, -64, 64, 64, 64, 64, 64, 64, 64, -64, 64, 64, 64, -64, -64, -64, 64, 64, 64, -64, -64, -64, -64, 64, 64, -64, -64, -64, -64, -64, -64, 64, 64, 64, 64, -64, 64, 64, 64, 64, -64, -64, -64, -64, -64, -64, -64, -64, -64, -64, -64, 64, -64, -64, 64, -64, -64, -64, -64, 64, 64, 64, 64, -64, -64, 64, -64, -64, 64, -64, -64, -64, -64, -64, -64, -64, -64, -64, -64, -64, -64, -64, 64, 64, 64, 64, 64, -64, -64, 64, -64, -64, -64, -64, 64, -64, -64, -64, -64, -64, -64, -64, -64, -64, -64, -64, 64, -64, -64, -64, -64, 64, -64, 64, 64, -64, -64, -64, -64, -64, 64, -64, -64, 64, 64, -64, -64, -64, -64, -64, -64, -64, -64, -64, 64, -64, -64, -64, 64, 64, -64, -64, 64, -64, -64, -64, -64, -64, 64, -64, -64, -64, -64, -64, -64, -64, -64, -64, -64, -64, -64, -64, 64, 64, -64, 64, 64, 64, -64, -64, 64, 64, -64, -64, 64, -64, -64, 64, 64, -64, -64, -64, -64, -64, -64, -64, -64, 64, 64, -64, 64, -64, -64, 64, -64, 64, -64, -64, 64, 64, 64, 64, 64, -64, -64, -64, 64, -64, -64, -64, -64, -64, -64, -64, -64, -64, -64, -64, 64, -64, 64, -64, 64, 64, 64, -64, 64, -64, 64, 64, 64, -64, -64, -64, 64, 64, 64, -64, 64, -64, -64, -64, -64, 64, -64, -64, 64, 64, 64, -64, -64, -64, 64, -64, 64, 64, -64, 64, 64, 64, -64, -64, -64, -64, 64, 64, -64, 64, 64, 64, -64, 64, 64, -64, 64, 64, 64, 64, -64, -64, -64, -64, -64, 64, 64, -64, -64, 64, -64, -64, -64, -64, -64, 64, -64, 64, 64, -64, -64, -64, -64, 64, 64, -64, -64, 64, -64, -64, -64, -64, -64, 64, 64, 64, 64, -64, -64, -64, 64, 64, 64, 64, -64, 64, 64, -64, 64, -64, 64, -64, -64, 64, 64, -64, 64, -64, -64, -64, 64, 64, -64, -64, -64, 64, -64, 64, 64, -64, -64, -64, -64, 64, 64, 64, -64, -64, 64, 64, -64, -64, 64, -64, -64, 64, 64, -64, 64, -64, 64, 64, 64, -64, -64, 64, 64, 64, -64, -64, 64, -64, -64, -64, -64, -64, -64, -64, 64, -64, 64, 64, 64, 64, -64, 64, 64, 64, 64, -64, -64, -64, -64, -64, -64, -64, -64, 64, -64, 64, 64, -64, -64, -64, -64, -64, -64, -64, -64, 64, 64, 64, 64, -64, 64, -64, -64, 64, 64, -64, -64, -64, 64, 64, 64, 64, 64, 64, -64, -64, 64, 64, 64, -64, -64, 64, -64, -64, -64, 64, -64, 64, -64, -64, -64, -64, -64, -64, -64, 64, 64, 64, -64, 64, 64, 64, -64, -64, 64, 64, 64, -64, -64, -64, 64, 64, 64, -64, 64, 64, 64, 64, 64, -64, -64, -64, 64, -64, 64, -64, 64, -64, -64, -64, 64, 64, 64, 64, 64, -64, -64, 64, 64, -64, 64, -64, -64, -64, 64, -64, 64, 64, 64, 64, -64, -64, 64, 64, 64, 64, 64, 64, 64, -64, 64, 64, 64, 64, 64, 64, 64, -64, 64, -64, -64, 64, -64, 64, -64, 64, 64, -64, 64, -64, -64, 64, 64, 64, 64, 64, 64, -64, -64, 64, 64, -64, -64, -64, -64, 64, 64, 64, -64, -64, 64, 64, 64, 64, 64, 64, 64, 64, -64, 64, -64, -64, 64, 64, -64, 64, 64, -64, 64, 64, -64, 64, -64, 64, -64, -64, -64, -64, 64, -64, 64, -64, -64, 64, -64, -64, 64, -64, 64, 64, 64, 64, 64, 64, 64, -64, -64, 64, -64, -64, -64, -64, -64, -64, 64, -64, 64, -64, 64, 64, -64, -64, -64, 64, 64, 64, 64, 64, -64, -64, 64, 64, 64, 64, 64, 64, -64, 64, 64, -64, -64, 64, -64, 64, 64, 64, -64, 64, 64, 64, 64, -64, 64, 64, -64, 64, -64, -64, -64, 64, 64, 64, -64, 64, -64, -64, -64, -64, 64, 64, -64, 64, -64, 64, -64, 64, 64, -64, 64, 64, 64, -64, 64, 64, 64, 64, 64, -64, 64, 64, -64, 64, -64, -64, -64, 64, -64, -64, -64, -64, 64, 64, -64, 64, -64, -64, 64, 64, 64, -64, 64, 64, 64, 64, -64, 64, 64, -64, -64, -64, -64, -64, 64, 64, -64, 64, -64, -64, 64, 64, 64, -64, -64, -64, 64, -64, 64, -64, -64, -64, 64, 64, 64, 64, 64, -64, 64, 64, 64, -64, -64, 64, -64, -64, -64, -64, -64, 64, -64, 64, 64, -64, 64, -64, 64, 64, -64, -64, -64, 64, -64, -64, 64, 64, 64, 64, 64, -64, 64, 64, -64, 64, 64, -64, -64, -64, -64, -64, 64, -64, -64, 64, 64, 64, 64, 64, 64, 64, -64, 64, -64, 64, 64, 64, -64, 64, 64, 64, -64, 64, 64, -64, 64, 64, 64, -64, -64, -64, -64, 64, 64, -64, 64, 64, 64, 64, -64, 64, 64, -64, 64, -64, 64, 64, 64, -64, 64, 64, -64, 64, 64, 64, -64, 64, 64, 64, 64, 64, 64, 64, -64, 64, -64, -64, -64, -64, 64, 64, 64, -64, 64, -64, -64, -64, 64, -64, -64, -64, -64, -64, 64, 64, -64, -64, 64, -64, 64, 64, 64, 64, -64, 64, 64, -64, 64, 64, 64, 64, -64, 64, -64, 64, -64, -64, 64, -64, -64, -64, -64, 64, 64, 64, -64, 64, -64, 64, 64, 64, 64, 64, -64, -64, -64, -64, 64, 64, -64, 64, -64, -64, 64, 64, -64, 64, 64, 64, 64, -64, -64, -64, 64, 64, 64, 64, -64, 64, -64, 64, 64, 64, -64, -64, 64, -64, -64, -64, 64, 64, -64, 64, 64, -64, -64, -64, -64, -64, -64, 64, 64, 64, -64, 64, 64, -64, 64, 64, 64, 64, -64, -64, 64, -64, 64, -64, 64, 64, 64, -64, 64, 64, 64, -64, -64, -64, -64, 64, 64, 64, 64, -64, 64, -64, 64, 64, 64, -64, 64, 64, 64, -64, -64, 64, -64, 64, -64, -64, -64, 64, 64, -64, 64, 64, -64, 64, 64, -64, -64, 64, 64, -64, -64, 64, -64, -64, 64, 64, 64, -64, -64, 64, -64, -64, 64, -64, 64, 64, -64, -64, -64, -64, -64, 64, -64, -64, 64, -64, 64, -64, -64, 64, -64, -64, 64, -64, 64, -64, -64, 64, -64, -64, -64, -64, 64, -64, -64, -64, 64, 64, -64, -64, -64, 64, -64, -64, -64, 64, -64, 64, 64, -64, 64, 64, 64, 64, -64, -64, 64, 64, 64, 64, -64, 64, -64, -64, -64, -64, 64, 64, -64, -64, 64, -64, 64, 64, 64, -64, 64, -64, -64, 64, 64, 64, 64, -64, 64, -64, 64, -64, -64, 64, -64, -64, -64, 64, 64, 64, 64, 64, -64, -64, 64, 64, -64, -64, -64, 64, -64, 64, 64, 64, 64, -64, -64, -64, -64, -64, 64, 64, 64, 64, 64, 64, 64, 64, 64, 64, 64, 64, 64, 64, -64, 64, 64, 64, -64, -64, -64, -64, 64, -64, -64, -64, 64, 64, 64, 64, -64, -64, 64, -64, 64, 64, 64, 64, 64, 64, 64, 64, 64, 64, 64, 64, -64, -64, 64, 64, 64, -64, -64, 64, -64, -64, -64, -64, 64, 64, 64, -64, -64, -64, 64, -64, 64, 64, 64, -64, 64, 64, 64, -64, -64, 64, -64, -64, 64, 64, 64, 64, 64, 64, 64, 64, -64, 64, -64, 64, 64, 64, 64, -64, -64, 64, 64, -64, 64, -64, 64, 64, 64, 64, 64, 64, -64, -64, -64, 64, -64, 64, -64, -64, 64, 64, -64, 64, -64, 64, -64, 64, 64, 64, 64, -64, -64, 64, 64, 64, -64, 64, -64, -64, -64, 64, -64, 64, 64, -64, 64, 64, 64, 64, 64, -64, -64, -64, 64, -64, -64, 64, 64, 64, 64, 64, 64, 64, 64, 64, -64, 64, 64, -64, 64, -64, -64, -64, 64, 64, 64, 64, 64, -64, -64, 64, 64, 64, 64, 64, 64, 64, 64, -64, 64, 64, 64, -64, 64, -64, -64, -64, 64, -64, -64, 64, 64, 64, -64, -64, 64, -64, -64, -64, 64, 64, 64, -64, 64, -64, -64, 64, -64, -64, 64, 64, 64, 64, 64, -64, -64, -64, -64, 64, 64, -64, 64, -64, 64, 64, 64, -64, 64, 64, 64, 64, 64, 64, 64, -64, 64, -64, 64, 64, 64, 64, -64, -64, -64, -64, -64, -64, -64, 64, 64, 64, 64, 64, 64, 64, 64, 64, 64, -64, 64, 64, 64, 64, 64, 64, 64, 64, -64, 64, 64, -64, -64, -64, 64, 64, 64, 64, 64, 64, -64, 64, -64, -64, -64, -64, 64, 64, 64, 64, -64, 64, 64, 64, 64, -64, -64, 64, 64, -64, 64, 64, 64, 64, -64, -64, 64, 64, -64, -64, -64, 64, -64, 64, -64, -64, 64, 64, 64, 64, -64, -64, 64, 64, 64, 64, 64, -64, -64, 64, 64, 64, -64, -64, 64, -64, 64, -64, 64, 64, 64, 64, -64, -64, 64, -64, 64, -64, 64, 64, 64, -64, 64, 64, 64, -64, -64, -64, -64, 64, 64, -64, -64, 64, 64, -64, -64, -64, -64, 64, 64, 64, -64, -64, 64, -64, 64, 64, 64, -64, -64, -64, -64, -64, 64, 64, -64, 64, 64, -64, 64, -64, -64, 64, 64, -64, 64, 64, 64, -64, -64, -64, 64, 64, 64, -64, -64, 64, -64, 64, 64, -64, 64, -64, 64, -64, 64, -64, -64, -64, -64, -64, 64, -64, -64, 64, -64, -64, 64, 64, 64, 64, 64, -64, -64, -64, 64, -64, 64, -64, -64, -64, -64, -64, -64, -64, -64, -64, -64, 64, 64, 64, 64, 64, -64, 64, -64, 64, 64, 64, -64, 64, 64, 64, -64, 64, 64, 64, -64, -64, -64, 64, -64, -64, -64, -64, -64, 64, 64, 64, -64, 64, 64, 64, 64, 64, 64, 64, -64, 64, 64, 64, 64, 64, 64, -64, -64, -64, -64, -64, 64, -64, -64, 64, 64, 64, 64, 64, 64, 64, 64, 64, 64, -64, -64, 64, 64, -64, 64, 64, 64, -64, 64, 64, 64, -64, 64, 64, -64, -64, -64, 64, 64, 64, -64, 64, 64, 64, -64, 64, 64, -64, 64, 64, -64, -64, -64, -64, -64, 64, 64, -64, -64, 64, 64, -64, -64, -64, 64, 64, -64, -64, 64, 64, 64, 64, 64, 64, 64, 64, 64, 64, -64, 64, 64, 64, -64, -64, 64, 64, 64, 64, -64, -64, -64, 64, -64, -64, 64, 64, 64, 64, 64, -64, 64, -64, -64, -64, -64, -64, 64, 64, 64, -64, -64, 64, 64, -64, -64, -64, -64, -64, 64, 64, -64, 64, 64, 64, 64, 64, 64, 64, 64, 64, 64, 64, 64, 64, 64, 64, 64, 64, 64, 64, -64, -64, -64, -64, 64, -64, 64, -64, -64, 64, -64, -64, -64, -64, -64, 64, 64, 64, 64, 64, -64, 64, 64, 64, -64, 64, 64, 64, -64, -64, -64, -64, 64, -64, -64, 64, -64, -64, 64, -64, 64, -64, -64, -64, 64, 64, 64, 64, -64, -64, 64, -64, -64, -64, 64, -64, -64, -64, 64, -64, 64, 64, 64, -64, -64, 64, -64, -64, 64, -64, 64, 64, 64, 64, -64, 64, -64, -64, 64, -64, -64, 64, -64, 64, -64, 64, -64, -64, -64, 64, -64, 64, 64, 64, -64, 64, -64, -64, 64, 64, 64, 64, -64, -64, -64, 64, 64, 64, 64, -64, 64, 64, -64, 64, -64, 64, 64, 64, 64, -64, 64, 64, 64, 64, 64, 64, 64, 64, 64, 64, -64, 64, 64, 64, 64, 64, 64, 64, -64, 64, 64, 64, 64, -64, 64, 64, 64, 64, 64, 64, 64, 64, 64, -64, 64, 64, 64, 64, 64, 64, 64, -64, -64, 64, 64, 64, 64, 64, 64, -64, -64, 64, -64, 64, -64, 64, -64, 64, -64, -64, 64, -64, 64, 64, 64, 64, 64, 64, 64, -64, -64, 64, -64, -64, -64, -64, -64, -64, 64, 64, -64, 64, -64, 64, 64, 64, 64, -64, 64, 64, 64, 64, 64, 64, 64, 64, 64, -64, -64, -64, -64, -64, -64, -64, -64, -64, -64, 64, 64, -64, -64, -64, -64, -64, -64, -64, -64, 64, 64, 64, 64, 64, 64, 64, -64, -64, -64, -64, -64, -64, -64, -64, -64, -64, -64, 64, 64, -64, 64, -64, 64, -64, -64, 64, 64, 64, 64, 64, 64, 64, 64, -64, -64, 64, -64, -64, -64, -64, -64, -64, -64, -64, -64, -64, -64, -64, 64, 64, 64, 64, -64, 64, 64, 64, 64, 64, 64, 64, 64, 64, -64, -64, -64, -64, -64, -64, -64, -64, -64, -64, 64, -64, -64, -64, 64, 64, -64, -64, -64, 64, 64, 64, 64, 64, -64, 64, -64, 64, -64, -64, -64, 64, -64, -64, -64, -64, -64, -64, -64, -64, 64, -64, -64, 64, -64, -64, -64, 64, 64, 64, 64, 64, 64, 64, -64, -64, -64, 64, 64, 64, 64, -64, -64, -64, -64, -64, -64, 64, 64, -64, -64, -64, -64, -64, -64, 64, 64, 64, -64, -64, 64, 64, 64, 64, -64, -64, -64, -64, -64, -64, -64, -64, 64, -64, -64, 64, -64, 64, 64, -64, -64, -64, -64, -64, 64, -64, -64, -64, -64, -64, 64, -64, -64, 64, -64, -64, -64, 64, -64, 64, 64, 64, 64, 64, -64, 64, 64, -64, -64, -64, -64, -64, 64, -64, -64, -64, -64, -64, 64, 64, 64, -64, -64, 64, -64, 64, 64, 64, 64, 64, 64, -64, 64, -64, -64, 64, -64, -64, -64, 64, 64, 64, -64, 64, 64, -64, 64, -64, -64, -64, -64, -64, 64, 64, 64, 64, 64, 64, -64, -64, 64, -64, -64, -64, 64, -64, 64, 64, 64, -64, 64, 64, 64, 64, 64, -64, 64, -64, -64, -64, -64, -64, 64, 64, 64, 64, 64, 64, 64, -64, 64, -64, -64, 64, 64, 64, -64, 64, 64, 64, 64, 64, 64, 64, -64, -64, -64, 64, 64, -64, -64, 64, 64, 64, 64, -64, -64, -64, -64, 64, -64, -64, -64, 64, -64, 64, 64, 64, 64, 64, 64, 64, -64, -64, -64, -64, 64, -64, -64, 64, 64, 64, -64, -64, -64, 64, 64, 64, -64, -64, -64, -64, 64, 64, 64, -64, 64, -64, 64, -64, -64, 64, -64, 64, -64, 64, 64, -64, -64, -64, -64, -64, 64, -64, 64, -64, -64, -64, -64, -64, 64, 64, 64, 64, -64, -64, -64, -64, 64, 64, -64, 64, 64, 64, 64, 64, -64, 64, -64, 64, 64, -64, -64, 64, -64, -64, -64, -64, -64, 64, 64, -64, -64, -64, 64, 64, 64, 64, 64, 64, 64, 64, 64, 64, 64, 64, -64, -64, 64, -64, 64, -64, 64, -64, -64, -64, -64, 64, 64, -64, 64, 64, 64, 64, 64, 64, 64, 64, 64, 64, 64, 64, 64, 64, -64, -64, -64, 64, -64, -64, -64, -64, -64, -64, -64, 64, -64, 64, -64, -64, 64, 64, 64, 64, 64, 64, 64, 64, 64, 64, -64, 64, -64, 64, 64, -64, -64, -64, -64, -64, -64, -64, -64, -64, -64, -64, -64, -64, 64, -64, -64, -64, -64, 64, -64, 64, 64, -64, -64, -64, -64, 64, -64, 64, 64, -64, -64, -64, -64, -64, -64, -64, -64, -64, -64, -64, -64, 64, -64, -64, -64, -64, -64, -64, -64, 64, -64, 64, 64, 64, -64, 64, -64, -64, -64, 64, -64, -64, -64, -64, -64, -64, -64, 64, 64, 64, 64, -64, -64, -64, -64, -64, 64, 64, -64, -64, -64, -64, -64, -64, -64, -64, 64, 64, -64, -64, 64, -64, 64, 64, -64, -64, 64, -64, 64, -64, -64, -64, 64, -64, 64, -64, 64, 64, -64, 64, 64, -64, 64, 64, -64, -64, 64, 64, 64, -64, -64, 64, 64, -64, 64, 64, -64, 64, 64, 64, -64, -64, -64, 64, 64, -64, -64, -64, -64, 64, 64, 64, -64, 64, -64, -64, -64, -64, 64, -64, -64, -64, 64, 64, 64, -64, -64, -64, -64, -64, -64, 64, -64, 64, -64, -64, -64, -64, 64, 64, 64, 64, 64, 64, -64, 64, -64, 64, 64, 64, -64, -64, -64, -64, 64, 64, 64, -64, 64, -64, 64, -64, -64, -64, -64, 64, 64, 64, 64, -64, 64, -64, 64, -64, -64, -64, -64, 64, 64, 64, 64, -64, 64, 64, 64, -64, -64, 64, 64, -64, 64, 64, 64, -64, -64, 64, 64, -64, 64, 64, 64, 64, -64, 64, -64, 64, -64, -64, 64, 64, 64, -64, -64, 64, -64, 64, -64, 64, 64, -64, -64, -64, 64, 64, 64, -64, 64, 64, -64, 64, -64, 64, 64, 64, 64, 64, 64, -64, -64, -64, 64, 64, -64, -64, -64, 64, -64, 64, 64, 64, 64, -64, 64, -64, -64, -64, -64, 64, -64, -64, -64, -64, -64, -64, -64, -64, -64, -64, -64, -64, 64, 64, -64, -64, -64, -64, 64, 64, -64, 64, 64, -64, -64, -64, 64, 64, -64, -64, 64, 64, -64, 64, -64, -64, -64, -64, -64, -64, 64, 64, -64, 64, -64, 64, -64, -64, -64, -64, -64, -64, 64, 64, -64, -64, -64, -64, -64, -64, -64, -64, 64, -64, 64, -64, 64, -64, 64, -64, 64, 64, -64, -64, -64, -64, 64, 64, -64, 64, 64, -64, -64, 64, -64, -64, -64, -64, 64, -64, -64, 64, -64, -64, -64, -64, 64, 64, 64, 64, 64, -64, 64, -64, 64, -64, 64, -64, -64, 64, -64, 64, 64, -64, -64, -64, -64, -64, -64, -64, 64, 64, -64, -64, 64, 64, -64, -64, -64, 64, 64, -64, -64, 64, 64, 64, 64, -64, 64, -64, 64, 64, 64, 64, 64, -64, 64, 64, -64, -64, 64, -64, -64, -64, -64, 64, -64, -64, -64, -64, 64, 64, -64, -64, -64, -64, -64, 64, -64, 64, 64, 64, -64, -64, -64, -64, 64, -64, -64, -64, -64, -64, 64, -64, -64, -64, -64, 64, 64, 64, 64, -64, 64, -64, -64, -64, 64, -64, 64, -64, -64, -64, -64, 64, -64, 64, -64, -64, -64, -64, -64, -64, -64, 64, -64, 64, -64, -64, -64, 64, -64, -64, 64, -64, 64, 64, -64, 64, -64, -64, -64, -64, -64, 64, -64, -64, -64, 64, 64, -64, -64, 64, 64, -64, 64, 64, 64, -64, -64, -64, -64, -64, -64, -64, -64, -64, 64, 64, -64, -64, -64, 64, -64, -64, -64, 64, 64, -64, -64, 64, -64, 64, -64, 64, 64, -64, -64, 64, -64, -64, -64, -64, -64, -64, -64, -64, -64, 64, -64, -64, -64, 64, -64, 64, -64, -64, 64, -64, -64, -64, 64, 64, 64, -64, -64, -64, -64, -64, -64, -64, -64, -64, 64, -64, -64, -64, -64, -64, -64, 64, -64, 64, -64, 64, 64, -64, 64, 64, 64, -64, 64, -64, 64, -64, -64, 64, 64, -64, -64, 64, -64, -64, -64, -64, -64, -64, -64, -64, -64, -64, -64, 64, 64, -64, 64, 64, -64, -64, 64, -64, -64, -64, 64, -64, -64, 64, -64, -64, -64, 64, 64, -64, -64, -64, 64, -64, -64, 64, -64, 64, -64, -64, 64, 64, 64, 64, 64, -64, -64, -64, -64, 64, 64, 64, -64, -64, 64, -64, -64, -64, 64, -64, 64, -64, -64, -64, -64, 64, 64, -64, -64, -64, -64, -64, -64, -64, -64, 64, -64, -64, -64, -64, 64, 64, -64, -64, -64, 64, -64, -64, 64, -64, -64, -64, -64, 64, 64, 64, 64, -64, 64, 64, 64, -64, 64, -64, -64, 64, -64, -64, -64, 64, -64, -64, -64, 64, -64, 64, -64, 64, 64, -64, 64, -64, 64, 64, 64, 64, 64, -64, 64, 64, 64, 64, 64, 64, 64, -64, 64, -64, -64, -64, -64, 64, -64, -64, -64, 64, 64, -64, -64, -64, 64, -64, -64, -64, 64, -64, 64, -64, 64, -64, -64, 64, -64, -64, -64, 64, -64, 64, -64, 64, -64, 64, -64, 64, -64, -64, 64, 64, -64, 64, -64, 64, 64, 64, 64, -64, 64, -64, 64, -64, -64, -64, -64, -64, -64, 64, 64, 64, 64, -64, 64, 64, 64, -64, -64, 64, 64, 64, -64, 64, -64, -64, -64, -64, 64, 64, 64, 64, -64, -64, -64, -64, -64, 64, 64, -64, -64, -64, 64, 64, -64, -64, -64, 64, -64, -64, -64, 64, -64, 64, 64, -64, 64, 64, -64, 64, -64, 64, 64, 64, -64, 64, 64, -64, 64, -64, -64, -64, 64, -64, -64, 64, 64, -64, -64, -64, -64, -64, -64, -64, -64, 64, -64, 64, -64, 64, -64, 64, 64, 64, -64, 64, 64, 64, 64, -64, 64, -64, 64, -64, -64, -64, 64, -64, -64, -64, 64, 64, 64, -64, -64, 64, 64, -64, -64, 64, 64, -64, -64, -64, -64, -64, 64, 64, 64, -64, -64, -64, -64, -64, 64, 64, 64, -64, -64, 64, 64, -64, -64, 64, 64, -64, -64, 64, 64, 64, -64, 64, -64, -64, 64, -64, -64, 64, 64, 64, -64, -64, 64, -64, 64, 64, -64, 64, 64, 64, -64, -64, -64, 64, 64, -64, 64, -64, -64, -64, -64, -64, 64, 64, -64, 64, 64, 64, -64, 64, -64, -64, 64, 64, 64, 64, -64, -64, -64, 64, -64, 64, -64, 64, -64, 64, -64, -64, 64, 64, -64, -64, -64, 64, -64, 64, -64, -64, 64, 64, -64, -64, -64, -64, 64, -64, -64, -64, -64, -64, -64, -64, 64, 64, -64, -64, 64, -64, -64, 64, 64, -64, 64, 64, -64, -64, 64, 64, -64, 64, 64, -64, -64, -64, 64, -64, -64, 64, -64, -64, 64, -64, -64, -64, -64, -64, 64, -64, 64, -64, 64, -64, 64, 64, -64, 64, 64, -64, 64, 64, 64, -64, 64, -64, -64, -64, -64, 64, -64, -64, -64, 64, -64, -64, -64, -64, -64, -64, 64, 64, -64, -64, -64, 64, 64, -64, 64, -64, -64, -64, -64, -64, -64, -64, -64, 64, -64, -64, 64, -64, 64, -64, 64, 64, 64, -64, 64, 64, -64, 64, -64, -64, -64, -64, -64, -64, 64, 64, -64, -64, -64, 64, -64, -64, -64, 64, -64, -64, -64, -64, -64, 64, -64, 64, 64, -64, -64, 64, -64, 64, -64, -64, -64, 64, -64, 64, -64, 64, -64, -64, 64, -64, -64, -64, -64, -64, -64, -64, -64, 64, 64, 64, 64, 64, 64, 64, 64, 64, -64, -64, 64, -64, 64, -64, -64, -64, -64, 64, 64, -64, -64, -64, -64, 64, -64, 64, -64, -64, -64, 64, -64, -64, 64, -64, -64, 64, -64, 64, 64, 64, -64, -64, -64, -64, -64, 64, 64, -64, -64, -64, -64, 64, -64, 64, -64, -64, -64, -64, 64, -64, -64, 64, -64, -64, 64, 64, -64, -64, 64, 64, 64, -64, -64, 64, 64, 64, -64, -64, -64, -64, -64, -64, -64, -64, 64, -64, -64, 64, 64, 64, 64, -64, -64, -64, -64, 64, -64, 64, 64, -64, -64, -64, -64, -64, -64, -64, -64, 64, -64, -64, -64, 64, -64, 64, -64, 64, 64, 64, 64, 64, -64, -64, -64, -64, -64, -64, -64, -64, -64, 64, 64, -64, -64, -64, -64, -64, -64, -64, -64, -64, -64, -64, 64, -64, 64, 64, -64, -64, -64, -64, -64, -64, -64, -64, -64, -64, -64, -64, -64, 64, 64, 64, -64, -64, -64, -64, -64, -64, -64, -64, 64, -64, 64, -64, -64, 64, 64, -64, 64, -64, -64, -64, -64, -64, -64, -64, 64, 64, 64, -64, 64, -64, -64, -64, -64, -64, 64, 64, 64, -64, 64, 64, -64, 64, -64, 64, -64, -64, -64, 64, 64, -64, -64, -64, -64, -64, 64, 64, 64, -64, 64, 64, -64, -64, -64, 64, 64, 64, 64, -64, -64, 64, 64, -64, -64, -64, -64, 64, -64, -64, -64, -64, -64, -64, -64, -64, 64, 64, -64, 64, -64, -64, -64, 64, -64, 64, 64, 64, -64, -64, 64, -64, -64, -64, 64, 64, -64, 64, -64, 64, -64, 64, 64, 64, 64, -64, -64, -64, -64, -64, 64, 64, 64, 64, -64, 64, 64, -64, -64, 64, 64, 64, 64, 64, -64, -64, -64, -64, -64, -64, 64, -64, 64, -64, 64, 64, 64, -64, 64, -64, -64, 64, -64, -64, 64, -64, 64, 64, -64, 64, 64, -64, 64, 64, 64, -64, -64, -64, -64, 64, -64, -64, -64, -64, -64, 64, 64, -64, -64, -64, -64, 64, 64, -64, -64, 64, 64, -64, -64, -64, 64, 64, -64, -64, 64, -64, 64, 64, -64, -64, 64, 64, -64, -64, 64, 64, 64, -64, 64, -64, 64, 64, -64, 64, -64, 64, 64, -64, -64, 64, 64, 64, 64, -64, 64, -64, 64, -64, -64, -64, -64, -64, 64, -64, -64, -64, -64, -64, 64, -64, 64, 64, 64, 64, -64, 64, -64, -64, -64, -64, -64, -64, -64, 64, -64, -64, -64, 64, -64, 64, 64, -64, -64, 64, 64, 64, -64, 64, -64, 64, -64, 64, 64, -64, -64, -64, 64, -64, -64, -64, 64, 64, -64, 64, 64, 64, -64, -64, -64, 64, -64, -64, 64, 64, 64, -64, -64, 64, 64, -64, -64, -64, -64, 64, -64, -64, 64, 64, 64, 64, 64, -64, 64, -64, 64, 64, 64, -64, 64, -64, -64, 64, -64, -64, 64, -64, -64, 64, 64, 64, 64, 64, 64, -64, 64, 64, 64, -64, -64, 64, 64, 64, 64, 64, -64, 64, -64, -64, -64, 64, 64, -64, -64, 64, 64, -64, -64, -64, -64, -64, -64, 64, -64, 64, -64, 64, -64, -64, -64, -64, 64, -64, 64, 64, 64, -64, -64, -64, 64, -64, -64, -64, -64, -64, -64, 64, 64, 64, -64, 64, 64, 64, -64, 64, 64, -64, -64, -64, -64, 64, 64, 64, 64, -64, 64, 64, -64, -64, 64, -64, 64, 64, 64, 64, -64, -64, -64, -64, 64, 64, 64, 64, -64, 64, 64, -64, -64, -64, 64, -64, 64, 64, 64, -64, -64, -64, 64, 64, -64, 64, 64, -64, 64, -64, 64, 64, -64, -64, -64, -64, -64, 64, -64, 64, -64, 64, 64, 64, -64, -64, -64, 64, 64, 64, 64, 64, 64, 64, 64, 64, 64, 64, 64, -64, 64, -64, -64, 64, -64, 64, 64, -64, 64, -64, -64, 64, -64, -64, -64, 64, -64, -64, 64, 64, 64, 64, 64, 64, 64, 64, 64, 64, 64, 64, 64, -64, -64, -64, 64, 64, -64, 64, -64, -64, -64, -64, -64, 64, 64, -64, 64, 64, -64, 64, 64, 64, 64, -64, 64, 64, -64, -64, 64, 64, -64, 64, -64, 64, -64, 64, -64, 64, 64, -64, -64, 64, 64, 64, -64, 64, 64, 64, -64, 64, 64, 64, 64, 64, 64, 64, 64, -64, 64, 64, 64, 64, 64, 64, 64, 64, 64, -64, 64, 64, 64, 64, 64, 64, -64, -64, 64, 64, -64, 64, 64, 64, -64, -64, 64, 64, -64, -64, -64, -64, 64, -64, -64, 64, 64, 64, 64, 64, -64, 64, -64, -64, -64, 64, 64, 64, 64, 64, 64, -64, -64, 64, 64, 64, 64, 64, -64, -64, 64, 64, -64, -64, -64, 64, 64, -64, -64, -64, 64, -64, 64, 64, 64, 64, -64, -64, 64, 64, -64, 64, 64, -64, -64, 64, 64, 64, -64, -64, -64, 64, 64, 64, -64, -64, -64, -64, -64, 64, 64, -64, 64, 64, 64, -64, -64, -64, 64, 64, 64, 64, 64, 64, -64, -64, -64, -64, 64, -64, 64, -64, 64, 64, 64, -64, -64, -64, 64, 64, -64, 64, -64, 64, 64, -64, 64, 64, 64, 64, 64, 64, 64, -64, 64, 64, 64, 64, 64, -64, 64, -64, 64, -64, 64, 64, 64, 64, 64, 64, -64, 64, -64, 64, -64, 64, 64, 64, 64, 64, 64, -64, 64, 64, -64, -64, 64, -64, -64, 64, -64, 64, -64, 64, 64, -64, 64, 64, 64, 64, 64, -64, 64, 64, 64, 64, 64, -64, 64, 64, -64, -64, -64, -64, 64, 64, -64, 64, -64, -64, -64, -64, 64, 64, 64, -64, -64, -64, 64, -64, 64, 64, 64, 64, 64, 64, 64, -64, 64, 64, 64, -64, 64, 64, 64, -64, -64, -64, -64, -64, -64, 64, -64, 64, -64, -64, 64, -64, 64, 64, 64, 64, 64, 64, -64, 64, -64, 64, 64, 64, -64, 64, -64, -64, -64, 64, 64, 64, 64, 64, -64, -64, -64, -64, 64, 64, 64, 64, -64, 64, 64, 64, 64, 64, 64, 64, -64, -64, -64, -64, -64, 64, -64, -64, 64, 64, -64, -64, -64, 64, 64, -64, 64, -64, 64, 64, 64, 64, -64, 64, 64, -64, -64, 64, 64, -64, -64, 64, 64, 64, 64, -64, -64, 64, 64, -64, 64, -64, 64, -64, 64, 64, 64, 64, 64, -64, 64, 64, -64, 64, 64, -64, -64, -64, 64, 64, -64, 64, 64, -64, -64, 64, 64, 64, -64, -64, 64, -64, 64, 64, 64, 64, 64, -64, -64, 64, 64, 64, -64, -64, 64, -64, 64, -64, 64, 64, -64, 64, 64, -64, -64, -64, -64, -64, 64, 64, -64, 64, 64, -64, -64, 64, 64, 64, 64, 64, 64, -64, 64, 64, 64, -64, -64, -64, 64, -64, 64, -64, 64, -64, -64, -64, 64, 64, -64, 64, 64, 64, 64, 64, 64, -64, 64, 64, -64, 64, -64, 64, 64, -64, 64, -64, -64, 64, -64, 64, -64, 64, -64, -64, 64, 64, -64, -64, -64, 64, 64, 64, 64, 64, 64, 64, -64, 64, -64, 64, 64, 64, 64, -64, 64, 64, 64, 64, 64, 64, 64, 64, 64, -64, -64, 64, -64, -64, 64, 64, 64, 64, 64, 64, 64, -64, -64, -64, 64, -64, 64, 64, 64, -64, 64, -64, -64, -64, 64, 64, -64, 64, 64, 64, -64, 64, 64, 64, 64, 64, 64, 64, -64, -64, -64, 64, -64, 64, 64, 64, 64, -64, -64, 64, -64, -64, 64, 64, -64, -64, -64, 64, -64, -64, -64, 64, 64, 64, 64, 64, 64, -64, 64, -64, 64, 64, 64, 64, 64, -64, 64, 64, -64, 64, -64, -64, 64, -64, 64, 64, -64, -64, -64, 64, -64, 64, 64, -64, 64, 64, -64, -64, 64, -64, 64, 64, -64, 64, 64, 64, -64, 64, -64, 64, -64, -64, -64, -64, 64, 64, 64, 64, -64, -64, -64, -64, 64, 64, 64, 64, 64, -64, 64, -64, 64, -64, -64, 64, -64, 64, 64, 64, 64, -64, 64, -64, -64, 64, -64, 64, -64, 64, -64, -64, -64, 64, -64, -64, -64, -64, 64, 64, 64, 64, 64, -64, 64, -64, -64, 64, 64, -64, 64, -64, -64, 64, -64, 64, 64, 64, -64, -64, -64, 64, 64, 64, -64, 64, -64, -64, -64, -64, 64, -64, -64, -64, 64, -64, 64, -64, 64, -64, -64, -64, -64, -64, 64, 64, -64, 64, 64, 64, 64, -64, -64, 64, 64, -64, -64, 64, 64, 64, -64, -64, -64, 64, 64, -64, 64, -64, -64, 64, -64, -64, 64, -64, -64, -64, -64, -64, -64, 64, -64, -64, -64, -64, 64, -64, -64, 64, -64, 64, 64, 64, 64, 64, 64, 64, -64, -64, -64, 64, 64, -64, 64, -64, -64, -64, 64, 64, -64, -64, -64, 64, 64, -64, -64, 64, -64, 64, 64, 64, 64, 64, 64, 64, 64, -64, 64, -64, 64, 64, 64, -64, -64, -64, 64, -64, -64, -64, 64, 64, -64, -64, -64, -64, 64, 64, 64, 64, 64, 64, 64, 64, 64, 64, 64, -64, 64, 64, 64, 64, 64, 64, -64, 64, 64, 64, -64, -64, 64, 64, -64, 64, 64, 64, 64, 64, 64, 64, 64, 64, -64, -64, -64, 64, 64, 64, 64, -64, 64, -64, 64, -64, -64, 64, 64, 64, -64, -64, 64, 64, -64, -64, 64, 64, 64, 64, -64, 64, -64, -64, -64, -64, 64, 64, -64, -64, 64, -64, 64, -64, -64, -64, -64, 64, 64, -64, -64, 64, 64, -64, 64, 64, 64, 64, -64, -64, -64, -64, -64, 64, 64, -64, 64, 64, 64, -64, 64, -64, -64, 64, -64, -64, 64, -64, 64, 64, -64, 64, 64, -64, 64, 64, 64, 64, 64, -64, 64, -64, 64, 64, -64, -64, -64, 64, 64, -64, -64, -64, -64, -64, 64, -64, -64, -64, 64, 64, 64, 64, 64, 64, 64, 64, -64, 64, -64, -64, 64, 64, 64, 64, -64, 64, 64, 64, -64, -64, -64, 64, 64, -64, 64, -64, -64, -64, -64, 64, 64, 64, 64, 64, 64, 64, -64, -64, 64, 64, 64, 64, -64, 64, 64, 64, 64, -64, -64, 64, -64, -64, 64, 64, -64, 64, 64, 64, 64, 64, 64, 64, 64, 64, -64, 64, 64, 64, 64, 64, 64, 64, 64, -64, 64, 64, 64, 64, 64, 64, -64, -64, 64, 64, 64, 64, 64, 64, 64, -64, -64, -64, 64, -64, 64, 64, 64, 64, 64, 64, 64, 64, 64, 64, 64, 64, 64, 64, 64, -64, 64, -64, 64, 64, 64, -64, -64, 64, 64, -64, -64, -64, 64, 64, 64, 64, 64, 64, 64, 64, 64, 64, -64, 64, -64, 64, 64, 64, 64, -64, 64, 64, 64, -64, -64, -64, -64, 64, 64, -64, 64, 64, 64, 64, 64, 64, 64, 64, 64, 64, 64, -64, 64, 64, 64, -64, 64, 64, 64, 64, -64, -64, -64, -64, 64, 64, 64, -64, 64, 64, 64, 64, 64, 64, 64, 64, 64, 64, 64, 64, -64, 64, -64, 64, 64, 64, 64, 64, -64, -64, -64, 64, 64, 64, 64, 64, 64, 64, 64, 64, 64, 64, 64, 64, 64, -64, -64, 64, 64, -64, -64, -64, -64, 64, 64, -64, -64, -64, 64, 64, 64, 64, -64, -64, 64, 64, -64, 64, 64, 64, 64, -64, 64, -64, -64, -64, -64, -64, 64, -64, 64, -64, -64, -64, -64, 64, 64, 64, 64, -64, 64, 64, -64, 64, -64, 64, 64, 64, 64, -64, -64, 64, -64, 64, 64, 64, -64, 64, 64, 64, -64, -64, -64, 64, -64, -64, -64, 64, -64, 64, 64, -64, 64, 64, 64, 64, 64, -64, 64, -64, -64, -64, 64, -64, -64, -64, 64, 64, -64, -64, -64, 64, -64, -64, -64, -64, 64, -64, 64, 64, 64, 64, 64, -64, 64, -64, -64, -64, -64, -64, 64, -64, -64, -64, 64, 64, 64, 64, 64, 64, 64, 64, 64, 64, 64, 64, 64, 64, 64, 64, 64, 64, 64, 64, -64, 64, 64, 64, -64, 64, -64, 64, 64, 64, 64, -64, 64, 64, 64, 64, 64, 64, -64, 64, -64, 64, -64, 64, 64, 64, -64, -64, 64, 64, 64, -64, 64, -64, -64, -64, -64, 64, -64, 64, 64, 64, 64, -64, 64, 64, 64, 64, -64, 64, 64, 64, -64, -64, -64, 64, 64, -64, 64, 64, -64, 64, -64, -64, 64, -64, -64, 64, -64, 64, 64, -64, 64, -64, -64, -64, -64, 64, -64, -64, 64, -64, 64, 64, -64, 64, 64, 64, -64, 64, 64, 64, -64, 64, -64, -64, -64, 64, -64, 64, -64, 64, -64, -64, -64, -64, 64, 64, 64, -64, 64, 64, 64, -64, -64, -64, -64, -64, -64, 64, -64, -64, 64, 64, -64, -64, -64, -64, 64, -64, -64, 64, -64, -64, -64, -64, -64, 64, -64, -64, 64, 64, -64, 64, 64, -64, 64, -64, 64, -64, -64, -64, 64, 64, 64, 64, -64, -64, 64, 64, 64, -64, 64, -64, -64, -64, 64, 64, -64, -64, 64, 64, 64, -64, 64, 64, 64, 64, -64, 64, -64, 64, 64, 64, 64, 64, 64, 64, -64, -64, -64, -64, -64, -64, -64, 64, -64, 64, 64, 64, -64, -64, -64, 64, 64, 64, 64, 64, 64, 64, 64, 64, -64, 64, 64, 64, -64, -64, -64, -64, -64, -64, -64, -64, -64, -64, -64, -64, -64, 64, -64, 64, 64, 64, 64, 64, 64, 64, -64, -64, -64, 64, -64, 64, 64, -64, -64, -64, -64, -64, -64, -64, -64, -64, 64, -64, 64, -64, 64, 64, 64, 64, 64, -64, 64, -64, -64, -64, 64, -64, -64, 64, 64, -64, -64, -64, -64, -64, -64, -64, -64, -64, 64, -64, 64, 64, -64, -64, 64, 64, 64, 64, 64, 64, 64, 64, 64, 64, 64, -64, 64, 64, 64, -64, 64, -64, 64, -64, 64, 64, -64, -64, 64, 64, -64, 64, 64, 64, 64, -64, 64, 64, 64, 64, 64, 64, 64, 64, 64, 64, 64, 64, -64, 64, 64, 64, -64, -64, -64, 64, -64, -64, 64, 64, -64, 64, 64, 64, 64, 64, 64, -64, -64, 64, 64, 64, 64, 64, -64, 64, 64, -64, -64, -64, -64, -64, 64, -64, 64, -64, 64, 64, -64, 64, 64, -64, 64, 64, -64, -64, -64, -64, 64, 64, -64, -64, 64, -64, -64, -64, -64, 64, -64, -64, -64, 64, 64, -64, 64, -64, -64, 64, -64, 64, -64, -64, -64, -64, -64, -64, 64, -64, 64, -64, 64, -64, -64, -64, -64, 64, 64, -64, -64, 64, 64, 64, 64, -64, -64, -64, -64, 64, -64, -64, -64, -64, -64, -64, -64, -64, 64, -64, -64, -64, -64, -64, 64, -64, 64, 64, 64, 64, 64, -64, 64, 64, -64, -64, -64, -64, 64, -64, -64, -64, -64, -64, -64, 64, 64, 64, -64, -64, -64, 64, -64, 64, 64, 64, 64, 64, -64, -64, -64, -64, -64, -64, -64, 64, -64, -64, -64, -64, -64, -64, -64, 64, 64, 64, -64, -64, -64, 64, 64, 64, 64, -64, 64, -64, 64, -64, 64, -64, -64, -64, -64, -64, 64, -64, -64, -64, -64, 64, -64, 64, 64, -64, -64, -64, 64, 64, 64, 64, 64, 64, 64, 64, 64, 64, -64, 64, 64, 64, 64, 64, 64, 64, 64, 64, -64, -64, 64, 64, 64, 64, -64, -64, -64, -64, 64, 64, 64, 64, 64, 64, 64, -64, 64, 64, 64, 64, 64, 64, -64, -64, 64, 64, 64, 64, 64, 64, -64, -64, -64, -64, -64, 64, -64, -64, 64, 64, 64, 64, 64, -64, -64, 64, 64, 64, -64, 64, 64, 64, 64, -64, -64, 64, 64, 64, -64, -64, 64, -64, -64, 64, -64, 64, 64, 64, -64, 64, -64, 64, -64, 64, -64, -64, -64, -64, 64, 64, 64, -64, 64, 64, 64, 64, -64, -64, -64, 64, 64, 64, 64, 64, 64, 64, -64, 64, 64, -64, 64, -64, -64, -64, -64, -64, -64, -64, 64, 64, 64, 64, 64, -64, 64, -64, 64, -64, 64, 64, 64, 64, 64, 64, 64, 64, 64, 64, -64, 64, 64, -64, -64, -64, -64, 64, 64, 64, 64, 64, 64, -64, -64, -64, -64, -64, 64, 64, 64, 64, 64, 64, 64, 64, -64, -64, 64, -64, -64, -64, -64, -64, -64, 64, 64, 64, -64, -64, -64, -64, -64, -64, -64, -64, -64, 64, 64, 64, 64, -64, 64, -64, -64, 64, -64, 64, 64, -64, -64, 64, -64, 64, 64, 64, -64, 64, 64, -64, -64, -64, -64, -64, -64, -64, 64, -64, 64, -64, 64, 64, 64, -64, 64, -64, 64, -64, 64, 64, -64, -64, 64, -64, 64, 64, 64, -64, -64, -64, -64, -64, -64, -64, -64, -64, 64, -64, 64, -64, 64, -64, -64, -64, -64, 64, -64, 64, 64, -64, 64, 64, 64, 64, -64, -64, -64, -64, -64, -64, -64, -64, -64, -64, -64, -64, 64, 64, 64, -64, -64, 64, -64, -64, -64, 64, 64, 64, 64, 64, -64, 64, -64, -64, -64, 64, -64, -64, -64, -64, 64, 64, -64, 64, 64, 64, -64, 64, 64, 64, -64, -64, 64, 64, -64, 64, 64, -64, 64, -64, -64, 64, -64, -64, 64, 64, -64, 64, -64, -64, 64, 64, -64, -64, 64, 64, 64, -64, -64, -64, 64, -64, -64, -64, -64, -64, 64, -64, -64, 64, 64, -64, -64, -64, 64, -64, 64, -64, -64, 64, 64, -64, 64, 64, -64, 64, -64, -64, 64, 64, -64, 64, 64, 64, 64, 64, -64, -64, -64, -64, -64, -64, -64, -64, 64, 64, -64, 64, -64, -64, 64, -64, 64, 64, -64, -64, -64, -64, -64, 64, 64, 64, 64, 64, 64, 64, -64, 64, -64, -64, -64, 64, 64, 64, 64, -64, 64, 64, -64, 64, 64, 64, -64, 64, 64, 64, 64, 64, 64, 64, 64, 64, 64, 64, 64, 64, 64, 64, 64, 64, 64, 64, 64, 64, 64, -64, -64, -64, 64, 64, -64, -64, -64, 64, -64, -64, -64, -64, -64, -64, 64, 64, 64, 64, -64, 64, 64, 64, 64, -64, -64, -64, -64, -64, -64, 64, 64, -64, -64, 64, -64, -64, -64, -64, -64, -64, -64, -64, -64, -64, -64, -64, -64, 64, 64, 64, 64, 64, -64, 64, 64, 64, -64, -64, -64, -64, -64, -64, -64, -64, -64, -64, -64, -64, 64, 64, 64, -64, -64, 64, 64, 64, 64, 64, 64, 64, -64, -64, -64, -64, -64, -64, -64, -64, 64, -64, -64, -64, -64, -64, 64, -64, 64, 64, 64, -64, -64, 64, -64, 64, 64, 64, 64, 64, 64, 64, -64, -64, 64, 64, -64, -64, -64, -64, -64, -64, -64, -64, -64, 64, 64, -64, -64, 64, -64, 64, -64, -64, 64, -64, 64, -64, -64, 64, 64, -64, 64, -64, -64, -64, 64, -64, -64, -64, -64, 64, 64, -64, -64, -64, -64, -64, -64, -64, -64, 64, 64, -64, -64, -64, 64, -64, -64, -64, 64, 64, -64, -64, -64, -64, -64, -64, -64, -64, 64, 64, -64, -64, -64, -64, -64, -64, -64, -64, 64, 64, -64, 64, 64, -64, -64, -64, -64, 64, -64, -64, -64, -64, -64, -64, 64, 64, 64, -64, 64, -64, -64, -64, -64, 64, 64, 64, 64, 64, -64, -64, -64, -64, -64, 64, -64, 64, 64, -64, -64, -64, 64, 64, 64, -64, -64, -64, 64, 64, 64, 64, 64, -64, 64, 64, 64, 64, -64, 64, 64, -64, -64, 64, 64, -64, 64, -64, -64, -64, 64, -64, 64, 64, -64, 64, 64, 64, 64, 64, 64, -64, 64, 64, 64, 64, -64, 64, 64, -64, 64, 64, -64, -64, -64, -64, -64, 64, -64, 64, 64, -64, -64, 64, 64, 64, 64, 64, 64, 64, 64, 64, -64, -64, -64, -64, -64, 64, 64, -64, 64, -64, 64, 64, 64, 64, 64, -64, 64, 64, 64, 64, 64, 64, -64, 64, 64, 64, -64, -64, -64, -64, -64, -64, -64, -64, -64, -64, 64, -64, 64, 64, 64, 64, 64, 64, 64, 64, 64, 64, 64, 64, 64, 64, 64, 64, -64, -64, -64, -64, -64, -64, -64, -64, 64, 64, 64, 64, 64, 64, -64, -64, 64, 64, 64, 64, 64, 64, 64, 64, 64, 64, 64, 64, -64, -64, -64, -64, -64, -64, -64, -64, 64, 64, -64, 64, 64, -64, -64, -64, 64, 64, 64, 64, 64, 64, 64, 64, -64, -64, 64, 64, -64, -64, -64, -64, -64, 64, -64, 64, 64, -64, -64, -64, -64, 64, -64, 64, 64, 64, 64, 64, 64, 64, -64, -64, -64, -64, 64, -64, 64, 64, -64, -64, -64, -64, 64, 64, 64, -64, 64, 64, -64, 64, -64, 64, -64, 64, 64, 64, -64, -64, -64, -64, -64, -64, 64, 64, -64, 64, -64, 64, -64, 64, -64, 64, 64, -64, 64, -64, 64, 64, -64, -64, -64, 64, -64, -64, -64, -64, -64, -64, -64, -64, 64, 64, -64, 64, -64, -64, -64, 64, -64, 64, 64, -64, -64, -64, -64, 64, 64, -64, -64, -64, -64, -64, -64, -64, -64, -64, 64, 64, 64, 64, 64, -64, -64, -64, -64, -64, -64, 64, -64, -64, -64, 64, -64, 64, -64, 64, 64, -64, -64, -64, -64, -64, -64, 64, 64, 64, 64, 64, -64, -64, 64, -64, -64, -64, -64, -64, -64, -64, -64, -64, -64, -64, -64, -64, -64, 64, -64, -64, -64, -64, -64, 64, 64, 64, 64, 64, 64, 64, 64, -64, 64, 64, 64, -64, -64, 64, 64, -64, -64, -64, 64, 64, 64, -64, -64, 64, -64, -64, 64, -64, -64, 64, 64, 64, 64, -64, -64, -64, -64, 64, 64, -64, -64, 64, -64, 64, -64, 64, 64, 64, 64, 64, -64, -64, -64, -64, -64, -64, 64, -64, 64, 64, -64, -64, -64, 64, 64, -64, -64, 64, -64, -64, -64, 64, 64, 64, 64, 64, 64, 64, -64, -64, 64, -64, -64, -64, -64, -64, 64, -64, -64, -64, -64, -64, -64, -64, -64, 64, 64, 64, -64, -64, -64, 64, 64, 64, -64, 64, -64, -64, 64, -64, -64, 64, 64, -64, -64, 64, -64, 64, 64, 64, -64, 64, 64, 64, 64, 64, -64, 64, -64, 64, -64, 64, 64, 64, -64, -64, 64, 64, 64, -64, -64, -64, -64, -64, 64, 64, 64, -64, -64, 64, -64, 64, 64, 64, 64, 64, -64, -64, 64, 64, -64, 64, 64, 64, -64, -64, -64, -64, 64, 64, 64, -64, 64, -64, -64, 64, -64, -64, 64, 64, -64, -64, 64, 64, 64, 64, -64, 64, 64, 64, -64, -64, -64, -64, -64, 64, 64, 64, 64, 64, -64, 64, 64, -64, 64, 64, -64, -64, 64, -64, -64, -64, 64, 64, -64, -64, -64, 64, -64, 64, 64, -64, 64, -64, 64, 64, 64, 64, 64, 64, 64, 64, 64, 64, 64, 64, 64, -64, 64, 64, -64, -64, -64, -64, -64, 64, 64, 64, -64, -64, -64, -64, -64, 64, -64, 64, 64, 64, -64, 64, 64, -64, 64, 64, 64, -64, 64, -64, -64, 64, -64, -64, -64, -64, -64, -64, -64, -64, -64, 64, 64, -64, -64, 64, 64, -64, 64, 64, 64, 64, 64, -64, -64, -64, 64, -64, 64, -64, -64, -64, -64, -64, -64, -64, -64, -64, -64, 64, -64, -64, 64, -64, 64, 64, -64, 64, -64, 64, 64, -64, -64, -64, 64, -64, -64, -64, -64, 64, -64, -64, -64, -64, -64, 64, 64, 64, 64, 64, -64, -64, -64, 64, 64, -64, -64, -64, -64, -64, -64, 64, 64, 64, -64, -64, -64, -64, -64, -64, -64, -64, -64, -64, 64, -64, -64, -64, -64, -64, -64, 64, -64, -64, -64, -64, -64, -64, 64, -64, -64, 64, 64, -64, 64, -64, 64, -64, -64, -64, 64, -64, 64, -64, -64, 64, 64, -64, -64, 64, 64, -64, -64, -64, -64, -64, 64, 64, -64, -64, -64, 64, 64, -64, -64, -64, -64, -64, -64, -64, -64, -64, 64, -64, 64, 64, -64, 64, -64, 64, -64, -64, -64, 64, 64, 64, -64, -64, -64, -64, -64, -64, -64, -64, -64, -64, 64, 64, 64, -64, -64, 64, 64, 64, -64, 64, -64, 64, -64, -64, -64, 64, -64, -64, -64, 64, -64, -64, -64, 64, -64, -64, -64, 64, 64, 64, 64, -64, 64, 64, 64, 64, -64, -64, 64, 64, -64, 64, 64, -64, -64, 64, 64, -64, -64, -64, -64, -64, -64, -64, -64, -64, 64, -64, 64, -64, 64, 64, 64, -64, -64, -64, -64, 64, 64, 64, -64, 64, -64, 64, -64, 64, -64, -64, -64, 64, -64, -64, 64, -64, -64, -64, -64, 64, 64, 64, 64, 64, -64, -64, -64, -64, 64, -64, -64, -64, -64, -64, -64, 64, -64, 64, 64, -64, -64, -64, 64, 64, 64, -64, -64, 64, 64, 64, 64, 64, -64, -64, -64, -64, -64, 64, 64, 64, 64, -64, 64, -64, 64, 64, 64, -64, -64, 64, 64, 64, 64, 64, 64, 64, 64, 64, 64, 64, -64, -64, -64, -64, -64, -64, 64, 64, 64, -64, 64, -64, -64, 64, 64, 64, 64, 64, 64, -64, -64, 64, 64, 64, 64, 64, 64, 64, -64, -64, -64, -64, -64, 64, 64, 64, 64, 64, -64, -64, 64, 64, -64, 64, 64, -64, 64, 64, -64, 64, 64, 64, 64, 64, 64, -64, -64, -64, -64, -64, -64, 64, -64, -64, 64, -64, 64, 64, -64, 64, 64, -64, -64, 64, 64, -64, -64, 64, 64, 64, 64, 64, 64, -64, -64, -64, -64, -64, -64, -64, 64, -64, -64, 64, 64, 64, -64, 64, -64, -64, -64, -64, -64, -64, 64, 64, 64, -64, 64, 64, -64, -64, -64, -64, -64, -64, -64, 64, 64, -64, 64, -64, -64, -64, 64, 64, -64, 64, -64, -64, -64, -64, 64, 64, 64, -64, 64, -64, -64, -64, -64, -64, -64, -64, 64, -64, -64, -64, 64, 64, -64, 64, -64, 64, 64, 64, 64, -64, -64, -64, -64, -64, -64, -64, -64, -64, -64, -64, -64, -64, -64, 64, 64, 64, -64, 64, -64, -64, 64, -64, -64, -64, 64, 64, -64, 64, 64, -64, -64, 64, -64, -64, -64, -64, -64, -64, -64, -64, -64, 64, 64, 64, 64, 64, -64, 64, -64, -64, 64, 64, -64, -64, -64, 64, 64, 64, 64, 64, 64, -64, -64, -64, -64, -64, -64, -64, -64, -64, -64, -64, 64, 64, 64, 64, -64, 64, -64, 64, -64, 64, -64, 64, 64, 64, 64, -64, -64, -64, 64, -64, -64, -64, -64, 64, -64, -64, 64, 64, 64, 64, 64, 64, 64, 64, 64, -64, 64, 64, 64, 64, -64, 64, 64, 64, 64, 64, 64, -64, 64, -64, 64, -64, -64, -64, 64, 64, -64, 64, 64, 64, 64, -64, 64, 64, 64, -64, -64, -64, 64, 64, -64, 64, -64, 64, -64, -64, 64, -64, 64, -64, 64, 64, 64, -64, -64, -64, 64, 64, 64, 64, 64, 64, -64, -64, -64, 64, 64, -64, 64, 64, 64, -64, 64, 64, -64, 64, 64, 64, 64, 64, 64, 64, -64, -64, 64, 64, -64, 64, -64, 64, -64, -64, -64, -64, -64, 64, 64, -64, -64, 64, 64, -64, 64, -64, -64, -64, -64, -64, -64, 64, 64, -64, 64, -64, -64, 64, 64, 64, -64, -64, 64, 64, 64, 64, -64, -64, 64, -64, -64, -64, -64, -64, -64, -64, 64, -64, -64, -64, 64, 64, -64, -64, -64, -64, -64, 64, -64, -64, 64, -64, 64, 64, -64, 64, -64, -64, -64, 64, 64, 64, -64, -64, -64, 64, 64, -64, -64, -64, -64, 64, -64, -64, -64, 64, -64, 64, 64, -64, -64, -64, -64, -64, -64, 64, 64, 64, 64, 64, -64, -64, -64, -64, -64, -64, -64, 64, 64, -64, 64, 64, 64, 64, -64, -64, 64, -64, -64, -64, -64, -64, -64, -64, 64, 64, -64, -64, -64, -64, -64, -64, -64, -64, -64, 64, -64, -64, 64, -64, 64, 64, 64, 64, -64, -64, -64, -64, 64, 64, 64, -64, 64, -64, 64, 64, 64, -64, -64, -64, -64, -64, -64, -64, -64, 64, 64, -64, -64, -64, 64, -64, 64, 64, -64, 64, 64, -64, -64, 64, -64, -64, 64, 64, -64, -64, 64, 64, -64, -64, -64, -64, 64, -64, -64, 64, -64, -64, 64, -64, -64, -64, -64, 64, 64, -64, -64, -64, -64, 64, 64, 64, -64, -64, 64, -64, 64, -64, 64, -64, 64, -64, -64, -64, 64, -64, -64, -64, 64, -64, -64, -64, 64, 64, -64, 64, 64, 64, 64, -64, -64, -64, 64, -64, -64, -64, -64, -64, 64, 64, 64, -64, -64, -64, -64, -64, 64, -64, -64, -64, 64, -64, -64, -64, -64, 64, 64, 64, -64, -64, -64, 64, -64, -64, -64, 64, 64, 64, 64, 64, -64, -64, -64, -64, -64, 64, -64, -64, -64, -64, -64, -64, -64, 64, -64, -64, -64, -64, -64, -64, -64, -64, 64, 64, -64, 64, 64, -64, 64, -64, -64, -64, 64, -64, -64, -64, -64, -64, -64, -64, -64, 64, -64, -64, -64, 64, -64, -64, -64, -64, 64, 64, 64, 64, -64, 64, 64, -64, -64, -64, -64, -64, -64, -64, -64, -64, -64, 64, -64, -64, -64, -64, -64, -64, 64, -64, -64, -64, -64, 64, 64, 64, -64, 64, -64, -64, -64, -64, -64, -64, -64, -64, -64, -64, 64, 64, 64, -64, 64, 64, 64, 64, -64, -64, -64, -64, 64, 64, 64, -64, -64, -64, -64, 64, -64, -64, -64, -64, -64, -64, -64, 64, 64, 64, -64, 64, -64, -64, 64, -64, -64, -64, -64, -64, -64, 64, 64, 64, 64, 64, -64, 64, -64, -64, -64, -64, -64, -64, 64, 64, 64, 64, 64, -64, -64, 64, -64, -64, -64, -64, -64, 64, -64, 64, 64, 64, -64, -64, -64, -64, -64, -64, -64, -64, -64, 64, 64, 64, 64, 64, -64, -64, -64, -64, -64, -64, -64, 64, -64, 64, 64, 64, 64, -64, -64, -64, -64, -64, 64, -64, -64, -64, -64, 64, 64, 64, 64, 64, -64, -64, -64, -64, -64, -64, -64, 64, 64, 64, 64, 64, -64, 64, -64, 64, -64, -64, -64, -64, -64, -64, 64, 64, 64, -64, 64, 64, -64, -64, -64, -64, -64, -64, -64, -64, 64, 64, 64, 64, -64, -64, -64, -64, 64, 64, -64, -64, -64, -64, -64, -64, -64, -64, 64, 64, -64, -64, -64, -64, -64, 64, -64, 64, 64, 64, -64, 64, -64, 64, -64, 64, 64, 64, -64, 64, -64, -64, -64, -64, -64, -64, -64, -64, -64, -64, -64, -64, -64, 64, -64, 64, 64, 64, -64, -64, -64, -64, 64, 64, 64, -64, -64, -64, -64, -64, 64, -64, -64, -64, 64, 64, -64, 64, -64, -64, -64, 64, -64, 64, 64, 64, -64, -64, -64, 64, -64, 64, 64, 64, -64, -64, -64, -64, -64, -64, -64, -64, 64, 64, 64, 64, -64, -64, -64, -64, -64, -64, 64, 64, 64, -64, 64, 64, 64, -64, -64, 64, -64, -64, -64, 64, 64, -64, 64, -64, 64, 64, 64, 64, -64, -64, -64, -64, -64, -64, -64, -64, -64, 64, -64, 64, 64, 64, 64, -64, -64, 64, 64, -64, 64, 64, 64, 64, -64, -64, 64, -64, 64, 64, -64, -64, 64, -64, -64, -64, -64, 64, -64, -64, -64, 64, -64, -64, 64, -64, 64, 64, 64, -64, -64, -64, 64, -64, 64, 64, -64, 64, -64, 64, 64, 64, 64, 64, 64, 64, 64, 64, -64, 64, 64, -64, 64, -64, -64, -64, -64, -64, -64, 64, 64, -64, 64, -64, 64, 64, -64, 64, 64, -64, 64, -64, -64, -64, -64, -64, 64, 64, -64, -64, -64, 64, 64, -64, -64, -64, -64, -64, -64, 64, 64, -64, 64, 64, -64, -64, -64, -64, 64, -64, -64, 64, 64, 64, 64, 64, 64, 64, -64, -64, 64, 64, 64, -64, -64, 64, 64, 64, 64, 64, -64, -64, 64, -64, -64, -64, 64, 64, 64, 64, -64, -64, 64, 64, 64, -64, 64, -64, 64, 64, 64, -64, 64, 64, -64, 64, -64, 64, -64, -64, -64, -64, 64, 64, 64, 64, -64, 64, -64, 64, 64, -64, -64, 64, 64, 64, 64, 64, 64, -64, 64, 64, 64, 64, 64, -64, -64, 64, -64, -64, 64, -64, -64, -64, -64, -64, 64, -64, 64, 64, 64, 64, 64, 64, -64, 64, -64, 64, 64, -64, -64, -64, -64, -64, -64, 64, -64, 64, 64, 64, 64, -64, 64, 64, 64, -64, -64, -64, 64, -64, 64, -64, 64, 64, 64, -64, -64, 64, 64, -64, -64, -64, -64, 64, -64, -64, -64, -64, 64, 64, 64, 64, 64, 64, 64, -64, -64, 64, -64, 64, 64, 64, 64, -64, -64, -64, -64, -64, -64, -64, -64, 64, -64, -64, -64, -64, -64, 64, 64, -64, 64, -64, -64, -64, 64, 64, 64, 64, 64, 64, -64, 64, 64, 64, -64, -64, -64, -64, 64, 64, -64, -64, -64, -64, 64, -64, 64, 64, -64, 64, 64, -64, 64, 64, 64, 64, 64, 64, 64, 64, -64, -64, -64, -64, -64, -64, -64, -64, -64, -64, -64, -64, -64, 64, 64, -64, -64, -64, -64, -64, -64, -64, 64, 64, 64, 64, -64, 64, -64, -64, -64, -64, -64, -64, -64, 64, -64, -64, -64, 64, 64, 64, -64, 64, -64, -64, 64, 64, -64, -64, -64, 64, 64, -64, -64, 64, -64, -64, -64, -64, -64, -64, -64, -64, -64, -64, -64, 64, 64, -64, -64, 64, -64, -64, 64, 64, 64, -64, -64, 64, 64, 64, 64, 64, -64, -64, -64, -64, -64, -64, -64, -64, -64, -64, -64, 64, -64, 64, 64, -64, 64, 64, -64, -64, 64, 64, 64, -64, 64, -64, 64, 64, -64, -64, -64, -64, -64, -64, 64, 64, -64, -64, 64, -64, 64, -64, 64, -64, 64, -64, -64, 64, 64, 64, -64, -64, 64, 64, -64, 64, -64, -64, -64, -64, -64, -64, 64, 64, 64, -64, -64, 64, 64, -64, 64, 64, -64, -64, -64, 64, 64, 64, 64, 64, -64, 64, -64, 64, 64, -64, -64, -64, -64, -64, -64, 64, 64, -64, -64, -64, 64, 64, 64, 64, -64, -64, -64, -64, 64, 64, -64, -64, -64, 64, -64, -64, 64, 64, 64, 64, -64, -64, -64, -64, -64, -64, -64, -64, 64, 64, 64, 64, -64, 64, -64, -64, 64, 64, -64, -64, -64, -64, -64, 64, 64, 64, -64, 64, -64, -64, -64, -64, -64, -64, -64, -64, 64, 64, 64, 64, -64, -64, 64, -64, 64, -64, -64, -64, -64, -64, -64, -64, -64, 64, 64, 64, -64, -64, 64, -64, 64, -64, -64, -64, 64, 64, 64, 64, -64, -64, 64, -64, 64, -64, -64, -64, -64, -64, -64, -64, -64, 64, -64, 64, -64, -64, -64, -64, 64, -64, -64, -64, -64, -64, 64, -64, -64, 64, 64, -64, 64, -64, -64, -64, -64, -64, -64, -64, -64, -64, -64, -64, -64, 64, -64, -64, -64, 64, -64, 64, 64, -64, -64, -64, -64, -64, -64, 64, 64, -64, -64, -64, -64, -64, 64, -64, -64, -64, -64, -64, -64, -64, -64, 64, 64, 64, -64, 64, 64, 64, -64, 64, 64, -64, 64, 64, 64, 64, 64, -64, -64, 64, -64, -64, -64, -64, -64, -64, -64, 64, -64, 64, 64, -64, 64, -64, -64, 64, -64, -64, 64, -64, 64, 64, -64, 64, -64, 64, -64, -64, 64, 64, -64, -64, -64, 64, -64, -64, -64, 64, -64, -64, 64, 64, 64, -64, -64, 64, -64, -64, -64, 64, -64, 64, -64, 64, -64, 64, 64, 64, 64, -64, -64, -64, -64, -64, -64, -64, -64, -64, 64, -64, 64, 64, -64, -64, 64, -64, -64, -64, 64, 64, 64, 64, -64, -64, -64, 64, -64, -64, -64, -64, -64, -64, -64, -64, -64, -64, -64, 64, -64, 64, -64, -64, 64, 64, -64, 64, -64, 64, 64, -64, -64, -64, -64, -64, -64, 64, -64, 64, -64, -64, -64, -64, -64, -64, -64, -64, -64, 64, 64, 64, -64, 64, 64, -64, 64, -64, 64, -64, 64, -64, -64, -64, -64, 64, -64, -64, -64, -64, -64, -64, 64, -64, 64, -64, -64, 64, 64, 64, 64, 64, 64, 64, 64, 64, -64, 64, 64, -64, 64, 64, -64, -64, 64, 64, 64, 64, 64, -64, -64, -64, 64, 64, 64, 64, -64, 64, -64, -64, -64, -64, 64, -64, 64, -64, 64, 64, 64, -64, 64, -64, 64, -64, 64, -64, -64, -64, -64, 64, -64, -64, -64, 64, 64, -64, -64, -64, -64, -64, 64, -64, -64, 64, 64, 64, -64, -64, 64, -64, -64, -64, 64, -64, -64, -64, -64, 64, 64, 64, 64, 64, -64, -64, -64, -64, 64, -64, 64, 64, -64, 64, 64, -64, -64, 64, 64, -64, -64, 64, -64, -64, 64, -64, 64, -64, 64, -64, -64, 64, 64, 64, 64, 64, 64, -64, -64, 64, 64, -64, -64, -64, 64, -64, 64, -64, 64, 64, 64, 64, 64, -64, 64, 64, 64, 64, 64, 64, -64, 64, -64, -64, 64, -64, -64, -64, 64, 64, -64, -64, 64, 64, -64, -64, 64, 64, 64, 64, 64, 64, -64, 64, 64, -64, 64, 64, 64, 64, 64, 64, 64, -64, 64, 64, -64, 64, 64, -64, 64, -64, 64, -64, -64, 64, 64, 64, 64, 64, -64, 64, 64, 64, 64, 64, -64, -64, -64, 64, -64, 64, 64, -64, 64, -64, 64, 64, -64, 64, -64, 64, 64, 64, 64, -64, 64, 64, 64, 64, 64, 64, 64, 64, 64, -64, 64, 64, 64, -64, -64, 64, 64, 64, -64, 64, -64, -64, -64, 64, 64, 64, -64, 64, 64, -64, 64, 64, 64, 64, 64, 64, 64, 64, 64, -64, -64, -64, 64, 64, -64, -64, -64, 64, 64, 64, 64, 64, 64, 64, 64, 64, -64, -64, 64, 64, 64, 64, -64, -64, -64, -64, 64, 64, 64, 64, 64, -64, -64, -64, -64, -64, 64, 64, 64, 64, 64, 64, 64, 64, 64, -64, 64, 64, 64, 64, -64, -64, -64, -64, -64, -64, 64, -64, 64, 64, 64, -64, -64, 64, 64, 64, 64, 64, 64, 64, 64, 64, 64, -64, -64, 64, -64, -64, -64, 64, 64, -64, 64, -64, -64, -64, 64, -64, 64, -64, 64, -64, 64, 64, -64, 64, 64, 64, -64, 64, 64, 64, -64, 64, 64, -64, 64, 64, 64, -64, 64, 64, -64, 64, -64, 64, 64, 64, -64, -64, -64, 64, 64, 64, 64, 64, 64, -64, -64, 64, -64, 64, -64, 64, -64, 64, -64, 64, 64, 64, 64, -64, -64, 64, 64, 64, -64, -64, -64, -64, 64, -64, 64, 64, -64, 64, 64, -64, -64, 64, -64, 64, 64, 64, 64, 64, 64, -64, -64, 64, -64, 64, -64, 64, 64, 64, 64, -64, -64, 64, 64, -64, -64, 64, 64, -64, 64, -64, -64, 64, 64, -64, -64, 64, -64, -64, -64, 64, 64, 64, 64, 64, 64, -64, -64, -64, 64, 64, -64, 64, 64, 64, 64, -64, -64, 64, 64, 64, 64, 64, 64, 64, 64, 64, -64, 64, 64, -64, 64, 64, 64, 64, 64, 64, 64, 64, -64, 64, 64, 64, 64, -64, -64, 64, 64, 64, 64, 64, 64, -64, 64, -64, -64, -64, 64, -64, 64, 64, 64, 64, 64, 64, -64, 64, 64, -64, -64, -64, -64, -64, 64, 64, 64, 64, 64, -64, -64, 64, 64, 64, 64, 64, -64, -64, -64, -64, 64, -64, 64, 64, 64, 64, 64, -64, 64, -64, -64, -64, -64, 64, 64, 64, 64, 64, -64, 64, -64, -64, -64, 64, -64, 64, -64, 64, 64, 64, -64, 64, -64, 64, 64, 64, 64, 64, 64, -64, -64, -64, -64, 64, -64, 64, -64, -64, -64, -64, -64, 64, -64, -64, -64, -64, 64, 64, 64, 64, 64, -64, 64, 64, 64, -64, 64, 64, 64, 64, 64, -64, 64, 64, 64, -64, -64, -64, 64, 64, -64, -64, -64, -64, -64, 64, 64, 64, 64, 64, 64, -64, -64, 64, -64, 64, 64, -64, -64, -64, 64, -64, -64, -64, -64, 64, -64, 64, 64, 64, 64, -64, -64, 64, 64, 64, 64, -64, 64, 64, 64, 64, -64, -64, 64, -64, 64, -64, 64, -64, -64, 64, 64, -64, 64, 64, -64, -64, -64, -64, -64, 64, 64, 64, 64, 64, 64, 64, -64, 64, 64, 64, 64, 64, 64, 64, -64, 64, 64, -64, 64, -64, -64, -64, 64, -64, 64, 64, 64, 64, 64, -64, 64, 64, 64, 64, -64, -64, -64, -64, 64, 64, -64, 64, -64, 64, -64, 64, 64, -64, 64, 64, -64, -64, 64, 64, 64, 64, -64, 64, 64, -64, 64, -64, -64, 64, 64, 64, -64, 64, -64, 64, -64, -64, 64, -64, 64, 64, -64, 64, -64, -64, 64, 64, -64, -64, 64, 64, 64, -64, 64, -64, -64, -64, 64, 64, -64, -64, 64, 64, -64, 64, -64, 64, 64, -64, -64, 64, 64, 64, -64, 64, 64, 64, -64, 64, -64, -64, 64, -64, 64, -64, 64, 64, 64, -64, 64, 64, -64, -64, -64, -64, -64, -64, -64, 64, 64, -64, -64, -64, 64, 64, -64, -64, 64, -64, -64, 64, -64, 64, 64, 64, 64, 64, 64, -64, 64, -64, -64, 64, -64, 64, -64, 64, 64, -64, 64, 64, 64, -64, 64, 64, 64, -64, -64, -64, 64, -64, -64, -64, 64, -64, 64, -64, 64, 64, 64, 64, -64, -64, -64, 64, -64, -64, 64, -64, -64, -64, -64, 64, 64, 64, -64, -64, 64, 64, -64, 64, 64, 64, 64, -64, 64, 64, 64, 64, 64, -64, 64, -64, -64, -64, -64, 64, 64, 64, 64, -64, -64, -64, -64, 64, 64, 64, -64, 64, 64, -64, -64, -64, 64, 64, 64, 64, -64, -64, -64, -64, -64, -64, -64, 64, 64, -64, 64, 64, 64, -64, -64, 64, -64, -64, 64, 64, -64, 64, 64, -64, 64, -64, 64, -64, -64, -64, -64, 64, 64, 64, -64, -64, -64, -64, -64, -64, 64, -64, -64, 64, -64, -64, -64, -64, -64, 64, -64, -64, 64, -64, 64, -64, -64, -64, -64, -64, -64, -64, 64, -64, 64, -64, -64, 64, -64, -64, 64, -64, -64, -64, -64, 64, 64, 64, -64, -64, 64, -64, 64, 64, 64, -64, 64, -64, 64, 64, 64, 64, -64, 64, 64, 64, 64, 64, -64, 64, -64, 64, 64, 64, -64, 64, 64, 64, 64, 64, 64, -64, -64, 64, 64, -64, 64, 64, -64, 64, 64, -64, -64, -64, 64, -64, -64, 64, 64, 64, 64, -64, 64, 64, 64, 64, 64, 64, -64, -64, -64, 64, 64, 64, -64, -64, -64, 64, 64, 64, -64, 64, 64, -64, -64, 64, -64, 64, -64, 64, -64, 64, 64, 64, -64, -64, 64, 64, -64, 64, -64, 64, 64, 64, -64, -64, -64, 64, 64, 64, -64, -64, 64, 64, 64, 64, 64, 64, -64, 64, -64, -64, 64, -64, 64, 64, 64, 64, -64, 64, -64, 64, 64, -64, 64, -64, 64, 64, -64, 64, -64, 64, 64, 64, -64, 64, 64, -64, -64, -64, 64, -64, 64, -64, 64, -64, 64, -64, 64, 64, 64, 64, 64, -64, 64, -64, 64, 64, -64, 64, 64, 64, -64, -64, -64, 64, 64, 64, -64, 64, 64, 64, 64, -64, 64, -64, 64, 64, -64, 64, -64, 64, -64, -64, 64, 64, 64, 64, 64, 64, 64, -64, 64, 64, 64, 64, -64, 64, 64, -64, -64, -64, -64, 64, 64, -64, 64, 64, -64, 64, 64, -64, 64, 64, -64, -64, 64, 64, 64, 64, 64, 64, 64, 64, 64, 64, 64, 64, -64, 64, 64, -64, 64, -64, 64, 64, 64, -64, 64, 64, 64, 64, 64, 64, -64, 64, 64, 64, 64, 64, 64, -64, -64, -64, 64, 64, 64, -64, 64, -64, -64, 64, -64, 64, 64, -64, 64, 64, 64, 64, 64, 64, 64, 64, -64, 64, 64, -64, 64, 64, -64, -64, -64, 64, -64, -64, 64, 64, 64, -64, -64, 64, 64, 64, 64, 64, 64, 64, -64, 64, 64, 64, 64, 64, 64, -64, -64, 64, 64, 64, -64, 64, -64, 64, 64, -64, 64, 64, 64, 64, -64, 64, 64, 64, 64, 64, 64, 64, 64, 64, 64, 64, 64, 64, -64, -64, 64, 64, -64, 64, -64, -64, 64, 64, 64, -64, 64, 64, -64, -64, -64, 64, 64, 64, 64, -64, 64, 64, -64, 64, -64, 64, 64, -64, -64, -64, 64, -64, 64, -64, 64, -64, 64, -64, -64, -64, 64, -64, 64, -64, 64, 64, 64, 64, 64, 64, -64, 64, 64, -64, 64, 64, 64, -64, 64, 64, -64, -64, 64, -64, -64, 64, 64, 64, -64, -64, -64, -64, 64, 64, 64, 64, 64, 64, 64, -64, 64, -64, 64, -64, 64, -64, 64, 64, 64, 64, -64, 64, -64, -64, -64, -64, -64, -64, -64, -64, -64, -64, -64, 64, 64, 64, -64, -64, -64, -64, -64, -64, 64, 64, 64, 64, 64, -64, -64, -64, -64, -64, 64, -64, 64, 64, 64, -64, 64, 64, -64, -64, -64, -64, 64, -64, 64, 64, -64, -64, 64, -64, -64, -64, 64, -64, 64, -64, -64, -64, 64, -64, 64, -64, -64, -64, 64, 64, 64, 64, 64, 64, 64, 64, -64, 64, 64, 64, 64, -64, 64, 64, 64, -64, 64, 64, -64, 64, -64, 64, 64, 64, 64, 64, 64, 64, 64, 64, 64, 64, -64, 64, -64, 64, 64, -64, -64, -64, 64, -64, -64, 64, 64, 64, -64, -64, 64, 64, -64, -64, 64, -64, 64, -64, -64, -64, 64, 64, 64, -64, -64, 64, -64, 64, 64, -64, 64, -64, -64, -64, 64, -64, 64, -64, -64, 64, 64, -64, -64, -64, -64, -64, -64, 64, 64, 64, 64, 64, -64, 64, 64, 64, -64, -64, -64, -64, 64, 64, -64, -64, -64, 64, -64, -64, 64, -64, -64, -64, 64, 64, -64, -64, 64, -64, 64, -64, -64, -64, -64, -64, 64, 64, -64, -64, -64, 64, 64, -64, 64, 64, 64, 64, 64, 64, 64, 64, 64, 64, 64, -64, 64, -64, 64, -64, -64, 64, -64, 64, -64, 64, -64, 64, 64, -64, -64, -64, 64, 64, -64, -64, -64, 64, 64, 64, -64, 64, 64, -64, 64, -64, 64, 64, -64, -64, 64, -64, 64, 64, -64, -64, 64, -64, 64, -64, 64, -64, -64, 64, 64, -64, -64, 64, 64, 64, 64, -64, -64, -64, -64, 64, -64, -64, -64, 64, -64, -64, -64, -64, 64, -64, -64, -64, -64, 64, -64, 64, -64, 64, 64, 64, -64, -64, 64, 64, 64, -64, 64, -64, -64, -64, 64, -64, -64, -64, 64, 64, -64, -64, 64, -64, -64, -64, -64, -64, -64, -64, -64, -64, -64, 64, -64, 64, -64, -64, -64, -64, -64, -64, -64, 64, 64, -64, 64, -64, 64, 64, -64, -64, 64, 64, 64, 64, 64, -64, 64, 64, -64, -64, -64, 64, 64, -64, -64, -64, -64, -64, 64, 64, 64, 64, 64, -64, 64, 64, 64, -64, -64, -64, -64, -64, -64, -64, -64, -64, 64, -64, -64, -64, -64, -64, 64, 64, -64, -64, 64, 64, -64, 64, -64, 64, -64, -64, 64, 64, -64, 64, -64, -64, -64, -64, 64, 64, 64, 64, -64, -64, -64, -64, -64, 64, -64, -64, 64, -64, 64, 64, -64, -64, -64, -64, -64, -64, -64, 64, 64, 64, -64, -64, 64, -64, 64, 64, 64, -64, -64, -64, -64, -64, -64, -64, -64, -64, -64, 64, 64, -64, -64, -64, 64, -64, -64, 64, -64, -64, -64, 64, 64, -64, -64, -64, -64, -64, 64, -64, -64, 64, -64, -64, -64, -64, 64, 64, -64, -64, 64, -64, -64, 64, -64, -64, -64, -64, -64, -64, -64, -64, -64, 64, -64, -64, -64, -64, -64, -64, 64, -64, -64, 64, -64, 64, -64, -64, -64, 64, 64, 64, -64, 64, -64, -64, 64, -64, 64, 64, -64, -64, -64, -64, -64, -64, -64, -64, -64, 64, -64, 64, 64, 64, -64, -64, 64, -64, -64, 64, -64, -64, 64, 64, -64, -64, -64, -64, 64, 64, -64, -64, -64, 64, -64, 64, 64, 64, -64, -64, 64, -64, 64, -64, 64, -64, -64, 64, -64, -64, -64, 64, -64, -64, -64, -64, -64, -64, -64, -64, -64, -64, -64, -64, 64, -64, -64, 64, 64, 64, 64, 64, 64, 64, 64, -64, -64, 64, -64, 64, -64, -64, -64, 64, -64, -64, -64, -64, -64, -64, -64, 64, -64, -64, -64, 64, -64, -64, -64, -64, 64, -64, 64, 64, 64, -64, -64, 64, -64, -64, -64, -64, -64, -64, -64, -64, -64, -64, 64, -64, -64, -64, -64, 64, 64, -64, 64, -64, -64, 64, -64, -64, -64, -64, 64, 64, 64, -64, 64, -64, -64, -64, -64, -64, -64, 64, -64, -64, -64, -64, -64, -64, 64, 64, 64, -64, -64, -64, -64, -64, -64, -64, 64, -64, -64, 64, -64, -64, 64, -64, 64, -64, -64, -64, -64, -64, -64, 64, 64, 64, -64, -64, -64, -64, 64, -64, 64, -64, -64, -64, 64, -64, 64, -64, -64, 64, -64, -64, 64, 64, -64, 64, 64, -64, -64, -64, -64, 64, -64, -64, -64, 64, -64, 64, -64, -64, 64, -64, -64, -64, -64, -64, -64, -64, -64, 64, -64, 64, -64, -64, -64, -64, -64, -64, -64, -64, -64, 64, -64, 64, -64, -64, -64, 64, -64, 64, 64, 64, 64, 64, -64, -64, -64, 64, 64, -64, -64, -64, 64, -64, -64, -64, -64, -64, -64, -64, -64, 64, 64, -64, 64, 64, -64, -64, -64, -64, -64, 64, -64, -64, 64, -64, -64, 64, -64, -64, -64, -64, 64, 64, 64, -64, 64, 64, -64, 64, -64, -64, 64, 64, -64, 64, 64, 64, -64, 64, 64, -64, -64, -64, 64, 64, -64, -64, -64, 64, -64, 64, -64, -64, 64, 64, -64, -64, 64, -64, -64, 64, 64, -64, 64, -64, -64, 64, -64, 64, -64, -64, -64, -64, -64, -64, 64, -64, 64, -64, -64, 64, -64, -64, -64, 64, 64, 64, -64, 64, -64, -64, 64, 64, 64, -64, 64, -64, -64, 64, -64, 64, 64, 64, -64, 64, -64, -64, 64, 64, -64, -64, -64, 64, -64, -64, 64, -64, 64, 64, -64, -64, 64, -64, 64, 64, 64, 64, 64, 64, 64, -64, 64, 64, 64, -64, 64, -64, 64, -64, -64, 64, -64, -64, -64, -64, -64, 64, 64, -64, -64, -64, 64, -64, 64, -64, -64, 64, -64, -64, -64, -64, 64, -64, 64, 64, -64, -64, 64, -64, -64, -64, -64, -64, 64, 64, -64, -64, 64, -64, 64, -64, 64, 64, 64, 64, 64, -64, 64, -64, -64, -64, -64, -64, 64, -64, -64, 64, 64, 64, 64, 64, 64, 64, -64, 64, -64, -64, 64, -64, 64, -64, 64, 64, -64, 64, 64, 64, 64, -64, 64, -64, 64, 64, -64, -64, -64, -64, 64, -64, 64, 64, 64, 64, 64, 64, 64, 64, -64, 64, -64, 64, -64, -64, 64, 64, -64, -64, 64, -64, 64, 64, -64, -64, 64, -64, -64, -64, -64, 64, -64, 64, -64, -64, 64, 64, 64, 64, -64, -64, -64, -64, 64, 64, 64, 64, 64, 64, 64, 64, -64, -64, 64, -64, -64, -64, 64, 64, -64, 64, -64, -64, -64, -64, -64, 64, 64, 64, -64, -64, 64, 64, 64, 64, 64, 64, 64, 64, 64, 64, 64, 64, 64, -64, -64, -64, -64, -64, -64, -64, -64, -64, -64, -64, -64, 64, 64, 64, 64, 64, 64, 64, 64, 64, 64, 64, 64, 64, 64, 64, -64, 64, 64, -64, 64, -64, -64, -64, -64, -64, -64, -64, -64, 64, 64, -64, 64, 64, 64, 64, 64, 64, 64, 64, 64, 64, 64, -64, -64, 64, 64, 64, -64, -64, -64, -64, -64, 64, 64, -64, 64, 64, 64, 64, 64, -64, 64, 64, 64, 64, -64, 64, 64, 64, -64, 64, -64, -64, -64, 64, 64, -64, -64, 64, 64, 64, 64, -64, 64, 64, 64, -64, -64, -64, 64, 64, 64, -64, -64, 64, 64, 64, -64, 64, 64, -64, 64, 64, 64, -64, 64, 64, 64, 64, 64, 64, 64, -64, -64, -64, 64, -64, 64, -64, 64, -64, -64, 64, 64, 64, 64, 64, -64, -64, 64, -64, 64, 64, 64, 64, 64, 64, 64, 64, 64, -64, 64, -64, 64, -64, -64, 64, 64, -64, 64, 64, 64, 64, 64, -64, -64, -64, -64, -64, -64, 64, 64, 64, 64, 64, -64, 64, 64, 64, 64, 64, -64, -64, -64, 64, -64, 64, 64, 64, 64, 64, 64, 64, 64, -64, -64, -64, -64, -64, -64, -64, 64, 64, 64, 64, 64, 64, 64, 64, -64, 64, 64, -64, -64, 64, -64, 64, -64, -64, 64, -64, 64, -64, -64, -64, 64, -64, -64, -64, 64, 64, 64, 64, 64, 64, 64, 64, 64, -64, 64, 64, -64, 64, -64, -64, -64, -64, 64, 64, -64, -64, -64, 64, -64, -64, -64, -64, -64, -64, 64, 64, 64, 64, 64, -64, 64, 64, 64, -64, -64, -64, -64, -64, 64, 64, 64, 64, 64, 64, -64, 64, -64, -64, -64, 64, -64, 64, 64, 64, 64, 64, 64, 64, -64, 64, -64, 64, -64, 64, -64, 64, 64, 64, 64, -64, 64, 64, -64, 64, -64, -64, 64, 64, 64, 64, 64, 64, 64, 64, 64, -64, 64, 64, -64, -64, -64, -64, -64, -64, -64, -64, 64, 64, -64, -64, 64, -64, -64, -64, 64, 64, 64, 64, 64, 64, 64, 64, -64, -64, -64, -64, -64, -64, -64, -64, 64, -64, -64, 64, -64, 64, -64, -64, 64, 64, -64, 64, 64, 64, 64, 64, 64, -64, -64, 64, -64, 64, 64, 64, 64, 64, -64, -64, 64, 64, 64, -64, -64, -64, -64, 64, 64, 64, 64, 64, 64, 64, 64, 64, 64, -64, -64, -64, -64, -64, 64, -64, 64, 64, -64, 64, 64, 64, 64, 64, 64, -64, -64, -64, 64, -64, 64, 64, 64, 64, 64, 64, -64, 64, -64, -64, -64, -64, -64, 64, 64, 64, 64, 64, 64, 64, 64, 64, 64, 64, 64, 64, 64, -64, 64, 64, 64, 64, 64, -64, -64, 64, 64, -64, -64, 64, 64, 64, 64, 64, 64, 64, 64, -64, 64, 64, -64, 64, -64, -64, 64, 64, 64, -64, 64, 64, -64, -64, -64, 64, 64, 64, 64, 64, 64, 64, 64, 64, 64, -64, 64, 64, -64, 64, 64, 64, 64, -64, 64, -64, -64, -64, 64, 64, -64, 64, 64, 64, 64, 64, -64, 64, 64, 64, 64, 64, 64, 64, 64, 64, 64, 64, -64, 64, -64, 64, -64, -64, -64, 64, 64, 64, -64, -64, 64, 64, 64, -64, -64, 64, 64, -64, 64, -64, 64, -64, -64, 64, 64, -64, -64, -64, -64, 64, 64, 64, -64, -64, 64, 64, -64, 64, 64, 64, -64, 64, 64, -64, -64, -64, 64, 64, 64, -64, -64, -64, 64, -64, -64, 64, 64, 64, 64, 64, -64, 64, -64, 64, -64, 64, 64, 64, 64, -64, -64, 64, 64, 64, 64, -64, -64, -64, -64, 64, 64, 64, -64, -64, -64, 64, 64, -64, 64, -64, -64, 64, 64, -64, -64, 64, 64, 64, 64, 64, -64, 64, 64, 64, -64, 64, -64, -64, 64, 64, -64, 64, -64, -64, 64, 64, 64, 64, 64, 64, -64, 64, -64, -64, 64, 64, 64, 64, 64, -64, -64, -64, 64, -64, 64, -64, 64, 64, 64, -64, -64, 64, -64, -64, 64, -64, -64, -64, 64, -64, 64, -64, -64, -64, -64, -64, 64, 64, 64, -64, 64, -64, -64, -64, -64, -64, -64, 64, -64, -64, -64, -64, -64, -64, -64, 64, -64, -64, -64, -64, -64, -64, -64, -64, -64, -64, -64, -64, -64, 64, -64, -64, -64, 64, 64, 64, -64, 64, 64, 64, -64, -64, -64, -64, -64, -64, 64, 64, 64, -64, -64, 64, -64, -64, -64, -64, 64, -64, -64, -64, -64, -64, 64, 64, -64, 64, 64, -64, -64, -64, -64, 64, -64, -64, -64, 64, 64, -64, -64, 64, -64, 64, -64, 64, -64, 64, 64, -64, -64, -64, -64, 64, -64, -64, -64, 64, -64, -64, 64, -64, -64, 64, 64, 64, 64, -64, 64, -64, -64, -64, -64, 64, 64, 64, 64, -64, -64, 64, 64, 64, 64, 64, 64, 64, -64, -64, 64, -64, 64, 64, -64, 64, 64, -64, -64, -64, -64, 64, -64, 64, 64, 64, -64, 64, -64, -64, 64, -64, -64, 64, 64, 64, 64, 64, -64, 64, -64, -64, -64, 64, -64, -64, 64, -64, 64, 64, -64, 64, -64, 64, 64, 64, 64, 64, -64, -64, -64, -64, -64, -64, -64, -64, 64, -64, -64, -64, 64, -64, 64, -64, -64, -64, -64, -64, 64, -64, -64, 64, 64, 64, 64, 64, 64, 64, 64, 64, 64, 64, -64, -64, 64, 64, -64, 64, 64, -64, 64, -64, -64, -64, 64, -64, -64, -64, 64, -64, -64, -64, -64, 64, 64, -64, -64, 64, -64, -64, -64, -64, 64, -64, -64, -64, 64, -64, -64, -64, -64, 64, -64, 64, -64, 64, -64, -64, 64, 64, 64, -64, -64, -64, 64, 64, 64, 64, -64, -64, 64, 64, -64, 64, -64, -64, -64, -64, -64, -64, -64, 64, 64, 64, 64, 64, 64, 64, -64, 64, 64, -64, -64, 64, 64, 64, -64, 64, 64, -64, 64, -64, -64, 64, -64, -64, -64, 64, -64, -64, 64, -64, 64, -64, 64, 64, 64, -64, -64, -64, 64, 64, -64, 64, 64, 64, -64, 64, -64, -64, -64, -64, -64, 64, 64, 64, -64, 64, 64, -64, -64, 64, -64, -64, 64, -64, -64, -64, 64, 64, -64, 64, -64, 64, -64, -64, 64, -64, 64, 64, -64, -64, -64, -64, -64, -64, 64, -64, -64, -64, -64, 64, -64, -64, 64, 64, 64, -64, 64, 64, -64, -64, -64, 64, -64, -64, -64, -64, -64, -64, -64, -64, -64, 64, -64, -64, -64, -64, -64, 64, 64, -64, 64, 64, 64, 64, -64, 64, 64, 64, -64, 64, -64, 64, -64, -64, 64, -64, 64, 64, -64, -64, -64, -64, -64, -64, -64, 64, 64, -64, -64, 64, 64, 64, 64, -64, -64, 64, 64, 64, -64, -64, -64, -64, 64, 64, -64, -64, -64, 64, -64, -64, -64, -64, -64, -64, -64, 64, 64, 64, 64, 64, 64, -64, 64, -64, 64, 64, -64, -64, -64, -64, -64, 64, -64, -64, 64, -64, -64, -64, -64, -64, -64, -64, -64, 64, 64, 64, 64, 64, 64, -64, 64, 64, 64, 64, -64, -64, 64, -64, -64, -64, 64, -64, -64, -64, -64, -64, 64, -64, 64, 64, 64, 64, 64, 64, 64, -64, -64, -64, -64, 64, 64, 64, 64, -64, 64, -64, -64, -64, -64, -64, -64, -64, -64, 64, -64, 64, -64, -64, -64, -64, 64, -64, 64, -64, 64, -64, -64, 64, 64, -64, 64, -64, -64, -64, 64, 64, -64, 64, 64, -64, 64, -64, -64, -64, 64, -64, 64, -64, -64, 64, 64, 64, -64, -64, 64, 64, -64, -64, -64, -64, 64, 64, -64, -64, -64, -64, -64, -64, -64, 64, 64, 64, -64, -64, 64, 64, 64, -64, -64, -64, -64, -64, -64, -64, -64, 64, 64, 64, -64, 64, -64, 64, 64, -64, -64, 64, 64, 64, 64, 64, 64, 64, -64, 64, 64, 64, 64, -64, -64, -64, 64, -64, -64, -64, 64, 64, -64, -64, -64, -64, -64, 64, -64, 64, 64, 64, 64, 64, 64, 64, -64, 64, 64, -64, 64, -64, 64, -64, 64, -64, 64, 64, -64, 64, -64, 64, 64, -64, -64, -64, 64, -64, 64, 64, -64, 64, -64, -64, -64, 64, 64, 64, -64, -64, -64, 64, 64, 64, -64, -64, 64, 64, -64, 64, 64, 64, 64, -64, -64, -64, -64, -64, 64, -64, 64, 64, 64, 64, -64, 64, -64, -64, -64, 64, 64, 64, 64, -64, 64, 64, -64, 64, -64, 64, 64, -64, 64, 64, -64, -64, 64, -64, -64, -64, 64, -64, -64, 64, -64, 64, -64, -64, -64, 64, -64, -64, -64, -64, -64, 64, 64, 64, -64, 64, 64, -64, 64, 64, 64, 64, -64, 64, -64, 64, 64, 64, -64, 64, -64, 64, 64, 64, -64, 64, 64, 64, -64, -64, 64, 64, 64, 64, 64, 64, 64, 64, 64, 64, 64, -64, -64, 64, 64, 64, -64, -64, -64, 64, -64, -64, 64, 64, 64, 64, 64, -64, -64, -64, 64, 64, 64, 64, 64, 64, 64, -64, 64, 64, 64, 64, 64, -64, -64, -64, -64, -64, 64, 64, 64, 64, 64, 64, 64, 64, -64, 64, 64, -64, -64, 64, -64, 64, -64, 64, -64, 64, 64, -64, -64, -64, 64, -64, 64, 64, 64, 64, 64, 64, -64, -64, -64, -64, -64, -64, 64, -64, -64, -64, -64, -64, -64, 64, 64, 64, 64, -64, 64, 64, 64, -64, -64, -64, 64, -64, 64, -64, 64, -64, -64, -64, -64, -64, -64, -64, -64, -64, -64, -64, -64, -64, -64, 64, 64, 64, 64, 64, -64, 64, -64, 64, 64, 64, 64, 64, -64, 64, -64, -64, -64, -64, -64, -64, -64, -64, -64, -64, -64, -64, -64, 64, 64, -64, 64, 64, -64, -64, -64, -64, 64, 64, 64, -64, -64, -64, -64, 64, -64, -64, -64, -64, -64, -64, -64, 64, -64, -64, -64, 64, 64, -64, -64, -64, -64, 64, -64, 64, -64, -64, -64, 64, -64, 64, 64, -64, 64, -64, -64, 64, -64, -64, 64, -64, 64, 64, -64, -64, 64, 64, 64, 64, 64, 64, 64, 64, -64, -64, -64, -64, -64, 64, -64, -64, 64, 64, -64, 64, -64, 64, 64, -64, -64, -64, -64, -64, 64, 64, 64, 64, 64, 64, 64, -64, -64, 64, 64, -64, -64, -64, -64, 64, 64, -64, -64, 64, 64, 64, -64, -64, -64, -64, -64, 64, 64, -64, -64, 64, -64, 64, 64, 64, 64, -64, -64, 64, 64, -64, 64, 64, 64, 64, 64, -64, 64, -64, -64, -64, -64, -64, -64, -64, 64, 64, 64, 64, 64, -64, 64, -64, -64, -64, 64, 64, 64, -64, 64, 64, 64, -64, 64, 64, 64, -64, -64, -64, 64, -64, 64, 64, 64, 64, 64, -64, 64, -64, -64, -64, -64, 64, -64, 64, 64, 64, 64, 64, 64, 64, -64, -64, -64, -64, 64, -64, -64, -64, 64, 64, 64, 64, -64, 64, 64, -64, -64, 64, -64, 64, 64, 64, 64, -64, 64, 64, 64, 64, -64, 64, 64, 64, -64, -64, -64, 64, 64, 64, 64, 64, -64, -64, 64, 64, -64, -64, -64, 64, -64, -64, -64, 64, 64, 64, 64, 64, 64, 64, 64, -64, -64, 64, 64, 64, 64, 64, 64, 64, 64, -64, -64, 64, -64, -64, -64, -64, -64, -64, 64, 64, -64, -64, -64, 64, 64, 64, 64, 64, -64, -64, -64, 64, 64, 64, 64, 64, 64, 64, -64, -64, -64, -64, 64, -64, -64, -64, -64, 64, 64, 64, 64, 64, 64, 64, 64, 64, -64, -64, 64, 64, 64, 64, 64, -64, 64, -64, -64, -64, 64, -64, -64, -64, -64, 64, 64, 64, 64, 64, 64, 64, 64, 64, 64, -64, -64, -64, 64, 64, 64, 64, 64, -64, -64, -64, 64, -64, 64, -64, -64, 64, -64, -64, 64, -64, -64, -64, 64, 64, -64, 64, 64, 64, -64, 64, -64, -64, -64, 64, 64, -64, -64, 64, 64, -64, 64, -64, 64, -64, -64, -64, -64, -64, -64, -64, -64, 64, 64, 64, -64, 64, -64, -64, -64, -64, -64, 64, 64, -64, -64, -64, 64, -64, -64, -64, 64, 64, -64, -64, -64, -64, 64, -64, -64, -64, -64, -64, -64, -64, -64, -64, -64, -64, -64, 64, 64, 64, -64, -64, -64, 64, 64, -64, -64, 64, 64, -64, 64, -64, 64, -64, -64, -64, -64, -64, -64, -64, -64, -64, -64, -64, 64, 64, 64, -64, 64, -64, 64, 64, 64, 64, -64, 64, -64, 64, -64, 64, 64, -64, -64, -64, -64, -64, -64, -64, -64, -64, -64, -64, 64, 64, 64, 64, -64, -64, 64, -64, -64, 64, -64, 64, 64, 64, -64, 64, -64, -64, -64, -64, -64, -64, -64, -64, -64, -64, -64, -64, 64, 64, 64, 64, -64, 64, -64, 64, 64, 64, -64, 64, 64, -64, -64, 64, 64, -64, -64, -64, -64, -64, -64, -64, 64, 64, -64, -64, 64, -64, -64, -64, 64, -64, -64, -64, -64, 64, 64, -64, 64, -64, -64, -64, -64, -64, 64, -64, -64, -64, -64, -64, 64, -64, 64, 64, -64, -64, -64, -64, -64, -64, 64, -64, 64, 64, -64, -64, 64, 64, -64, -64, 64, -64, -64, 64, 64, 64, -64, 64, -64, -64, -64, 64, 64, 64, -64, 64, -64, 64, 64, -64, 64, -64, -64, 64, -64, 64, 64, 64, 64, 64, 64, -64, -64, 64, 64, 64, -64, -64, -64, -64, -64, -64, 64, 64, -64, 64, -64, -64, -64, 64, 64, -64, -64, 64, 64, 64, 64, -64, 64, 64, 64, 64, 64, -64, -64, 64, 64, -64, -64, 64, 64, 64, -64, -64, 64, -64, -64, -64, -64, -64, 64, 64, 64, -64, -64, -64, 64, -64, 64, 64, -64, 64, -64, 64, 64, 64, -64, 64, -64, -64, 64, -64, -64, -64, 64, 64, 64, 64, 64, -64, 64, -64, -64, -64, 64, 64, -64, 64, 64, 64, 64, 64, 64, 64, 64, -64, -64, -64, 64, 64, -64, 64, -64, 64, 64, 64, 64, 64, 64, 64, -64, -64, -64, 64, -64, -64, 64, -64, -64, 64, -64, -64, 64, -64, -64, 64, 64, 64, -64, -64, -64, 64, 64, 64, 64, 64, 64, -64, 64, -64, 64, 64, -64, 64, -64, -64, -64, -64, -64, -64, 64, -64, -64, 64, -64, 64, 64, 64, -64, -64, 64, 64, 64, 64, 64, 64, 64, 64, 64, 64, 64, 64, 64, -64, -64, 64, 64, 64, -64, 64, -64, -64, 64, 64, -64, 64, -64, -64, 64, 64, 64, 64, 64, -64, -64, 64, 64, 64, 64, 64, 64, -64, -64, -64, -64, -64, -64, -64, -64, -64, 64, -64, -64, 64, -64, 64, 64, 64, 64, -64, -64, -64, -64, 64, 64, -64, 64, 64, 64, 64, 64, -64, -64, -64, -64, -64, -64, -64, 64, -64, 64, 64, -64, 64, 64, 64, 64, -64, -64, -64, -64, -64, -64, -64, 64, 64, 64, -64, -64, -64, -64, -64, -64, -64, -64, -64, -64, 64, 64, 64, -64, 64, 64, 64, -64, -64, 64, 64, 64, 64, -64, -64, -64, -64, -64, -64, 64, -64, -64, -64, -64, -64, 64, 64, 64, -64, 64, -64, -64, 64, 64, -64, -64, -64, -64, -64, -64, -64, 64, -64, -64, 64, 64, -64, -64, -64, -64, -64, -64, 64, -64, -64, -64, 64, 64, 64, -64, -64, -64, -64, -64, -64, -64, 64, 64, 64, -64, 64, 64, -64, -64, -64, -64, -64, -64, -64, -64, 64, 64, -64, 64, -64, -64, -64, 64, 64, -64, -64, -64, -64, -64, 64, 64, 64, -64, -64, 64, 64, 64, 64, 64, 64, -64, -64, -64, -64, -64, -64, 64, 64, 64, 64, 64, 64, 64, -64, -64, -64, -64, 64, 64, 64, 64, 64, -64, 64, -64, -64, -64, -64, 64, -64, -64, -64, -64, 64, 64, -64, -64, 64, -64, 64, 64, 64, -64, -64, -64, 64, 64, 64, 64, 64, 64, 64, -64, -64, -64, -64, 64, 64, -64, 64, 64, 64, 64, -64, 64, 64, 64, 64, 64, 64, -64, -64, -64, 64, 64, 64, 64, 64, 64, -64, -64, 64, 64, -64, 64, -64, 64, 64, 64, 64, -64, -64, -64, -64, 64, 64, 64, 64, -64, -64, -64, 64, 64, 64, 64, 64, 64, 64, 64, 64, 64, 64, -64, 64, 64, -64, 64, 64, 64, -64, 64, 64, -64, 64, 64, -64, -64, -64, -64, 64, 64, 64, 64, 64, 64, 64, -64, 64, 64, 64, 64, 64, -64, 64, -64, 64, -64, 64, 64, 64, -64, 64, 64, -64, -64, -64, 64, 64, 64, 64, 64, 64, -64, -64, -64, -64, 64, -64, 64, 64, 64, -64, -64, -64, -64, 64, 64, 64, -64, 64, -64, -64, -64, -64, -64, -64, 64, -64, -64, -64, 64, 64, -64, 64, 64, 64, 64, 64, 64, 64, 64, -64, 64, 64, -64, -64, -64, -64, -64, -64, -64, -64, -64, 64, 64, -64, -64, 64, -64, 64, -64, -64, 64, 64, 64, 64, 64, -64, -64, 64, 64, -64, -64, 64, 64, -64, -64, -64, -64, -64, -64, -64, -64, -64, -64, 64, 64, 64, 64, 64, 64, 64, 64, 64, 64, -64, -64, 64, 64, 64, 64, 64, 64, -64, -64, -64, -64, -64, -64, -64, -64, -64, 64, 64, -64, -64, -64, -64, -64, 64, 64, 64, -64, 64, 64, 64, 64, -64, 64, 64, 64, 64, -64, -64, -64, -64, -64, -64, -64, -64, 64, 64, 64, 64, 64, 64, 64, 64, -64, -64, -64, -64, 64, 64, -64, -64, -64, 64, -64, -64, -64, 64, -64, 64, -64, -64, -64, -64, -64, -64, -64, -64, -64, -64, -64, -64, -64, -64, -64, 64, 64, 64, 64, 64, -64, -64, 64, -64, 64, -64, 64, 64, -64, -64, -64, -64, -64, 64, -64, 64, -64, -64, 64, 64, 64, -64, -64, 64, 64, 64, -64, 64, 64, 64, -64, -64, -64, -64, -64, -64, 64, 64, 64, -64, -64, 64, -64, -64, -64, -64, -64, -64, 64, -64, 64, 64, -64, 64, -64, 64, 64, -64, 64, 64, -64, -64, 64, 64, 64, 64, -64, -64, 64, 64, 64, -64, -64, -64, -64, 64, -64, 64, -64, 64, 64, -64, -64, -64, -64, 64, -64, -64, -64, -64, 64, -64, 64, 64, -64, 64, -64, 64, 64, -64, -64, 64, -64, 64, 64, 64, 64, 64, -64, 64, -64, -64, 64, 64, 64, 64, -64, 64, 64, 64, 64, 64, 64, 64, -64, 64, -64, -64, -64, 64, -64, 64, -64, 64, 64, -64, -64, 64, -64, 64, -64, -64, 64, 64, 64, -64, 64, -64, -64, 64, -64, -64, -64, -64, -64, -64, 64, -64, -64, 64, -64, -64, -64, -64, 64, 64, 64, 64, -64, 64, 64, 64, 64, 64, 64, 64, 64, -64, -64, -64, -64, -64, -64, -64, -64, -64, -64, 64, 64, 64, 64, 64, -64, 64, -64, 64, 64, -64, 64, 64, 64, 64, 64, 64, 64, -64, 64, -64, -64, -64, -64, -64, -64, -64, -64, -64, -64, -64, 64, 64, 64, -64, -64, 64, 64, -64, -64, -64, 64, 64, 64, 64, -64, 64, -64, 64, 64, 64, -64, -64, -64, -64, -64, -64, -64, 64, 64, -64, -64, -64, 64, -64, -64, -64, 64, 64, 64, 64, 64, -64, 64, 64, 64, -64, -64, 64, -64, -64, -64, -64, -64, 64, 64, 64, 64, 64, -64, 64, -64, 64, -64, -64, 64, -64, 64, 64, 64, 64, 64, 64, -64, -64, -64, -64, -64, -64, 64, 64, 64, -64, -64, -64, -64, -64, -64, 64, -64, -64, -64, -64, 64, -64, 64, 64, 64, 64, 64, -64, -64, -64, -64, -64, -64, -64, 64, -64, 64, 64, -64, -64, -64, -64, -64, 64, -64, -64, -64, 64, 64, 64, 64, 64, 64, 64, -64, -64, -64, -64, -64, 64, -64, -64, -64, 64, -64, -64, -64, 64, 64, 64, -64, -64, 64, 64, 64, -64, -64, -64, 64, 64, 64, 64, -64, -64, -64, -64, -64, 64, 64, 64, -64, -64, 64, -64, -64, 64, 64, -64, -64, -64, 64, -64, 64, 64, 64, 64, 64, 64, 64, 64, -64, -64, -64, -64, -64, -64, -64, -64, -64, -64, 64, -64, 64, 64, 64, 64, -64, -64, -64, 64, -64, 64, 64, -64, 64, 64, 64, 64, -64, -64, -64, -64, -64, 64, -64, -64, -64, -64, -64, 64, -64, 64, 64, 64, -64, -64, -64, -64, 64, 64, 64, 64, 64, 64, 64, 64, 64, -64, -64, -64, 64, -64, -64, -64, -64, 64, 64, 64, -64, -64, -64, 64, -64, -64, 64, -64, 64, 64, 64, 64, 64, 64, 64, -64, 64, 64, 64, -64, -64, -64, -64, -64, -64, -64, 64, -64, -64, -64, 64, 64, -64, -64, 64, 64, 64, 64, 64, -64, 64, 64, 64, 64, 64, 64, 64, -64, -64, 64, -64, -64, -64, 64, 64, 64, -64, 64, 64, 64, -64, -64, -64, -64, -64, -64, 64, 64, 64, 64, 64, -64, -64, -64, -64, 64, 64, -64, -64, -64, -64, -64, -64, -64, 64, 64, 64, 64, -64, -64, -64, 64, 64, 64, -64, 64, -64, -64, 64, -64, 64, -64, -64, -64, -64, -64, -64, 64, -64, 64, -64, -64, 64, 64, 64, 64, -64, -64, -64, -64, -64, -64, -64, -64, 64, -64, 64, -64, -64, -64, 64, -64, -64, -64, -64, -64, 64, 64, -64, -64, 64, 64, 64, -64, 64, -64, -64, 64, -64, 64, -64, -64, -64, 64, 64, -64, -64, -64, -64, -64, -64, -64, 64, -64, -64, -64, 64, 64, 64, 64, 64, 64, 64, -64, -64, -64, -64, 64, -64, 64, 64, 64, 64, 64, -64, -64, -64, -64, -64, -64, -64, -64, -64, -64, -64, 64, 64, 64, 64, 64, -64, 64, 64, 64, 64, 64, 64, 64, -64, -64, -64, 64, -64, 64, -64, -64, 64, -64, -64, -64, -64, -64, 64, 64, 64, 64, 64, 64, 64, 64, -64, -64, 64, 64, 64, -64, -64, -64, 64, -64, 64, -64, 64, 64, 64, -64, -64, -64, -64, 64, 64, 64, 64, 64, 64, 64, -64, 64, -64, 64, -64, -64, -64, 64, -64, -64, -64, -64, -64, -64, 64, -64, -64, 64, -64, -64, -64, 64, 64, 64, 64, 64, 64, -64, -64, -64, 64, -64, -64, -64, 64, 64, 64, 64, -64, -64, 64, -64, -64, -64, 64, -64, 64, -64, -64, 64, -64, 64, 64, 64, 64, 64, 64, -64, -64, -64, -64, 64, 64, -64, -64, -64, -64, 64, -64, 64, -64, 64, -64, 64, 64, -64, -64, 64, -64, -64, -64, -64, 64, 64, -64, -64, 64, 64, 64, -64, -64, 64, 64, 64, 64, -64, -64, -64, 64, 64, 64, 64, 64, -64, 64, 64, -64, 64, -64, 64, -64, 64, -64, 64, -64, 64, 64, -64, -64, -64, -64, -64, 64, -64, -64, 64, 64, -64, 64, -64, -64, -64, -64, -64, -64, 64, 64, 64, 64, 64, 64, 64, 64, 64, 64, -64, -64, 64, 64, -64, -64, -64, 64, 64, -64, -64, 64, 64, 64, -64, 64, 64, 64, -64, 64, 64, -64, 64, 64, -64, -64, 64, 64, 64, 64, -64, -64, 64, 64, -64, 64, 64, -64, -64, 64, 64, -64, -64, -64, 64, -64, -64, -64, -64, -64, -64, 64, 64, -64, -64, 64, -64, 64, -64, 64, 64, 64, 64, 64, -64, 64, -64, 64, -64, -64, -64, -64, -64, -64, -64, -64, -64, -64, -64, -64, -64, 64, 64, -64, -64, 64, 64, -64, 64, 64, 64, 64, 64, -64, -64, -64, -64, -64, -64, 64, -64, -64, -64, -64, -64, -64, -64, -64, -64, 64, 64, -64, 64, -64, 64, 64, 64, 64, 64, 64, 64, -64, -64, -64, -64, 64, -64, 64, 64, -64, -64, -64, -64, -64, -64, -64, -64, -64, 64, -64, 64, 64, 64, 64, 64, 64, 64, -64, -64, -64, -64, -64, -64, 64, 64, 64, 64, 64, -64, -64, -64, -64, -64, -64, -64, 64, 64, -64, -64, 64, -64, 64, 64, 64, 64, 64, -64, -64, -64, -64, 64, 64, 64, 64, 64, 64, -64, -64, -64, -64, -64, -64, -64, 64, -64, 64, -64, 64, 64, 64, 64, 64, 64, -64, -64, -64, -64, -64, 64, 64, 64, 64, -64, 64, 64, 64, -64, -64, -64, -64, -64, -64, 64, 64, -64, 64, 64, -64, 64, 64, 64, 64, -64, -64, -64, -64, 64, -64, 64, 64, 64, 64, 64, -64, -64, -64, -64, -64, -64, -64, 64, 64, 64, 64, 64, 64, 64, -64, 64, 64, -64, -64, -64, 64, -64, 64, -64, 64, 64, 64, 64, 64, -64, -64, -64, -64, -64, 64, -64, -64, 64, 64, -64, 64, 64, -64, 64, 64, 64, 64, 64, -64, 64, -64, 64, 64, 64, 64, -64, 64, 64, 64, 64, -64, -64, -64, -64, -64, 64, 64, -64, 64, 64, 64, 64, 64, 64, -64, -64, -64, 64, -64, 64, 64, 64, 64, 64, -64, 64, 64, -64, 64, -64, -64, -64, 64, 64, 64, -64, 64, 64, 64, 64, 64, 64, 64, -64, -64, -64, -64, 64, 64, 64, 64, 64, -64, 64, 64, 64, -64, -64, -64, -64, 64, 64, -64, -64, 64, 64, 64, 64, 64, 64, 64, 64, -64, -64, -64, -64, 64, 64, -64, 64, 64, 64, 64, 64, -64, -64, -64, 64, -64, -64, 64, -64, 64, 64, -64, 64, 64, -64, -64, -64, -64, -64, -64, 64, 64, 64, 64, -64, 64, 64, 64, -64, 64, -64, -64, 64, -64, -64, 64, -64, 64, -64, 64, -64, 64, -64, -64, -64, -64, -64, -64, -64, -64, -64, -64, -64, 64, 64, 64, -64, -64, -64, -64, -64, 64, -64, -64, -64, -64, -64, -64, 64, 64, -64, -64, -64, -64, -64, -64, 64, 64, 64, -64, 64, 64, -64, -64, -64, -64, -64, -64, 64, 64, 64, 64, -64, -64, -64, -64, 64, 64, -64, -64, -64, -64, -64, -64, -64, 64, 64, -64, 64, -64, 64, -64, -64, -64, -64, 64, -64, -64, 64, -64, -64, 64, 64, 64, 64, 64, 64, -64, -64, -64, -64, 64, -64, 64, -64, 64, -64, -64, 64, -64, -64, -64, -64, 64, 64, 64, -64, -64, 64, -64, -64, -64, -64, 64, 64, -64, -64, -64, 64, -64, -64, 64, -64, 64, 64, -64, -64, -64, -64, -64, -64, 64, 64, 64, -64, -64, -64, -64, -64, 64, 64, 64, 64, -64, -64, -64, -64, -64, -64, 64, 64, 64, 64, -64, -64, -64, 64, 64, -64, 64, 64, 64, -64, -64, 64, 64, -64, 64, 64, -64, -64, -64, -64, -64, -64, -64, -64, -64, 64, 64, 64, -64, 64, 64, 64, 64, 64, 64, 64, -64, -64, 64, 64, 64, -64, -64, 64, -64, -64, 64, -64, 64, -64, 64, -64, 64, 64, 64, 64, 64, 64, 64, 64, 64, 64, 64, 64, 64, -64, 64, -64, -64, 64, 64, 64, -64, -64, 64, 64, -64, -64, -64, -64, -64, 64, 64, 64, 64, 64, 64, 64, -64, 64, -64, 64, 64, -64, 64, -64, -64, 64, 64, 64, 64, 64, -64, 64, 64, 64, 64, 64, 64, 64, 64, 64, 64, 64, 64, -64, 64, 64, -64, -64, -64, 64, -64, 64, -64, 64, -64, 64, -64, -64, 64, 64, -64, 64, 64, 64, 64, 64, 64, -64, 64, 64, -64, 64, -64, 64, -64, 64, 64, -64, 64, 64, 64, 64, -64, 64, -64, 64, -64, 64, 64, 64, -64, 64, -64, -64, 64, -64, 64, -64, 64, 64, -64, -64, -64, 64, 64, -64, -64, -64, 64, -64, 64, -64, -64, 64, -64, 64, 64, -64, 64, -64, -64, -64, -64, 64, 64, -64, -64, 64, -64, -64, 64, -64, -64, -64, -64, -64, -64, 64, 64, 64, 64, -64, -64, -64, -64, 64, 64, 64, 64, 64, 64, 64, -64, 64, 64, 64, 64, -64, 64, -64, -64, 64, 64, -64, -64, 64, 64, 64, 64, -64, -64, 64, 64, 64, 64, 64, 64, 64, 64, 64, 64, 64, 64, 64, -64, -64, -64, 64, 64, 64, -64, 64, -64, 64, 64, 64, 64, 64, 64, 64, 64, 64, 64, 64, 64, 64, -64, 64, -64, -64, 64, -64, -64, -64, -64, -64, 64, -64, -64, 64, -64, 64, 64, 64, 64, 64, 64, 64, 64, 64, 64, 64, -64, 64, -64, -64, -64, -64, 64, 64, -64, -64, -64, 64, 64, 64, 64, 64, 64, 64, 64, -64, -64, -64, -64, -64, 64, -64, -64, -64, 64, 64, -64, -64, 64, -64, -64, 64, 64, 64, 64, 64, 64, -64, 64, 64, 64, 64, -64, -64, 64, -64, 64, 64, -64, -64, -64, 64, -64, 64, 64, 64, 64, 64, 64, 64, 64, -64, 64, -64, 64, -64, -64, 64, 64, 64, 64, -64, -64, 64, -64, 64, -64, 64, 64, -64, 64, -64, -64, 64, 64, 64, 64, 64, -64, 64, -64, 64, -64, 64, -64, 64, -64, -64, -64, -64, 64, 64, 64, 64, 64, 64, 64, 64, 64, 64, 64, 64, 64, 64, 64, -64, -64, -64, -64, -64, 64, -64, -64, 64, -64, -64, -64, -64, -64, -64, 64, 64, 64, 64, 64, -64, 64, 64, -64, 64, 64, -64, -64, -64, -64, -64, -64, 64, -64, -64, 64, 64, -64, -64, -64, -64, 64, 64, 64, 64, 64, 64, 64, 64, -64, 64, 64, -64, -64, -64, -64, -64, -64, -64, -64, -64, -64, -64, -64, 64, -64, -64, -64, -64, 64, 64, 64, 64, -64, 64, -64, -64, -64, 64, 64, -64, -64, -64, -64, 64, -64, -64, 64, 64, 64, 64, -64, -64, -64, -64, 64, -64, 64, -64, -64, 64, 64, 64, 64, -64, -64, 64, 64, 64, -64, -64, -64, -64, -64, -64, 64, 64, 64, 64, 64, 64, -64, 64, -64, 64, 64, 64, 64, -64, 64, 64, 64, -64, -64, 64, 64, 64, 64, 64, -64, 64, -64, -64, -64, 64, 64, 64, -64, 64, 64, -64, 64, -64, 64, 64, 64, -64, 64, 64, 64, 64, 64, 64, 64, 64, 64, 64, 64, 64, 64, -64, -64, -64, -64, 64, 64, 64, 64, 64, -64, 64, 64, 64, 64, 64, 64, 64, 64, 64, 64, 64, 64, 64, 64, 64, 64, 64, -64, -64, 64, 64, -64, 64, -64, 64, 64, 64, 64, -64, 64, 64, 64, 64, -64, 64, 64, 64, 64, 64, 64, 64, 64, 64, -64, 64, -64, -64, -64, -64, -64, -64, -64, 64, 64, 64, -64, 64, 64, -64, -64, -64, -64, -64, -64, 64, 64, 64, 64, 64, 64, 64, -64, -64, -64, -64, -64, -64, 64, -64, 64, 64, 64, 64, -64, -64, -64, -64, -64, -64, -64, -64, 64, 64, 64, 64, 64, 64, 64, 64, 64, -64, -64, 64, -64, -64, -64, 64, 64, -64, 64, -64, 64, -64, -64, -64, -64, -64, 64, 64, 64, 64, 64, 64, 64, 64, 64, -64, -64, 64, 64, -64, -64, -64, -64, -64, 64, 64, -64, 64, 64, 64, -64, 64, 64, 64, 64, 64, 64, 64, 64, 64, -64, -64, -64, 64, -64, -64, 64, -64, 64, 64, -64, -64, 64, 64, -64, 64, 64, -64, -64, -64, 64, 64, 64, 64, 64, 64, 64, 64, -64, -64, -64, 64, -64, -64, -64, -64, -64, -64, 64, -64, -64, -64, -64, 64, -64, 64, 64, 64, 64, 64, 64, 64, 64, 64, 64, -64, -64, -64, 64, 64, 64, -64, -64, -64, -64, -64, -64, -64, 64, -64, 64, -64, -64, 64, 64, 64, -64, -64, 64, 64, 64, 64, 64, -64, -64, -64, -64, 64, 64, -64, 64, -64, 64, 64, 64, 64, -64, -64, -64, 64, -64, 64, 64, 64, 64, -64, 64, 64, 64, 64, -64, -64, -64, -64, -64, 64, 64, 64, -64, -64, 64, -64, -64, 64, -64, 64, -64, -64, -64, -64, -64, -64, 64, -64, -64, -64, -64, -64, -64, 64, 64, -64, -64, -64, -64, -64, -64, 64, 64, 64, -64, 64, -64, -64, 64, -64, 64, 64, -64, 64, -64, -64, -64, -64, -64, 64, -64, 64, -64, -64, 64, 64, 64, 64, 64, -64, -64, 64, -64, 64, -64, -64, 64, -64, -64, 64, 64, 64, 64, 64, 64, 64, -64, 64, 64, -64, -64, 64, -64, 64, -64, -64, 64, -64, 64, -64, 64, -64, 64, 64, -64, 64, 64, -64, -64, -64, -64, 64, -64, 64, -64, -64, 64, -64, 64, 64, 64, 64, 64, 64, -64, 64, -64, 64, -64, 64, 64, -64, -64, -64, -64, -64, -64, -64, -64, 64, -64, -64, -64, 64, 64, 64, -64, -64, 64, 64, -64, -64, 64, 64, 64, 64, 64, 64, 64, 64, 64, 64, 64, 64, 64, 64, 64, -64, 64, -64, -64, -64, -64, -64, 64, 64, 64, -64, 64, -64, -64, 64, -64, 64, -64, 64, 64, 64, 64, -64, -64, -64, -64, -64, 64, -64, -64, 64, 64, -64, -64, -64, -64, -64, 64, -64, -64, 64, -64, 64, -64, -64, -64, -64, 64, 64, -64, -64, -64, -64, -64, -64, -64, 64, 64, -64, 64, -64, -64, -64, -64, -64, -64, -64, -64, -64, -64, 64, 64, 64, -64, 64, -64, -64, 64, 64, -64, 64, 64, -64, -64, 64, 64, -64, -64, -64, -64, -64, 64, 64, -64, 64, 64, 64, 64, 64, 64, 64, 64, 64, 64, 64, -64, -64, 64, 64, 64, -64, 64, 64, -64, 64, -64, -64, -64, 64, -64, -64, 64, 64, -64, -64, -64, -64, -64, -64, -64, 64, -64, 64, -64, -64, -64, -64, -64, -64, -64, -64, 64, -64, -64, -64, 64, -64, -64, -64, -64, 64, 64, -64, -64, -64, 64, 64, -64, -64, -64, -64, -64, -64, 64, 64, -64, 64, -64, 64, -64, -64, 64, 64, -64, -64, 64, -64, -64, 64, -64, 64, 64, -64, 64, -64, -64, 64, -64, 64, 64, -64, -64, -64, 64, 64, 64, -64, 64, 64, 64, -64, 64, 64, -64, -64, -64, -64, -64, 64, -64, 64, 64, -64, -64, 64, -64, -64, -64, 64, 64, -64, -64, -64, -64, -64, -64, 64, -64, -64, 64, -64, 64, -64, 64, -64, 64, -64, -64, 64, -64, -64, 64, 64, -64, 64, -64, 64, 64, -64, 64, -64, -64, 64, -64, -64, -64, -64, -64, -64, -64, -64, -64, -64, -64, -64, -64, -64, -64, -64, 64, 64, -64, 64, -64, -64, -64, -64, 64, 64, -64, 64, -64, -64, -64, -64, -64, -64, -64, -64, -64, -64, -64, -64, -64, 64, 64, -64, -64, -64, 64, -64, 64, -64, -64, 64, -64, 64, 64, -64, -64, -64, -64, 64, 64, -64, 64, -64, 64, 64, -64, -64, 64, -64, -64, -64, -64, 64, -64, -64, 64, 64, 64, -64, 64, -64, -64, -64, 64, 64, 64, 64, 64, -64, -64, -64, -64, 64, 64, -64, -64, 64, -64, 64, 64, -64, -64, -64, -64, -64, -64, -64, -64, 64, 64, -64, -64, 64, -64, -64, 64, -64, 64, 64, -64, -64, -64, -64, -64, 64, 64, 64, 64, -64, 64, -64, 64, -64, 64, 64, -64, -64, -64, -64, 64, -64, -64, -64, -64, -64, -64, 64, -64, -64, 64, -64, -64, -64, 64, 64, -64, -64, 64, 64, -64, -64, -64, 64, -64, 64, -64, 64, -64, -64, -64, -64, -64, -64, -64, -64, -64, -64, -64, -64, 64, 64, 64, 64, 64, 64, 64, 64, 64, 64, 64, 64, 64, -64, -64, 64, -64, 64, -64, -64, -64, -64, 64, -64, 64, -64, 64, 64, -64, -64, 64, -64, 64, -64, -64, 64, -64, -64, 64, -64, -64, 64, -64, -64, -64, -64, -64, -64, -64, -64, -64, 64, 64, -64, -64, 64, 64, 64, 64, 64, -64, 64, 64, 64, -64, -64, -64, -64, -64, 64, 64, -64, -64, 64, 64, -64, -64, -64, 64, -64, -64, -64, -64, -64, -64, -64, 64, -64, 64, -64, 64, 64, -64, 64, 64, 64, -64, -64, -64, 64, 64, 64, -64, 64, -64, -64, -64, 64, -64, -64, 64, -64, 64, -64, 64, 64, -64, 64, 64, 64, -64, -64, 64, -64, 64, -64, -64, -64, -64, -64, 64, -64, -64, -64, 64, 64, 64, 64, 64, 64, -64, 64, 64, 64, 64, 64, -64, 64, -64, 64, -64, -64, -64, -64, -64, 64, -64, -64, -64, -64, -64, 64, 64, 64, -64, -64, 64, -64, 64, 64, -64, -64, -64, 64, -64, 64, -64, -64, -64, -64, 64, 64, -64, 64, 64, -64, 64, -64, -64, 64, 64, 64, 64, -64, 64, 64, -64, -64, 64, 64, -64, -64, -64, 64, -64, -64, -64, 64, -64, -64, -64, 64, -64, 64, -64, -64, -64, 64, 64, -64, -64, -64, -64, 64, 64, 64, 64, 64, 64, 64, 64, 64, 64, 64, -64, 64, 64, -64, -64, -64, -64, 64, -64, 64, -64, 64, 64, 64, 64, -64, -64, -64, 64, -64, -64, 64, -64, 64, -64, 64, -64, 64, 64, 64, -64, -64, 64, 64, -64, 64, -64, 64, 64, -64, 64, 64, 64, 64, 64, -64, -64, -64, -64, 64, -64, -64, 64, -64, 64, 64, -64, 64, -64, -64, -64, -64, 64, 64, -64, 64, -64, 64, -64, -64, 64, -64, -64, 64, 64, -64, 64, -64, 64, -64, -64, -64, -64, -64, 64, -64, -64, 64, 64, -64, 64, 64, 64, 64, 64, 64, -64, 64, 64, -64, 64, -64, 64, 64, 64, 64, 64, 64, -64, 64, -64, 64, 64, 64, -64, 64, 64, -64, 64, 64, 64, 64, -64, 64, 64, 64, -64, -64, 64, -64, -64, -64, 64, 64, -64, -64, -64, -64, 64, 64, -64, 64, 64, 64, 64, 64, -64, -64, 64, 64, 64, -64, 64, 64, -64, -64, -64, -64, 64, -64, -64, 64, -64, -64, -64, -64, 64, -64, -64, -64, -64, 64, -64, -64, -64, 64, 64, -64, -64, -64, -64, -64, -64, -64, -64, -64, -64, 64, 64, 64, 64, 64, 64, -64, 64, 64, 64, -64, 64, 64, 64, -64, -64, 64, 64, 64, 64, 64, 64, -64, -64, -64, -64, -64, -64, 64, 64, 64, 64, -64, 64, 64, 64, -64, -64, 64, 64, 64, 64, -64, 64, 64, 64, 64, -64, 64, 64, 64, -64, -64, -64, -64, -64, -64, -64, 64, 64, -64, 64, 64, -64, 64, 64, 64, 64, -64, 64, 64, 64, -64, 64, 64, 64, 64, 64, -64, -64, -64, -64, -64, -64, -64, -64, 64, -64, -64, 64, 64, 64, 64, -64, 64, 64, 64, 64, 64, -64, 64, -64, -64, 64, 64, 64, 64, -64, -64, -64, -64, -64, 64, 64, -64, -64, -64, 64, 64, 64, 64, -64, 64, 64, 64, -64, -64, -64, -64, 64, 64, 64, 64, 64, -64, 64, -64, -64, -64, -64, 64, -64, -64, -64, 64, 64, -64, -64, 64, -64, 64, 64, -64, -64, 64, 64, -64, 64, 64, 64, 64, 64, 64, 64, -64, -64, -64, -64, -64, -64, 64, -64, 64, -64, -64, 64, 64, 64, 64, -64, -64, -64, -64, 64, 64, 64, 64, 64, 64, 64, 64, -64, -64, -64, -64, 64, -64, -64, 64, 64, 64, -64, -64, 64, 64, -64, 64, -64, -64, 64, 64, 64, 64, 64, 64, 64, 64, 64, -64, 64, -64, 64, -64, -64, -64, -64, 64, 64, 64, 64, 64, -64, 64, -64, -64, -64, -64, -64, 64, 64, 64, 64, 64, 64, 64, 64, 64, 64, -64, 64, -64, -64, -64, -64, 64, 64, 64, 64, 64, 64, 64, -64, -64, -64, -64, -64, 64, -64, -64, 64, 64, 64, 64, -64, 64, -64, 64, 64, -64, -64, 64, -64, -64, 64, 64, -64, 64, 64, -64, -64, -64, -64, -64, -64, -64, 64, 64, 64, 64, 64, 64, -64, 64, -64, -64, 64, -64, -64, 64, 64, -64, 64, 64, 64, 64, 64, -64, -64, -64, -64, -64, -64, 64, -64, 64, 64, 64, 64, -64, 64, 64, -64, -64, 64, 64, 64, 64, 64, 64, -64, -64, 64, -64, 64, -64, -64, -64, -64, 64, -64, -64, -64, 64, 64, 64, 64, 64, 64, 64, 64, -64, -64, 64, 64, 64, -64, 64, -64, 64, 64, -64, -64, -64, -64, -64, -64, 64, -64, 64, 64, 64, -64, 64, 64, 64, 64, 64, 64, -64, 64, 64, 64, 64, -64, 64, -64, -64, -64, 64, -64, -64, -64, -64, 64, 64, 64, -64, 64, -64, -64, 64, 64, 64, 64, 64, -64, 64, 64, 64, 64, 64, -64, 64, -64, -64, -64, 64, -64, -64, -64, -64, -64, -64, -64, 64, 64, -64, 64, 64, 64, 64, 64, 64, 64, 64, 64, 64, -64, 64, 64, 64, 64, -64, -64, -64, -64, 64, -64, -64, -64, 64, 64, -64, 64, -64, 64, 64, 64, 64, -64, 64, -64, 64, 64, -64, -64, -64, 64, -64, 64, 64, -64, 64, -64, 64, -64, 64, 64, -64, -64, -64, 64, 64, 64, 64, 64, 64, 64, -64, 64, -64, 64, -64, -64, 64, 64, 64, 64, -64, -64, 64, 64, 64, 64, -64, -64, -64, -64, -64, 64, -64, -64, -64, -64, 64, 64, 64, 64, -64, -64, 64, 64, 64, -64, 64, 64, 64, 64, 64, 64, -64, 64, -64, 64, 64, 64, 64, 64, 64, 64, 64, 64, 64, 64, 64, -64, 64, -64, 64, 64, -64, -64, -64, -64, -64, -64, 64, 64, 64, -64, 64, -64, -64, -64, -64, -64, 64, 64, 64, 64, -64, 64, 64, -64, 64, 64, 64, -64, 64, -64, -64, -64, 64, -64, -64, -64, 64, 64, -64, 64, -64, 64, 64, 64, 64, -64, -64, 64, -64, -64, -64, -64, -64, 64, 64, 64, -64, -64, -64, -64, 64, 64, 64, 64, 64, -64, -64, -64, 64, -64, 64, 64, -64, -64, -64, 64, -64, -64, 64, -64, -64, -64, 64, -64, 64, -64, 64, -64, 64, -64, -64, -64, -64, 64, -64, -64, -64, -64, -64, -64, 64, 64, 64, 64, 64, -64, 64, 64, 64, -64, 64, 64, 64, -64, 64, -64, 64, 64, 64, -64, -64, -64, 64, 64, 64, 64, -64, 64, -64, 64, -64, -64, 64, -64, -64, -64, 64, 64, -64, 64, 64, 64, 64, -64, -64, 64, -64, 64, 64, 64, 64, -64, -64, -64, -64, 64, -64, 64, 64, 64, -64, -64, -64, -64, -64, -64, -64, -64, -64, -64, -64, 64, 64, -64, 64, -64, -64, 64, 64, 64, -64, -64, 64, -64, 64, 64, -64, -64, -64, -64, -64, -64, -64, -64, -64, -64, -64, 64, 64, 64, 64, 64, -64, 64, 64, -64, 64, -64, -64, -64, -64, -64, -64, 64, 64, 64, -64, -64, 64, 64, 64, 64, -64, -64, 64, 64, 64, -64, -64, -64, 64, 64, 64, 64, 64, -64, 64, 64, -64, -64, -64, -64, 64, 64, -64, -64, -64, -64, 64, -64, 64, 64, 64, 64, -64, 64, 64, -64, -64, -64, 64, 64, 64, 64, -64, 64, -64, -64, -64, -64, 64, -64, -64, -64, -64, -64, 64, 64, 64, 64, 64, 64, -64, 64, -64, -64, 64, -64, 64, -64, -64, 64, 64, -64, -64, -64, -64, 64, 64, -64, -64, 64, -64, 64, 64, 64, 64, 64, 64, 64, -64, 64, 64, -64, 64, 64, 64, -64, -64, -64, -64, 64, -64, -64, 64, 64, -64, -64, 64, -64, -64, -64, 64, 64, 64, 64, 64, 64, 64, 64, -64, -64, 64, 64, -64, -64, 64, -64, 64, 64, -64, -64, -64, 64, -64, -64, -64, 64, 64, 64, -64, 64, 64, 64, 64, 64, 64, 64, -64, -64, 64, 64, -64, 64, -64, -64, -64, -64, -64, -64, -64, 64, -64, -64, -64, -64, 64, -64, 64, -64, -64, 64, 64, 64, -64, 64, 64, 64, 64, 64, 64, 64, 64, 64, 64, -64, -64, 64, 64, 64, 64, 64, -64, -64, -64, 64, -64, -64, -64, -64, -64, -64, -64, -64, -64, 64, 64, -64, 64, -64, 64, -64, 64, -64, -64, -64, 64, -64, 64, 64, -64, -64, -64, -64, -64, -64, -64, -64, 64, 64, 64, -64, 64, 64, 64, -64, 64, 64, -64, -64, -64, -64, -64, -64, -64, -64, -64, -64, -64, -64, -64, -64, -64, -64, 64, 64, 64, -64, -64, -64, -64, 64, 64, 64, 64, 64, 64, -64, -64, -64, -64, 64, -64, -64, 64, -64, -64, -64, -64, 64, -64, 64, -64, 64, 64, -64, -64, 64, 64, -64, 64, 64, -64, 64, -64, -64, -64, -64, -64, -64, 64, -64, -64, -64, -64, -64, -64, 64, 64, -64, 64, 64, 64, -64, -64, -64, -64, -64, 64, 64, 64, 64, -64, -64, -64, -64, -64, -64, -64, -64, -64, -64, -64, 64, -64, -64, 64, -64, -64, 64, -64, -64, -64, 64, 64, 64, 64, 64, 64, -64, 64, -64, -64, -64, -64, -64, -64, -64, -64, -64, -64, -64, -64, 64, -64, -64, -64, 64, -64, -64, -64, -64, -64, -64, 64, 64, 64, -64, -64, 64, -64, -64, -64, 64, -64, -64, -64, -64, -64, -64, -64, -64, -64, 64, 64, 64, -64, -64, -64, -64, 64, -64, 64, 64, -64, -64, -64, -64, -64, -64, -64, -64, 64, -64, 64, -64, -64, -64, -64, -64, -64, -64, -64, -64, 64, 64, 64, 64, 64, -64, -64, -64, -64, -64, -64, -64, -64, -64, 64, 64, -64, 64, -64, -64, -64, -64, -64, -64, -64, -64, -64, 64, 64, 64, -64, -64, 64, 64, -64, -64, -64, 64, -64, -64, -64, -64, 64, -64, 64, -64, -64, 64, 64, -64, -64, -64, -64, -64, 64, -64, 64, 64, -64, 64, -64, 64, 64, -64, 64, 64, -64, -64, -64, 64, 64, -64, 64, 64, 64, 64, 64, -64, -64, -64, -64, -64, 64, 64, 64, 64, -64, 64, -64, 64, 64, 64, 64, 64, 64, -64, -64, 64, 64, -64, -64, 64, 64, 64, 64, -64, -64, 64, 64, -64, -64, -64, -64, 64, 64, 64, -64, 64, -64, 64, -64, -64, -64, 64, 64, 64, 64, -64, -64, 64, 64, 64, 64, -64, 64, -64, -64, -64, -64, -64, 64, 64, 64, 64, 64, 64, 64, -64, -64, -64, 64, -64, 64, 64, 64, -64, -64, 64, 64, 64, 64, -64, -64, -64, -64, 64, 64, -64, -64, -64, 64, 64, -64, -64, 64, 64, 64, -64, 64, 64, 64, -64, -64, -64, 64, -64, 64, -64, -64, -64, -64, 64, 64, -64, -64, -64, -64, 64, -64, -64, 64, 64, 64, -64, 64, -64, -64, 64, -64, 64, -64, 64, 64, 64, -64, 64, 64, 64, -64, -64, -64, -64, 64, 64, 64, 64, -64, -64, -64, -64, 64, 64, 64, -64, -64, -64, 64, -64, 64, -64, 64, -64, -64, -64, 64, 64, -64, 64, -64, 64, 64, -64, -64, -64, -64, 64, 64, -64, 64, -64, -64, -64, -64, -64, -64, -64, -64, 64, -64, -64, -64, 64, 64, 64, -64, 64, -64, 64, 64, 64, 64, 64, -64, -64, -64, -64, 64, -64, -64, -64, 64, -64, 64, -64, -64, 64, -64, 64, -64, -64, -64, 64, 64, -64, -64, -64, -64, -64, 64, -64, -64, -64, 64, -64, -64, 64, -64, 64, -64, 64, 64, 64, -64, 64, 64, 64, -64, 64, 64, -64, -64, 64, -64, -64, 64, -64, 64, 64, 64, -64, -64, 64, 64, -64, 64, -64, 64, -64, -64, 64, 64, -64, 64, -64, -64, 64, -64, 64, -64, -64, -64, 64, -64, 64, -64, 64, 64, -64, -64, -64, 64, -64, -64, 64, -64, -64, -64, -64, -64, -64, -64, -64, -64, -64, -64, -64, -64, -64, 64, -64, -64, 64, -64, -64, -64, -64, -64, 64, 64, -64, -64, 64, -64, 64, -64, -64, -64, -64, -64, -64, -64, -64, 64, -64, -64, -64, -64, -64, -64, -64, 64, -64, -64, -64, -64, -64, -64, 64, 64, 64, 64, -64, -64, -64, 64, -64, -64, -64, 64, -64, 64, 64, 64, 64, -64, -64, 64, -64, -64, -64, -64, -64, 64, -64, -64, 64, 64, -64, -64, 64, -64, -64, -64, -64, -64, -64, -64, -64, -64, -64, -64, 64, 64, -64, 64, -64, -64, 64, -64, 64, -64, -64, -64, 64, -64, -64, -64, 64, -64, -64, -64, -64, -64, -64, -64, -64, 64, -64, -64, -64, -64, 64, -64, 64, 64, -64, -64, -64, -64, -64, 64, -64, 64, -64, -64, 64, 64, -64, 64, -64, -64, 64, -64, 64, -64, -64, -64, -64, -64, -64, -64, 64, -64, -64, -64, 64, -64, 64, -64, -64, 64, -64, 64, 64, -64, -64, -64, -64, -64, -64, -64, -64, -64, -64, 64, 64, 64, -64, 64, 64, 64, 64, 64, 64, 64, 64, 64, -64, 64, -64, -64, -64, 64, -64, 64, -64, -64, -64, -64, -64, -64, -64, -64, 64, 64, -64, 64, 64, 64, 64, -64, 64, -64, -64, 64, -64, -64, -64, 64, 64, -64, -64, -64, -64, -64, 64, -64, -64, -64, -64, 64, 64, -64, -64, 64, 64, 64, -64, -64, 64, -64, -64, -64, 64, -64, 64, 64, 64, 64, 64, -64, 64, 64, -64, -64, -64, -64, -64, -64, -64, -64, 64, -64, -64, 64, 64, 64, -64, 64, 64, -64, 64, 64, 64, -64, 64, -64, 64, -64, 64, 64, -64, -64, -64, -64, -64, 64, 64, -64, -64, 64, 64, 64, -64, 64, 64, 64, 64, 64, -64, 64, -64, 64, 64, -64, -64, 64, 64, -64, -64, 64, -64, -64, 64, -64, -64, -64, -64, 64, 64, -64, -64, -64, 64, 64, -64, 64, 64, -64, 64, 64, -64, 64, 64, 64, -64, -64, -64, -64, -64, -64, -64, -64, -64, -64, -64, 64, -64, 64, -64, 64, 64, 64, 64, -64, 64, -64, -64, -64, -64, -64, 64, 64, 64, -64, -64, 64, -64, -64, -64, -64, -64, -64, 64, 64, 64, 64, -64, 64, 64, -64, -64, 64, 64, 64, 64, 64, -64, -64, -64, 64, 64, 64, -64, 64, 64, -64, -64, 64, 64, 64, 64, 64, 64, 64, 64, -64, -64, -64, -64, 64, -64, 64, 64, -64, -64, -64, -64, 64, 64, -64, 64, 64, 64, -64, 64, -64, 64, 64, 64, 64, -64, -64, -64, -64, 64, 64, -64, 64, -64, -64, 64, -64, -64, -64, -64, -64, -64, -64, -64, -64, 64, -64, -64, 64, -64, 64, -64, -64, 64, 64, -64, 64, -64, 64, 64, -64, -64, 64, 64, 64, -64, -64, -64, 64, -64, -64, -64, -64, -64, -64, -64, 64, 64, -64, -64, 64, 64, -64, 64, -64, 64, -64, 64, -64, -64, 64, -64, -64, -64, 64, 64, -64, -64, -64, -64, 64, -64, -64, -64, -64, -64, -64, -64, 64, -64, 64, -64, -64, 64, 64, -64, 64, 64, -64, -64, -64, -64, 64, -64, -64, -64, -64, -64, -64, -64, -64, -64, 64, -64, 64, -64, -64, 64, 64, -64, -64, 64, 64, -64, -64, 64, 64, 64, -64, -64, -64, -64, 64, -64, 64, -64, -64, -64, -64, -64, -64, 64, -64, 64, 64, 64, 64, 64, 64, 64, -64, -64, -64, -64, -64, 64, -64, -64, -64, 64, -64, -64, -64, 64, 64, -64, 64, 64, 64, 64, -64, 64, -64, 64, 64, 64, 64, -64, 64, -64, -64, 64, -64, 64, 64, -64, 64, 64, -64, -64, -64, 64, -64, 64, -64, 64, 64, 64, -64, 64, -64, 64, -64, -64, -64, -64, -64, 64, -64, -64, 64, 64, 64, 64, 64, 64, -64, 64, 64, -64, 64, 64, 64, -64, 64, 64, -64, 64, 64, 64, 64, 64, -64, 64, -64, 64, -64, -64, 64, -64, 64, 64, 64, 64, 64, 64, 64, -64, -64, 64, -64, 64, 64, -64, 64, 64, 64, 64, -64, 64, 64, 64, 64, 64, -64, -64, 64, -64, -64, -64, 64, -64, 64, 64, -64, -64, 64, 64, 64, -64, 64, 64, -64, -64, 64, 64, 64, -64, 64, 64, -64, -64, 64, -64, 64, 64, -64, -64, -64, 64, -64, 64, -64, 64, -64, -64, 64, 64, -64, 64, -64, -64, 64, 64, -64, -64, -64, -64, -64, 64, -64, 64, 64, -64, -64, 64, 64, 64, 64, -64, -64, 64, -64, 64, -64, -64, -64, -64, -64, 64, 64, -64, 64, -64, -64, -64, -64, -64, 64, 64, 64, 64, -64, 64, -64, -64, -64, -64, -64, -64, -64, -64, -64, -64, 64, -64, -64, -64, 64, -64, -64, 64, -64, 64, -64, 64, -64, 64, -64, -64, -64, -64, -64, -64, -64, -64, -64, -64, -64, -64, 64, -64, -64, -64, -64, -64, 64, 64, -64, 64, -64, -64, -64, -64, -64, 64, -64, -64, 64, -64, -64, -64, 64, 64, -64, -64, 64, -64, -64, -64, -64, 64, 64, 64, -64, -64, 64, -64, -64, 64, 64, 64, 64, 64, 64, -64, 64, 64, 64, -64, 64, -64, -64, -64, 64, -64, -64, -64, -64, -64, -64, 64, -64, -64, -64, -64, 64, 64, -64, 64, 64, 64, -64, -64, -64, 64, 64, 64, 64, -64, -64, 64, -64, 64, -64, -64, -64, 64, 64, 64, -64, 64, 64, -64, -64, -64, 64, 64, -64, 64, -64, -64, 64, -64, -64, 64, -64, 64, -64, -64, -64, -64, -64, -64, -64, 64, -64, -64, 64, 64, -64, -64, -64, 64, 64, -64, 64, 64, -64, 64, -64, 64, -64, 64, -64, -64, -64, -64, -64, -64, -64, 64, -64, 64, -64, -64, -64, 64, -64, 64, -64, 64, -64, 64, 64, -64, -64, -64, 64, 64, -64, -64, -64, -64, -64, -64, -64, -64, -64, 64, 64, 64, -64, -64, 64, 64, 64, -64, -64, 64, 64, -64, -64, -64, -64, 64, 64, 64, -64, 64, -64, -64, -64, -64, -64, -64, -64, -64, 64, 64, -64, 64, -64, 64, 64, -64, 64, 64, 64, 64, -64, -64, 64, -64, 64, -64, 64, 64, -64, -64, 64, 64, -64, 64, 64, 64, -64, 64, 64, -64, 64, 64, -64, 64, 64, 64, 64, -64, -64, -64, 64, -64, -64, 64, -64, -64, 64, -64, -64, -64, 64, -64, -64, 64, -64, -64, 64, -64, -64, 64, 64, -64, -64, 64, -64, 64, 64, -64, -64, 64, -64, -64, -64, -64, -64, -64, 64, -64, -64, -64, -64, 64, 64, -64, 64, -64, 64, 64, 64, 64, -64, -64, 64, -64, -64, 64, -64, 64, -64, -64, -64, -64, -64, -64, -64, -64, -64, -64, 64, -64, -64, -64, -64, -64, 64, 64, -64, -64, 64, 64, -64, -64, 64, 64, -64, 64, -64, 64, -64, 64, -64, -64, -64, -64, -64, -64, -64, 64, -64, -64, 64, 64, 64, 64, -64, 64, -64, 64, 64, 64, -64, 64, -64, -64, 64, 64, -64, 64, -64, -64, -64, 64, -64, -64, -64, -64, 64, -64, -64, -64, -64, -64, -64, -64, -64, -64, 64, 64, -64, -64, 64, -64, -64, -64, -64, 64, 64, -64, -64, -64, -64, 64, 64, -64, 64, -64, -64, 64, -64, -64, 64, -64, -64, 64, -64, 64, 64, -64, 64, 64, 64, -64, -64, -64, -64, -64, -64, -64, -64, 64, 64, -64, 64, 64, -64, -64, -64, -64, 64, 64, 64, 64, 64, 64, 64, -64, -64, -64, 64, 64, -64, 64, 64, 64, -64, 64, -64, -64, 64, -64, -64, 64, -64, 64, -64, -64, 64, -64, 64, -64, -64, 64, -64, -64, 64, 64, -64, -64, 64, -64, -64, -64, -64, 64, -64, 64, 64, 64, -64, -64, 64, -64, 64, -64, -64, -64, -64, -64, 64, 64, 64, 64, -64, 64, -64, 64, 64, -64, 64, 64, 64, 64, -64, -64, 64, -64, 64, -64, -64, 64, 64, 64, -64, -64, 64, 64, 64, -64, -64, -64, -64, -64, -64, 64, 64, 64, 64, 64, -64, -64, 64, -64, 64, -64, 64, -64, -64, -64, 64, -64, -64, 64, 64, -64, -64, -64, -64, -64, -64, 64, -64, -64, -64, 64, 64, 64, -64, 64, -64, -64, -64, -64, -64, 64, -64, 64, 64, 64, 64, 64, 64, 64, 64, -64, 64, -64, 64, 64, 64, 64, -64, 64, -64, 64, 64, 64, -64, -64, 64, -64, -64, 64, 64, 64, 64, 64, 64, -64, -64, 64, 64, -64, -64, -64, -64, -64, -64, 64, 64, 64, 64, -64, 64, -64, 64, 64, 64, -64, 64, -64, 64, -64, 64, -64, -64, -64, -64, 64, -64, 64, 64, 64, -64, 64, -64, 64, 64, 64, -64, 64, 64, -64, -64, 64, -64, 64, -64, -64, 64, 64, -64, 64, -64, -64, -64, 64, -64, -64, 64, 64, 64, 64, 64, 64, 64, -64, -64, -64, 64, 64, 64, 64, 64, 64, 64, 64, 64, -64, -64, -64, 64, 64, 64, 64, -64, 64, 64, -64, -64, 64, 64, 64, 64, 64, 64, -64, -64, 64, 64, 64, 64, -64, -64, 64, 64, 64, 64, 64, -64, -64, -64, 64, -64, -64, -64, -64, -64, 64, 64, -64, -64, 64, 64, 64, 64, 64, 64, -64, 64, -64, 64, -64, 64, 64, 64, -64, -64, -64, -64, -64, 64, -64, 64, 64, 64, -64, 64, 64, -64, -64, 64, -64, -64, 64, 64, 64, -64, 64, 64, 64, 64, -64, 64, 64, 64, -64, -64, 64, -64, -64, -64, 64, 64, 64, 64, 64, -64, -64, -64, -64, 64, -64, -64, -64, 64, 64, -64, 64, -64, 64, 64, 64, 64, 64, -64, -64, 64, 64, -64, -64, -64, 64, 64, 64, -64, 64, -64, 64, 64, 64, -64, -64, 64, -64, -64, -64, 64, 64, 64, 64, -64, 64, 64, 64, -64, 64, -64, 64, 64, -64, 64, -64, -64, 64, 64, -64, -64, 64, 64, 64, 64, -64, -64, -64, -64, 64, 64, 64, 64, -64, -64, 64, -64, 64, 64, -64, 64, 64, 64, 64, -64, 64, -64, 64, 64, 64, 64, -64, 64, 64, -64, -64, 64, 64, -64, 64, -64, 64, 64, -64, 64, 64, -64, 64, -64, 64, -64, 64, 64, -64, -64, 64, 64, -64, -64, 64, 64, 64, -64, 64, 64, -64, 64, 64, 64, 64, -64, -64, -64, 64, 64, 64, 64, 64, 64, 64, 64, 64, 64, 64, 64, -64, 64, 64, 64, -64, 64, 64, -64, 64, -64, -64, 64, -64, -64, -64, -64, -64, -64, -64, 64, 64, -64, 64, 64, 64, 64, -64, -64, 64, 64, 64, 64, 64, 64, 64, 64, -64, 64, -64, 64, -64, -64, -64, 64, -64, -64, -64, 64, 64, -64, 64, 64, 64, 64, 64, 64, 64, -64, 64, -64, 64, 64, 64, 64, 64, -64, 64, -64, 64, 64, -64, -64, 64, -64, 64, 64, -64, 64, -64, 64, -64, 64, -64, -64, 64, 64, -64, 64, -64, 64, 64, 64, -64, -64, 64, 64, 64, 64, -64, 64, -64, 64, -64, -64, 64, 64, 64, 64, 64, 64, 64, -64, -64, -64, 64, 64, 64, 64, 64, -64, 64, -64, -64, -64, 64, -64, 64, 64, -64, 64, -64, 64, 64, 64, -64, 64, 64, -64, 64, -64, 64, -64, -64, 64, 64, -64, -64, 64, 64, -64, 64, -64, 64, -64, -64, 64, -64, -64, 64, -64, 64, 64, 64, -64, 64, -64, 64, -64, 64, 64, 64, 64, -64, -64, 64, 64, -64, -64, 64, 64, 64, 64, 64, 64, 64, 64, -64, 64, 64, 64, -64, -64, 64, -64, 64, 64, 64, -64, 64, 64, 64, 64, -64, -64, 64, -64, 64, -64, -64, 64, 64, 64, -64, -64, -64, -64, -64, 64, 64, -64, 64, -64, 64, 64, 64, -64, 64, 64, 64, 64, -64, 64, 64, 64, 64, -64, 64, 64, -64, -64, -64, 64, -64, -64, 64, -64, 64, 64, 64, -64, -64, 64, 64, -64, 64, 64, -64, 64, 64, 64, 64, 64, 64, -64, 64, -64, -64, 64, -64, 64, -64, 64, -64, 64, 64, 64, 64, 64, 64, 64, -64, 64, 64, 64, -64, -64, -64, 64, -64, -64, -64, -64, 64, -64, -64, 64, -64, 64, 64, 64, 64, 64, 64, 64, -64, 64, -64, 64, 64, 64, -64, 64, 64, -64, -64, 64, -64, 64, 64, -64, -64, 64, -64, 64, -64, 64, -64, -64, -64, 64, 64, 64, -64, 64, 64, 64, -64, -64, 64, 64, 64, 64, 64, 64, 64, -64, -64, -64, 64, 64, -64, -64, -64, 64, -64, -64, -64, 64, 64, 64, 64, -64, 64, -64, 64, 64, -64, 64, 64, -64, 64, 64, 64, -64, -64, -64, 64, -64, -64, -64, -64, -64, 64, -64, -64, 64, 64, 64, 64, -64, 64, 64, -64, -64, 64, -64, -64, -64, 64, -64, -64, 64, -64, -64, -64, 64, -64, -64, -64, 64, -64, 64, 64, 64, 64, 64, -64, -64, 64, -64, -64, 64, -64, -64, 64, 64, 64, 64, 64, -64, 64, -64, 64, -64, 64, 64, -64, -64, 64, -64, -64, 64, -64, -64, 64, -64, -64, 64, 64, -64, -64, -64, -64, -64, 64, 64, -64, -64, -64, -64, -64, 64, -64, 64, -64, -64, 64, -64, 64, 64, 64, 64, -64, 64, -64, 64, 64, 64, 64, 64, 64, 64, 64, -64, 64, 64, -64, -64, -64, -64, 64, 64, -64, 64, 64, -64, 64, 64, -64, -64, -64, -64, -64, -64, -64, 64, 64, 64, 64, 64, 64, 64, 64, -64, 64, -64, 64, -64, 64, -64, -64, -64, -64, -64, -64, 64, 64, 64, 64, -64, -64, 64, -64, -64, -64, 64, -64, -64, -64, -64, 64, 64, 64, 64, -64, 64, 64, -64, 64, -64, -64, -64, -64, -64, 64, 64, 64, 64, 64, -64, 64, -64, -64, -64, -64, -64, -64, 64, 64, 64, 64, 64, -64, -64, -64, 64, -64, 64, -64, -64, 64, 64, 64, -64, 64, 64, 64, 64, -64, -64, 64, 64, -64, -64, 64, 64, 64, 64, 64, 64, 64, -64, 64, -64, 64, 64, 64, 64, 64, 64, 64, 64, 64, 64, -64, -64, -64, 64, -64, -64, 64, 64, 64, 64, -64, 64, 64, -64, 64, -64, 64, -64, -64, -64, -64, -64, 64, 64, 64, 64, 64, 64, 64, 64, -64, -64, -64, 64, -64, 64, 64, -64, -64, 64, 64, -64, 64, -64, -64, 64, 64, -64, 64, -64, 64, 64, 64, 64, 64, -64, 64, -64, -64, -64, -64, -64, -64, 64, -64, -64, 64, 64, 64, 64, 64, 64, -64, 64, -64, -64, 64, 64, 64, 64, 64, 64, 64, 64, 64, 64, -64, -64, -64, -64, 64, -64, -64, -64, 64, 64, 64, -64, 64, -64, -64, 64, -64, -64, 64, -64, 64, -64, 64, 64, 64, 64, 64, 64, -64, -64, -64, 64, -64, -64, 64, 64, 64, -64, 64, -64, 64, 64, -64, -64, -64, -64, -64, -64, 64, 64, 64, 64, 64, 64, 64, -64, -64, -64, -64, -64, -64, 64, 64, 64, 64, 64, 64, -64, 64, -64, 64, -64, 64, 64, 64, -64, 64, 64, 64, 64, 64, 64, -64, -64, -64, -64, -64, -64, -64, 64, 64, 64, 64, 64, 64, 64, -64, -64, 64, 64, -64, -64, 64, 64, 64, 64, 64, 64, 64, 64, -64, -64, -64, -64, -64, -64, -64, 64, 64, 64, 64, 64, 64, 64, -64, 64, 64, -64, -64, 64, 64, 64, -64, 64, -64, 64, 64, 64, 64, -64, -64, -64, 64, -64, -64, -64, 64, -64, 64, 64, 64, 64, -64, 64, -64, 64, -64, 64, 64, 64, -64, 64, 64, 64, 64, 64, -64, -64, 64, 64, 64, -64, -64, 64, 64, -64, 64, -64, 64, 64, -64, 64, -64, 64, 64, 64, 64, 64, 64, -64, 64, 64, 64, 64, 64, 64, 64, 64, 64, 64, -64, 64, 64, 64, 64, 64, 64, 64, -64, 64, 64, -64, -64, -64, 64, -64, 64, 64, 64, 64, 64, 64, 64, 64, 64, 64, -64, -64, 64, 64, 64, 64, 64, 64, 64, 64, 64, 64, 64, 64, 64, -64, -64, -64, 64, 64, 64, 64, 64, 64, 64, 64, 64, -64, -64, -64, 64, 64, 64, 64, 64, 64, 64, 64, 64, -64, -64, 64, -64, -64, -64, -64, -64, 64, 64, 64, 64, 64, 64, 64, -64, 64, -64, -64, 64, 64, 64, -64, 64, 64, 64, -64, -64, -64, 64, -64, -64, -64, -64, -64, -64, 64, -64, -64, 64, 64, 64, -64, -64, 64, 64, -64, 64, 64, 64, 64, 64, 64, 64, -64, 64, -64, 64, -64, -64, -64, -64, -64, -64, -64, -64, 64, 64, -64, 64, 64, -64, 64, -64, 64, 64, 64, 64, 64, 64, 64, 64, 64, 64, -64, 64, -64, -64, -64, -64, -64, -64, -64, 64, 64, 64, 64, -64, 64, 64, 64, 64, 64, 64, 64, 64, 64, -64, -64, -64, -64, -64, 64, 64, -64, -64, -64, -64, -64, -64, -64, -64, -64, 64, -64, 64, 64, 64, 64, 64, -64, 64, 64, 64, 64, 64, -64, -64, -64, 64, 64, 64, -64, -64, -64, -64, -64, -64, -64, -64, -64, -64, 64, 64, 64, 64, 64, 64, -64, 64, 64, 64, 64, 64, 64, -64, -64, 64, -64, -64, -64, -64, 64, 64, -64, -64, -64, -64, -64, -64, -64, -64, -64, 64, 64, -64, -64, 64, 64, 64, 64, 64, 64, -64, -64, 64, -64, -64, 64, -64, -64, -64, 64, -64, 64, 64, -64, -64, -64, -64, -64, -64, 64, -64, -64, 64, 64, 64, -64, 64, -64, 64, -64, -64, 64, -64, 64, 64, 64, 64, -64, -64, -64, -64, -64, 64, -64, 64, 64, -64, 64, -64, 64, 64, -64, -64, 64, 64, -64, -64, 64, -64, -64, 64, -64, 64, 64, -64, -64, -64, -64, -64, -64, 64, -64, 64, 64, -64, 64, 64, 64, 64, -64, 64, 64, 64, 64, 64, 64, 64, 64, -64, 64, -64, -64, 64, 64, 64, -64, 64, 64, 64, 64, 64, 64, 64, 64, -64, 64, -64, 64, 64, -64, 64, 64, 64, 64, -64, -64, 64, -64, -64, 64, -64, -64, -64, 64, 64, 64, -64, 64, 64, -64, 64, 64, 64, 64, -64, -64, -64, 64, -64, 64, 64, -64, -64, 64, -64, 64, 64, -64, -64, -64, 64, -64, -64, 64, -64, -64, -64, 64, -64, -64, 64, -64, -64, 64, -64, 64, -64, 64, 64, -64, -64, -64, -64, -64, 64, 64, 64, 64, -64, 64, -64, -64, -64, -64, 64, 64, -64, -64, 64, -64, 64, -64, 64, 64, 64, -64, -64, 64, 64, -64, 64, 64, 64, 64, 64, -64, -64, -64, -64, -64, -64, -64, -64, 64, -64, -64, -64, 64, -64, -64, -64, 64, -64, -64, 64, -64, -64, -64, -64, 64, -64, 64, 64, 64, 64, -64, -64, -64, -64, -64, 64, 64, 64, -64, -64, -64, 64, -64, -64, 64, 64, -64, 64, 64, -64, -64, 64, 64, -64, -64, -64, -64, -64, -64, -64, -64, -64, -64, 64, -64, -64, 64, -64, 64, 64, -64, -64, -64, -64, 64, 64, 64, -64, 64, 64, 64, -64, -64, 64, -64, -64, -64, 64, 64, 64, 64, 64, -64, -64, -64, 64, 64, 64, -64, -64, 64, 64, -64, -64, -64, 64, 64, 64, -64, 64, -64, 64, 64, -64, -64, 64, 64, -64, 64, -64, 64, 64, 64, -64, -64, -64, 64, 64, 64, 64, -64, -64, 64, -64, 64, -64, 64, -64, -64, 64, -64, -64, -64, -64, -64, -64, -64, -64, -64, -64, -64, -64, -64, 64, -64, 64, -64, -64, 64, 64, 64, -64, 64, -64, 64, -64, -64, -64, -64, -64, 64, 64, -64, 64, -64, 64, 64, -64, 64, -64, -64, -64, 64, 64, -64, -64, 64, -64, 64, -64, 64, 64, 64, -64, -64, 64, -64, -64, -64, 64, -64, -64, -64, -64, 64, 64, -64, 64, -64, -64, 64, -64, 64, -64, -64, -64, 64, -64, 64, -64, 64, 64, -64, -64, -64, -64, -64, -64, -64, 64, 64, -64, 64, 64, 64, 64, -64, -64, -64, -64, 64, 64, 64, -64, 64, -64, -64, -64, -64, 64, 64, -64, 64, -64, -64, 64, 64, 64, -64, -64, -64, 64, -64, -64, -64, -64, -64, 64, -64, 64, -64, -64, -64, 64, 64, 64, -64, -64, 64, -64, -64, -64, 64, 64, -64, 64, -64, -64, -64, -64, -64, -64, -64, 64, 64, -64, 64, 64, -64, -64, 64, 64, -64, -64, 64, -64, 64, 64, -64, -64, -64, -64, -64, -64, -64, -64, -64, -64, -64, 64, -64, -64, -64, -64, -64, 64, 64, -64, 64, -64, 64, -64, 64, 64, -64, -64, -64, -64, -64, -64, -64, 64, 64, -64, -64, -64, 64, -64, -64, -64, -64, 64, -64, -64, 64, -64, 64, 64, -64, -64, 64, -64, 64, -64, -64, -64, -64, 64, -64, 64, -64, -64, -64, 64, 64, 64, 64, -64, -64, 64, 64, -64, -64, -64, -64, -64, 64, 64, 64, 64, 64, -64, -64, 64, -64, 64, 64, 64, -64, 64, 64, 64, -64, -64, -64, -64, 64, 64, -64, 64, 64, -64, -64, 64, -64, 64, 64, -64, -64, -64, 64, -64, -64, 64, -64, 64, -64, -64, -64, -64, -64, -64, -64, 64, -64, -64, 64, 64, 64, 64, 64, -64, 64, 64, 64, -64, -64, -64, 64, -64, -64, -64, -64, 64, -64, -64, -64, 64, -64, -64, -64, 64, 64, -64, 64, -64, -64, -64, 64, -64, -64, 64, -64, 64, 64, 64, -64, -64, 64, -64, 64, 64, -64, -64, -64, -64, -64, -64, 64, 64, -64, -64, 64, -64, -64, -64, -64, 64, -64, -64, 64, 64, 64, -64, -64, 64, -64, -64, 64, 64, 64, -64, 64, -64, -64, -64, 64, 64, 64, -64, -64, 64, 64, -64, 64, -64, -64, 64, 64, 64, 64, -64, -64, 64, 64, 64, 64, -64, -64, -64, -64, -64, -64, 64, -64, -64, 64, -64, -64, 64, -64, 64, 64, -64, -64, 64, 64, -64, 64, 64, 64, -64, -64, -64, 64, -64, -64, -64, -64, -64, -64, -64, 64, 64, 64, -64, -64, 64, 64, -64, 64, 64, 64, -64, 64, -64, 64, -64, 64, -64, -64, 64, 64, -64, -64, 64, -64, -64, -64, 64, 64, -64, 64, 64, -64, 64, 64, -64, -64, 64, -64, -64, -64, 64, 64, -64, 64, 64, -64, 64, -64, 64, -64, -64, -64, 64, 64, -64, 64, -64, 64, 64, 64, 64, -64, -64, -64, 64, 64, -64, -64, 64, -64, 64, 64, 64, -64, 64, -64, 64, 64, 64, 64, -64, -64, 64, -64, -64, 64, 64, -64, -64, 64, -64, 64, 64, 64, 64, -64, 64, 64, 64, 64, -64, 64, -64, 64, -64, -64, -64, -64, -64, -64, -64, -64, 64, -64, -64, 64, 64, 64, 64, -64, -64, -64, 64, 64, 64, -64, 64, 64, 64, 64, -64, 64, -64, -64, -64, -64, -64, -64, 64, 64, 64, -64, -64, -64, -64, 64, -64, 64, 64, -64, -64, -64, -64, 64, 64, -64, -64, 64, 64, 64, 64, -64, -64, 64, 64, -64, -64, -64, 64, -64, -64, -64, -64, 64, 64, -64, 64, -64, -64, -64, -64, 64, -64, 64, 64, -64, 64, -64, -64, -64, -64, 64, -64, 64, 64, 64, 64, -64, -64, -64, -64, 64, 64, -64, -64, -64, 64, -64, -64, -64, -64, -64, -64, -64, -64, -64, -64, -64, -64, -64, -64, -64, -64, -64, -64, -64, -64, -64, -64, 64, 64, -64, -64, 64, 64, 64, 64, -64, 64, 64, 64, 64, -64, 64, -64, -64, -64, -64, -64, -64, -64, -64, -64, -64, -64, -64, -64, -64, -64, -64, -64, -64, -64, 64, 64, 64, -64, 64, 64, 64, 64, -64, 64, 64, -64, 64, -64, -64, -64, -64, -64, -64, -64, -64, -64, -64, -64, -64, -64, -64, 64, 64, 64, 64, -64, 64, 64, 64, 64, 64, 64, 64, -64, -64, -64, -64, -64, -64, -64, 64, -64, -64, -64, -64, 64, -64, 64, 64, -64, -64, -64, -64, -64, 64, 64, 64, 64, -64, 64, 64, 64, -64, -64, -64, -64, -64, -64, -64, -64, 64, 64, -64, -64, -64, -64, -64, -64, -64, -64, 64, -64, -64, -64, 64, 64, 64, 64, 64, 64, 64, -64, 64, 64, -64, -64, -64, -64, -64, -64, -64, -64, -64, 64, -64, -64, -64, 64, -64, -64, 64, -64, 64, 64, -64, 64, -64, 64, -64, -64, 64, 64, 64, -64, -64, -64, -64, -64, 64, 64, 64, -64, -64, -64, 64, -64, 64, -64, 64, -64, 64, 64, 64, 64, -64, -64, -64, -64, 64, 64, -64, 64, 64, -64, -64, 64, 64, 64, 64, 64, -64, -64, 64, -64, -64, -64, 64, 64, 64, -64, -64, -64, 64, -64, -64, 64, 64, 64, 64, 64, 64, 64, 64, -64, 64, 64, -64, 64, 64, -64, -64, -64, 64, -64, -64, -64, 64, 64, -64, -64, 64, -64, -64, -64, 64, 64, 64, 64, 64, 64, 64, 64, 64, 64, -64, 64, 64, -64, -64, -64, 64, -64, 64, 64, 64, 64, 64, -64, -64, -64, -64, -64, 64, 64, 64, 64, 64, -64, 64, 64, -64, 64, -64, -64, -64, -64, -64, 64, 64, -64, 64, 64, 64, -64, 64, -64, -64, -64, 64, -64, 64, 64, 64, 64, 64, -64, 64, 64, -64, -64, -64, -64, 64, -64, -64, -64, 64, 64, 64, 64, 64, 64, -64, 64, -64, -64, 64, -64, -64, 64, 64, 64, -64, -64, 64, 64, 64, -64, -64, -64, -64, 64, -64, 64, -64, 64, -64, -64, -64, -64, -64, 64, 64, 64, 64, -64, -64, -64, -64, -64, -64, 64, 64, -64, -64, -64, 64, -64, -64, -64, -64, 64, -64, -64, -64, -64, -64, -64, -64, -64, 64, -64, 64, -64, -64, -64, -64, -64, -64, -64, -64, -64, 64, 64, -64, -64, -64, -64, -64, -64, 64, -64, -64, -64, -64, -64, -64, -64, -64, -64, -64, 64, -64, -64, -64, -64, -64, -64, -64, 64, 64, 64, 64, -64, -64, 64, -64, -64, -64, -64, -64, -64, -64, -64, -64, -64, -64, -64, -64, -64, -64, -64, -64, -64, -64, -64, 64, 64, 64, 64, 64, -64, -64, 64, 64, 64, -64, 64, -64, 64, -64, -64, -64, -64, -64, -64, -64, -64, -64, -64, -64, 64, -64, 64, -64, 64, -64, 64, 64, -64, -64, 64, -64, -64, -64, -64, 64, -64, -64, -64, -64, -64, -64, -64, -64, -64, -64, -64, -64, -64, 64, 64, 64, -64, -64, -64, 64, -64, 64, -64, -64, -64, -64, 64, -64, -64, -64, -64, -64, -64, -64, -64, -64, -64, 64, 64, 64, 64, 64, 64, 64, -64, -64, -64, -64, 64, -64, 64, 64, -64, -64, 64, 64, -64, -64, -64, -64, 64, 64, 64, 64, 64, 64, 64, 64, 64, -64, 64, 64, 64, -64, 64, 64, 64, 64, 64, 64, 64, 64, -64, 64, 64, -64, 64, 64, 64, 64, 64, 64, 64, 64, -64, 64, -64, 64, 64, 64, 64, -64, -64, -64, 64, -64, 64, 64, 64, -64, -64, -64, -64, 64, 64, 64, 64, -64, 64, -64, -64, -64, 64, -64, -64, 64, 64, -64, -64, -64, -64, 64, -64, -64, 64, -64, 64, -64, -64, -64, 64, -64, -64, 64, -64, 64, 64, -64, -64, -64, -64, -64, 64, -64, -64, -64, 64, -64, 64, 64, 64, -64, -64, 64, -64, 64, -64, -64, -64, -64, 64, -64, -64, 64, 64, 64, -64, 64, 64, -64, -64, 64, 64, -64, -64, 64, 64, -64, 64, 64, -64, -64, -64, -64, 64, 64, -64, -64, -64, -64, -64, -64, -64, -64, 64, 64, -64, 64, 64, 64, 64, 64, 64, -64, -64, -64, -64, -64, 64, -64, -64, -64, -64, -64, 64, -64, -64, -64, -64, -64, 64, -64, -64, -64, -64, -64, 64, 64, 64, 64, 64, 64, 64, 64, -64, -64, 64, -64, -64, 64, -64, 64, 64, 64, 64, 64, 64, 64, -64, -64, 64, 64, 64, 64, 64, 64, 64, 64, 64, 64, 64, -64, -64, -64, -64, 64, -64, -64, 64, 64, 64, 64, 64, 64, 64, -64, 64, -64, 64, 64, 64, 64, 64, 64, 64, 64, 64, 64, 64, 64, 64, -64, -64, 64, 64, -64, 64, 64, 64, 64, 64, -64, -64, -64, -64, -64, 64, -64, 64, 64, 64, -64, -64, 64, 64, 64, 64, 64, 64, -64, -64, -64, -64, -64, 64, 64, 64, 64, -64, -64, -64, -64, -64, -64, 64, -64, 64, 64, -64, -64, -64, -64, -64, -64, 64, 64, -64, -64, -64, -64, -64, -64, 64, 64, -64, -64, -64, -64, -64, -64, -64, -64, -64, 64, 64, -64, -64, -64, -64, -64, -64, 64, 64, 64, 64, 64, 64, -64, -64, 64, 64, -64, -64, -64, 64, -64, -64, -64, -64, 64, 64, -64, 64, -64, -64, -64, -64, -64, -64, 64, 64, 64, 64, 64, -64, -64, -64, 64, -64, -64, -64, 64, 64, -64, -64, -64, -64, 64, 64, 64, -64, -64, -64, -64, -64, 64, 64, -64, 64, 64, 64, -64, -64, 64, -64, -64, -64, -64, -64, -64, -64, 64, -64, -64, 64, 64, 64, -64, -64, -64, -64, -64, -64, 64, 64, 64, 64, -64, 64, 64, 64, 64, 64, -64, -64, 64, -64, -64, -64, -64, 64, 64, 64, 64, -64, -64, -64, -64, -64, 64, -64, 64, 64, 64, -64, 64, -64, 64, -64, -64, -64, 64, -64, -64, -64, -64, 64, 64, 64, 64, 64, -64, 64, 64, -64, -64, -64, 64, 64, 64, 64, 64, -64, -64, -64, 64, -64, -64, -64, -64, -64, -64, 64, -64, 64, 64, 64, -64, 64, 64, -64, 64, -64, 64, 64, -64, 64, 64, 64, -64, -64, -64, -64, -64, -64, 64, 64, -64, -64, 64, -64, 64, 64, 64, 64, 64, 64, 64, 64, -64, -64, -64, -64, -64, 64, 64, 64, -64, 64, -64, -64, -64, -64, 64, -64, 64, -64, -64, -64, -64, -64, 64, -64, -64, -64, 64, 64, 64, -64, -64, -64, -64, 64, 64, 64, 64, 64, -64, -64, -64, -64, 64, -64, -64, -64, -64, 64, -64, -64, 64, -64, -64, -64, 64, 64, 64, 64, -64, -64, -64, -64, 64, -64, 64, 64, 64, -64, -64, -64, 64, 64, -64, -64, -64, 64, -64, 64, 64, -64, 64, -64, 64, -64, 64, -64, -64, -64, -64, -64, 64, 64, 64, 64, 64, -64, 64, 64, -64, 64, -64, -64, -64, 64, -64, -64, 64, 64, -64, -64, 64, -64, 64, -64, -64, -64, 64, 64, 64, 64, 64, 64, 64, -64, -64, -64, 64, -64, -64, -64, -64, -64, -64, -64, -64, 64, -64, 64, 64, -64, -64, -64, -64, -64, 64, 64, 64, 64, 64, 64, 64, -64, -64, -64, 64, 64, -64, 64, -64, -64, -64, -64, -64, -64, 64, 64, -64, 64, 64, -64, 64, -64, 64, 64, 64, 64, -64, 64, -64, -64, -64, -64, 64, -64, 64, 64, 64, -64, -64, -64, -64, -64, -64, 64, 64, 64, 64, 64, 64, 64, 64, 64, 64, 64, -64, -64, 64, 64, -64, 64, -64, 64, 64, 64, -64, -64, -64, -64, -64, -64, 64, 64, 64, 64, 64, -64, 64, 64, -64, -64, 64, -64, -64, -64, -64, -64, -64, 64, 64, -64, -64, 64, -64, 64, -64, -64, 64, -64, 64, -64, -64, -64, 64, -64, -64, -64, -64, -64, -64, -64, -64, 64, -64, 64, 64, 64, -64, -64, 64, -64, -64, 64, -64, -64, -64, -64, -64, -64, -64, -64, -64, -64, -64, -64, -64, -64, -64, -64, 64, -64, 64, 64, -64, 64, 64, -64, 64, -64, -64, -64, 64, -64, -64, -64, -64, -64, -64, -64, -64, -64, -64, -64, -64, -64, -64, -64, -64, 64, 64, 64, 64, 64, 64, 64, -64, 64, 64, 64, -64, -64, -64, 64, -64, -64, 64, 64, 64, 64, -64, -64, -64, -64, -64, 64, -64, 64, -64, -64, 64, -64, 64, -64, 64, -64, 64, -64, 64, -64, -64, -64, -64, -64, -64, 64, -64, 64, 64, -64, -64, -64, -64, -64, -64, -64, -64, -64, 64, 64, -64, -64, -64, -64, -64, -64, -64, -64, 64, 64, 64, -64, 64, -64, -64, -64, -64, 64, -64, -64, 64, -64, -64, 64, 64, 64, 64, -64, 64, 64, 64, 64, 64, -64, -64, -64, 64, 64, 64, 64, -64, -64, -64, -64, -64, -64, 64, -64, 64, -64, -64, -64, 64, -64, -64, -64, -64, -64, -64, 64, -64, -64, -64, 64, 64, 64, 64, 64, -64, -64, -64, -64, -64, -64, -64, -64, -64, 64, 64, 64, -64, -64, -64, 64, -64, 64, -64, -64, -64, 64, 64, 64, 64, 64, 64, 64, 64, -64, -64, -64, -64, -64, -64, -64, -64, 64, 64, 64, 64, 64, -64, 64, 64, 64, -64, 64, 64, 64, 64, 64, 64, 64, 64, 64, -64, -64, -64, -64, -64, -64, -64, -64, -64, -64, -64, -64, 64, 64, -64, -64, 64, -64, -64, -64, 64, 64, 64, -64, 64, 64, 64, -64, -64, -64, -64, -64, -64, -64, -64, -64, -64, -64, 64, 64, -64, -64, -64, -64, 64, -64, -64, -64, 64, 64, 64, -64, 64, 64, 64, -64, -64, -64, -64, -64, 64, 64, -64, -64, -64, 64, 64, 64, 64, -64, -64, 64, 64, -64, -64, 64, 64, 64, 64, 64, -64, 64, -64, -64, -64, 64, 64, 64, 64, 64, 64, 64, 64, 64, 64, 64, 64, -64, 64, -64, 64, 64, 64, 64, 64, 64, 64, -64, -64, -64, -64, -64, -64, 64, 64, 64, 64, 64, 64, 64, 64, 64, 64, 64, 64, -64, 64, 64, -64, 64, 64, 64, 64, 64, 64, 64, -64, -64, -64, -64, -64, 64, 64, 64, 64, 64, 64, 64, 64, 64, 64, 64, 64, 64, 64, 64, 64, 64, 64, -64, 64, 64, -64, -64, -64, 64, -64, 64, 64, -64, -64, 64, 64, 64, 64, 64, 64, 64, 64, 64, 64, 64, -64, -64, -64, -64, -64, -64, 64, 64, 64, 64, 64, 64, -64, 64, 64, 64, 64, 64, -64, -64, -64, 64, 64, 64, 64, 64, 64, -64, 64, 64, -64, -64, -64, 64, 64, 64, 64, -64, 64, 64, -64, 64, 64, 64, -64, 64, 64, 64, -64, -64, 64, 64, 64, 64, -64, -64, 64, -64, 64, 64, -64, 64, 64, 64, 64, 64, 64, 64, 64, 64, 64, 64, 64, 64, 64, 64, 64, -64, 64, 64, -64, 64, -64, 64, -64, 64, 64, 64, 64, 64, 64, -64, 64, 64, 64, 64, 64, 64, 64, 64, 64, 64, 64, 64, -64, 64, 64, 64, 64, 64, 64, 64, 64, 64, -64, 64, 64, 64, -64, 64, 64, 64, 64, 64, 64, 64, 64, 64, -64, 64, 64, 64, 64, -64, 64, 64, 64, 64, 64, 64, -64, 64, -64, 64, 64, 64, 64, 64, 64, 64, 64, 64, 64, 64, 64, -64, 64, 64, 64, 64, -64, 64, 64, -64, -64, 64, -64, -64, 64, -64, -64, 64, -64, 64, 64, 64, 64, 64, 64, 64, 64, 64, 64, 64, -64, 64, 64, 64, -64, -64, -64, 64, 64, -64, -64, 64, 64, 64, -64, -64, -64, -64, -64, 64, 64, 64, 64, 64, 64, 64, -64, -64, -64, 64, -64, -64, -64, 64, 64, 64, 64, -64, -64, 64, -64, 64, 64, -64, -64, -64, 64, 64, 64, 64, -64, 64, 64, 64, -64, -64, -64, 64, -64, -64, -64, 64, -64, 64, 64, -64, -64, 64, -64, 64, 64, 64, -64, -64, -64, 64, -64, -64, -64, -64, 64, -64, -64, -64, -64, 64, -64, -64, -64, -64, -64, -64, 64, -64, -64, 64, 64, 64, 64, -64, -64, -64, -64, -64, -64, -64, 64, -64, 64, 64, -64, -64, 64, -64, -64, -64, 64, 64, -64, 64, 64, -64, 64, -64, -64, -64, 64, 64, 64, 64, -64, -64, -64, -64, 64, 64, 64, 64, -64, 64, 64, -64, -64, 64, 64, 64, 64, 64, 64, -64, 64, 64, -64, -64, 64, 64, 64, -64, -64, -64, -64, -64, 64, 64, -64, -64, 64, 64, -64, -64, -64, 64, -64, 64, 64, -64, -64, 64, 64, -64, -64, -64, 64, -64, -64, -64, -64, -64, 64, -64, 64, -64, -64, 64, -64, 64, -64, -64, -64, -64, -64, 64, 64, -64, -64, 64, 64, 64, 64, 64, -64, 64, -64, -64, 64, 64, 64, -64, 64, -64, -64, -64, -64, 64, -64, -64, 64, -64, -64, 64, -64, -64, 64, -64, -64, 64, 64, -64, 64, -64, -64, 64, 64, -64, 64, -64, -64, 64, -64, -64, -64, 64, 64, -64, -64, -64, 64, -64, 64, 64, -64, 64, -64, -64, -64, -64, -64, 64, 64, -64, 64, -64, 64, 64, -64, -64, -64, -64, -64, 64, -64, -64, -64, 64, -64, -64, -64, -64, -64, -64, -64, -64, 64, -64, -64, -64, -64, 64, 64, 64, 64, -64, 64, -64, 64, 64, 64, -64, 64, 64, 64, -64, 64, 64, 64, 64, -64, -64, -64, 64, -64, -64, 64, -64, -64, -64, -64, 64, -64, 64, 64, 64, 64, 64, 64, 64, 64, 64, 64, -64, 64, 64, 64, 64, 64, 64, -64, -64, 64, 64, 64, 64, 64, 64, -64, 64, 64, 64, 64, 64, 64, 64, 64, 64, 64, 64, -64, -64, -64, -64, 64, -64, 64, 64, -64, 64, 64, -64, -64, 64, -64, 64, 64, 64, 64, 64, 64, 64, 64, 64, 64, 64, 64, 64, 64, 64, 64, 64, -64, -64, -64, -64, -64, 64, 64, 64, -64, -64, -64, 64, -64, -64, -64, -64, 64, 64, 64, -64, 64, 64, -64, 64, 64, 64, 64, 64, 64, -64, -64, -64, -64, -64, 64, 64, -64, -64, 64, -64, 64, 64, 64, -64, 64, 64, 64, 64, 64, 64, 64, 64, 64, 64, 64, 64, 64, 64, -64, -64, -64, -64, -64, -64, -64, 64, -64, -64, -64, 64, 64, -64, -64, -64, 64, 64, 64, 64, -64, 64, 64, 64, 64, 64, 64, 64, 64, -64, -64, -64, 64, -64, 64, 64, 64, 64, 64, -64, 64, -64, 64, 64, 64, 64, 64, 64, 64, 64, 64, -64, -64, 64, 64, 64, -64, -64, -64, -64, 64, 64, 64, 64, 64, 64, 64, -64, 64, 64, 64, 64, 64, 64, 64, 64, 64, 64, 64, 64, 64, 64, -64, -64, 64, -64, -64, 64, -64, -64, 64, 64, 64, -64, -64, -64, -64, -64, -64, 64, 64, 64, 64, 64, 64, 64, 64, -64, -64, -64, -64, 64, 64, -64, -64, -64, -64, 64, 64, -64, -64, -64, -64, -64, -64, -64, -64, -64, -64, -64, 64, 64, 64, -64, -64, -64, -64, -64, -64, 64, 64, -64, -64, -64, 64, -64, -64, -64, 64, -64, -64, -64, -64, -64, -64, -64, -64, 64, -64, 64, -64, -64, -64, -64, 64, 64, -64, 64, 64, 64, -64, 64, -64, -64, -64, 64, -64, -64, -64, -64, -64, -64, -64, -64, -64, -64, -64, -64, -64, -64, 64, 64, 64, 64, 64, -64, 64, 64, -64, 64, 64, -64, -64, 64, -64, 64, -64, -64, -64, -64, -64, -64, -64, -64, -64, -64, 64, 64, -64, 64, 64, 64, 64, -64, -64, 64, 64, 64, 64, -64, -64, 64, 64, 64, -64, -64, -64, -64, -64, -64, -64, -64, -64, -64, -64, -64, -64, 64, 64, 64, 64, -64, -64, 64, -64, -64, -64, 64, 64, 64, 64, 64, 64, 64, -64, -64, -64, -64, -64, -64, -64, -64, -64, -64, 64, 64, -64, 64, -64, 64, -64, -64, 64, 64, 64, -64, 64, 64, 64, 64, 64, -64, -64, -64, -64, -64, -64, -64, -64, -64, 64, -64, -64, -64, -64, -64, 64, 64, 64, -64, 64, 64, -64, 64, 64, -64, 64, 64, 64, 64, 64, 64, -64, -64, -64, 64, -64, -64, 64, 64, -64, -64, 64, 64, 64, 64, -64, 64, 64, 64, -64, 64, 64, 64, 64, 64, 64, 64, 64, 64, 64, 64, 64, 64, -64, 64, -64, 64, 64, -64, 64, -64, 64, 64, 64, 64, 64, -64, -64, -64, -64, 64, 64, 64, 64, 64, 64, 64, 64, 64, 64, 64, 64, 64, 64, -64, 64, 64, -64, 64, 64, 64, -64, -64, -64, -64, 64, 64, 64, 64, 64, 64, 64, 64, 64, 64, 64, 64, 64, 64, 64, 64, 64, -64, 64, 64, -64, -64, -64, -64, -64, -64, -64, 64, 64, 64, 64, 64, 64, 64, 64, 64, 64, 64, 64, 64, 64, 64, 64, 64, -64, 64, 64, -64, 64, -64, 64, -64, -64, -64, 64, -64, -64, 64, -64, -64, 64, 64, 64, 64, 64, 64, 64, -64, 64, 64, 64, 64, -64, 64, 64, -64, -64, -64, 64, -64, -64, -64, 64, -64, -64, 64, -64, -64, 64, -64, 64, 64, 64, 64, -64, -64, 64, -64, 64, 64, 64, 64, 64, 64, -64, -64, -64, -64, -64, -64, -64, -64, -64, -64, 64, -64, -64, -64, 64, 64, 64, 64, 64, 64, -64, 64, 64, 64, 64, -64, -64, -64, -64, -64, -64, -64, -64, -64, -64, -64, 64, -64, -64, 64, 64, -64, -64, 64, 64, 64, -64, 64, -64, 64, -64, 64, 64, -64, -64, 64, -64, -64, -64, 64, -64, 64, 64, -64, 64, 64, 64, 64, -64, 64, -64, 64, -64, 64, -64, -64, -64, -64, -64, -64, -64, -64, 64, 64, -64, 64, 64, -64, -64, -64, -64, 64, -64, 64, -64, 64, 64, -64, -64, -64, 64, 64, -64, -64, -64, -64, -64, -64, 64, 64, -64, 64, -64, -64, -64, -64, 64, -64, -64, 64, 64, -64, -64, 64, 64, 64, -64, 64, 64, -64, -64, 64, 64, -64, -64, 64, 64, 64, -64, 64, 64, 64, 64, 64, 64, 64, 64, -64, -64, 64, -64, -64, 64, -64, 64, 64, 64, 64, -64, -64, 64, 64, 64, 64, 64, 64, 64, 64, -64, 64, 64, -64, -64, 64, -64, 64, 64, -64, -64, 64, 64, -64, 64, 64, 64, 64, 64, 64, 64, 64, 64, 64, 64, 64, 64, 64, 64, 64, 64, -64, -64, -64, -64, -64, 64, -64, -64, -64, 64, -64, 64, -64, -64, -64, 64, 64, 64, 64, 64, 64, 64, 64, 64, 64, 64, 64, -64, -64, -64, 64, 64, 64, -64, 64, -64, -64, -64, 64, 64, 64, 64, -64, -64, 64, -64, -64, -64, 64, 64, 64, 64, 64, 64, 64, 64, 64, -64, 64, -64, 64, -64, 64, 64, -64, -64, 64, 64, 64, 64, -64, 64, -64, -64, -64, -64, -64, -64, 64, 64, 64, 64, 64, 64, 64, -64, -64, 64, 64, 64, -64, 64, 64, 64, 64, 64, 64, 64, 64, -64, -64, -64, -64, -64, -64, -64, -64, -64, 64, 64, 64, 64, 64, 64, 64, 64, -64, -64, 64, -64, 64, 64, 64, 64, -64, 64, 64, -64, -64, -64, -64, -64, -64, -64, -64, -64, 64, 64, 64, 64, 64, 64, 64, 64, -64, -64, -64, -64, 64, 64, 64, 64, 64, -64, 64, -64, -64, -64, -64, -64, -64, -64, -64, -64, 64, 64, 64, 64, 64, 64, 64, 64, -64, -64, 64, -64, -64, 64, 64, 64, 64, 64, -64, 64, -64, 64, -64, -64, -64, -64, -64, -64, -64, 64, 64, 64, 64, 64, 64, 64, -64, -64, 64, 64, 64, 64, -64, -64, 64, -64, 64, -64, -64, 64, 64, -64, -64, -64, -64, -64, -64, 64, 64, 64, 64, 64, 64, 64, 64, -64, -64, 64, 64, -64, 64, -64, -64, 64, 64, 64, -64, 64, -64, -64, -64, -64, -64, -64, 64, 64, 64, 64, 64, -64, 64, -64, 64, -64, -64, 64, 64, 64, -64, 64, -64, 64, 64, 64, 64, 64, 64, -64, -64, -64, -64, -64, -64, 64, 64, 64, -64, -64, 64, -64, 64, 64, -64, -64, 64, -64, 64, 64, 64, 64, 64, 64, 64, 64, 64, 64, -64, -64, 64, -64, -64, 64, 64, 64, -64, -64, 64, 64, -64, 64, 64, 64, -64, 64, 64, 64, 64, 64, 64, 64, 64, -64, 64, -64, 64, 64, 64, -64, 64, 64, 64, 64, -64, 64, 64, 64, -64, 64, 64, -64, 64, 64, -64, -64, 64, 64, 64, 64, 64, 64, -64, -64, 64, 64, -64, -64, -64, 64, 64, 64, -64, -64, 64, 64, -64, 64, 64, -64, -64, -64, 64, -64, -64, -64, -64, -64, 64, -64, -64, -64, -64, -64, 64, 64, 64, -64, 64, -64, 64, -64, 64, 64, -64, -64, 64, -64, 64, 64, -64, 64, 64, 64, -64, -64, -64, -64, -64, -64, -64, 64, 64, 64, 64, 64, 64, 64, 64, 64, 64, 64, 64, -64, -64, 64, 64, 64, 64, 64, 64, 64, 64, -64, 64, 64, 64, -64, 64, 64, 64, 64, -64, 64, 64, -64, 64, 64, 64, 64, 64, 64, 64, 64, 64, 64, 64, 64, 64, 64, 64, 64, 64, 64, 64, -64, 64, 64, 64, 64, 64, -64, 64, 64, 64, 64, 64, 64, -64, 64, 64, -64, 64, 64, 64, 64, 64, 64, 64, 64, 64, 64, -64, 64, -64, 64, 64, -64, -64, 64, 64, 64, 64, 64, 64, 64, 64, -64, 64, 64, -64, -64, 64, -64, 64, 64, 64, 64, 64, 64, 64, -64, -64, 64, -64, -64, 64, 64, 64, 64, 64, 64, 64, 64, 64, 64, -64, -64, -64, 64, -64, -64, -64, -64, 64, 64, 64, 64, -64, -64, 64, -64, 64, -64, -64, -64, 64, -64, 64, 64, 64, 64, 64, -64, 64, 64, -64, 64, -64, -64, -64, -64, 64, 64, -64, -64, -64, -64, -64, -64, 64, -64, -64, -64, 64, -64, -64, -64, -64, 64, 64, 64, -64, -64, -64, -64, -64, -64, 64, -64, -64, -64, -64, -64, -64, -64, -64, 64, -64, 64, -64, 64, 64, 64, -64, 64, 64, 64, -64, 64, -64, 64, 64, -64, -64, -64, -64, 64, 64, 64, 64, 64, -64, -64, -64, -64, -64, 64, -64, 64, -64, -64, -64, -64, -64, 64, -64, 64, -64, -64, 64, -64, 64, -64, 64, -64, 64, 64, 64, -64, -64, -64, -64, -64, -64, 64, -64, -64, 64, -64, -64, 64, 64, -64, 64, 64, -64, -64, -64, -64, -64, 64, -64, -64, -64, 64, 64, 64, 64, -64, -64, -64, -64, 64, 64, -64, -64, -64, -64, -64, 64, 64, -64, -64, -64, 64, -64, 64, -64, -64, 64, 64, -64, -64, -64, -64, 64, 64, 64, 64, 64, -64, -64, -64, 64, 64, -64, 64, -64, -64, 64, 64, -64, -64, -64, 64, -64, 64, 64, 64, 64, -64, -64, -64, 64, -64, 64, -64, -64, 64, -64, -64, 64, 64, -64, -64, -64, -64, -64, -64, 64, -64, -64, -64, 64, 64, -64, -64, -64, -64, -64, -64, 64, 64, 64, 64, -64, 64, -64, -64, -64, 64, 64, -64, -64, 64, -64, 64, 64, 64, -64, 64, -64, 64, 64, -64, 64, -64, 64, -64, -64, -64, 64, 64, -64, 64, -64, 64, -64, 64, -64, -64, -64, -64, 64, -64, -64, 64, -64, 64, 64, 64, 64, 64, 64, 64, 64, 64, 64, 64, -64, -64, -64, -64, -64, -64, -64, -64, 64, -64, -64, -64, -64, -64, -64, -64, 64, 64, 64, 64, 64, -64, 64, -64, -64, -64, 64, 64, -64, -64, -64, -64, -64, -64, -64, -64, -64, -64, 64, 64, 64, -64, 64, 64, 64, 64, 64, 64, 64, 64, 64, -64, -64, 64, 64, 64, -64, -64, -64, -64, -64, -64, -64, -64, -64, -64, 64, -64, 64, -64, -64, -64, -64, -64, 64, 64, 64, -64, 64, 64, -64, 64, 64, -64, 64, -64, -64, 64, -64, -64, -64, -64, -64, -64, -64, -64, 64, 64, -64, -64, 64, -64, -64, 64, 64, -64, 64, -64, 64, -64, -64, -64, 64, 64, 64, -64, -64, -64, -64, -64, -64, -64, -64, -64, 64, -64, -64, 64, 64, 64, -64, 64, 64, -64, -64, -64, -64, -64, -64, -64, 64, -64, -64, -64, -64, -64, -64, -64, -64, 64, -64, -64, -64, -64, -64, 64, 64, -64, 64, 64, 64, 64, -64, -64, -64, 64, -64, -64, 64, 64, 64, 64, 64, -64, -64, -64, -64, -64, -64, -64, -64, 64, -64, -64, 64, 64, 64, 64, 64, -64, -64, -64, -64, -64, 64, 64, 64, 64, 64, 64, 64, 64, -64, -64, -64, -64, -64, -64, 64, -64, 64, -64, 64, 64, 64, 64, 64, 64, 64, 64, -64, 64, 64, 64, 64, 64, -64, 64, 64, 64, -64, 64, -64, -64, -64, -64, 64, 64, 64, 64, -64, 64, 64, -64, 64, 64, -64, -64, -64, 64, 64, 64, 64, 64, 64, 64, 64, 64, 64, 64, 64, -64, -64, -64, 64, 64, 64, -64, 64, -64, 64, -64, -64, -64, 64, -64, -64, -64, -64, 64, 64, -64, -64, 64, 64, 64, 64, 64, 64, 64, -64, -64, -64, 64, 64, -64, 64, -64, 64, -64, -64, -64, -64, -64, -64, -64, -64, -64, -64, 64, 64, -64, 64, 64, -64, -64, -64, 64, 64, -64, 64, -64, 64, -64, 64, -64, -64, -64, -64, -64, -64, -64, 64, -64, 64, 64, -64, 64, 64, 64, 64, -64, -64, -64, -64, -64, 64, 64, 64, -64, -64, 64, -64, -64, 64, -64, -64, -64, -64, -64, -64, -64, -64, -64, -64, -64, 64, 64, 64, 64, 64, -64, 64, 64, -64, 64, 64, -64, -64, -64, 64, -64, -64, -64, -64, -64, -64, -64, -64, -64, 64, -64, 64, -64, 64, 64, 64, 64, 64, -64, 64, 64, 64, -64, 64, 64, 64, -64, -64, -64, -64, -64, -64, -64, -64, -64, -64, -64, -64, -64, -64, -64, 64, -64, -64, -64, -64, -64, -64, 64, 64, -64, -64, -64, -64, 64, -64, -64, -64, -64, 64, -64, 64, -64, -64, -64, -64, -64, -64, 64, 64, 64, 64, 64, -64, -64, 64, 64, 64, -64, -64, 64, 64, -64, -64, -64, 64, 64, -64, -64, -64, -64, -64, -64, -64, -64, -64, -64, 64, 64, 64, 64, 64, 64, 64, 64, 64, -64, 64, -64, 64, 64, -64, 64, -64, -64, -64, -64, -64, -64, -64, -64, -64, -64, -64, -64, 64, 64, 64, 64, 64, 64, 64, 64, 64, -64, -64, -64, 64, 64, 64, 64, 64, 64, -64, -64, 64, 64, 64, -64, -64, -64, -64, -64, -64, 64, 64, 64, 64, 64, 64, -64, -64, 64, 64, -64, -64, -64, 64, -64, -64, -64, -64, -64, -64, -64, -64, -64, -64, -64, -64, -64, 64, 64, 64, -64, 64, 64, 64, -64, 64, 64, 64, -64, 64, -64, -64, -64, 64, -64, -64, 64, -64, -64, 64, -64, -64, -64, 64, -64, 64, 64, 64, -64, -64, 64, 64, 64, 64, -64, 64, -64, 64, -64, -64, -64, -64, -64, -64, -64, -64, 64, -64, 64, 64, -64, -64, 64, -64, 64, 64, -64, -64, 64, 64, -64, -64, -64, 64, 64, -64, -64, 64, -64, -64, -64, -64, -64, 64, -64, 64, 64, 64, -64, -64, -64, 64, 64, 64, 64, -64, 64, 64, 64, -64, -64, 64, -64, 64, -64, 64, 64, -64, 64, 64, -64, -64, -64, 64, 64, -64, 64, -64, -64, -64, 64, -64, 64, 64, -64, -64, -64, -64, 64, 64, 64, 64, -64, 64, -64, -64, -64, -64, 64, -64, 64, 64, 64, 64, -64, 64, 64, 64, 64, 64, 64, 64, -64, 64, 64, 64, -64, 64, -64, 64, 64, -64, 64, 64, 64, 64, 64, 64, 64, 64, 64, 64, 64, 64, 64, 64, 64, 64, 64, 64, 64, 64, 64, 64, 64, -64, 64, 64, 64, -64, -64, -64, 64, 64, 64, 64, 64, 64, 64, 64, 64, 64, 64, 64, 64, 64, 64, 64, 64, 64, 64, 64, 64, 64, 64, -64, 64, -64, -64, -64, 64, 64, 64, 64, 64, 64, 64, -64, 64, 64, 64, 64, 64, 64, 64, 64, 64, 64, 64, 64, 64, 64, 64, 64, 64, -64, -64, 64, 64, 64, 64, 64, 64, 64, -64, -64, -64, 64, 64, -64, -64, -64, -64, 64, 64, 64, 64, 64, 64, -64, -64, 64, -64, 64, -64, 64, 64, 64, 64, 64, -64, -64, -64, -64, -64, 64, -64, -64, -64, -64, -64, -64, 64, 64, 64, 64, -64, -64, 64, -64, -64, 64, -64, -64, 64, -64, -64, -64, -64, -64, 64, -64, -64, 64, -64, -64, -64, -64, -64, 64, 64, 64, 64, -64, 64, 64, 64, -64, 64, 64, -64, -64, 64, -64, -64, -64, -64, -64, -64, -64, -64, -64, -64, -64, -64, -64, -64, -64, -64, 64, -64, 64, 64, -64, 64, 64, -64, -64, -64, -64, -64, -64, -64, -64, -64, -64, 64, -64, 64, -64, -64, -64, -64, -64, -64, -64, -64, -64, -64, -64, 64, 64, -64, 64, 64, 64, -64, -64, -64, -64, -64, -64, -64, 64, 64, -64, 64, -64, 64, 64, -64, -64, -64, -64, -64, -64, -64, 64, 64, -64, -64, -64, -64, -64, -64, -64, -64, -64, -64, 64, 64, 64, 64, 64, -64, -64, 64, -64, -64, -64, -64, -64, -64, -64, -64, -64, 64, -64, 64, -64, -64, -64, 64, -64, -64, -64, -64, 64, 64, 64, 64, 64, -64, -64, 64, -64, 64, -64, -64, 64, 64, 64, -64, 64, 64, 64, 64, 64, 64, 64, -64, -64, 64, 64, -64, 64, 64, 64, 64, -64, -64, -64, -64, 64, 64, 64, 64, 64, 64, -64, 64, 64, -64, -64, 64, -64, 64, 64, 64, 64, 64, -64, 64, 64, -64, 64, 64, 64, 64, 64, -64, 64, -64, -64, 64, 64, 64, 64, 64, 64, -64, 64, -64, -64, -64, 64, 64, -64, 64, 64, -64, 64, 64, 64, 64, -64, 64, 64, 64, 64, -64, 64, 64, 64, 64, -64, -64, 64, -64, 64, 64, -64, 64, -64, 64, 64, 64, 64, -64, 64, -64, -64, 64, 64, 64, 64, 64, 64, 64, 64, 64, 64, 64, 64, -64, -64, -64, 64, 64, 64, 64, -64, -64, 64, 64, 64, 64, -64, -64, -64, 64, 64, 64, 64, -64, 64, 64, -64, 64, 64, 64, 64, 64, -64, -64, -64, -64, 64, 64, 64, 64, 64, 64, 64, 64, 64, -64, -64, 64, 64, 64, 64, -64, -64, 64, 64, 64, 64, 64, 64, -64, -64, -64, -64, -64, 64, 64, -64, 64, 64, 64, 64, 64, 64, -64, -64, 64, 64, -64, 64, -64, 64, 64, 64, 64, 64, 64, -64, -64, 64, -64, -64, 64, 64, -64, -64, 64, 64, 64, 64, 64, 64, 64, 64, 64, 64, -64, -64, -64, 64, 64, 64, 64, 64, 64, 64, -64, -64, -64, -64, 64, -64, 64, -64, 64, 64, 64, 64, 64, -64, -64, 64, 64, 64, -64, -64, -64, 64, -64, 64, 64, 64, -64, -64, 64, 64, 64, -64, 64, -64, -64, 64, -64, 64, -64, -64, -64, -64, -64, -64, -64, -64, -64, -64, -64, -64, -64, 64, 64, 64, 64, 64, 64, 64, 64, -64, 64, -64, -64, 64, 64, 64, -64, 64, -64, -64, -64, -64, -64, -64, -64, -64, -64, -64, -64, -64, -64, -64, 64, 64, 64, -64, -64, 64, -64, -64, 64, -64, -64, -64, -64, -64, -64, -64, -64, 64, 64, 64, 64, -64, -64, 64, -64, -64, -64, 64, 64, -64, 64, -64, -64, 64, 64, 64, -64, -64, -64, -64, -64, -64, -64, -64, -64, 64, -64, -64, 64, 64, -64, -64, 64, -64, 64, 64, -64, -64, 64, 64, 64, 64, 64, -64, 64, 64, -64, 64, 64, -64, 64, 64, -64, 64, 64, -64, -64, -64, -64, -64, -64, -64, 64, -64, 64, 64, -64, -64, 64, -64, -64, -64, -64, 64, -64, 64, 64, 64, -64, 64, 64, 64, 64, 64, 64, -64, -64, -64, -64, 64, -64, -64, -64, 64, -64, 64, 64, 64, 64, 64, 64, 64, -64, -64, -64, 64, -64, -64, -64, -64, 64, -64, 64, 64, 64, 64, -64, 64, 64, 64, 64, 64, 64, 64, 64, -64, 64, -64, 64, -64, 64, 64, 64, 64, -64, -64, -64, -64, -64, -64, -64, -64, -64, -64, -64, -64, -64, -64, 64, 64, -64, 64, 64, -64, 64, 64, 64, -64, -64, -64, 64, 64, 64, -64, -64, -64, -64, 64, 64, 64, -64, -64, 64, -64, 64, 64, 64, -64, 64, -64, 64, 64, -64, -64, 64, 64, -64, 64, 64, 64, 64, -64, 64, 64, 64, 64, 64, 64, -64, -64, 64, 64, 64, 64, 64, 64, 64, 64, -64, -64, 64, 64, 64, -64, 64, -64, -64, -64, -64, 64, -64, -64, 64, 64, 64, 64, 64, -64, 64, 64, 64, 64, 64, 64, 64, -64, -64, -64, -64, -64, -64, -64, 64, -64, -64, -64, -64, 64, 64, -64, -64, 64, 64, 64, 64, 64, 64, 64, 64, 64, 64, -64, 64, 64, -64, -64, 64, -64, 64, -64, 64, -64, -64, -64, -64, -64, -64, 64, 64, 64, 64, 64, 64, 64, 64, 64, 64, 64, 64, 64, -64, 64, 64, -64, -64, -64, -64, -64, -64, -64, -64, -64, -64, -64, -64, -64, 64, 64, 64, 64, 64, 64, 64, 64, 64, 64, -64, -64, 64, 64, 64, 64, 64, 64, 64, -64, -64, -64, -64, -64, -64, -64, -64, -64, -64, 64, 64, 64, 64, -64, -64, 64, -64, 64, 64, -64, -64, 64, 64, 64, -64, -64, 64, 64, 64, -64, -64, -64, -64, -64, 64, -64, -64, -64, 64, 64, -64, -64, 64, -64, 64, 64, 64, -64, -64, -64, 64, 64, -64, -64, 64, -64, 64, -64, -64, 64, -64, 64, 64, -64, -64, -64, 64, 64, 64, -64, 64, -64, 64, 64, -64, 64, -64, 64, 64, 64, 64, -64, 64, -64, -64, -64, 64, 64, 64, 64, -64, -64, -64, -64, 64, 64, -64, 64, 64, 64, -64, -64, 64, -64, 64, 64, -64, 64, 64, 64, 64, -64, 64, 64, -64, -64, -64, 64, -64, -64, -64, -64, 64, 64, 64, 64, -64, 64, -64, 64, -64, -64, -64, 64, 64, 64, -64, -64, -64, -64, -64, -64, -64, -64, -64, -64, -64, 64, 64, 64, 64, 64, -64, -64, -64, -64, 64, -64, -64, -64, -64, 64, 64, -64, -64, 64, 64, -64, -64, 64, -64, -64, -64, 64, 64, 64, 64, 64, -64, 64, 64, -64, 64, -64, -64, -64, -64, -64, -64, 64, -64, -64, 64, 64, 64, -64, -64, -64, -64, -64, 64, -64, 64, -64, 64, -64, -64, -64, -64, -64, -64, -64, 64, -64, -64, -64, -64, 64, -64, -64, 64, 64, -64, -64, 64, -64, -64, -64, 64, 64, 64, 64, 64, 64, -64, -64, -64, -64, -64, -64, -64, -64, -64, -64, 64, -64, -64, -64, 64, -64, 64, 64, 64, 64, -64, 64, 64, 64, 64, 64, 64, 64, -64, -64, -64, -64, 64, -64, 64, 64, 64, 64, 64, -64, -64, -64, 64, -64, 64, 64, 64, 64, -64, 64, 64, 64, 64, 64, 64, -64, -64, -64, -64, -64, -64, -64, 64, 64, 64, 64, 64, -64, -64, 64, 64, -64, -64, 64, 64, -64, 64, 64, 64, 64, 64, 64, 64, -64, -64, -64, -64, -64, 64, 64, 64, 64, 64, 64, -64, 64, -64, 64, 64, 64, 64, 64, 64, 64, 64, 64, 64, 64, 64, 64, 64, 64, -64, -64, -64, 64, -64, -64, 64, 64, 64, 64, -64, 64, -64, 64, 64, -64, -64, -64, 64, 64, 64, 64, 64, 64, 64, 64, 64, 64, -64, -64, 64, -64, -64, -64, 64, -64, 64, -64, -64, 64, 64, 64, -64, -64, 64, 64, -64, -64, 64, 64, -64, 64, 64, 64, 64, 64, 64, 64, -64, -64, -64, -64, 64, 64, 64, 64, 64, 64, -64, 64, 64, -64, 64, 64, 64, 64, 64, 64, 64, -64, 64, 64, 64, 64, -64, 64, -64, -64, -64, 64, 64, 64, -64, 64, -64, 64, -64, 64, 64, -64, 64, 64, 64, 64, -64, -64, 64, -64, -64, 64, 64, 64, 64, 64, -64, -64, -64, -64, 64, 64, 64, 64, 64, 64, 64, -64, 64, 64, 64, -64, 64, 64, -64, 64, 64, -64, 64, 64, 64, 64, 64, 64, -64, -64, 64, 64, 64, 64, -64, -64, 64, -64, -64, 64, 64, 64, 64, 64, 64, 64, -64, 64, -64, 64, 64, 64, 64, 64, 64, 64, -64, -64, 64, -64, 64, 64, 64, 64, 64, 64, -64, -64, 64, -64, 64, -64, 64, -64, -64, -64, -64, -64, 64, -64, 64, -64, -64, -64, -64, -64, 64, 64, -64, 64, -64, -64, -64, 64, 64, 64, 64, -64, 64, -64, 64, 64, 64, 64, 64, -64, 64, -64, 64, -64, -64, 64, 64, 64, 64, 64, 64, -64, 64, -64, -64, 64, 64, -64, -64, -64, -64, -64, -64, -64, 64, -64, -64, -64, -64, -64, -64, -64, -64, 64, -64, -64, -64, -64, -64, -64, -64, 64, -64, -64, -64, -64, 64, -64, 64, 64, 64, 64, 64, -64, 64, 64, -64, -64, 64, 64, 64, 64, -64, -64, -64, -64, -64, -64, -64, -64, -64, -64, 64, -64, -64, 64, 64, 64, -64, 64, -64, 64, -64, -64, 64, 64, -64, 64, 64, -64, 64, -64, -64, -64, -64, -64, -64, -64, 64, -64, 64, 64, -64, -64, 64, 64, 64, -64, 64, -64, 64, -64, 64, 64, 64, 64, 64, -64, -64, -64, -64, -64, -64, -64, 64, -64, 64, 64, -64, -64, -64, 64, 64, 64, -64, 64, -64, -64, 64, -64, -64, 64, 64, 64, -64, -64, -64, -64, -64, -64, -64, -64, -64, -64, 64, 64, 64, -64, 64, -64, 64, -64, 64, -64, 64, -64, -64, -64, 64, 64, 64, -64, -64, -64, 64, -64, -64, -64, 64, 64, 64, 64, 64, 64, 64, -64, 64, 64, -64, 64, -64, 64, 64, 64, -64, 64, -64, 64, 64, 64, -64, 64, 64, 64, 64, 64, 64, 64, 64, 64, 64, 64, 64, 64, 64, 64, 64, 64, 64, -64, 64, 64, -64, -64, -64, 64, 64, 64, 64, 64, 64, 64, 64, 64, 64, 64, 64, 64, 64, 64, 64, 64, -64, 64, -64, -64, -64, -64, -64, 64, 64, -64, 64, 64, 64, 64, 64, 64, 64, 64, 64, 64, 64, 64, 64, 64, 64, 64, 64, 64, -64, 64, 64, 64, -64, -64, -64, 64, 64, 64, 64, 64, 64, 64, -64, 64, 64, 64, 64, 64, 64, 64, 64, 64, -64, 64, 64, -64, -64, 64, 64, -64, -64, 64, -64, 64, 64, 64, 64, 64, 64, 64, -64, 64, 64, 64, -64, 64, 64, 64, -64, -64, -64, -64, 64, -64, 64, 64, 64, -64, -64, -64, -64, 64, 64, 64, 64, 64, 64, 64, 64, 64, 64, 64, 64, 64, -64, -64, -64, -64, -64, -64, 64, 64, -64, -64, 64, 64, -64, -64, 64, 64, 64, 64, 64, 64, 64, 64, 64, 64, 64, 64, 64, 64, -64, -64, 64, -64, -64, -64, -64, -64, -64, 64, 64, 64, -64, 64, -64, 64, 64, 64, 64, 64, 64, 64, 64, 64, 64, 64, 64, -64, 64, -64, 64, 64, 64, -64, -64, -64, 64, -64, -64, 64, 64, -64, -64, 64, 64, 64, -64, 64, 64, 64, -64, 64, 64, 64, 64, 64, -64, 64, 64, -64, 64, -64, 64, 64, -64, 64, -64, 64, 64, -64, 64, 64, 64, 64, 64, -64, 64, 64, 64, 64, 64, 64, 64, 64, -64, 64, -64, -64, 64, 64, 64, 64, 64, -64, -64, -64, 64, -64, -64, 64, 64, 64, 64, 64, 64, -64, 64, 64, 64, 64, 64, 64, -64, 64, -64, 64, 64, -64, 64, 64, 64, 64, 64, -64, 64, 64, 64, 64, 64, -64, 64, 64, 64, 64, 64, 64, 64, 64, 64, -64, -64, 64, 64, -64, -64, 64, 64, -64, -64, -64, 64, 64, 64, -64, 64, 64, 64, 64, -64, -64, 64, -64, -64, -64, -64, -64, 64, -64, 64, 64, 64, -64, -64, 64, 64, 64, 64, -64, -64, -64, -64, 64, -64, 64, 64, -64, -64, 64, -64, 64, -64, 64, -64, 64, 64, -64, 64, 64, -64, -64, 64, 64, 64, 64, 64, 64, -64, -64, 64, 64, -64, -64, -64, 64, 64, 64, 64, -64, -64, -64, 64, 64, 64, 64, 64, -64, -64, -64, -64, 64, 64, 64, -64, -64, 64, -64, 64, -64, 64, 64, -64, -64, -64, 64, 64, -64, -64, -64, -64, 64, 64, 64, 64, -64, 64, -64, 64, 64, 64, -64, -64, -64, 64, -64, -64, -64, -64, -64, 64, 64, 64, 64, 64, -64, -64, -64, -64, -64, 64, 64, -64, 64, -64, -64, -64, -64, 64, 64, -64, 64, 64, 64, 64, -64, 64, 64, 64, 64, 64, 64, 64, 64, 64, -64, -64, 64, 64, 64, 64, 64, 64, -64, 64, -64, -64, -64, 64, -64, 64, -64, -64, 64, -64, 64, 64, 64, -64, 64, 64, 64, 64, 64, 64, 64, -64, 64, -64, -64, -64, -64, -64, 64, -64, 64, 64, -64, -64, 64, 64, -64, 64, 64, -64, 64, 64, 64, 64, 64, -64, 64, 64, 64, -64, -64, 64, 64, -64, -64, -64, -64, 64, -64, 64, -64, 64, -64, -64, 64, 64, 64, 64, -64, -64, -64, -64, 64, 64, -64, 64, -64, 64, -64, 64, 64, -64, -64, -64, -64, 64, -64, -64, 64, 64, -64, 64, 64, -64, -64, 64, -64, 64, -64, 64, -64, 64, 64, 64, -64, 64, -64, -64, -64, 64, 64, -64, 64, -64, -64, -64, 64, 64, 64, -64, -64, 64, -64, -64, 64, 64, 64, -64, -64, 64, 64, 64, 64, 64, 64, -64, -64, -64, 64, 64, -64, -64, -64, 64, -64, -64, -64, 64, -64, 64, -64, -64, 64, -64, 64, -64, -64, -64, 64, 64, 64, -64, -64, -64, 64, 64, -64, -64, -64, 64, 64, -64, 64, -64, 64, 64, -64, 64, 64, 64, -64, -64, -64, 64, 64, 64, -64, -64, -64, 64, -64, 64, -64, 64, 64, 64, -64, -64, -64, -64, -64, -64, 64, -64, 64, -64, 64, -64, -64, 64, -64, 64, 64, 64, 64, 64, 64, -64, -64, -64, -64, 64, -64, -64, 64, -64, -64, 64, -64, -64, 64, 64, 64, 64, -64, 64, 64, 64, -64, -64, 64, 64, 64, -64, 64, 64, -64, 64, -64, 64, 64, 64, -64, 64, -64, -64, -64, -64, -64, 64, 64, -64, 64, -64, 64, 64, 64, -64, 64, 64, 64, 64, 64, 64, -64, 64, 64, -64, -64, 64, -64, -64, 64, 64, 64, -64, 64, 64, 64, -64, -64, 64, 64, 64, -64, -64, 64, 64, -64, -64, 64, 64, 64, 64, -64, -64, -64, -64, -64, 64, 64, -64, -64, 64, -64, -64, -64, 64, -64, 64, -64, 64, 64, 64, 64, -64, 64, 64, -64, -64, 64, -64, -64, 64, 64, 64, 64, 64, -64, 64, 64, -64, 64, 64, 64, -64, 64, 64, -64, 64, 64, -64, -64, 64, 64, 64, 64, 64, -64, 64, -64, 64, 64, 64, -64, 64, -64, 64, -64, -64, -64, 64, 64, -64, -64, 64, 64, 64, -64, 64, 64, 64, 64, 64, 64, 64, 64, 64, 64, 64, 64, -64, 64, -64, -64, -64, -64, -64, -64, -64, 64, -64, -64, 64, 64, 64, 64, 64, -64, -64, 64, 64, 64, -64, 64, -64, 64, 64, -64, 64, 64, -64, -64, -64, -64, -64, -64, -64, 64, 64, 64, 64, 64, -64, 64, 64, 64, -64, -64, 64, 64, 64, 64, -64, 64, 64, 64, -64, 64, 64, -64, 64, -64, -64, 64, 64, -64, 64, 64, -64, 64, 64, -64, 64, -64, -64, 64, 64, 64, 64, -64, 64, -64, 64, 64, -64, -64, -64, -64, -64, -64, 64, -64, -64, 64, -64, 64, 64, -64, -64, -64, 64, 64, 64, -64, 64, -64, -64, 64, 64, -64, -64, 64, 64, -64, 64, 64, 64, 64, -64, 64, -64, 64, -64, 64, 64, 64, 64, -64, 64, 64, -64, 64, 64, 64, -64, -64, 64, 64, 64, 64, 64, -64, 64, -64, 64, 64, -64, 64, -64, 64, -64, -64, 64, 64, -64, 64, -64, -64, -64, -64, 64, 64, 64, -64, -64, 64, 64, -64, 64, 64, 64, -64, -64, -64, 64, -64, 64, -64, 64, 64, 64, 64, -64, 64, 64, 64, -64, -64, 64, 64, 64, 64, 64, 64, 64, 64, 64, 64, 64, 64, -64, -64, 64, -64, -64, -64, 64, 64, -64, 64, 64, 64, 64, -64, 64, -64, -64, 64, -64, 64, 64, 64, 64, 64, 64, -64, -64, 64, -64, 64, -64, 64, 64, 64, 64, -64, -64, -64, -64, 64, 64, 64, 64, 64, 64, -64, 64, 64, -64, 64, 64, 64, 64, -64, 64, -64, -64, 64, -64, -64, -64, 64, -64, -64, -64, -64, -64, 64, -64, -64, 64, 64, 64, 64, -64, -64, 64, 64, 64, 64, -64, 64, -64, 64, 64, 64, -64, 64, 64, -64, 64, 64, -64, -64, 64, -64, 64, 64, -64, 64, 64, -64, 64, 64, 64, 64, 64, 64, 64, 64, 64, -64, 64, 64, -64, 64, -64, 64, -64, 64, -64, 64, 64, -64, 64, 64, 64, 64, -64, 64, 64, -64, 64, 64, -64, 64, 64, -64, -64, -64, -64, -64, -64, 64, -64, -64, 64, -64, 64, 64, 64, -64, -64, -64, 64, 64, -64, 64, 64, -64, 64, 64, 64, 64, 64, -64, 64, -64, 64, 64, -64, -64, 64, 64, 64, -64, 64, -64, 64, 64, 64, -64, -64, 64, 64, 64, 64, 64, -64, 64, -64, -64, 64, 64, -64, -64, -64, 64, 64, -64, 64, -64, -64, -64, 64, 64, 64, -64, -64, 64, -64, -64, -64, 64, -64, 64, 64, 64, -64, 64, 64, -64, 64, -64, -64, -64, -64, -64, -64, 64, 64, -64, -64, 64, -64, -64, -64, 64, -64, -64, -64, -64, -64, -64, -64, -64, 64, -64, 64, 64, 64, -64, 64, -64, -64, 64, 64, -64, 64, -64, 64, -64, 64, -64, 64, 64, 64, -64, 64, -64, 64, 64, -64, -64, 64, -64, -64, 64, -64, -64, 64, 64, 64, 64, 64, -64, -64, 64, 64, 64, -64, -64, 64, -64, 64, 64, -64, 64, 64, 64, -64, -64, 64, -64, -64, 64, -64, -64, -64, 64, 64, 64, 64, 64, -64, 64, -64, 64, 64, -64, -64, -64, 64, 64, -64, -64, -64, -64, -64, -64, -64, -64, 64, 64, -64, -64, 64, -64, -64, -64, 64, -64, -64, -64, 64, 64, 64, -64, -64, -64, 64, -64, -64, -64, -64, -64, 64, -64, 64, -64, -64, -64, 64, -64, 64, 64, -64, 64, 64, -64, -64, -64, -64, -64, -64, -64, 64, 64, -64, -64, -64, 64, -64, 64, 64, -64, -64, -64, 64, 64, 64, 64, -64, 64, -64, -64, -64, 64, -64, 64, 64, 64, -64, -64, -64, 64, 64, -64, -64, -64, -64, -64, -64, -64, 64, -64, -64, -64, 64, -64, -64, -64, -64, -64, -64, 64, 64, 64, 64, -64, 64, 64, -64, -64, -64, -64, -64, 64, -64, -64, -64, -64, 64, -64, -64, -64, -64, 64, 64, 64, -64, -64, 64, -64, 64, 64, -64, -64, -64, -64, -64, 64, -64, -64, 64, -64, 64, -64, -64, 64, 64, -64, -64, -64, 64, -64, -64, 64, -64, -64, -64, -64, -64, -64, -64, -64, -64, -64, 64, -64, 64, -64, 64, -64, -64, -64, -64, -64, -64, 64, 64, -64, 64, -64, -64, 64, -64, 64, 64, -64, -64, 64, 64, 64, -64, -64, -64, 64, 64, -64, -64, -64, -64, -64, -64, 64, -64, -64, -64, 64, 64, -64, -64, 64, 64, -64, 64, -64, 64, 64, 64, -64, -64, 64, -64, -64, 64, -64, -64, -64, -64, 64, 64, 64, -64, -64, 64, -64, -64, -64, -64, 64, -64, 64, -64, -64, 64, 64, 64, -64, -64, -64, 64, -64, -64, -64, -64, 64, -64, -64, -64, -64, -64, 64, -64, 64, -64, 64, -64, 64, 64, -64, 64, 64, 64, -64, -64, 64, 64, -64, 64, -64, 64, -64, -64, -64, -64, -64, -64, -64, -64, -64, -64, 64, -64, -64, -64, -64, 64, -64, -64, -64, 64, -64, -64, -64, 64, -64, 64, 64, -64, 64, -64, -64, 64, -64, -64, -64, -64, 64, 64, -64, 64, 64, -64, -64, -64, -64, 64, 64, -64, -64, 64, -64, -64, 64, 64, 64, -64, -64, -64, -64, -64, -64, -64, -64, 64, 64, 64, -64, 64, -64, 64, 64, 64, 64, 64, 64, -64, -64, -64, -64, -64, 64, -64, -64, 64, -64, 64, -64, -64, -64, -64, 64, -64, 64, 64, -64, 64, -64, 64, 64, 64, -64, 64, 64, 64, -64, -64, 64, 64, -64, -64, -64, 64, -64, -64, -64, 64, 64, -64, -64, -64, 64, -64, -64, -64, -64, 64, -64, -64, -64, 64, 64, -64, -64, -64, -64, 64, 64, -64, 64, 64, -64, -64, -64, -64, -64, 64, -64, -64, 64, 64, -64, -64, 64, -64, -64, 64, 64, -64, -64, -64, 64, 64, -64, 64, -64, -64, 64, -64, 64, 64, -64, -64, 64, -64, 64, -64, 64, 64, -64, -64, 64, -64, -64, -64, 64, -64, 64, -64, -64, -64, 64, -64, -64, -64, -64, -64, 64, -64, -64, -64, -64, 64, 64, -64, 64, 64, -64, -64, -64, 64, 64, -64, -64, 64, -64, -64, 64, 64, -64, 64, 64, -64, -64, -64, -64, -64, -64, 64, -64, 64, -64, 64, 64, -64, 64, 64, -64, 64, 64, 64, -64, 64, 64, -64, -64, -64, -64, -64, -64, 64, 64, -64, -64, -64, 64, -64, 64, -64, -64, 64, 64, -64, -64, -64, -64, 64, 64, -64, -64, -64, -64, -64, 64, 64, 64, -64, -64, -64, 64, -64, -64, 64, 64, -64, 64, 64, -64, 64, 64, 64, -64, -64, 64, 64, -64, -64, -64, -64, 64, -64, -64, -64, -64, -64, -64, -64, 64, 64, -64, 64, -64, -64, -64, -64, 64, -64, 64, -64, 64, -64, -64, 64, 64, 64, -64, -64, -64, -64, 64, 64, -64, -64, 64, 64, -64, 64, -64, -64, -64, -64, 64, -64, 64, -64, 64, -64, -64, -64, 64, 64, -64, -64, -64, -64, 64, 64, -64, -64, 64, 64, 64, -64, 64, 64, 64, 64, 64, -64, -64, 64, -64, -64, -64, 64, -64, 64, -64, -64, -64, 64, 64, -64, -64, 64, -64, -64, 64, -64, -64, 64, 64, 64, 64, -64, 64, -64, -64, -64, -64, -64, -64, 64, 64, -64, -64, 64, 64, -64, -64, -64, -64, 64, 64, 64, -64, -64, 64, 64, -64, -64, -64, 64, 64, -64, -64, 64, -64, 64, 64, 64, 64, 64, 64, -64, -64, 64, 64, 64, -64, -64, -64, -64, 64, 64, -64, 64, -64, 64, 64, -64, 64, 64, -64, 64, -64, 64, -64, -64, 64, 64, 64, -64, 64, -64, -64, -64, -64, 64, 64, 64, 64, -64, -64, -64, -64, 64, 64, -64, -64, 64, -64, -64, 64, -64, -64, -64, -64, 64, -64, -64, 64, 64, -64, 64, 64, -64, 64, -64, 64, -64, -64, -64, -64, 64, 64, -64, -64, 64, -64, -64, -64, 64, 64, 64, 64, 64, -64, 64, -64, 64, 64, -64, -64, 64, 64, 64, 64, 64, 64, 64, -64, 64, -64, -64, -64, -64, -64, -64, 64, 64, 64, 64, 64, -64, 64, 64, -64, -64, 64, 64, 64, 64, 64, -64, -64, -64, -64, 64, 64, -64, -64, -64, -64, -64, -64, -64, -64, 64, -64, -64, -64, -64, 64, 64, -64, 64, -64, 64, -64, 64, -64, 64, 64, -64, -64, 64, -64, -64, -64, -64, -64, -64, -64, -64, 64, -64, -64, -64, -64, -64, -64, 64, 64, -64, -64, -64, 64, 64, -64, 64, -64, -64, 64, -64, -64, -64, -64, 64, -64, -64, -64, -64, 64, -64, -64, -64, 64, -64, 64, 64, 64, 64, -64, 64, 64, 64, -64, 64, -64, 64, -64, -64, -64, 64, -64, -64, 64, -64, -64, -64, -64, 64, -64, -64, -64, -64, -64, -64, 64, -64, 64, 64, 64, 64, 64, -64, -64, -64, -64, -64, 64, 64, 64, 64, -64, -64, -64, 64, 64, 64, 64, 64, -64, -64, -64, -64, 64, 64, 64, -64, 64, 64, 64, -64, -64, -64, -64, 64, 64, 64, -64, -64, -64, -64, -64, -64, 64, 64, 64, 64, -64, -64, -64, 64, -64, 64, -64, -64, 64, 64, -64, -64, -64, 64, -64, -64, -64, -64, -64, -64, -64, -64, -64, -64, 64, 64, 64, -64, -64, 64, -64, 64, 64, -64, 64, 64, 64, 64, -64, -64, 64, -64, -64, -64, -64, -64, -64, -64, -64, -64, -64, -64, 64, 64, 64, -64, -64, 64, 64, 64, 64, 64, -64, -64, -64, 64, -64, -64, -64, -64, -64, -64, -64, 64, 64, 64, -64, -64, -64, 64, 64, 64, 64, 64, -64, -64, -64, 64, 64, -64, -64, -64, -64, 64, 64, -64, -64, -64, -64, -64, -64, -64, -64, 64, -64, -64, -64, -64, -64, -64, 64, 64, 64, 64, 64, -64, 64, 64, -64, -64, 64, -64, 64, -64, -64, -64, -64, -64, -64, -64, -64, 64, -64, -64, -64, -64, -64, -64, 64, -64, 64, 64, -64, 64, -64, -64, -64, -64, 64, 64, 64, 64, -64, -64, 64, 64, 64, -64, 64, -64, -64, -64, -64, -64, -64, -64, -64, 64, 64, -64, 64, 64, 64, -64, -64, -64, -64, 64, -64, -64, -64, -64, 64, -64, -64, -64, -64, -64, -64, -64, -64, -64, -64, -64, 64, 64, -64, -64, -64, 64, -64, -64, 64, -64, 64, 64, -64, -64, -64, 64, 64, -64, -64, -64, -64, -64, -64, -64, -64, -64, -64, -64, 64, 64, 64, -64, 64, -64, 64, 64, -64, -64, 64, 64, 64, -64, -64, 64, -64, 64, -64, -64, -64, 64, 64, 64, -64, -64, -64, 64, 64, 64, -64, -64, -64, 64, -64, -64, 64, 64, -64, 64, 64, -64, 64, -64, 64, -64, -64, -64, 64, -64, 64, -64, -64, 64, -64, -64, 64, 64, 64, -64, -64, 64, 64, 64, 64, -64, 64, 64, 64, -64, -64, -64, -64, -64, -64, -64, -64, -64, -64, -64, -64, -64, -64, -64, -64, 64, 64, -64, 64, 64, 64, 64, -64, 64, 64, -64, -64, -64, -64, -64, -64, -64, 64, 64, 64, -64, -64, 64, -64, 64, -64, -64, -64, -64, 64, -64, 64, 64, 64, -64, 64, -64, 64, -64, -64, -64, -64, -64, 64, -64, -64, -64, -64, -64, -64, 64, -64, 64, -64, -64, -64, 64, -64, 64, 64, -64, 64, 64, -64, 64, -64, -64, -64, -64, -64, -64, -64, -64, 64, 64, -64, -64, -64, -64, -64, -64, -64, -64, -64, 64, 64, -64, -64, -64, -64, 64, -64, 64, -64, -64, 64, -64, -64, -64, -64, 64, 64, 64, -64, -64, -64, -64, -64, 64, -64, -64, -64, 64, -64, -64, -64, -64, 64, 64, 64, 64, 64, 64, 64, 64, -64, -64, -64, 64, 64, 64, 64, -64, -64, -64, -64, 64, -64, -64, 64, 64, 64, 64, 64, 64, 64, -64, -64, 64, -64, 64, -64, -64, -64, 64, 64, -64, 64, 64, -64, -64, -64, 64, -64, -64, -64, -64, 64, -64, -64, -64, 64, -64, 64, 64, 64, 64, -64, 64, 64, 64, -64, -64, 64, 64, -64, -64, 64, -64, -64, -64, 64, 64, 64, 64, -64, 64, 64, 64, -64, -64, 64, -64, -64, -64, 64, 64, 64, -64, 64, -64, -64, 64, 64, -64, 64, -64, 64, 64, -64, 64, -64, -64, 64, -64, -64, 64, 64, 64, 64, 64, -64, 64, 64, -64, -64, 64, 64, -64, -64, 64, 64, -64, 64, -64, 64, -64, -64, 64, 64, -64, -64, -64, -64, 64, 64, 64, -64, -64, 64, 64, 64, 64, 64, -64, -64, -64, -64, -64, -64, 64, -64, -64, 64, 64, 64, 64, 64, -64, 64, -64, 64, -64, -64, -64, 64, -64, -64, 64, 64, 64, 64, -64, -64, -64, -64, -64, 64, -64, 64, 64, -64, 64, -64, 64, -64, -64, -64, -64, -64, 64, -64, 64, 64, 64, 64, 64, -64, -64, -64, 64, -64, -64, -64, -64, -64, -64, -64, -64, -64, -64, -64, -64, -64, -64, -64, -64, -64, -64, -64, 64, -64, 64, -64, -64, 64, -64, -64, -64, -64, -64, -64, -64, -64, -64, -64, -64, -64, -64, 64, -64, 64, 64, -64, 64, 64, 64, -64, -64, 64, 64, -64, 64, -64, -64, -64, -64, -64, -64, -64, -64, -64, -64, -64, -64, -64, 64, -64, -64, -64, -64, 64, 64, 64, 64, -64, 64, 64, 64, -64, 64, -64, -64, -64, -64, -64, -64, -64, -64, -64, -64, -64, 64, 64, -64, -64, -64, -64, -64, 64, 64, 64, 64, -64, 64, -64, 64, -64, -64, -64, -64, -64, -64, -64, -64, -64, -64, 64, -64, 64, -64, -64, -64, -64, -64, 64, -64, 64, -64, 64, 64, -64, 64, 64, -64, -64, -64, 64, -64, -64, -64, -64, 64, -64, -64, -64, -64, 64, -64, -64, 64, 64, 64, 64, 64, 64, 64, 64, 64, 64, 64, -64, 64, -64, 64, -64, -64, -64, -64, -64, -64, -64, -64, -64, -64, 64, 64, 64, -64, -64, 64, 64, 64, 64, 64, 64, 64, 64, 64, -64, 64, 64, 64, -64, 64, -64, -64, -64, -64, -64, -64, -64, -64, 64, 64, 64, 64, -64, 64, 64, 64, 64, 64, 64, 64, 64, 64, -64, -64, 64, 64, -64, 64, -64, -64, 64, 64, -64, 64, 64, 64, 64, 64, -64, -64, -64, -64, -64, -64, 64, 64, 64, -64, -64, -64, -64, 64, -64, -64, -64, 64, -64, -64, -64, -64, -64, -64, 64, 64, -64, 64, -64, -64, -64, -64, -64, -64, -64, 64, 64, -64, 64, -64, 64, -64, 64, -64, -64, -64, 64, 64, 64, 64, -64, -64, 64, 64, -64, 64, -64, 64, -64, -64, -64, -64, -64, -64, -64, 64, 64, 64, -64, -64, -64, -64, 64, 64, -64, 64, -64, 64, 64, -64, -64, 64, -64, -64, -64, -64, -64, -64, -64, -64, -64, -64, 64, -64, 64, 64, -64, 64, -64, -64, -64, -64, -64, 64, -64, 64, -64, -64, -64, -64, -64, -64, -64, -64, 64, -64, -64, -64, -64, -64, -64, -64, -64, -64, -64, 64, -64, 64, 64, 64, 64, 64, 64, 64, 64, -64, -64, 64, -64, 64, -64, 64, -64, -64, -64, -64, -64, -64, -64, -64, 64, 64, -64, 64, 64, -64, 64, 64, 64, 64, 64, 64, 64, -64, -64, 64, 64, 64, 64, -64, -64, -64, -64, -64, -64, -64, -64, -64, -64, 64, 64, 64, 64, -64, -64, -64, 64, 64, 64, 64, -64, -64, 64, -64, -64, 64, -64, -64, -64, -64, -64, -64, -64, 64, -64, 64, 64, 64, -64, 64, -64, 64, -64, 64, 64, 64, 64, -64, -64, 64, 64, -64, -64, -64, 64, 64, -64, -64, -64, -64, -64, -64, -64, -64, -64, 64, 64, 64, 64, 64, -64, -64, 64, -64, 64, 64, -64, 64, -64, -64, -64, -64, -64, -64, -64, -64, -64, -64, 64, -64, -64, -64, 64, 64, 64, 64, 64, -64, -64, -64, 64, 64, -64, -64, -64, -64, -64, -64, -64, 64, 64, -64, -64, -64, -64, -64, -64, -64, -64, 64, 64, -64, 64, 64, 64, 64, 64, -64, -64, -64, -64, -64, 64, -64, -64, 64, -64, 64, -64, -64, -64, -64, -64, -64, -64, 64, -64, -64, -64, -64, 64, -64, -64, 64, -64, -64, -64, 64, 64, -64, 64, 64, 64, -64, 64, -64, -64, -64, -64, -64, -64, -64, -64, -64, 64, -64, -64, 64, 64, 64, 64, 64, 64, 64, 64, -64, -64, 64, -64, -64, -64, 64, -64, -64, -64, 64, -64, -64, 64, 64, 64, -64, 64, -64, -64, 64, 64, -64, 64, -64, 64, -64, -64, -64, -64, -64, -64, 64, 64, 64, -64, -64, -64, 64, -64, -64, -64, -64, -64, -64, 64, -64, -64, -64, -64, 64, 64, -64, 64, 64, 64, 64, 64, 64, -64, 64, 64, 64, 64, 64, 64, -64, 64, 64, 64, -64, -64, -64, 64, -64, 64, 64, 64, -64, -64, -64, 64, 64, -64, 64, 64, -64, -64, 64, 64, 64, -64, 64, 64, 64, -64, -64, 64, 64, -64, 64, -64, 64, -64, -64, -64, 64, 64, 64, 64, -64, -64, -64, -64, -64, -64, -64, 64, 64, -64, 64, 64, -64, 64, -64, -64, -64, 64, 64, 64, 64, 64, 64, 64, 64, 64, -64, 64, -64, -64, 64, 64, -64, 64, 64, 64, 64, 64, -64, 64, 64, 64, 64, -64, 64, -64, 64, -64, -64, 64, -64, -64, -64, 64, 64, -64, 64, -64, 64, 64, 64, 64, -64, -64, -64, -64, -64, -64, -64, -64, 64, -64, -64, -64, 64, 64, -64, 64, 64, -64, -64, -64, 64, -64, 64, 64, -64, 64, 64, 64, 64, -64, -64, -64, -64, -64, -64, -64, 64, 64, -64, 64, 64, -64, -64, -64, 64, -64, 64, -64, 64, 64, 64, 64, -64, 64, 64, -64, -64, -64, -64, -64, -64, -64, -64, -64, -64, -64, -64, -64, -64, -64, -64, -64, -64, 64, 64, 64, -64, 64, 64, 64, -64, 64, 64, 64, -64, -64, -64, 64, -64, -64, -64, -64, -64, -64, -64, -64, 64, -64, -64, -64, -64, 64, -64, 64, -64, -64, 64, 64, 64, 64, 64, 64, -64, -64, 64, -64, 64, 64, -64, -64, -64, -64, -64, -64, -64, -64, -64, -64, 64, -64, -64, 64, 64, -64, -64, 64, 64, -64, -64, -64, -64, -64, -64, 64, 64, 64, -64, -64, -64, -64, -64, -64, -64, -64, -64, 64, 64, 64, -64, 64, -64, -64, -64, -64, -64, -64, -64, 64, -64, -64, -64, -64, 64, -64, -64, -64, -64, -64, -64, -64, -64, -64, -64, -64, 64, -64, 64, -64, 64, 64, 64, -64, -64, -64, -64, -64, -64, -64, -64, -64, 64, -64, 64, -64, -64, -64, -64, -64, -64, 64, -64, 64, -64, -64, -64, -64, 64, -64, -64, -64, -64, -64, -64, -64, -64, -64, 64, 64, 64, 64, -64, 64, 64, -64, 64, 64, 64, 64, 64, -64, 64, -64, -64, 64, 64, 64, -64, -64, -64, 64, -64, -64, -64, -64, -64, 64, -64, -64, -64, -64, -64, -64, -64, 64, 64, 64, 64, -64, 64, 64, 64, -64, 64, 64, -64, -64, -64, -64, -64, -64, -64, -64, -64, -64, -64, -64, -64, -64, -64, 64, 64, 64, 64, 64, 64, 64, 64, 64, 64, -64, 64, 64, 64, 64, 64, 64, 64, 64, -64, -64, -64, -64, -64, -64, -64, -64, -64, 64, 64, 64, -64, 64, 64, 64, -64, 64, 64, 64, -64, -64, 64, 64, 64, -64, 64, -64, 64, -64, -64, -64, -64, -64, -64, -64, -64, 64, 64, -64, 64, 64, 64, 64, 64, -64, -64, -64, 64, -64, 64, 64, -64, -64, 64, 64, 64, 64, -64, -64, 64, -64, -64, -64, -64, 64, 64, 64, 64, 64, 64, 64, 64, -64, 64, 64, 64, -64, -64, 64, -64, 64, -64, -64, 64, -64, -64, -64, -64, 64, -64, -64, 64, 64, 64, 64, 64, 64, 64, 64, 64, -64, 64, -64, 64, -64, 64, -64, -64, -64, 64, -64, 64, -64, 64, -64, -64, -64, -64, 64, 64, 64, 64, 64, 64, 64, 64, -64, -64, 64, 64, 64, 64, -64, -64, -64, -64, -64, -64, 64, 64, 64, 64, -64, -64, -64, 64, 64, 64, 64, 64, 64, -64, -64, 64, 64, 64, 64, 64, 64, 64, 64, -64, -64, -64, -64, -64, -64, 64, -64, 64, -64, 64, -64, -64, -64, 64, 64, -64, -64, -64, -64, -64, 64, 64, 64, 64, 64, 64, -64, 64, -64, -64, -64, -64, 64, -64, -64, -64, 64, -64, -64, -64, 64, 64, -64, -64, -64, -64, -64, 64, 64, -64, -64, -64, 64, 64, -64, 64, 64, 64, 64, -64, -64, -64, -64, 64, -64, -64, -64, -64, -64, -64, -64, -64, -64, -64, 64, 64, -64, 64, 64, 64, -64, 64, -64, -64, 64, 64, -64, 64, -64, -64, -64, -64, -64, -64, -64, -64, -64, -64, 64, -64, -64, -64, 64, -64, -64, -64, 64, 64, -64, 64, 64, -64, -64, -64, -64, -64, 64, -64, 64, -64, -64, -64, -64, -64, -64, -64, 64, -64, -64, -64, -64, 64, -64, 64, -64, -64, 64, -64, -64, -64, -64, -64, 64, -64, -64, 64, 64, 64, -64, -64, -64, 64, -64, -64, 64, -64, 64, -64, 64, -64, 64, 64, -64, -64, 64, -64, -64, 64, -64, 64, 64, 64, 64, -64, 64, 64, -64, -64, -64, -64, 64, -64, -64, -64, 64, 64, -64, -64, 64, 64, 64, -64, -64, 64, 64, -64, 64, 64, -64, -64, 64, 64, 64, 64, -64, -64, 64, -64, 64, 64, -64, 64, 64, -64, -64, -64, 64, -64, -64, -64, -64, 64, -64, 64, 64, 64, -64, 64, 64, -64, 64, 64, 64, -64, -64, 64, 64, -64, 64, -64, 64, 64, 64, 64, 64, 64, -64, -64, 64, 64, -64, 64, 64, -64, -64, 64, 64, 64, 64, 64, -64, -64, -64, -64, -64, 64, -64, 64, -64, -64, 64, 64, 64, -64, -64, 64, -64, -64, -64, -64, -64, -64, 64, 64, 64, -64, -64, -64, 64, 64, 64, 64, -64, -64, -64, -64, 64, -64, -64, 64, 64, -64, 64, -64, -64, 64, -64, 64, -64, -64, 64, 64, 64, 64, 64, 64, 64, -64, -64, 64, 64, -64, 64, 64, -64, 64, 64, -64, -64, -64, -64, 64, 64, 64, -64, 64, 64, -64, -64, 64, 64, -64, -64, -64, -64, 64, 64, -64, 64, -64, 64, 64, 64, -64, 64, -64, 64, -64, -64, -64, 64, 64, -64, -64, 64, -64, -64, -64, -64, -64, -64, 64, 64, -64, -64, -64, 64, 64, -64, 64, -64, -64, 64, -64, -64, -64, -64, 64, 64, 64, -64, 64, -64, -64, -64, 64, -64, -64, -64, -64, 64, -64, 64, 64, -64, -64, 64, 64, -64, -64, -64, -64, -64, -64, -64, -64, -64, 64, 64, 64, 64, -64, -64, -64, 64, -64, -64, -64, 64, -64, -64, -64, -64, -64, -64, -64, -64, -64, -64, 64, 64, -64, 64, -64, 64, 64, -64, 64, 64, 64, 64, -64, -64, 64, -64, 64, -64, 64, 64, -64, 64, 64, 64, -64, 64, 64, 64, 64, -64, 64, -64, 64, -64, -64, -64, -64, -64, -64, -64, -64, 64, -64, -64, 64, 64, 64, -64, -64, 64, -64, -64, -64, -64, -64, -64, -64, 64, -64, 64, 64, -64, 64, 64, -64, -64, -64, 64, 64, -64, -64, -64, -64, -64, -64, -64, -64, 64, -64, -64, -64, -64, -64, -64, 64, -64, 64, -64, -64, 64, -64, -64, 64, -64, -64, 64, -64, -64, -64, -64, 64, -64, -64, 64, -64, 64, 64, -64, -64, -64, -64, 64, -64, 64, -64, 64, -64, -64, -64, 64, -64, -64, -64, -64, -64, -64, -64, 64, -64, -64, -64, -64, 64, 64, -64, -64, -64, -64, -64, 64, -64, -64, -64, 64, -64, -64, 64, 64, -64, 64, -64, -64, 64, -64, -64, 64, 64, 64, 64, -64, -64, -64, -64, -64, -64, -64, -64, -64, 64, -64, -64, -64, -64, 64, 64, -64, -64, -64, -64, -64, -64, -64, 64, 64, -64, -64, -64, -64, -64, -64, -64, -64, 64, -64, -64, -64, 64, -64, -64, 64, -64, 64, -64, 64, -64, -64, 64, -64, -64, -64, 64, 64, -64, -64, -64, -64, -64, 64, -64, 64, -64, -64, -64, -64, -64, 64, 64, -64, -64, 64, 64, 64, -64, -64, -64, 64, -64, -64, -64, -64, -64, 64, 64, -64, -64, -64, -64, -64, 64, -64, -64, -64, -64, 64, -64, -64, -64, -64, -64, -64, 64, 64, -64, 64, -64, -64, -64, -64, -64, -64, -64, -64, -64, -64, -64, 64, -64, 64, -64, -64, -64, 64, -64, -64, -64, -64, 64, 64, -64, -64, 64, -64, 64, 64, -64, -64, 64, -64, -64, -64, -64, 64, -64, 64, 64, 64, 64, -64, 64, 64, 64, 64, -64, 64, -64, -64, 64, -64, 64, 64, 64, -64, -64, 64, 64, -64, -64, -64, -64, -64, -64, 64, -64, 64, -64, -64, 64, -64, -64, 64, -64, -64, -64, 64, 64, 64, -64, -64, 64, -64, -64, -64, 64, -64, -64, -64, -64, -64, 64, -64, -64, 64, -64, -64, -64, -64, -64, 64, -64, -64, -64, 64, -64, -64, -64, 64, 64, -64, -64, -64, -64, -64, 64, -64, 64, -64, 64, 64, -64, 64, 64, -64, -64, -64, 64, -64, 64, -64, -64, 64, -64, 64, -64, -64, 64, -64, 64, -64, -64, 64, -64, -64, -64, -64, 64, 64, -64, -64, -64, -64, 64, 64, 64, 64, -64, 64, -64, -64, 64, 64, -64, -64, 64, 64, -64, -64, 64, 64, 64, 64, 64, 64, 64, -64, 64, 64, 64, -64, 64, 64, -64, 64, 64, 64, -64, 64, -64, -64, -64, -64, 64, 64, -64, 64, -64, -64, 64, 64, 64, 64, 64, 64, 64, 64, 64, 64, 64, -64, 64, 64, -64, 64, 64, 64, -64, 64, -64, -64, -64, 64, 64, -64, 64, -64, 64, 64, 64, -64, 64, -64, 64, -64, 64, -64, 64, -64, 64, -64, 64, -64, -64, 64, 64, -64, 64, 64, -64, 64, -64, -64, 64, 64, 64, -64, -64, -64, -64, -64, -64, 64, 64, -64, -64, 64, 64, 64, 64, 64, -64, -64, 64, -64, -64, -64, 64, 64, -64, -64, -64, 64, 64, -64, -64, -64, 64, -64, -64, -64, -64, -64, 64, -64, 64, -64, -64, -64, -64, 64, -64, 64, -64, -64, -64, -64, -64, 64, -64, -64, 64, -64, -64, 64, -64, -64, 64, -64, -64, 64, -64, -64, 64, -64, 64, 64, 64, 64, 64, -64, 64, -64, 64, -64, 64, -64, -64, 64, -64, -64, -64, -64, 64, -64, 64, -64, 64, 64, -64, -64, -64, 64, 64, 64, -64, -64, 64, 64, 64, 64, 64, 64, -64, 64, 64, -64, 64, -64, -64, 64, 64, 64, 64, -64, -64, -64, -64, 64, -64, 64, -64, -64, -64, -64, 64, 64, 64, 64, 64, 64, 64, 64, -64, -64, 64, -64, 64, 64, 64, -64, -64, 64, 64, 64, 64, -64, 64, 64, -64, -64, -64, 64, 64, -64, 64, -64, 64, 64, 64, 64, 64, 64, 64, -64, -64, 64, 64, 64, -64, 64, 64, 64, 64, 64, 64, -64, -64, 64, 64, 64, 64, -64, 64, 64, 64, 64, 64, 64, 64, 64, 64, 64, 64, 64, 64, 64, 64, 64, -64, -64, 64, 64, -64, -64, -64, -64, -64, 64, 64, 64, 64, 64, 64, 64, 64, 64, 64, 64, 64, 64, 64, 64, 64, 64, 64, 64, 64, 64, 64, -64, 64, -64, -64, -64, -64, 64, 64, 64, 64, 64, 64, 64, 64, 64, 64, 64, 64, 64, 64, 64, 64, -64, 64, -64, 64, 64, 64, 64, -64, -64, -64, -64, -64, -64, 64, 64, 64, -64, 64, -64, 64, 64, 64, 64, 64, 64, 64, 64, -64, -64, -64, -64, -64, 64, 64, -64, -64, -64, 64, 64, -64, -64, -64, 64, -64, 64, 64, 64, 64, 64, 64, -64, 64, -64, 64, -64, -64, -64, -64, -64, -64, 64, -64, 64, -64, 64, 64, 64, 64, -64, -64, -64, -64, -64, -64, -64, -64, -64, -64, -64, -64, -64, -64, -64, -64, -64, -64, -64, -64, -64, -64, -64, 64, 64, 64, -64, -64, -64, -64, -64, -64, -64, 64, 64, -64, -64, -64, -64, -64, -64, 64, -64, -64, -64, 64, -64, -64, -64, -64, -64, -64, 64, 64, -64, -64, -64, -64, 64, 64, 64, 64, 64, 64, 64, -64, 64, -64, -64, -64, 64, 64, -64, 64, 64, 64, 64, -64, -64, -64, -64, 64, 64, 64, -64, -64, 64, -64, 64, 64, 64, -64, 64, 64, -64, 64, 64, -64, 64, 64, 64, 64, 64, 64, -64, -64, -64, 64, 64, 64, 64, -64, 64, 64, 64, -64, 64, 64, -64, 64, -64, -64, -64, 64, -64, 64, 64, 64, -64, -64, 64, -64, -64, -64, -64, -64, -64, 64, 64, -64, 64, 64, 64, 64, 64, 64, -64, 64, 64, 64, 64, -64, -64, 64, 64, 64, -64, -64, 64, 64, -64, -64, -64, 64, -64, -64, 64, -64, -64, 64, -64, 64, 64, 64, 64, 64, 64, 64, 64, -64, 64, -64, -64, -64, -64, -64, -64, -64, -64, -64, -64, -64, 64, -64, 64, 64, -64, 64, 64, -64, 64, 64, 64, 64, -64, 64, -64, 64, -64, -64, -64, -64, -64, -64, -64, -64, -64, -64, -64, -64, -64, -64, 64, 64, -64, 64, 64, 64, -64, -64, 64, -64, -64, -64, -64, 64, 64, -64, 64, -64, -64, 64, 64, 64, 64, -64, 64, 64, 64, 64, -64, -64, -64, -64, -64, -64, -64, -64, -64, -64, -64, 64, 64, 64, 64, 64, -64, 64, -64, 64, 64, 64, 64, -64, -64, -64, -64, -64, -64, -64, -64, -64, -64, -64, -64, -64, -64, 64, 64, 64, 64, 64, 64, 64, 64, 64, 64, 64, 64, 64, -64, -64, 64, -64, 64, -64, 64, -64, -64, -64, 64, -64, 64, 64, 64, 64, 64, 64, 64, 64, 64, 64, 64, 64, 64, 64, 64, -64, -64, -64, -64, 64, -64, 64, 64, -64, 64, 64, -64, 64, 64, 64, 64, 64, 64, 64, 64, 64, 64, 64, 64, 64, 64, 64, 64, -64, 64, 64, -64, 64, -64, 64, -64, 64, -64, 64, -64, 64, 64, 64, 64, 64, 64, 64, 64, 64, 64, 64, 64, 64, 64, -64, 64, 64, 64, -64, -64, 64, -64, 64, 64, 64, -64, -64, -64, -64, 64, 64, 64, 64, 64, 64, 64, -64, 64, -64, 64, 64, -64, -64, -64, 64, -64, 64, 64, 64, -64, 64, 64, -64, -64, -64, -64, -64, 64, 64, 64, 64, 64, 64, 64, 64, -64, -64, -64, -64, -64, -64, -64, -64, 64, 64, -64, 64, -64, 64, 64, -64, 64, -64, -64, -64, -64, -64, -64, -64, -64, -64, 64, 64, -64, -64, -64, -64, -64, -64, -64, 64, -64, -64, -64, -64, 64, -64, -64, 64, -64, -64, -64, 64, -64, 64, -64, -64, -64, -64, -64, 64, -64, -64, -64, 64, -64, 64, -64, 64, 64, -64, 64, 64, 64, 64, -64, -64, -64, 64, 64, -64, 64, 64, -64, 64, 64, 64, 64, -64, 64, 64, -64, 64, -64, -64, 64, 64, 64, -64, 64, -64, 64, 64, 64, 64, -64, 64, -64, -64, -64, -64, -64, 64, 64, -64, 64, -64, -64, -64, -64, -64, -64, -64, -64, 64, -64, 64, 64, -64, 64, -64, -64, -64, -64, -64, -64, -64, -64, -64, 64, 64, 64, 64, -64, 64, -64, 64, -64, -64, -64, 64, 64, -64, -64, 64, 64, 64, 64, 64, 64, 64, -64, -64, -64, -64, 64, 64, -64, -64, -64, -64, -64, -64, -64, -64, -64, -64, -64, -64, -64, -64, -64, 64, -64, -64, 64, -64, -64, -64, -64, -64, -64, -64, -64, -64, 64, -64, 64, -64, -64, -64, -64, -64, -64, -64, 64, -64, 64, 64, 64, 64, -64, 64, -64, -64, -64, -64, 64, 64, -64, -64, -64, 64, -64, -64, -64, -64, -64, -64, -64, -64, -64, -64, -64, 64, -64, 64, 64, 64, -64, 64, 64, 64, -64, 64, -64, -64, 64, 64, -64, -64, -64, -64, -64, -64, -64, -64, -64, -64, -64, -64, 64, 64, 64, 64, 64, 64, 64, 64, -64, -64, 64, 64, 64, 64, -64, 64, 64, -64, -64, -64, -64, -64, -64, 64, 64, -64, -64, -64, -64, 64, 64, 64, -64, 64, 64, -64, -64, 64, -64, -64, -64, 64, -64, -64, -64, -64, -64, -64, -64, 64, -64, -64, 64, 64, 64, -64, -64, 64, 64, 64, 64, 64, 64, -64, -64, -64, -64, -64, -64, -64, -64, -64, -64, -64, -64, -64, 64, 64, 64, -64, 64, 64, 64, -64, -64, 64, 64, 64, -64, 64, 64, 64, -64, 64, -64, 64, -64, -64, 64, -64, -64, -64, -64, 64, 64, 64, 64, -64, -64, -64, -64, 64, -64, 64, 64, -64, -64, 64, 64, -64, -64, 64, -64, 64, 64, 64, -64, -64, -64, -64, -64, -64, 64, 64, 64, -64, 64, 64, -64, -64, 64, -64, -64, -64, -64, 64, 64, 64, -64, -64, -64, -64, 64, -64, -64, -64, -64, -64, 64, -64, 64, 64, 64, 64, -64, -64, -64, -64, -64, -64, -64, -64, -64, 64, -64, -64, -64, -64, -64, -64, 64, -64, -64, -64, -64, -64, -64, 64, 64, 64, -64, 64, -64, -64, -64, -64, -64, -64, 64, -64, 64, -64, 64, 64, -64, 64, -64, -64, 64, -64, -64, -64, -64, 64, -64, 64, 64, 64, 64, -64, 64, -64, -64, 64, -64, -64, -64, -64, -64, 64, 64, -64, -64, -64, -64, 64, 64, 64, -64, -64, -64, -64, -64, -64, 64, -64, -64, -64, 64, 64, 64, -64, 64, -64, -64, -64, 64, 64, -64, -64, -64, 64, 64, -64, 64, 64, -64, 64, -64, 64, -64, -64, 64, 64, 64, 64, 64, 64, -64, -64, -64, 64, -64, 64, -64, -64, 64, 64, -64, 64, -64, 64, 64, 64, 64, -64, -64, -64, -64, -64, -64, -64, -64, 64, 64, -64, -64, -64, 64, -64, -64, 64, -64, -64, 64, 64, -64, -64, 64, 64, 64, 64, 64, 64, -64, -64, -64, -64, -64, 64, 64, 64, 64, 64, 64, -64, 64, -64, -64, -64, -64, -64, -64, -64, -64, 64, -64, 64, 64, 64, 64, 64, -64, -64, -64, -64, -64, 64, 64, 64, 64, -64, -64, -64, -64, -64, -64, -64, 64, -64, 64, -64, -64, 64, -64, 64, 64, 64, 64, 64, 64, -64, -64, 64, -64, -64, -64, 64, -64, -64, -64, -64, 64, 64, 64, 64, 64, -64, 64, 64, -64, 64, -64, 64, 64, 64, 64, 64, 64, -64, -64, -64, -64, -64, -64, -64, -64, -64, -64, 64, -64, 64, 64, -64, -64, -64, 64, 64, -64, -64, -64, 64, 64, -64, 64, -64, -64, -64, -64, -64, -64, -64, -64, -64, -64, -64, -64, 64, -64, 64, -64, 64, -64, -64, -64, -64, 64, -64, -64, 64, 64, -64, -64, -64, -64, -64, -64, -64, 64, 64, 64, -64, -64, 64, 64, -64, 64, 64, 64, -64, 64, -64, 64, -64, 64, -64, 64, -64, -64, -64, -64, -64, -64, 64, 64, 64, 64, -64, 64, 64, -64, -64, -64, -64, -64, 64, 64, -64, -64, 64, -64, 64, 64, -64, 64, 64, -64, 64, -64, -64, -64, 64, -64, -64, -64, -64, -64, -64, -64, -64, -64, -64, -64, -64, 64, -64, -64, 64, 64, -64, 64, -64, 64, 64, 64, 64, -64, -64, -64, -64, 64, -64, -64, -64, -64, -64, -64, -64, -64, -64, -64, 64, 64, -64, -64, -64, -64, -64, 64, -64, -64, 64, 64, -64, 64, 64, -64, 64, 64, -64, -64, 64, -64, -64, -64, -64, 64, -64, 64, -64, 64, 64, -64, -64, 64, -64, -64, -64, -64, 64, 64, 64, 64, 64, 64, 64, 64, 64, -64, -64, 64, -64, -64, -64, -64, -64, 64, -64, -64, 64, 64, -64, 64, 64, 64, -64, 64, -64, -64, 64, 64, -64, -64, -64, 64, 64, -64, -64, -64, -64, -64, -64, 64, -64, -64, -64, -64, 64, -64, -64, -64, -64, 64, -64, -64, 64, -64, 64, -64, 64, -64, 64, -64, -64, -64, 64, -64, 64, -64, -64, -64, 64, -64, 64, 64, 64, 64, 64, 64, 64, 64, -64, -64, -64, 64, 64, -64, 64, -64, 64, 64, -64, -64, -64, -64, -64, 64, -64, -64, -64, 64, 64, -64, 64, -64, -64, -64, 64, 64, 64, -64, -64, -64, -64, 64, 64, 64, 64, 64, 64, 64, -64, -64, -64, -64, -64, -64, 64, 64, -64, -64, 64, 64, -64, 64, -64, 64, 64, 64, -64, -64, -64, -64, -64, -64, 64, 64, 64, 64, 64, 64, -64, 64, 64, 64, 64, -64, 64, -64, -64, -64, -64, 64, 64, -64, -64, -64, 64, -64, 64, -64, -64, -64, -64, 64, 64, 64, 64, -64, 64, 64, 64, 64, 64, -64, 64, 64, 64, 64, -64, -64, -64, -64, -64, -64, -64, -64, -64, -64, -64, 64, -64, 64, 64, -64, -64, -64, -64, -64, -64, 64, 64, 64, 64, -64, -64, -64, -64, 64, -64, 64, -64, -64, 64, -64, -64, -64, -64, -64, 64, 64, -64, 64, -64, -64, -64, 64, 64, -64, -64, 64, 64, 64, -64, 64, 64, 64, 64, 64, 64, -64, -64, -64, -64, -64, -64, 64, 64, -64, -64, 64, -64, -64, -64, -64, -64, -64, -64, -64, -64, 64, 64, -64, 64, 64, -64, 64, 64, 64, -64, -64, -64, -64, -64, -64, 64, -64, -64, -64, 64, -64, -64, -64, 64, -64, -64, -64, 64, 64, -64, -64, -64, 64, -64, 64, -64, 64, 64, -64, -64, -64, -64, 64, -64, 64, -64, 64, -64, -64, -64, -64, -64, -64, -64, -64, -64, -64, 64, 64, -64, 64, -64, 64, -64, 64, -64, -64, -64, -64, -64, -64, -64, -64, -64, -64, -64, -64, -64, -64, -64, -64, -64, 64, -64, -64, -64, 64, -64, -64, -64, -64, -64, 64, 64, -64, -64, -64, -64, -64, 64, -64, -64, -64, -64, -64, -64, 64, -64, -64, -64, -64, -64, -64, 64, 64, 64, -64, -64, 64, -64, -64, -64, 64, -64, -64, -64, 64, -64, -64, -64, 64, -64, 64, 64, -64, -64, -64, -64, -64, -64, -64, -64, 64, -64, 64, 64, -64, 64, -64, 64, -64, -64, -64, -64, -64, -64, 64, -64, -64, 64, 64, 64, -64, -64, -64, -64, -64, -64, 64, -64, 64, 64, 64, 64, -64, -64, -64, 64, -64, -64, -64, -64, 64, -64, -64, -64, 64, -64, -64, -64, -64, 64, -64, 64, -64, -64, -64, 64, 64, -64, 64, -64, 64, -64, 64, 64, 64, 64, -64, 64, 64, -64, -64, -64, -64, -64, -64, -64, 64, 64, -64, 64, -64, -64, 64, -64, 64, 64, -64, -64, 64, -64, -64, -64, -64, -64, 64, 64, -64, -64, -64, -64, -64, -64, -64, -64, -64, -64, 64, 64, 64, 64, 64, 64, -64, 64, 64, -64, 64, -64, 64, 64, 64, 64, -64, 64, -64, -64, -64, -64, -64, -64, -64, -64, -64, -64, 64, 64, 64, -64, -64, 64, -64, -64, -64, -64, -64, 64, 64, 64, -64, 64, 64, 64, -64, -64, -64, -64, -64, -64, -64, -64, -64, 64, 64, 64, 64, -64, 64, 64, -64, -64, 64, -64, -64, -64, -64, -64, -64, 64, 64, 64, 64, -64, -64, -64, -64, -64, -64, -64, -64, 64, 64, 64, 64, 64, 64, 64, -64, -64, 64, 64, -64, 64, 64, -64, -64, 64, 64, 64, 64, -64, 64, -64, -64, -64, 64, 64, 64, 64, 64, 64, 64, 64, 64, -64, -64, 64, -64, 64, 64, 64, -64, 64, 64, 64, 64, -64, 64, 64, -64, 64, 64, 64, 64, 64, 64, -64, 64, 64, 64, 64, -64, 64, -64, 64, -64, -64, 64, 64, 64, 64, 64, -64, 64, 64, 64, 64, 64, 64, 64, 64, 64, 64, -64, -64, -64, 64, 64, 64, -64, -64, 64, 64, 64, -64, 64, 64, -64, -64, -64, -64, 64, 64, 64, 64, -64, 64, -64, -64, -64, -64, -64, -64, 64, 64, 64, -64, -64, -64, 64, 64, -64, 64, 64, -64, 64, -64, -64, -64, 64, 64, -64, -64, 64, -64, -64, -64, -64, -64, 64, -64, -64, 64, 64, -64, 64, 64, 64, -64, -64, 64, 64, -64, -64, 64, 64, 64, -64, 64, 64, -64, -64, -64, -64, 64, -64, 64, -64, -64, 64, -64, -64, -64, -64, -64, 64, -64, -64, -64, -64, -64, 64, 64, -64, -64, 64, 64, -64, 64, 64, -64, 64, -64, -64, -64, 64, 64, -64, 64, -64, -64, -64, -64, -64, -64, -64, 64, -64, -64, 64, 64, 64, 64, 64, 64, -64, -64, 64, 64, -64, 64, -64, 64, 64, 64, 64, 64, 64, 64, 64, 64, -64, -64, -64, 64, 64, 64, 64, -64, -64, -64, 64, -64, -64, 64, -64, -64, 64, 64, 64, 64, 64, 64, 64, 64, 64, 64, -64, 64, 64, -64, -64, -64, 64, -64, -64, -64, -64, 64, -64, 64, -64, -64, -64, 64, 64, 64, 64, 64, -64, 64, 64, 64, 64, 64, -64, -64, 64, -64, -64, 64, -64, 64, -64, -64, -64, 64, -64, -64, -64, -64, -64, 64, 64, 64, 64, 64, 64, 64, 64, 64, 64, 64, 64, -64, -64, -64, -64, 64, -64, 64, 64, 64, 64, -64, -64, -64, -64, -64, 64, 64, -64, -64, -64, -64, 64, 64, 64, 64, 64, 64, -64, 64, -64, -64, 64, -64, 64, 64, -64, 64, -64, -64, -64, -64, -64, -64, 64, -64, 64, -64, -64, 64, 64, 64, 64, -64, 64, 64, 64, -64, 64, 64, 64, 64, 64, -64, -64, -64, -64, -64, -64, -64, -64, -64, 64, 64, -64, -64, -64, 64, 64, 64, 64, 64, 64, 64, 64, 64, 64, 64, 64, 64, -64, 64, 64, -64, -64, -64, -64, -64, -64, -64, -64, 64, 64, -64, -64, -64, 64, -64, -64, 64, 64, -64, 64, 64, 64, 64, 64, -64, 64, 64, -64, -64, 64, -64, -64, -64, -64, 64, 64, 64, 64, -64, 64, 64, -64, -64, -64, -64, -64, 64, 64, -64, 64, 64, 64, 64, 64, -64, -64, -64, -64, -64, -64, -64, 64, -64, 64, 64, -64, 64, -64, -64, -64, -64, -64, -64, -64, -64, -64, -64, -64, 64, -64, -64, -64, 64, 64, 64, 64, -64, -64, -64, -64, 64, 64, -64, 64, 64, -64, -64, -64, -64, -64, -64, -64, -64, -64, -64, -64, -64, -64, -64, -64, 64, -64, 64, -64, -64, 64, 64, -64, 64, 64, 64, 64, 64, -64, -64, -64, -64, -64, -64, -64, -64, 64, 64, -64, -64, -64, -64, 64, 64, -64, 64, 64, 64, 64, 64, -64, 64, 64, 64, 64, -64, -64, -64, -64, -64, -64, 64, -64, -64, 64, 64, 64, -64, -64, 64, -64, -64, -64, -64, 64, 64, 64, 64, 64, -64, 64, 64, 64, -64, -64, -64, -64, -64, -64, -64, 64, 64, 64, 64, 64, 64, 64, -64, 64, 64, 64, -64, 64, -64, 64, -64, 64, 64, 64, -64, -64, -64, -64, -64, -64, -64, -64, 64, 64, 64, 64, 64, -64, -64, -64, 64, 64, -64, -64, -64, -64, 64, -64, -64, 64, -64, -64, -64, -64, -64, -64, -64, -64, -64, 64, 64, 64, 64, 64, 64, -64, 64, -64, 64, -64, 64, -64, -64, 64, 64, -64, -64, -64, -64, -64, -64, -64, -64, -64, -64, -64, -64, -64, 64, 64, 64, 64, -64, -64, -64, 64, -64, -64, 64, -64, -64, 64, 64, -64, -64, -64, -64, -64, -64, -64, -64, -64, -64, -64, -64, 64, 64, 64, 64, 64, -64, 64, 64, -64, 64, 64, -64, 64, 64, 64, 64, 64, 64, 64, 64, -64, -64, -64, -64, 64, -64, -64, -64, 64, 64, 64, 64, -64, -64, 64, -64, -64, -64, -64, -64, -64, 64, -64, 64, 64, 64, -64, -64, 64, 64, 64, -64, -64, -64, 64, 64, 64, 64, 64, 64, -64, 64, -64, -64, 64, 64, -64, 64, 64, 64, 64, 64, 64, 64, 64, 64, -64, -64, 64, -64, 64, 64, 64, 64, -64, 64, 64, -64, -64, -64, -64, -64, -64, 64, -64, 64, 64, 64, -64, 64, 64, 64, 64, 64, -64, 64, 64, 64, 64, -64, 64, -64, -64, -64, -64, 64, -64, -64, -64, -64, 64, -64, -64, -64, 64, 64, 64, 64, 64, 64, -64, 64, 64, 64, 64, -64, -64, -64, 64, -64, -64, 64, 64, -64, -64, -64, 64, -64, -64, -64, -64, 64, 64, 64, 64, 64, 64, 64, -64, 64, 64, 64, 64, -64, -64, -64, -64, -64, -64, 64, 64, -64, -64, -64, -64, -64, 64, -64, -64, 64, 64, -64, -64, 64, -64, -64, 64, -64, -64, -64, -64, -64, 64, 64, -64, 64, -64, 64, -64, -64, -64, 64, -64, 64, 64, 64, 64, 64, 64, 64, -64, -64, -64, 64, 64, -64, -64, -64, -64, 64, -64, -64, -64, -64, -64, -64, -64, -64, -64, 64, -64, 64, 64, 64, -64, -64, 64, 64, 64, 64, -64, 64, -64, 64, 64, 64, -64, -64, 64, 64, 64, -64, -64, -64, -64, -64, -64, 64, 64, 64, 64, -64, 64, -64, 64, -64, 64, -64, 64, 64, 64, 64, -64, 64, 64, 64, 64, 64, -64, -64, -64, -64, -64, -64, -64, -64, -64, -64, 64, -64, -64, -64, 64, 64, -64, -64, -64, 64, -64, -64, -64, 64, -64, -64, -64, -64, 64, -64, -64, -64, 64, 64, 64, -64, -64, -64, 64, 64, 64, -64, -64, 64, -64, -64, -64, 64, 64, 64, 64, 64, -64, 64, 64, -64, 64, -64, -64, 64, -64, -64, 64, -64, 64, -64, -64, -64, -64, -64, 64, -64, -64, 64, -64, 64, 64, 64, -64, 64, 64, 64, 64, 64, 64, 64, 64, 64, 64, 64, -64, 64, 64, 64, 64, -64, 64, 64, -64, 64, 64, 64, 64, 64, -64, -64, -64, 64, -64, -64, 64, 64, -64, 64, 64, 64, 64, 64, 64, 64, 64, 64, 64, 64, 64, 64, 64, 64, 64, 64, 64, 64, 64, -64, 64, -64, 64, 64, -64, 64, -64, 64, 64, 64, 64, 64, 64, 64, -64, -64, 64, 64, 64, 64, 64, 64, 64, 64, 64, -64, -64, -64, 64, -64, 64, 64, 64, 64, -64, -64, -64, 64, 64, 64, 64, 64, -64, 64, -64, 64, 64, 64, -64, -64, 64, 64, 64, -64, -64, 64, 64, -64, 64, 64, 64, -64, -64, 64, 64, -64, 64, -64, 64, 64, -64, -64, -64, 64, -64, -64, -64, 64, -64, 64, -64, -64, -64, 64, 64, 64, 64, 64, 64, -64, -64, 64, 64, 64, 64, -64, 64, 64, -64, -64, -64, -64, -64, -64, -64, 64, 64, -64, -64, -64, 64, -64, -64, 64, -64, -64, -64, -64, -64, 64, -64, 64, 64, 64, -64, -64, -64, 64, -64, 64, -64, -64, -64, 64, -64, -64, -64, 64, -64, -64, 64, -64, -64, 64, 64, -64, 64, 64, 64, 64, -64, -64, 64, -64, 64, -64, 64, 64, -64, 64, 64, -64, -64, -64, -64, -64, -64, -64, -64, 64, 64, -64, 64, 64, -64, -64, -64, 64, 64, -64, 64, 64, -64, 64, 64, 64, 64, -64, -64, -64, 64, 64, 64, 64, 64, 64, 64, 64, 64, 64, 64, 64, 64, -64, 64, -64, -64, 64, 64, 64, -64, -64, 64, 64, 64, -64, -64, 64, 64, 64, -64, 64, 64, 64, 64, 64, 64, 64, -64, 64, 64, 64, -64, -64, -64, 64, 64, 64, -64, 64, 64, 64, -64, -64, 64, 64, 64, -64, 64, 64, 64, 64, 64, 64, 64, -64, 64, -64, -64, 64, 64, 64, 64, 64, -64, 64, 64, -64, -64, -64, 64, 64, 64, 64, 64, 64, 64, 64, 64, 64, -64, -64, 64, -64, -64, 64, 64, 64, -64, -64, 64, 64, 64, -64, 64, 64, -64, 64, 64, 64, -64, 64, 64, 64, 64, 64, 64, 64, -64, 64, 64, 64, 64, 64, 64, 64, 64, 64, 64, 64, -64, -64, 64, 64, 64, 64, -64, 64, -64, 64, -64, -64, 64, 64, 64, 64, 64, 64, 64, 64, 64, -64, 64, 64, -64, 64, 64, 64, -64, -64, -64, 64, -64, 64, 64, 64, 64, -64, 64, 64, 64, 64, 64, 64, 64, -64, 64, 64, 64, 64, 64, 64, 64, 64, -64, 64, 64, -64, 64, -64, -64, 64, -64, -64, 64, 64, -64, 64, 64, 64, -64, -64, 64, 64, -64, -64, 64, 64, 64, 64, 64, 64, -64, 64, 64, 64, 64, -64, -64, 64, 64, -64, 64, -64, -64, -64, 64, -64, 64, 64, 64, 64, 64, 64, 64, 64, 64, -64, 64, 64, -64, 64, -64, 64, -64, -64, -64, 64, -64, -64, 64, 64, 64, 64, -64, 64, -64, 64, -64, 64, 64, 64, 64, -64, -64, -64, -64, 64, 64, 64, -64, -64, 64, -64, 64, 64, -64, 64, 64, -64, -64, -64, 64, 64, 64, -64, 64, -64, -64, 64, -64, 64, 64, -64, -64, 64, 64, 64, 64, 64, -64, -64, 64, 64, 64, -64, -64, 64, 64, -64, -64, 64, 64, -64, 64, 64, 64, 64, 64, -64, 64, -64, -64, 64, -64, -64, 64, 64, -64, 64, -64, -64, -64, -64, 64, 64, 64, 64, 64, 64, 64, 64, -64, -64, -64, -64, 64, 64, -64, 64, -64, -64, 64, -64, 64, 64, -64, -64, -64, 64, 64, 64, -64, 64, -64, 64, 64, 64, -64, 64, 64, 64, 64, 64, 64, 64, 64, -64, 64, -64, 64, -64, -64, -64, -64, 64, 64, -64, 64, 64, -64, 64, 64, -64, 64, -64, -64, 64, -64, -64, 64, -64, -64, -64, 64, 64, -64, 64, 64, -64, -64, -64, 64, 64, -64, -64, 64, -64, -64, -64, -64, 64, 64, -64, 64, 64, -64, 64, -64, -64, -64, -64, 64, -64, 64, -64, -64, -64, 64, 64, -64, -64, -64, 64, -64, -64, 64, -64, 64, 64, -64, -64, -64, -64, 64, -64, 64, -64, -64, -64, 64, 64, -64, -64, -64, -64, 64, -64, -64, -64, 64, 64, 64, -64, 64, 64, -64, -64, -64, 64, -64, -64, 64, -64, -64, -64, 64, -64, 64, -64, -64, 64, -64, 64, -64, -64, -64, -64, 64, 64, -64, 64, 64, -64, -64, 64, -64, -64, 64, 64, -64, 64, -64, -64, -64, -64, 64, -64, -64, 64, 64, -64, -64, -64, 64, 64, -64, -64, -64, 64, 64, -64, -64, 64, 64, 64, -64, -64, 64, -64, 64, -64, -64, 64, -64, -64, 64, -64, -64, -64, 64, -64, -64, 64, -64, -64, 64, -64, -64, -64, -64, 64, -64, 64, 64, 64, 64, 64, -64, 64, 64, 64, -64, -64, 64, 64, 64, -64, 64, 64, 64, 64, -64, -64, 64, -64, -64, 64, 64, -64, 64, -64, 64, 64, 64, 64, -64, 64, -64, -64, 64, 64, 64, -64, 64, 64, 64, 64, 64, -64, 64, -64, -64, -64, 64, 64, 64, -64, 64, -64, 64, 64, 64, 64, 64, 64, 64, 64, 64, 64, 64, 64, -64, -64, 64, -64, -64, 64, -64, -64, 64, -64, -64, -64, -64, 64, -64, 64, -64, 64, 64, -64, 64, 64, 64, 64, 64, -64, 64, 64, 64, 64, 64, 64, 64, 64, 64, 64, -64, 64, -64, -64, 64, 64, 64, 64, 64, 64, 64, 64, -64, -64, 64, 64, 64, 64, -64, -64, 64, -64, 64, 64, 64, 64, 64, 64, -64, -64, 64, 64, 64, -64, 64, -64, -64, 64, 64, 64, 64, 64, 64, -64, -64, 64, 64, -64, -64, 64, 64, -64, -64, 64, 64, 64, -64, -64, -64, -64, -64, 64, 64, -64, -64, 64, 64, 64, 64, -64, -64, -64, 64, 64, -64, -64, 64, 64, 64, -64, -64, 64, 64, -64, -64, 64, 64, 64, 64, 64, 64, 64, 64, 64, 64, 64, -64, 64, 64, 64, 64, 64, 64, -64, 64, -64, -64, 64, 64, 64, -64, -64, -64, 64, 64, 64, 64, -64, -64, 64, -64, -64, 64, 64, -64, 64, -64, 64, 64, 64, 64, 64, 64, -64, 64, -64, -64, 64, -64, 64, -64, 64, 64, -64, -64, 64, 64, 64, 64, 64, 64, 64, 64, 64, 64, 64, -64, -64, 64, -64, 64, 64, -64, 64, -64, 64, 64, -64, -64, -64, -64, 64, 64, 64, -64, 64, -64, 64, -64, 64, -64, 64, 64, -64, -64, 64, 64, 64, 64, -64, 64, -64, 64, 64, 64, 64, 64, -64, -64, 64, 64, 64, 64, 64, -64, 64, 64, 64, 64, 64, 64, -64, -64, 64, 64, 64, 64, 64, -64, 64, 64, 64, 64, -64, -64, 64, -64, -64, 64, 64, -64, -64, 64, 64, 64, -64, 64, -64, 64, 64, -64, 64, 64, 64, -64, -64, -64, -64, -64, 64, -64, 64, 64, -64, -64, -64, 64, 64, 64, -64, 64, 64, 64, 64, 64, -64, -64, 64, 64, 64, 64, -64, 64, 64, -64, 64, 64, -64, 64, -64, 64, 64, -64, -64, 64, -64, 64, 64, 64, 64, 64, -64, -64, -64, 64, 64, 64, 64, 64, -64, -64, 64, -64, -64, -64, 64, -64, 64, 64, -64, -64, -64, 64, 64, 64, 64, 64, 64, -64, 64, 64, 64, 64, 64, 64, 64, 64, 64, -64, 64, 64, 64, 64, 64, 64, 64, 64, -64, 64, 64, 64, -64, 64, 64, 64, 64, 64, -64, 64, 64, 64, 64, -64, 64, 64, 64, -64, -64, -64, 64, 64, -64, 64, 64, -64, 64, -64, -64, -64, 64, 64, 64, 64, -64, 64, -64, 64, 64, 64, 64, 64, 64, 64, 64, 64, 64, 64, -64, -64, 64, -64, -64, 64, 64, -64, 64, -64, 64, 64, 64, -64, 64, 64, 64, 64, 64, 64, 64, 64, 64, -64, 64, 64, 64, 64, -64, -64, 64, -64, 64, -64, -64, 64, -64, 64, 64, -64, -64, -64, 64, 64, 64, -64, 64, -64, 64, 64, -64, 64, 64, 64, 64, 64, 64, -64, 64, 64, -64, 64, 64, 64, 64, 64, -64, -64, -64, 64, 64, 64, -64, 64, -64, 64, -64, -64, -64, -64, 64, 64, 64, -64, 64, -64, 64, -64, -64, 64, -64, -64, -64, 64, -64, -64, -64, 64, 64, -64, -64, -64, -64, -64, 64, -64, -64, 64, 64, -64, -64, 64, -64, -64, -64, 64, 64, 64, 64, 64, -64, 64, 64, -64, -64, 64, -64, 64, -64, 64, 64, 64, 64, -64, -64, 64, 64, 64, -64, -64, 64, 64, 64, -64, -64, -64, 64, 64, -64, 64, -64, 64, 64, 64, 64, 64, -64, 64, 64, 64, -64, 64, -64, -64, 64, 64, 64, -64, -64, -64, 64, -64, -64, 64, -64, -64, -64, -64, 64, 64, 64, 64, -64, 64, -64, 64, 64, -64, -64, 64, 64, -64, -64, 64, -64, -64, 64, -64, -64, -64, 64, -64, 64, 64, 64, 64, -64, -64, 64, 64, 64, 64, -64, -64, 64, -64, 64, 64, -64, -64, -64, -64, -64, -64, -64, 64, -64, -64, -64, -64, 64, -64, 64, -64, -64, 64, -64, -64, -64, -64, -64, -64, -64, 64, 64, 64, -64, -64, 64, 64, -64, 64, -64, 64, -64, -64, -64, -64, -64, 64, 64, 64, 64, 64, 64, 64, -64, 64, -64, 64, 64, 64, -64, 64, 64, 64, 64, 64, 64, 64, -64, 64, -64, -64, 64, 64, -64, -64, -64, 64, -64, -64, 64, -64, -64, -64, -64, -64, -64, -64, -64, -64, -64, 64, 64, 64, 64, 64, 64, 64, -64, -64, -64, -64, 64, -64, 64, -64, -64, -64, 64, -64, -64, -64, -64, -64, -64, -64, -64, -64, -64, 64, -64, 64, 64, 64, 64, 64, -64, -64, 64, -64, 64, -64, 64, 64, -64, 64, 64, 64, -64, 64, 64, -64, -64, 64, -64, -64, -64, 64, 64, 64, 64, 64, -64, -64, -64, 64, -64, 64, 64, 64, -64, -64, 64, 64, 64, -64, -64, 64, 64, -64, 64, -64, -64, -64, 64, 64, 64, 64, 64, -64, 64, -64, 64, -64, -64, -64, 64, 64, -64, -64, 64, -64, -64, 64, 64, 64, -64, 64, 64, 64, 64, -64, 64, 64, 64, 64, -64, 64, 64, -64, 64, 64, -64, -64, 64, -64, 64, -64, 64, 64, 64, 64, 64, 64, -64, 64, 64, -64, 64, -64, -64, 64, 64, 64, 64, 64, -64, 64, -64, -64, -64, -64, 64, 64, 64, 64, 64, -64, 64, 64, 64, -64, -64, 64, 64, 64, 64, -64, -64, 64, 64, 64, 64, -64, -64, -64, 64, -64, 64, 64, 64, -64, -64, 64, 64, 64, 64, 64, 64, 64, 64, 64, 64, 64, 64, 64, -64, 64, 64, 64, -64, 64, 64, 64, 64, 64, 64, 64, 64, -64, -64, 64, 64, -64, 64, -64, 64, 64, 64, 64, 64, -64, 64, -64, 64, 64, 64, -64, -64, 64, 64, 64, 64, -64, -64, -64, 64, -64, 64, 64, 64, 64, 64, 64, -64, -64, 64, -64, -64, -64, 64, -64, 64, 64, 64, 64, 64, 64, 64, -64, 64, -64, 64, 64, 64, 64, 64, 64, 64, 64, 64, 64, -64, -64, 64, 64, 64, 64, 64, -64, 64, 64, 64, 64, 64, 64, -64, 64, 64, -64, 64, 64, 64, 64, 64, 64, 64, 64, 64, 64, 64, -64, 64, 64, 64, 64, 64, 64, 64, 64, 64, -64, 64, 64, 64, -64, -64, -64, 64, -64, 64, -64, -64, -64, -64, 64, 64, 64, 64, -64, -64, 64, -64, 64, 64, 64, 64, 64, 64, 64, 64, 64, -64, -64, -64, 64, 64, 64, -64, 64, 64, 64, 64, 64, 64, 64, 64, -64, -64, -64, 64, 64, -64, 64, 64, 64, 64, 64, 64, -64, -64, -64, -64, 64, -64, 64, -64, -64, -64, -64, 64, 64, 64, 64, -64, -64, -64, -64, 64, 64, 64, -64, 64, 64, 64, 64, 64, -64, -64, -64, -64, -64, 64, -64, -64, -64, 64, 64, 64, 64, 64, 64, -64, -64, -64, 64, 64, 64, 64, 64, 64, 64, -64, 64, 64, 64, -64, -64, 64, -64, 64, -64, 64, -64, 64, -64, 64, 64, 64, 64, -64, -64, -64, 64, 64, 64, -64, -64, -64, -64, 64, 64, 64, -64, -64, -64, 64, -64, -64, 64, 64, -64, -64, 64, 64, 64, 64, 64, -64, 64, -64, -64, 64, -64, -64, -64, 64, -64, 64, 64, 64, 64, -64, 64, 64, -64, 64, 64, 64, -64, -64, 64, -64, 64, 64, -64, -64, -64, -64, -64, -64, -64, 64, -64, 64, -64, 64, -64, 64, 64, -64, 64, -64, 64, 64, 64, -64, -64, -64, 64, -64, 64, 64, -64, 64, -64, 64, -64, 64, 64, -64, -64, -64, 64, 64, 64, -64, -64, 64, 64, 64, -64, -64, 64, 64, -64, -64, 64, 64, 64, 64, 64, 64, -64, -64, -64, 64, 64, 64, -64, -64, -64, 64, -64, -64, 64, 64, -64, 64, 64, 64, 64, -64, -64, -64, -64, -64, 64, 64, 64, 64, 64, 64, 64, 64, 64, 64, 64, -64, -64, 64, -64, -64, -64, 64, -64, -64, -64, -64, 64, -64, 64, 64, 64, -64, -64, -64, -64, -64, 64, 64, -64, 64, 64, 64, -64, -64, -64, -64, -64, -64, 64, -64, 64, -64, -64, -64, -64, 64, -64, 64, 64, -64, 64, 64, -64, 64, 64, 64, 64, -64, -64, 64, -64, 64, -64, -64, -64, 64, -64, -64, -64, 64, -64, 64, 64, -64, 64, 64, 64, 64, 64, 64, 64, -64, 64, -64, -64, -64, 64, -64, 64, 64, 64, 64, 64, 64, 64, -64, 64, 64, 64, -64, 64, -64, -64, 64, -64, -64, -64, 64, 64, -64, -64, 64, -64, -64, 64, -64, -64, -64, 64, -64, 64, 64, -64, -64, -64, 64, 64, 64, -64, 64, -64, -64, -64, 64, -64, 64, -64, 64, -64, -64, -64, -64, 64, 64, 64, 64, -64, -64, -64, 64, 64, -64, 64, 64, -64, 64, 64, -64, 64, -64, 64, 64, 64, 64, 64, 64, 64, 64, -64, -64, 64, 64, 64, 64, 64, -64, -64, -64, 64, 64, -64, -64, 64, 64, 64, -64, -64, 64, -64, 64, 64, 64, 64, 64, -64, 64, 64, 64, -64, -64, 64, 64, 64, 64, -64, -64, 64, -64, 64, -64, -64, -64, -64, -64, -64, -64, 64, 64, -64, 64, -64, 64, -64, -64, 64, -64, 64, -64, -64, 64, -64, 64, -64, -64, -64, 64, 64, -64, -64, 64, 64, -64, 64, -64, 64, 64, 64, -64, 64, 64, 64, 64, 64, 64, 64, -64, 64, -64, -64, 64, -64, 64, -64, -64, -64, 64, 64, 64, 64, 64, -64, -64, -64, -64, 64, -64, -64, -64, -64, -64, 64, -64, 64, -64, 64, -64, 64, 64, -64, -64, 64, -64, 64, -64, -64, -64, -64, 64, -64, 64, 64, 64, 64, 64, 64, 64, 64, 64, 64, 64, 64, 64, -64, 64, 64, 64, -64, -64, -64, -64, -64, -64, -64, -64, 64, 64, -64, 64, 64, -64, 64, -64, 64, 64, 64, 64, -64, -64, -64, 64, 64, 64, -64, 64, 64, 64, 64, -64, -64, -64, -64, 64, 64, 64, -64, -64, -64, 64, -64, -64, -64, -64, 64, 64, -64, -64, 64, 64, 64, -64, 64, 64, -64, -64, 64, 64, -64, -64, 64, -64, 64, 64, -64, -64, -64, -64, -64, 64, -64, 64, -64, -64, -64, -64, 64, 64, 64, 64, 64, 64, -64, 64, -64, -64, 64, 64, 64, -64, 64, 64, 64, -64, -64, -64, -64, -64, 64, -64, -64, -64, 64, 64, 64, 64, -64, 64, -64, 64, 64, -64, -64, 64, -64, -64, 64, -64, 64, 64, -64, 64, -64, -64, 64, -64, 64, -64, 64, -64, 64, 64, -64, 64, -64, 64, 64, 64, -64, 64, -64, -64, 64, 64, 64, 64, 64, -64, -64, -64, -64, 64, 64, -64, 64, 64, 64, 64, 64, 64, 64, 64, 64, 64, 64, -64, -64, 64, 64, 64, -64, -64, 64, -64, -64, -64, 64, -64, -64, -64, -64, 64, 64, -64, 64, 64, -64, 64, 64, -64, -64, -64, 64, 64, 64, -64, -64, 64, 64, -64, -64, 64, 64, 64, 64, -64, 64, -64, 64, 64, -64, -64, -64, -64, 64, 64, 64, 64, -64, 64, 64, 64, -64, 64, 64, -64, -64, 64, 64, 64, -64, 64, 64, 64, -64, 64, 64, 64, 64, -64, -64, -64, -64, 64, 64, 64, 64, 64, -64, -64, -64, 64, -64, 64, -64, 64, -64, -64, 64, 64, -64, 64, 64, -64, 64, 64, -64, 64, -64, 64, 64, -64, 64, 64, 64, -64, 64, -64, -64, -64, -64, 64, 64, 64, -64, -64, -64, -64, 64, 64, 64, -64, 64, 64, 64, 64, 64, -64, 64, 64, -64, 64, 64, 64, 64, -64, 64, 64, 64, 64, 64, -64, 64, 64, -64, -64, 64, 64, -64, -64, 64, 64, -64, 64, 64, -64, 64, -64, 64, -64, 64, -64, -64, 64, 64, 64, 64, 64, 64, 64, -64, -64, -64, -64, -64, -64, -64, 64, 64, -64, -64, 64, 64, -64, 64, 64, -64, 64, -64, 64, -64, 64, 64, 64, 64, -64, 64, -64, 64, -64, 64, 64, 64, 64, -64, -64, 64, -64, -64, 64, -64, 64, -64, 64, 64, 64, -64, 64, 64, 64, 64, -64, 64, -64, 64, 64, 64, -64, 64, -64, 64, 64, -64, 64, 64, 64, -64, 64, -64, -64, 64, 64, -64, -64, -64, -64, -64, -64, -64, -64, 64, 64, 64, -64, 64, -64, 64, 64, -64, 64, 64, -64, -64, -64, 64, -64, 64, 64, 64, -64, 64, 64, -64, -64, -64, -64, 64, 64, -64, -64, 64, 64, -64, 64, -64, -64, -64, -64, -64, -64, -64, 64, -64, -64, 64, -64, -64, 64, 64, 64, 64, -64, -64, 64, -64, -64, -64, -64, -64, -64, -64, -64, -64, 64, -64, 64, -64, -64, 64, -64, -64, -64, -64, 64, 64, -64, -64, 64, -64, -64, -64, 64, 64, 64, -64, 64, -64, 64, 64, -64, 64, 64, 64, -64, 64, -64, -64, 64, -64, 64, 64, -64, -64, -64, -64, -64, -64, 64, -64, -64, -64, 64, -64, -64, -64, -64, 64, -64, -64, -64, 64, -64, 64, 64, 64, -64, -64, 64, 64, -64, 64, -64, -64, -64, -64, -64, -64, -64, -64, -64, 64, 64, 64, 64, 64, 64, -64, 64, -64, -64, -64, 64, -64, -64, 64, 64, 64, -64, -64, 64, 64, -64, -64, 64, 64, -64, -64, 64, 64, -64, -64, -64, -64, -64, 64, -64, -64, 64, -64, -64, 64, 64, -64, 64, -64, -64, -64, 64, 64, 64, 64, 64, 64, 64, -64, -64, 64, -64, -64, -64, -64, 64, 64, -64, -64, 64, -64, 64, 64, -64, 64, -64, -64, 64, 64, 64, -64, -64, 64, -64, 64, -64, 64, -64, -64, 64, -64, -64, -64, 64, 64, -64, -64, 64, -64, -64, 64, 64, 64, -64, -64, -64, -64, -64, -64, 64, 64, 64, 64, 64, -64, 64, 64, 64, -64, 64, 64, -64, 64, -64, 64, -64, 64, -64, 64, 64, -64, 64, -64, 64, 64, -64, 64, 64, 64, 64, 64, 64, 64, -64, 64, 64, -64, 64, -64, 64, -64, 64, -64, 64, 64, -64, 64, 64, -64, 64, 64, 64, -64, 64, 64, 64, 64, 64, 64, 64, 64, 64, -64, 64, 64, 64, 64, -64, -64, 64, -64, -64, 64, 64, 64, 64, 64, 64, 64, -64, -64, 64, 64, 64, 64, 64, 64, 64, 64, 64, 64, -64, 64, -64, 64, 64, 64, 64, 64, -64, 64, -64, 64, 64, -64, -64, 64, -64, 64, 64, 64, 64, 64, 64, 64, 64, 64, 64, 64, 64, 64, -64, -64, 64, -64, -64, -64, 64, 64, 64, 64, 64, 64, 64, -64, 64, 64, 64, 64, 64, 64, -64, -64, -64, 64, 64, 64, 64, -64, 64, -64, -64, -64, 64, 64, -64, 64, 64, -64, 64, 64, 64, 64, 64, -64, 64, 64, 64, 64, 64, 64, 64, -64, -64, 64, -64, 64, 64, 64, -64, -64, 64, 64, 64, -64, 64, 64, 64, 64, 64, -64, 64, -64, -64, -64, 64, 64, 64, 64, -64, 64, 64, -64, 64, 64, 64, 64, -64, 64, -64, -64, 64, -64, 64, 64, 64, 64, 64, 64, 64, -64, -64, -64, 64, 64, 64, -64, 64, -64, -64, 64, 64, 64, 64, -64, 64, -64, 64, 64, 64, 64, -64, 64, 64, 64, 64, 64, 64, -64, -64, -64, -64, 64, 64, 64, 64, 64, 64, 64, -64, -64, 64, -64, 64, 64, 64, -64, 64, 64, -64, -64, -64, 64, 64, 64, 64, 64, 64, -64, 64, 64, 64, 64, 64, 64, 64, -64, -64, -64, 64, 64, 64, 64, 64, -64, -64, -64, -64, 64, 64, -64, 64, 64, 64, 64, -64, -64, 64, 64, 64, 64, 64, -64, 64, 64, 64, -64, 64, 64, 64, -64, 64, 64, -64, 64, 64, -64, 64, 64, 64, 64, 64, 64, -64, -64, 64, 64, 64, -64, 64, 64, 64, -64, -64, 64, -64, 64, 64, 64, -64, -64, -64, 64, -64, -64, 64, 64, 64, 64, 64, 64, 64, -64, -64, -64, 64, 64, 64, 64, 64, 64, -64, 64, -64, 64, 64, 64, 64, 64, -64, -64, 64, 64, 64, 64, -64, 64, 64, 64, 64, -64, 64, 64, 64, 64, 64, -64, -64, 64, 64, 64, -64, 64, 64, 64, -64, 64, -64, -64, 64, 64, -64, -64, 64, 64, 64, 64, 64, -64, -64, -64, -64, 64, 64, 64, 64, 64, -64, -64, -64, 64, -64, -64, 64, 64, 64, 64, -64, 64, 64, 64, 64, 64, 64, 64, 64, 64, -64, -64, -64, -64, -64, -64, -64, 64, -64, 64, 64, -64, 64, 64, -64, 64, 64, 64, 64, 64, -64, 64, -64, 64, 64, 64, -64, -64, 64, 64, 64, -64, -64, -64, -64, -64, -64, 64, -64, -64, -64, -64, -64, 64, 64, 64, -64, 64, -64, 64, -64, -64, 64, 64, 64, 64, -64, -64, -64, -64, -64, -64, -64, 64, -64, 64, -64, -64, 64, -64, -64, 64, -64, -64, 64, 64, 64, -64, -64, 64, 64, 64, 64, 64, -64, -64, -64, 64, -64, 64, 64, 64, 64, -64, 64, 64, 64, -64, -64, 64, -64, -64, 64, 64, 64, 64, -64, -64, 64, 64, 64, 64, 64, 64, 64, 64, 64, -64, -64, 64, 64, -64, 64, -64, -64, -64, 64, -64, -64, -64, 64, -64, 64, 64, 64, 64, 64, -64, 64, 64, 64, 64, 64, 64, -64, 64, -64, 64, -64, -64, 64, 64, 64, 64, 64, 64, 64, 64, 64, -64, 64, -64, 64, 64, -64, 64, 64, 64, 64, 64, 64, 64, -64, -64, 64, 64, 64, 64, 64, -64, -64, 64, -64, 64, -64, -64, -64, -64, 64, -64, -64, -64, -64, -64, -64, -64, -64, -64, -64, -64, -64, -64, -64, 64, -64, 64, 64, 64, -64, 64, 64, 64, -64, -64, -64, 64, 64, -64, 64, 64, -64, -64, -64, 64, 64, -64, -64, -64, 64, -64, 64, 64, 64, -64, -64, -64, 64, -64, 64, 64, -64, 64, -64, -64, 64, 64, 64, -64, 64, 64, 64, -64, 64, 64, -64, -64, -64, -64, 64, -64, -64, -64, -64, -64, 64, 64, 64, 64, 64, -64, -64, 64, 64, -64, -64, -64, -64, -64, 64, 64, -64, -64, -64, 64, -64, -64, -64, -64, 64, 64, 64, -64, 64, -64, -64, -64, 64, -64, 64, -64, -64, 64, 64, 64, 64, -64, -64, -64, -64, -64, -64, -64, -64, -64, -64, -64, -64, 64, 64, -64, -64, 64, -64, -64, -64, -64, -64, -64, 64, -64, 64, 64, -64, 64, -64, -64, 64, -64, -64, -64, -64, -64, -64, 64, 64, 64, -64, 64, -64, -64, 64, 64, -64, -64, -64, -64, -64, -64, -64, -64, -64, -64, 64, -64, -64, -64, -64, -64, -64, -64, -64, -64, 64, -64, -64, 64, 64, -64, 64, 64, 64, -64, 64, 64, -64, -64, -64, -64, 64, 64, 64, 64, 64, 64, 64, 64, 64, -64, 64, 64, 64, -64, 64, -64, -64, 64, 64, -64, -64, -64, 64, -64, -64, -64, -64, 64, -64, -64, -64, 64, 64, 64, 64, 64, 64, 64, 64, -64, -64, -64, -64, 64, 64, 64, -64, 64, -64, -64, -64, -64, -64, -64, -64, -64, 64, -64, 64, 64, 64, 64, 64, 64, 64, -64, 64, -64, -64, -64, -64, -64, -64, -64, -64, -64, -64, -64, 64, -64, -64, -64, -64, 64, -64, -64, -64, -64, 64, 64, -64, -64, -64, 64, -64, -64, -64, -64, -64, -64, -64, 64, 64, 64, 64, -64, 64, 64, 64, -64, -64, -64, -64, -64, -64, 64, -64, -64, 64, -64, -64, 64, -64, -64, -64, 64, -64, -64, -64, 64, -64, 64, 64, 64, 64, -64, 64, 64, 64, -64, -64, -64, -64, -64, -64, -64, -64, -64, 64, -64, 64, 64, 64, 64, -64, 64, 64, -64, 64, 64, 64, 64, 64, 64, 64, -64, -64, 64, -64, -64, -64, -64, -64, -64, -64, -64, 64, 64, 64, 64, -64, -64, -64, 64, 64, -64, -64, -64, 64, 64, 64, 64, 64, -64, 64, -64, -64, 64, -64, -64, -64, -64, -64, -64, -64, 64, 64, 64, -64, 64, -64, -64, 64, -64, -64, 64, 64, 64, 64, 64, 64, 64, -64, -64, -64, -64, -64, -64, -64, -64, -64, -64, 64, -64, 64, 64, -64, 64, -64, -64, 64, -64, -64, -64, -64, -64, 64, 64, -64, -64, -64, -64, -64, -64, -64, -64, -64, -64, -64, -64, -64, -64, 64, -64, -64, 64, -64, 64, 64, -64, -64, -64, -64, -64, -64, 64, 64, 64, 64, -64, -64, -64, -64, -64, -64, -64, -64, 64, -64, -64, 64, 64, -64, 64, -64, -64, -64, 64, -64, -64, -64, -64, -64, -64, -64, 64, 64, 64, 64, -64, -64, -64, -64, -64, 64, -64, -64, -64, 64, 64, -64, -64, -64, 64, -64, 64, -64, -64, -64, -64, -64, 64, 64, 64, -64, -64, -64, -64, -64, -64, -64, -64, -64, -64, -64, -64, -64, -64, -64, -64, -64, 64, 64, 64, 64, -64, -64, 64, 64, -64, -64, -64, -64, -64, -64, -64, -64, -64, -64, -64, -64, -64, -64, -64, -64, 64, -64, -64, 64, 64, -64, 64, 64, 64, -64, -64, 64, -64, -64, -64, 64, 64, 64, 64, -64, -64, -64, -64, -64, -64, -64, -64, -64, 64, 64, -64, 64, -64, -64, 64, 64, -64, -64, 64, -64, 64, 64, -64, -64, -64, -64, -64, -64, -64, -64, 64, -64, -64, -64, -64, -64, 64, -64, 64, 64, -64, 64, 64, 64, -64, -64, -64, 64, -64, 64, 64, -64, -64, 64, -64, -64, -64, -64, -64, -64, -64, -64, -64, -64, 64, 64, 64, 64, -64, -64, 64, 64, -64, -64, -64, -64, 64, 64, 64, 64, -64, -64, 64, -64, -64, -64, -64, -64, -64, -64, -64, -64, -64, 64, 64, 64, -64, -64, 64, -64, -64, 64, -64, 64, -64, -64, 64, -64, 64, -64, -64, -64, -64, -64, -64, 64, 64, 64, -64, -64, -64, -64, 64, 64, -64, 64, -64, -64, 64, -64, 64, 64, 64, 64, 64, 64, 64, 64, -64, -64, -64, -64, -64, 64, 64, 64, 64, 64, 64, -64, 64, -64, 64, -64, -64, 64, -64, 64, 64, 64, 64, -64, 64, -64, 64, 64, 64, 64, -64, -64, -64, 64, 64, -64, 64, 64, -64, -64, 64, -64, -64, 64, 64, 64, -64, 64, -64, -64, -64, -64, 64, 64, 64, -64, -64, 64, 64, 64, 64, 64, 64, -64, 64, -64, 64, 64, 64, -64, -64, -64, 64, 64, -64, -64, 64, -64, -64, -64, -64, 64, -64, 64, 64, -64, 64, 64, 64, 64, 64, -64, -64, -64, 64, -64, -64, 64, -64, -64, -64, -64, 64, 64, -64, 64, 64, -64, -64, -64, -64, 64, 64, -64, -64, 64, 64, 64, -64, -64, 64, 64, 64, -64, 64, -64, -64, 64, -64, 64, -64, 64, -64, 64, 64, -64, -64, -64, -64, -64, 64, 64, -64, -64, -64, -64, 64, -64, -64, 64, -64, -64, 64, -64, -64, 64, -64, -64, -64, 64, 64, 64, 64, 64, -64, -64, 64, 64, 64, -64, 64, 64, 64, 64, 64, -64, -64, 64, -64, -64, -64, -64, -64, 64, -64, -64, -64, 64, 64, 64, 64, 64, 64, -64, 64, 64, 64, 64, 64, 64, 64, 64, -64, -64, 64, 64, -64, -64, 64, -64, -64, 64, 64, -64, 64, -64, 64, 64, 64, 64, 64, 64, 64, 64, 64, 64, 64, 64, 64, 64, 64, 64, 64, 64, 64, 64, 64, 64, -64, 64, 64, -64, -64, 64, 64, 64, 64, 64, 64, 64, 64, -64, 64, 64, -64, 64, 64, 64, -64, -64, 64, 64, 64, 64, 64, 64, -64, 64, 64, -64, -64, 64, 64, 64, -64, 64, 64, 64, -64, -64, -64, 64, 64, 64, 64, 64, 64, -64, 64, 64, 64, 64, 64, -64, -64, 64, 64, 64, 64, -64, 64, -64, 64, -64, 64, 64, -64, -64, 64, 64, -64, -64, 64, 64, 64, -64, 64, 64, 64, 64, 64, -64, -64, 64, -64, -64, 64, -64, 64, 64, -64, 64, -64, 64, 64, 64, 64, -64, 64, 64, 64, 64, -64, 64, -64, 64, 64, 64, -64, -64, 64, 64, 64, 64, -64, -64, 64, -64, 64, 64, 64, 64, 64, 64, 64, 64, 64, 64, -64, -64, 64, 64, 64, 64, -64, 64, 64, -64, 64, 64, 64, 64, -64, 64, -64, -64, 64, 64, 64, 64, 64, 64, -64, 64, 64, 64, 64, 64, 64, 64, -64, 64, 64, 64, 64, 64, 64, 64, 64, 64, 64, -64, 64, -64, 64, 64, 64, -64, -64, 64, 64, 64, -64, 64, 64, 64, 64, 64, -64, 64, 64, 64, 64, 64, 64, -64, 64, -64, 64, 64, -64, -64, 64, 64, 64, 64, 64, 64, 64, 64, -64, -64, 64, 64, 64, -64, 64, 64, 64, 64, 64, 64, -64, 64, 64, 64, -64, 64, -64, -64, 64, 64, 64, 64, -64, -64, 64, 64, -64, 64, 64, 64, -64, 64, 64, 64, 64, 64, 64, 64, -64, 64, -64, 64, -64, 64, 64, -64, 64, 64, 64, -64, -64, -64, 64, -64, 64, 64, 64, 64, 64, -64, -64, 64, 64, 64, -64, 64, -64, -64, 64, -64, 64, 64, 64, 64, 64, 64, -64, -64, -64, -64, -64, 64, 64, 64, -64, 64, 64, 64, 64, 64, 64, 64, 64, 64, 64, -64, 64, -64, -64, 64, 64, -64, 64, 64, 64, 64, -64, -64, -64, 64, 64, -64, -64, 64, 64, 64, 64, 64, 64, 64, -64, 64, 64, 64, -64, 64, -64, -64, 64, -64, 64, 64, 64, -64, 64, 64, -64, -64, 64, 64, -64, 64, 64, 64, 64, 64, 64, 64, 64, -64, -64, -64, 64, 64, 64, -64, 64, 64, -64, 64, 64, 64, -64, -64, 64, -64, 64, -64, 64, 64, 64, 64, -64, -64, -64, 64, -64, 64, -64, -64, -64, 64, 64, -64, 64, 64, 64, 64, 64, 64, 64, 64, 64, 64, 64, 64, 64, 64, 64, 64, -64, -64, -64, 64, 64, 64, 64, 64, -64, -64, -64, -64, -64, 64, 64, 64, 64, 64, 64, 64, 64, 64, 64, 64, 64, 64, 64, 64, 64, 64, -64, -64, -64, -64, 64, -64, -64, -64, -64, 64, 64, 64, 64, 64, 64, 64, 64, 64, 64, 64, 64, 64, 64, 64, 64, 64, 64, 64, -64, -64, -64, -64, -64, 64, -64, -64, 64, -64, 64, -64, 64, 64, -64, 64, 64, 64, -64, 64, 64, 64, 64, 64, 64, 64, 64, -64, -64, -64, -64, 64, 64, 64, 64, 64, -64, 64, 64, -64, -64, -64, -64, -64, 64, -64, -64, 64, 64, 64, 64, 64, 64, 64, 64, 64, -64, -64, -64, 64, -64, -64, -64, -64, 64, 64, -64, -64, -64, -64, -64, -64, -64, -64, -64, -64, -64, -64, 64, -64, 64, -64, 64, 64, -64, -64, -64, -64, 64, 64, 64, -64, 64, -64, -64, 64, -64, 64, -64, 64, -64, 64, -64, 64, 64, 64, -64, 64, 64, -64, -64, -64, 64, 64, -64, -64, 64, -64, -64, 64, -64, 64, -64, 64, -64, -64, -64, -64, -64, -64, 64, 64, -64, -64, -64, -64, -64, 64, 64, -64, -64, -64, 64, 64, 64, 64, 64, -64, -64, 64, -64, 64, 64, 64, 64, 64, 64, 64, 64, -64, 64, -64, 64, -64, 64, -64, -64, 64, 64, -64, 64, 64, 64, 64, 64, 64, 64, -64, 64, -64, -64, 64, -64, -64, -64, -64, 64, -64, 64, -64, -64, -64, -64, -64, -64, -64, -64, 64, 64, -64, 64, 64, -64, 64, 64, 64, -64, -64, 64, -64, -64, -64, -64, -64, -64, -64, -64, -64, -64, -64, -64, -64, 64, 64, 64, 64, 64, 64, 64, -64, 64, -64, 64, -64, 64, -64, -64, 64, 64, -64, 64, -64, -64, -64, -64, -64, -64, -64, -64, -64, -64, 64, 64, 64, 64, 64, 64, -64, -64, 64, -64, 64, 64, 64, -64, 64, 64, 64, 64, -64, -64, 64, -64, -64, -64, -64, -64, 64, 64, -64, 64, 64, 64, 64, -64, -64, -64, 64, 64, -64, -64, -64, 64, 64, 64, 64, 64, 64, 64, -64, -64, 64, 64, 64, 64, -64, -64, -64, -64, 64, 64, 64, 64, -64, 64, -64, 64, 64, 64, 64, 64, 64, 64, 64, -64, -64, -64, -64, -64, 64, -64, 64, -64, -64, -64, -64, -64, -64, 64, 64, 64, 64, 64, 64, -64, 64, 64, 64, 64, 64, 64, -64, -64, 64, -64, 64, -64, -64, 64, -64, -64, -64, -64, -64, -64, 64, 64, 64, 64, 64, 64, 64, -64, 64, 64, 64, 64, 64, 64, -64, 64, -64, 64, -64, -64, -64, -64, 64, -64, -64, -64, -64, -64, 64, -64, 64, 64, 64, 64, 64, -64, 64, -64, 64, 64, 64, 64, 64, 64, 64, -64, -64, -64, -64, 64, 64, -64, -64, -64, -64, -64, -64, 64, 64, 64, -64, 64, -64, -64, -64, -64, 64, 64, 64, 64, 64, 64, -64, -64, -64, -64, -64, -64, -64, -64, -64, -64, -64, -64, 64, -64, 64, 64, -64, 64, 64, -64, 64, -64, 64, 64, 64, 64, 64, 64, -64, 64, 64, -64, 64, 64, -64, 64, -64, -64, -64, 64, -64, -64, 64, 64, -64, 64, -64, 64, -64, 64, -64, 64, 64, 64, 64, 64, 64, 64, 64, 64, 64, 64, 64, 64, -64, 64, 64, -64, 64, -64, -64, -64, -64, -64, 64, -64, -64, -64, 64, -64, -64, 64, 64, 64, 64, 64, 64, 64, 64, -64, 64, 64, -64, 64, 64, -64, 64, -64, -64, -64, 64, -64, 64, -64, -64, -64, -64, -64, -64, -64, -64, 64, 64, 64, 64, 64, 64, 64, 64, -64, 64, -64, 64, -64, -64, -64, -64, -64, 64, -64, 64, 64, -64, -64, -64, -64, -64, -64, -64, -64, 64, 64, 64, -64, -64, -64, 64, -64, -64, -64, -64, -64, -64, -64, -64, 64, 64, -64, -64, 64, -64, -64, -64, -64, -64, -64, -64, -64, -64, 64, -64, -64, 64, -64, 64, 64, 64, -64, -64, -64, -64, -64, -64, -64, -64, 64, 64, 64, -64, -64, -64, -64, -64, -64, -64, -64, -64, -64, -64, -64, -64, 64, 64, 64, -64, 64, 64, -64, -64, -64, -64, 64, -64, 64, -64, -64, 64, -64, -64, -64, -64, -64, -64, -64, -64, -64, -64, -64, -64, -64, -64, -64, -64, 64, 64, 64, -64, -64, -64, -64, 64, 64, -64, 64, 64, -64, -64, -64, -64, -64, -64, -64, -64, -64, -64, -64, -64, -64, -64, 64, -64, -64, 64, -64, -64, -64, -64, -64, -64, 64, 64, 64, 64, 64, -64, -64, -64, -64, -64, -64, -64, -64, -64, -64, -64, -64, 64, 64, -64, 64, 64, 64, 64, -64, -64, 64, 64, 64, -64, 64, 64, -64, -64, -64, 64, 64, -64, 64, 64, -64, -64, -64, -64, -64, 64, -64, 64, -64, 64, 64, 64, 64, -64, 64, 64, -64, 64, 64, 64, -64, -64, -64, -64, 64, -64, 64, 64, -64, 64, -64, 64, -64, 64, 64, -64, -64, -64, 64, 64, 64, -64, -64, -64, 64, -64, 64, -64, -64, 64, -64, 64, -64, 64, 64, 64, 64, -64, 64, -64, 64, 64, 64, -64, 64, 64, 64, 64, 64, 64, 64, 64, -64, 64, 64, 64, 64, 64, 64, 64, 64, 64, 64, -64, 64, -64, -64, -64, 64, 64, 64, 64, 64, 64, 64, -64, 64, 64, 64, 64, 64, 64, 64, 64, 64, 64, 64, 64, 64, 64, 64, 64, 64, 64, 64, 64, 64, 64, 64, 64, 64, 64, 64, 64, 64, -64, -64, 64, -64, -64, 64, 64, -64, 64, 64, 64, 64, 64, 64, 64, 64, 64, 64, 64, 64, 64, 64, 64, -64, 64, 64, 64, 64, 64, 64, -64, -64, -64, -64, -64, 64, -64, 64, -64, 64, 64, -64, -64, -64, 64, -64, 64, 64, -64, -64, 64, 64, 64, -64, 64, 64, 64, -64, -64, 64, -64, -64, 64, 64, -64, 64, -64, -64, -64, -64, 64, 64, -64, -64, 64, 64, 64, -64, 64, -64, -64, 64, 64, -64, -64, -64, -64, -64, -64, -64, -64, 64, 64, 64, 64, 64, 64, 64, -64, -64, -64, 64, 64, 64, 64, 64, -64, 64, 64, 64, -64, 64, 64, -64, 64, 64, 64, -64, 64, 64, -64, 64, 64, -64, -64, 64, -64, 64, 64, -64, 64, 64, -64, -64, -64, 64, -64, -64, -64, -64, 64, -64, 64, -64, 64, -64, -64, -64, -64, -64, -64, -64, -64, -64, -64, 64, -64, 64, 64, 64, -64, -64, 64, 64, -64, 64, 64, 64, 64, -64, -64, -64, 64, -64, -64, -64, 64, 64, 64, -64, 64, 64, 64, 64, -64, 64, 64, -64, -64, -64, -64, 64, 64, 64, 64, 64, -64, 64, -64, 64, 64, -64, 64, -64, 64, -64, -64, -64, -64, 64, 64, 64, 64, 64, -64, 64, -64, -64, -64, 64, 64, 64, -64, 64, -64, -64, 64, 64, -64, -64, 64, 64, 64, -64, 64, -64, 64, 64, 64, 64, -64, -64, 64, 64, 64, 64, -64, 64, 64, 64, 64, -64, -64, -64, 64, 64, -64, -64, 64, 64, 64, -64, -64, 64, 64, 64, 64, -64, -64, -64, -64, 64, 64, 64, 64, -64, -64, 64, -64, 64, -64, 64, 64, -64, 64, 64, 64, 64, 64, 64, 64, 64, 64, 64, 64, -64, -64, -64, -64, 64, 64, 64, -64, 64, 64, 64, 64, 64, 64, -64, -64, -64, 64, 64, 64, 64, 64, 64, 64, 64, 64, -64, 64, -64, -64, 64, 64, 64, 64, -64, -64, 64, 64, 64, 64, 64, 64, 64, -64, -64, 64, -64, 64, 64, 64, 64, 64, -64, -64, -64, -64, -64, -64, -64, -64, -64, 64, -64, -64, 64, 64, 64, 64, 64, 64, 64, -64, -64, -64, 64, 64, -64, 64, 64, -64, -64, -64, -64, -64, -64, -64, -64, -64, -64, -64, -64, -64, -64, 64, 64, 64, 64, 64, -64, -64, -64, -64, 64, -64, -64, 64, 64, -64, -64, -64, -64, -64, -64, -64, -64, -64, -64, -64, -64, -64, -64, -64, 64, -64, 64, 64, 64, 64, 64, -64, 64, -64, -64, 64, 64, 64, -64, -64, -64, -64, -64, -64, -64, -64, -64, -64, -64, -64, 64, 64, -64, 64, 64, 64, 64, -64, 64, 64, 64, 64, 64, 64, 64, 64, -64, -64, -64, -64, -64, -64, -64, -64, -64, -64, 64, 64, 64, 64, -64, 64, -64, -64, -64, 64, -64, -64, 64, -64, 64, 64, 64, 64, 64, 64, 64, 64, -64, -64, -64, -64, -64, 64, 64, 64, 64, 64, 64, 64, 64, 64, -64, -64, 64, 64, 64, 64, 64, 64, 64, 64, 64, 64, 64, 64, -64, -64, -64, -64, -64, 64, 64, 64, 64, 64, 64, 64, 64, -64, 64, 64, -64, 64, -64, 64, 64, 64, 64, 64, 64, 64, -64, -64, -64, -64, -64, -64, 64, 64, 64, 64, 64, 64, 64, 64, 64, 64, 64, 64, 64, -64, 64, 64, 64, 64, 64, 64, 64, 64, -64, -64, -64, -64, -64, 64, 64, 64, 64, 64, -64, 64, 64, 64, 64, 64, 64, -64, 64, -64, 64, 64, 64, 64, 64, 64, 64, -64, -64, -64, -64, 64, -64, -64, -64, 64, -64, -64, 64, 64, 64, 64, 64, 64, 64, -64, 64, 64, 64, 64, 64, 64, 64, 64, 64, 64, 64, -64, 64, 64, 64, -64, -64, -64, 64, 64, 64, 64, 64, 64, 64, 64, 64, -64, -64, 64, 64, 64, 64, 64, 64, 64, 64, 64, -64, -64, -64, 64, -64, -64, -64, -64, -64, 64, 64, -64, 64, 64, 64, 64, 64, -64, 64, -64, -64, 64, 64, 64, 64, 64, 64, 64, 64, 64, -64, 64, -64, -64, -64, -64, -64, -64, -64, 64, 64, 64, 64, -64, -64, 64, -64, -64, -64, 64, 64, 64, 64, 64, 64, 64, 64, 64, -64, 64, -64, -64, -64, -64, -64, -64, -64, -64, 64, -64, -64, -64, -64, 64, -64, -64, 64, 64, 64, 64, 64, 64, -64, 64, -64, -64, 64, 64, 64, 64, -64, -64, -64, -64, -64, -64, -64, -64, 64, -64, 64, -64, -64, -64, 64, 64, -64, 64, -64, -64, -64, -64, 64, 64, -64, -64, -64, 64, -64, -64, -64, -64, -64, -64, -64, 64, 64, -64, 64, -64, 64, 64, 64, -64, -64, 64, -64, -64, -64, -64, -64, 64, -64, 64, -64, 64, -64, 64, 64, -64, -64, 64, -64, 64, 64, 64, -64, -64, -64, -64, 64, 64, 64, -64, -64, 64, -64, 64, 64, -64, 64, -64, -64, 64, -64, -64, -64, 64, -64, -64, 64, -64, 64, -64, -64, -64, -64, -64, -64, -64, -64, 64, 64, 64, -64, -64, 64, 64, -64, 64, 64, 64, -64, -64, 64, 64, -64, -64, 64, 64, 64, 64, -64, 64, -64, -64, 64, 64, -64, 64, 64, -64, 64, -64, 64, 64, -64, 64, 64, 64, 64, 64, -64, 64, 64, -64, 64, -64, -64, -64, -64, -64, 64, 64, 64, -64, 64, -64, -64, 64, 64, 64, -64, 64, 64, 64, 64, 64, 64, 64, 64, -64, -64, 64, 64, 64, -64, 64, 64, 64, 64, 64, 64, 64, 64, 64, -64, 64, -64, 64, 64, 64, 64, 64, 64, 64, 64, -64, -64, -64, -64, -64, -64, 64, -64, 64, -64, -64, 64, 64, -64, -64, -64, 64, 64, 64, 64, -64, 64, 64, 64, 64, 64, 64, 64, -64, 64, -64, -64, 64, -64, -64, -64, 64, -64, 64, 64, 64, -64, 64, 64, 64, 64, -64, 64, -64, -64, -64, -64, 64, -64, 64, -64, -64, 64, 64, -64, -64, -64, -64, 64, 64, -64, 64, 64, -64, -64, -64, -64, -64, -64, -64, 64, -64, 64, -64, -64, 64, -64, -64, -64, -64, 64, -64, -64, 64, -64, -64, -64, -64, -64, 64, -64, 64, 64, -64, 64, -64, -64, -64, -64, -64, -64, -64, -64, -64, -64, -64, 64, 64, -64, -64, -64, -64, -64, -64, -64, -64, -64, 64, 64, 64, 64, -64, 64, 64, 64, 64, -64, 64, 64, -64, 64, -64, -64, -64, 64, -64, 64, 64, -64, -64, -64, -64, 64, -64, 64, 64, 64, -64, 64, 64, 64, -64, -64, 64, -64, -64, -64, 64, 64, -64, -64, -64, -64, -64, -64, -64, 64, 64, 64, 64, 64, 64, -64, 64, -64, 64, -64, 64, 64, 64, -64, -64, 64, -64, -64, 64, 64, -64, -64, 64, -64, -64, -64, -64, -64, -64, -64, 64, 64, -64, 64, 64, -64, -64, 64, 64, -64, -64, 64, -64, -64, 64, -64, 64, -64, 64, -64, -64, -64, -64, 64, 64, 64, -64, 64, -64, 64, -64, -64, 64, 64, 64, -64, 64, -64, 64, -64, -64, -64, -64, 64, -64, 64, -64, 64, -64, -64, -64, -64, -64, -64, -64, 64, 64, 64, 64, 64, -64, 64, -64, 64, -64, -64, -64, -64, -64, -64, 64, -64, 64, -64, -64, 64, -64, -64, -64, 64, -64, -64, -64, 64, -64, 64, 64, -64, -64, -64, -64, 64, 64, -64, -64, -64, 64, -64, -64, -64, -64, -64, -64, -64, -64, 64, -64, -64, -64, -64, -64, -64, 64, 64, 64, 64, -64, 64, 64, -64, 64, -64, -64, -64, -64, 64, 64, -64, -64, -64, 64, 64, 64, -64, -64, -64, -64, 64, -64, -64, -64, -64, 64, 64, -64, 64, -64, 64, -64, -64, -64, -64, -64, -64, 64, -64, 64, 64, 64, -64, -64, -64, -64, 64, -64, -64, -64, -64, -64, 64, 64, -64, -64, -64, 64, 64, 64, -64, -64, -64, -64, -64, -64, -64, -64, -64, 64, -64, -64, -64, -64, 64, -64, 64, -64, 64, -64, -64, 64, -64, -64, 64, -64, -64, -64, -64, -64, -64, -64, -64, -64, -64, -64, 64, 64, -64, 64, -64, -64, 64, -64, 64, -64, -64, -64, 64, -64, 64, -64, 64, -64, -64, 64, 64, -64, -64, -64, -64, -64, -64, 64, -64, -64, -64, 64, -64, 64, 64, -64, -64, -64, -64, -64, -64, -64, 64, 64, -64, -64, -64, -64, 64, 64, 64, 64, 64, -64, 64, 64, -64, -64, -64, -64, -64, -64, 64, -64, -64, -64, 64, -64, -64, -64, 64, 64, 64, -64, 64, 64, 64, 64, -64, 64, 64, 64, -64, -64, -64, 64, 64, -64, -64, -64, 64, 64, -64, -64, -64, 64, -64, -64, 64, 64, 64, -64, 64, -64, 64, 64, -64, 64, 64, 64, -64, -64, 64, 64, -64, -64, -64, -64, 64, 64, -64, -64, 64, -64, 64, 64, 64, -64, 64, 64, 64, 64, 64, 64, -64, -64, 64, 64, 64, 64, -64, 64, 64, 64, -64, -64, -64, 64, -64, -64, -64, -64, 64, -64, 64, 64, 64, 64, 64, -64, 64, -64, -64, 64, 64, -64, -64, 64, -64, 64, -64, -64, -64, 64, 64, 64, -64, -64, -64, -64, -64, -64, -64, -64, -64, -64, 64, -64, -64, -64, -64, -64, -64, -64, -64, -64, -64, 64, 64, -64, -64, -64, 64, -64, 64, -64, 64, 64, 64, 64, 64, 64, -64, -64, 64, -64, 64, -64, -64, -64, -64, -64, -64, 64, -64, -64, 64, -64, -64, -64, -64, -64, -64, -64, -64, 64, -64, 64, 64, -64, 64, 64, -64, 64, 64, 64, -64, -64, 64, 64, 64, -64, -64, -64, -64, 64, 64, 64, 64, -64, 64, -64, -64, -64, -64, 64, 64, 64, -64, 64, 64, 64, -64, 64, 64, -64, 64, -64, -64, 64, -64, -64, -64, -64, 64, 64, 64, 64, -64, -64, -64, 64, 64, 64, 64, 64, -64, -64, 64, -64, -64, 64, 64, -64, -64, 64, -64, -64, -64, 64, -64, 64, -64, -64, 64, 64, 64, -64, 64, 64, 64, 64, -64, 64, 64, -64, 64, 64, 64, -64, 64, -64, -64, -64, 64, -64, -64, 64, -64, -64, 64, -64, 64, 64, -64, -64, -64, 64, 64, 64, 64, 64, 64, 64, 64, -64, -64, -64, -64, -64, 64, 64, 64, -64, 64, -64, -64, -64, 64, 64, 64, -64, -64, 64, -64, 64, 64, -64, -64, 64, -64, 64, 64, -64, -64, -64, 64, 64, -64, 64, 64, 64, 64, -64, 64, 64, 64, -64, 64, -64, 64, -64, -64, -64, 64, -64, 64, 64, -64, -64, 64, -64, -64, 64, -64, -64, -64, 64, 64, 64, 64, 64, 64, 64, -64, -64, -64, -64, -64, -64, -64, -64, 64, 64, 64, 64, -64, -64, -64, -64, -64, -64, -64, -64, 64, 64, 64, -64, 64, -64, -64, 64, 64, -64, -64, -64, -64, -64, -64, -64, 64, 64, -64, 64, 64, 64, -64, -64, -64, 64, -64, 64, 64, 64, 64, -64, -64, -64, -64, -64, 64, -64, -64, -64, -64, -64, -64, -64, 64, 64, 64, -64, 64, -64, 64, -64, -64, -64, 64, 64, 64, 64, 64, -64, -64, -64, -64, -64, -64, -64, -64, -64, -64, -64, -64, -64, -64, -64, 64, -64, 64, 64, 64, -64, -64, 64, 64, 64, 64, 64, -64, -64, -64, 64, -64, -64, -64, -64, -64, -64, 64, -64, -64, -64, -64, -64, 64, -64, -64, -64, 64, 64, 64, 64, 64, 64, -64, 64, -64, 64, -64, -64, -64, 64, -64, 64, -64, 64, -64, -64, -64, -64, -64, -64, -64, -64, -64, 64, 64, -64, 64, 64, -64, -64, -64, -64, -64, -64, -64, 64, 64, 64, 64, 64, -64, 64, -64, -64, -64, -64, -64, -64, -64, -64, 64, -64, -64, -64, 64, 64, 64, -64, -64, 64, 64, 64, 64, 64, 64, 64, 64, 64, -64, 64, 64, -64, -64, -64, -64, -64, -64, -64, 64, 64, -64, 64, 64, 64, 64, -64, 64, 64, -64, -64, 64, 64, 64, -64, -64, 64, 64, 64, 64, 64, -64, -64, -64, -64, -64, -64, 64, -64, -64, -64, 64, 64, -64, -64, 64, 64, -64, 64, -64, -64, -64, -64, -64, -64, 64, 64, 64, -64, 64, -64, -64, -64, -64, 64, 64, -64, 64, -64, -64, -64, -64, -64, -64, 64, -64, -64, -64, -64, -64, -64, -64, -64, -64, -64, 64, 64, 64, -64, 64, -64, 64, 64, 64, 64, 64, -64, 64, 64, 64, -64, -64, -64, -64, -64, -64, -64, -64, -64, -64, -64, -64, -64, 64, 64, 64, -64, -64, -64, -64, -64, -64, 64, -64, -64, 64, 64, -64, -64, 64, -64, -64, 64, -64, 64, -64, -64, -64, -64, -64, 64, 64, 64, 64, -64, -64, -64, 64, 64, -64, -64, 64, -64, 64, 64, -64, -64, 64, 64, 64, -64, -64, -64, -64, -64, -64, -64, -64, -64, 64, -64, -64, -64, 64, -64, 64, 64, -64, 64, 64, -64, 64, 64, 64, 64, -64, -64, -64, -64, -64, -64, -64, -64, -64, -64, -64, -64, 64, 64, 64, 64, -64, -64, -64, -64, 64, 64, 64, 64, 64, 64, 64, 64, 64, 64, 64, 64, -64, -64, -64, -64, -64, -64, -64, -64, 64, 64, 64, 64, -64, 64, 64, -64, -64, 64, 64, -64, -64, -64, 64, 64, 64, -64, 64, 64, -64, -64, -64, -64, -64, -64, -64, -64, -64, 64, 64, 64, -64, -64, 64, -64, -64, 64, 64, 64, -64, -64, -64, 64, 64, -64, -64, -64, -64, -64, -64, -64, -64, 64, -64, 64, 64, 64, 64, 64, -64, -64, -64, 64, 64, -64, 64, -64, -64, -64, -64, -64, -64, -64, -64, -64, -64, -64, -64, -64, -64, 64, 64, 64, 64, 64, 64, -64, 64, 64, 64, -64, -64, 64, -64, 64, 64, 64, -64, -64, -64, 64, 64, -64, -64, -64, 64, -64, 64, -64, 64, -64, 64, 64, 64, -64, -64, 64, -64, 64, -64, -64, -64, 64, -64, 64, 64, 64, -64, -64, 64, 64, -64, -64, 64, 64, -64, -64, -64, -64, 64, -64, 64, -64, -64, 64, 64, -64, -64, -64, -64, 64, 64, 64, 64, -64, -64, 64, -64, 64, 64, -64, -64, -64, 64, 64, -64, 64, -64, -64, -64, 64, 64, -64, 64, -64, -64, -64, -64, -64, 64, 64, 64, -64, 64, 64, 64, 64, 64, 64, -64, -64, -64, 64, -64, 64, -64, 64, 64, -64, 64, -64, -64, -64, -64, -64, 64, -64, -64, -64, -64, -64, 64, -64, 64, -64, -64, 64, -64, -64, -64, -64, 64, 64, 64, -64, -64, -64, 64, 64, -64, 64, -64, -64, -64, 64, -64, -64, 64, 64, 64, 64, -64, 64, -64, -64, 64, -64, -64, 64, 64, -64, 64, -64, -64, -64, -64, 64, 64, 64, -64, 64, -64, -64, 64, 64, -64, 64, 64, 64, 64, 64, -64, -64, -64, -64, -64, 64, -64, -64, -64, -64, -64, 64, 64, 64, -64, 64, -64, -64, 64, 64, 64, -64, -64, 64, 64, 64, 64, 64, -64, 64, 64, -64, -64, 64, 64, 64, 64, 64, -64, 64, -64, -64, 64, 64, -64, 64, 64, 64, 64, 64, 64, 64, 64, 64, 64, 64, 64, 64, 64, 64, -64, -64, -64, 64, -64, -64, 64, -64, 64, -64, -64, -64, -64, -64, -64, 64, -64, 64, 64, 64, 64, 64, 64, 64, 64, 64, 64, 64, 64, 64, -64, -64, 64, 64, 64, 64, 64, -64, -64, -64, -64, 64, -64, 64, 64, 64, 64, 64, 64, 64, -64, 64, 64, 64, -64, 64, 64, 64, -64, -64, -64, 64, 64, 64, -64, 64, 64, -64, -64, 64, 64, -64, 64, 64, 64, 64, 64, 64, 64, 64, 64, 64, 64, -64, -64, 64, 64, 64, 64, 64, 64, 64, 64, 64, 64, -64, 64, 64, -64, 64, 64, 64, 64, 64, 64, -64, 64, 64, 64, 64, 64, -64, 64, 64, 64, 64, 64, 64, 64, 64, 64, 64, 64, 64, 64, -64, -64, -64, 64, 64, 64, 64, 64, 64, 64, 64, 64, 64, 64, -64, 64, 64, 64, -64, -64, 64, 64, 64, 64, 64, 64, -64, -64, -64, -64, 64, 64, 64, 64, 64, -64, 64, 64, -64, -64, -64, 64, -64, -64, 64, -64, -64, -64, 64, 64, 64, 64, 64, 64, 64, 64, 64, 64, 64, 64, 64, 64, 64, -64, -64, -64, -64, -64, -64, -64, -64, 64, 64, -64, -64, 64, -64, 64, -64, 64, 64, 64, 64, 64, 64, -64, 64, 64, -64, 64, 64, 64, -64, -64, 64, -64, 64, 64, -64, -64, -64, -64, 64, 64, -64, -64, 64, 64, -64, -64, 64, -64, 64, 64, -64, 64, 64, 64, 64, -64, -64, -64, 64, 64, 64, 64, 64, -64, 64, -64, 64, -64, -64, 64, -64, 64, -64, 64, -64, -64, 64, 64, 64, -64, -64, -64, 64, 64, -64, 64, 64, 64, 64, 64, 64, 64, 64, 64, 64, 64, 64, 64, 64, 64, 64, -64, 64, -64, 64, 64, -64, -64, -64, 64, 64, -64, 64, 64, 64, 64, 64, 64, -64, 64, 64, 64, 64, 64, -64, 64, 64, 64, -64, -64, 64, 64, 64, 64, -64, 64, 64, 64, -64, 64, 64, 64, 64, 64, 64, 64, 64, 64, 64, 64, 64, 64, -64, -64, -64, 64, 64, -64, -64, 64, 64, 64, 64, 64, 64, 64, 64, 64, 64, 64, 64, 64, 64, -64, -64, 64, 64, 64, 64, -64, 64, 64, 64, -64, 64, -64, -64, -64, -64, -64, -64, 64, 64, 64, 64, 64, 64, 64, 64, -64, -64, 64, -64, 64, 64, 64, 64, 64, 64, 64, 64, 64, 64, -64, 64, -64, 64, 64, -64, 64, 64, 64, 64, 64, 64, 64, 64, 64, 64, 64, 64, 64, 64, 64, 64, 64, 64, 64, 64, 64, 64, 64, -64, 64, -64, 64, -64, 64, 64, 64, 64, 64, 64, 64, -64, -64, 64, 64, 64, 64, 64, 64, 64, 64, 64, 64, 64, 64, -64, -64, 64, -64, -64, 64, 64, 64, 64, 64, 64, 64, 64, 64, -64, 64, 64, 64, 64, 64, 64, -64, 64, 64, 64, 64, 64, 64, -64, -64, -64, -64, -64, 64, -64, 64, 64, 64, 64, 64, -64, -64, 64, -64, 64, 64, -64, -64, 64, 64, -64, 64, 64, 64, 64, 64, 64, 64, 64, 64, 64, -64, -64, -64, -64, -64, -64, -64, -64, -64, -64, 64, -64, -64, 64, 64, -64, -64, -64, 64, 64, 64, 64, -64, 64, 64, -64, -64, 64, -64, -64, -64, -64, -64, -64, -64, -64, -64, -64, -64, -64, -64, 64, 64, 64, -64, -64, -64, -64, 64, 64, 64, -64, -64, 64, -64, -64, 64, 64, -64, -64, -64, -64, -64, -64, -64, -64, -64, -64, -64, -64, -64, -64, 64, 64, -64, 64, -64, 64, 64, 64, -64, 64, 64, -64, 64, 64, 64, 64, -64, -64, -64, -64, -64, -64, -64, 64, -64, -64, -64, -64, 64, -64, -64, 64, 64, 64, 64, 64, 64, -64, -64, 64, -64, 64, 64, -64, 64, 64, 64, 64, -64, -64, -64, -64, -64, -64, -64, 64, 64, -64, -64, 64, -64, 64, -64, -64, -64, -64, 64, -64, -64, -64, -64, -64, 64, 64, -64, -64, -64, 64, 64, -64, 64, -64, -64, 64, 64, -64, -64, 64, -64, 64, 64, -64, -64, -64, -64, 64, -64, 64, 64, 64, 64, 64, 64, -64, 64, 64, -64, 64, 64, -64, 64, -64, 64, 64, 64, 64, -64, 64, 64, 64, -64, 64, 64, -64, 64, -64, -64, -64, 64, 64, 64, 64, 64, 64, 64, 64, -64, -64, 64, -64, 64, -64, 64, -64, 64, -64, 64, 64, -64, 64, 64, -64, -64, 64, -64, -64, 64, 64, -64, -64, 64, 64, 64, 64, 64, -64, 64, 64, 64, 64, -64, -64, -64, 64, 64, 64, 64, 64, 64, -64, -64, -64, -64, 64, 64, 64, -64, -64, -64, 64, 64, -64, 64, 64, 64, 64, -64, -64, -64, 64, 64, 64, 64, 64, -64, -64, 64, -64, -64, 64, 64, 64, -64, 64, 64, 64, -64, 64, 64, -64, 64, 64, 64, 64, 64, 64, 64, -64, 64, 64, 64, 64, 64, -64, 64, -64, 64, 64, 64, -64, 64, -64, -64, -64, 64, 64, 64, 64, 64, 64, 64, 64, -64, 64, -64, -64, 64, 64, 64, 64, 64, -64, 64, 64, 64, 64, 64, 64, 64, -64, -64, -64, -64, 64, 64, 64, 64, 64, 64, 64, 64, 64, -64, -64, -64, -64, -64, 64, 64, -64, 64, -64, 64, -64, -64, 64, 64, 64, -64, -64, 64, 64, 64, 64, 64, 64, 64, -64, -64, -64, 64, -64, 64, -64, -64, 64, -64, -64, -64, 64, 64, -64, -64, -64, -64, -64, -64, -64, -64, 64, 64, 64, 64, 64, -64, -64, -64, -64, 64, -64, 64, 64, 64, -64, -64, -64, -64, -64, -64, 64, -64, -64, -64, -64, -64, -64, -64, -64, 64, -64, 64, -64, -64, -64, -64, -64, 64, 64, 64, -64, -64, -64, -64, 64, 64, -64, 64, 64, -64, -64, -64, -64, -64, 64, 64, 64, 64, 64, 64, -64, 64, -64, -64, -64, 64, 64, -64, -64, -64, -64, 64, 64, 64, -64, -64, -64, -64, -64, -64, -64, 64, 64, 64, 64, 64, 64, 64, 64, -64, 64, 64, -64, 64, 64, 64, -64, -64, -64, 64, 64, 64, -64, -64, -64, -64, -64, -64, -64, -64, 64, 64, -64, -64, 64, 64, -64, 64, -64, 64, 64, 64, 64, 64, 64, -64, -64, -64, -64, 64, -64, 64, -64, 64, -64, 64, -64, 64, -64, -64, -64, 64, 64, -64, 64, 64, -64, 64, 64, -64, -64, 64, 64, 64, 64, -64, 64, -64, -64, 64, -64, 64, 64, 64, -64, 64, 64, 64, 64, -64, 64, 64, 64, -64, 64, 64, 64, -64, 64, -64, 64, 64, 64, 64, -64, 64, 64, -64, -64, -64, -64, -64, 64, -64, 64, 64, 64, 64, 64, 64, 64, 64, 64, 64, 64, -64, -64, -64, -64, -64, 64, -64, -64, -64, 64, -64, -64, 64, -64, -64, 64, 64, -64, 64, -64, -64, 64, 64, 64, 64, -64, -64, -64, -64, -64, -64, 64, 64, -64, -64, 64, 64, 64, -64, 64, -64, -64, -64, -64, -64, -64, -64, -64, -64, -64, 64, 64, 64, 64, 64, 64, -64, -64, -64, 64, 64, 64, -64, -64, 64, -64, -64, 64, 64, 64, 64, -64, -64, -64, -64, -64, -64, -64, 64, 64, 64, 64, 64, 64, -64, -64, -64, 64, -64, 64, -64, -64, -64, 64, -64, 64, 64, 64, -64, -64, 64, -64, 64, 64, -64, 64, 64, 64, 64, 64, 64, 64, 64, -64, -64, -64, 64, 64, -64, -64, -64, 64, -64, 64, 64, 64, 64, -64, 64, -64, -64, 64, -64, 64, 64, 64, 64, 64, 64, 64, -64, -64, -64, -64, 64, 64, -64, 64, 64, 64, -64, 64, 64, 64, 64, 64, -64, 64, -64, -64, 64, 64, 64, 64, 64, 64, 64, -64, -64, -64, -64, -64, -64, -64, -64, -64, -64, 64, 64, 64, 64, 64, 64, 64, 64, -64, 64, 64, 64, 64, 64, 64, 64, 64, 64, 64, -64, -64, -64, -64, -64, -64, -64, 64, -64, 64, -64, 64, 64, 64, 64, 64, 64, -64, 64, 64, 64, 64, 64, 64, 64, 64, -64, 64, 64, -64, -64, -64, -64, 64, -64, 64, -64, 64, -64, -64, -64, 64, 64, 64, -64, 64, -64, 64, -64, -64, -64, -64, -64, -64, -64, -64, -64, -64, -64, -64, 64, -64, -64, -64, -64, 64, -64, 64, -64, 64, 64, -64, -64, 64, 64, -64, -64, 64, 64, -64, 64, 64, 64, 64, 64, -64, -64, -64, 64, 64, 64, 64, -64, -64, -64, 64, 64, -64, 64, 64, 64, 64, -64, -64, -64, -64, 64, -64, -64, -64, -64, 64, -64, -64, -64, -64, 64, 64, -64, 64, 64, -64, -64, 64, -64, 64, -64, -64, -64, -64, -64, -64, -64, -64, 64, -64, 64, 64, -64, -64, 64, -64, 64, 64, -64, -64, 64, 64, -64, 64, 64, -64, 64, 64, 64, 64, 64, 64, 64, 64, -64, 64, 64, 64, 64, -64, -64, 64, -64, 64, 64, -64, -64, 64, -64, -64, -64, -64, 64, 64, -64, -64, -64, 64, 64, 64, 64, 64, 64, 64, 64, -64, 64, 64, 64, 64, 64, 64, 64, 64, 64, 64, -64, 64, 64, 64, -64, 64, 64, 64, -64, 64, -64, -64, 64, 64, 64, 64, 64, -64, 64, -64, -64, 64, 64, 64, 64, 64, 64, 64, -64, 64, -64, 64, -64, 64, 64, 64, 64, -64, -64, 64, -64, -64, -64, 64, -64, -64, 64, -64, 64, -64, -64, 64, 64, 64, 64, -64, -64, 64, 64, -64, -64, -64, 64, 64, 64, 64, 64, -64, -64, 64, -64, -64, -64, -64, -64, -64, -64, 64, -64, -64, -64, -64, 64, 64, 64, 64, -64, 64, -64, 64, -64, 64, 64, 64, 64, 64, -64, 64, 64, -64, -64, -64, -64, -64, 64, -64, -64, -64, -64, 64, 64, 64, 64, 64, -64, -64, -64, 64, -64, 64, 64, -64, 64, 64, 64, 64, 64, -64, -64, -64, 64, 64, -64, 64, -64, 64, 64, 64, 64, 64, 64, 64, -64, 64, 64, 64, -64, 64, 64, 64, 64, -64, -64, 64, 64, -64, -64, -64, 64, -64, 64, 64, -64, 64, 64, 64, 64, 64, 64, 64, -64, -64, 64, -64, -64, -64, -64, -64, 64, -64, 64, 64, -64, -64, -64, -64, -64, -64, -64, -64, -64, -64, -64, -64, 64, -64, 64, -64, 64, -64, 64, -64, -64, -64, 64, 64, 64, 64, 64, 64, -64, -64, -64, -64, -64, -64, -64, -64, -64, -64, -64, -64, -64, -64, -64, 64, 64, -64, 64, 64, -64, 64, 64, 64, 64, 64, 64, -64, -64, -64, -64, -64, -64, -64, 64, -64, -64, -64, -64, -64, -64, -64, -64, -64, -64, -64, 64, 64, 64, 64, 64, 64, 64, 64, 64, -64, -64, -64, -64, -64, -64, -64, 64, -64, -64, -64, -64, 64, 64, -64, 64, -64, 64, -64, 64, 64, 64, 64, 64, 64, 64, 64, 64, 64, -64, -64, -64, -64, -64, 64, -64, -64, -64, 64, -64, -64, -64, -64, 64, -64, 64, 64, -64, -64, 64, 64, 64, 64, 64, 64, -64, -64, -64, -64, -64, -64, 64, -64, -64, -64, 64, 64, 64, -64, -64, -64, -64, -64, 64, 64, -64, -64, 64, 64, 64, 64, 64, 64, -64, -64, -64, -64, -64, -64, 64, 64, 64, -64, 64, 64, 64, 64, -64, -64, 64, 64, -64, 64, -64, -64, -64, 64, -64, 64, 64, 64, 64, -64, -64, -64, -64, -64, -64, 64, 64, -64, 64, 64, 64, 64, -64, 64, 64, -64, 64, 64, -64, -64, -64, -64, -64, -64, 64, 64, 64, 64, -64, -64, -64, 64, 64, 64, 64, 64, 64, 64, -64, -64, -64, -64, -64, -64, 64, 64, -64, -64, -64, -64, -64, 64, -64, 64, 64, -64, -64, -64, -64, -64, 64, 64, 64, 64, 64, 64, -64, -64, -64, -64, -64, -64, -64, 64, -64, 64, -64, -64, -64, -64, -64, -64, 64, -64, -64, -64, -64, 64, 64, 64, 64, 64, -64, 64, -64, -64, -64, 64, -64, 64, 64, -64, 64, 64, 64, 64, 64, -64, -64, 64, -64, -64, -64, -64, -64, 64, 64, 64, -64, 64, 64, 64, -64, 64, 64, 64, -64, -64, 64, 64, 64, -64, -64, -64, 64, -64, -64, 64, -64, -64, -64, -64, 64, 64, 64, 64, 64, -64, -64, -64, -64, -64, 64, 64, -64, 64, -64, 64, -64, -64, -64, -64, -64, -64, -64, -64, -64, -64, -64, -64, 64, 64, 64, 64, -64, 64, -64, 64, 64, 64, 64, -64, -64, -64, -64, 64, -64, -64, -64, -64, -64, -64, -64, -64, -64, -64, -64, -64, 64, 64, 64, -64, -64, 64, 64, 64, 64, 64, 64, 64, 64, 64, 64, 64, -64, 64, 64, -64, -64, -64, -64, -64, -64, -64, 64, -64, 64, -64, 64, 64, -64, -64, 64, 64, -64, 64, -64, 64, 64, -64, -64, 64, -64, 64, -64, 64, -64, -64, -64, -64, -64, -64, 64, -64, -64, -64, -64, 64, 64, 64, 64, 64, 64, -64, 64, 64, 64, -64, 64, -64, -64, 64, 64, -64, 64, 64, -64, 64, -64, -64, -64, -64, -64, 64, -64, 64, 64, 64, -64, -64, 64, -64, -64, -64, -64, -64, -64, -64, -64, -64, -64, -64, -64, 64, -64, 64, 64, 64, 64, 64, 64, 64, 64, -64, 64, 64, 64, 64, 64, -64, -64, -64, 64, -64, -64, -64, 64, -64, -64, -64, 64, -64, 64, 64, 64, -64, -64, 64, -64, 64, -64, -64, -64, 64, -64, 64, -64, 64, 64, 64, 64, -64, 64, 64, -64, 64, 64, -64, 64, -64, 64, 64, 64, -64, 64, -64, 64, 64, 64, -64, -64, 64, 64, 64, -64, -64, -64, -64, 64, -64, -64, 64, 64, 64, -64, 64, -64, -64, -64, -64, 64, -64, -64, -64, 64, 64, 64, -64, 64, -64, -64, -64, 64, 64, 64, 64, -64, -64, 64, 64, 64, -64, 64, 64, -64, -64, 64, -64, -64, 64, -64, 64, 64, 64, 64, -64, -64, -64, 64, 64, 64, -64, -64, 64, -64, -64, -64, 64, -64, 64, 64, 64, -64, 64, 64, -64, 64, 64, 64, 64, 64, -64, -64, -64, -64, -64, -64, 64, -64, -64, -64, -64, 64, -64, -64, -64, 64, 64, 64, 64, -64, -64, 64, 64, -64, 64, 64, 64, 64, 64, 64, -64, -64, -64, -64, 64, 64, 64, 64, 64, -64, 64, 64, 64, 64, -64, 64, -64, 64, 64, 64, 64, 64, 64, 64, 64, 64, -64, -64, -64, -64, -64, 64, -64, 64, 64, 64, 64, 64, -64, 64, -64, -64, 64, 64, 64, 64, 64, 64, 64, -64, -64, 64, 64, -64, 64, -64, 64, -64, 64, -64, 64, 64, 64, 64, 64, 64, 64, 64, -64, -64, -64, 64, 64, 64, -64, 64, 64, -64, 64, 64, 64, 64, -64, -64, 64, 64, -64, -64, -64, -64, -64, 64, 64, -64, 64, 64, 64, 64, 64, 64, -64, 64, 64, -64, 64, 64, 64, 64, 64, 64, 64, -64, -64, -64, -64, -64, 64, 64, 64, 64, -64, 64, 64, -64, 64, -64, -64, 64, -64, 64, 64, -64, -64, 64, 64, 64, 64, 64, 64, -64, -64, 64, 64, 64, -64, -64, 64, 64, -64, 64, -64, -64, -64, 64, -64, -64, 64, -64, -64, -64, 64, 64, 64, -64, 64, -64, -64, 64, -64, -64, -64, 64, 64, -64, 64, 64, 64, 64, -64, 64, -64, -64, 64, -64, 64, -64, -64, -64, 64, 64, 64, 64, 64, 64, 64, -64, 64, 64, -64, -64, -64, 64, 64, -64, -64, 64, -64, 64, -64, 64, -64, -64, 64, 64, 64, 64, 64, 64, 64, 64, 64, 64, 64, 64, 64, 64, -64, -64, 64, 64, -64, -64, -64, -64, 64, 64, -64, 64, -64, 64, 64, 64, 64, 64, 64, 64, 64, 64, 64, 64, 64, 64, 64, 64, -64, 64, -64, -64, -64, -64, 64, -64, -64, 64, 64, 64, 64, 64, 64, 64, -64, -64, -64, -64, -64, -64, 64, 64, -64, 64, 64, 64, 64, 64, 64, -64, 64, 64, -64, -64, 64, 64, 64, 64, 64, 64, 64, 64, -64, -64, -64, -64, -64, 64, 64, 64, 64, -64, -64, -64, -64, 64, 64, 64, 64, -64, 64, -64, -64, -64, -64, 64, -64, 64, 64, 64, -64, 64, 64, -64, -64, -64, 64, 64, 64, -64, -64, 64, 64, -64, -64, 64, 64, -64, -64, -64, -64, -64, 64, 64, 64, 64, -64, 64, 64, 64, 64, 64, 64, 64, 64, 64, 64, 64, 64, 64, -64, 64, 64, 64, -64, -64, 64, 64, -64, 64, -64, -64, 64, 64, 64, -64, 64, -64, -64, -64, 64, 64, 64, 64, 64, 64, 64, 64, 64, 64, 64, 64, 64, 64, -64, -64, -64, -64, -64, -64, 64, -64, 64, 64, 64, -64, 64, -64, 64, -64, 64, 64, 64, -64, 64, 64, 64, 64, 64, 64, 64, 64, 64, -64, -64, 64, -64, 64, 64, 64, 64, 64, -64, 64, 64, 64, 64, 64, -64, 64, 64, 64, 64, 64, 64, 64, 64, 64, 64, 64, 64, 64, -64, 64, 64, -64, 64, -64, 64, 64, 64, 64, 64, -64, -64, -64, 64, 64, 64, 64, 64, -64, 64, 64, 64, 64, 64, 64, 64, -64, -64, 64, 64, 64, 64, 64, 64, 64, -64, 64, -64, -64, 64, 64, -64, 64, 64, 64, 64, 64, 64, -64, 64, 64, 64, 64, -64, -64, 64, -64, 64, 64, 64, 64, -64, 64, -64, 64, 64, 64, 64, 64, 64, -64, 64, 64, -64, -64, -64, -64, 64, 64, -64, 64, 64, 64, 64, -64, -64, -64, -64, -64, -64, -64, 64, -64, -64, -64, -64, -64, 64, 64, -64, 64, 64, -64, -64, -64, -64, -64, 64, -64, 64, -64, -64, -64, 64, 64, 64, -64, 64, -64, 64, -64, 64, 64, -64, 64, -64, -64, 64, 64, -64, -64, 64, -64, -64, 64, 64, -64, 64, -64, -64, -64, -64, -64, 64, -64, -64, 64, 64, 64, 64, -64, -64, 64, 64, -64, 64, -64, 64, -64, 64, -64, 64, -64, 64, 64, -64, 64, 64, 64, -64, 64, -64, -64, 64, 64, -64, 64, 64, 64, -64, -64, -64, 64, -64, 64, 64, -64, 64, 64, 64, 64, -64, -64, 64, 64, -64, 64, 64, -64, 64, 64, -64, -64, -64, -64, 64, -64, -64, -64, -64, 64, -64, -64, -64, 64, -64, 64, -64, 64, -64, 64, -64, 64, 64, 64, -64, 64, -64, -64, 64, 64, 64, 64, -64, -64, 64, -64, 64, 64, 64, -64, 64, -64, 64, -64, 64, 64, -64, -64, -64, 64, 64, -64, 64, -64, -64, -64, 64, 64, 64, 64, -64, 64, 64, -64, 64, -64, 64, 64, -64, -64, 64, 64, -64, 64, 64, -64, 64, 64, -64, -64, -64, -64, 64, 64, 64, -64, -64, 64, -64, -64, -64, -64, 64, -64, -64, -64, -64, -64, -64, -64, -64, -64, -64, 64, -64, 64, -64, -64, 64, 64, 64, -64, 64, -64, -64, 64, -64, 64, 64, -64, 64, 64, -64, -64, 64, 64, -64, -64, 64, 64, 64, -64, 64, -64, 64, -64, 64, -64, -64, -64, 64, -64, -64, -64, 64, -64, -64, -64, -64, 64, 64, -64, -64, 64, 64, 64, -64, -64, -64, 64, 64, 64, 64, -64, 64, -64, -64, 64, 64, 64, -64, -64, -64, 64, -64, -64, -64, 64, -64, -64, -64, -64, 64, -64, -64, -64, 64, 64, -64, 64, -64, -64, -64, 64, -64, 64, -64, -64, -64, 64, 64, 64, -64, -64, -64, 64, -64, 64, -64, -64, 64, -64, -64, -64, -64, -64, -64, -64, -64, 64, -64, 64, -64, -64, 64, 64, 64, -64, 64, -64, 64, -64, 64, -64, 64, -64, 64, -64, -64, -64, 64, -64, 64, 64, 64, 64, -64, 64, 64, -64, 64, -64, 64, -64, 64, -64, -64, -64, -64, -64, -64, -64, -64, -64, -64, -64, 64, -64, 64, -64, 64, -64, 64, 64, -64, -64, -64, -64, -64, -64, -64, -64, -64, 64, -64, -64, -64, -64, -64, 64, -64, 64, 64, -64, 64, 64, 64, -64, 64, -64, -64, -64, -64, 64, 64, -64, 64, 64, -64, 64, -64, 64, 64, 64, 64, 64, -64, -64, 64, -64, 64, -64, 64, 64, -64, 64, 64, 64, -64, -64, -64, 64, 64, 64, -64, 64, -64, -64, 64, -64, 64, -64, -64, -64, 64, 64, 64, -64, -64, 64, -64, -64, -64, -64, -64, -64, -64, 64, -64, 64, 64, -64, 64, -64, 64, -64, 64, 64, -64, -64, -64, 64, -64, -64, -64, -64, -64, 64, -64, -64, -64, 64, -64, -64, -64, 64, -64, -64, 64, 64, 64, -64, -64, -64, 64, -64, -64, 64, 64, 64, -64, -64, 64, 64, -64, -64, 64, -64, -64, 64, -64, -64, -64, 64, 64, 64, -64, 64, 64, -64, -64, -64, 64, -64, -64, 64, -64, 64, -64, -64, -64, -64, -64, -64, -64, -64, -64, 64, -64, 64, 64, 64, -64, 64, -64, -64, -64, 64, -64, -64, 64, -64, -64, -64, -64, -64, -64, 64, -64, 64, -64, -64, 64, -64, -64, -64, -64, -64, -64, 64, -64, -64, 64, -64, 64, 64, -64, -64, -64, -64, -64, -64, -64, 64, -64, -64, 64, 64, -64, -64, -64, 64, 64, -64, -64, -64, -64, 64, -64, 64, 64, 64, 64, 64, 64, -64, -64, -64, -64, -64, 64, -64, -64, -64, 64, -64, -64, -64, -64, -64, 64, -64, 64, -64, 64, -64, 64, 64, -64, 64, -64, 64, 64, -64, -64, 64, 64, -64, -64, -64, -64, -64, -64, 64, -64, -64, -64, 64, 64, -64, -64, 64, -64, 64, -64, -64, -64, 64, 64, 64, 64, -64, -64, -64, 64, 64, -64, -64, 64, -64, -64, 64, -64, -64, 64, 64, 64, -64, 64, -64, 64, 64, -64, -64, 64, -64, 64, -64, -64, 64, 64, -64, -64, -64, 64, -64, -64, -64, -64, -64, 64, -64, -64, -64, 64, -64, 64, -64, 64, 64, -64, 64, -64, 64, 64, -64, -64, -64, 64, -64, -64, -64, -64, 64, -64, -64, 64, 64, -64, 64, -64, 64, 64, 64, 64, 64, -64, -64, 64, -64, 64, 64, -64, -64, -64, -64, 64, 64, -64, -64, -64, 64, -64, -64, 64, -64, -64, -64, -64, 64, -64, -64, -64, -64, 64, 64, 64, -64, -64, -64, -64, 64, -64, 64, -64, -64, -64, -64, 64, -64, 64, -64, -64, 64, 64, 64, 64, 64, -64, -64, -64, 64, 64, -64, 64, 64, 64, 64, -64, -64, -64, 64, 64, -64, -64, 64, -64, 64, -64, -64, 64, -64, 64, 64, 64, 64, -64, 64, 64, 64, 64, -64, 64, -64, 64, -64, -64, -64, -64, 64, 64, 64, -64, -64, 64, -64, 64, -64, 64, -64, -64, -64, -64, 64, 64, 64, -64, -64, 64, -64, 64, -64, 64, 64, -64, 64, -64, 64, 64, -64, -64, -64, -64, -64, -64, 64, -64, 64, -64, -64, -64, -64, 64, -64, 64, 64, 64, -64, 64, 64, -64, -64, 64, 64, 64, 64, -64, -64, 64, -64, -64, -64, -64, 64, 64, -64, 64, -64, 64, 64, -64, -64, -64, 64, -64, -64, 64, 64, 64, -64, -64, -64, -64, -64, -64, -64, -64, 64, 64, 64, 64, 64, 64, -64, -64, -64, -64, -64, -64, -64, -64, -64, 64, 64, 64, 64, 64, 64, -64, -64, -64, 64, 64, 64, 64, 64, 64, 64, 64, 64, 64, -64, -64, -64, -64, -64, -64, -64, -64, 64, 64, 64, 64, -64, 64, -64, 64, 64, -64, -64, 64, 64, 64, 64, 64, 64, 64, 64, 64, -64, -64, 64, 64, 64, -64, 64, 64, 64, 64, 64, -64, -64, -64, 64, -64, 64, 64, 64, 64, 64, 64, 64, 64, 64, 64, 64, 64, 64, 64, -64, -64, 64, -64, 64, -64, 64, 64, -64, -64, -64, -64, 64, -64, 64, -64, -64, 64, 64, 64, 64, 64, 64, 64, 64, 64, 64, 64, 64, 64, 64, -64, -64, -64, 64, -64, -64, -64, 64, 64, 64, -64, 64, 64, 64, 64, 64, 64, 64, 64, 64, 64, 64, -64, 64, -64, -64, 64, 64, 64, -64, -64, -64, -64, 64, -64, -64, -64, -64, -64, 64, 64, 64, 64, 64, 64, 64, 64, 64, 64, 64, 64, -64, -64, 64, 64, 64, 64, -64, -64, -64, 64, 64, 64, 64, 64, 64, 64, 64, 64, 64, 64, 64, 64, -64, -64, 64, -64, 64, 64, -64, 64, 64, 64, 64, 64, -64, -64, -64, -64, -64, -64, -64, 64, -64, -64, 64, 64, 64, 64, 64, -64, 64, 64, 64, -64, -64, -64, 64, 64, 64, 64, 64, -64, -64, -64, -64, -64, -64, -64, 64, 64, 64, -64, 64, 64, -64, 64, -64, -64, 64, 64, 64, -64, -64, 64, -64, 64, 64, 64, 64, 64, -64, -64, -64, -64, -64, 64, -64, -64, -64, 64, -64, -64, 64, -64, 64, -64, -64, -64, 64, 64, -64, 64, 64, 64, 64, 64, 64, 64, 64, -64, -64, -64, 64, -64, -64, 64, -64, 64, 64, 64, -64, 64, 64, 64, -64, 64, 64, -64, 64, 64, 64, 64, -64, 64, 64, 64, 64, 64, 64, -64, 64, 64, 64, 64, -64, 64, 64, 64, -64, 64, 64, -64, 64, 64, 64, 64, 64, 64, 64, 64, -64, -64, 64, -64, 64, 64, 64, 64, 64, -64, -64, 64, 64, 64, 64, 64, -64, 64, -64, -64, 64, 64, 64, 64, 64, 64, 64, 64, -64, -64, -64, 64, 64, 64, 64, 64, -64, 64, 64, 64, -64, 64, 64, 64, -64, 64, 64, 64, -64, 64, 64, 64, 64, 64, 64, 64, -64, -64, 64, 64, 64, 64, -64, 64, -64, -64, 64, -64, 64, 64, -64, 64, -64, -64, 64, -64, 64, 64, 64, 64, 64, 64, -64, -64, 64, 64, 64, 64, 64, 64, 64, 64, -64, -64, 64, 64, -64, 64, -64, -64, -64, 64, -64, -64, -64, 64, 64, 64, -64, -64, -64, 64, 64, 64, 64, 64, -64, 64, 64, -64, -64, -64, 64, 64, -64, -64, 64, -64, -64, -64, -64, -64, -64, -64, -64, -64, -64, -64, -64, 64, 64, 64, 64, 64, 64, -64, 64, 64, -64, 64, -64, -64, -64, 64, 64, 64, -64, -64, -64, -64, -64, -64, -64, -64, 64, 64, 64, 64, 64, 64, 64, 64, 64, 64, 64, 64, 64, 64, 64, -64, -64, 64, 64, -64, -64, 64, 64, 64, -64, -64, -64, -64, -64, 64, 64, 64, 64, 64, 64, 64, 64, -64, -64, -64, 64, 64, 64, -64, 64, 64, 64, 64, 64, -64, 64, 64, 64, 64, 64, 64, 64, 64, 64, 64, 64, 64, 64, 64, 64, 64, -64, 64, -64, -64, 64, -64, 64, 64, 64, 64, 64, -64, -64, -64, 64, 64, 64, 64, 64, 64, 64, 64, 64, 64, 64, 64, 64, 64, -64, -64, 64, -64, 64, 64, 64, 64, 64, 64, 64, 64, -64, -64, 64, 64, 64, 64, -64, 64, 64, 64, 64, 64, 64, 64, -64, -64, -64, -64, 64, 64, -64, 64, 64, -64, 64, 64, -64, -64, 64, 64, -64, -64, -64, -64, -64, -64, -64, 64, 64, 64, -64, 64, -64, 64, -64, 64, 64, -64, -64, -64, 64, -64, 64, 64, 64, 64, -64, -64, -64, -64, -64, -64, 64, 64, 64, 64, -64, 64, -64, -64, -64, 64, -64, 64, -64, -64, -64, -64, 64, 64, 64, -64, 64, 64, -64, -64, -64, -64, -64, 64, 64, 64, 64, 64, 64, 64, 64, 64, -64, 64, -64, -64, 64, 64, 64, 64, -64, -64, -64, 64, -64, -64, 64, 64, -64, -64, 64, -64, 64, -64, 64, -64, -64, 64, 64, 64, -64, -64, 64, 64, -64, -64, 64, 64, 64, 64, -64, 64, -64, -64, -64, -64, -64, 64, -64, -64, -64, -64, -64, 64, 64, 64, 64, 64, 64, 64, 64, 64, 64, -64, 64, -64, 64, 64, 64, -64, -64, -64, 64, 64, -64, -64, -64, -64, -64, -64, -64, -64, -64, -64, -64, -64, -64, 64, 64, -64, -64, -64, -64, 64, -64, -64, -64, -64, -64, -64, -64, -64, 64, -64, -64, -64, -64, -64, -64, -64, -64, -64, -64, 64, 64, -64, -64, -64, -64, 64, -64, -64, 64, -64, -64, 64, -64, -64, -64, 64, -64, -64, -64, -64, -64, -64, -64, -64, -64, -64, 64, 64, -64, 64, -64, -64, -64, -64, 64, -64, 64, -64, 64, 64, -64, -64, -64, -64, -64, -64, -64, -64, -64, -64, -64, -64, -64, -64, 64, 64, 64, 64, 64, -64, -64, -64, -64, 64, -64, -64, -64, 64, -64, 64, 64, 64, -64, -64, -64, -64, -64, -64, -64, -64, -64, -64, -64, 64, 64, -64, 64, -64, -64, 64, 64, 64, 64, 64, -64, 64, 64, 64, 64, 64, 64, 64, -64, -64, -64, -64, -64, 64, -64, 64, -64, 64, 64, 64, 64, 64, -64, 64, -64, 64, 64, 64, 64, 64, 64, 64, -64, 64, -64, -64, -64, 64, 64, 64, 64, 64, 64, 64, 64, 64, -64, 64, 64, -64, -64, -64, -64, 64, 64, 64, 64, 64, 64, 64, 64, -64, -64, 64, -64, -64, -64, -64, -64, -64, -64, 64, -64, 64, 64, -64, -64, 64, 64, -64, 64, -64, 64, -64, 64, 64, 64, 64, 64, 64, -64, 64, -64, -64, 64, 64, -64, -64, -64, -64, 64, -64, -64, -64, -64, 64, -64, -64, 64, 64, 64, 64, 64, 64, 64, 64, -64, 64, -64, 64, -64, -64, -64, -64, -64, -64, -64, -64, -64, -64, 64, -64, -64, -64, -64, -64, -64, -64, 64, 64, 64, 64, 64, 64, 64, 64, -64, -64, -64, -64, 64, -64, 64, -64, -64, -64, -64, 64, -64, -64, -64, -64, -64, 64, 64, -64, 64, 64, 64, -64, 64, 64, 64, -64, -64, -64, -64, 64, 64, -64, -64, 64, -64, 64, -64, -64, -64, -64, -64, 64, -64, -64, 64, -64, 64, -64, 64, 64, 64, -64, 64, 64, 64, -64, 64, 64, -64, -64, -64, 64, 64, 64, -64, -64, -64, -64, -64, -64, -64, 64, 64, 64, 64, -64, -64, -64, -64, 64, -64, -64, -64, -64, -64, -64, -64, -64, -64, 64, 64, 64, -64, -64, -64, -64, -64, -64, -64, 64, -64, -64, 64, 64, -64, -64, -64, -64, -64, -64, -64, -64, -64, -64, -64, -64, -64, 64, 64, -64, 64, -64, -64, 64, -64, 64, 64, 64, -64, 64, -64, 64, -64, -64, -64, -64, -64, -64, -64, -64, -64, 64, 64, -64, -64, -64, 64, 64, -64, -64, 64, -64, -64, -64, 64, 64, -64, -64, -64, 64, -64, -64, -64, -64, -64, -64, -64, -64, -64, 64, -64, -64, -64, 64, -64, -64, -64, 64, -64, -64, -64, -64, -64, -64, 64, 64, -64, -64, 64, -64, -64, -64, -64, -64, -64, -64, -64, -64, -64, -64, -64, -64, -64, -64, 64, -64, -64, -64, -64, -64, -64, -64, 64, -64, 64, -64, 64, 64, 64, -64, -64, -64, -64, -64, -64, -64, -64, -64, 64, -64, -64, -64, -64, 64, -64, -64, -64, 64, 64, -64, 64, 64, 64, -64, -64, 64, 64, -64, -64, -64, -64, -64, -64, -64, -64, -64, -64, -64, -64, -64, -64, -64, 64, 64, 64, 64, 64, -64, 64, 64, 64, -64, 64, -64, 64, 64, 64, -64, -64, -64, -64, -64, -64, 64, -64, -64, -64, -64, -64, -64, 64, 64, -64, 64, 64, -64, 64, 64, -64, -64, -64, 64, 64, 64, 64, -64, -64, -64, -64, -64, 64, -64, 64, 64, -64, -64, 64, 64, 64, -64, -64, 64, 64, -64, -64, 64, 64, -64, 64, -64, 64, 64, 64, 64, 64, 64, 64, 64, 64, -64, 64, 64, -64, -64, 64, -64, -64, -64, -64, -64, -64, -64, -64, -64, 64, 64, 64, -64, -64, -64, -64, -64, -64, 64, 64, 64, -64, -64, 64, 64, 64, 64, 64, 64, 64, -64, -64, -64, -64, 64, 64, 64, -64, -64, -64, -64, 64, -64, -64, 64, 64, 64, -64, -64, -64, -64, 64, 64, 64, 64, 64, 64, -64, 64, 64, 64, -64, -64, 64, -64, 64, -64, -64, 64, -64, 64, 64, -64, 64, -64, 64, -64, 64, -64, 64, 64, -64, 64, -64, -64, 64, 64, -64, -64, -64, 64, 64, 64, -64, -64, 64, -64, -64, 64, -64, -64, -64, -64, 64, -64, -64, -64, 64, -64, -64, -64, 64, 64, 64, -64, -64, -64, -64, -64, -64, -64, -64, -64, -64, 64, 64, -64, 64, -64, 64, -64, -64, 64, -64, 64, 64, -64, -64, 64, 64, 64, -64, -64, 64, 64, -64, 64, 64, -64, -64, -64, 64, 64, 64, 64, 64, -64, -64, 64, 64, 64, 64, 64, -64, 64, 64, 64, -64, -64, -64, -64, 64, -64, 64, 64, -64, -64, -64, -64, -64, 64, -64, -64, -64, -64, 64, -64, -64, -64, 64, 64, 64, 64, 64, -64, 64, 64, -64, 64, 64, -64, -64, -64, 64, -64, -64, -64, -64, 64, 64, 64, -64, 64, -64, -64, 64, -64, 64, 64, 64, -64, 64, -64, -64, 64, -64, 64, 64, 64, 64, 64, 64, -64, 64, 64, 64, 64, 64, 64, 64, -64, 64, -64, 64, 64, 64, 64, -64, -64, -64, -64, 64, -64, 64, -64, 64, -64, 64, 64, -64, 64, -64, -64, 64, -64, -64, -64, -64, 64, 64, 64, 64, 64, 64, 64, 64, -64, -64, -64, 64, 64, -64, -64, 64, 64, 64, -64, -64, 64, 64, -64, 64, 64, 64, -64, 64, -64, -64, -64, 64, 64, 64, 64, 64, 64, -64, -64, 64, 64, 64, 64, -64, 64, -64, -64, -64, -64, 64, -64, 64, 64, -64, -64, -64, -64, 64, 64, 64, 64, 64, 64, 64, -64, 64, -64, -64, -64, 64, 64, 64, 64, 64, 64, -64, -64, -64, 64, 64, 64, -64, -64, 64, -64, -64, 64, 64, 64, 64, 64, -64, -64, -64, -64, -64, -64, -64, -64, -64, 64, 64, -64, -64, -64, -64, -64, -64, -64, -64, -64, 64, -64, 64, 64, 64, 64, -64, 64, 64, -64, -64, -64, -64, -64, -64, 64, 64, 64, 64, 64, 64, -64, -64, -64, 64, 64, -64, 64, -64, -64, 64, 64, 64, -64, -64, 64, 64, 64, 64, -64, -64, -64, 64, 64, -64, -64, -64, 64, 64, -64, -64, -64, -64, -64, -64, 64, -64, -64, 64, 64, 64, 64, 64, 64, 64, 64, 64, -64, -64, -64, -64, -64, -64, 64, -64, -64, 64, 64, -64, -64, -64, -64, -64, -64, -64, 64, 64, 64, 64, 64, 64, 64, 64, 64, -64, -64, 64, -64, -64, -64, 64, -64, -64, 64, 64, -64, -64, 64, -64, -64, -64, -64, -64, -64, 64, 64, 64, 64, 64, 64, 64, 64, -64, -64, -64, -64, -64, -64, 64, 64, -64, 64, -64, 64, -64, -64, -64, -64, -64, -64, -64, -64, 64, 64, 64, 64, 64, 64, 64, 64, 64, -64, -64, -64, -64, 64, -64, -64, 64, -64, -64, -64, 64, -64, -64, -64, -64, -64, 64, -64, -64, -64, 64, 64, 64, 64, 64, 64, -64, -64, -64, -64, 64, 64, -64, -64, -64, 64, 64, 64, 64, -64, 64, -64, -64, -64, -64, -64, -64, -64, -64, 64, 64, 64, 64, -64, -64, -64, -64, -64, -64, 64, -64, 64, -64, 64, -64, 64, 64, -64, 64, 64, 64, -64, -64, -64, -64, -64, 64, 64, 64, 64, 64, -64, -64, -64, 64, -64, -64, -64, -64, 64, -64, 64, -64, -64, 64, -64, 64, 64, 64, -64, -64, -64, -64, -64, -64, 64, -64, 64, 64, 64, 64, -64, 64, 64, 64, -64, 64, -64, -64, 64, 64, -64, -64, 64, -64, 64, 64, -64, -64, -64, -64, -64, -64, 64, 64, -64, 64, 64, 64, 64, -64, 64, -64, 64, 64, 64, 64, 64, -64, -64, -64, 64, -64, 64, 64, 64, -64, -64, 64, 64, 64, 64, 64, 64, -64, 64, 64, 64, 64, 64, 64, 64, 64, -64, 64, 64, -64, 64, 64, 64, 64, -64, 64, 64, 64, 64, 64, -64, 64, 64, -64, 64, -64, 64, 64, -64, 64, 64, 64, 64, 64, 64, 64, 64, -64, -64, -64, -64, 64, 64, 64, 64, 64, 64, 64, 64, -64, 64, -64, -64, 64, 64, 64, 64, 64, 64, 64, -64, -64, -64, -64, 64, -64, 64, 64, -64, -64, 64, 64, 64, 64, 64, 64, 64, 64, -64, -64, -64, 64, 64, 64, 64, 64, -64, -64, 64, 64, -64, -64, -64, -64, -64, -64, -64, -64, -64, 64, 64, 64, 64, 64, 64, 64, 64, -64, 64, 64, 64, 64, -64, 64, 64, -64, 64, 64, -64, -64, -64, -64, -64, -64, -64, -64, -64, 64, 64, 64, 64, 64, 64, 64, 64, 64, -64, 64, -64, -64, -64, -64, -64, 64, -64, 64, 64, -64, 64, 64, 64, -64, 64, 64, 64, 64, -64, -64, -64, -64, -64, -64, 64, 64, -64, -64, -64, -64, -64, -64, -64, -64, 64, 64, 64, 64, -64, 64, -64, 64, 64, 64, -64, 64, 64, 64, -64, -64, -64, -64, 64, -64, -64, 64, -64, 64, 64, 64, 64, 64, 64, -64, -64, 64, -64, -64, 64, 64, -64, 64, -64, 64, -64, -64, -64, 64, -64, 64, -64, -64, 64, -64, -64, -64, 64, 64, 64, 64, -64, -64, -64, 64, -64, -64, 64, 64, -64, 64, -64, 64, 64, -64, -64, -64, 64, -64, 64, 64, -64, -64, -64, -64, -64, -64, 64, 64, 64, -64, -64, -64, 64, -64, 64, -64, -64, 64, 64, 64, -64, -64, -64, -64, -64, -64, 64, 64, 64, 64, 64, -64, -64, 64, 64, 64, 64, -64, 64, -64, -64, -64, -64, 64, -64, -64, 64, 64, 64, -64, 64, 64, -64, 64, 64, 64, 64, 64, 64, -64, -64, 64, 64, -64, 64, -64, -64, 64, -64, 64, -64, 64, -64, 64, -64, 64, 64, -64, 64, 64, -64, -64, -64, -64, -64, -64, -64, -64, 64, -64, 64, 64, 64, 64, 64, 64, 64, -64, 64, 64, 64, -64, -64, -64, 64, 64, -64, -64, 64, 64, -64, 64, 64, -64, 64, 64, 64, -64, 64, -64, -64, 64, 64, -64, -64, 64, -64, 64, -64, 64, -64, -64, 64, -64, -64, -64, -64, -64, 64, -64, -64, 64, -64, 64, -64, 64, 64, 64, -64, 64, 64, 64, 64, 64, 64, 64, 64, -64, -64, -64, -64, -64, -64, -64, -64, -64, -64, -64, 64, -64, 64, -64, -64, -64, -64, 64, 64, 64, 64, -64, -64, -64, 64, 64, -64, 64, -64, -64, 64, 64, -64, -64, -64, 64, -64, -64, -64, 64, -64, 64, -64, 64, 64, -64, -64, -64, -64, -64, -64, -64, -64, 64, 64, -64, -64, 64, 64, -64, 64, -64, 64, -64, -64, 64, -64, -64, 64, 64, 64, -64, -64, -64, -64, 64, -64, 64, 64, 64, 64, 64, -64, 64, -64, -64, 64, 64, 64, 64, -64, -64, 64, -64, -64, -64, -64, 64, -64, -64, -64, 64, 64, 64, -64, 64, -64, -64, 64, -64, 64, -64, 64, -64, -64, 64, -64, -64, -64, 64, 64, 64, 64, -64, -64, -64, 64, -64, -64, -64, -64, -64, 64, -64, 64, 64, 64, -64, -64, -64, 64, -64, -64, 64, -64, 64, -64, -64, -64, -64, -64, -64, -64, -64, -64, -64, -64, 64, 64, 64, 64, 64, 64, 64, -64, -64, -64, -64, -64, -64, -64, 64, -64, 64, -64, 64, 64, -64, 64, 64, -64, 64, -64, 64, -64, -64, -64, 64, -64, -64, -64, 64, -64, -64, -64, -64, -64, -64, 64, -64, 64, -64, 64, 64, -64, -64, -64, -64, 64, -64, -64, -64, -64, 64, -64, -64, 64, -64, 64, 64, -64, 64, 64, 64, 64, -64, 64, -64, -64, -64, -64, -64, -64, -64, 64, -64, -64, 64, -64, 64, -64, 64, 64, -64, -64, -64, -64, 64, -64, 64, -64, 64, 64, -64, -64, 64, 64, -64, -64, -64, -64, 64, -64, 64, -64, -64, -64, -64, -64, -64, -64, 64, -64, -64, -64, 64, -64, -64, -64, -64, -64, 64, 64, 64, -64, -64, -64, 64, 64, 64, 64, -64, -64, -64, -64, -64, -64, -64, -64, -64, -64, -64, -64, 64, 64, -64, -64, -64, -64, -64, 64, -64, -64, -64, -64, -64, -64, -64, -64, -64, -64, -64, 64, 64, 64, 64, 64, -64, 64, 64, -64, 64, -64, -64, -64, 64, 64, -64, -64, -64, -64, -64, 64, -64, -64, 64, -64, -64, 64, 64, -64, -64, 64, -64, 64, 64, -64, 64, 64, 64, -64, -64, -64, 64, -64, 64, -64, -64, 64, 64, 64, -64, -64, 64, -64, -64, 64, -64, 64, -64, 64, -64, -64, -64, 64, -64, -64, -64, 64, -64, 64, -64, 64, 64, 64, -64, -64, -64, 64, -64, 64, 64, -64, 64, -64, 64, -64, -64, 64, 64, -64, 64, -64, 64, -64, -64, 64, 64, -64, -64, -64, -64, -64, -64, 64, 64, -64, 64, 64, -64, -64, -64, -64, 64, 64, -64, 64, -64, -64, 64, 64, 64, -64, 64, 64, -64, -64, 64, -64, 64, 64, -64, 64, -64, -64, 64, -64, -64, 64, -64, 64, -64, 64, -64, -64, -64, 64, -64, -64, 64, -64, -64, 64, 64, 64, -64, -64, -64, 64, -64, 64, 64, 64, -64, -64, 64, -64, -64, 64, -64, -64, 64, -64, 64, 64, -64, 64, 64, -64, -64, 64, -64, 64, 64, -64, 64, 64, -64, 64, -64, -64, 64, -64, -64, -64, -64, -64, -64, 64, 64, 64, 64, -64, -64, -64, -64, 64, 64, -64, 64, -64, 64, 64, 64, 64, -64, -64, 64, -64, -64, 64, -64, 64, 64, 64, -64, 64, -64, 64, -64, 64, -64, -64, -64, -64, 64, 64, 64, 64, 64, 64, -64, 64, -64, -64, 64, 64, -64, -64, 64, -64, -64, -64, 64, -64, 64, -64, 64, 64, -64, -64, 64, 64, -64, 64, -64, 64, -64, -64, -64, -64, 64, -64, -64, -64, 64, 64, 64, -64, -64, 64, -64, 64, -64, 64, -64, 64, -64, 64, 64, 64, 64, -64, -64, 64, 64, -64, -64, -64, 64, 64, -64, 64, -64, 64, 64, 64, 64, -64, -64, 64, 64, 64, 64, 64, 64, 64, -64, 64, 64, 64, -64, 64, 64, -64, -64, -64, -64, -64, -64, -64, 64, -64, 64, -64, -64, 64, -64, 64, 64, 64, 64, 64, 64, -64, 64, -64, -64, -64, 64, -64, -64, -64, 64, -64, -64, -64, -64, -64, -64, -64, -64, -64, -64, -64, 64, 64, 64, 64, -64, -64, 64, 64, -64, -64, -64, -64, -64, 64, 64, 64, 64, 64, -64, -64, -64, -64, -64, -64, -64, -64, 64, 64, 64, 64, 64, 64, -64, -64, -64, -64, 64, -64, 64, -64, -64, 64, 64, 64, 64, 64, -64, -64, 64, -64, 64, -64, 64, 64, 64, 64, 64, 64, 64, 64, 64, -64, -64, -64, -64, 64, -64, -64, 64, 64, 64, -64, -64, -64, -64, -64, 64, 64, 64, 64, 64, 64, 64, 64, 64, 64, 64, 64, 64, 64, 64, -64, -64, 64, -64, -64, -64, -64, 64, 64, -64, 64, 64, -64, -64, -64, 64, 64, 64, 64, 64, 64, 64, 64, -64, 64, 64, 64, -64, -64, 64, -64, 64, 64, -64, 64, -64, -64, 64, -64, -64, -64, -64, -64, 64, 64, 64, 64, 64, 64, 64, -64, 64, 64, 64, 64, -64, -64, -64, -64, -64, -64, 64, -64, 64, -64, 64, 64, -64, -64, -64, 64, 64, 64, 64, -64, 64, 64, -64, 64, 64, 64, 64, 64, -64, -64, 64, -64, 64, -64, -64, 64, 64, 64, 64, 64, 64, 64, 64, -64, 64, 64, -64, -64, -64, -64, 64, 64, 64, 64, 64, 64, -64, 64, -64, 64, 64, -64, -64, -64, 64, 64, 64, 64, 64, 64, 64, 64, 64, 64, 64, 64, 64, -64, 64, 64, 64, 64, 64, 64, 64, -64, -64, -64, -64, -64, 64, -64, 64, 64, 64, 64, 64, 64, 64, 64, -64, 64, 64, 64, -64, -64, 64, 64, -64, 64, 64, -64, 64, -64, -64, -64, -64, -64, -64, 64, -64, 64, 64, 64, 64, 64, 64, 64, -64, -64, -64, 64, 64, 64, 64, 64, 64, 64, -64, -64, -64, -64, -64, 64, -64, 64, -64, -64, -64, -64, 64, 64, 64, 64, 64, 64, -64, 64, 64, 64, 64, 64, 64, 64, 64, 64, -64, 64, 64, 64, -64, -64, -64, -64, 64, -64, 64, 64, 64, 64, 64, 64, 64, 64, 64, 64, 64, -64, 64, 64, 64, 64, 64, 64, -64, 64, 64, 64, -64, 64, -64, -64, -64, 64, 64, 64, 64, -64, 64, 64, 64, 64, 64, 64, 64, 64, 64, 64, 64, 64, 64, -64, -64, 64, 64, 64, 64, 64, -64, 64, 64, 64, 64, 64, -64, -64, 64, 64, 64, 64, 64, 64, -64, 64, 64, 64, 64, 64, -64, -64, 64, 64, -64, -64, 64, 64, 64, -64, 64, -64, 64, -64, -64, -64, 64, 64, 64, 64, 64, 64, 64, -64, 64, 64, -64, -64, -64, -64, 64, -64, -64, 64, -64, -64, -64, -64, -64, -64, -64, -64, -64, 64, -64, 64, 64, -64, 64, -64, 64, 64, -64, 64, -64, -64, 64, -64, 64, 64, -64, -64, -64, 64, 64, 64, 64, -64, -64, -64, -64, -64, 64, -64, -64, 64, -64, 64, -64, -64, 64, -64, -64, -64, -64, -64, 64, 64, -64, 64, -64, 64, -64, -64, -64, 64, -64, 64, -64, -64, 64, 64, 64, -64, 64, 64, -64, -64, -64, -64, -64, -64, -64, 64, 64, 64, -64, 64, -64, 64, -64, -64, 64, -64, 64, 64, 64, 64, -64, 64, -64, -64, 64, 64, -64, -64, 64, -64, -64, -64, 64, 64, 64, 64, -64, -64, -64, -64, -64, -64, 64, 64, 64, 64, 64, 64, 64, 64, 64, 64, 64, 64, 64, 64, 64, 64, 64, -64, -64, 64, -64, 64, -64, -64, -64, -64, 64, -64, 64, -64, 64, 64, 64, 64, 64, 64, 64, 64, 64, 64, -64, -64, 64, 64, 64, 64, 64, 64, 64, -64, -64, -64, -64, -64, -64, -64, 64, -64, -64, 64, -64, 64, 64, 64, -64, 64, -64, 64, 64, -64, 64, 64, 64, 64, -64, -64, 64, 64, 64, -64, -64, 64, 64, 64, 64, 64, 64, 64, -64, 64, -64, -64, 64, -64, -64, 64, -64, -64, 64, 64, 64, 64, -64, 64, -64, 64, -64, -64, -64, 64, -64, -64, -64, 64, -64, -64, 64, -64, 64, -64, -64, -64, -64, -64, -64, -64, -64, -64, 64, -64, -64, -64, -64, 64, 64, 64, 64, 64, 64, -64, -64, -64, 64, 64, 64, 64, -64, -64, 64, 64, 64, 64, 64, -64, 64, 64, 64, -64, 64, 64, 64, 64, -64, -64, 64, -64, -64, -64, 64, 64, 64, 64, -64, -64, 64, -64, -64, 64, -64, 64, 64, -64, -64, -64, -64, -64, 64, -64, 64, -64, 64, -64, 64, 64, -64, -64, 64, 64, 64, 64, -64, 64, -64, -64, -64, 64, -64, 64, -64, 64, -64, -64, -64, -64, -64, -64, 64, 64, 64, -64, 64, -64, -64, -64, 64, -64, 64, 64, 64, -64, -64, 64, 64, -64, 64, 64, 64, 64, -64, 64, -64, 64, 64, -64, -64, 64, -64, 64, -64, 64, 64, -64, -64, 64, -64, 64, 64, 64, 64, -64, -64, 64, -64, -64, 64, 64, 64, 64, -64, 64, 64, 64, -64, 64, -64, 64, -64, 64, 64, -64, 64, 64, -64, 64, 64, 64, 64, 64, -64, 64, -64, -64, -64, 64, -64, 64, 64, 64, 64, -64, 64, 64, 64, 64, 64, -64, -64, 64, 64, 64, -64, 64, 64, 64, 64, -64, 64, -64, 64, 64, 64, 64, 64, -64, 64, 64, 64, 64, -64, 64, 64, 64, 64, -64, 64, -64, 64, -64, -64, 64, -64, -64, -64, -64, 64, 64, 64, -64, -64, 64, 64, -64, 64, 64, 64, 64, 64, -64, 64, -64, -64, 64, 64, -64, 64, -64, -64, 64, 64, 64, 64, -64, 64, 64, -64, 64, -64, 64, -64, 64, 64, 64, 64, -64, 64, 64, -64, 64, -64, 64, -64, 64, -64, 64, 64, -64, -64, 64, -64, 64, 64, 64, -64, -64, -64, 64, 64, 64, 64, 64, 64, 64, -64, 64, 64, 64, 64, -64, -64, -64, -64, 64, -64, 64, 64, 64, 64, 64, 64, -64, 64, -64, -64, -64, 64, 64, 64, 64, 64, -64, -64, 64, -64, 64, -64, 64, 64, -64, -64, -64, -64, 64, 64, 64, 64, 64, 64, -64, 64, 64, -64, -64, 64, 64, 64, 64, 64, 64, 64, 64, -64, 64, 64, 64, -64, -64, 64, 64, -64, -64, -64, -64, 64, -64, 64, -64, 64, 64, 64, 64, 64, 64, 64, 64, 64, 64, 64, 64, 64, 64, 64, -64, 64, 64, -64, -64, -64, -64, 64, 64, 64, -64, -64, -64, -64, 64, -64, 64, 64, 64, 64, 64, 64, 64, 64, 64, 64, 64, -64, 64, 64, 64, -64, -64, 64, 64, -64, -64, -64, -64, -64, -64, -64, 64, 64, 64, 64, 64, 64, 64, 64, 64, -64, -64, -64, -64, -64, 64, -64, 64, -64, 64, -64, 64, -64, -64, -64, -64, -64, -64, -64, 64, 64, 64, -64, -64, 64, -64, 64, -64, -64, 64, -64, -64, -64, -64, 64, 64, 64, -64, -64, 64, -64, -64, 64, -64, 64, 64, -64, 64, -64, 64, -64, -64, -64, -64, 64, -64, -64, -64, -64, -64, -64, -64, -64, 64, 64, -64, 64, 64, -64, 64, 64, -64, -64, -64, 64, 64, -64, 64, -64, 64, -64, -64, 64, 64, -64, -64, -64, -64, 64, -64, 64, -64, 64, -64, -64, -64, 64, 64, -64, -64, 64, 64, -64, 64, 64, 64, 64, 64, -64, -64, -64, -64, -64, -64, -64, -64, -64, -64, 64, 64, -64, -64, 64, -64, -64, -64, 64, -64, 64, 64, 64, 64, 64, 64, 64, -64, 64, -64, -64, -64, 64, -64, -64, -64, 64, -64, 64, -64, -64, -64, -64, 64, 64, -64, 64, 64, 64, 64, 64, -64, 64, 64, 64, 64, 64, 64, -64, 64, 64, -64, 64, 64, 64, -64, -64, 64, -64, -64, -64, -64, 64, 64, 64, 64, 64, -64, -64, 64, 64, 64, 64, 64, 64, 64, 64, 64, -64, 64, 64, 64, -64, 64, -64, -64, 64, -64, 64, 64, 64, 64, 64, 64, 64, 64, 64, 64, 64, 64, 64, 64, 64, 64, 64, -64, -64, 64, -64, 64, 64, -64, -64, 64, -64, 64, 64, 64, 64, 64, 64, -64, 64, 64, 64, -64, 64, 64, 64, 64, 64, -64, 64, -64, 64, 64, -64, -64, 64, -64, -64, -64, -64, 64, -64, 64, 64, 64, 64, -64, 64, -64, 64, 64, 64, 64, -64, 64, -64, 64, -64, -64, 64, 64, -64, 64, -64, 64, -64, -64, -64, 64, -64, 64, 64, 64, 64, 64, -64, -64, 64, 64, 64, 64, -64, 64, 64, 64, -64, 64, 64, -64, -64, -64, 64, -64, -64, -64, 64, -64, -64, -64, -64, -64, -64, -64, -64, 64, -64, -64, -64, -64, -64, -64, -64, 64, -64, 64, 64, 64, -64, 64, -64, -64, -64, 64, -64, 64, 64, 64, -64, -64, -64, -64, 64, 64, 64, -64, -64, 64, 64, -64, -64, -64, -64, 64, 64, 64, -64, 64, 64, 64, 64, -64, 64, -64, 64, 64, -64, 64, 64, -64, 64, -64, -64, -64, 64, 64, 64, 64, -64, 64, -64, -64, 64, 64, 64, 64, 64, 64, -64, -64, 64, -64, -64, 64, -64, -64, 64, -64, -64, -64, -64, 64, 64, -64, 64, 64, 64, 64, 64, 64, -64, -64, 64, -64, -64, 64, -64, -64, 64, 64, 64, 64, 64, -64, 64, 64, 64, 64, -64, 64, 64, -64, 64, -64, 64, 64, 64, 64, 64, 64, 64, -64, -64, 64, 64, -64, -64, 64, 64, 64, 64, 64, 64, 64, -64, 64, 64, 64, 64, 64, 64, 64, 64, -64, 64, -64, -64, -64, 64, 64, -64, -64, 64, -64, -64, -64, 64, -64, 64, 64, 64, 64, -64, -64, 64, 64, -64, -64, 64, -64, 64, -64, 64, -64, -64, 64, 64, -64, 64, -64, 64, -64, -64, 64, -64, 64, 64, -64, 64, 64, 64, 64, 64, 64, 64, 64, -64, -64, 64, 64, 64, 64, 64, 64, 64, 64, 64, -64, -64, 64, -64, 64, 64, -64, -64, -64, 64, 64, 64, 64, 64, -64, -64, -64, -64, 64, 64, -64, 64, 64, 64, 64, -64, 64, -64, 64, 64, -64, -64, -64, 64, -64, -64, 64, 64, 64, -64, -64, -64, 64, 64, -64, 64, 64, -64, 64, 64, 64, 64, 64, 64, 64, 64, 64, -64, 64, 64, 64, -64, 64, 64, 64, 64, 64, 64, 64, 64, 64, 64, 64, -64, -64, -64, -64, 64, 64, 64, 64, 64, 64, 64, -64, 64, -64, -64, 64, 64, -64, 64, 64, 64, 64, 64, 64, 64, 64, 64, 64, -64, -64, 64, -64, 64, 64, 64, -64, -64, -64, -64, 64, -64, 64, 64, 64, 64, 64, 64, 64, 64, 64, -64, 64, -64, -64, -64, 64, -64, 64, 64, -64, 64, 64, 64, 64, -64, -64, -64, -64, 64, -64, 64, 64, 64, 64, 64, 64, -64, -64, 64, 64, 64, 64, -64, -64, 64, 64, 64, 64, 64, -64, 64, 64, -64, 64, -64, -64, 64, -64, 64, -64, 64, 64, -64, -64, 64, -64, 64, 64, 64, 64, -64, -64, 64, 64, 64, 64, 64, 64, -64, -64, 64, -64, 64, -64, 64, -64, -64, 64, 64, 64, -64, -64, 64, -64, 64, 64, 64, -64, -64, 64, -64, 64, 64, 64, 64, 64, 64, 64, 64, 64, -64, 64, -64, 64, 64, -64, 64, 64, 64, -64, 64, 64, 64, 64, -64, 64, 64, 64, -64, 64, 64, 64, 64, 64, 64, 64, 64, 64, -64, -64, 64, -64, -64, -64, 64, 64, 64, 64, -64, 64, -64, 64, 64, 64, 64, -64, 64, 64, -64, -64, 64, -64, 64, -64, 64, -64, -64, 64, -64, -64, -64, 64, 64, 64, 64, 64, 64, 64, 64, 64, 64, 64, -64, -64, -64, -64, 64, -64, 64, 64, 64, 64, -64, 64, 64, -64, -64, 64, -64, 64, 64, 64, 64, 64, 64, -64, 64, 64, 64, -64, -64, -64, 64, 64, 64, 64, 64, 64, 64, 64, 64, 64, -64, -64, 64, 64, -64, -64, -64, 64, -64, 64, 64, 64, 64, -64, 64, 64, 64, 64, 64, -64, 64, 64, 64, 64, 64, 64, 64, -64, 64, -64, -64, 64, 64, -64, 64, -64, -64, 64, -64, -64, 64, 64, 64, -64, 64, 64, 64, 64, 64, 64, 64, 64, -64, -64, -64, -64, -64, -64, 64, -64, 64, -64, 64, 64, -64, 64, 64, 64, 64, 64, 64, 64, 64, 64, 64, 64, 64, 64, 64, 64, -64, 64, 64, 64, -64, 64, -64, -64, -64, -64, -64, 64, -64, 64, 64, 64, 64, 64, -64, 64, 64, 64, 64, 64, 64, 64, 64, 64, 64, 64, 64, -64, 64, 64, 64, 64, -64, -64, 64, -64, 64, -64, 64, -64, 64, -64, -64, -64, 64, 64, 64, 64, 64, 64, 64, 64, -64, 64, 64, -64, 64, -64, -64, 64, -64, -64, 64, 64, -64, 64, -64, -64, -64, 64, -64, 64, 64, 64, 64, 64, 64, 64, 64, 64, -64, -64, -64, -64, 64, -64, 64, 64, 64, -64, 64, -64, 64, -64, 64, 64, -64, -64, -64, -64, -64, 64, 64, 64, 64, 64, 64, -64, 64, -64, -64, -64, -64, 64, -64, -64, 64, 64, 64, -64, -64, -64, 64, -64, -64, -64, 64, -64, 64, -64, -64, -64, -64, -64, 64, -64, 64, -64, 64, -64, -64, -64, -64, -64, 64, -64, 64, 64, 64, -64, 64, 64, 64, -64, 64, 64, 64, -64, -64, -64, -64, 64, 64, 64, 64, 64, -64, 64, -64, -64, -64, -64, -64, 64, 64, 64, -64, -64, -64, -64, 64, 64, 64, -64, 64, -64, 64, 64, -64, -64, -64, -64, 64, -64, 64, 64, -64, -64, 64, -64, 64, 64, -64, 64, -64, -64, 64, -64, 64, -64, 64, -64, 64, -64, 64, -64, 64, -64, -64, 64, 64, 64, 64, -64, 64, -64, 64, 64, -64, -64, -64, -64, -64, 64, -64, -64, -64, 64, 64, 64, -64, 64, 64, -64, -64, -64, -64, 64, -64, 64, 64, 64, -64, -64, -64, -64, -64, -64, -64, -64, 64, -64, -64, -64, 64, -64, -64, -64, -64, -64, -64, 64, -64, -64, -64, -64, 64, -64, 64, 64, -64, 64, 64, 64, 64, -64, -64, -64, 64, -64, -64, -64, -64, -64, -64, -64, -64, -64, -64, -64, 64, -64, 64, 64, 64, -64, 64, 64, 64, 64, -64, -64, -64, -64, 64, 64, 64, 64, 64, -64, 64, -64, 64, -64, -64, -64, 64, 64, -64, -64, -64, -64, -64, -64, -64, 64, 64, -64, 64, 64, 64, -64, 64, -64, -64, -64, -64, -64, -64, -64, -64, 64, -64, -64, -64, -64, -64, 64, -64, -64, -64, -64, 64, -64, 64, 64, -64, 64, 64, 64, -64, 64, -64, 64, -64, -64, 64, 64, -64, -64, 64, -64, -64, 64, -64, 64, -64, -64, -64, 64, -64, -64, -64, -64, -64, -64, 64, 64, 64, 64, -64, 64, -64, -64, -64, -64, 64, 64, -64, -64, 64, -64, 64, -64, -64, -64, -64, -64, -64, -64, 64, -64, 64, 64, -64, 64, 64, 64, -64, -64, 64, -64, -64, -64, -64, -64, 64, -64, 64, 64, 64, -64, -64, -64, -64, -64, -64, 64, -64, 64, -64, 64, 64, 64, 64, -64, 64, -64, -64, -64, 64, -64, 64, -64, -64, -64, 64, 64, 64, 64, -64, -64, -64, -64, -64, -64, 64, -64, -64, 64, 64, -64, 64, -64, -64, 64, 64, 64, -64, -64, -64, -64, 64, 64, -64, -64, 64, -64, -64, 64, -64, -64, 64, -64, 64, 64, -64, -64, 64, 64, -64, -64, -64, -64, 64, 64, -64, -64, -64, -64, 64, 64, 64, -64, -64, 64, 64, -64, -64, 64, -64, 64, 64, -64, 64, -64, -64, -64, 64, -64, 64, -64, -64, 64, -64, -64, -64, 64, 64, 64, 64, -64, -64, -64, -64, -64, 64, -64, 64, -64, -64, 64, -64, -64, -64, -64, -64, -64, -64, -64, -64, -64, -64, -64, 64, 64, -64, 64, 64, -64, -64, -64, -64, -64, -64, -64, -64, -64, -64, 64, -64, -64, -64, -64, -64, -64, 64, 64, -64, -64, -64, -64, -64, -64, -64, 64, -64, -64, -64, -64, -64, 64, -64, 64, 64, 64, 64, -64, -64, 64, 64, 64, -64, -64, 64, 64, -64, -64, -64, -64, -64, -64, -64, -64, -64, -64, -64, -64, -64, -64, -64, -64, -64, -64, 64, 64, 64, 64, 64, 64, -64, -64, -64, -64, 64, 64, -64, -64, -64, -64, -64, 64, 64, 64, -64, -64, 64, 64, 64, -64, -64, 64, 64, -64, 64, 64, -64, -64, 64, -64, -64, -64, -64, -64, 64, 64, -64, -64, -64, -64, -64, -64, -64, -64, -64, 64, -64, -64, -64, -64, 64, 64, 64, 64, -64, 64, 64, -64, -64, 64, 64, -64, -64, -64, -64, -64, 64, -64, -64, -64, -64, -64, -64, 64, 64, 64, -64, 64, 64, 64, -64, 64, 64, 64, -64, 64, 64, -64, -64, -64, -64, -64, -64, -64, -64, -64, -64, -64, 64, 64, 64, 64, -64, -64, -64, 64, -64, -64, 64, -64, 64, 64, -64, -64, -64, -64, -64, -64, -64, -64, -64, 64, -64, -64, -64, -64, 64, 64, 64, -64, -64, -64, 64, 64, -64, -64, 64, -64, 64, -64, -64, 64, -64, 64, 64, -64, -64, -64, -64, -64, -64, -64, -64, -64, 64, -64, 64, -64, -64, -64, -64, -64, -64, 64, 64, -64, 64, 64, -64, 64, -64, 64, -64, 64, 64, 64, -64, -64, -64, -64, -64, 64, -64, 64, 64, 64, -64, 64, 64, -64, -64, -64, 64, 64, 64, 64, 64, 64, 64, 64, 64, -64, -64, 64, 64, 64, -64, -64, -64, 64, 64, -64, 64, 64, 64, 64, 64, 64, 64, -64, -64, -64, 64, -64, -64, -64, 64, -64, 64, 64, 64, 64, -64, 64, 64, 64, 64, -64, -64, 64, 64, 64, 64, -64, 64, -64, 64, 64, 64, -64, -64, -64, 64, 64, -64, -64, -64, 64, 64, 64, 64, -64, 64, -64, -64, -64, -64, -64, -64, -64, 64, -64, 64, 64, -64, 64, 64, 64, 64, -64, -64, -64, -64, -64, 64, -64, 64, 64, -64, 64, 64, -64, 64, 64, 64, -64, -64, -64, 64, -64, -64, 64, -64, 64, 64, 64, 64, -64, -64, 64, -64, 64, -64, -64, -64, -64, -64, 64, 64, -64, 64, 64, 64, 64, -64, -64, -64, 64, -64, -64, -64, -64, 64, 64, -64, -64, -64, -64, 64, 64, 64, 64, -64, -64, -64, 64, -64, 64, 64, 64, -64, -64, 64, 64, -64, -64, 64, 64, -64, 64, -64, 64, -64, -64, -64, -64, -64, -64, 64, -64, -64, -64, 64, 64, -64, 64, -64, -64, 64, -64, 64, -64, 64, 64, -64, 64, -64, -64, 64, -64, -64, 64, -64, -64, 64, 64, 64, 64, -64, -64, 64, 64, -64, -64, -64, -64, 64, 64, 64, 64, 64, -64, -64, -64, 64, -64, -64, -64, -64, 64, 64, 64, 64, 64, 64, 64, -64, -64, -64, -64, -64, -64, -64, -64, -64, -64, -64, -64, 64, -64, -64, -64, 64, 64, 64, 64, 64, -64, 64, -64, 64, 64, 64, -64, -64, -64, 64, -64, -64, -64, -64, 64, 64, -64, 64, -64, -64, 64, 64, 64, -64, -64, -64, 64, 64, -64, -64, -64, 64, -64, -64, -64, 64, -64, -64, -64, 64, 64, -64, 64, 64, 64, 64, 64, 64, 64, 64, 64, 64, 64, -64, 64, -64, -64, -64, -64, 64, -64, -64, -64, -64, 64, 64, 64, 64, 64, 64, 64, 64, 64, 64, 64, -64, -64, 64, -64, -64, 64, 64, -64, 64, 64, -64, -64, -64, -64, -64, 64, -64, 64, 64, 64, 64, 64, 64, 64, -64, 64, -64, -64, -64, -64, 64, 64, 64, 64, -64, 64, -64, 64, -64, -64, -64, -64, -64, 64, -64, -64, 64, 64, 64, -64, -64, -64, -64, -64, -64, -64, 64, -64, 64, 64, 64, -64, 64, 64, 64, 64, -64, -64, -64, -64, -64, 64, 64, 64, 64, 64, 64, -64, -64, -64, -64, -64, 64, -64, -64, 64, 64, 64, 64, -64, -64, -64, -64, 64, -64, -64, -64, -64, -64, -64, 64, 64, 64, -64, -64, -64, -64, -64, -64, -64, -64, -64, -64, 64, -64, -64, 64, -64, -64, 64, 64, 64, -64, -64, -64, -64, -64, 64, -64, 64, 64, 64, -64, -64, -64, -64, -64, -64, -64, -64, -64, -64, -64, -64, 64, 64, 64, 64, 64, 64, -64, -64, -64, -64, -64, 64, -64, -64, -64, 64, -64, -64, -64, -64, -64, -64, -64, -64, -64, -64, 64, 64, 64, 64, 64, -64, 64, -64, -64, -64, 64, -64, -64, 64, 64, -64, 64, -64, -64, -64, -64, -64, -64, -64, -64, -64, -64, -64, -64, 64, 64, -64, 64, -64, 64, -64, -64, 64, 64, 64, 64, 64, 64, 64, 64, -64, -64, -64, -64, -64, -64, -64, 64, 64, 64, -64, 64, 64, 64, 64, 64, 64, 64, -64, -64, 64, 64, 64, -64, 64, 64, 64, -64, -64, -64, -64, -64, -64, -64, -64, -64, 64, 64, 64, -64, 64, 64, -64, -64, -64, -64, 64, -64, -64, -64, -64, 64, -64, -64, -64, -64, -64, -64, -64, -64, 64, -64, 64, 64, 64, -64, 64, 64, 64, -64, -64, -64, -64, -64, -64, -64, -64, -64, -64, -64, -64, -64, -64, -64, -64, -64, -64, 64, 64, -64, 64, 64, -64, 64, 64, -64, 64, -64, 64, -64, -64, -64, 64, -64, 64, -64, 64, -64, -64, -64, -64, -64, -64, -64, -64, 64, 64, -64, 64, 64, -64, -64, 64, -64, 64, -64, 64, -64, 64, 64, 64, -64, -64, -64, -64, -64, -64, -64, -64, -64, -64, 64, 64, 64, 64, 64, 64, 64, 64, 64, 64, -64, 64, 64, -64, -64, -64, -64, 64, 64, 64, -64, -64, -64, 64, -64, -64, 64, -64, 64, -64, 64, -64, 64, 64, -64, 64, 64, 64, 64, 64, -64, 64, 64, 64, -64, -64, -64, 64, -64, 64, -64, 64, 64, -64, 64, 64, -64, 64, -64, 64, 64, 64, -64, -64, 64, 64, -64, 64, -64, -64, 64, -64, 64, 64, -64, 64, 64, 64, 64, 64, -64, -64, 64, -64, 64, -64, -64, 64, 64, 64, -64, -64, -64, -64, -64, 64, 64, 64, 64, -64, 64, 64, 64, 64, 64, 64, 64, 64, 64, 64, 64, 64, 64, 64, 64, 64, 64, -64, -64, -64, 64, 64, 64, -64, 64, 64, -64, 64, 64, 64, -64, -64, 64, -64, -64, -64, -64, 64, 64, 64, 64, 64, 64, 64, 64, 64, -64, 64, 64, 64, 64, 64, 64, -64, 64, 64, 64, -64, -64, -64, 64, -64, -64, -64, -64, 64, -64, 64, -64, 64, -64, 64, 64, 64, 64, 64, 64, 64, 64, 64, 64, -64, -64, 64, -64, -64, -64, -64, 64, 64, 64, -64, -64, -64, 64, 64, -64, 64, -64, -64, 64, -64, -64, -64, -64, 64, -64, -64, -64, -64, 64, 64, -64, 64, -64, 64, 64, 64, 64, -64, -64, 64, 64, -64, 64, -64, -64, 64, 64, 64, -64, -64, -64, 64, -64, 64, 64, -64, 64, 64, 64, 64, -64, 64, 64, -64, 64, 64, 64, 64, -64, 64, 64, -64, 64, 64, -64, 64, 64, -64, 64, -64, -64, 64, -64, -64, 64, -64, -64, -64, -64, -64, 64, -64, 64, -64, -64, 64, -64, -64, 64, 64, 64, -64, 64, -64, 64, 64, 64, -64, 64, -64, 64, 64, 64, 64, -64, 64, 64, 64, 64, 64, 64, -64, 64, 64, -64, 64, 64, 64, 64, 64, -64, -64, -64, -64, 64, 64, -64, 64, -64, 64, 64, -64, -64, -64, 64, -64, -64, -64, 64, -64, -64, -64, -64, -64, -64, -64, -64, -64, -64, -64, 64, 64, 64, -64, 64, 64, 64, 64, -64, 64, -64, -64, -64, 64, -64, -64, 64, 64, 64, 64, 64, 64, 64, -64, -64, -64, -64, -64, -64, 64, -64, 64, 64, 64, 64, -64, -64, 64, 64, -64, 64, -64, 64, 64, 64, 64, 64, 64, 64, 64, 64, 64, -64, -64, -64, -64, -64, -64, -64, 64, 64, 64, 64, 64, 64, -64, -64, -64, 64, 64, 64, 64, -64, 64, 64, 64, 64, -64, 64, 64, -64, 64, 64, 64, -64, -64, 64, 64, 64, 64, 64, 64, -64, -64, -64, 64, -64, 64, 64, 64, 64, 64, 64, 64, 64, 64, 64, 64, 64, 64, 64, 64, 64, 64, 64, 64, 64, 64, 64, -64, -64, 64, 64, 64, 64, -64, 64, 64, 64, 64, -64, 64, 64, 64, 64, 64, 64, -64, -64, -64, -64, 64, 64, -64, -64, 64, -64, -64, -64, -64, -64, 64, 64, 64, 64, 64, 64, 64, 64, 64, 64, 64, 64, 64, 64, -64, -64, -64, 64, -64, 64, 64, 64, -64, -64, -64, -64, -64, 64, -64, 64, 64, 64, 64, 64, 64, 64, 64, 64, 64, 64, -64, -64, -64, 64, 64, 64, -64, -64, 64, -64, 64, 64, -64, -64, -64, -64, -64, 64, 64, 64, -64, 64, 64, 64, 64, 64, 64, 64, -64, 64, -64, 64, 64, 64, 64, -64, -64, 64, 64, 64, -64, -64, -64, -64, -64, -64, 64, 64, -64, 64, 64, -64, -64, 64, -64, 64, -64, -64, 64, 64, 64, 64, -64, 64, -64, 64, 64, 64, 64, -64, -64, -64, -64, -64, 64, -64, 64, -64, 64, -64, 64, 64, -64, -64, 64, 64, 64, -64, 64, 64, 64, 64, -64, 64, 64, -64, 64, 64, -64, 64, -64, 64, -64, -64, 64, 64, 64, 64, -64, -64, 64, -64, -64, -64, -64, 64, 64, 64, 64, 64, 64, 64, -64, -64, -64, 64, -64, 64, -64, -64, -64, 64, 64, 64, 64, 64, 64, 64, 64, 64, 64, -64, -64, 64, 64, 64, 64, 64, 64, -64, 64, -64, 64, -64, -64, -64, 64, -64, 64, 64, 64, 64, 64, 64, 64, 64, 64, 64, 64, -64, -64, -64, 64, 64, -64, 64, -64, -64, -64, -64, -64, -64, 64, -64, 64, -64, -64, 64, 64, 64, 64, 64, 64, 64, 64, 64, 64, 64, -64, 64, 64, 64, -64, -64, -64, -64, -64, -64, 64, 64, -64, -64, -64, -64, -64, -64, -64, 64, 64, 64, -64, 64, 64, -64, -64, 64, 64, 64, -64, -64, -64, -64, -64, -64, -64, 64, 64, -64, 64, -64, -64, -64, -64, -64, -64, -64, -64, -64, -64, -64, -64, 64, -64, 64, 64, 64, 64, 64, -64, -64, -64, 64, -64, -64, 64, 64, -64, 64, -64, -64, -64, -64, -64, -64, -64, -64, -64, 64, 64, 64, 64, 64, 64, -64, 64, 64, -64, 64, 64, -64, -64, 64, -64, 64, -64, 64, 64, -64, -64, -64, 64, 64, -64, -64, 64, 64, 64, 64, 64, 64, 64, 64, 64, 64, 64, 64, 64, 64, -64, -64, 64, 64, -64, -64, 64, 64, 64, 64, 64, 64, 64, -64, -64, 64, -64, 64, 64, 64, 64, 64, 64, 64, 64, 64, 64, -64, -64, 64, -64, 64, 64, -64, 64, 64, -64, 64, 64, 64, 64, 64, -64, 64, 64, -64, 64, 64, 64, 64, 64, 64, 64, 64, -64, 64, 64, 64, 64, -64, -64, -64, 64, 64, 64, 64, 64, 64, 64, -64, -64, 64, 64, -64, 64, 64, 64, 64, 64, 64, 64, 64, 64, 64, 64, -64, 64, 64, 64, 64, -64, -64, 64, -64, 64, -64, -64, -64, 64, 64, 64, 64, 64, 64, 64, -64, 64, 64, 64, 64, 64, -64, 64, -64, 64, -64, -64, -64, 64, -64, -64, 64, -64, -64, 64, 64, -64, -64, -64, 64, -64, 64, 64, -64, 64, 64, -64, 64, -64, 64, 64, 64, -64, 64, 64, 64, -64, 64, -64, -64, 64, 64, -64, 64, -64, -64, 64, 64, -64, 64, 64, 64, 64, 64, -64, -64, -64, -64, -64, 64, 64, 64, -64, -64, -64, 64, 64, 64, -64, -64, -64, 64, 64, -64, 64, 64, 64, 64, -64, 64, 64, 64, -64, 64, -64, -64, -64, 64, 64, -64, 64, 64, 64, -64, -64, -64, 64, 64, -64, 64, 64, -64, -64, -64, -64, 64, 64, -64, 64, 64, 64, -64, 64, -64, 64, -64, -64, 64, 64, -64, 64, 64, -64, -64, -64, -64, -64, -64, -64, 64, -64, -64, -64, -64, -64, -64, -64, -64, 64, -64, -64, 64, 64, -64, -64, 64, -64, -64, -64, 64, 64, -64, -64, -64, -64, -64, -64, 64, -64, -64, -64, -64, -64, -64, -64, -64, -64, -64, 64, -64, 64, 64, -64, -64, 64, -64, -64, 64, -64, -64, 64, -64, -64, -64, 64, -64, -64, -64, -64, -64, -64, -64, -64, -64, 64, 64, -64, -64, -64, 64, 64, 64, -64, 64, 64, 64, -64, 64, -64, -64, 64, 64, 64, -64, -64, -64, -64, -64, -64, -64, -64, 64, -64, -64, -64, 64, 64, -64, 64, 64, 64, 64, 64, -64, 64, -64, 64, 64, -64, -64, 64, -64, 64, 64, 64, 64, -64, 64, 64, 64, -64, 64, -64, 64, -64, -64, -64, 64, -64, -64, 64, 64, 64, 64, 64, 64, 64, -64, 64, 64, 64, 64, 64, 64, 64, 64, 64, -64, -64, -64, 64, 64, -64, -64, -64, 64, 64, 64, -64, -64, 64, 64, 64, 64, -64, -64, 64, 64, 64, 64, 64, 64, 64, 64, 64, 64, -64, -64, -64, -64, 64, 64, -64, 64, 64, 64, 64, -64, -64, -64, 64, 64, 64, -64, -64, -64, -64, -64, -64, 64, -64, 64, 64, -64, -64, -64, -64, -64, -64, 64, -64, 64, -64, 64, -64, -64, -64, -64, 64, 64, -64, -64, 64, -64, -64, -64, -64, -64, 64, 64, 64, -64, -64, 64, -64, -64, -64, 64, 64, 64, -64, -64, 64, -64, -64, 64, -64, -64, -64, -64, -64, -64, -64, -64, -64, -64, 64, 64, -64, -64, -64, 64, -64, -64, -64, -64, -64, -64, 64, 64, 64, -64, 64, -64, 64, 64, 64, -64, -64, -64, -64, -64, -64, -64, 64, -64, -64, -64, -64, 64, -64, -64, -64, 64, 64, 64, -64, 64, 64, 64, 64, -64, 64, -64, -64, -64, -64, -64, -64, -64, -64, 64, 64, -64, 64, -64, 64, -64, -64, -64, -64, 64, 64, -64, -64, 64, 64, -64, -64, -64, -64, -64, -64, -64, -64, -64, -64, -64, -64, 64, -64, -64, -64, -64, -64, -64, -64, -64, -64, -64, -64, 64, 64, -64, -64, -64, -64, 64, -64, -64, -64, -64, -64, -64, -64, -64, -64, 64, -64, -64, -64, -64, -64, -64, -64, -64, -64, 64, 64, -64, -64, -64, -64, -64, -64, 64, -64, -64, -64, -64, -64, -64, -64, -64, -64, -64, -64, -64, -64, -64, -64, -64, -64, 64, 64, 64, -64, 64, -64, 64, -64, -64, -64, -64, -64, -64, -64, -64, -64, -64, 64, -64, 64, -64, -64, -64, 64, -64, -64, -64, -64, -64, -64, 64, -64, 64, 64, -64, -64, 64, 64, -64, -64, -64, -64, -64, 64, -64, 64, -64, 64, -64, -64, -64, -64, -64, -64, -64, -64, 64, -64, 64, 64, -64, 64, 64, -64, 64, -64, 64, -64, -64, -64, 64, 64, -64, 64, 64, 64, -64, -64, -64, 64, -64, -64, -64, -64, -64, 64, -64, -64, -64, -64, -64, -64, -64, -64, -64, 64, -64, 64, -64, 64, 64, -64, 64, 64, -64, -64, -64, -64, -64, 64, -64, -64, 64, -64, -64, -64, 64, 64, -64, -64, -64, -64, -64, -64, -64, 64, 64, 64, -64, -64, 64, 64, -64, -64, -64, -64, -64, -64, -64, -64, 64, -64, 64, -64, -64, 64, -64, -64, 64, 64, 64, -64, 64, 64, 64, -64, -64, -64, 64, 64, -64, -64, 64, -64, 64, -64, -64, 64, 64, -64, 64, -64, -64, -64, -64, -64, 64, 64, 64, 64, 64, 64, 64, 64, 64, 64, 64, 64, -64, 64, -64, 64, 64, -64, -64, -64, 64, -64, 64, -64, -64, 64, 64, -64, 64, -64, 64, 64, 64, 64, 64, 64, 64, 64, 64, 64, 64, 64, -64, 64, -64, -64, -64, -64, -64, -64, -64, -64, -64, -64, -64, -64, -64, -64, 64, 64, 64, 64, 64, 64, 64, 64, -64, 64, 64, -64, 64, 64, -64, -64, 64, -64, 64, 64, -64, -64, -64, -64, 64, -64, -64, -64, -64, 64, 64, -64, -64, 64, 64, 64, 64, -64, -64, 64, 64, -64, -64, 64, 64, -64, 64, -64, 64, -64, -64, 64, 64, -64, -64, 64, 64, 64, 64, -64, -64, 64, -64, -64, -64, 64, 64, -64, -64, 64, -64, -64, 64, 64, 64, -64, 64, 64, -64, 64, -64, 64, 64, 64, -64, 64, 64, 64, -64, 64, 64, 64, 64, -64, -64, -64, -64, -64, 64, 64, -64, -64, 64, -64, 64, 64, 64, 64, -64, 64, -64, 64, -64, -64, -64, -64, -64, -64, -64, -64, -64, -64, -64, 64, 64, 64, -64, -64, -64, 64, -64, 64, 64, -64, 64, 64, -64, -64, -64, -64, 64, -64, -64, -64, -64, -64, -64, -64, -64, -64, -64, 64, 64, 64, 64, -64, -64, 64, 64, -64, -64, 64, 64, 64, -64, 64, 64, -64, -64, -64, -64, -64, -64, -64, -64, -64, -64, -64, 64, -64, 64, -64, 64, 64, 64, -64, 64, 64, 64, 64, 64, -64, -64, 64, 64, -64, -64, -64, -64, -64, -64, -64, -64, -64, 64, 64, 64, 64, -64, -64, -64, 64, 64, 64, 64, 64, 64, 64, -64, 64, 64, 64, 64, 64, 64, 64, 64, -64, 64, -64, -64, 64, 64, 64, 64, -64, 64, 64, 64, 64, 64, 64, 64, -64, 64, 64, -64, 64, -64, 64, 64, 64, 64, -64, -64, -64, 64, 64, 64, 64, 64, 64, 64, -64, -64, 64, 64, 64, 64, 64, -64, 64, 64, 64, 64, -64, 64, 64, 64, 64, 64, -64, -64, 64, 64, 64, 64, 64, 64, 64, 64, 64, -64, 64, 64, 64, 64, 64, -64, -64, 64, 64, 64, -64, 64, 64, 64, 64, 64, -64, 64, 64, 64, 64, 64, 64, 64, 64, 64, -64, 64, 64, 64, 64, -64, -64, 64, -64, 64, 64, -64, -64, -64, -64, 64, -64, -64, 64, -64, 64, 64, 64, 64, 64, 64, 64, -64, -64, 64, 64, 64, 64, -64, -64, 64, -64, -64, 64, 64, 64, 64, -64, 64, 64, 64, 64, 64, 64, 64, 64, 64, 64, 64, 64, 64, 64, 64, 64, 64, 64, -64, -64, -64, 64, 64, -64, 64, 64, 64, -64, 64, 64, 64, 64, 64, 64, 64, 64, 64, 64, 64, 64, 64, 64, 64, 64, 64, 64, 64, -64, 64, -64, 64, -64, -64, -64, -64, 64, 64, 64, 64, 64, 64, 64, 64, 64, 64, -64, 64, 64, 64, 64, 64, -64, 64, 64, 64, -64, 64, 64, 64, -64, -64, -64, -64, -64, -64, -64, 64, 64, -64, 64, 64, -64, -64, -64, -64, 64, -64, 64, 64, 64, 64, 64, 64, -64, -64, 64, -64, -64, -64, -64, -64, 64, 64, 64, -64, 64, 64, 64, -64, -64, -64, -64, 64, 64, -64, 64, -64, 64, 64, 64, 64, -64, 64, 64, 64, -64, -64, 64, -64, -64, -64, -64, 64, 64, -64, -64, 64, -64, 64, -64, -64, -64, 64, -64, 64, 64, 64, 64, -64, 64, 64, 64, -64, -64, 64, -64, 64, 64, 64, 64, -64, 64, -64, 64, -64, -64, -64, 64, -64, 64, 64, 64, 64, 64, 64, 64, -64, 64, 64, 64, -64, -64, 64, -64, 64, 64, -64, -64, -64, 64, 64, 64, -64, -64, -64, -64, 64, 64, 64, -64, -64, 64, 64, -64, 64, -64, -64, -64, 64, -64, -64, 64, 64, 64, -64, 64, 64, 64, 64, -64, -64, -64, -64, -64, 64, 64, -64, -64, -64, -64, -64, -64, -64, -64, -64, 64, -64, -64, -64, 64, 64, -64, -64, 64, 64, 64, 64, 64, -64, -64, -64, -64, 64, -64, -64, -64, -64, -64, -64, -64, -64, -64, -64, -64, 64, 64, -64, 64, -64, 64, 64, 64, -64, 64, 64, 64, 64, -64, 64, 64, -64, 64, -64, -64, -64, -64, -64, -64, -64, -64, -64, 64, -64, 64, -64, 64, 64, 64, -64, -64, 64, -64, 64, 64, 64, -64, 64, 64, -64, -64, -64, 64, -64, 64, -64, 64, 64, 64, -64, -64, -64, 64, -64, -64, -64, 64, -64, 64, 64, 64, 64, 64, 64, 64, 64, 64, 64, 64, 64, 64, 64, 64, 64, -64, -64, -64, -64, -64, 64, 64, -64, -64, 64, 64, 64, 64, 64, 64, 64, 64, 64, 64, 64, 64, 64, 64, 64, 64, 64, 64, 64, -64, -64, 64, -64, -64, 64, -64, -64, -64, -64, 64, 64, 64, 64, 64, 64, 64, 64, 64, -64, 64, -64, 64, -64, -64, 64, -64, 64, -64, -64, -64, 64, -64, 64, 64, -64, -64, -64, 64, -64, 64, 64, -64, -64, 64, -64, 64, 64, 64, -64, 64, 64, 64, 64, -64, 64, 64, 64, -64, -64, 64, 64, -64, 64, 64, -64, 64, 64, 64, -64, -64, 64, 64, 64, -64, 64, -64, -64, 64, 64, 64, 64, 64, -64, -64, -64, 64, -64, 64, 64, 64, -64, -64, 64, -64, 64, 64, 64, 64, 64, 64, 64, -64, 64, -64, 64, -64, 64, 64, -64, -64, 64, 64, 64, 64, 64, 64, 64, 64, 64, -64, -64, 64, -64, -64, 64, -64, -64, 64, 64, 64, 64, 64, 64, 64, -64, -64, 64, -64, 64, 64, 64, 64, 64, -64, 64, 64, 64, 64, -64, 64, 64, -64, -64, -64, -64, -64, 64, -64, 64, -64, 64, 64, -64, 64, -64, -64, 64, -64, 64, 64, -64, 64, -64, -64, 64, 64, -64, 64, 64, -64, -64, 64, 64, -64, -64, -64, -64, 64, -64, -64, 64, -64, -64, 64, -64, -64, 64, 64, 64, -64, -64, -64, 64, 64, -64, 64, 64, 64, -64, 64, -64, 64, 64, -64, -64, 64, 64, -64, 64, -64, -64, -64, 64, -64, -64, -64, 64, -64, 64, 64, 64, 64, -64, 64, 64, 64, 64, 64, -64, 64, 64, -64, -64, 64, -64, 64, -64, -64, -64, -64, 64, 64, -64, 64, -64, -64, -64, -64, 64, 64, 64, -64, -64, 64, 64, 64, 64, -64, 64, 64, -64, -64, -64, -64, -64, -64, -64, -64, -64, -64, 64, -64, 64, -64, 64, 64, -64, 64, 64, 64, 64, 64, 64, 64, -64, -64, 64, 64, -64, 64, 64, -64, -64, -64, 64, 64, -64, -64, -64, 64, 64, 64, -64, -64, 64, -64, -64, -64, 64, -64, -64, -64, -64, 64, -64, -64, -64, -64, -64, -64, -64, -64, -64, 64, -64, -64, -64, -64, -64, -64, -64, 64, -64, 64, -64, -64, -64, -64, -64, -64, -64, -64, 64, -64, 64, -64, -64, 64, -64, 64, -64, -64, -64, 64, 64, 64, -64, -64, -64, -64, 64, -64, 64, -64, -64, -64, -64, -64, 64, 64, 64, -64, 64, -64, -64, -64, -64, -64, -64, -64, 64, 64, 64, -64, -64, -64, 64, 64, -64, -64, 64, 64, -64, -64, -64, -64, -64, 64, 64, -64, -64, 64, -64, -64, -64, 64, -64, -64, 64, 64, 64, 64, -64, -64, -64, -64, -64, 64, 64, -64, 64, -64, -64, 64, -64, 64, -64, -64, 64, -64, -64, 64, 64, -64, -64, 64, -64, -64, 64, 64, 64, -64, -64, -64, 64, 64, -64, 64, 64, -64, -64, -64, -64, -64, -64, -64, -64, 64, -64, -64, -64, 64, -64, -64, -64, -64, -64, -64, 64, -64, -64, -64, 64, -64, -64, 64, -64, 64, -64, -64, -64, -64, -64, -64, -64, 64, 64, -64, 64, -64, 64, 64, -64, 64, -64, -64, -64, 64, 64, 64, 64, -64, -64, 64, 64, -64, -64, -64, -64, -64, -64, -64, -64, -64, 64, -64, -64, 64, -64, -64, 64, -64, 64, -64, -64, -64, 64, -64, -64, 64, 64, -64, -64, -64, -64, 64, 64, -64, -64, -64, 64, -64, -64, -64, -64, -64, -64, -64, 64, 64, 64, -64, -64, -64, 64, 64, 64, 64, -64, -64, -64, -64, -64, -64, 64, -64, -64, 64, -64, -64, -64, 64, -64, 64, 64, -64, 64, -64, -64, -64, -64, -64, -64, 64, -64, 64, 64, -64, -64, -64, -64, -64, -64, 64, -64, -64, -64, -64, -64, -64, -64, -64, -64, -64, -64, -64, -64, -64, -64, 64, -64, 64, 64, -64, 64, -64, -64, -64, -64, -64, -64, -64, -64, -64, -64, -64, -64, -64, -64, -64, -64, 64, 64, -64, -64, -64, -64, -64, 64, 64, 64, 64, 64, -64, -64, 64, -64, 64, -64, -64, -64, -64, -64, -64, -64, 64, -64, -64, -64, -64, -64, -64, -64, -64, 64, 64, -64, -64, -64, 64, -64, -64, -64, 64, -64, -64, -64, 64, -64, -64, -64, 64, -64, 64, 64, 64, -64, -64, 64, -64, -64, -64, -64, -64, -64, 64, 64, -64, -64, 64, -64, 64, -64, -64, 64, 64, 64, -64, 64, 64, -64, 64, 64, 64, 64, -64, -64, -64, -64, -64, 64, -64, -64, 64, 64, -64, -64, 64, 64, 64, 64, 64, -64, -64, -64, 64, -64, -64, 64, -64, 64, -64, -64, -64, -64, -64, -64, -64, -64, -64, -64, 64, 64, -64, 64, 64, -64, -64, 64, 64, -64, -64, 64, 64, 64, 64, 64, 64, -64, -64, -64, -64, -64, 64, -64, -64, -64, 64, -64, 64, -64, -64, 64, 64, 64, -64, 64, 64, 64, -64, 64, 64, 64, 64, 64, 64, -64, -64, -64, -64, -64, -64, -64, -64, -64, -64, -64, -64, -64, 64, 64, 64, -64, 64, -64, 64, -64, -64, -64, 64, 64, -64, 64, -64, -64, -64, -64, 64, -64, -64, 64, -64, 64, -64, -64, 64, -64, -64, -64, -64, -64, -64, -64, -64, 64, -64, 64, 64, 64, -64, -64, 64, -64, 64, 64, 64, 64, 64, 64, 64, 64, 64, 64, -64, -64, -64, -64, -64, -64, 64, -64, -64, 64, -64, -64, 64, -64, 64, -64, -64, 64, 64, 64, -64, 64, 64, 64, 64, -64, -64, -64, 64, -64, -64, -64, 64, -64, 64, -64, -64, 64, 64, 64, -64, 64, 64, -64, 64, 64, -64, -64, -64, 64, -64, -64, 64, 64, 64, -64, -64, -64, 64, 64, -64, 64, -64, 64, 64, 64, 64, -64, -64, 64, -64, 64, 64, 64, -64, 64, 64, 64, 64, 64, 64, 64, 64, 64, -64, -64, -64, -64, 64, -64, -64, 64, -64, -64, 64, 64, 64, 64, 64, 64, 64, 64, 64, -64, 64, 64, -64, 64, 64, 64, 64, 64, -64, -64, 64, 64, 64, 64, 64, 64, -64, -64, 64, -64, 64, -64, -64, 64, -64, 64, 64, -64, -64, -64, 64, 64, 64, 64, 64, -64, -64, 64, 64, 64, -64, -64, -64, 64, 64, 64, 64, -64, -64, -64, 64, 64, -64, 64, 64, -64, -64, 64, 64, 64, 64, 64, -64, -64, 64, 64, 64, -64, -64, 64, 64, 64, -64, 64, 64, 64, 64, -64, -64, 64, 64, 64, 64, 64, -64, -64, 64, 64, 64, 64, -64, -64, -64, 64, -64, -64, 64, -64, -64, -64, -64, 64, 64, 64, 64, -64, -64, 64, 64, 64, 64, 64, 64, 64, 64, 64, 64, 64, 64, 64, 64, -64, 64, -64, -64, -64, -64, -64, 64, 64, 64, 64, 64, 64, 64, 64, 64, 64, 64, -64, -64, 64, 64, 64, 64, 64, 64, 64, -64, -64, 64, 64, -64, -64, -64, -64, 64, 64, 64, 64, 64, -64, 64, -64, 64, -64, -64, -64, -64, 64, 64, 64, 64, 64, 64, -64, -64, 64, -64, 64, -64, -64, -64, 64, 64, 64, 64, 64, 64, 64, -64, -64, 64, -64, -64, -64, 64, 64, 64, 64, 64, -64, 64, -64, 64, 64, -64, -64, -64, -64, 64, 64, 64, 64, 64, 64, -64, -64, -64, -64, -64, 64, 64, -64, 64, 64, 64, 64, 64, -64, 64, -64, 64, -64, -64, -64, -64, -64, 64, 64, 64, 64, 64, 64, -64, -64, -64, 64, 64, 64, 64, 64, 64, 64, -64, 64, -64, 64, -64, 64, -64, 64, 64, 64, -64, -64, 64, 64, 64, 64, -64, -64, -64, -64, -64, 64, 64, 64, 64, 64, 64, 64, 64, 64, 64, 64, -64, 64, 64, -64, 64, 64, -64, -64, 64, 64, 64, 64, 64, -64, -64, 64, 64, 64, 64, 64, 64, 64, 64, 64, 64, 64, 64, 64, -64, 64, -64, 64, 64, -64, -64, -64, -64, 64, 64, 64, 64, 64, 64, 64, 64, 64, 64, -64, 64, 64, 64, -64, -64, -64, 64, -64, -64, 64, -64, -64, -64, -64, -64, -64, 64, -64, 64, 64, -64, 64, -64, 64, 64, 64, 64, 64, 64, 64, 64, -64, -64, -64, -64, -64, 64, 64, 64, 64, -64, -64, -64, -64, -64, -64, 64, -64, 64, 64, 64, 64, -64, 64, -64, -64, 64, 64, -64, -64, -64, -64, -64, -64, 64, 64, -64, 64, -64, -64, -64, -64, -64, -64, 64, -64, 64, -64, -64, 64, -64, 64, -64, -64, 64, 64, -64, -64, -64, -64, -64, 64, 64, -64, -64, 64, 64, -64, 64, -64, 64, 64, 64, 64, 64, 64, 64, 64, 64, 64, -64, -64, -64, 64, 64, 64, -64, -64, -64, -64, -64, 64, -64, 64, -64, 64, -64, 64, 64, 64, -64, -64, 64, -64, 64, 64, 64, 64, 64, 64, 64, 64, 64, -64, -64, -64, 64, -64, -64, -64, -64, 64, 64, -64, 64, 64, -64, -64, 64, 64, 64, 64, 64, -64, 64, 64, -64, -64, 64, -64, -64, -64, -64, -64, 64, 64, -64, 64, 64, -64, 64, -64, -64, -64, -64, 64, 64, 64, 64, 64, 64, 64, 64, 64, 64, -64, 64, -64, -64, -64, -64, 64, 64, -64, 64, 64, -64, 64, -64, -64, 64, -64, 64, 64, -64, 64, 64, 64, 64, 64, 64, 64, 64, 64, -64, -64, -64, -64, -64, 64, -64, 64, 64, -64, -64, -64, 64, 64, -64, -64, -64, -64, -64, -64, 64, -64, 64, 64, 64, 64, 64, 64, 64, -64, -64, -64, 64, 64, 64, -64, -64, 64, -64, 64, -64, 64, 64, -64, 64, 64, -64, 64, 64, 64, 64, 64, -64, -64, 64, 64, 64, -64, -64, 64, 64, 64, -64, 64, 64, -64, -64, 64, 64, 64, 64, -64, -64, -64, 64, 64, 64, 64, 64, 64, 64, 64, 64, -64, -64, 64, 64, 64, 64, 64, -64, 64, 64, 64, -64, 64, 64, -64, -64, 64, 64, 64, 64, 64, 64, 64, -64, 64, -64, 64, -64, 64, 64, 64, 64, -64, -64, 64, 64, -64, -64, 64, -64, -64, -64, -64, 64, -64, 64, 64, -64, -64, 64, 64, -64, -64, 64, -64, -64, -64, -64, -64, -64, -64, 64, -64, -64, -64, 64, 64, -64, 64, -64, 64, 64, 64, 64, 64, 64, 64, -64, 64, 64, 64, -64, -64, 64, 64, 64, -64, -64, 64, 64, 64, -64, -64, -64, 64, 64, -64, 64, -64, 64, -64, 64, -64, 64, -64, -64, 64, 64, 64, -64, 64, -64, 64, -64, -64, -64, 64, 64, 64, 64, 64, 64, -64, 64, -64, 64, 64, 64, 64, 64, 64, 64, 64, 64, 64, 64, 64, 64, 64, 64, 64, -64, 64, -64, -64, -64, -64, 64, 64, -64, 64, -64, -64, 64, 64, 64, 64, -64, 64, 64, 64, 64, 64, 64, 64, 64, 64, 64, 64, 64, 64, 64, -64, -64, -64, 64, 64, -64, -64, -64, -64, -64, 64, 64, 64, 64, 64, 64, 64, 64, -64, -64, -64, -64, -64, 64, 64, 64, -64, -64, -64, -64, 64, 64, 64, 64, 64, 64, -64, -64, 64, 64, -64, 64, 64, 64, 64, -64, -64, -64, -64, -64, -64, -64, -64, 64, 64, 64, -64, 64, 64, 64, -64, -64, 64, -64, -64, 64, 64, -64, -64, 64, 64, -64, 64, 64, 64, 64, -64, -64, -64, -64, -64, -64, 64, 64, -64, -64, -64, -64, -64, -64, -64, -64, 64, -64, -64, -64, -64, 64, -64, 64, 64, 64, 64, 64, -64, -64, -64, -64, -64, -64, -64, -64, -64, -64, -64, -64, -64, -64, 64, 64, -64, -64, -64, -64, -64, 64, -64, 64, 64, 64, 64, -64, -64, -64, -64, -64, -64, -64, -64, -64, -64, -64, -64, -64, -64, -64, 64, -64, -64, 64, -64, 64, -64, -64, 64, 64, 64, -64, -64, -64, -64, -64, -64, 64, -64, -64, -64, -64, -64, -64, -64, -64, -64, 64, -64, -64, 64, 64, -64, 64, -64, 64, 64, -64, -64, -64, -64, -64, -64, -64, -64, 64, 64, 64, -64, -64, -64, -64, -64, -64, 64, 64, -64, -64, 64, 64, 64, 64, -64, -64, -64, -64, -64, -64, -64, -64, -64, 64, 64, 64, 64, 64, 64, 64, -64, -64, 64, 64, 64, 64, 64, 64, 64, 64, -64, -64, -64, -64, -64, -64, -64, -64, -64, -64, -64, 64, 64, 64, -64, 64, 64, -64, -64, 64, 64, -64, 64, 64, 64, 64, 64, 64, -64, -64, -64, -64, -64, -64, -64, -64, -64, -64, -64, 64, 64, 64, -64, 64, -64, -64, 64, 64, 64, -64, 64, 64, 64, 64, 64, 64, 64, 64, 64, 64, -64, -64, -64, -64, -64, -64, 64, 64, -64, -64, -64, -64, 64, 64, -64, 64, 64, 64, 64, -64, 64, 64, -64, 64, -64, -64, -64, -64, -64, -64, -64, -64, -64, 64, 64, 64, -64, -64, -64, -64, 64, 64, 64, 64, 64, 64, 64, -64, 64, 64, 64, 64, 64, 64, -64, -64, -64, -64, -64, -64, -64, -64, 64, -64, 64, -64, -64, -64, -64, -64, -64, -64, 64, 64, 64, 64, 64, 64, 64, 64, 64, 64, 64, -64, 64, -64, -64, 64, 64, -64, -64, -64, -64, -64, -64, 64, 64, 64, 64, 64, 64, 64, 64, -64, 64, 64, -64, 64, 64, 64, 64, -64, -64, -64, 64, 64, 64, 64, -64, 64, -64, -64, -64, 64, 64, 64, 64, 64, 64, 64, -64, 64, -64, -64, 64, -64, 64, -64, 64, 64, 64, 64, -64, 64, 64, 64, 64, 64, 64, -64, 64, 64, 64, 64, 64, 64, 64, 64, 64, -64, -64, -64, 64, -64, 64, 64, 64, 64, 64, 64, 64, 64, 64, 64, 64, -64, -64, 64, 64, 64, 64, 64, 64, 64, -64, -64, 64, -64, 64, 64, 64, 64, 64, -64, 64, 64, -64, -64, -64, 64, -64, 64, -64, -64, 64, 64, 64, 64, 64, -64, -64, -64, -64, -64, -64, 64, 64, -64, 64, 64, 64, -64, 64, 64, -64, -64, 64, 64, -64, -64, 64, -64, 64, -64, -64, 64, -64, -64, 64, -64, -64, -64, -64, 64, 64, 64, 64, -64, -64, 64, -64, -64, 64, -64, -64, 64, -64, -64, -64, -64, -64, -64, -64, -64, -64, -64, 64, 64, -64, -64, -64, 64, -64, 64, 64, 64, -64, 64, -64, -64, -64, -64, 64, -64, -64, -64, 64, -64, -64, -64, -64, 64, 64, -64, 64, 64, 64, -64, -64, 64, 64, 64, -64, 64, -64, 64, 64, -64, 64, 64, -64, 64, -64, -64, 64, 64, -64, 64, 64, 64, 64, 64, 64, -64, -64, 64, -64, 64, 64, -64, -64, -64, -64, -64, 64, -64, -64, -64, 64, 64, 64, 64, -64, -64, 64, 64, -64, 64, 64, -64, 64, 64, 64, -64, 64, -64, -64, -64, -64, -64, -64, -64, -64, 64, -64, -64, 64, -64, 64, 64, 64, -64, 64, 64, -64, 64, -64, 64, 64, -64, -64, 64, 64, -64, -64, -64, -64, -64, 64, 64, 64, -64, -64, 64, -64, 64, -64, -64, 64, 64, -64, 64, -64, 64, 64, 64, -64, 64, 64, 64, -64, 64, 64, 64, -64, -64, -64, -64, -64, -64, 64, 64, 64, -64, -64, -64, -64, -64, -64, -64, 64, 64, -64, -64, -64, 64, 64, -64, 64, 64, -64, -64, -64, -64, -64, -64, -64, -64, -64, -64, 64, -64, -64, -64, -64, -64, 64, -64, -64, -64, 64, -64, 64, -64, -64, 64, -64, 64, -64, -64, 64, -64, -64, -64, -64, -64, -64, 64, -64, -64, 64, -64, 64, -64, 64, -64, -64, -64, 64, -64, 64, 64, -64, -64, -64, 64, -64, 64, -64, 64, 64, -64, -64, 64, 64, -64, 64, 64, -64, -64, -64, -64, 64, -64, -64, 64, -64, 64, 64, -64, 64, -64, 64, -64, -64, 64, -64, -64, 64, 64, 64, -64, 64, -64, -64, -64, -64, -64, -64, -64, -64, -64, -64, 64, 64, -64, 64, -64, 64, 64, -64, -64, 64, -64, 64, -64, -64, -64, 64, -64, -64, -64, -64, 64, 64, -64, -64, -64, -64, -64, -64, -64, 64, -64, 64, -64, -64, -64, 64, -64, 64, 64, -64, 64, -64, -64, -64, -64, -64, -64, -64, 64, -64, -64, -64, -64, -64, -64, -64, -64, 64, -64, -64, -64, -64, -64, -64, -64, 64, 64, 64, 64, -64, -64, 64, 64, -64, -64, -64, 64, -64, -64, -64, -64, -64, -64, -64, -64, -64, 64, 64, -64, -64, -64, -64, -64, -64, -64, -64, -64, -64, 64, -64, 64, 64, -64, -64, 64, -64, -64, -64, -64, -64, -64, -64, -64, 64, -64, -64, 64, -64, -64, -64, -64, -64, -64, 64, 64, -64, 64, 64, 64, -64, -64, 64, -64, -64, -64, -64, -64, -64, -64, -64, -64, 64, -64, 64, -64, -64, -64, -64, -64, -64, -64, 64, 64, -64, 64, -64, -64, 64, -64, 64, -64, 64, 64, -64, 64, -64, -64, 64, -64, 64, 64, 64, -64, -64, -64, -64, -64, 64, 64, 64, 64, -64, 64, -64, -64, 64, 64, -64, -64, -64, -64, 64, -64, -64, -64, -64, -64, 64, 64, -64, 64, -64, -64, -64, -64, 64, 64, -64, 64, 64, -64, 64, -64, -64, 64, -64, 64, 64, -64, 64, 64, 64, -64, -64, 64, 64, -64, -64, -64, -64, -64, -64, 64, 64, 64, 64, 64, -64, -64, -64, 64, -64, -64, 64, -64, 64, 64, 64, 64, 64, 64, -64, -64, 64, 64, -64, -64, -64, -64, 64, 64, -64, -64, -64, 64, 64, -64, 64, -64, -64, 64, 64, -64, -64, 64, -64, -64, 64, 64, -64, -64, 64, -64, 64, -64, -64, -64, 64, -64, -64, 64, -64, -64, 64, -64, 64, 64, -64, 64, 64, 64, 64, -64, -64, -64, -64, -64, -64, 64, 64, -64, -64, -64, -64, -64, -64, -64, 64, 64, -64, 64, -64, -64, -64, 64, -64, -64, 64, -64, -64, -64, 64, -64, 64, -64, 64, -64, 64, -64, -64, -64, -64, 64, 64, 64, -64, 64, -64, -64, -64, -64, 64, -64, -64, -64, 64, 64, 64, 64, -64, 64, 64, -64, -64, 64, -64, -64, -64, -64, -64, -64, -64, 64, 64, 64, 64, 64, 64, -64, 64, 64, 64, 64, -64, -64, 64, 64, -64, -64, -64, -64, -64, 64, 64, -64, 64, 64, -64, -64, 64, -64, -64, 64, 64, -64, -64, -64, 64, 64, 64, -64, -64, -64, -64, -64, -64, -64, -64, -64, 64, 64, 64, -64, 64, 64, -64, 64, 64, -64, -64, 64, -64, 64, 64, -64, -64, 64, -64, 64, -64, -64, 64, 64, -64, -64, -64, 64, -64, 64, -64, -64, -64, 64, 64, -64, 64, -64, 64, -64, 64, -64, 64, 64, -64, 64, -64, 64, -64, -64, -64, -64, -64, -64, -64, 64, -64, -64, -64, -64, -64, -64, -64, 64, -64, 64, -64, -64, 64, 64, -64, 64, -64, -64, -64, -64, -64, 64, -64, -64, -64, -64, -64, -64, 64, 64, 64, 64, 64, 64, 64, -64, 64, -64, 64, -64, 64, 64, 64, -64, -64, -64, -64, -64, -64, -64, 64, -64, 64, -64, -64, -64, -64, -64, -64, 64, 64, 64, 64, 64, 64, 64, -64, -64, 64, -64, 64, -64, -64, 64, -64, 64, -64, -64, 64, 64, 64, -64, -64, -64, 64, 64, -64, 64, 64, -64, -64, -64, -64, -64, -64, 64, -64, 64, -64, -64, -64, -64, -64, 64, 64, 64, -64, 64, -64, -64, -64, -64, -64, -64, -64, 64, 64, 64, -64, -64, -64, 64, 64, -64, -64, 64, -64, -64, 64, 64, 64, -64, 64, 64, -64, -64, 64, -64, -64, -64, 64, 64, -64, -64, -64, 64, -64, -64, 64, -64, 64, 64, 64, -64, -64, -64, 64, 64, -64, -64, 64, 64, -64, -64, 64, 64, -64, -64, -64, -64, -64, -64, 64, -64, 64, -64, 64, -64, 64, -64, -64, 64, 64, -64, 64, 64, -64, 64, -64, -64, -64, -64, 64, -64, -64, 64, -64, 64, -64, -64, 64, -64, 64, 64, -64, 64, 64, -64, -64, -64, -64, 64, 64, -64, -64, -64, -64, -64, -64, 64, -64, -64, -64, -64, -64, 64, 64, -64, -64, -64, -64, -64, -64, 64, 64, -64, -64, 64, -64, 64, 64, 64, 64, -64, -64, 64, 64, -64, 64, 64, -64, -64, -64, -64, -64, 64, -64, -64, -64, -64, -64, 64, -64, 64, -64, -64, -64, 64, -64, -64, 64, 64, -64, -64, -64, -64, -64, -64, 64, 64, 64, 64, -64, 64, -64, 64, -64, -64, -64, -64, -64, -64, -64, -64, 64, 64, -64, -64, -64, 64, -64, -64, 64, -64, -64, -64, -64, -64, -64, -64, -64, 64, -64, -64, -64, -64, -64, 64, 64, -64, 64, -64, 64, -64, 64, 64, 64, -64, 64, -64, 64, -64, -64, -64, -64, -64, -64, -64, 64, 64, -64, -64, -64, 64, 64, -64, 64, -64, -64, 64, 64, 64, 64, 64, 64, -64, -64, -64, -64, -64, -64, -64, 64, -64, -64, -64, 64, 64, 64, 64, 64, -64, -64, 64, 64, 64, -64, 64, -64, 64, 64, 64, 64, -64, -64, -64, -64, -64, 64, 64, -64, 64, -64, 64, -64, 64, 64, 64, 64, 64, -64, -64, 64, 64, 64, -64, -64, 64, -64, -64, -64, -64, -64, -64, 64, -64, -64, -64, 64, 64, 64, 64, -64, -64, -64, -64, -64, -64, -64, -64, 64, 64, 64, 64, 64, 64, 64, -64, -64, -64, -64, -64, -64, -64, 64, 64, 64, 64, -64, 64, -64, -64, -64, -64, -64, -64, -64, -64, 64, -64, 64, 64, 64, 64, -64, -64, -64, -64, -64, 64, -64, 64, 64, -64, -64, 64, -64, -64, -64, -64, -64, -64, -64, -64, -64, 64, 64, -64, -64, 64, -64, 64, -64, -64, -64, -64, -64, 64, -64, 64, -64, -64, -64, 64, -64, -64, -64, -64, -64, -64, -64, -64, 64, -64, 64, 64, 64, -64, 64, -64, 64, -64, -64, -64, -64, -64, -64, -64, -64, -64, -64, -64, 64, -64, -64, -64, 64, -64, -64, -64, -64, 64, -64, 64, 64, -64, -64, -64, -64, 64, -64, -64, -64, 64, -64, 64, -64, -64, 64, -64, -64, 64, -64, 64, 64, -64, -64, 64, -64, 64, 64, 64, 64, 64, -64, 64, -64, 64, -64, -64, -64, -64, -64, -64, -64, -64, -64, 64, -64, 64, 64, 64, -64, -64, 64, 64, -64, 64, 64, -64, 64, 64, -64, 64, 64, 64, -64, 64, -64, 64, -64, -64, -64, 64, 64, 64, 64, -64, -64, 64, -64, 64, 64, 64, 64, -64, -64, -64, 64, -64, 64, -64, 64, 64, -64, 64, 64, 64, 64, 64, 64, 64, -64, -64, -64, -64, 64, -64, -64, -64, -64, -64, 64, -64, 64, 64, -64, -64, -64, 64, 64, 64, -64, -64, -64, 64, 64, -64, -64, 64, -64, -64, -64, -64, 64, 64, 64, -64, -64, 64, 64, -64, 64, 64, -64, 64, -64, 64, -64, 64, -64, -64, -64, -64, -64, -64, 64, -64, -64, -64, -64, -64, 64, 64, -64, -64, -64, -64, 64, -64, 64, 64, -64, -64, 64, 64, -64, -64, -64, -64, -64, 64, -64, -64, -64, -64, -64, -64, -64, -64, 64, -64, -64, -64, 64, -64, 64, -64, -64, -64, -64, 64, -64, -64, -64, -64, -64, 64, 64, -64, 64, -64, -64, -64, 64, -64, 64, 64, 64, -64, -64, 64, -64, -64, -64, -64, 64, 64, 64, -64, 64, -64, -64, -64, -64, -64, -64, 64, 64, -64, 64, -64, 64, 64, -64, -64, -64, -64, -64, -64, 64, -64, 64, 64, -64, 64, 64, 64, 64, 64, 64, 64, 64, 64, 64, -64, -64, -64, -64, -64, 64, 64, 64, 64, -64, -64, -64, 64, 64, -64, 64, 64, 64, 64, 64, 64, -64, 64, 64, -64, -64, -64, -64, 64, 64, -64, -64, 64, 64, -64, 64, 64, -64, -64, -64, 64, 64, -64, 64, 64, 64, -64, 64, -64, -64, 64, 64, -64, 64, 64, 64, 64, -64, -64, -64, -64, -64, -64, -64, -64, -64, -64, -64, -64, -64, -64, 64, -64, -64, 64, -64, 64, -64, -64, -64, 64, -64, -64, -64, -64, -64, 64, -64, 64, -64, -64, -64, -64, 64, 64, -64, -64, -64, 64, 64, -64, -64, 64, -64, 64, 64, 64, 64, 64, 64, -64, -64, -64, 64, -64, 64, 64, 64, -64, -64, 64, 64, 64, 64, -64, 64, 64, -64, 64, -64, -64, 64, 64, -64, -64, -64, -64, -64, -64, 64, -64, 64, -64, 64, 64, -64, -64, 64, 64, 64, -64, -64, 64, -64, -64, -64, 64, 64, -64, -64, -64, 64, 64, -64, -64, 64, -64, 64, -64, 64, 64, 64, 64, -64, 64, 64, 64, 64, 64, -64, 64, -64, 64, 64, 64, 64, -64, -64, -64, -64, 64, -64, 64, 64, 64, 64, 64, 64, -64, 64, 64, 64, 64, 64, 64, 64, 64, -64, -64, 64, 64, 64, 64, -64, -64, 64, -64, -64, 64, -64, 64, 64, 64, 64, 64, 64, 64, 64, 64, 64, 64, 64, 64, 64, 64, -64, -64, 64, -64, 64, -64, 64, 64, -64, 64, 64, 64, 64, 64, 64, 64, 64, 64, 64, 64, 64, 64, 64, -64, 64, -64, 64, 64, 64, -64, 64, 64, -64, -64, -64, -64, -64, 64, -64, -64, 64, 64, 64, -64, 64, 64, 64, 64, 64, 64, 64, 64, -64, -64, -64, -64, 64, -64, -64, -64, -64, -64, -64, 64, 64, 64, -64, -64, 64, 64, 64, 64, 64, 64, 64, 64, 64, 64, 64, 64, -64, -64, -64, -64, 64, 64, -64, -64, -64, -64, -64, 64, 64, -64, 64, -64, 64, 64, 64, -64, 64, -64, -64, 64, 64, 64, 64, 64, -64, -64, -64, 64, -64, 64, -64, -64, -64, -64, -64, -64, 64, 64, 64, 64, 64, 64, 64, 64, 64, -64, 64, -64, -64, 64, 64, 64, 64, 64, 64, -64, -64, -64, -64, 64, -64, -64, -64, -64, -64, -64, -64, 64, 64, -64, -64, 64, 64, -64, -64, 64, -64, 64, 64, 64, -64, 64, 64, -64, -64, 64, -64, -64, -64, -64, -64, -64, -64, -64, -64, -64, 64, 64, 64, 64, -64, -64, -64, -64, -64, 64, 64, 64, 64, -64, -64, 64, -64, -64, -64, 64, 64, -64, -64, -64, -64, -64, 64, -64, -64, -64, 64, -64, -64, -64, -64, -64, -64, -64, 64, -64, -64, 64, 64, -64, 64, 64, 64, 64, 64, 64, -64, 64, -64, -64, -64, -64, 64, -64, 64, -64, -64, -64, -64, -64, -64, -64, 64, 64, 64, 64, -64, 64, 64, 64, 64, 64, 64, -64, 64, 64, 64, -64, 64, -64, 64, 64, 64, -64, -64, 64, 64, -64, 64, 64, 64, 64, 64, 64, 64, 64, 64, 64, 64, 64, 64, 64, -64, 64, 64, 64, 64, 64, 64, 64, -64, -64, -64, 64, 64, 64, 64, 64, 64, 64, 64, 64, 64, -64, 64, 64, 64, 64, -64, 64, -64, -64, 64, -64, -64, 64, 64, 64, -64, 64, 64, 64, 64, 64, -64, 64, 64, -64, 64, 64, -64, -64, 64, 64, -64, 64, -64, 64, -64, 64, 64, 64, -64, -64, 64, -64, -64, 64, 64, 64, 64, -64, 64, 64, -64, -64, 64, -64, 64, 64, 64, 64, 64, 64, 64, 64, -64, -64, -64, 64, -64, 64, 64, -64, 64, 64, -64, -64, -64, 64, -64, 64, -64, -64, -64, 64, 64, 64, 64, 64, 64, 64, 64, 64, 64, 64, 64, -64, -64, 64, -64, 64, 64, 64, -64, 64, 64, 64, 64, 64, 64, -64, -64, 64, 64, 64, 64, 64, 64, 64, 64, 64, 64, -64, -64, 64, 64, -64, 64, 64, 64, 64, 64, 64, 64, 64, 64, 64, -64, -64, -64, 64, 64, 64, 64, 64, 64, -64, 64, -64, 64, -64, -64, -64, 64, 64, 64, 64, 64, 64, 64, 64, 64, 64, 64, -64, -64, -64, 64, 64, 64, 64, -64, 64, -64, -64, 64, -64, 64, -64, -64, 64, 64, 64, 64, 64, 64, 64, 64, -64, 64, 64, -64, 64, -64, -64, -64, 64, 64, 64, 64, 64, 64, 64, 64, 64, -64, 64, -64, -64, 64, -64, 64, 64, 64, -64, 64, 64, -64, -64, 64, -64, -64, 64, 64, 64, 64, 64, 64, 64, 64, -64, -64, 64, 64, 64, 64, 64, 64, -64, 64, 64, 64, 64, -64, 64, -64, -64, -64, -64, -64, 64, 64, 64, 64, 64, 64, -64, -64, -64, -64, 64, -64, 64, 64, -64, 64, 64, -64, 64, -64, 64, -64, 64, -64, -64, -64, -64, -64, -64, 64, 64, -64, -64, -64, -64, -64, -64, -64, 64, 64, 64, 64, 64, 64, -64, 64, -64, -64, 64, -64, -64, -64, -64, -64, -64, -64, -64, 64, 64, 64, 64, 64, -64, -64, -64, -64, -64, 64, -64, -64, -64, 64, -64, -64, -64, -64, 64, 64, 64, 64, 64, 64, 64, 64, -64, 64, -64, 64, -64, -64, -64, -64, -64, 64, 64, 64, 64, 64, 64, 64, 64, -64, -64, 64, -64, 64, -64, 64, -64, -64, -64, 64, -64, 64, 64, 64, -64, -64, 64, -64, 64, -64, -64, -64, 64, 64, -64, -64, 64, 64, 64, 64, -64, -64, 64, 64, 64, 64, -64, -64, 64, 64, 64, 64, -64, -64, 64, 64, 64, -64, 64, 64, 64, 64, 64, -64, -64, -64, -64, 64, 64, -64, -64, -64, -64, 64, 64, -64, 64, 64, -64, -64, -64, -64, 64, 64, -64, -64, 64, 64, -64, 64, 64, 64, 64, -64, -64, -64, 64, -64, -64, 64, -64, -64, 64, -64, -64, -64, -64, -64, -64, -64, -64, 64, 64, 64, 64, -64, -64, -64, -64, 64, -64, 64, -64, 64, 64, -64, -64, -64, 64, -64, 64, -64, -64, 64, -64, -64, -64, -64, 64, 64, -64, 64, 64, 64, -64, -64, -64, -64, -64, -64, -64, -64, -64, 64, 64, 64, 64, 64, -64, 64, 64, 64, -64, 64, 64, -64, 64, -64, -64, 64, 64, -64, -64, 64, -64, -64, 64, -64, -64, -64, -64, -64, 64, 64, 64, 64, -64, 64, 64, 64, 64, 64, 64, 64, -64, 64, 64, -64, 64, 64, -64, 64, 64, -64, -64, 64, -64, -64, -64, 64, 64, 64, -64, 64, -64, 64, 64, 64, 64, 64, 64, 64, 64, 64, 64, 64, 64, -64, -64, -64, 64, 64, -64, -64, 64, 64, -64, -64, -64, 64, 64, -64, 64, 64, 64, 64, 64, 64, 64, 64, 64, 64, 64, 64, -64, -64, 64, 64, -64, 64, 64, -64, 64, 64, -64, -64, 64, 64, 64, 64, 64, 64, 64, 64, 64, 64, 64, 64, 64, 64, -64, 64, -64, -64, -64, -64, 64, 64, -64, 64, 64, 64, 64, -64, -64, 64, 64, 64, 64, 64, 64, 64, 64, 64, 64, 64, 64, 64, 64, 64, -64, 64, -64, 64, -64, 64, -64, 64, -64, -64, -64, -64, 64, -64, -64, 64, 64, 64, 64, -64, 64, 64, 64, 64, 64, 64, 64, 64, 64, -64, 64, 64, 64, 64, -64, 64, -64, 64, -64, 64, -64, -64, 64, 64, 64, 64, 64, 64, 64, 64, 64, 64, -64, 64, 64, -64, -64, -64, 64, 64, 64, -64, 64, -64, 64, -64, 64, -64, -64, 64, 64, 64, 64, 64, 64, 64, -64, 64, 64, 64, -64, 64, 64, 64, -64, 64, -64, 64, -64, -64, -64, -64, 64, 64, -64, 64, -64, 64, 64, 64, 64, 64, 64, 64, 64, -64, 64, 64, 64, 64, 64, 64, -64, 64, -64, 64, 64, -64, 64, -64, 64, 64, 64, 64, 64, 64, 64, 64, 64, 64, 64, 64, 64, -64, -64, 64, -64, 64, 64, 64, 64, 64, -64, -64, -64, -64, 64, -64, 64, -64, -64, -64, 64, 64, 64, 64, 64, -64, -64, 64, -64, 64, -64, -64, 64, 64, 64, 64, 64, 64, -64, -64, -64, 64, 64, 64, 64, 64, 64, -64, 64, 64, 64, 64, 64, 64, -64, 64, -64, 64, 64, -64, 64, 64, 64, 64, 64, 64, 64, 64, -64, 64, 64, 64, 64, 64, 64, 64, 64, 64, 64, 64, 64, 64, -64, -64, 64, -64, -64, -64, -64, 64, -64, 64, 64, -64, -64, 64, -64, -64, 64, 64, 64, 64, 64, 64, 64, 64, 64, 64, -64, 64, 64, 64, 64, 64, 64, -64, -64, 64, -64, 64, -64, 64, 64, 64, 64, 64, 64, -64, 64, 64, 64, 64, 64, 64, 64, 64, 64, 64, -64, 64, -64, 64, -64, -64, -64, 64, -64, 64, -64, 64, -64, -64, 64, 64, -64, 64, 64, 64, 64, -64, -64, 64, 64, 64, -64, 64, -64, -64, -64, 64, 64, 64, 64, 64, 64, 64, -64, -64, 64, -64, -64, -64, 64, 64, 64, 64, -64, -64, 64, 64, 64, 64, 64, -64, -64, -64, -64, 64, 64, -64, -64, -64, 64, 64, -64, 64, 64, 64, -64, -64, 64, 64, 64, -64, 64, -64, 64, 64, 64, 64, 64, -64, -64, -64, 64, -64, 64, 64, 64, 64, -64, 64, 64, -64, 64, -64, -64, -64, 64, 64, 64, -64, 64, 64, 64, 64, 64, -64, 64, 64, 64, -64, 64, 64, 64, 64, 64, -64, 64, 64, -64, -64, -64, -64, 64, 64, 64, -64, 64, -64, 64, 64, 64, -64, 64, 64, -64, 64, -64, 64, -64, 64, 64, -64, 64, -64, -64, 64, 64, -64, 64, -64, -64, 64, 64, -64, 64, -64, 64, 64, 64, -64, -64, 64, -64, -64, -64, -64, -64, -64, 64, 64, -64, 64, -64, 64, -64, -64, 64, 64, -64, 64, 64, 64, -64, -64, -64, 64, 64, 64, -64, -64, -64, -64, 64, -64, -64, -64, 64, 64, -64, 64, -64, 64, -64, 64, -64, 64, 64, -64, 64, -64, 64, -64, -64, 64, -64, 64, -64, -64, 64, -64, -64, -64, -64, 64, -64, 64, -64, -64, -64, -64, -64, 64, -64, -64, -64, 64, -64, -64, 64, 64, -64, 64, 64, 64, 64, -64, -64, 64, -64, -64, -64, -64, 64, 64, -64, 64, -64, -64, 64, 64, -64, 64, -64, -64, -64, 64, -64, 64, -64, -64, 64, -64, -64, -64, -64, -64, -64, 64, 64, -64, -64, 64, 64, 64, 64, 64, -64, -64, 64, 64, -64, -64, 64, -64, 64, -64, -64, -64, -64, -64, -64, -64, -64, -64, -64, -64, -64, -64, -64, -64, 64, -64, 64, 64, 64, -64, -64, -64, 64, -64, -64, 64, 64, 64, -64, -64, -64, -64, -64, -64, -64, -64, -64, 64, -64, -64, -64, 64, 64, -64, 64, 64, -64, -64, -64, 64, 64, 64, -64, -64, -64, -64, 64, -64, -64, -64, -64, 64, -64, -64, -64, -64, 64, 64, -64, 64, -64, -64, 64, 64, -64, -64, -64, 64, 64, -64, 64, -64, -64, -64, 64, -64, -64, -64, -64, -64, -64, -64, -64, 64, -64, -64, -64, -64, -64, 64, -64, -64, -64, -64, 64, -64, 64, 64, -64, -64, -64, -64, 64, -64, -64, -64, -64, -64, -64, -64, -64, -64, -64, -64, -64, -64, -64, -64, 64, -64, -64, -64, -64, 64, -64, 64, -64, 64, -64, 64, 64, 64, 64, -64, 64, 64, -64, -64, -64, -64, -64, -64, -64, 64, 64, -64, 64, -64, 64, -64, -64, 64, -64, -64, 64, 64, -64, 64, 64, 64, 64, 64, 64, -64, 64, 64, -64, 64, 64, 64, 64, 64, 64, 64, 64, 64, 64, 64, -64, 64, -64, 64, 64, 64, -64, 64, 64, 64, 64, 64, 64, 64, 64, 64, 64, -64, 64, 64, 64, 64, 64, 64, 64, 64, 64, -64, 64, -64, -64, -64, 64, -64, 64, 64, 64, 64, 64, 64, 64, -64, 64, 64, 64, -64, 64, 64, 64, 64, 64, 64, 64, 64, 64, -64, 64, -64, -64, -64, 64, 64, -64, 64, 64, 64, 64, -64, -64, -64, 64, 64, -64, 64, 64, 64, 64, 64, 64, 64, 64, 64, 64, -64, 64, -64, 64, 64, 64, 64, 64, 64, -64, -64, -64, -64, 64, -64, -64, -64, 64, 64, 64, 64, 64, -64, 64, 64, 64, 64, 64, -64, -64, -64, -64, 64, 64, 64, 64, -64, -64, -64, -64, -64, -64, 64, -64, -64, 64, 64, 64, 64, 64, 64, 64, 64, 64, 64, 64, -64, 64, -64, 64, 64, 64, 64, 64, -64, 64, 64, 64, 64, 64, 64, 64, -64, 64, 64, -64, 64, 64, -64, -64, 64, 64, 64, 64, -64, 64, -64, -64, 64, 64, -64, 64, 64, 64, 64, 64, 64, 64, 64, 64, 64, 64, 64, 64, -64, -64, -64, -64, 64, 64, -64, 64, -64, -64, 64, -64, 64, 64, -64, 64, 64, 64, 64, 64, 64, 64, 64, 64, 64, 64, 64, -64, -64, -64, -64, -64, -64, 64, -64, -64, -64, -64, -64, 64, 64, -64, 64, 64, 64, 64, 64, 64, 64, 64, 64, 64, -64, 64, 64, 64, -64, -64, -64, -64, -64, -64, -64, -64, -64, 64, -64, -64, -64, -64, -64, -64, -64, 64, 64, 64, 64, 64, 64, -64, -64, -64, 64, 64, -64, -64, -64, -64, -64, -64, -64, -64, -64, -64, 64, 64, 64, -64, -64, -64, -64, -64, -64, 64, 64, -64, -64, -64, -64, -64, -64, -64, -64, -64, -64, -64, -64, -64, -64, -64, -64, 64, 64, -64, -64, -64, -64, -64, -64, -64, -64, -64, -64, -64, 64, -64, 64, -64, -64, -64, -64, -64, -64, -64, -64, -64, 64, 64, -64, 64, 64, 64, -64, -64, -64, -64, -64, -64, -64, -64, -64, -64, 64, -64, 64, -64, -64, -64, 64, -64, -64, -64, -64, -64, -64, 64, -64, 64, -64, 64, 64, -64, -64, -64, -64, -64, -64, -64, -64, -64, -64, -64, -64, 64, 64, -64, -64, -64, -64, -64, -64, -64, -64, -64, 64, 64, 64, 64, 64, -64, 64, 64, -64, -64, -64, -64, -64, -64, -64, -64, -64, 64, 64, -64, 64, -64, -64, -64, -64, -64, -64, -64, 64, -64, -64, -64, -64, 64, -64, 64, 64, -64, 64, -64, -64, -64, -64, -64, -64, -64, 64, 64, 64, -64, 64, -64, -64, -64, -64, 64, 64, -64, -64, 64, -64, 64, -64, -64, -64, 64, 64, 64, -64, 64, -64, -64, -64, -64, 64, 64, 64, -64, 64, -64, -64, -64, 64, 64, 64, -64, 64, -64, -64, -64, -64, 64, -64, 64, -64, -64, -64, 64, 64, 64, 64, -64, -64, 64, -64, -64, -64, 64, -64, -64, -64, -64, 64, 64, 64, -64, -64, -64, -64, 64, -64, -64, -64, -64, 64, -64, -64, 64, 64, 64, 64, 64, -64, 64, 64, -64, 64, -64, -64, -64, 64, 64, -64, -64, -64, -64, 64, 64, 64, -64, -64, 64, 64, -64, -64, -64, -64, -64, 64, 64, 64, 64, -64, 64, 64, 64, -64, 64, 64, -64, 64, 64, -64, -64, -64, 64, 64, -64, -64, -64, 64, 64, 64, 64, -64, -64, -64, 64, 64, 64, -64, -64, -64, -64, 64, 64, -64, 64, 64, -64, 64, -64, -64, -64, 64, 64, 64, 64, 64, 64, 64, 64, 64, 64, 64, 64, -64, -64, 64, -64, 64, 64, -64, 64, -64, 64, -64, -64, 64, -64, -64, -64, -64, -64, -64, 64, -64, -64, -64, -64, 64, -64, 64, 64, 64, -64, 64, -64, -64, -64, 64, -64, -64, -64, 64, 64, -64, -64, -64, -64, 64, -64, -64, -64, 64, -64, 64, -64, 64, 64, 64, 64, -64, -64, 64, -64, -64, 64, 64, -64, -64, -64, -64, -64, -64, -64, -64, 64, -64, -64, -64, 64, -64, -64, -64, -64, 64, -64, -64, 64, -64, 64, 64, -64, -64, -64, 64, 64, -64, 64, -64, -64, -64, -64, -64, -64, -64, 64, -64, 64, -64, 64, -64, 64, 64, 64, 64, -64, -64, -64, 64, -64, -64, 64, -64, 64, 64, -64, 64, 64, 64, -64, -64, -64, -64, 64, 64, -64, -64, -64, -64, -64, 64, 64, -64, -64, 64, -64, 64, -64, -64, 64, 64, 64, 64, -64, 64, -64, -64, -64, -64, -64, -64, -64, -64, -64, 64, 64, -64, -64, 64, 64, -64, -64, -64, -64, 64, -64, -64, -64, 64, 64, 64, -64, 64, 64, -64, -64, 64, -64, -64, -64, -64, -64, -64, -64, -64, 64, 64, -64, -64, -64, -64, 64, -64, -64, 64, 64, -64, 64, 64, 64, -64, -64, 64, 64, -64, 64, -64, -64, -64, -64, 64, -64, -64, -64, -64, -64, -64, -64, -64, 64, -64, 64, -64, 64, 64, 64, -64, 64, -64, 64, -64, -64, 64, 64, -64, 64, -64, -64, 64, -64, -64, 64, -64, -64, -64, -64, -64, -64, -64, -64, -64, 64, 64, 64, -64, -64, 64, 64, 64, 64, 64, 64, -64, 64, -64, 64, -64, 64, -64, 64, -64, -64, -64, -64, 64, 64, -64, -64, -64, 64, -64, 64, 64, 64, -64, 64, -64, -64, -64, 64, -64, 64, 64, -64, -64, 64, 64, -64, -64, -64, -64, 64, -64, -64, -64, -64, 64, -64, -64, -64, -64, 64, -64, -64, 64, -64, 64, -64, 64, -64, 64, -64, -64, 64, 64, -64, -64, -64, -64, 64, -64, -64, 64, -64, -64, 64, -64, -64, 64, -64, -64, -64, -64, 64, 64, 64, -64, -64, -64, -64, 64, 64, 64, -64, -64, -64, -64, -64, -64, -64, -64, -64, 64, 64, -64, 64, 64, 64, 64, -64, -64, 64, -64, -64, 64, -64, 64, -64, -64, 64, 64, -64, -64, -64, 64, -64, 64, 64, 64, -64, 64, 64, 64, 64, -64, -64, -64, -64, -64, -64, 64, -64, 64, 64, -64, 64, -64, -64, 64, -64, -64, 64, -64, -64, 64, 64, -64, -64, -64, 64, -64, 64, 64, -64, -64, 64, -64, 64, -64, 64, 64, 64, 64, 64, -64, -64, -64, -64, -64, -64, -64, -64, -64, 64, 64, 64, 64, -64, 64, -64, 64, -64, -64, 64, -64, 64, 64, 64, 64, -64, -64, 64, -64, -64, -64, -64, 64, 64, -64, 64, 64, -64, 64, 64, -64, -64, 64, 64, 64, -64, -64, -64, 64, -64, 64, 64, 64, 64, -64, -64, 64, -64, -64, -64, -64, -64, -64, -64, 64, 64, 64, 64, -64, -64, 64, -64, -64, -64, -64, -64, 64, 64, 64, 64, -64, 64, -64, 64, -64, -64, -64, -64, -64, -64, -64, 64, -64, -64, -64, 64, 64, 64, 64, 64, -64, 64, -64, -64, 64, 64, 64, -64, 64, -64, 64, -64, 64, -64, -64, -64, -64, -64, 64, -64, -64, -64, -64, 64, 64, 64, 64, -64, 64, 64, -64, 64, 64, -64, -64, -64, -64, -64, 64, -64, -64, -64, -64, -64, 64, 64, -64, -64, 64, -64, 64, 64, 64, 64, -64, 64, 64, -64, -64, 64, -64, -64, 64, -64, -64, -64, 64, 64, -64, -64, -64, 64, 64, -64, 64, 64, 64, -64, -64, 64, 64, -64, -64, 64, -64, -64, 64, -64, -64, 64, -64, -64, -64, -64, -64, 64, -64, -64, -64, -64, -64, 64, 64, 64, -64, 64, -64, 64, -64, 64, 64, 64, 64, -64, -64, -64, 64, 64, 64, 64, -64, 64, -64, -64, 64, -64, -64, -64, 64, 64, 64, 64, -64, -64, -64, 64, -64, 64, -64, 64, 64, 64, 64, 64, -64, 64, -64, -64, -64, 64, -64, 64, 64, -64, 64, 64, -64, -64, -64, 64, -64, 64, -64, 64, -64, 64, -64, -64, -64, 64, -64, 64, 64, -64, 64, -64, -64, -64, 64, 64, -64, -64, 64, 64, 64, 64, -64, 64, 64, -64, 64, -64, -64, 64, 64, 64, -64, -64, 64, -64, -64, 64, -64, -64, -64, -64, 64, 64, 64, 64, 64, 64, 64, 64, -64, -64, -64, 64, 64, -64, 64, -64, 64, -64, -64, 64, 64, -64, 64, 64, 64, 64, -64, -64, 64, -64, 64, -64, -64, -64, 64, 64, 64, 64, 64, 64, 64, 64, 64, 64, 64, -64, 64, 64, 64, 64, -64, -64, -64, -64, -64, -64, -64, -64, -64, -64, 64, -64, -64, 64, 64, -64, 64, 64, -64, 64, 64, 64, 64, 64, 64, -64, -64, 64, 64, 64, -64, -64, -64, -64, 64, -64, -64, -64, 64, 64, 64, 64, 64, -64, -64, -64, 64, 64, 64, 64, 64, 64, -64, 64, 64, 64, -64, 64, -64, -64, -64, -64, 64, -64, -64, -64, 64, 64, -64, -64, 64, 64, 64, -64, 64, 64, 64, 64, 64, 64, 64, 64, -64, 64, 64, -64, -64, -64, -64, -64, 64, 64, 64, -64, -64, 64, -64, 64, 64, 64, 64, 64, 64, 64, 64, 64, 64, 64, 64, -64, 64, -64, -64, -64, -64, -64, -64, -64, -64, 64, -64, 64, 64, 64, -64, 64, 64, 64, 64, 64, 64, 64, 64, 64, 64, -64, -64, -64, -64, -64, -64, -64, -64, -64, -64, -64, 64, -64, 64, 64, 64, 64, 64, -64, 64, 64, -64, -64, -64, -64, 64, 64, 64, 64, -64, -64, 64, 64, 64, 64, -64, 64, -64, 64, -64, 64, -64, 64, 64, 64, 64, 64, -64, 64, -64, -64, 64, -64, 64, 64, 64, 64, 64, -64, -64, -64, -64, -64, -64, -64, 64, 64, 64, 64, 64, -64, 64, 64, -64, 64, 64, 64, -64, 64, 64, -64, 64, 64, 64, -64, 64, -64, -64, -64, 64, 64, -64, -64, 64, 64, 64, 64, 64, 64, 64, 64, 64, 64, 64, 64, 64, -64, -64, -64, -64, 64, -64, -64, -64, -64, 64, -64, -64, 64, 64, 64, 64, 64, 64, 64, -64, 64, 64, -64, 64, -64, 64, 64, -64, 64, -64, 64, -64, -64, 64, -64, -64, -64, 64, -64, -64, 64, 64, 64, 64, 64, 64, -64, 64, 64, 64, 64, 64, -64, 64, -64, -64, -64, -64, -64, 64, 64, -64, 64, -64, 64, -64, -64, -64, 64, 64, -64, 64, 64, 64, 64, 64, 64, 64, 64, 64, 64, -64, -64, -64, 64, -64, -64, 64, 64, 64, 64, -64, -64, 64, -64, -64, 64, -64, -64, -64, -64, 64, 64, 64, 64, 64, -64, 64, 64, 64, 64, -64, 64, -64, 64, -64, -64, -64, -64, -64, -64, -64, 64, -64, -64, 64, -64, -64, -64, 64, 64, -64, 64, 64, 64, 64, -64, 64, 64, 64, 64, 64, -64, 64, -64, -64, -64, -64, 64, -64, -64, -64, -64, -64, -64, -64, 64, 64, 64, 64, 64, -64, 64, 64, 64, 64, 64, 64, -64, -64, -64, 64, 64, -64, -64, -64, -64, -64, 64, 64, 64, -64, 64, 64, 64, 64, 64, 64, 64, 64, 64, 64, 64, 64, 64, 64, -64, 64, 64, -64, 64, 64, 64, -64, -64, 64, -64, 64, -64, -64, 64, 64, 64, 64, 64, 64, 64, 64, 64, 64, 64, 64, 64, 64, -64, 64, -64, 64, 64, -64, -64, 64, 64, -64, -64, -64, 64, -64, 64, 64, 64, -64, 64, -64, 64, 64, 64, -64, 64, 64, 64, 64, -64, 64, 64, 64, 64, 64, -64, -64, -64, 64, 64, 64, 64, -64, -64, 64, 64, 64, 64, 64, 64, 64, 64, 64, 64, 64, 64, 64, 64, 64, 64, 64, 64, -64, 64, -64, 64, 64, -64, 64, -64, 64, 64, -64, 64, 64, -64, -64, 64, 64, -64, -64, 64, 64, 64, -64, -64, 64, -64, 64, 64, 64, -64, -64, 64, 64, 64, -64, -64, 64, -64, 64, 64, -64, -64, 64, -64, -64, -64, -64, -64, 64, 64, 64, -64, -64, 64, 64, 64, 64, -64, 64, 64, 64, -64, 64, 64, -64, -64, 64, 64, 64, -64, 64, 64, -64, 64, 64, 64, 64, 64, 64, -64, -64, -64, 64, 64, 64, -64, 64, -64, -64, 64, 64, 64, 64, -64, -64, -64, -64, -64, -64, 64, 64, -64, -64, -64, 64, 64, -64, 64, 64, 64, -64, 64, -64, -64, 64, 64, 64, -64, 64, 64, -64, 64, 64, 64, 64, -64, 64, -64, -64, -64, -64, -64, -64, 64, -64, 64, 64, 64, -64, -64, 64, 64, -64, -64, -64, 64, -64, 64, 64, 64, 64, 64, -64, -64, 64, -64, -64, -64, 64, -64, -64, 64, 64, -64, -64, 64, -64, -64, -64, 64, 64, 64, -64, -64, 64, 64, 64, -64, 64, 64, 64, -64, -64, 64, -64, 64, -64, 64, 64, -64, -64, 64, 64, -64, -64, 64, -64, -64, 64, -64, 64, -64, 64, -64, -64, 64, -64, 64, 64, 64, 64, -64, 64, 64, 64, -64, 64, 64, 64, 64, 64, -64, 64, 64, 64, 64, -64, -64, -64, -64, -64, -64, 64, 64, -64, 64, 64, -64, 64, -64, 64, 64, 64, -64, -64, -64, -64, 64, 64, 64, 64, 64, -64, -64, -64, 64, -64, -64, -64, 64, -64, 64, -64, 64, -64, 64, -64, 64, -64, -64, -64, -64, -64, 64, -64, -64, -64, 64, 64, -64, -64, -64, 64, -64, -64, -64, 64, 64, 64, 64, -64, -64, -64, -64, 64, -64, -64, -64, -64, -64, -64, -64, 64, -64, -64, 64, -64, 64, 64, 64, -64, -64, 64, 64, -64, -64, 64, -64, 64, -64, -64, 64, -64, -64, 64, -64, -64, -64, -64, -64, -64, -64, 64, -64, 64, -64, -64, -64, -64, -64, 64, 64, 64, -64, 64, 64, -64, -64, -64, -64, -64, -64, -64, -64, 64, -64, -64, -64, 64, -64, -64, -64, 64, -64, 64, -64, 64, 64, 64, 64, -64, -64, -64, -64, 64, -64, -64, -64, -64, -64, -64, 64, -64, 64, -64, 64, -64, -64, -64, 64, -64, -64, -64, -64, -64, -64, -64, 64, 64, 64, 64, 64, -64, -64, -64, -64, -64, -64, -64, -64, 64, -64, -64, -64, -64, -64, 64, 64, -64, 64, -64, -64, -64, 64, 64, 64, 64, 64, -64, -64, -64, -64, -64, 64, -64, 64, -64, 64, 64, 64, -64, 64, -64, -64, 64, -64, -64, 64, -64, -64, 64, -64, 64, -64, 64, -64, 64, -64, -64, -64, -64, -64, -64, -64, -64, 64, -64, -64, -64, 64, -64, -64, -64, -64, -64, -64, -64, -64, 64, 64, -64, -64, 64, 64, -64, -64, -64, -64, -64, -64, -64, -64, -64, 64, -64, 64, 64, -64, -64, 64, 64, 64, -64, 64, -64, 64, 64, -64, 64, 64, 64, 64, -64, -64, -64, -64, -64, -64, 64, -64, -64, -64, 64, 64, -64, -64, -64, 64, -64, -64, -64, -64, -64, 64, -64, -64, -64, -64, 64, 64, -64, -64, -64, -64, -64, 64, 64, 64, -64, 64, 64, -64, 64, -64, -64, 64, -64, 64, 64, -64, -64, 64, -64, -64, -64, 64, -64, -64, 64, -64, -64, 64, -64, 64, -64, 64, -64, 64, 64, 64, -64, -64, -64, -64, -64, -64, -64, -64, -64, -64, -64, -64, -64, -64, 64, -64, -64, -64, -64, -64, -64, 64, 64, -64, 64, -64, -64, -64, -64, 64, -64, -64, -64, -64, -64, 64, 64, -64, -64, 64, 64, 64, -64, 64, 64, 64, 64, -64, -64, -64, -64, 64, 64, -64, -64, -64, -64, 64, -64, -64, -64, -64, -64, -64, -64, -64, 64, 64, -64, 64, -64, 64, 64, 64, -64, 64, -64, 64, -64, 64, -64, -64, -64, 64, -64, -64, -64, -64, 64, 64, -64, -64, -64, -64, 64, -64, -64, -64, -64, 64, -64, 64, 64, -64, -64, 64, -64, -64, -64, -64, -64, 64, -64, 64, 64, 64, 64, -64, -64, -64, -64, -64, 64, 64, 64, -64, 64, -64, -64, -64, 64, -64, -64, -64, 64, -64, 64, -64, -64, -64, 64, -64, 64, -64, -64, 64, -64, -64, -64, -64, 64, 64, -64, -64, 64, 64, 64, 64, -64, -64, 64, -64, -64, 64, 64, -64, -64, -64, 64, 64, -64, -64, -64, 64, -64, 64, 64, -64, 64, -64, 64, 64, 64, 64, -64, 64, 64, -64, 64, -64, -64, -64, 64, -64, -64, -64, 64, -64, 64, -64, 64, -64, -64, -64, 64, -64, -64, 64, -64, -64, 64, -64, 64, -64, 64, -64, -64, -64, -64, -64, -64, -64, -64, 64, -64, 64, -64, -64, 64, 64, 64, -64, 64, 64, 64, -64, -64, 64, 64, 64, 64, -64, 64, 64, -64, -64, -64, -64, 64, -64, -64, -64, -64, -64, -64, -64, -64, -64, 64, 64, -64, -64, -64, 64, 64, 64, -64, -64, 64, 64, 64, 64, -64, -64, -64, -64, 64, 64, 64, -64, 64, -64, -64, -64, -64, -64, -64, -64, 64, 64, -64, -64, 64, 64, -64, -64, 64, 64, 64, 64, 64, -64, -64, -64, 64, -64, 64, 64, 64, -64, 64, 64, -64, 64, -64, -64, 64, -64, 64, 64, -64, -64, 64, -64, -64, 64, -64, 64, -64, 64, 64, -64, 64, 64, -64, 64, -64, 64, 64, -64, -64, 64, -64, -64, -64, -64, -64, -64, 64, -64, 64, 64, 64, -64, 64, -64, 64, 64, 64, 64, -64, -64, 64, 64, 64, -64, -64, -64, -64, -64, -64, -64, 64, -64, 64, 64, -64, -64, 64, 64, -64, 64, -64, 64, -64, -64, -64, -64, -64, -64, 64, 64, 64, -64, 64, -64, 64, 64, 64, -64, -64, 64, -64, -64, -64, -64, 64, 64, 64, 64, 64, 64, 64, 64, 64, 64, 64, 64, 64, -64, 64, -64, 64, 64, -64, -64, 64, 64, -64, -64, 64, -64, -64, -64, 64, -64, -64, 64, -64, -64, -64, 64, -64, 64, -64, 64, 64, -64, 64, -64, 64, -64, 64, -64, 64, 64, -64, 64, -64, -64, -64, -64, -64, 64, 64, 64, -64, 64, -64, 64, -64, -64, -64, 64, -64, -64, 64, 64, 64, 64, 64, 64, -64, 64, -64, -64, -64, 64, 64, -64, 64, 64, -64, -64, -64, 64, 64, 64, -64, 64, 64, 64, 64, 64, -64, 64, 64, 64, 64, 64, 64, -64, -64, -64, -64, -64, 64, -64, -64, 64, -64, -64, 64, 64, -64, -64, 64, 64, -64, 64, 64, -64, 64, -64, 64, 64, -64, -64, 64, 64, 64, -64, -64, 64, 64, -64, -64, 64, -64, -64, 64, 64, 64, -64, -64, 64, 64, -64, 64, 64, -64, 64, -64, -64, -64, 64, 64, -64, 64, -64, -64, 64, -64, 64, 64, -64, 64, 64, 64, -64, -64, 64, 64, 64, 64, 64, 64, -64, 64, 64, 64, 64, 64, 64, 64, -64, -64, 64, 64, -64, 64, -64, -64, 64, 64, 64, 64, 64, 64, -64, 64, 64, 64, -64, 64, 64, 64, 64, -64, -64, 64, 64, -64, -64, 64, 64, -64, 64, -64, -64, 64, 64, -64, -64, 64, 64, -64, 64, -64, 64, 64, 64, 64, 64, 64, 64, -64, -64, -64, 64, 64, 64, 64, 64, -64, 64, 64, -64, 64, 64, -64, 64, -64, 64, -64, 64, 64, 64, 64, 64, 64, 64, 64, -64, 64, 64, 64, -64, 64, -64, -64, -64, -64, 64, 64, 64, 64, -64, 64, 64, 64, 64, -64, 64, 64, 64, 64, -64, 64, 64, 64, 64, 64, 64, 64, -64, 64, 64, 64, -64, -64, 64, -64, 64, -64, 64, 64, 64, 64, 64, 64, 64, 64, 64, 64, 64, -64, 64, -64, -64, 64, 64, 64, 64, 64, 64, -64, 64, 64, -64, 64, 64, 64, 64, 64, 64, 64, 64, -64, 64, 64, 64, 64, 64, -64, 64, 64, -64, 64, 64, 64, -64, -64, -64, 64, 64, 64, -64, -64, -64, 64, 64, 64, 64, 64, 64, 64, 64, -64, 64, -64, 64, 64, 64, -64, -64, 64, -64, -64, 64, 64, -64, 64, -64, -64, -64, -64, 64, 64, 64, 64, -64, 64, -64, 64, 64, 64, -64, -64, 64, 64, -64, -64, -64, 64, 64, 64, 64, 64, 64, 64, 64, -64, 64, -64, 64, 64, -64, -64, -64, -64, 64, 64, 64, 64, 64, 64, 64, -64, 64, 64, 64, 64, 64, 64, -64, 64, -64, -64, 64, -64, -64, -64, -64, -64, 64, -64, 64, -64, 64, 64, 64, 64, 64, 64, -64, 64, 64, 64, 64, 64, 64, 64, 64, -64, -64, -64, 64, 64, 64, -64, 64, -64, 64, 64, 64, -64, 64, 64, 64, 64, 64, -64, 64, 64, 64, -64, -64, 64, -64, 64, -64, -64, -64, -64, 64, 64, -64, 64, -64, 64, 64, -64, 64, 64, 64, 64, -64, -64, 64, 64, 64, 64, -64, -64, 64, -64, 64, -64, 64, -64, 64, -64, -64, -64, -64, -64, 64, 64, -64, -64, -64, 64, 64, 64, -64, 64, -64, 64, 64, -64, 64, -64, 64, -64, -64, 64, -64, -64, -64, 64, -64, 64, -64, -64, 64, 64, 64, -64, -64, 64, 64, 64, 64, -64, 64, 64, 64, -64, -64, 64, 64, 64, -64, 64, -64, 64, 64, 64, 64, 64, 64, -64, 64, 64, -64, -64, 64, -64, -64, -64, 64, 64, 64, -64, -64, 64, 64, -64, 64, 64, 64, -64, 64, -64, -64, -64, -64, 64, -64, 64, -64, 64, 64, 64, 64, -64, -64, 64, -64, 64, 64, 64, 64, 64, -64, -64, 64, -64, -64, -64, 64, -64, 64, -64, 64, -64, -64, -64, 64, 64, -64, 64, 64, 64, -64, 64, 64, -64, 64, 64, 64, 64, 64, -64, 64, -64, 64, 64, -64, 64, -64, -64, 64, 64, 64, 64, 64, 64, -64, -64, -64, -64, 64, 64, -64, 64, 64, 64, 64, -64, 64, 64, -64, -64, 64, 64, -64, 64, -64, 64, -64, -64, 64, -64, -64, 64, 64, -64, 64, 64, 64, 64, 64, -64, -64, 64, 64, 64, 64, -64, -64, 64, -64, 64, 64, 64, -64, 64, 64, 64, -64, -64, -64, -64, -64, 64, 64, 64, 64, 64, 64, 64, -64, -64, -64, -64, 64, -64, 64, -64, 64, -64, 64, -64, 64, 64, -64, -64, 64, -64, -64, 64, -64, -64, 64, -64, -64, -64, -64, -64, 64, -64, -64, -64, 64, 64, 64, 64, 64, 64, -64, -64, 64, 64, 64, -64, -64, -64, -64, 64, 64, 64, -64, 64, -64, 64, 64, -64, -64, -64, 64, 64, -64, -64, -64, 64, -64, -64, -64, -64, -64, -64, -64, 64, -64, 64, 64, 64, 64, -64, 64, -64, 64, -64, -64, -64, -64, -64, -64, -64, 64, -64, -64, -64, -64, -64, 64, 64, 64, 64, 64, 64, -64, 64, -64, -64, 64, -64, -64, 64, 64, 64, -64, -64, -64, -64, 64, 64, 64, 64, 64, -64, 64, 64, 64, 64, 64, 64, 64, -64, 64, 64, 64, -64, -64, 64, 64, -64, -64, 64, -64, -64, -64, 64, 64, -64, -64, -64, -64, -64, -64, 64, -64, 64, 64, 64, 64, 64, -64, 64, -64, 64, 64, 64, 64, 64, -64, -64, -64, -64, -64, -64, 64, -64, 64, -64, -64, -64, -64, 64, -64, 64, 64, 64, -64, 64, 64, 64, -64, -64, 64, 64, 64, 64, 64, -64, -64, -64, -64, -64, -64, 64, 64, 64, -64, -64, -64, 64, -64, 64, 64, 64, 64, 64, -64, 64, -64, -64, -64, 64, 64, -64, -64, -64, -64, -64, -64, -64, 64, 64, 64, 64, 64, 64, 64, 64, -64, 64, 64, 64, 64, -64, -64, 64, 64, 64, 64, 64, -64, -64, -64, -64, -64, -64, -64, -64, 64, -64, 64, 64, 64, 64, 64, 64, 64, -64, 64, 64, -64, -64, -64, -64, 64, 64, 64, -64, -64, -64, -64, -64, -64, -64, 64, 64, 64, 64, 64, 64, 64, 64, 64, -64, 64, -64, -64, 64, -64, -64, 64, 64, -64, -64, -64, 64, -64, -64, -64, -64, -64, 64, 64, 64, 64, -64, -64, 64, -64, 64, -64, -64, -64, -64, -64, -64, -64, 64, 64, -64, -64, 64, 64, -64, -64, -64, -64, 64, -64, -64, 64, 64, 64, -64, -64, -64, -64, -64, 64, -64, -64, -64, -64, -64, -64, -64, 64, 64, 64, 64, 64, -64, -64, -64, 64, -64, 64, 64, -64, 64, 64, 64, 64, 64, -64, -64, 64, -64, -64, -64, -64, -64, -64, 64, 64, 64, 64, -64, -64, -64, -64, -64, -64, -64, -64, 64, 64, 64, 64, 64, 64, 64, 64, 64, 64, -64, -64, -64, -64, -64, -64, 64, -64, 64, 64, -64, -64, -64, -64, -64, -64, -64, 64, 64, 64, 64, 64, 64, 64, 64, 64, -64, 64, 64, -64, -64, -64, -64, 64, 64, -64, -64, -64, -64, 64, -64, -64, 64, -64, -64, 64, 64, 64, 64, 64, 64, -64, 64, 64, 64, -64, -64, -64, -64, -64, -64, -64, 64, -64, -64, 64, 64, -64, -64, -64, -64, 64, 64, 64, 64, 64, 64, 64, 64, 64, 64, 64, 64, -64, -64, -64, -64, -64, -64, -64, -64, 64, 64, -64, 64, -64, -64, -64, 64, -64, 64, 64, -64, -64, 64, -64, -64, 64, 64, 64, -64, -64, -64, -64, -64, -64, -64, -64, -64, 64, -64, 64, 64, -64, -64, -64, 64, -64, -64, -64, -64, -64, -64, -64, -64, 64, 64, -64, -64, -64, -64, -64, -64, -64, 64, 64, -64, 64, 64, 64, -64, -64, -64, -64, 64, 64, -64, -64, -64, -64, 64, 64, -64, 64, 64, -64, -64, -64, 64, -64, -64, -64, -64, 64, 64, -64, -64, -64, 64, 64, -64, -64, 64, 64, 64, 64, -64, 64, -64, -64, -64, 64, -64, 64, -64, -64, 64, -64, -64, -64, -64, -64, 64, 64, 64, 64, -64, -64, 64, 64, 64, -64, 64, 64, 64, 64, 64, -64, 64, -64, -64, -64, 64, -64, -64, -64, -64, -64, 64, -64, -64, -64, 64, 64, -64, 64, 64, 64, 64, -64, 64, -64, 64, 64, 64, 64, 64, -64, -64, -64, -64, -64, -64, -64, -64, -64, -64, -64, 64, -64, -64, 64, 64, -64, 64, -64, 64, 64, 64, -64, -64, 64, 64, 64, -64, -64, -64, -64, -64, -64, -64, 64, -64, -64, -64, -64, 64, -64, -64, -64, 64, 64, 64, 64, -64, 64, 64, 64, 64, 64, 64, 64, 64, -64, -64, -64, -64, -64, -64, -64, -64, -64, -64, -64, -64, -64, -64, -64, 64, -64, -64, -64, 64, 64, 64, -64, 64, -64, 64, -64, 64, -64, -64, 64, -64, -64, -64, -64, -64, 64, -64, 64, -64, -64, 64, -64, 64, -64, 64, 64, -64, 64, 64, -64, 64, 64, -64, -64, 64, 64, -64, -64, -64, 64, 64, 64, -64, -64, 64, -64, 64, 64, -64, 64, 64, -64, -64, 64, -64, -64, 64, -64, 64, 64, 64, -64, -64, 64, 64, 64, 64, -64, -64, 64, -64, -64, 64, 64, -64, 64, 64, 64, -64, 64, -64, 64, -64, 64, -64, 64, 64, 64, -64, -64, 64, -64, -64, 64, 64, 64, 64, 64, -64, 64, -64, 64, -64, -64, -64, 64, 64, -64, -64, -64, -64, -64, 64, 64, 64, 64, 64, 64, 64, 64, 64, 64, 64, 64, 64, 64, 64, -64, 64, -64, 64, 64, -64, -64, -64, 64, 64, -64, 64, 64, -64, -64, -64, 64, 64, 64, 64, 64, 64, 64, 64, -64, -64, -64, 64, -64, -64, 64, -64, 64, 64, 64, -64, -64, 64, -64, 64, 64, -64, -64, 64, 64, 64, -64, 64, 64, 64, 64, 64, -64, -64, -64, -64, -64, -64, -64, -64, -64, 64, -64, -64, 64, 64, 64, -64, -64, -64, -64, 64, -64, 64, -64, 64, -64, -64, 64, 64, 64, -64, -64, -64, -64, -64, -64, -64, -64, 64, -64, -64, 64, 64, 64, 64, -64, -64, -64, -64, -64, 64, -64, -64, 64, 64, -64, 64, -64, -64, -64, -64, -64, -64, -64, -64, 64, -64, 64, 64, 64, 64, 64, 64, 64, 64, 64, -64, 64, -64, -64, 64, -64, -64, 64, -64, -64, -64, -64, -64, -64, -64, -64, -64, -64, -64, -64, 64, 64, 64, 64, 64, 64, 64, 64, -64, -64, 64, -64, 64, 64, -64, -64, -64, 64, 64, 64, 64, -64, -64, 64, -64, -64, 64, -64, -64, 64, 64, 64, 64, 64, 64, -64, -64, -64, -64, 64, 64, 64, -64, -64, -64, 64, 64, 64, -64, 64, -64, -64, 64, 64, -64, 64, -64, -64, -64, 64, 64, 64, -64, -64, -64, -64, -64, 64, 64, 64, -64, -64, -64, 64, 64, 64, -64, -64, -64, -64, -64, -64, -64, -64, -64, 64, 64, 64, 64, -64, -64, -64, -64, -64, -64, 64, 64, -64, -64, 64, -64, 64, 64, 64, -64, -64, -64, -64, -64, -64, -64, -64, 64, -64, 64, 64, -64, -64, -64, -64, -64, -64, -64, -64, 64, 64, 64, 64, 64, 64, 64, 64, -64, -64, -64, 64, -64, -64, 64, 64, 64, 64, 64, -64, -64, -64, -64, -64, -64, -64, -64, -64, 64, -64, 64, 64, 64, 64, 64, -64, 64, 64, -64, -64, 64, -64, 64, -64, -64, 64, 64, 64, -64, -64, -64, -64, -64, -64, -64, 64, -64, -64, 64, 64, 64, 64, 64, -64, -64, 64, -64, 64, 64, 64, -64, 64, -64, -64, -64, -64, 64, -64, -64, -64, -64, -64, 64, 64, 64, 64, 64, -64, -64, 64, 64, -64, 64, -64, 64, -64, 64, 64, 64, -64, 64, 64, 64, -64, 64, -64, -64, -64, -64, -64, -64, 64, 64, 64, 64, -64, -64, -64, -64, 64, -64, 64, 64, 64, 64, 64, 64, -64, 64, -64, -64, -64, 64, 64, -64, -64, -64, -64, -64, 64, 64, 64, -64, 64, 64, 64, -64, 64, -64, 64, 64, 64, 64, -64, -64, 64, 64, 64, -64, -64, 64, 64, -64, -64, -64, 64, -64, 64, 64, 64, 64, -64, 64, -64, -64, 64, 64, -64, 64, 64, -64, -64, -64, 64, 64, -64, 64, 64, -64, 64, 64, 64, 64, -64, -64, 64, 64, 64, 64, -64, -64, -64, -64, 64, 64, 64, 64, -64, 64, -64, -64, 64, 64, -64, 64, 64, -64, 64, 64, 64, 64, 64, 64, 64, 64, -64, -64, -64, 64, -64, -64, 64, 64, 64, 64, -64, -64, 64, -64, -64, 64, 64, 64, 64, -64, 64, 64, 64, 64, 64, 64, 64, -64, -64, -64, -64, -64, -64, -64, -64, 64, 64, 64, -64, 64, 64, -64, -64, 64, 64, 64, 64, 64, 64, 64, 64, 64, -64, -64, -64, -64, -64, -64, -64, 64, -64, -64, 64, 64, 64, 64, -64, 64, 64, 64, -64, 64, -64, 64, 64, 64, 64, 64, 64, 64, -64, -64, -64, -64, -64, -64, -64, -64, 64, -64, 64, 64, 64, -64, 64, -64, -64, -64, 64, -64, 64, -64, -64, 64, 64, 64, 64, 64, -64, -64, -64, -64, -64, -64, -64, -64, -64, -64, 64, 64, -64, 64, -64, 64, -64, -64, 64, -64, 64, 64, 64, 64, 64, 64, 64, 64, 64, -64, -64, -64, -64, -64, -64, -64, -64, -64, -64, 64, -64, 64, -64, -64, 64, 64, 64, -64, -64, 64, 64, 64, 64, 64, 64, -64, 64, 64, -64, -64, -64, -64, -64, 64, -64, -64, -64, -64, -64, 64, 64, 64, 64, -64, -64, -64, -64, -64, -64, 64, 64, -64, 64, -64, -64, 64, 64, 64, -64, -64, -64, 64, -64, 64, 64, -64, -64, -64, 64, -64, -64, 64, 64, -64, 64, 64, -64, 64, -64, 64, -64, -64, 64, -64, 64, -64, -64, -64, 64, 64, -64, 64, 64, 64, -64, -64, -64, 64, 64, -64, -64, -64, 64, -64, -64, -64, 64, -64, -64, 64, -64, -64, -64, -64, -64, 64, 64, 64, 64, -64, 64, -64, 64, -64, 64, 64, 64, 64, 64, -64, -64, -64, -64, 64, 64, 64, 64, 64, 64, -64, 64, 64, 64, 64, 64, 64, 64, 64, 64, 64, -64, 64, -64, -64, 64, -64, -64, -64, 64, -64, 64, -64, 64, -64, -64, -64, -64, -64, -64, -64, 64, 64, -64, 64, 64, 64, 64, 64, 64, 64, -64, 64, 64, -64, 64, 64, -64, -64, 64, -64, -64, -64, -64, -64, -64, 64, 64, 64, -64, -64, -64, -64, -64, -64, 64, 64, 64, 64, 64, 64, 64, -64, -64, 64, -64, 64, -64, -64, -64, 64, -64, -64, -64, 64, -64, -64, -64, -64, -64, -64, -64, -64, -64, -64, 64, 64, -64, 64, -64, -64, 64, 64, 64, 64, 64, 64, 64, 64, 64, 64, 64, -64, 64, 64, 64, -64, -64, -64, -64, -64, -64, -64, 64, 64, 64, 64, 64, 64, 64, 64, -64, 64, 64, 64, 64, 64, 64, -64, -64, -64, -64, 64, -64, 64, -64, -64, -64, -64, -64, -64, -64, -64, -64, 64, -64, 64, 64, -64, 64, 64, 64, 64, 64, 64, -64, 64, -64, -64, 64, 64, 64, -64, 64, -64, -64, -64, -64, -64, -64, -64, -64, -64, 64, -64, -64, -64, -64, 64, 64, 64, 64, 64, 64, -64, 64, 64, 64, 64, 64, -64, -64, -64, -64, -64, -64, -64, -64, 64, 64, 64, -64, -64, -64, -64, -64, 64, 64, 64, 64, 64, -64, -64, 64, 64, 64, 64, 64, 64, -64, -64, -64, -64, -64, -64, 64, 64, 64, 64, 64, -64, 64, -64, -64, 64, 64, 64, -64, -64, -64, 64, -64, 64, 64, 64, -64, 64, -64, -64, -64, -64, -64, -64, 64, 64, 64, 64, -64, 64, -64, 64, 64, -64, 64, -64, -64, -64, -64, -64, 64, 64, -64, 64, 64, -64, -64, -64, -64, -64, -64, -64, 64, -64, -64, -64, 64, -64, -64, -64, 64, -64, -64, -64, -64, -64, -64, 64, 64, -64, -64, -64, 64, -64, -64, 64, 64, -64, -64, 64, -64, 64, -64, -64, -64, -64, -64, 64, 64, -64, -64, -64, -64, -64, -64, 64, -64, -64, -64, -64, -64, 64, -64, 64, -64, -64, 64, 64, 64, 64, -64, 64, 64, -64, -64, 64, -64, -64, -64, -64, -64, -64, -64, -64, -64, -64, -64, -64, 64, -64, -64, -64, -64, -64, -64, 64, 64, 64, -64, -64, 64, -64, -64, -64, -64, -64, -64, -64, -64, -64, -64, -64, 64, -64, 64, 64, 64, -64, -64, 64, -64, 64, -64, 64, 64, 64, -64, -64, 64, 64, 64, -64, -64, -64, -64, -64, -64, -64, -64, -64, -64, -64, 64, 64, -64, -64, -64, -64, -64, -64, 64, 64, 64, 64, 64, -64, 64, -64, -64, 64, -64, -64, -64, -64, -64, -64, -64, -64, -64, 64, -64, -64, -64, 64, 64, 64, -64, 64, 64, 64, 64, 64, -64, -64, 64, 64, -64, 64, -64, -64, -64, -64, -64, -64, -64, -64, -64, 64, -64, -64, -64, 64, 64, 64, 64, -64, 64, 64, 64, 64, -64, -64, -64, 64, -64, -64, -64, -64, -64, -64, -64, -64, 64, -64, -64, 64, -64, -64, -64, 64, 64, -64, -64, 64, 64, 64, 64, 64, -64, -64, -64, -64, 64, 64, -64, -64, -64, -64, -64, -64, 64, -64, -64, -64, -64, -64, -64, 64, 64, -64, 64, 64, 64, 64, 64, 64, 64, -64, 64, -64, -64, 64, -64, -64, -64, -64, -64, -64, 64, -64, -64, -64, 64, 64, 64, 64, -64, -64, 64, 64, -64, -64, -64, 64, 64, -64, -64, -64, -64, 64, 64, -64, -64, -64, 64, -64, 64, -64, -64, 64, 64, 64, 64, 64, -64, 64, 64, 64, 64, -64, 64, -64, -64, -64, -64, -64, 64, -64, -64, 64, -64, 64, -64, -64, -64, -64, -64, 64, 64, 64, -64, -64, 64, -64, -64, -64, 64, -64, 64, -64, 64, 64, 64, -64, 64, 64, -64, -64, -64, 64, 64, -64, -64, 64, 64, 64, -64, -64, -64, -64, 64, -64, -64, -64, -64, -64, -64, -64, -64, 64, -64, 64, 64, 64, 64, 64, -64, -64, -64, -64, -64, 64, 64, -64, -64, -64, -64, 64, 64, -64, -64, 64, 64, 64, 64, -64, -64, 64, -64, -64, -64, 64, -64, -64, 64, -64, -64, -64, -64, 64, 64, -64, 64, 64, 64, 64, 64, 64, 64, 64, 64, -64, 64, -64, 64, -64, -64, 64, -64, 64, -64, -64, 64, 64, -64, 64, -64, 64, 64, -64, -64, 64, -64, 64, -64, -64, 64, 64, 64, 64, -64, 64, 64, -64, -64, -64, 64, -64, 64, 64, -64, -64, 64, 64, 64, 64, -64, -64, -64, -64, 64, 64, 64, 64, -64, -64, 64, 64, 64, 64, 64, -64, 64, 64, 64, -64, -64, -64, -64, 64, 64, 64, 64, 64, 64, 64, 64, 64, -64, 64, -64, 64, 64, 64, 64, 64, 64, -64, 64, 64, 64, 64, -64, 64, -64, -64, -64, 64, -64, 64, 64, -64, 64, -64, 64, -64, -64, -64, -64, 64, 64, 64, 64, 64, 64, 64, 64, -64, 64, 64, 64, 64, 64, -64, -64, 64, 64, -64, 64, -64, -64, 64, -64, -64, 64, -64, -64, -64, 64, -64, 64, 64, 64, 64, 64, 64, -64, 64, -64, 64, 64, 64, -64, 64, 64, 64, -64, -64, 64, -64, -64, 64, -64, 64, -64, -64, -64, -64, -64, 64, 64, 64, 64, 64, 64, 64, 64, 64, -64, -64, 64, 64, 64, 64, 64, -64, 64, 64, 64, 64, 64, -64, 64, -64, -64, -64, -64, -64, 64, -64, -64, -64, -64, 64, -64, -64, -64, 64, -64, 64, -64, 64, -64, 64, 64, 64, 64, 64, -64, -64, -64, -64, -64, -64, -64, 64, 64, 64, -64, -64, -64, 64, 64, -64, -64, -64, -64, 64, 64, -64, -64, -64, -64, 64, 64, 64, 64, -64, 64, 64, -64, -64, -64, -64, 64, 64, 64, 64, 64, -64, -64, -64, -64, 64, 64, 64, -64, 64, -64, 64, -64, -64, -64, 64, -64, 64, 64, 64, -64, -64, -64, -64, 64, -64, -64, -64, -64, 64, -64, -64, -64, 64, -64, -64, -64, 64, 64, 64, 64, 64, -64, 64, -64, -64, 64, 64, -64, -64, -64, -64, -64, -64, -64, -64, -64, -64, -64, -64, -64, 64, 64, -64, -64, -64, 64, 64, 64, 64, 64, 64, -64, 64, -64, 64, 64, -64, -64, -64, -64, -64, -64, 64, 64, 64, -64, -64, -64, 64, 64, 64, 64, 64, -64, 64, 64, 64, 64, 64, 64, 64, 64, 64, -64, -64, -64, -64, -64, -64, -64, -64, 64, 64, -64, -64, -64, 64, 64, 64, 64, 64, 64, 64, 64, -64, -64, 64, 64, 64, 64, 64, -64, -64, -64, -64, -64, -64, -64, -64, -64, 64, -64, -64, -64, 64, 64, 64, -64, 64, 64, 64, -64, -64, 64, 64, 64, 64, 64, -64, 64, -64, -64, -64, 64, -64, -64, -64, 64, 64, 64, 64, 64, -64, 64, 64, -64, -64, 64, 64, 64, 64, 64, 64, 64, 64, 64, 64, -64, -64, -64, -64, 64, -64, -64, -64, 64, 64, -64, 64, 64, 64, 64, -64, -64, -64, 64, 64, 64, 64, 64, -64, -64, 64, 64, 64, 64, -64, -64, 64, 64, -64, -64, -64, 64, -64, -64, 64, -64, -64, -64, -64, -64, -64, 64, 64, 64, 64, 64, 64, -64, 64, 64, 64, 64, 64, -64, -64, -64, -64, -64, -64, -64, 64, 64, 64, -64, -64, -64, -64, 64, -64, 64, 64, 64, 64, 64, 64, -64, 64, 64, 64, -64, -64, 64, -64, -64, -64, -64, 64, 64, -64, -64, -64, -64, -64, -64, -64, -64, -64, 64, 64, 64, -64, -64, -64, 64, 64, 64, 64, -64, -64, 64, 64, -64, -64, -64, 64, 64, 64, -64, 64, -64, -64, -64, -64, -64, -64, 64, 64, 64, 64, -64, 64, 64, 64, 64, 64, -64, 64, -64, 64, 64, -64, -64, -64, -64, -64, 64, -64, -64, -64, -64, -64, -64, -64, -64, -64, 64, 64, 64, 64, 64, 64, 64, -64, -64, -64, 64, 64, 64, -64, 64, -64, 64, 64, 64, 64, -64, -64, -64, -64, -64, -64, -64, -64, 64, 64, 64, 64, 64, 64, 64, -64, -64, -64, -64, -64, 64, -64, 64, 64, 64, 64, 64, -64, -64, -64, 64, -64, -64, -64, -64, -64, 64, 64, 64, 64, 64, 64, -64, -64, -64, 64, 64, 64, -64, -64, 64, 64, 64, -64, -64, -64, 64, -64, 64, 64, -64, -64, -64, 64, -64, 64, -64, -64, -64, -64, 64, -64, -64, -64, -64, 64, 64, -64, 64, 64, 64, 64, -64, 64, -64, 64, -64, 64, -64, -64, -64, -64, 64, 64, 64, -64, 64, 64, 64, 64, 64, 64, 64, 64, 64, -64, -64, -64, 64, -64, -64, 64, 64, -64, -64, 64, -64, -64, -64, 64, 64, -64, 64, 64, -64, 64, 64, 64, 64, 64, 64, 64, 64, 64, -64, 64, 64, -64, 64, -64, 64, -64, -64, 64, -64, 64, 64, -64, 64, -64, -64, -64, 64, -64, -64, -64, -64, -64, 64, 64, 64, -64, 64, -64, 64, 64, -64, -64, 64, -64, -64, -64, -64, 64, -64, 64, 64, -64, 64, -64, -64, -64, 64, -64, 64, -64, 64, 64, 64, -64, -64, -64, 64, -64, 64, -64, 64, -64, 64, 64, 64, 64, 64, -64, 64, 64, -64, -64, 64, 64, 64, -64, 64, 64, 64, 64, 64, 64, -64, -64, -64, -64, -64, 64, -64, 64, 64, 64, 64, 64, 64, 64, 64, -64, 64, 64, 64, 64, 64, 64, 64, 64, 64, -64, -64, -64, -64, -64, -64, 64, -64, -64, 64, 64, 64, 64, 64, 64, 64, 64, 64, 64, 64, 64, 64, 64, 64, 64, -64, -64, -64, -64, -64, -64, 64, 64, -64, -64, 64, -64, 64, -64, -64, 64, 64, 64, 64, 64, 64, 64, 64, 64, 64, -64, -64, -64, -64, -64, -64, -64, -64, -64, -64, 64, -64, -64, 64, 64, 64, 64, -64, 64, -64, -64, -64, -64, -64, -64, 64, 64, 64, 64, -64, -64, 64, -64, -64, -64, -64, -64, -64, -64, -64, 64, -64, 64, -64, 64, -64, -64, -64, -64, -64, -64, -64, -64, -64, 64, -64, -64, 64, -64, -64, 64, -64, -64, -64, -64, 64, -64, 64, 64, 64, -64, 64, 64, -64, -64, -64, -64, -64, -64, -64, 64, 64, -64, -64, 64, 64, 64, 64, -64, -64, -64, -64, -64, -64, -64, 64, -64, 64, -64, -64, -64, 64, -64, 64, -64, 64, -64, 64, -64, -64, -64, -64, 64, -64, -64, 64, 64, -64, -64, -64, -64, -64, -64, -64, -64, -64, 64, 64, 64, 64, 64, 64, 64, -64, 64, 64, -64, -64, -64, -64, 64, 64, 64, -64, 64, 64, -64, -64, -64, -64, -64, -64, 64, -64, 64, 64, -64, 64, 64, 64, 64, 64, -64, -64, -64, -64, -64, -64, 64, 64, 64, 64, 64, -64, -64, -64, -64, -64, -64, 64, -64, 64, -64, -64, -64, -64, 64, 64, -64, -64, -64, -64, -64, -64, -64, 64, 64, 64, -64, -64, 64, 64, -64, -64, -64, -64, -64, -64, -64, 64, 64, -64, -64, -64, -64, -64, -64, -64, -64, -64, -64, -64, 64, 64, 64, -64, -64, -64, 64, -64, -64, 64, -64, -64, -64, 64, 64, -64, -64, -64, -64, -64, -64, -64, -64, -64, -64, -64, -64, 64, 64, -64, -64, -64, -64, -64, 64, 64, 64, 64, -64, -64, 64, 64, 64, -64, 64, -64, -64, -64, -64, -64, -64, -64, -64, -64, 64, 64, 64, 64, -64, -64, -64, -64, -64, 64, -64, 64, 64, 64, 64, 64, 64, -64, 64, -64, -64, -64, -64, -64, -64, -64, 64, 64, 64, 64, 64, 64, -64, -64, -64, -64, -64, -64, 64, 64, 64, 64, 64, 64, 64, 64, -64, 64, 64, -64, -64, -64, 64, 64, 64, 64, 64, 64, 64, -64, -64, -64, -64, -64, -64, -64, 64, 64, -64, 64, 64, -64, -64, 64, -64, 64, -64, -64, -64, -64, 64, 64, 64, 64, 64, 64, 64, 64, -64, -64, 64, 64, -64, -64, -64, 64, 64, 64, 64, 64, 64, -64, -64, -64, -64, -64, -64, -64, 64, 64, 64, 64, 64, 64, -64, 64, 64, 64, 64, 64, 64, -64, -64, 64, 64, 64, 64, 64, 64, 64, -64, -64, -64, -64, -64, -64, -64, 64, 64, 64, 64, 64, 64, 64, 64, -64, -64, 64, 64, -64, 64, 64, 64, 64, -64, -64, 64, -64, 64, 64, -64, -64, 64, -64, -64, -64, 64, 64, 64, 64, 64, 64, 64, -64, -64, -64, -64, -64, -64, 64, 64, -64, 64, 64, -64, 64, 64, -64, -64, 64, 64, 64, -64, -64, 64, -64, -64, 64, 64, -64, 64, -64, -64, -64, -64, 64, -64, 64, 64, -64, 64, 64, 64, -64, 64, 64, 64, 64, 64, 64, 64, 64, -64, -64, -64, 64, 64, -64, -64, -64, -64, 64, -64, 64, -64, -64, -64, -64, 64, 64, 64, 64, 64, 64, 64, 64, 64, 64, -64, -64, -64, -64, -64, -64, -64, -64, 64, -64, -64, -64, -64, -64, -64, 64, -64, 64, -64, 64, 64, -64, -64, 64, 64, 64, -64, 64, -64, -64, -64, -64, -64, -64, -64, -64, 64, -64, -64, -64, -64, -64, 64, -64, 64, 64, -64, -64, -64, 64, -64, 64, -64, -64, 64, -64, -64, -64, -64, -64, -64, -64, -64, -64, -64, 64, -64, -64, 64, -64, -64, -64, -64, -64, -64, -64, -64, -64, 64, -64, -64, -64, -64, -64, -64, -64, -64, 64, -64, -64, -64, -64, -64, -64, -64, -64, 64, 64, 64, 64, -64, -64, -64, 64, 64, -64, -64, -64, -64, 64, 64, -64, -64, -64, 64, 64, -64, -64, 64, -64, -64, 64, 64, 64, 64, 64, 64, -64, -64, 64, -64, -64, 64, -64, -64, -64, -64, -64, 64, -64, 64, -64, 64, 64, -64, 64, 64, 64, 64, 64, -64, -64, 64, 64, 64, -64, 64, -64, 64, -64, 64, 64, -64, -64, -64, -64, 64, 64, 64, -64, -64, -64, 64, 64, 64, 64, 64, -64, 64, 64, 64, -64, -64, -64, 64, -64, -64, -64, -64, 64, -64, -64, -64, 64, 64, 64, 64, 64, -64, 64, 64, -64, 64, 64, 64, 64, -64, 64, -64, -64, 64, 64, -64, 64, -64, -64, 64, -64, -64, -64, -64, 64, -64, 64, -64, 64, 64, 64, -64, 64, 64, -64, -64, -64, 64, -64, -64, -64, -64, -64, 64, -64, -64, -64, 64, -64, -64, -64, 64, 64, 64, -64, -64, -64, -64, -64, -64, -64, 64, -64, -64, -64, 64, 64, 64, -64, -64, 64, -64, -64, 64, 64, 64, 64, 64, 64, -64, -64, -64, -64, -64, -64, -64, -64, 64, 64, 64, -64, -64, -64, -64, -64, -64, 64, -64, -64, -64, 64, 64, 64, -64, 64, 64, 64, -64, -64, 64, 64, 64, 64, 64, 64, 64, 64, 64, 64, 64, -64, -64, -64, -64, 64, -64, -64, 64, 64, 64, 64, 64, -64, -64, 64, -64, 64, 64, -64, -64, 64, -64, -64, -64, 64, 64, 64, -64, -64, -64, -64, -64, -64, -64, 64, 64, 64, -64, -64, 64, 64, -64, -64, -64, 64, 64, -64, -64, -64, 64, 64, -64, -64, 64, 64, -64, -64, -64, -64, 64, -64, -64, 64, 64, -64, -64, 64, 64, -64, -64, -64, -64, 64, 64, -64, 64, -64, -64, -64, -64, 64, 64, 64, -64, -64, -64, -64, -64, 64, -64, -64, -64, -64, -64, -64, -64, 64, -64, -64, -64, 64, 64, 64, 64, 64, 64, 64, -64, 64, 64, 64, 64, -64, -64, 64, -64, 64, -64, 64, 64, -64, -64, 64, -64, 64, 64, 64, -64, 64, 64, 64, 64, 64, -64, -64, 64, 64, 64, 64, 64, -64, -64, -64, 64, 64, 64, 64, 64, -64, 64, -64, -64, -64, -64, -64, -64, 64, 64, 64, 64, 64, 64, 64, 64, 64, 64, 64, 64, -64, -64, 64, 64, 64, 64, 64, 64, 64, -64, -64, -64, -64, -64, 64, 64, 64, 64, -64, 64, -64, -64, 64, 64, 64, 64, 64, 64, -64, 64, 64, 64, -64, 64, 64, 64, 64, 64, 64, 64, -64, 64, -64, 64, -64, -64, -64, -64, -64, -64, 64, 64, 64, 64, 64, -64, 64, 64, 64, 64, -64, 64, 64, 64, 64, 64, -64, 64, 64, -64, 64, -64, 64, 64, -64, 64, 64, 64, 64, 64, -64, 64, 64, 64, 64, -64, -64, -64, 64, 64, 64, 64, 64, -64, -64, 64, 64, -64, 64, -64, 64, 64, 64, 64, 64, 64, 64, 64, 64, 64, 64, 64, -64, -64, -64, -64, -64, 64, 64, 64, -64, -64, 64, 64, -64, 64, -64, 64, 64, -64, 64, -64, 64, 64, 64, 64, 64, 64, 64, 64, -64, -64, -64, 64, -64, -64, 64, 64, 64, 64, -64, -64, -64, -64, 64, 64, 64, 64, 64, 64, 64, 64, 64, 64, 64, 64, 64, 64, -64, 64, 64, -64, -64, -64, 64, -64, -64, 64, -64, -64, -64, -64, -64, 64, 64, 64, 64, 64, -64, -64, 64, 64, 64, 64, 64, -64, -64, -64, 64, 64, -64, -64, -64, -64, 64, 64, 64, 64, -64, -64, 64, 64, 64, -64, -64, -64, -64, -64, 64, -64, -64, -64, -64, -64, -64, -64, -64, -64, 64, 64, 64, 64, 64, 64, 64, -64, 64, -64, 64, -64, 64, -64, -64, -64, -64, -64, -64, -64, -64, -64, -64, -64, -64, -64, -64, -64, 64, -64, -64, -64, -64, 64, -64, 64, 64, -64, 64, -64, -64, -64, -64, -64, -64, -64, -64, -64, -64, -64, -64, 64, -64, -64, -64, -64, -64, -64, -64, 64, 64, -64, 64, -64, 64, -64, -64, -64, -64, -64, -64, -64, -64, -64, -64, -64, -64, 64, 64, -64, -64, -64, -64, 64, 64, 64, 64, 64, 64, 64, 64, -64, -64, -64, -64, -64, -64, -64, -64, -64, 64, 64, 64, 64, -64, -64, 64, -64, -64, -64, 64, 64, 64, -64, 64, 64, 64, 64, -64, -64, 64, -64, 64, -64, -64, -64, -64, -64, 64, 64, 64, 64, 64, 64, 64, 64, 64, 64, 64, 64, 64, 64, -64, -64, -64, -64, 64, -64, -64, 64, 64, -64, -64, 64, 64, 64, 64, 64, 64, 64, 64, -64, -64, -64, 64, -64, -64, 64, -64, 64, 64, 64, 64, -64, -64, 64, 64, 64, -64, -64, 64, 64, 64, 64, 64, -64, -64, 64, -64, -64, 64, -64, -64, -64, 64, -64, 64, -64, 64, 64, 64, -64, -64, -64, 64, 64, -64, -64, -64, -64, 64, -64, 64, -64, 64, -64, -64, 64, 64, -64, 64, 64, 64, 64, -64, 64, 64, -64, 64, -64, -64, 64, 64, -64, -64, 64, -64, 64, -64, -64, -64, 64, 64, 64, 64, 64, -64, 64, 64, -64, 64, 64, 64, -64, -64, 64, 64, -64, -64, 64, -64, -64, -64, -64, -64, -64, 64, -64, 64, -64, -64, -64, 64, 64, 64, -64, -64, 64, 64, 64, -64, -64, -64, -64, 64, 64, 64, -64, -64, 64, 64, -64, 64, -64, -64, 64, 64, 64, 64, -64, -64, 64, 64, 64, 64, 64, 64, -64, 64, 64, 64, 64, -64, 64, 64, 64, -64, -64, 64, -64, 64, -64, 64, -64, -64, -64, -64, 64, -64, -64, -64, -64, -64, -64, -64, -64, 64, 64, 64, -64, 64, 64, 64, -64, -64, -64, 64, 64, -64, -64, 64, 64, -64, -64, 64, -64, 64, -64, -64, -64, -64, -64, 64, 64, -64, 64, 64, 64, -64, 64, 64, 64, 64, -64, -64, 64, 64, 64, -64, 64, 64, 64, 64, 64, 64, 64, 64, 64, -64, -64, -64, -64, -64, 64, 64, -64, 64, -64, 64, 64, 64, 64, -64, -64, -64, -64, -64, -64, -64, 64, 64, 64, 64, 64, -64, -64, -64, -64, -64, -64, -64, 64, -64, 64, -64, 64, 64, 64, 64, 64, -64, -64, -64, -64, -64, 64, -64, -64, -64, -64, 64, 64, 64, -64, -64, -64, -64, 64, -64, 64, 64, 64, 64, 64, -64, -64, -64, 64, 64, -64, -64, -64, 64, -64, 64, 64, -64, 64, -64, -64, 64, -64, -64, -64, -64, -64, 64, 64, -64, 64, 64, 64, -64, -64, 64, -64, 64, -64, -64, 64, -64, -64, -64, 64, -64, -64, -64, 64, 64, 64, -64, -64, 64, -64, -64, 64, 64, -64, 64, -64, -64, -64, -64, 64, 64, 64, 64, -64, 64, -64, -64, -64, -64, 64, 64, -64, -64, -64, -64, -64, 64, 64, 64, -64, -64, -64, -64, -64, 64, -64, -64, -64, -64, -64, 64, 64, 64, -64, -64, -64, -64, 64, 64, 64, 64, 64, 64, -64, -64, -64, -64, -64, -64, -64, 64, 64, -64, -64, 64, 64, 64, 64, -64, -64, -64, -64, -64, -64, -64, -64, 64, 64, -64, -64, 64, -64, -64, -64, -64, 64, -64, 64, -64, 64, -64, 64, -64, 64, 64, -64, -64, -64, -64, -64, -64, 64, -64, -64, -64, -64, -64, -64, -64, -64, -64, -64, -64, -64, -64, -64, -64, -64, 64, -64, 64, 64, 64, -64, -64, -64, -64, -64, -64, -64, 64, -64, -64, -64, -64, -64, -64, -64, -64, 64, -64, -64, 64, -64, -64, 64, 64, 64, 64, 64, -64, 64, -64, -64, -64, -64, -64, -64, 64, -64, -64, -64, -64, -64, -64, 64, -64, -64, -64, -64, 64, 64, -64, 64, 64, 64, 64, 64, 64, 64, -64, -64, 64, -64, -64, -64, -64, -64, -64, -64, -64, -64, -64, 64, -64, -64, -64, 64, -64, -64, -64, 64, -64, 64, -64, -64, 64, 64, 64, -64, -64, 64, -64, -64, -64, -64, -64, -64, -64, -64, 64, -64, -64, -64, -64, 64, -64, 64, -64, -64, 64, -64, -64, -64, 64, 64, -64, 64, -64, 64, 64, -64, -64, -64, -64, -64, -64, -64, 64, 64, -64, -64, -64, 64, 64, 64, -64, -64, 64, -64, -64, 64, 64, 64, 64, -64, -64, -64, -64, -64, -64, -64, 64, -64, -64, 64, -64, -64, -64, -64, -64, -64, -64, -64, 64, -64, -64, 64, -64, 64, 64, 64, -64, -64, -64, -64, -64, 64, -64, -64, 64, -64, 64, 64, -64, -64, -64, -64, -64, -64, 64, -64, -64, -64, 64, 64, -64, 64, 64, -64, -64, 64, 64, -64, -64, -64, 64, -64, -64, -64, -64, 64, -64, -64, 64, -64, -64, -64, -64, 64, 64, -64, -64, -64, 64, -64, -64, -64, -64, 64, -64, -64, 64, -64, 64, -64, -64, 64, -64, -64, -64, -64, -64, -64, 64, 64, 64, 64, 64, 64, 64, -64, 64, -64, 64, -64, 64, -64, 64, 64, -64, -64, 64, 64, 64, -64, -64, 64, 64, 64, -64, -64, 64, 64, -64, 64, -64, -64, 64, 64, -64, -64, 64, -64, 64, 64, 64, 64, 64, 64, 64, 64, -64, -64, 64, 64, 64, 64, 64, 64, 64, 64, 64, 64, -64, -64, 64, 64, -64, 64, -64, -64, 64, -64, 64, 64, 64, 64, 64, 64, 64, 64, 64, 64, 64, 64, 64, 64, 64, 64, -64, 64, 64, 64, -64, 64, -64, -64, 64, 64, 64, -64, -64, -64, 64, -64, 64, 64, -64, 64, -64, -64, 64, 64, -64, -64, 64, -64, -64, -64, -64, -64, 64, -64, -64, -64, 64, 64, 64, -64, 64, 64, 64, -64, -64, 64, -64, 64, 64, 64, -64, -64, -64, -64, 64, 64, 64, 64, 64, -64, 64, 64, -64, -64, 64, -64, 64, 64, -64, -64, -64, 64, 64, -64, -64, 64, -64, -64, 64, -64, 64, -64, 64, 64, -64, 64, -64, -64, -64, 64, -64, -64, -64, -64, -64, -64, 64, -64, -64, 64, -64, 64, -64, 64, -64, -64, 64, -64, 64, -64, -64, -64, -64, 64, 64, -64, -64, -64, 64, 64, -64, -64, 64, -64, -64, 64, 64, -64, -64, 64, 64, 64, -64, -64, -64, -64, 64, 64, -64, 64, -64, -64, -64, -64, -64, -64, 64, 64, -64, 64, 64, -64, -64, 64, 64, 64, 64, -64, 64, -64, -64, -64, -64, -64, -64, 64, -64, -64, 64, -64, 64, 64, -64, -64, -64, -64, 64, -64, 64, -64, 64, -64, -64, 64, -64, -64, -64, -64, -64, -64, 64, 64, 64, -64, -64, -64, 64, -64, -64, 64, 64, -64, -64, -64, -64, -64, -64, 64, -64, 64, -64, -64, -64, -64, -64, -64, 64, 64, 64, 64, -64, 64, -64, 64, -64, 64, -64, 64, -64, -64, 64, 64, -64, -64, -64, 64, -64, 64, -64, -64, -64, -64, -64, -64, 64, -64, -64, -64, -64, -64, -64, 64, 64, 64, 64, 64, -64, 64, 64, -64, 64, 64, 64, 64, 64, -64, 64, -64, -64, 64, 64, -64, -64, -64, -64, -64, -64, -64, 64, 64, -64, 64, 64, 64, -64, 64, 64, 64, -64, -64, -64, -64, -64, -64, -64, -64, 64, 64, -64, -64, 64, 64, -64, -64, -64, -64, -64, -64, -64, -64, -64, 64, -64, -64, -64, 64, 64, -64, -64, -64, -64, -64, 64, -64, -64, -64, -64, -64, 64, 64, -64, -64, 64, -64, -64, -64, 64, 64, -64, 64, -64, -64, 64, 64, -64, -64, 64, 64, 64, -64, 64, -64, -64, -64, -64, -64, -64, -64, 64, 64, -64, 64, -64, -64, 64, -64, -64, -64, 64, 64, -64, 64, -64, -64, 64, -64, 64, -64, -64, 64, -64, 64, -64, -64, 64, -64, 64, 64, -64, -64, -64, 64, -64, 64, -64, 64, -64, 64, -64, -64, -64, 64, -64, -64, -64, 64, -64, -64, 64, -64, -64, -64, -64, 64, -64, 64, 64, -64, -64, 64, -64, 64, 64, 64, 64, -64, 64, -64, -64, 64, -64, 64, -64, -64, -64, 64, -64, -64, 64, -64, 64, -64, -64, -64, -64, 64, 64, -64, -64, 64, 64, -64, 64, -64, 64, 64, 64, -64, -64, -64, 64, -64, -64, 64, 64, -64, -64, 64, -64, -64, 64, -64, -64, 64, -64, 64, -64, -64, -64, -64, -64, 64, 64, 64, -64, -64, -64, -64, -64, -64, -64, 64, 64, -64, -64, -64, -64, -64, -64, 64, -64, -64, -64, 64, -64, 64, -64, 64, -64, -64, 64, -64, -64, 64, 64, -64, -64, 64, -64, -64, -64, -64, -64, -64, -64, 64, -64, -64, -64, 64, -64, -64, 64, -64, 64, 64, -64, -64, -64, 64, 64, 64, 64, 64, -64, -64, 64, -64, 64, -64, -64, -64, 64, -64, -64, 64, -64, 64, -64, -64, -64, -64, -64, -64, 64, -64, -64, -64, -64, -64, -64, -64, -64, -64, -64, -64, 64, -64, -64, -64, 64, -64, -64, -64, 64, -64, -64, -64, -64, 64, -64, -64, 64, -64, 64, -64, -64, 64, 64, -64, 64, -64, -64, -64, -64, 64, -64, -64, -64, -64, -64, 64, -64, 64, -64, -64, 64, -64, 64, 64, -64, -64, -64, 64, 64, -64, 64, -64, 64, 64, -64, 64, -64, -64, 64, 64, -64, -64, -64, 64, 64, -64, 64, -64, -64, 64, 64, 64, -64, 64, 64, 64, -64, 64, 64, -64, 64, 64, -64, 64, -64, -64, -64, -64, -64, -64, -64, 64, 64, -64, -64, -64, -64, -64, 64, -64, 64, -64, 64, 64, -64, -64, -64, -64, 64, -64, -64, -64, 64, 64, 64, -64, -64, -64, -64, 64, -64, -64, 64, 64, -64, -64, -64, 64, -64, 64, -64, 64, -64, 64, 64, 64, -64, 64, 64, -64, -64, -64, -64, 64, 64, -64, 64, 64, 64, 64, -64, 64, -64, 64, 64, -64, -64, 64, -64, -64, 64, 64, 64, -64, -64, 64, 64, -64, 64, -64, -64, -64, -64, -64, 64, 64, -64, 64, -64, 64, -64, 64, 64, -64, -64, -64, 64, 64, -64, -64, 64, -64, 64, -64, 64, -64, -64, 64, 64, 64, -64, -64, -64, 64, -64, -64, -64, -64, 64, -64, 64, 64, -64, 64, -64, -64, 64, 64, -64, -64, -64, -64, -64, 64, 64, -64, 64, 64, -64, 64, 64, -64, 64, 64, 64, -64, -64, 64, -64, -64, 64, 64, -64, -64, 64, -64, 64, 64, 64, 64, 64, 64, -64, 64, -64, -64, 64, 64, 64, -64, -64, -64, -64, -64, 64, -64, -64, -64, 64, 64, -64, 64, -64, 64, -64, 64, 64, 64, -64, 64, 64, 64, -64, 64, 64, 64, 64, 64, 64, -64, -64, -64, 64, 64, 64, 64, 64, -64, 64, -64, 64, -64, 64, 64, -64, -64, -64, 64, 64, 64, -64, -64, 64, -64, 64, -64, 64, -64, -64, -64, -64, 64, -64, 64, -64, -64, 64, 64, 64, 64, 64, 64, 64, 64, -64, 64, -64, -64, -64, 64, 64, 64, -64, 64, -64, 64, 64, 64, 64, -64, 64, -64, -64, -64, 64, 64, -64, 64, -64, -64, 64, -64, -64, -64, -64, -64, 64, 64, 64, 64, 64, 64, -64, 64, 64, -64, 64, -64, 64, -64, -64, 64, 64, -64, -64, 64, -64, 64, 64, 64, 64, -64, -64, 64, 64, -64, 64, 64, -64, 64, -64, 64, -64, 64, -64, -64, 64, -64, 64, 64, 64, -64, -64, 64, 64, 64, 64, -64, -64, 64, 64, 64, 64, 64, 64, -64, -64, -64, 64, 64, 64, 64, 64, 64, -64, -64, 64, 64, -64, -64, 64, -64, -64, -64, -64, 64, -64, 64, -64, 64, 64, -64, -64, 64, -64, -64, 64, 64, 64, -64, -64, 64, 64, -64, 64, 64, -64, 64, 64, -64, 64, 64, -64, -64, 64, 64, 64, -64, 64, 64, 64, -64, -64, 64, 64, 64, 64, -64, -64, -64, 64, -64, 64, 64, 64, 64, 64, 64, -64, 64, -64, -64, 64, 64, 64, 64, -64, -64, 64, -64, 64, 64, -64, -64, -64, -64, 64, 64, -64, 64, 64, 64, 64, 64, 64, -64, -64, -64, 64, -64, 64, 64, 64, -64, -64, 64, 64, 64, -64, -64, 64, -64, -64, 64, -64, 64, -64, -64, 64, 64, 64, 64, -64, 64, -64, -64, 64, -64, 64, -64, 64, -64, 64, 64, 64, 64, -64, -64, 64, 64, 64, 64, 64, 64, 64, 64, -64, 64, 64, 64, 64, -64, 64, 64, -64, 64, 64, 64, 64, 64, 64, 64, 64, -64, 64, 64, 64, 64, 64, 64, 64, -64, -64, -64, -64, 64, 64, 64, -64, -64, -64, 64, 64, 64, 64, 64, 64, -64, -64, 64, 64, 64, 64, -64, 64, 64, 64, 64, -64, -64, -64, -64, -64, -64, 64, -64, -64, -64, 64, -64, -64, -64, -64, 64, 64, 64, -64, 64, 64, -64, 64, 64, 64, 64, -64, 64, -64, 64, 64, 64, 64, 64, -64, 64, 64, -64, 64, -64, -64, 64, -64, 64, 64, 64, 64, -64, 64, 64, -64, 64, 64, 64, 64, 64, -64, -64, -64, -64, 64, 64, -64, -64, 64, 64, 64, 64, 64, -64, 64, 64, 64, -64, 64, 64, 64, -64, 64, 64, 64, 64, 64, -64, 64, -64, 64, 64, -64, 64, 64, -64, 64, -64, -64, -64, -64, 64, -64, 64, -64, -64, -64, -64, -64, -64, 64, 64, 64, -64, 64, -64, -64, 64, -64, 64, 64, 64, -64, -64, -64, 64, 64, -64, -64, -64, -64, 64, -64, 64, 64, -64, 64, 64, 64, 64, 64, 64, 64, 64, 64, -64, -64, -64, -64, 64, 64, -64, 64, -64, 64, 64, 64, 64, 64, 64, 64, -64, 64, -64, 64, 64, 64, 64, 64, 64, -64, -64, 64, -64, -64, -64, 64, -64, 64, 64, 64, 64, 64, 64, 64, 64, 64, -64, -64, 64, 64, -64, 64, 64, 64, 64, 64, 64, -64, 64, -64, -64, 64, -64, -64, 64, -64, -64, 64, 64, 64, -64, 64, -64, -64, 64, 64, 64, -64, 64, 64, 64, 64, 64, 64, 64, -64, -64, -64, -64, 64, 64, 64, -64, 64, -64, 64, 64, -64, 64, -64, 64, 64, 64, -64, 64, -64, 64, 64, -64, -64, 64, 64, 64, 64, 64, 64, -64, 64, 64, -64, 64, -64, -64, 64, -64, -64, -64, 64, -64, 64, 64, 64, 64, -64, -64, 64, 64, -64, -64, 64, 64, 64, 64, 64, -64, 64, 64, -64, -64, -64, -64, -64, 64, 64, 64, 64, -64, -64, 64, -64, 64, 64, -64, -64, -64, -64, -64, -64, -64, -64, -64, -64, -64, -64, -64, -64, -64, 64, -64, -64, -64, 64, 64, 64, 64, 64, 64, 64, 64, -64, -64, -64, -64, -64, -64, -64, -64, -64, 64, -64, -64, -64, -64, -64, -64, 64, 64, 64, 64, -64, 64, 64, -64, -64, 64, -64, 64, -64, 64, 64, 64, 64, -64, -64, -64, 64, 64, -64, -64, -64, 64, 64, 64, -64, -64, 64, -64, 64, -64, 64, 64, -64, -64, -64, 64, -64, -64, -64, 64, -64, -64, 64, -64, 64, -64, 64, -64, 64, 64, -64, -64, -64, 64, -64, 64, 64, 64, -64, 64, -64, 64, 64, -64, -64, -64, -64, -64, -64, 64, 64, 64, 64, -64, 64, -64, -64, -64, 64, 64, 64, -64, -64, 64, -64, 64, 64, 64, 64, 64, 64, -64, 64, 64, 64, -64, 64, 64, -64, 64, 64, -64, -64, 64, 64, -64, 64, -64, 64, -64, 64, -64, 64, 64, 64, -64, 64, 64, 64, -64, 64, 64, 64, 64, -64, 64, 64, 64, 64, 64, 64, 64, -64, -64, -64, 64, -64, 64, 64, -64, 64, 64, -64, 64, 64, -64, 64, 64, 64, 64, 64, 64, 64, 64, 64, -64, 64, -64, 64, -64, -64, 64, 64, -64, -64, -64, -64, 64, -64, -64, -64, -64, 64, 64, 64, 64, -64, 64, -64, 64, 64, 64, 64, 64, 64, -64, 64, -64, 64, -64, -64, 64, 64, -64, 64, -64, -64, -64, -64, 64, 64, 64, -64, -64, 64, 64, 64, 64, 64, 64, 64, -64, -64, 64, 64, 64, 64, 64, -64, 64, 64, -64, -64, 64, -64, -64, -64, 64, 64, -64, -64, 64, -64, 64, 64, 64, 64, 64, 64, 64, 64, -64, 64, -64, 64, 64, -64, 64, 64, 64, -64, -64, -64, -64, -64, 64, 64, -64, 64, 64, -64, 64, 64, 64, 64, -64, 64, -64, 64, -64, -64, 64, -64, 64, -64, -64, -64, 64, -64, -64, -64, 64, 64, 64, 64, 64, 64, 64, 64, 64, 64, 64, 64, -64, -64, -64, 64, -64, 64, 64, -64, 64, -64, 64, 64, -64, -64, -64, -64, 64, -64, -64, 64, -64, 64, -64, 64, 64, 64, 64, 64, -64, -64, -64, -64, -64, 64, 64, 64, 64, 64, -64, 64, -64, 64, 64, 64, 64, 64, 64, -64, -64, 64, 64, 64, 64, -64, -64, 64, -64, -64, -64, 64, 64, 64, 64, 64, 64, 64, 64, -64, -64, 64, -64, 64, -64, -64, -64, -64, -64, -64, 64, 64, 64, 64, 64, -64, -64, -64, -64, 64, 64, 64, 64, 64, 64, 64, 64, 64, 64, -64, 64, 64, -64, -64, -64, 64, -64, -64, -64, -64, 64, -64, -64, -64, -64, -64, -64, -64, 64, 64, 64, 64, 64, -64, -64, -64, -64, -64, -64, 64, -64, -64, -64, -64, -64, -64, -64, 64, 64, 64, 64, -64, -64, 64, 64, -64, -64, 64, 64, 64, 64, 64, 64, -64, 64, -64, 64, 64, -64, -64, -64, 64, -64, -64, 64, 64, 64, 64, -64, -64, -64, -64, 64, -64, 64, 64, 64, 64, 64, -64, -64, -64, 64, -64, 64, 64, 64, 64, 64, 64, -64, -64, 64, 64, 64, 64, 64, 64, -64, -64, -64, 64, -64, -64, 64, -64, 64, -64, -64, -64, -64, -64, 64, 64, 64, 64, 64, 64, -64, 64, 64, 64, 64, 64, 64, 64, 64, 64, 64, 64, -64, -64, 64, 64, -64, -64, -64, 64, 64, -64, 64, 64, 64, 64, 64, 64, 64, 64, 64, 64, 64, -64, 64, 64, 64, -64, 64, 64, -64, -64, -64, 64, -64, 64, -64, 64, -64, 64, -64, 64, 64, -64, 64, 64, 64, 64, 64, 64, 64, -64, -64, -64, 64, -64, 64, 64, -64, 64, -64, 64, -64, 64, -64, 64, -64, -64, 64, 64, -64, 64, 64, 64, 64, 64, 64, 64, 64, -64, -64, 64, 64, 64, -64, 64, 64, -64, 64, 64, 64, -64, -64, 64, -64, -64, -64, 64, -64, -64, 64, 64, 64, 64, 64, 64, 64, 64, -64, 64, 64, 64, 64, 64, 64, 64, 64, 64, -64, 64, 64, -64, -64, -64, -64, 64, -64, 64, 64, 64, 64, 64, 64, 64, 64, 64, 64, 64, 64, 64, 64, 64, 64, 64, 64, 64, -64, -64, 64, 64, -64, -64, 64, -64, 64, -64, 64, -64, 64, -64, -64, -64, 64, 64, 64, 64, -64, 64, -64, -64, -64, 64, 64, 64, -64, 64, -64, 64, -64, 64, 64, -64, 64, -64, -64, 64, 64, -64, 64, 64, 64, 64, -64, -64, -64, -64, -64, 64, -64, 64, 64, 64, -64, 64, -64, -64, 64, 64, -64, 64, -64, -64, -64, -64, 64, 64, 64, 64, 64, -64, -64, -64, -64, -64, -64, 64, -64, -64, -64, 64, 64, 64, -64, 64, -64, 64, -64, -64, -64, 64, -64, -64, -64, -64, -64, -64, -64, -64, -64, -64, -64, -64, -64, 64, 64, -64, -64, 64, 64, -64, -64, -64, -64, 64, 64, 64, 64, -64, -64, -64, -64, -64, -64, -64, -64, -64, -64, 64, 64, -64, 64, -64, 64, 64, 64, 64, 64, 64, 64, 64, 64, 64, 64, 64, 64, 64, 64, -64, 64, 64, -64, -64, -64, -64, -64, 64, 64, -64, -64, 64, 64, 64, -64, -64, -64, -64, -64, -64, 64, 64, -64, -64, 64, -64, -64, 64, -64, -64, 64, -64, 64, 64, -64, -64, -64, -64, 64, -64, 64, 64, -64, -64, -64, -64, -64, -64, 64, -64, 64, 64, -64, -64, -64, -64, -64, -64, 64, 64, 64, 64, 64, 64, -64, -64, -64, 64, -64, -64, -64, 64, 64, -64, -64, -64, -64, 64, -64, -64, -64, -64, -64, -64, 64, -64, 64, 64, 64, 64, 64, 64, 64, 64, 64, -64, 64, -64, -64, 64, 64, -64, 64, -64, -64, -64, 64, -64, -64, 64, -64, 64, 64, -64, 64, 64, -64, -64, -64, -64, 64, -64, 64, 64, 64, 64, 64, -64, -64, 64, 64, -64, -64, -64, 64, 64, -64, 64, 64, 64, -64, -64, -64, -64, -64, 64, 64, 64, 64, 64, -64, 64, -64, 64, 64, -64, 64, -64, -64, 64, 64, -64, -64, 64, -64, -64, -64, 64, -64, 64, -64, 64, -64, -64, -64, 64, 64, 64, 64, -64, -64, 64, -64, -64, 64, 64, 64, 64, 64, 64, -64, 64, -64, 64, -64, 64, -64, -64, -64, 64, 64, -64, -64, -64, 64, -64, 64, -64, -64, -64, -64, -64, -64, 64, 64, -64, -64, 64, -64, -64, 64, -64, 64, -64, -64, -64, -64, -64, -64, -64, 64, -64, -64, 64, 64, -64, -64, -64, -64, -64, 64, -64, -64, 64, -64, -64, -64, -64, -64, -64, 64, 64, -64, -64, -64, -64, -64, -64, -64, -64, 64, -64, -64, 64, -64, 64, 64, 64, 64, 64, 64, -64, 64, -64, -64, -64, -64, -64, -64, 64, -64, -64, 64, -64, 64, -64, -64, -64, -64, -64, 64, -64, -64, 64, -64, -64, -64, -64, 64, 64, 64, 64, 64, -64, -64, -64, -64, 64, -64, -64, 64, -64, 64, -64, 64, -64, -64, 64, -64, -64, 64, 64, -64, -64, -64, -64, 64, 64, -64, 64, -64, -64, -64, -64, 64, -64, -64, -64, -64, 64, 64, 64, -64, -64, -64, -64, 64, -64, 64, 64, 64, 64, -64, -64, -64, -64, 64, -64, -64, -64, 64, 64, -64, -64, 64, 64, -64, 64, -64, -64, -64, -64, 64, -64, -64, -64, -64, -64, 64, 64, -64, 64, -64, -64, 64, -64, -64, 64, -64, 64, -64, -64, -64, 64, 64, -64, -64, -64, -64, -64, -64, -64, 64, -64, 64, 64, 64, 64, -64, -64, 64, -64, 64, 64, 64, 64, -64, -64, 64, -64, -64, -64, -64, -64, -64, 64, -64, 64, 64, 64, -64, 64, 64, 64, -64, 64, 64, -64, -64, 64, 64, -64, -64, 64, -64, -64, -64, -64, -64, -64, -64, -64, -64, -64, -64, -64, -64, 64, -64, -64, 64, -64, -64, -64, -64, -64, -64, -64, 64, 64, 64, 64, -64, -64, -64, -64, -64, 64, -64, -64, -64, 64, -64, -64, -64, 64, -64, -64, 64, 64, -64, 64, -64, -64, -64, -64, -64, -64, 64, 64, -64, -64, 64, -64, 64, 64, -64, 64, -64, 64, -64, 64, -64, -64, 64, -64, -64, 64, 64, 64, -64, -64, 64, -64, 64, 64, -64, 64, -64, 64, -64, 64, -64, 64, -64, -64, -64, -64, -64, 64, 64, 64, -64, -64, -64, 64, -64, 64, -64, 64, 64, -64, 64, 64, -64, 64, 64, 64, -64, -64, 64, 64, -64, 64, 64, 64, -64, -64, 64, 64, 64, 64, -64, -64, -64, -64, -64, 64, 64, 64, -64, -64, -64, 64, -64, -64, 64, -64, -64, 64, -64, -64, -64, -64, 64, -64, -64, 64, -64, -64, -64, 64, 64, 64, -64, -64, -64, 64, 64, 64, -64, -64, 64, -64, -64, -64, 64, -64, -64, -64, 64, -64, -64, -64, -64, -64, -64, -64, -64, 64, 64, 64, -64, -64, -64, -64, 64, -64, 64, 64, -64, 64, -64, 64, 64, 64, -64, -64, -64, 64, 64, -64, 64, -64, -64, -64, -64, 64, -64, -64, 64, 64, -64, 64, 64, 64, -64, -64, -64, 64, -64, -64, -64, -64, 64, -64, -64, 64, -64, -64, -64, 64, -64, 64, -64, -64, -64, -64, 64, 64, 64, 64, -64, -64, -64, -64, -64, -64, -64, 64, -64, -64, 64, -64, -64, 64, 64, -64, 64, 64, -64, 64, -64, -64, -64, 64, 64, -64, 64, -64, -64, 64, -64, 64, -64, -64, -64, -64, 64, 64, 64, 64, 64, -64, -64, 64, 64, -64, -64, -64, 64, -64, 64, -64, -64, 64, 64, -64, 64, -64, -64, 64, -64, 64, 64, -64, -64, 64, 64, -64, -64, -64, -64, -64, -64, 64, 64, -64, 64, -64, 64, -64, -64, 64, 64, 64, 64, -64, -64, -64, 64, -64, -64, -64, 64, -64, -64, -64, 64, -64, 64, -64, 64, -64, 64, -64, 64, 64, 64, 64, 64, -64, -64, 64, -64, -64, -64, 64, 64, -64, -64, 64, 64, -64, -64, 64, 64, 64, 64, -64, 64, -64, -64, 64, -64, 64, -64, 64, 64, 64, -64, -64, 64, 64, -64, -64, -64, -64, 64, 64, 64, -64, -64, -64, 64, 64, -64, -64, 64, -64, -64, -64, -64, 64, -64, -64, -64, 64, -64, 64, -64, 64, 64, -64, 64, 64, 64, 64, -64, -64, 64, -64, -64, -64, -64, 64, -64, 64, -64, -64, 64, -64, 64, -64, -64, 64, -64, 64, -64, 64, -64, 64, 64, 64, 64, 64, -64, 64, -64, 64, 64, 64, 64, 64, 64, 64, 64, -64, 64, 64, -64, 64, 64, -64, -64, 64, -64, 64, -64, -64, 64, 64, -64, 64, -64, 64, 64, 64, -64, 64, 64, -64, 64, 64, 64, -64, -64, 64, 64, -64, 64, 64, -64, -64, -64, 64, -64, 64, 64, 64, -64, 64, 64, 64, 64, -64, 64, 64, 64, 64, -64, -64, -64, -64, 64, 64, -64, -64, -64, 64, 64, -64, 64, -64, 64, 64, 64, 64, -64, -64, 64, -64, 64, 64, 64, -64, 64, 64, -64, 64, 64, -64, -64, -64, -64, -64, -64, 64, 64, -64, -64, -64, 64, 64, -64, -64, 64, 64, -64, 64, 64, -64, 64, 64, 64, -64, 64, -64, -64, 64, -64, -64, -64, 64, 64, 64, 64, 64, -64, -64, -64, 64, 64, -64, 64, 64, -64, 64, 64, 64, -64, -64, 64, 64, 64, 64, 64, 64, 64, 64, 64, 64, 64, 64, 64, -64, -64, -64, -64, 64, -64, 64, 64, 64, 64, 64, 64, 64, 64, 64, 64, 64, -64, -64, 64, -64, -64, 64, 64, -64, -64, 64, 64, 64, 64, 64, -64, -64, 64, 64, 64, 64, 64, -64, 64, -64, 64, -64, -64, -64, -64, 64, -64, -64, 64, 64, 64, -64, -64, 64, 64, -64, 64, -64, -64, -64, 64, -64, 64, 64, 64, 64, 64, 64, 64, -64, 64, -64, 64, 64, -64, -64, 64, 64, 64, -64, -64, -64, -64, 64, 64, 64, -64, 64, 64, 64, 64, -64, 64, 64, 64, 64, -64, -64, 64, 64, 64, -64, -64, -64, -64, -64, -64, -64, 64, -64, -64, 64, 64, -64, -64, 64, 64, 64, -64, 64, 64, 64, -64, 64, 64, 64, -64, 64, -64, 64, 64, 64, -64, -64, 64, -64, 64, 64, -64, -64, -64, 64, -64, 64, 64, 64, 64, 64, 64, 64, -64, -64, 64, 64, 64, -64, 64, 64, 64, 64, 64, -64, 64, -64, 64, 64, -64, 64, -64, 64, 64, 64, -64, -64, 64, -64, 64, 64, 64, 64, 64, 64, 64, -64, 64, 64, 64, 64, -64, -64, 64, 64, 64, 64, -64, -64, -64, -64, -64, 64, -64, -64, -64, 64, 64, 64, -64, 64, 64, 64, 64, -64, -64, 64, 64, -64, -64, -64, -64, 64, 64, -64, 64, -64, 64, 64, -64, -64, 64, -64, 64, -64, 64, 64, 64, -64, 64, 64, -64, 64, 64, 64, 64, 64, 64, 64, 64, -64, 64, 64, -64, -64, 64, -64, 64, 64, 64, 64, -64, 64, 64, 64, 64, -64, 64, 64, 64, 64, 64, -64, 64, -64, 64, 64, 64, 64, 64, 64, -64, 64, 64, -64, -64, 64, -64, 64, 64, 64, 64, -64, 64, -64, 64, 64, 64, 64, 64, 64, 64, -64, 64, -64, 64, 64, 64, -64, -64, -64, -64, -64, 64, -64, 64, 64, -64, -64, 64, -64, 64, 64, -64, -64, -64, 64, -64, 64, 64, -64, 64, 64, 64, 64, -64, 64, 64, 64, -64, 64, -64, 64, -64, 64, 64, 64, -64, 64, -64, -64, 64, 64, -64, 64, -64, -64, -64, -64, 64, -64, -64, -64, -64, -64, 64, -64, 64, 64, -64, 64, 64, 64, 64, 64, 64, -64, -64, -64, 64, 64, 64, 64, -64, 64, 64, 64, 64, 64, 64, 64, 64, -64, -64, 64, 64, 64, -64, -64, -64, 64, -64, 64, -64, 64, 64, -64, -64, -64, 64, 64, 64, -64, 64, 64, 64, 64, 64, 64, -64, -64, 64, 64, 64, -64, 64, 64, -64, -64, -64, 64, -64, -64, -64, 64, 64, -64, 64, -64, 64, -64, 64, -64, 64, -64, 64, -64, -64, 64, -64, 64, -64, 64, -64, 64, 64, -64, 64, -64, 64, 64, 64, -64, 64, -64, -64, 64, 64, 64, 64, 64, -64, 64, -64, 64, 64, -64, 64, 64, -64, 64, -64, 64, -64, -64, 64, 64, -64, -64, 64, 64, 64, 64, -64, 64, 64, 64, -64, -64, 64, 64, 64, -64, 64, -64, 64, -64, -64, 64, 64, 64, 64, -64, 64, 64, 64, 64, 64, -64, 64, 64, -64, -64, 64, -64, -64, 64, 64, 64, 64, -64, 64, -64, 64, -64, 64, -64, 64, -64, 64, 64, 64, 64, -64, -64, 64, 64, 64, 64, 64, 64, 64, -64, 64, -64, -64, 64, -64, -64, -64, -64, -64, 64, 64, -64, 64, -64, -64, -64, -64, 64, -64, -64, 64, 64, -64, 64, 64, 64, -64, -64, -64, -64, -64, -64, -64, -64, 64, 64, -64, -64, 64, -64, 64, 64, -64, 64, 64, -64, -64, 64, -64, -64, -64, 64, -64, -64, 64, 64, 64, -64, 64, 64, -64, 64, 64, 64, 64, -64, 64, -64, 64, -64, 64, -64, -64, 64, -64, -64, 64, -64, -64, -64, -64, -64, -64, -64, 64, 64, -64, -64, -64, -64, -64, 64, 64, 64, -64, -64, -64, 64, 64, -64, -64, -64, -64, -64, -64, 64, -64, 64, 64, -64, -64, -64, -64, 64, -64, 64, -64, 64, -64, -64, 64, 64, -64, -64, 64, -64, -64, 64, 64, -64, 64, -64, -64, -64, -64, -64, -64, -64, -64, -64, -64, -64, -64, -64, -64, -64, 64, 64, -64, 64, 64, -64, -64, -64, -64, 64, 64, -64, -64, -64, -64, -64, -64, -64, -64, -64, -64, -64, -64, -64, -64, -64, -64, -64, -64, 64, 64, 64, -64, -64, -64, -64, -64, -64, -64, -64, -64, -64, -64, -64, 64, 64, -64, 64, -64, 64, -64, -64, -64, -64, 64, -64, 64, 64, -64, -64, -64, -64, -64, -64, 64, 64, -64, -64, -64, -64, -64, -64, -64, -64, -64, 64, -64, 64, -64, -64, -64, -64, -64, -64, -64, 64, 64, 64, -64, -64, -64, -64, -64, 64, -64, -64, -64, -64, -64, 64, 64, -64, -64, -64, 64, 64, -64, 64, 64, -64, -64, -64, -64, -64, 64, -64, -64, 64, 64, -64, 64, 64, -64, -64, -64, 64, 64, -64, 64, -64, -64, -64, 64, 64, -64, -64, -64, 64, -64, -64, 64, 64, -64, -64, -64, 64, -64, -64, -64, -64, -64, -64, -64, 64, -64, -64, 64, 64, -64, 64, -64, 64, -64, 64, 64, -64, -64, -64, 64, -64, -64, -64, -64, 64, -64, -64, 64, -64, -64, 64, -64, 64, 64, 64, -64, 64, 64, -64, -64, -64, 64, -64, 64, -64, 64, -64, 64, 64, 64, -64, 64, -64, 64, -64, -64, -64, -64, -64, 64, 64, -64, 64, 64, -64, 64, -64, -64, 64, -64, 64, 64, 64, 64, -64, -64, 64, -64, 64, -64, 64, 64, -64, 64, 64, -64, -64, 64, 64, -64, 64, -64, -64, 64, -64, -64, -64, 64, -64, 64, -64, -64, -64, 64, 64, -64, 64, 64, 64, 64, -64, 64, -64, -64, -64, -64, -64, 64, 64, -64, 64, -64, -64, -64, -64, 64, -64, -64, -64, -64, -64, -64, -64, -64, -64, -64, -64, -64, -64, 64, -64, -64, -64, 64, 64, -64, -64, 64, -64, -64, -64, -64, 64, -64, 64, -64, 64, -64, 64, -64, -64, 64, 64, -64, 64, -64, -64, -64, -64, -64, -64, -64, -64, -64, -64, 64, 64, -64, -64, -64, -64, 64, -64, -64, -64, -64, -64, 64, -64, -64, -64, -64, -64, -64, -64, -64, -64, -64, 64, -64, -64, -64, -64, -64, -64, -64, -64, -64, -64, -64, 64, 64, -64, -64, 64, 64, -64, -64, -64, -64, -64, 64, -64, -64, -64, -64, -64, 64, -64, 64, -64, -64, -64, -64, -64, 64, 64, 64, -64, -64, -64, -64, 64, -64, -64, 64, 64, -64, 64, -64, 64, 64, -64, 64, -64, -64, -64, -64, -64, -64, -64, -64, 64, -64, -64, -64, 64, 64, -64, -64, -64, 64, 64, -64, 64, 64, -64, -64, 64, -64, -64, -64, -64, -64, -64, -64, -64, -64, -64, -64, -64, -64, -64, -64, -64, 64, -64, -64, 64, -64, 64, 64, -64, 64, -64, -64, -64, -64, 64, -64, 64, 64, -64, 64, 64, -64, -64, -64, -64, 64, -64, -64, -64, 64, 64, -64, -64, 64, 64, 64, 64, -64, -64, 64, 64, -64, 64, 64, -64, -64, -64, -64, -64, -64, 64, -64, -64, -64, -64, 64, 64, 64, -64, -64, 64, -64, -64, -64, 64, 64, -64, -64, -64, -64, 64, 64, 64, -64, 64, -64, 64, -64, 64, -64, -64, -64, -64, -64, -64, -64, -64, 64, -64, -64, -64, 64, -64, -64, -64, 64, 64, -64, 64, 64, 64, -64, -64, 64, -64, 64, 64, -64, -64, -64, -64, 64, 64, 64, -64, 64, -64, -64, 64, -64, 64, -64, -64, 64, -64, -64, -64, 64, 64, 64, -64, 64, 64, 64, 64, 64, -64, -64, 64, 64, 64, 64, -64, -64, -64, -64, -64, 64, -64, 64, -64, 64, 64, -64, 64, 64, -64, -64, 64, 64, -64, -64, -64, -64, -64, -64, -64, 64, -64, -64, 64, -64, 64, 64, -64, -64, 64, 64, -64, 64, -64, -64, 64, -64, -64, 64, -64, 64, -64, 64, 64, 64, 64, 64, 64, -64, -64, 64, -64, -64, 64, 64, 64, -64, 64, 64, 64, 64, 64, 64, -64, -64, 64, -64, -64, 64, 64, -64, -64, 64, 64, 64, 64, -64, -64, -64, -64, 64, 64, -64, 64, -64, -64, 64, 64, -64, -64, -64, 64, -64, -64, -64, -64, -64, -64, -64, -64, -64, 64, 64, -64, 64, -64, -64, -64, -64, -64, 64, 64, 64, 64, -64, -64, -64, 64, 64, 64, 64, -64, -64, -64, -64, -64, 64, -64, -64, -64, -64, -64, 64, 64, 64, 64, 64, 64, 64, -64, 64, 64, -64, -64, 64, 64, -64, 64, -64, -64, -64, -64, -64, -64, -64, -64, -64, -64, -64, -64, -64, 64, -64, -64, 64, 64, 64, 64, 64, -64, 64, 64, 64, 64, -64, -64, -64, -64, -64, -64, -64, 64, 64, -64, -64, 64, 64, 64, 64, -64, 64, -64, -64, 64, 64, 64, -64, 64, -64, 64, 64, -64, 64, -64, -64, -64, -64, 64, -64, 64, 64, 64, 64, 64, 64, 64, 64, 64, 64, -64, -64, -64, -64, -64, -64, -64, 64, 64, 64, 64, -64, -64, -64, -64, -64, -64, 64, 64, 64, 64, -64, 64, 64, 64, 64, 64, -64, -64, -64, -64, -64, -64, -64, 64, -64, 64, 64, 64, 64, -64, 64, 64, -64, -64, -64, 64, -64, -64, 64, -64, -64, -64, 64, -64, -64, -64, -64, -64, -64, -64, 64, -64, -64, 64, 64, 64, -64, 64, -64, -64, -64, -64, 64, -64, -64, -64, 64, -64, -64, -64, -64, -64, -64, -64, -64, -64, 64, 64, -64, 64, 64, 64, 64, 64, -64, -64, -64, -64, -64, -64, 64, 64, -64, -64, 64, -64, 64, 64, 64, -64, -64, -64, -64, -64, 64, 64, 64, 64, -64, -64, -64, 64, 64, -64, -64, -64, 64, 64, -64, 64, -64, 64, -64, -64, 64, 64, -64, -64, -64, -64, -64, -64, -64, -64, 64, -64, -64, -64, -64, -64, -64, -64, -64, -64, -64, 64, 64, 64, 64, 64, 64, 64, 64, 64, -64, -64, -64, -64, -64, 64, 64, 64, -64, -64, -64, -64, -64, -64, -64, -64, -64, -64, 64, 64, 64, 64, 64, 64, 64, 64, 64, -64, 64, -64, -64, -64, -64, -64, 64, -64, 64, -64, -64, -64, -64, -64, -64, -64, -64, -64, 64, -64, 64, 64, 64, 64, -64, 64, -64, 64, -64, -64, -64, -64, -64, -64, 64, -64, 64, -64, -64, 64, 64, -64, -64, -64, -64, -64, 64, -64, 64, 64, -64, 64, -64, -64, -64, 64, -64, -64, -64, -64, -64, -64, 64, -64, 64, -64, -64, 64, 64, 64, -64, -64, -64, -64, 64, 64, -64, 64, -64, 64, 64, 64, 64, -64, 64, -64, -64, -64, -64, -64, -64, 64, -64, 64, -64, 64, 64, -64, -64, -64, 64, -64, -64, -64, -64, -64, -64, 64, -64, 64, 64, 64, -64, -64, -64, -64, -64, -64, -64, 64, 64, 64, 64, 64, 64, -64, -64, -64, -64, -64, -64, -64, -64, 64, -64, 64, -64, 64, -64, -64, -64, -64, -64, -64, -64, -64, -64, 64, -64, 64, 64, 64, -64, -64, -64, -64, -64, -64, -64, -64, -64, 64, -64, -64, -64, 64, 64, -64, -64, -64, -64, -64, -64, -64, 64, -64, -64, -64, -64, -64, 64, -64, -64, -64, 64, 64, -64, -64, -64, -64, -64, -64, -64, 64, -64, 64, -64, -64, -64, -64, -64, -64, 64, -64, -64, 64, 64, 64, -64, 64, -64, -64, 64, 64, -64, -64, -64, -64, -64, -64, -64, -64, -64, -64, -64, -64, -64, -64, 64, 64, -64, 64, 64, 64, 64, 64, -64, -64, -64, -64, -64, -64, -64, 64, -64, -64, -64, -64, -64, -64, -64, -64, -64, -64, -64, -64, 64, -64, -64, -64, 64, -64, 64, 64, -64, -64, -64, -64, 64, 64, 64, 64, 64, 64, 64, -64, -64, -64, 64, -64, -64, -64, -64, 64, 64, -64, 64, -64, 64, -64, 64, 64, 64, -64, -64, -64, 64, 64, 64, 64, 64, 64, 64, -64, 64, -64, 64, 64, 64, 64, -64, 64, 64, 64, -64, 64, 64, -64, -64, -64, -64, -64, 64, -64, 64, 64, 64, -64, -64, 64, 64, -64, -64, -64, 64, -64, 64, 64, 64, 64, 64, -64, -64, 64, 64, 64, 64, 64, -64, -64, -64, -64, -64, -64, -64, -64, -64, 64, -64, -64, -64, -64, 64, -64, 64, -64, 64, 64, 64, -64, 64, 64, -64, 64, 64, -64, -64, 64, 64, -64, -64, -64, 64, 64, 64, -64, -64, 64, 64, 64, -64, 64, 64, -64, 64, -64, -64, 64, -64, -64, 64, 64, 64, 64, -64, 64, 64, -64, 64, -64, -64, 64, 64, 64, 64, 64, -64, -64, 64, -64, -64, -64, 64, -64, -64, -64, -64, 64, -64, -64, -64, -64, 64, 64, 64, 64, -64, 64, 64, 64, -64, 64, -64, -64, 64, 64, -64, -64, -64, 64, -64, 64, -64, -64, -64, -64, -64, 64, 64, 64, 64, -64, 64, 64, -64, -64, -64, -64, -64, -64, -64, -64, 64, -64, -64, -64, 64, -64, 64, 64, 64, -64, 64, -64, 64, -64, -64, -64, -64, 64, 64, -64, -64, -64, 64, -64, -64, -64, -64, -64, -64, -64, -64, -64, -64, -64, -64, -64, -64, -64, -64, 64, -64, -64, -64, -64, 64, -64, -64, -64, -64, -64, -64, -64, -64, -64, -64, -64, 64, -64, 64, -64, -64, -64, 64, -64, 64, 64, -64, 64, 64, 64, -64, 64, -64, -64, -64, -64, -64, -64, -64, -64, -64, -64, 64, -64, 64, -64, -64, -64, -64, 64, -64, -64, 64, -64, -64, -64, -64, 64, -64, -64, 64, -64, -64, -64, -64, -64, -64, -64, -64, -64, -64, -64, -64, -64, -64, 64, -64, -64, 64, -64, 64, 64, 64, 64, -64, 64, 64, -64, 64, 64, -64, -64, -64, 64, 64, -64, -64, -64, -64, -64, -64, 64, 64, 64, -64, 64, 64, -64, 64, 64, 64, 64, 64, 64, 64, 64, 64, 64, 64, -64, 64, 64, -64, 64, -64, 64, -64, -64, -64, -64, -64, 64, 64, 64, -64, 64, 64, 64, -64, 64, 64, 64, 64, 64, 64, 64, 64, 64, 64, 64, 64, 64, 64, 64, 64, 64, 64, 64, -64, -64, 64, 64, 64, 64, 64, 64, -64, -64, -64, 64, 64, 64, 64, 64, 64, 64, 64, 64, 64, 64, 64, 64, 64, 64, 64, -64, 64, -64, 64, 64, -64, 64, 64, 64, 64, -64, -64, 64, 64, 64, 64, 64, -64, 64, 64, 64, 64, 64, 64, 64, 64, 64, 64, -64, -64, 64, -64, 64, -64, 64, 64, 64, -64, -64, 64, 64, -64, -64, -64, -64, -64, 64, 64, 64, 64, 64, 64, -64, -64, -64, -64, -64, 64, -64, -64, -64, -64, 64, 64, 64, 64, 64, 64, -64, 64, 64, 64, 64, 64, 64, 64, 64, 64, -64, -64, -64, -64, -64, -64, -64, -64, -64, -64, -64, 64, 64, 64, -64, 64, 64, -64, 64, -64, -64, -64, -64, 64, 64, 64, 64, -64, -64, -64, -64, -64, -64, -64, -64, -64, -64, -64, -64, -64, 64, 64, 64, 64, 64, 64, 64, 64, -64, -64, 64, 64, 64, -64, -64, -64, -64, -64, -64, -64, -64, -64, -64, -64, 64, -64, 64, 64, 64, 64, 64, -64, -64, 64, 64, -64, -64, -64, -64, 64, 64, 64, 64, -64, -64, -64, -64, -64, -64, -64, 64, -64, -64, 64, -64, 64, 64, -64, 64, 64, 64, -64, 64, -64, -64, 64, -64, -64, -64, -64, -64, -64, -64, -64, -64, -64, -64, -64, -64, 64, 64, 64, -64, 64, 64, 64, 64, -64, 64, 64, 64, -64, -64, -64, -64, -64, -64, -64, -64, -64, -64, -64, -64, -64, -64, -64, 64, 64, 64, 64, 64, 64, -64, 64, 64, 64, -64, 64, 64, 64, -64, -64, -64, -64, -64, 64, -64, -64, -64, -64, -64, -64, -64, 64, -64, -64, 64, -64, 64, 64, 64, -64, 64, 64, 64, -64, 64, -64, 64, -64, 64, -64, -64, -64, -64, -64, -64, -64, -64, -64, 64, -64, -64, -64, -64, 64, 64, 64, -64, -64, 64, 64, -64, -64, -64, 64, 64, 64, -64, -64, 64, -64, -64, -64, -64, 64, 64, 64, -64, 64, 64, 64, 64, 64, -64, 64, 64, -64, -64, 64, -64, -64, 64, -64, 64, 64, 64, -64, 64, 64, 64, 64, -64, -64, -64, 64, 64, 64, -64, 64, 64, 64, 64, 64, -64, -64, -64, 64, 64, 64, 64, -64, -64, 64, 64, 64, 64, 64, 64, 64, 64, 64, 64, 64, 64, 64, 64, 64, 64, 64, -64, 64, -64, -64, 64, 64, -64, -64, -64, -64, -64, -64, -64, 64, 64, 64, 64, -64, -64, 64, -64, 64, 64, 64, 64, 64, 64, 64, 64, 64, 64, 64, -64, -64, 64, 64, -64, 64, 64, -64, -64, 64, -64, -64, 64, -64, -64, 64, -64, 64, 64, -64, 64, 64, -64, -64, -64, 64, -64, 64, -64, 64, 64, 64, 64, -64, 64, 64, 64, 64, -64, 64, -64, -64, -64, -64, -64, 64, 64, 64, -64, -64, -64, 64, -64, -64, 64, 64, 64, 64, 64, -64, -64, 64, -64, -64, -64, -64, -64, -64, -64, -64, -64, -64, 64, 64, 64, -64, -64, 64, -64, -64, -64, 64, -64, -64, 64, 64, 64, -64, -64, -64, 64, 64, 64, 64, -64, 64, -64, 64, -64, -64, -64, -64, -64, 64, 64, -64, 64, 64, 64, -64, -64, 64, -64, 64, -64, -64, 64, -64, -64, 64, -64, 64, 64, -64, 64, -64, -64, -64, 64, -64, 64, -64, 64, 64, 64, 64, -64, 64, -64, 64, -64, 64, 64, 64, -64, -64, 64, -64, -64, -64, -64, 64, -64, -64, -64, -64, -64, -64, -64, -64, -64, 64, 64, -64, 64, 64, 64, 64, -64, 64, -64, 64, -64, 64, -64, -64, 64, -64, -64, -64, -64, -64, -64, -64, 64, 64, -64, -64, -64, 64, 64, 64, 64, 64, -64, 64, 64, 64, -64, -64, 64, -64, -64, 64, 64, 64, 64, 64, -64, -64, 64, 64, 64, 64, 64, -64, -64, 64, 64, 64, 64, 64, 64, 64, 64, 64, -64, -64, 64, -64, 64, -64, 64, 64, 64, 64, 64, 64, 64, 64, 64, -64, 64, -64, 64, 64, 64, 64, -64, 64, 64, 64, 64, -64, 64, -64, 64, -64, -64, -64, 64, 64, 64, 64, 64, 64, 64, 64, 64, 64, 64, 64, 64, 64, 64, -64, 64, 64, 64, 64, 64, 64, -64, -64, -64, -64, -64, -64, 64, 64, 64, 64, 64, 64, 64, 64, 64, 64, 64, 64, 64, 64, 64, 64, 64, 64, 64, 64, -64, -64, 64, 64, 64, -64, 64, -64, 64, 64, 64, 64, 64, 64, 64, 64, 64, 64, 64, 64, 64, 64, 64, 64, 64, 64, 64, 64, -64, 64, -64, 64, 64, -64, -64, -64, -64, -64, -64, -64, 64, 64, 64, 64, 64, 64, 64, 64, 64, 64, 64, -64, -64, -64, -64, 64, -64, -64, -64, 64, -64, -64, -64, -64, -64, -64, -64, -64, -64, -64, -64, -64, -64, -64, -64, -64, 64, 64, -64, 64, 64, -64, 64, -64, -64, -64, 64, 64, -64, -64, -64, -64, 64, -64, -64, -64, -64, -64, -64, -64, -64, -64, -64, -64, -64, -64, 64, 64, -64, -64, -64, 64, 64, -64, -64, 64, -64, -64, -64, -64, 64, -64, 64, -64, -64, -64, 64, 64, 64, -64, -64, -64, -64, 64, 64, -64, 64, -64, -64, -64, -64, -64, -64, -64, -64, 64, -64, -64, -64, -64, -64, 64, -64, -64, -64, -64, 64, 64, -64, -64, 64, -64, -64, -64, 64, -64, -64, -64, -64, -64, 64, 64, 64, -64, -64, -64, -64, 64, 64, 64, -64, 64, 64, 64, 64, 64, 64, 64, 64, -64, 64, -64, 64, -64, -64, -64, -64, -64, -64, 64, 64, -64, 64, 64, -64, 64, 64, 64, 64, 64, 64, 64, -64, 64, -64, -64, -64, -64, -64, 64, 64, 64, -64, -64, -64, -64, 64, -64, -64, -64, -64, 64, -64, 64, 64, 64, -64, -64, 64, -64, 64, 64, -64, 64, -64, -64, -64, -64, -64, -64, -64, -64, -64, -64, -64, -64, -64, 64, -64, -64, 64, 64, -64, 64, 64, 64, 64, 64, 64, -64, 64, 64, -64, -64, -64, 64, -64, -64, -64, -64, -64, -64, 64, -64, 64, 64, -64, 64, -64, -64, -64, 64, 64, -64, 64, 64, -64, -64, 64, 64, 64, 64, 64, 64, 64, 64, 64, -64, -64, -64, -64, 64, -64, -64, 64, -64, -64, 64, 64, 64, 64, 64, 64, -64, -64, 64, 64, 64, 64, 64, 64, 64, 64, 64, 64, -64, 64, -64, 64, -64, 64, -64, 64, -64, 64, -64, -64, -64, 64, 64, 64, 64, 64, -64, -64, -64, -64, 64, 64, 64, 64, 64, 64, 64, -64, 64, -64, 64, -64, 64, 64, 64, -64, -64, 64, 64, 64, 64, 64, -64, 64, 64, 64, -64, 64, 64, 64, 64, 64, 64, 64, 64, 64, -64, -64, 64, -64, -64, -64, 64, -64, 64, 64, -64, 64, 64, 64, 64, 64, -64, -64, 64, 64, 64, -64, -64, 64, 64, 64, 64, -64, -64, 64, 64, -64, 64, 64, 64, -64, 64, 64, 64, 64, 64, 64, 64, 64, 64, 64, 64, -64, 64, -64, 64, 64, 64, 64, 64, -64, 64, 64, -64, 64, -64, -64, 64, 64, 64, 64, 64, -64, -64, 64, 64, 64, 64, 64, 64, -64, 64, 64, 64, 64, 64, 64, 64, -64, 64, -64, -64, 64, 64, -64, -64, -64, -64, -64, -64, 64, 64, 64, 64, 64, -64, 64, -64, -64, -64, -64, -64, -64, -64, -64, 64, -64, -64, 64, -64, -64, 64, -64, 64, 64, 64, 64, -64, 64, 64, 64, -64, -64, -64, 64, 64, 64, -64, -64, -64, -64, -64, -64, -64, 64, -64, 64, 64, 64, 64, -64, 64, -64, 64, 64, -64, -64, -64, -64, -64, -64, -64, 64, 64, -64, -64, 64, -64, 64, 64, 64, 64, 64, 64, 64, 64, 64, 64, 64, -64, 64, -64, -64, 64, 64, 64, 64, -64, -64, 64, -64, -64, -64, -64, -64, 64, -64, -64, -64, 64, -64, 64, -64, 64, 64, -64, 64, 64, 64, 64, -64, 64, 64, 64, -64, -64, 64, 64, -64, 64, 64, -64, -64, 64, 64, 64, -64, -64, 64, 64, 64, 64, 64, -64, 64, -64, -64, 64, -64, 64, -64, 64, 64, 64, -64, -64, 64, -64, -64, 64, -64, 64, -64, 64, 64, 64, -64, 64, -64, 64, -64, -64, -64, 64, -64, -64, -64, -64, -64, -64, -64, 64, 64, 64, 64, 64, 64, -64, -64, -64, -64, -64, -64, 64, -64, -64, 64, 64, 64, -64, -64, 64, 64, -64, -64, 64, -64, -64, -64, -64, -64, 64, 64, -64, 64, 64, 64, 64, -64, -64, -64, 64, 64, 64, 64, -64, -64, -64, -64, -64, 64, 64, 64, 64, 64, 64, 64, -64, 64, 64, -64, 64, -64, 64, -64, -64, 64, -64, -64, -64, 64, 64, 64, 64, -64, -64, 64, 64, -64, -64, -64, -64, 64, 64, 64, 64, 64, -64, -64, 64, 64, 64, -64, 64, 64, 64, -64, -64, 64, -64, 64, 64, -64, 64, 64, 64, 64, 64, 64, 64, 64, 64, 64, 64, 64, -64, -64, -64, -64, 64, 64, -64, -64, -64, -64, -64, -64, 64, -64, -64, -64, 64, 64, 64, 64, 64, 64, 64, 64, 64, 64, 64, -64, 64, 64, -64, -64, 64, -64, -64, 64, -64, -64, -64, 64, 64, 64, -64, 64, 64, -64, 64, 64, 64, 64, 64, 64, 64, 64, 64, 64, 64, 64, 64, 64, 64, -64, -64, -64, -64, 64, 64, -64, 64, 64, 64, 64, 64, 64, -64, 64, 64, 64, 64, 64, 64, 64, 64, 64, 64, 64, -64, 64, 64, -64, 64, -64, -64, 64, -64, -64, 64, 64, 64, 64, -64, -64, 64, 64, 64, 64, 64, 64, -64, 64, 64, -64, -64, -64, 64, 64, 64, -64, -64, 64, 64, -64, -64, -64, 64, -64, -64, -64, -64, 64, 64, 64, 64, 64, -64, -64, -64, 64, 64, 64, 64, -64, 64, 64, -64, -64, -64, 64, 64, 64, -64, 64, -64, 64, -64, -64, -64, -64, 64, 64, 64, 64, -64, -64, 64, 64, -64, 64, 64, -64, 64, -64, -64, -64, 64, 64, 64, 64, -64, -64, 64, 64, -64, 64, -64, -64, 64, 64, 64, -64, -64, -64, 64, -64, -64, 64, 64, 64, 64, 64, 64, 64, 64, -64, 64, -64, -64, -64, 64, -64, 64, -64, -64, 64, 64, 64, -64, -64, -64, -64, -64, 64, -64, -64, 64, 64, -64, 64, 64, 64, 64, 64, 64, -64, -64, -64, 64, -64, -64, 64, -64, 64, 64, -64, -64, -64, -64, -64, -64, -64, 64, -64, -64, 64, 64, 64, 64, 64, 64, 64, -64, -64, 64, -64, -64, -64, 64, 64, 64, -64, 64, 64, 64, -64, -64, -64, -64, -64, -64, 64, 64, 64, 64, 64, 64, -64, 64, 64, -64, 64, 64, 64, 64, 64, 64, -64, -64, 64, -64, 64, 64, 64, -64, -64, -64, -64, 64, 64, 64, 64, 64, 64, 64, 64, 64, 64, 64, -64, 64, 64, 64, -64, 64, 64, -64, -64, 64, 64, 64, 64, -64, -64, -64, -64, -64, 64, -64, 64, 64, 64, -64, 64, 64, -64, -64, -64, -64, -64, 64, 64, 64, 64, -64, 64, -64, 64, 64, 64, -64, -64, -64, -64, 64, 64, 64, 64, 64, 64, 64, 64, -64, -64, -64, 64, 64, 64, 64, -64, -64, -64, -64, 64, 64, 64, 64, 64, 64, -64, -64, 64, 64, 64, 64, 64, 64, 64, 64, 64, 64, -64, 64, 64, 64, 64, -64, 64, 64, 64, 64, -64, 64, -64, -64, -64, -64, -64, -64, -64, 64, 64, 64, 64, 64, 64, 64, 64, -64, 64, 64, -64, -64, -64, 64, 64, 64, -64, -64, -64, -64, 64, -64, -64, -64, -64, -64, 64, 64, 64, 64, 64, 64, 64, 64, 64, -64, 64, -64, 64, 64, -64, 64, -64, -64, -64, -64, 64, 64, 64, 64, -64, -64, 64, -64, -64, 64, 64, -64, 64, 64, 64, 64, 64, -64, -64, 64, -64, 64, 64, 64, -64, -64, -64, 64, 64, -64, -64, 64, 64, -64, -64, 64, -64, 64, 64, 64, 64, 64, 64, 64, 64, -64, -64, -64, -64, -64, 64, 64, -64, -64, 64, 64, 64, 64, -64, 64, 64, -64, -64, -64, 64, 64, -64, 64, 64, 64, -64, 64, 64, 64, -64, -64, 64, 64, -64, -64, -64, 64, 64, 64, 64, -64, -64, -64, 64, -64, 64, -64, -64, -64, 64, -64, -64, -64, 64, 64, -64, -64, -64, 64, 64, 64, -64, -64, 64, -64, -64, -64, 64, 64, 64, 64, 64, -64, 64, -64, 64, 64, -64, 64, -64, -64, -64, -64, 64, -64, -64, -64, 64, -64, -64, 64, -64, 64, 64, -64, 64, 64, 64, -64, -64, -64, 64, 64, -64, 64, -64, 64, -64, 64, -64, -64, -64, -64, 64, 64, -64, 64, 64, 64, -64, 64, 64, -64, 64, -64, 64, 64, 64, -64, -64, -64, 64, 64, -64, 64, 64, 64, 64, 64, -64, 64, 64, 64, -64, -64, 64, -64, -64, -64, -64, 64, 64, -64, 64, 64, -64, 64, -64, -64, 64, 64, -64, -64, -64, 64, 64, -64, -64, -64, 64, 64, 64, -64, 64, -64, 64, -64, -64, 64, 64, -64, -64, -64, -64, -64, -64, -64, -64, 64, -64, 64, -64, -64, -64, -64, -64, -64, 64, 64, -64, -64, -64, 64, -64, -64, -64, 64, 64, -64, -64, -64, -64, -64, -64, -64, 64, -64, -64, -64, 64, -64, -64, -64, -64, -64, -64, 64, -64, -64, -64, 64, 64, -64, -64, 64, -64, -64, -64, -64, -64, -64, 64, 64, 64, 64, 64, 64, 64, 64, 64, 64, 64, 64, 64, -64, -64, -64, -64, 64, 64, -64, -64, -64, -64, -64, -64, -64, -64, 64, 64, 64, 64, 64, 64, 64, 64, 64, 64, 64, 64, 64, -64, -64, -64, -64, -64, 64, 64, 64, -64, 64, 64, -64, -64, 64, -64, 64, 64, 64, -64, 64, 64, 64, 64, 64, 64, 64, 64, 64, -64, 64, 64, 64, 64, 64, -64, 64, 64, -64, 64, 64, -64, 64, -64, 64, -64, 64, 64, 64, 64, 64, 64, 64, 64, 64, 64, 64, 64, 64, 64, 64, 64, 64, -64, -64, 64, 64, 64, 64, -64, -64, -64, -64, 64, 64, -64, 64, 64, 64, 64, 64, 64, 64, -64, 64, 64, 64, 64, -64, 64, 64, -64, 64, 64, 64, -64, -64, -64, -64, -64, 64, -64, 64, -64, -64, 64, 64, 64, -64, 64, -64, -64, 64, 64, 64, 64, -64, 64, 64, 64, 64, -64, 64, 64, 64, -64, -64, 64, -64, 64, 64, -64, -64, 64, 64, 64, 64, 64, 64, -64, 64, 64, 64, 64, -64, -64, 64, 64, -64, 64, 64, 64, -64, -64, -64, 64, -64, -64, -64, -64, -64, 64, 64, -64, -64, -64, -64, -64, -64, 64, -64, 64, -64, -64, -64, -64, 64, 64, 64, 64, 64, -64, -64, -64, -64, -64, 64, -64, -64, -64, 64, 64, -64, -64, 64, -64, -64, 64, 64, -64, -64, -64, -64, 64, 64, -64, 64, -64, 64, 64, -64, 64, -64, -64, 64, -64, -64, -64, -64, -64, -64, 64, -64, 64, 64, -64, 64, -64, 64, -64, -64, -64, 64, 64, -64, 64, 64, 64, 64, 64, -64, -64, 64, -64, -64, -64, -64, -64, -64, -64, 64, 64, 64, 64, -64, 64, 64, -64, 64, -64, -64, 64, 64, 64, 64, 64, 64, 64, 64, -64, 64, -64, -64, -64, -64, -64, -64, 64, 64, 64, 64, -64, -64, -64, 64, -64, 64, 64, 64, 64, 64, 64, 64, 64, 64, 64, 64, -64, 64, -64, -64, -64, -64, -64, 64, 64, 64, 64, -64, -64, -64, 64, -64, 64, 64, 64, 64, 64, 64, 64, 64, 64, 64, 64, 64, -64, -64, -64, -64, -64, -64, 64, -64, 64, 64, -64, -64, -64, -64, 64, -64, -64, 64, -64, -64, -64, -64, 64, 64, 64, 64, -64, -64, -64, -64, -64, -64, 64, 64, -64, 64, -64, -64, -64, -64, -64, -64, 64, 64, 64, -64, -64, 64, -64, 64, 64, 64, 64, 64, 64, -64, -64, 64, 64, -64, -64, 64, -64, -64, 64, -64, -64, -64, -64, 64, 64, 64, 64, 64, -64, 64, 64, 64, 64, 64, 64, -64, 64, 64, 64, 64, -64, -64, -64, -64, 64, 64, -64, -64, -64, -64, -64, -64, 64, 64, -64, 64, -64, -64, 64, 64, 64, 64, 64, 64, -64, 64, 64, 64, 64, -64, -64, -64, -64, -64, -64, -64, -64, -64, -64, 64, 64, 64, -64, 64, 64, -64, -64, -64, -64, 64, 64, 64, 64, 64, 64, 64, 64, 64, 64, 64, 64, 64, 64, -64, -64, -64, 64, 64, 64, -64, 64, 64, 64, -64, 64, 64, -64, -64, 64, 64, 64, 64, 64, 64, 64, 64, 64, 64, 64, 64, 64, 64, 64, 64, 64, 64, -64, 64, 64, 64, -64, 64, 64, 64, 64, 64, -64, 64, 64, 64, 64, 64, 64, 64, 64, 64, 64, 64, 64, 64, 64, 64, 64, 64, 64, -64, -64, 64, 64, -64, -64, -64, 64, 64, -64, 64, -64, 64, -64, -64, -64, -64, 64, -64, -64, 64, 64, 64, -64, 64, 64, 64, 64, 64, -64, -64, 64, 64, -64, 64, -64, -64, 64, 64, -64, 64, -64, 64, -64, -64, -64, -64, -64, -64, -64, 64, 64, -64, -64, 64, -64, -64, -64, 64, 64, 64, 64, -64, -64, -64, 64, 64, 64, 64, -64, 64, 64, 64, -64, 64, 64, 64, -64, 64, -64, 64, 64, -64, 64, 64, -64, 64, 64, 64, -64, -64, 64, 64, 64, 64, 64, -64, 64, -64, 64, 64, 64, 64, 64, 64, 64, 64, 64, 64, 64, -64, 64, 64, -64, 64, 64, 64, 64, 64, -64, -64, 64, 64, 64, -64, 64, 64, 64, 64, 64, -64, 64, 64, -64, -64, 64, -64, -64, 64, 64, -64, -64, 64, 64, 64, -64, -64, -64, 64, 64, 64, -64, -64, -64, -64, 64, 64, -64, -64, 64, -64, -64, -64, -64, 64, 64, 64, 64, 64, -64, -64, -64, 64, 64, 64, -64, 64, -64, 64, 64, 64, 64, 64, 64, -64, -64, 64, 64, 64, -64, -64, -64, -64, 64, -64, 64, -64, 64, 64, 64, -64, -64, -64, -64, 64, 64, 64, 64, 64, 64, 64, -64, 64, -64, -64, -64, 64, -64, -64, -64, -64, 64, 64, 64, -64, 64, 64, 64, 64, 64, -64, -64, 64, -64, 64, 64, 64, -64, -64, -64, -64, 64, 64, -64, -64, -64, -64, -64, -64, 64, 64, 64, 64, 64, 64, 64, 64, -64, -64, -64, -64, 64, -64, 64, -64, -64, -64, -64, 64, 64, 64, 64, 64, -64, -64, -64, 64, -64, 64, -64, 64, 64, 64, -64, 64, 64, -64, -64, 64, -64, -64, -64, -64, -64, -64, -64, -64, 64, 64, 64, -64, -64, -64, -64, -64, -64, -64, 64, 64, 64, 64, 64, 64, 64, -64, -64, -64, -64, -64, -64, -64, 64, -64, 64, -64, 64, 64, 64, -64, -64, -64, -64, -64, -64, -64, 64, 64, 64, 64, -64, 64, -64, -64, 64, -64, -64, -64, 64, -64, 64, 64, 64, 64, 64, 64, -64, -64, -64, -64, -64, -64, -64, -64, -64, -64, 64, 64, -64, -64, -64, -64, 64, -64, -64, -64, 64, 64, 64, 64, 64, 64, 64, -64, -64, -64, 64, -64, -64, -64, -64, -64, 64, -64, -64, 64, 64, 64, 64, 64, -64, 64, 64, 64, 64, 64, 64, 64, 64, 64, -64, -64, -64, -64, -64, -64, -64, -64, -64, 64, -64, -64, -64, 64, 64, -64, -64, -64, -64, -64, -64, 64, 64, 64, 64, 64, 64, -64, -64, -64, -64, -64, 64, -64, 64, -64, 64, 64, -64, -64, -64, 64, 64, -64, -64, 64, -64, -64, -64, 64, -64, -64, 64, -64, 64, 64, -64, -64, -64, -64, 64, -64, 64, 64, 64, 64, -64, -64, -64, -64, 64, 64, -64, 64, -64, -64, 64, -64, 64, -64, 64, 64, -64, -64, -64, -64, -64, 64, 64, 64, 64, 64, 64, 64, 64, -64, -64, -64, -64, -64, -64, -64, -64, -64, -64, 64, -64, 64, -64, 64, -64, -64, -64, -64, 64, 64, 64, 64, 64, 64, 64, 64, 64, 64, -64, -64, -64, -64, 64, -64, -64, -64, 64, -64, 64, -64, -64, -64, -64, -64, 64, 64, -64, 64, 64, 64, -64, 64, -64, 64, 64, 64, -64, -64, -64, -64, -64, -64, -64, 64, 64, 64, 64, -64, -64, 64, -64, -64, -64, 64, -64, 64, 64, -64, -64, 64, -64, 64, 64, 64, 64, -64, 64, 64, 64, -64, 64, -64, -64, 64, -64, -64, 64, 64, -64, 64, 64, 64, 64, 64, 64, -64, -64, 64, 64, 64, 64, 64, 64, -64, 64, -64, -64, -64, 64, 64, -64, -64, -64, 64, -64, -64, 64, 64, 64, 64, 64, 64, -64, -64, -64, -64, -64, 64, 64, 64, 64, -64, -64, 64, 64, 64, 64, 64, -64, -64, -64, -64, 64, -64, -64, -64, -64, 64, 64, 64, 64, -64, 64, -64, 64, 64, -64, 64, 64, 64, -64, -64, 64, -64, -64, -64, -64, -64, -64, -64, 64, 64, -64, 64, 64, 64, 64, 64, 64, -64, -64, 64, -64, -64, -64, -64, 64, 64, 64, 64, 64, -64, -64, 64, -64, -64, -64, 64, 64, -64, -64, -64, -64, 64, 64, 64, -64, -64, -64, -64, -64, -64, -64, -64, 64, -64, -64, 64, 64, -64, -64, 64, -64, -64, -64, -64, -64, -64, -64, -64, -64, 64, 64, -64, -64, -64, -64, -64, 64, 64, 64, -64, 64, -64, 64, 64, -64, -64, -64, 64, -64, 64, -64, -64, -64, -64, -64, -64, -64, -64, -64, -64, -64, -64, -64, -64, -64, -64, -64, 64, -64, -64, -64, 64, -64, -64, -64, 64, -64, 64, -64, -64, -64, -64, -64, -64, -64, 64, -64, -64, 64, -64, -64, -64, 64, -64, 64, -64, 64, -64, 64, 64, 64, -64, 64, -64, 64, -64, 64, 64, 64, -64, 64, 64, 64, -64, -64, -64, -64, -64, -64, -64, -64, 64, 64, 64, -64, 64, -64, -64, 64, 64, 64, 64, 64, -64, 64, -64, -64, -64, 64, 64, 64, -64, -64, -64, 64, 64, -64, -64, -64, -64, 64, -64, -64, 64, -64, -64, 64, 64, 64, 64, 64, 64, 64, -64, -64, 64, 64, 64, -64, -64, -64, 64, 64, 64, -64, -64, -64, -64, -64, 64, 64, -64, -64, -64, 64, 64, -64, -64, 64, -64, -64, -64, -64, -64, 64, 64, 64, 64, -64, 64, 64, 64, -64, -64, -64, -64, 64, -64, -64, -64, 64, -64, -64, 64, 64, -64, -64, -64, -64, -64, 64, 64, 64, -64, 64, 64, 64, -64, -64, -64, -64, 64, 64, -64, -64, 64, -64, -64, 64, -64, 64, -64, -64, -64, -64, -64, -64, 64, 64, -64, -64, -64, -64, -64, -64, -64, -64, -64, 64, -64, 64, 64, 64, -64, 64, 64, -64, -64, -64, -64, 64, 64, -64, -64, -64, -64, -64, -64, -64, 64, 64, 64, 64, -64, -64, -64, -64, 64, 64, 64, 64, -64, 64, -64, -64, 64, 64, 64, -64, -64, -64, 64, 64, -64, -64, -64, -64, 64, -64, 64, -64, -64, -64, -64, -64, -64, -64, 64, -64, -64, 64, 64, -64, 64, -64, -64, -64, 64, 64, -64, -64, 64, -64, -64, -64, -64, -64, -64, -64, -64, -64, -64, -64, -64, 64, 64, 64, 64, 64, 64, 64, -64, -64, -64, -64, 64, 64, 64, -64, -64, -64, 64, -64, -64, -64, 64, -64, -64, -64, -64, -64, 64, -64, -64, 64, 64, 64, 64, -64, 64, -64, 64, -64, -64, 64, -64, -64, -64, -64, -64, 64, -64, -64, -64, 64, -64, -64, -64, 64, -64, -64, -64, -64, 64, 64, 64, 64, -64, 64, -64, -64, 64, -64, -64, -64, -64, -64, 64, -64, -64, -64, 64, -64, -64, -64, -64, -64, -64, -64, -64, 64, -64, 64, 64, -64, 64, -64, -64, 64, 64, 64, 64, 64, -64, -64, -64, 64, 64, -64, -64, 64, -64, 64, -64, -64, -64, -64, -64, -64, -64, 64, -64, 64, 64, 64, 64, -64, 64, 64, -64, -64, -64, 64, 64, 64, 64, -64, -64, -64, 64, -64, 64, -64, -64, -64, -64, -64, -64, 64, 64, 64, 64, 64, 64, -64, -64, -64, -64, -64, -64, 64, 64, -64, 64, -64, 64, -64, -64, 64, 64, 64, -64, -64, -64, -64, -64, -64, -64, -64, 64, -64, -64, 64, -64, 64, -64, -64, -64, 64, 64, 64, 64, -64, -64, 64, 64, 64, 64, -64, -64, -64, -64, 64, -64, 64, -64, -64, -64, -64, 64, -64, -64, -64, -64, -64, -64, 64, -64, -64, 64, -64, -64, 64, 64, -64, -64, -64, 64, -64, -64, -64, 64, 64, 64, -64, 64, 64, -64, 64, -64, -64, -64, -64, -64, -64, -64, -64, -64, -64, 64, 64, -64, -64, -64, -64, -64, -64, -64, 64, 64, -64, -64, -64, 64, -64, -64, 64, -64, -64, -64, -64, -64, -64, -64, -64, -64, -64, -64, -64, -64, -64, -64, -64, -64, -64, 64, -64, -64, -64, 64, 64, -64, 64, -64, 64, -64, -64, -64, 64, -64, -64, 64, 64, -64, -64, -64, -64, 64, -64, -64, -64, -64, 64, -64, 64, 64, -64, 64, -64, 64, -64, -64, 64, 64, 64, 64, -64, -64, -64, -64, -64, -64, 64, -64, -64, -64, -64, -64, -64, -64, -64, 64, 64, -64, -64, 64, 64, 64, 64, 64, 64, 64, 64, -64, -64, -64, 64, 64, -64, -64, -64, -64, -64, -64, -64, -64, -64, -64, -64, 64, -64, 64, 64, -64, -64, 64, -64, 64, -64, -64, 64, -64, -64, -64, -64, -64, 64, 64, 64, 64, 64, -64, 64, -64, -64, -64, -64, -64, -64, -64, 64, -64, 64, -64, -64, 64, 64, -64, -64, -64, -64, -64, 64, -64, -64, -64, -64, -64, -64, -64, 64, 64, 64, -64, 64, -64, -64, -64, -64, -64, 64, 64, 64, -64, 64, -64, -64, -64, -64, -64, 64, 64, 64, -64, 64, -64, -64, 64, 64, -64, 64, -64, -64, 64, -64, -64, -64, 64, -64, -64, -64, 64, -64, 64, -64, -64, -64, 64, 64, -64, -64, 64, -64, 64, -64, -64, 64, -64, 64, -64, -64, 64, 64, -64, -64, -64, 64, -64, -64, 64, 64, 64, -64, -64, -64, 64, -64, -64, 64, 64, -64, 64, -64, -64, -64, 64, -64, -64, -64, 64, 64, 64, 64, -64, -64, 64, -64, -64, -64, -64, 64, -64, 64, -64, -64, 64, 64, -64, -64, -64, -64, -64, 64, 64, 64, -64, 64, -64, 64, 64, -64, -64, -64, 64, 64, 64, 64, 64, 64, 64, 64, -64, 64, -64, 64, 64, 64, -64, -64, -64, -64, 64, 64, -64, 64, 64, 64, 64, -64, -64, -64, 64, 64, 64, -64, 64, -64, -64, -64, -64, -64, 64, 64, -64, 64, 64, -64, -64, 64, 64, -64, 64, -64, -64, 64, -64, -64, 64, 64, 64, 64, 64, 64, -64, -64, -64, -64, 64, 64, 64, -64, 64, 64, 64, 64, 64, -64, -64, -64, -64, 64, 64, -64, -64, 64, 64, 64, -64, 64, 64, 64, -64, -64, -64, 64, 64, -64, 64, 64, 64, 64, 64, -64, -64, 64, -64, 64, -64, 64, -64, -64, -64, 64, -64, 64, 64, 64, -64, 64, -64, 64, 64, 64, 64, 64, -64, -64, -64, -64, -64, -64, 64, -64, 64, 64, 64, -64, 64, -64, 64, 64, -64, 64, 64, 64, -64, -64, 64, 64, 64, 64, 64, -64, -64, -64, 64, -64, -64, 64, -64, -64, -64, -64, -64, -64, -64, -64, -64, -64, 64, -64, -64, -64, 64, -64, 64, 64, 64, 64, 64, -64, -64, -64, 64, -64, -64, -64, -64, -64, -64, -64, -64, 64, 64, -64, -64, -64, -64, -64, -64, -64, -64, 64, -64, -64, 64, 64, 64, -64, -64, -64, -64, -64, -64, -64, -64, -64, -64, -64, -64, -64, -64, -64, 64, 64, 64, 64, -64, -64, 64, 64, -64, 64, 64, -64, 64, -64, -64, -64, -64, -64, 64, -64, -64, -64, -64, -64, 64, 64, -64, -64, 64, -64, -64, -64, -64, 64, 64, -64, -64, -64, -64, 64, -64, -64, -64, -64, 64, 64, 64, 64, -64, -64, -64, 64, 64, -64, -64, 64, -64, -64, -64, -64, 64, -64, -64, -64, -64, -64, -64, -64, -64, -64, -64, -64, -64, -64, -64, -64, -64, -64, -64, -64, -64, -64, -64, -64, 64, 64, -64, -64, -64, -64, 64, -64, -64, 64, -64, -64, -64, 64, -64, 64, 64, -64, -64, -64, -64, -64, 64, 64, -64, 64, -64, -64, 64, -64, -64, -64, -64, -64, 64, -64, -64, -64, 64, 64, 64, -64, 64, 64, -64, -64, -64, -64, -64, -64, -64, -64, 64, -64, 64, 64, 64, 64, -64, -64, -64, -64, 64, -64, 64, 64, -64, -64, -64, -64, 64, -64, -64, -64, -64, -64, -64, -64, -64, -64, -64, -64, 64, -64, 64, 64, 64, -64, -64, -64, 64, 64, -64, 64, 64, -64, 64, 64, -64, -64, -64, -64, -64, -64, -64, 64, -64, 64, 64, 64, 64, 64, 64, 64, 64, -64, -64, -64, -64, -64, 64, -64, 64, 64, -64, -64, -64, -64, -64, -64, -64, 64, -64, 64, 64, 64, 64, 64, 64, 64, 64, -64, -64, 64, -64, 64, -64, 64, 64, 64, 64, -64, -64, -64, -64, -64, -64, -64, -64, -64, 64, 64, 64, 64, 64, 64, -64, 64, -64, 64, -64, 64, -64, 64, -64, -64, 64, 64, 64, 64, 64, -64, -64, -64, -64, -64, 64, 64, -64, -64, 64, 64, 64, -64, -64, -64, -64, 64, -64, -64, 64, 64, 64, -64, 64, -64, 64, 64, 64, -64, -64, -64, 64, -64, -64, 64, 64, -64, 64, 64, 64, -64, -64, -64, -64, -64, 64, 64, -64, -64, 64, 64, -64, -64, 64, 64, -64, 64, -64, -64, -64, -64, -64, -64, 64, -64, -64, -64, 64, -64, 64, -64, -64, -64, -64, -64, -64, 64, 64, 64, 64, 64, 64, 64, 64, -64, 64, 64, -64, -64, -64, -64, -64, -64, -64, -64, -64, 64, -64, 64, 64, 64, -64, -64, -64, -64, 64, 64, 64, -64, 64, 64, -64, 64, -64, -64, -64, -64, -64, -64, -64, -64, -64, -64, -64, 64, -64, 64, 64, -64, 64, -64, 64, 64, 64, 64, 64, 64, -64, -64, -64, -64, 64, -64, -64, -64, -64, -64, -64, -64, -64, -64, -64, -64, -64, 64, -64, 64, -64, 64, -64, 64, 64, -64, 64, 64, 64, -64, -64, -64, -64, -64, -64, -64, -64, -64, -64, 64, -64, -64, 64, -64, 64, -64, 64, -64, -64, 64, -64, -64, -64, 64, 64, -64, -64, 64, -64, -64, -64, -64, 64, -64, -64, -64, 64, -64, -64, 64, -64, -64, 64, 64, -64, -64, -64, 64, 64, 64, -64, -64, 64, -64, 64, -64, -64, -64, 64, -64, -64, -64, -64, -64, -64, -64, -64, -64, -64, -64, 64, -64, 64, 64, -64, 64, 64, -64, 64, 64, -64, -64, 64, -64, 64, 64, 64, -64, -64, -64, -64, -64, 64, -64, -64, -64, 64, 64, -64, 64, 64, 64, -64, 64, 64, 64, -64, 64, -64, 64, 64, -64, 64, 64, 64, -64, -64, 64, -64, -64, -64, 64, 64, 64, -64, -64, 64, -64, 64, 64, 64, -64, 64, 64, -64, -64, 64, 64, 64, -64, -64, -64, -64, 64, -64, -64, 64, -64, -64, 64, -64, -64, -64, -64, 64, -64, -64, 64, -64, -64, 64, 64, 64, -64, -64, 64, -64, -64, 64, -64, 64, 64, -64, 64, -64, 64, 64, -64, 64, -64, 64, 64, 64, 64, -64, -64, -64, -64, -64, -64, -64, -64, -64, -64, -64, 64, 64, 64, 64, 64, 64, -64, -64, 64, 64, 64, -64, -64, -64, 64, 64, 64, -64, 64, -64, -64, 64, 64, 64, 64, -64, -64, -64, 64, -64, -64, -64, -64, -64, 64, -64, 64, 64, -64, 64, -64, -64, -64, -64, 64, 64, -64, -64, -64, -64, 64, -64, -64, 64, 64, -64, -64, -64, -64, -64, -64, -64, -64, -64, -64, -64, 64, 64, -64, -64, -64, -64, -64, -64, -64, -64, -64, -64, 64, 64, 64, 64, -64, -64, -64, -64, -64, -64, 64, -64, -64, -64, 64, 64, -64, 64, -64, -64, -64, 64, -64, 64, -64, -64, -64, 64, 64, 64, 64, 64, 64, -64, -64, -64, -64, -64, -64, -64, -64, -64, -64, -64, -64, -64, 64, 64, -64, -64, -64, 64, 64, 64, -64, -64, -64, 64, 64, 64, 64, -64, -64, -64, -64, -64, -64, -64, -64, -64, -64, -64, -64, -64, -64, -64, -64, 64, 64, 64, -64, 64, 64, -64, 64, -64, -64, 64, 64, -64, 64, -64, 64, -64, -64, -64, 64, -64, 64, -64, -64, -64, -64, -64, -64, 64, 64, 64, 64, 64, 64, 64, 64, 64, -64, 64, 64, 64, 64, -64, 64, 64, 64, 64, 64, 64, 64, -64, -64, -64, -64, -64, -64, -64, -64, -64, 64, 64, 64, 64, -64, 64, -64, 64, 64, -64, -64, -64, 64, -64, 64, -64, 64, -64, 64, 64, 64, -64, -64, 64, -64, -64, -64, -64, 64, -64, -64, 64, -64, 64, 64, 64, 64, 64, 64, 64, -64, -64, 64, 64, 64, -64, -64, -64, 64, -64, 64, 64, -64, -64, 64, -64, -64, 64, -64, 64, -64, 64, 64, 64, 64, -64, 64, 64, -64, 64, 64, 64, 64, 64, 64, -64, -64, 64, -64, -64, 64, 64, 64, 64, 64, -64, -64, -64, -64, -64, 64, 64, 64, 64, 64, 64, 64, 64, 64, 64, 64, -64, -64, -64, -64, 64, -64, -64, -64, -64, 64, 64, -64, 64, -64, -64, 64, -64, 64, 64, 64, 64, 64, -64, 64, 64, 64, -64, -64, -64, -64, -64, -64, 64, -64, -64, -64, 64, 64, 64, 64, -64, 64, -64, 64, -64, -64, -64, -64, 64, 64, -64, -64, -64, -64, -64, -64, -64, -64, -64, -64, 64, 64, 64, 64, 64, 64, 64, -64, -64, 64, 64, 64, 64, 64, -64, 64, 64, -64, -64, -64, -64, -64, -64, -64, -64, -64, -64, 64, -64, -64, -64, 64, 64, 64, -64, -64, -64, 64, -64, -64, -64, 64, -64, 64, -64, -64, -64, 64, 64, -64, -64, -64, -64, -64, -64, -64, -64, -64, -64, -64, 64, 64, -64, -64, -64, -64, 64, 64, 64, -64, 64, -64, -64, -64, -64, 64, -64, -64, -64, -64, -64, -64, -64, 64, -64, -64, -64, 64, 64, -64, -64, -64, 64, 64, -64, -64, 64, -64, 64, 64, -64, -64, 64, 64, -64, -64, -64, -64, -64, -64, 64, -64, -64, -64, -64, 64, 64, 64, 64, -64, 64, -64, 64, -64, -64, -64, -64, -64, -64, -64, -64, -64, -64, -64, -64, -64, 64, 64, -64, 64, 64, 64, -64, 64, 64, -64, -64, -64, 64, 64, -64, 64, -64, -64, 64, -64, -64, 64, -64, -64, -64, -64, -64, -64, -64, 64, 64, -64, 64, 64, 64, 64, 64, -64, 64, 64, 64, -64, -64, 64, -64, 64, 64, -64, -64, -64, -64, -64, -64, -64, -64, 64, -64, 64, 64, 64, 64, -64, -64, 64, -64, 64, -64, 64, -64, 64, 64, -64, -64, -64, -64, -64, -64, 64, -64, -64, 64, -64, -64, 64, -64, -64, -64, -64, 64, -64, -64, -64, -64, 64, -64, 64, -64, 64, 64, -64, 64, 64, -64, 64, -64, -64, -64, -64, -64, -64, 64, -64, 64, 64, -64, 64, -64, -64, 64, -64, -64, 64, -64, -64, 64, -64, -64, -64, -64, -64, 64, 64, -64, -64, 64, -64, 64, 64, 64, 64, 64, -64, -64, 64, -64, 64, 64, -64, -64, 64, -64, 64, 64, -64, -64, 64, 64, 64, 64, -64, -64, -64, 64, -64, 64, 64, 64, 64, -64, 64, -64, 64, 64, 64, -64, 64, -64, -64, -64, -64, 64, -64, -64, 64, -64, -64, 64, 64, -64, -64, -64, 64, 64, 64, 64, 64, -64, -64, 64, 64, 64, 64, -64, 64, 64, -64, -64, 64, -64, 64, -64, -64, 64, -64, 64, -64, -64, 64, -64, -64, 64, -64, -64, 64, -64, 64, -64, -64, 64, -64, -64, -64, -64, -64, 64, -64, 64, 64, 64, 64, 64, -64, 64, -64, 64, 64, -64, 64, 64, -64, -64, -64, -64, -64, 64, 64, 64, 64, 64, -64, 64, 64, 64, -64, 64, -64, 64, 64, 64, -64, -64, 64, 64, 64, -64, 64, -64, -64, 64, 64, 64, -64, -64, -64, 64, -64, -64, 64, 64, 64, 64, -64, 64, -64, 64, -64, -64, 64, -64, 64, 64, -64, -64, 64, -64, -64, -64, 64, -64, -64, 64, -64, 64, 64, 64, 64, -64, 64, -64, -64, -64, 64, 64, 64, 64, -64, -64, -64, 64, -64, -64, 64, -64, 64, -64, 64, 64, 64, -64, -64, -64, -64, 64, 64, -64, -64, -64, 64, 64, 64, 64, 64, 64, 64, 64, 64, -64, 64, -64, 64, -64, 64, -64, -64, 64, -64, -64, 64, -64, -64, 64, 64, 64, -64, -64, 64, 64, -64, -64, -64, -64, 64, -64, 64, 64, 64, -64, -64, -64, -64, 64, -64, -64, 64, -64, -64, -64, -64, -64, -64, -64, -64, -64, 64, 64, 64, 64, -64, -64, -64, 64, -64, 64, -64, 64, -64, 64, 64, -64, 64, -64, 64, -64, -64, -64, -64, -64, -64, -64, -64, 64, 64, 64, 64, 64, -64, -64, 64, -64, 64, 64, -64, 64, -64, 64, 64, -64, 64, 64, -64, -64, 64, -64, -64, 64, 64, -64, 64, 64, -64, -64, 64, 64, -64, 64, -64, -64, -64, 64, -64, -64, -64, -64, 64, -64, -64, -64, -64, 64, -64, -64, -64, -64, -64, 64, -64, -64, -64, -64, -64, 64, -64, 64, -64, 64, -64, -64, -64, -64, -64, 64, -64, -64, 64, -64, -64, -64, -64, -64, -64, -64, 64, 64, -64, -64, 64, -64, -64, -64, -64, 64, -64, -64, -64, -64, -64, -64, 64, -64, -64, -64, -64, -64, -64, 64, -64, -64, -64, 64, -64, -64, 64, -64, -64, 64, 64, -64, 64, 64, 64, -64, 64, -64, 64, 64, 64, -64, -64, -64, 64, -64, 64, 64, -64, -64, 64, -64, -64, -64, -64, -64, -64, -64, 64, 64, 64, -64, -64, -64, 64, -64, 64, -64, 64, -64, 64, -64, -64, -64, 64, 64, -64, -64, -64, -64, 64, 64, -64, -64, 64, 64, -64, 64, 64, -64, 64, -64, 64, -64, -64, 64, -64, -64, -64, 64, 64, -64, -64, -64, -64, -64, 64, 64, 64, 64, 64, 64, 64, 64, -64, 64, 64, 64, 64, -64, -64, 64, -64, -64, 64, -64, 64, -64, -64, 64, -64, -64, -64, -64, -64, -64, -64, 64, -64, -64, -64, 64, -64, -64, 64, -64, 64, -64, 64, 64, -64, 64, -64, -64, -64, 64, -64, 64, -64, -64, -64, -64, -64, 64, 64, -64, -64, -64, -64, -64, -64, -64, 64, 64, 64, -64, -64, -64, -64, 64, -64, -64, 64, 64, -64, -64, 64, -64, 64, -64, -64, -64, 64, -64, 64, -64, -64, -64, 64, -64, 64, 64, -64, -64, -64, -64, 64, -64, 64, 64, -64, -64, -64, -64, 64, 64, -64, 64, 64, 64, -64, -64, 64, 64, 64, -64, 64, -64, 64, -64, 64, -64, -64, 64, 64, -64, -64, -64, 64, -64, 64, -64, -64, -64, 64, 64, 64, -64, -64, 64, -64, 64, -64, -64, 64, -64, 64, 64, -64, -64, 64, -64, 64, -64, -64, -64, -64, 64, -64, -64, -64, -64, -64, -64, -64, -64, 64, -64, -64, 64, 64, -64, 64, -64, -64, -64, 64, -64, -64, 64, 64, -64, -64, -64, -64, -64, 64, -64, -64, -64, -64, 64, -64, 64, -64, -64, 64, -64, 64, 64, -64, -64, 64, -64, 64, -64, 64, 64, 64, 64, -64, -64, -64, 64, 64, -64, 64, 64, 64, -64, -64, -64, -64, -64, -64, -64, -64, 64, -64, -64, -64, -64, -64, 64, -64, 64, -64, -64, 64, -64, -64, 64, 64, -64, -64, -64, 64, 64, -64, 64, -64, -64, -64, -64, -64, 64, -64, 64, 64, -64, -64, 64, 64, -64, 64, 64, 64, -64, -64, -64, -64, 64, -64, -64, -64, -64, 64, -64, -64, 64, 64, -64, -64, 64, -64, -64, 64, -64, -64, -64, -64, -64, 64, -64, 64, -64, 64, 64, -64, -64, -64, -64, -64, -64, -64, 64, 64, 64, -64, -64, -64, -64, -64, -64, 64, -64, -64, 64, -64, 64, 64, 64, 64, 64, -64, 64, -64, -64, 64, -64, 64, -64, -64, -64, 64, 64, -64, -64, 64, -64, -64, 64, 64, -64, -64, 64, -64, -64, 64, -64, 64, -64, 64, -64, 64, -64, 64, 64, -64, 64, -64, -64, 64, 64, -64, -64, -64, -64, 64, -64, -64, 64, -64, -64, 64, -64, -64, 64, -64, -64, -64, 64, 64, -64, 64, 64, 64, -64, -64, -64, 64, -64, 64, -64, -64, -64, 64, -64, -64, -64, 64, 64, -64, -64, 64, 64, -64, 64, 64, -64, 64, 64, 64, 64, -64, 64, 64, 64, -64, -64, 64, 64, 64, 64, -64, 64, -64, 64, 64, -64, -64, -64, 64, 64, 64, 64, -64, -64, -64, -64, 64, -64, 64, 64, 64, -64, -64, -64, -64, 64, -64, -64, 64, -64, -64, -64, 64, 64, 64, 64, 64, -64, -64, -64, -64, -64, 64, 64, -64, -64, 64, 64, 64, 64, 64, 64, -64, 64, 64, -64, 64, 64, -64, 64, 64, 64, 64, 64, 64, 64, -64, 64, -64, 64, -64, 64, -64, -64, -64, -64, 64, 64, 64, 64, 64, 64, 64, 64, -64, -64, -64, -64, 64, -64, 64, -64, -64, 64, -64, -64, 64, 64, -64, -64, -64, -64, -64, -64, -64, 64, 64, 64, 64, 64, 64, 64, 64, -64, -64, 64, 64, 64, 64, 64, 64, 64, 64, 64, 64, 64, 64, 64, 64, -64, 64, -64, -64, 64, 64, 64, 64, 64, 64, -64, 64, 64, 64, -64, 64, -64, -64, 64, -64, -64, 64, 64, 64, 64, 64, 64, 64, 64, 64, 64, -64, -64, 64, 64, -64, 64, 64, 64, -64, -64, 64, -64, -64, -64, -64, 64, -64, 64, 64, 64, 64, -64, 64, 64, 64, 64, 64, -64, 64, -64, -64, -64, -64, 64, 64, 64, -64, 64, -64, -64, -64, 64, 64, -64, 64, 64, 64, 64, -64, 64, 64, 64, 64, -64, 64, 64, 64, -64, -64, -64, -64, 64, 64, -64, 64, 64, -64, -64, -64, -64, -64, -64, -64, 64, 64, 64, 64, 64, -64, -64, 64, 64, 64, 64, 64, -64, -64, -64, -64, 64, 64, 64, -64, -64, -64, 64, 64, -64, 64, -64, 64, 64, 64, 64, -64, 64, 64, 64, 64, 64, 64, 64, 64, -64, -64, -64, 64, 64, 64, 64, 64, -64, -64, 64, -64, -64, 64, -64, -64, 64, 64, -64, -64, -64, 64, 64, 64, 64, 64, 64, -64, -64, -64, -64, -64, 64, 64, -64, 64, -64, -64, -64, 64, -64, -64, -64, -64, 64, -64, -64, 64, 64, 64, 64, 64, 64, 64, 64, -64, -64, -64, -64, -64, 64, 64, 64, -64, 64, 64, 64, 64, -64, 64, -64, -64, 64, -64, -64, 64, 64, 64, 64, 64, 64, 64, 64, -64, -64, -64, -64, -64, -64, 64, 64, 64, -64, -64, 64, -64, -64, 64, 64, -64, -64, 64, -64, -64, 64, 64, 64, 64, 64, 64, -64, -64, -64, 64, 64, 64, 64, 64, 64, 64, 64, -64, -64, 64, 64, -64, -64, 64, -64, 64, 64, -64, 64, 64, 64, 64, 64, -64, -64, -64, 64, 64, -64, 64, 64, -64, 64, -64, -64, -64, 64, 64, -64, -64, -64, 64, -64, -64, 64, 64, 64, 64, 64, 64, -64, -64, -64, -64, 64, -64, 64, 64, 64, 64, -64, -64, 64, 64, 64, 64, 64, 64, 64, -64, -64, 64, 64, 64, 64, 64, -64, 64, 64, 64, 64, 64, -64, 64, 64, 64, 64, 64, -64, -64, 64, -64, -64, 64, 64, -64, -64, -64, 64, 64, 64, 64, 64, 64, -64, 64, 64, 64, -64, -64, 64, 64, 64, 64, 64, -64, -64, 64, 64, -64, 64, -64, -64, -64, -64, 64, -64, -64, 64, 64, 64, -64, 64, -64, -64, -64, -64, -64, -64, 64, 64, -64, 64, 64, 64, 64, 64, -64, 64, -64, -64, -64, -64, -64, 64, 64, 64, 64, -64, -64, 64, -64, 64, -64, 64, -64, -64, -64, -64, -64, 64, -64, 64, -64, -64, 64, 64, 64, 64, -64, -64, -64, -64, -64, 64, 64, 64, -64, -64, 64, 64, 64, 64, -64, -64, -64, -64, 64, -64, -64, -64, -64, -64, 64, 64, 64, 64, 64, -64, -64, -64, -64, -64, 64, 64, 64, -64, 64, 64, 64, 64, 64, -64, -64, -64, -64, -64, -64, -64, 64, 64, -64, -64, -64, 64, 64, 64, 64, -64, 64, -64, 64, -64, 64, -64, -64, 64, 64, 64, 64, 64, -64, -64, 64, 64, 64, 64, -64, 64, -64, 64, 64, 64, -64, -64, -64, -64, -64, -64, -64, -64, 64, -64, 64, 64, 64, 64, -64, -64, 64, 64, 64, 64, -64, 64, 64, -64, -64, -64, 64, -64, -64, -64, -64, -64, -64, -64, 64, 64, 64, 64, 64, 64, 64, -64, -64, 64, 64, 64, 64, -64, 64, 64, -64, 64, -64, -64, -64, -64, 64, 64, 64, -64, 64, 64, -64, -64, -64, -64, -64, 64, -64, 64, -64, -64, -64, -64, -64, 64, -64, 64, 64, 64, -64, 64, -64, -64, 64, 64, 64, 64, -64, 64, 64, -64, -64, -64, -64, 64, 64, -64, -64, -64, 64, -64, -64, 64, 64, -64, 64, 64, 64, -64, 64, -64, -64, 64, 64, 64, -64, 64, 64, 64, -64, 64, 64, -64, 64, 64, 64, -64, -64, 64, 64, -64, 64, 64, 64, -64, 64, 64, -64, -64, 64, -64, 64, 64, 64, 64, 64, -64, -64, -64, 64, -64, 64, 64, 64, -64, -64, 64, -64, -64, -64, -64, 64, -64, -64, -64, 64, -64, 64, -64, 64, 64, -64, 64, 64, 64, 64, 64, -64, -64, 64, 64, 64, 64, -64, 64, 64, 64, -64, 64, 64, -64, 64, 64, 64, -64, 64, 64, -64, -64, -64, 64, -64, -64, -64, -64, -64, -64, -64, 64, 64, -64, -64, -64, 64, 64, 64, -64, 64, 64, 64, -64, -64, 64, -64, -64, -64, -64, 64, 64, -64, 64, 64, -64, -64, -64, -64, 64, -64, 64, 64, 64, 64, 64, -64, 64, 64, -64, -64, 64, -64, 64, -64, -64, -64, -64, 64, -64, 64, 64, -64, -64, 64, 64, -64, 64, -64, -64, -64, -64, 64, 64, -64, -64, 64, -64, -64, -64, 64, -64, 64, -64, -64, 64, -64, 64, 64, 64, 64, -64, -64, -64, -64, -64, 64, -64, -64, 64, -64, 64, -64, -64, 64, 64, -64, -64, -64, 64, -64, 64, 64, -64, -64, 64, 64, 64, 64, 64, -64, -64, -64, -64, 64, -64, -64, -64, -64, 64, 64, -64, 64, -64, 64, 64, -64, 64, 64, -64, 64, -64, -64, -64, -64, 64, 64, -64, -64, -64, -64, -64, -64, 64, -64, -64, 64, 64, 64, 64, 64, -64, 64, 64, -64, -64, -64, -64, 64, -64, 64, -64, 64, 64, 64, -64, -64, -64, 64, -64, -64, -64, -64, -64, 64, 64, 64, -64, -64, -64, -64, -64, -64, 64, 64, 64, -64, 64, -64, 64, 64, 64, -64, -64, -64, -64, -64, 64, -64, 64, -64, -64, -64, 64, -64, -64, 64, 64, -64, 64, 64, 64, -64, -64, 64, 64, 64, 64, 64, 64, 64, -64, -64, 64, -64, -64, 64, -64, 64, -64, -64, -64, -64, 64, -64, -64, -64, -64, -64, -64, -64, -64, 64, -64, -64, 64, -64, 64, -64, 64, -64, 64, -64, -64, -64, -64, -64, -64, -64, 64, -64, -64, 64, 64, 64, -64, 64, 64, 64, 64, -64, -64, -64, -64, 64, 64, 64, -64, -64, 64, 64, -64, -64, 64, 64, 64, -64, 64, -64, 64, 64, 64, -64, -64, -64, 64, -64, -64, -64, -64, -64, 64, 64, -64, -64, -64, -64, 64, -64, -64, -64, -64, 64, 64, -64, -64, -64, -64, 64, 64, 64, 64, -64, 64, -64, -64, -64, -64, -64, 64, 64, -64, 64, -64, -64, -64, 64, 64, -64, -64, -64, -64, -64, -64, -64, -64, -64, 64, -64, -64, 64, -64, -64, -64, -64, 64, -64, 64, -64, -64, -64, -64, -64, -64, -64, -64, -64, -64, -64, -64, -64, -64, -64, -64, -64, 64, 64, 64, -64, -64, -64, -64, -64, -64, -64, -64, -64, -64, -64, -64, -64, -64, 64, -64, 64, -64, -64, -64, -64, -64, -64, 64, 64, -64, 64, -64, -64, -64, -64, -64, -64, 64, -64, 64, -64, -64, -64, -64, -64, -64, -64, 64, 64, 64, -64, -64, -64, -64, -64, 64, -64, 64, 64, -64, 64, 64, -64, -64, -64, -64, -64, -64, -64, -64, -64, -64, -64, -64, -64, -64, -64, 64, -64, -64, -64, -64, -64, -64, 64, 64, 64, 64, -64, -64, -64, -64, -64, -64, -64, -64, -64, 64, -64, -64, 64, 64, 64, 64, -64, -64, 64, 64, -64, -64, -64, -64, -64, 64, -64, 64, -64, -64, 64, -64, -64, -64, -64, -64, 64, -64, -64, -64, -64, 64, 64, 64, 64, -64, 64, -64, 64, -64, 64, -64, 64, -64, -64, 64, 64, -64, -64, -64, -64, -64, -64, -64, -64, 64, 64, 64, 64, 64, 64, 64, 64, -64, -64, 64, -64, 64, 64, 64, 64, -64, 64, 64, 64, -64, 64, 64, 64, -64, 64, -64, 64, 64, 64, -64, -64, 64, 64, 64, -64, 64, -64, -64, -64, 64, -64, -64, -64, 64, 64, 64, 64, 64, 64, 64, 64, 64, 64, 64, -64, 64, -64, 64, -64, 64, -64, 64, -64, -64, 64, -64, -64, 64, 64, -64, 64, -64, 64, 64, 64, 64, 64, -64, -64, -64, 64, -64, -64, -64, -64, 64, -64, 64, 64, 64, -64, -64, -64, 64, 64, 64, -64, -64, 64, 64, -64, -64, -64, -64, 64, -64, -64, -64, 64, -64, -64, -64, -64, -64, 64, -64, 64, 64, 64, 64, -64, 64, -64, 64, -64, 64, -64, -64, -64, 64, 64, -64, 64, -64, -64, 64, 64, 64, 64, 64, -64, -64, -64, -64, -64, -64, 64, 64, -64, 64, -64, -64, 64, 64, 64, -64, 64, 64, -64, -64, -64, 64, 64, 64, -64, -64, -64, 64, 64, -64, 64, 64, -64, 64, 64, -64, -64, -64, -64, 64, 64, -64, 64, 64, -64, -64, 64, -64, -64, -64, -64, -64, 64, -64, -64, -64, 64, 64, 64, -64, -64, 64, 64, -64, -64, 64, -64, -64, 64, -64, -64, 64, -64, 64, 64, -64, 64, -64, 64, 64, -64, -64, -64, -64, -64, -64, -64, 64, -64, -64, 64, 64, -64, -64, -64, -64, 64, -64, -64, -64, 64, 64, 64, 64, 64, -64, -64, -64, 64, -64, -64, -64, -64, 64, -64, 64, 64, -64, -64, -64, -64, -64, 64, 64, -64, -64, -64, -64, -64, -64, -64, 64, 64, 64, 64, -64, -64, 64, -64, -64, 64, 64, -64, -64, 64, -64, -64, -64, 64, 64, 64, 64, 64, -64, -64, -64, -64, 64, -64, 64, -64, 64, -64, -64, 64, -64, 64, -64, -64, 64, -64, -64, -64, -64, -64, -64, -64, 64, 64, 64, 64, -64, -64, -64, -64, -64, 64, 64, 64, -64, 64, 64, -64, -64, -64, 64, -64, -64, 64, -64, -64, -64, -64, 64, 64, -64, 64, -64, 64, -64, -64, -64, -64, 64, -64, 64, 64, 64, 64, -64, -64, 64, -64, -64, 64, 64, 64, -64, -64, -64, -64, 64, -64, -64, -64, 64, -64, -64, 64, -64, -64, 64, -64, 64, 64, -64, -64, -64, -64, -64, 64, -64, 64, -64, -64, -64, -64, -64, -64, -64, -64, 64, -64, -64, -64, 64, 64, -64, 64, -64, -64, -64, 64, -64, -64, -64, -64, -64, -64, 64, -64, -64, -64, -64, -64, -64, -64, -64, -64, -64, -64, -64, -64, -64, -64, 64, -64, -64, 64, 64, 64, -64, -64, -64, 64, -64, -64, 64, -64, -64, -64, -64, -64, 64, -64, -64, -64, -64, -64, -64, -64, -64, -64, 64, 64, 64, -64, 64, 64, 64, -64, -64, -64, -64, -64, -64, -64, -64, -64, 64, -64, -64, -64, 64, -64, 64, 64, -64, -64, -64, -64, 64, -64, -64, -64, 64, -64, 64, 64, 64, -64, -64, -64, -64, -64, -64, -64, -64, -64, -64, -64, -64, -64, -64, 64, 64, -64, 64, -64, 64, -64, -64, 64, 64, 64, -64, -64, -64, -64, -64, -64, -64, -64, -64, -64, -64, -64, -64, 64, 64, 64, -64, 64, -64, 64, -64, 64, -64, 64, 64, 64, -64, -64, 64, -64, -64, 64, -64, -64, -64, -64, -64, -64, -64, 64, -64, -64, 64, -64, -64, -64, -64, -64, -64, 64, -64, -64, 64, -64, 64, -64, -64, -64, -64, -64, -64, -64, 64, -64, 64, -64, -64, -64, 64, -64, 64, -64, -64, -64, 64, -64, 64, -64, -64, 64, 64, -64, 64, -64, -64, -64, -64, -64, -64, -64, -64, 64, -64, -64, -64, 64, 64, -64, -64, 64, 64, -64, 64, -64, 64, -64, 64, -64, -64, 64, 64, 64, 64, 64, -64, -64, -64, -64, 64, -64, -64, -64, -64, 64, 64, 64, -64, -64, -64, -64, -64, 64, 64, 64, -64, -64, -64, 64, -64, 64, -64, 64, -64, -64, -64, -64, -64, -64, -64, -64, 64, 64, 64, -64, -64, 64, -64, -64, -64, 64, -64, 64, -64, 64, -64, 64, 64, 64, -64, 64, -64, -64, -64, -64, -64, -64, -64, -64, 64, -64, 64, 64, -64, 64, 64, 64, 64, -64, 64, -64, -64, -64, -64, 64, 64, 64, 64, -64, 64, -64, -64, 64, 64, 64, -64, -64, -64, -64, -64, -64, 64, -64, -64, -64, -64, 64, -64, 64, 64, 64, 64, 64, 64, 64, 64, 64, 64, 64, -64, -64, 64, -64, -64, -64, -64, -64, -64, 64, 64, -64, 64, 64, 64, 64, 64, 64, 64, 64, 64, 64, -64, -64, 64, 64, -64, 64, -64, -64, 64, 64, -64, -64, -64, -64, -64, 64, 64, 64, 64, 64, 64, -64, -64, -64, 64, -64, 64, -64, 64, -64, -64, -64, -64, 64, 64, -64, 64, -64, 64, -64, -64, 64, -64, -64, 64, -64, -64, 64, 64, -64, -64, 64, -64, 64, -64, -64, -64, 64, 64, -64, 64, 64, 64, -64, 64, -64, -64, 64, -64, 64, 64, 64, 64, -64, 64, 64, 64, -64, 64, -64, 64, -64, 64, 64, 64, 64, 64, -64, 64, -64, -64, -64, -64, 64, 64, -64, -64, -64, 64, -64, -64, 64, 64, -64, 64, -64, -64, 64, 64, 64, -64, 64, 64, 64, -64, 64, -64, 64, 64, 64, 64, 64, -64, 64, 64, -64, 64, -64, 64, 64, 64, 64, -64, 64, -64, -64, 64, -64, 64, -64, 64, -64, 64, 64, -64, 64, 64, -64, -64, 64, -64, 64, -64, 64, 64, -64, 64, -64, 64, -64, 64, -64, -64, -64, -64, 64, 64, -64, 64, 64, 64, 64, 64, -64, 64, 64, -64, 64, 64, -64, 64, -64, 64, 64, -64, 64, 64, 64, 64, 64, 64, 64, -64, 64, -64, -64, 64, 64, 64, -64, -64, -64, -64, 64, 64, 64, -64, -64, -64, -64, 64, -64, -64, 64, 64, -64, 64, -64, 64, -64, 64, 64, 64, 64, 64, 64, -64, 64, -64, 64, -64, 64, -64, -64, -64, -64, -64, -64, -64, -64, -64, -64, -64, 64, 64, -64, -64, 64, -64, 64, -64, 64, 64, -64, -64, -64, -64, 64, -64, -64, -64, -64, -64, -64, 64, -64, -64, -64, 64, -64, 64, 64, -64, 64, 64, -64, -64, 64, -64, -64, -64, -64, -64, -64, 64, -64, -64, -64, -64, -64, 64, -64, 64, -64, -64, -64, -64, -64, 64, -64, 64, 64, -64, -64, -64, 64, -64, 64, -64, -64, 64, -64, -64, 64, 64, 64, 64, 64, -64, -64, 64, 64, -64, -64, -64, -64, -64, -64, -64, 64, 64, 64, -64, 64, 64, 64, -64, -64, -64, -64, 64, 64, -64, 64, 64, 64, 64, 64, 64, -64, -64, -64, -64, -64, -64, -64, -64, -64, -64, 64, 64, -64, -64, -64, -64, -64, -64, 64, 64, 64, -64, -64, 64, 64, 64, 64, -64, -64, -64, 64, 64, -64, 64, -64, -64, -64, 64, -64, 64, 64, -64, 64, -64, 64, 64, -64, 64, -64, -64, 64, -64, 64, 64, 64, -64, -64, -64, -64, -64, -64, -64, -64, 64, 64, 64, 64, -64, -64, -64, -64, 64, -64, -64, 64, -64, -64, -64, -64, -64, 64, 64, -64, -64, -64, -64, -64, -64, -64, 64, 64, 64, -64, 64, -64, -64, 64, -64, 64, -64, 64, -64, -64, -64, -64, -64, 64, 64, -64, -64, -64, -64, -64, -64, -64, -64, 64, 64, 64, -64, 64, 64, -64, 64, 64, 64, -64, -64, 64, -64, 64, -64, -64, 64, -64, -64, -64, 64, -64, -64, -64, -64, 64, -64, -64, -64, -64, 64, 64, 64, 64, 64, -64, 64, 64, 64, -64, -64, -64, -64, -64, 64, -64, 64, -64, 64, -64, 64, 64, 64, -64, 64, 64, -64, 64, 64, 64, 64, 64, 64, 64, 64, 64, 64, -64, -64, -64, -64, -64, -64, 64, -64, -64, -64, 64, 64, -64, -64, 64, 64, -64, 64, 64, 64, 64, 64, -64, 64, 64, 64, -64, -64, -64, -64, -64, -64, -64, -64, -64, -64, -64, -64, -64, -64, -64, -64, 64, -64, -64, 64, 64, 64, -64, -64, -64, 64, 64, -64, 64, 64, 64, -64, -64, -64, -64, -64, -64, -64, 64, -64, -64, -64, 64, -64, -64, -64, -64, -64, 64, -64, -64, 64, -64, -64, -64, 64, -64, -64, 64, -64, -64, -64, -64, -64, -64, -64, -64, -64, -64, -64, -64, -64, -64, -64, -64, 64, -64, 64, -64, -64, 64, -64, -64, 64, 64, 64, -64, -64, -64, -64, -64, -64, -64, 64, 64, -64, 64, -64, -64, -64, -64, -64, 64, 64, 64, 64, 64, 64, -64, 64, -64, 64, 64, 64, -64, -64, -64, -64, -64, -64, -64, -64, -64, -64, 64, -64, -64, -64, -64, -64, -64, 64, -64, 64, -64, 64, -64, -64, 64, 64, 64, -64, 64, 64, -64, -64, 64, -64, -64, -64, -64, -64, 64, -64, -64, -64, -64, -64, 64, -64, 64, 64, 64, 64, -64, 64, 64, 64, 64, -64, 64, -64, -64, -64, -64, -64, -64, -64, 64, -64, -64, -64, -64, -64, -64, 64, 64, 64, -64, 64, 64, -64, -64, 64, -64, -64, 64, 64, -64, 64, -64, -64, -64, 64, -64, -64, -64, -64, 64, -64, -64, -64, -64, 64, 64, -64, -64, 64, -64, -64, -64, 64, 64, 64, -64, 64, 64, -64, 64, 64, 64, -64, 64, -64, -64, -64, 64, -64, 64, 64, 64, -64, -64, -64, -64, -64, 64, -64, -64, -64, 64, -64, 64, -64, 64, -64, 64, 64, 64, 64, 64, -64, 64, -64, 64, 64, 64, -64, -64, -64, 64, 64, -64, -64, 64, -64, -64, 64, -64, 64, 64, 64, -64, 64, 64, 64, 64, -64, 64, 64, -64, -64, 64, 64, 64, 64, 64, 64, -64, -64, -64, 64, 64, 64, -64, 64, -64, -64, 64, 64, 64, 64, 64, -64, 64, -64, 64, -64, 64, -64, -64, 64, 64, -64, 64, 64, 64, -64, 64, -64, 64, 64, 64, -64, 64, 64, -64, -64, -64, -64, -64, 64, 64, -64, 64, -64, 64, -64, 64, -64, 64, 64, -64, 64, 64, -64, 64, 64, -64, -64, 64, -64, -64, -64, -64, -64, 64, -64, 64, 64, 64, 64, 64, 64, -64, 64, -64, -64, 64, -64, -64, -64, 64, -64, 64, -64, 64, -64, -64, 64, -64, 64, -64, 64, -64, -64, 64, 64, 64, -64, 64, -64, -64, -64, -64, -64, 64, 64, 64, 64, 64, 64, -64, 64, -64, -64, -64, 64, -64, 64, 64, -64, 64, 64, -64, 64, -64, -64, -64, 64, -64, -64, 64, -64, 64, 64, 64, 64, 64, 64, -64, 64, 64, 64, -64, 64, 64, -64, 64, 64, -64, -64, -64, 64, -64, -64, -64, 64, -64, 64, -64, -64, 64, 64, 64, 64, -64, 64, 64, 64, 64, -64, 64, 64, -64, 64, -64, 64, 64, -64, 64, -64, -64, -64, 64, 64, 64, -64, -64, -64, 64, -64, 64, -64, 64, 64, 64, 64, 64, 64, 64, 64, -64, 64, 64, -64, -64, -64, -64, -64, -64, -64, 64, -64, 64, 64, 64, -64, -64, -64, -64, -64, -64, 64, -64, -64, -64, -64, -64, -64, -64, 64, -64, -64, -64, -64, -64, -64, -64, -64, -64, -64, 64, 64, 64, 64, -64, 64, 64, -64, 64, -64, -64, -64, 64, -64, 64, -64, 64, 64, -64, 64, -64, -64, -64, 64, -64, 64, 64, 64, 64, 64, -64, 64, 64, -64, -64, 64, -64, -64, -64, -64, -64, -64, 64, -64, -64, -64, -64, -64, -64, 64, -64, 64, 64, -64, 64, -64, 64, 64, -64, -64, 64, -64, -64, -64, 64, -64, -64, 64, 64, 64, -64, 64, 64, 64, -64, -64, -64, 64, 64, 64, 64, 64, -64, -64, -64, -64, -64, -64, -64, -64, -64, -64, -64, -64, -64, -64, -64, -64, -64, -64, -64, -64, -64, -64, -64, 64, 64, 64, -64, -64, -64, -64, -64, -64, -64, -64, -64, -64, -64, -64, -64, -64, -64, -64, 64, -64, -64, 64, -64, -64, 64, -64, 64, 64, 64, 64, 64, -64, -64, -64, 64, 64, -64, -64, -64, -64, -64, 64, 64, -64, 64, -64, 64, -64, -64, 64, 64, -64, 64, -64, -64, 64, 64, 64, 64, 64, -64, 64, 64, -64, -64, -64, -64, 64, 64, 64, 64, 64, 64, -64, 64, -64, 64, -64, 64, -64, -64, -64, -64, 64, 64, 64, 64, 64, -64, -64, 64, 64, -64, 64, 64, 64, 64, 64, 64, 64, 64, -64, -64, -64, -64, -64, -64, -64, 64, 64, -64, -64, 64, 64, 64, 64, -64, -64, -64, -64, 64, 64, 64, 64, -64, 64, 64, 64, -64, -64, -64, -64, -64, -64, 64, 64, -64, 64, -64, -64, 64, 64, 64, 64, 64, 64, -64, 64, 64, 64, 64, -64, -64, 64, 64, 64, 64, 64, -64, -64, -64, -64, 64, -64, 64, -64, -64, -64, 64, 64, 64, -64, 64, 64, -64, -64, -64, 64, -64, -64, -64, -64, -64, -64, 64, 64, 64, -64, -64, 64, 64, -64, 64, 64, -64, -64, -64, 64, 64, 64, 64, 64, -64, -64, -64, -64, -64, -64, -64, -64, -64, -64, 64, 64, 64, 64, -64, -64, -64, -64, 64, -64, -64, -64, 64, -64, -64, 64, 64, -64, -64, -64, -64, -64, 64, 64, -64, -64, -64, 64, 64, 64, 64, -64, -64, -64, 64, 64, -64, 64, -64, 64, 64, -64, 64, 64, 64, -64, 64, -64, -64, -64, 64, -64, -64, -64, -64, 64, 64, 64, -64, -64, 64, -64, -64, -64, 64, -64, -64, 64, 64, -64, -64, 64, 64, 64, -64, -64, -64, -64, -64, -64, -64, -64, 64, 64, 64, 64, 64, 64, -64, 64, 64, -64, 64, -64, -64, 64, -64, 64, -64, 64, 64, -64, -64, -64, -64, -64, 64, 64, 64, 64, 64, 64, 64, -64, 64, -64, 64, -64, -64, -64, 64, -64, -64, -64, -64, -64, -64, -64, -64, 64, -64, -64, 64, 64, 64, -64, 64, 64, 64, 64, -64, -64, 64, 64, 64, -64, -64, -64, 64, -64, -64, -64, -64, -64, 64, -64, -64, -64, -64, -64, -64, 64, 64, 64, -64, -64, -64, 64, 64, -64, 64, -64, -64, -64, -64, 64, -64, -64, -64, -64, 64, 64, 64, -64, -64, -64, -64, -64, 64, 64, 64, 64, 64, 64, 64, 64, -64, 64, 64, 64, -64, -64, -64, -64, -64, 64, 64, 64, -64, 64, 64, -64, -64, -64, -64, 64, 64, -64, 64, 64, 64, 64, 64, 64, -64, -64, 64, 64, -64, 64, 64, -64, -64, -64, 64, -64, -64, -64, 64, 64, -64, -64, -64, 64, 64, -64, 64, 64, 64, 64, 64, -64, 64, -64, 64, 64, 64, 64, -64, -64, 64, -64, 64, -64, 64, 64, -64, -64, -64, -64, 64, 64, -64, 64, 64, 64, 64, 64, -64, -64, 64, 64, 64, -64, -64, 64, 64, -64, 64, 64, -64, 64, -64, -64, -64, -64, -64, -64, -64, 64, -64, -64, -64, 64, 64, -64, 64, 64, -64, 64, -64, 64, -64, -64, -64, 64, 64, 64, -64, 64, 64, -64, -64, -64, -64, -64, 64, 64, -64, -64, 64, -64, 64, -64, -64, -64, 64, -64, 64, -64, -64, 64, 64, 64, 64, 64, 64, -64, -64, -64, -64, 64, -64, 64, 64, -64, -64, -64, -64, -64, -64, 64, 64, -64, 64, 64, -64, -64, 64, 64, 64, -64, -64, -64, 64, -64, -64, -64, 64, 64, -64, -64, 64, -64, -64, -64, -64, -64, -64, 64, -64, -64, -64, 64, -64, -64, -64, -64, -64, -64, 64, -64, 64, -64, -64, -64, -64, -64, 64, -64, 64, 64, -64, -64, -64, -64, -64, -64, 64, 64, 64, 64, 64, -64, -64, 64, -64, 64, -64, 64, 64, -64, 64, 64, 64, -64, 64, 64, -64, 64, 64, 64, -64, -64, -64, -64, 64, -64, 64, 64, 64, 64, -64, -64, 64, -64, -64, -64, -64, 64, 64, 64, 64, 64, 64, 64, -64, 64, 64, -64, 64, 64, -64, -64, -64, 64, 64, 64, -64, -64, 64, 64, 64, -64, 64, -64, 64, 64, 64, 64, 64, 64, 64, 64, -64, 64, -64, -64, -64, -64, -64, -64, -64, -64, 64, 64, 64, 64, -64, 64, -64, -64, -64, -64, 64, 64, 64, -64, -64, -64, 64, -64, -64, -64, -64, -64, -64, -64, -64, -64, -64, -64, 64, -64, 64, 64, 64, 64, -64, -64, -64, -64, 64, 64, -64, -64, -64, -64, -64, -64, -64, -64, -64, -64, -64, -64, -64, -64, -64, -64, -64, 64, 64, 64, -64, 64, -64, -64, -64, 64, -64, -64, -64, -64, 64, -64, -64, -64, -64, -64, -64, -64, -64, -64, -64, -64, -64, -64, -64, 64, 64, 64, 64, -64, 64, -64, -64, 64, 64, 64, -64, 64, 64, -64, -64, -64, -64, -64, 64, -64, -64, -64, -64, -64, -64, -64, -64, -64, 64, 64, 64, 64, 64, -64, -64, 64, 64, 64, -64, 64, 64, -64, -64, -64, 64, 64, -64, -64, -64, -64, -64, 64, 64, -64, -64, -64, 64, 64, 64, -64, 64, 64, 64, 64, 64, 64, 64, 64, 64, 64, 64, -64, -64, -64, -64, -64, -64, -64, -64, 64, 64, -64, -64, -64, -64, -64, 64, 64, -64, 64, 64, 64, 64, -64, 64, 64, 64, -64, -64, -64, -64, -64, -64, -64, -64, -64, -64, 64, 64, 64, -64, -64, 64, -64, -64, -64, 64, -64, 64, -64, 64, -64, -64, 64, -64, -64, -64, -64, -64, -64, -64, -64, -64, 64, 64, -64, -64, 64, 64, -64, -64, -64, -64, 64, -64, -64, 64, 64, 64, -64, -64, 64, -64, 64, -64, -64, -64, -64, -64, -64, -64, 64, 64, 64, -64, 64, 64, -64, -64, -64, 64, 64, 64, 64, 64, -64, -64, 64, -64, 64, 64, -64, 64, 64, -64, -64, -64, -64, -64, 64, -64, 64, -64, -64, 64, -64, -64, -64, -64, -64, -64, -64, -64, -64, -64, 64, 64, 64, 64, 64, 64, 64, 64, -64, -64, -64, -64, 64, 64, -64, -64, 64, 64, -64, -64, 64, 64, 64, -64, -64, -64, -64, -64, 64, -64, -64, 64, 64, 64, -64, -64, -64, -64, -64, -64, -64, -64, -64, -64, 64, 64, 64, 64, -64, -64, 64, 64, 64, 64, -64, -64, 64, -64, -64, -64, -64, -64, -64, -64, -64, -64, 64, 64, -64, -64, 64, 64, 64, 64, -64, 64, 64, 64, 64, -64, 64, 64, -64, 64, -64, -64, -64, -64, -64, -64, -64, -64, -64, 64, 64, 64, 64, 64, -64, -64, -64, 64, 64, 64, -64, 64, -64, -64, 64, -64, 64, 64, 64, 64, -64, -64, -64, -64, -64, -64, 64, 64, -64, 64, 64, 64, 64, -64, -64, -64, 64, 64, 64, 64, 64, 64, 64, -64, -64, -64, 64, 64, -64, -64, -64, -64, -64, -64, -64, -64, -64, -64, -64, -64, 64, 64, 64, 64, 64, 64, -64, 64, 64, -64, 64, -64, 64, -64, -64, -64, -64, -64, -64, -64, -64, -64, -64, -64, 64, -64, -64, 64, 64, 64, 64, 64, 64, 64, -64, 64, -64, 64, -64, 64, -64, -64, -64, -64, -64, -64, -64, -64, 64, 64, 64, -64, -64, -64, 64, 64, 64, -64, 64, -64, -64, 64, -64, -64, 64, 64, 64, -64, -64, 64, 64, -64, -64, -64, -64, -64, -64, -64, 64, 64, 64, -64, -64, 64, 64, 64, -64, -64, 64, -64, -64, 64, 64, 64, 64, 64, 64, -64, 64, 64, -64, 64, -64, -64, -64, -64, -64, 64, -64, 64, 64, 64, -64, -64, 64, 64, 64, 64, -64, -64, 64, -64, 64, 64, -64, -64, -64, 64, 64, -64, 64, -64, -64, -64, -64, 64, -64, 64, 64, -64, -64, -64, -64, 64, 64, 64, -64, -64, 64, -64, -64, -64, 64, -64, -64, -64, 64, 64, 64, 64, 64, -64, 64, -64, -64, -64, 64, 64, 64, -64, 64, -64, 64, -64, 64, -64, -64, 64, 64, 64, 64, 64, 64, 64, -64, -64, 64, 64, 64, -64, 64, -64, 64, -64, -64, -64, -64, -64, 64, -64, 64, -64, -64, -64, 64, -64, -64, -64, -64, 64, -64, -64, -64, -64, 64, -64, 64, 64, 64, 64, 64, 64, 64, 64, 64, -64, -64, 64, -64, 64, -64, 64, -64, 64, -64, 64, -64, -64, -64, -64, -64, -64, 64, -64, 64, -64, 64, -64, -64, 64, 64, 64, 64, -64, -64, -64, 64, 64, 64, -64, 64, -64, 64, -64, -64, -64, -64, 64, 64, 64, 64, 64, -64, 64, -64, -64, 64, 64, 64, 64, -64, 64, 64, 64, 64, -64, 64, -64, -64, -64, -64, -64, 64, 64, -64, 64, 64, -64, 64, -64, -64, 64, -64, 64, 64, -64, 64, 64, -64, 64, -64, -64, 64, 64, 64, 64, -64, -64, -64, -64, 64, -64, -64, 64, 64, 64, -64, 64, 64, 64, 64, -64, 64, -64, 64, -64, -64, 64, 64, -64, -64, -64, -64, 64, -64, 64, -64, 64, -64, 64, -64, -64, -64, 64, -64, -64, 64, -64, -64, 64, 64, -64, 64, 64, -64, 64, -64, -64, 64, -64, -64, -64, 64, 64, -64, 64, 64, 64, 64, 64, 64, 64, 64, 64, 64, 64, -64, -64, 64, 64, -64, 64, -64, 64, 64, 64, -64, 64, 64, 64, 64, -64, 64, 64, -64, 64, -64, -64, -64, -64, -64, 64, 64, 64, 64, 64, -64, -64, 64, -64, 64, -64, 64, 64, 64, -64, 64, 64, -64, 64, 64, 64, 64, 64, -64, 64, -64, 64, -64, -64, -64, -64, -64, 64, -64, -64, 64, 64, -64, -64, -64, 64, 64, 64, -64, -64, -64, 64, 64, 64, 64, -64, 64, 64, 64, 64, 64, -64, 64, -64, -64, 64, -64, 64, 64, -64, 64, 64, 64, -64, -64, -64, -64, -64, 64, 64, -64, 64, -64, 64, 64, -64, 64, 64, 64, 64, 64, 64, 64, 64, 64, 64, 64, 64, 64, 64, 64, -64, 64, -64, 64, 64, -64, 64, 64, -64, -64, 64, 64, 64, 64, 64, 64, 64, 64, 64, 64, 64, 64, 64, 64, 64, 64, 64, 64, 64, 64, -64, 64, 64, -64, 64, -64, 64, -64, 64, -64, 64, 64, -64, -64, -64, -64, -64, -64, 64, 64, -64, -64, -64, -64, -64, 64, -64, 64, -64, 64, -64, 64, -64, -64, 64, -64, -64, 64, -64, -64, 64, -64, 64, -64, 64, -64, 64, -64, 64, 64, 64, 64, -64, 64, 64, -64, 64, -64, 64, 64, 64, 64, 64, 64, -64, 64, -64, -64, 64, 64, 64, 64, 64, 64, -64, 64, 64, 64, 64, 64, 64, -64, -64, 64, -64, 64, -64, 64, -64, 64, -64, -64, 64, 64, 64, 64, -64, 64, 64, -64, 64, 64, 64, 64, 64, -64, 64, -64, 64, 64, 64, 64, -64, -64, 64, 64, 64, -64, 64, 64, 64, 64, 64, -64, 64, -64, 64, 64, 64, 64, -64, 64, -64, 64, 64, 64, -64, -64, 64, 64, -64, -64, -64, 64, -64, 64, -64, 64, 64, 64, 64, 64, -64, -64, 64, 64, 64, 64, 64, 64, 64, 64, -64, -64, 64, 64, 64, 64, 64, 64, -64, 64, -64, -64, -64, -64, -64, 64, -64, -64, -64, 64, 64, 64, -64, -64, -64, -64, -64, -64, -64, -64, 64, 64, 64, -64, 64, 64, -64, -64, -64, 64, -64, -64, 64, 64, 64, 64, -64, 64, -64, -64, 64, 64, 64, 64, 64, 64, 64, -64, -64, 64, -64, -64, 64, -64, 64, 64, 64, -64, 64, -64, -64, 64, 64, -64, 64, -64, 64, 64, 64, 64, 64, 64, -64, 64, -64, -64, -64, 64, -64, 64, -64, -64, -64, -64, 64, 64, 64, 64, -64, 64, 64, 64, 64, 64, 64, 64, 64, 64, -64, 64, -64, 64, 64, -64, -64, -64, 64, -64, -64, 64, -64, 64, 64, -64, 64, 64, -64, -64, -64, 64, 64, -64, -64, -64, -64, -64, -64, 64, -64, 64, -64, -64, -64, 64, 64, 64, -64, -64, -64, 64, 64, 64, -64, 64, 64, 64, 64, -64, -64, 64, 64, 64, 64, -64, -64, -64, -64, -64, -64, -64, 64, -64, 64, -64, -64, 64, -64, -64, -64, -64, -64, 64, 64, 64, -64, -64, -64, 64, -64, -64, 64, -64, 64, 64, -64, 64, -64, 64, -64, 64, 64, -64, 64, -64, 64, 64, 64, 64, -64, 64, 64, 64, 64, 64, -64, 64, -64, 64, 64, -64, 64, -64, -64, 64, 64, 64, -64, -64, -64, -64, -64, 64, -64, -64, -64, -64, 64, -64, 64, -64, 64, -64, -64, -64, -64, 64, -64, -64, 64, -64, 64, 64, -64, 64, -64, -64, -64, 64, -64, -64, 64, 64, 64, -64, -64, 64, 64, -64, -64, -64, 64, -64, 64, -64, 64, -64, -64, -64, -64, 64, -64, -64, -64, 64, 64, -64, 64, 64, -64, -64, 64, 64, 64, 64, -64, -64, -64, -64, -64, 64, 64, 64, 64, 64, 64, 64, 64, -64, -64, 64, -64, 64, 64, -64, 64, 64, -64, -64, -64, 64, 64, 64, 64, -64, -64, -64, -64, 64, 64, 64, -64, -64, -64, -64, -64, 64, 64, -64, 64, 64, 64, 64, -64, 64, -64, 64, -64, 64, 64, -64, 64, 64, -64, 64, 64, -64, 64, 64, -64, 64, -64, -64, -64, -64, 64, 64, 64, 64, 64, 64, 64, 64, 64, 64, -64, 64, 64, 64, 64, 64, 64, -64, -64, 64, 64, 64, 64, 64, 64, 64, 64, 64, 64, 64, 64, -64, 64, 64, -64, 64, -64, 64, -64, -64, 64, -64, 64, 64, 64, 64, 64, 64, 64, 64, 64, 64, 64, 64, 64, 64, -64, -64, 64, 64, 64, 64, 64, 64, -64, 64, 64, 64, -64, -64, 64, 64, 64, 64, 64, 64, 64, 64, 64, 64, 64, 64, -64, 64, -64, -64, 64, -64, 64, -64, 64, 64, -64, 64, -64, -64, 64, 64, 64, 64, 64, 64, -64, 64, 64, -64, -64, 64, 64, -64, -64, -64, -64, 64, -64, -64, -64, -64, 64, 64, -64, -64, 64, -64, 64, -64, -64, 64, -64, -64, -64, -64, -64, -64, -64, -64, -64, -64, -64, -64, -64, -64, -64, -64, -64, -64, -64, -64, -64, 64, 64, 64, 64, -64, -64, -64, -64, -64, -64, -64, -64, -64, -64, -64, -64, -64, -64, -64, -64, -64, -64, -64, -64, -64, 64, 64, -64, 64, 64, 64, 64, 64, -64, -64, -64, -64, -64, -64, -64, -64, -64, -64, -64, -64, -64, 64, -64, -64, -64, -64, -64, -64, 64, 64, 64, -64, 64, -64, 64, 64, -64, -64, -64, -64, -64, -64, -64, -64, -64, 64, -64, 64, 64, 64, 64, -64, -64, -64, -64, -64, 64, 64, -64, 64, -64, 64, 64, -64, -64, -64, -64, -64, -64, -64, -64, -64, -64, 64, -64, -64, 64, 64, 64, -64, -64, -64, -64, -64, 64, 64, 64, 64, 64, 64, 64, -64, -64, -64, -64, -64, -64, -64, 64, -64, 64, 64, -64, 64, 64, 64, 64, 64, -64, -64, -64, 64, -64, -64, -64, -64, 64, 64, 64, -64, -64, -64, -64, -64, -64, -64, -64, -64, 64, -64, -64, -64, -64, 64, 64, 64, -64, -64, -64, 64, -64, -64, -64, -64, -64, -64, 64, 64, 64, -64, 64, -64, -64, -64, -64, -64, -64, -64, -64, 64, 64, -64, -64, -64, -64, -64, -64, -64, 64, -64, 64, -64, 64, -64, 64, -64, -64, 64, 64, -64, -64, -64, -64, -64, -64, -64, -64, 64, 64, 64, 64, -64, -64, -64, -64, 64, 64, 64, -64, -64, -64, 64, 64, -64, -64, -64, 64, -64, -64, -64, -64, -64, -64, 64, 64, 64, 64, 64, 64, -64, 64, -64, 64, 64, 64, 64, 64, -64, -64, -64, 64, 64, 64, 64, 64, 64, 64, -64, 64, 64, 64, 64, 64, 64, 64, -64, 64, -64, 64, 64, 64, 64, 64, 64, 64, 64, -64, -64, 64, 64, 64, 64, 64, 64, 64, 64, -64, -64, 64, -64, -64, -64, 64, -64, 64, -64, 64, -64, 64, 64, 64, -64, 64, 64, -64, 64, 64, 64, -64, 64, 64, 64, 64, 64, 64, 64, 64, -64, -64, 64, -64, 64, -64, -64, -64, 64, 64, 64, 64, 64, 64, 64, -64, -64, 64, 64, 64, 64, 64, -64, -64, 64, -64, -64, -64, -64, -64, -64, -64, -64, -64, -64, -64, -64, 64, 64, -64, -64, -64, 64, 64, 64, -64, 64, 64, 64, 64, 64, 64, 64, 64, -64, 64, -64, 64, -64, 64, -64, -64, -64, -64, -64, -64, 64, -64, 64, -64, 64, 64, -64, 64, 64, 64, 64, 64, 64, 64, 64, -64, -64, 64, 64, 64, 64, 64, 64, 64, 64, 64, 64, 64, -64, 64, 64, -64, -64, -64, -64, 64, -64, -64, -64, 64, 64, 64, -64, -64, -64, 64, 64, 64, 64, 64, 64, 64, 64, 64, 64, -64, 64, 64, -64, 64, 64, -64, 64, 64, -64, 64, -64, -64, -64, -64, 64, 64, -64, 64, -64, 64, -64, 64, 64, 64, 64, 64, 64, 64, -64, -64, -64, 64, -64, -64, -64, 64, -64, 64, 64, 64, -64, 64, -64, 64, -64, 64, 64, 64, -64, 64, 64, 64, 64, 64, 64, -64, -64, -64, -64, -64, -64, 64, 64, -64, 64, -64, 64, -64, 64, 64, 64, 64, -64, 64, -64, 64, 64, -64, 64, 64, -64, -64, -64, -64, 64, 64, -64, 64, 64, 64, 64, 64, 64, -64, 64, 64, 64, 64, -64, 64, -64, 64, 64, -64, 64, -64, 64, -64, 64, 64, 64, 64, 64, -64, 64, 64, -64, -64, 64, -64, 64, -64, -64, -64, -64, 64, -64, 64, 64, 64, 64, 64, 64, -64, -64, 64, 64, 64, 64, -64, 64, 64, -64, -64, 64, 64, -64, -64, 64, -64, 64, -64, -64, -64, -64, -64, 64, 64, 64, -64, 64, -64, -64, -64, -64, 64, 64, 64, -64, 64, 64, -64, -64, -64, 64, 64, -64, -64, 64, 64, -64, -64, 64, -64, 64, 64, 64, 64, 64, -64, -64, -64, -64, 64, 64, 64, 64, -64, -64, -64, -64, 64, 64, 64, -64, 64, 64, -64, 64, -64, 64, 64, -64, 64, 64, 64, 64, 64, -64, 64, 64, 64, -64, 64, 64, -64, -64, -64, -64, -64, 64, 64, 64, -64, -64, 64, -64, 64, 64, -64, -64, 64, 64, 64, 64, -64, 64, 64, 64, 64, 64, 64, -64, -64, 64, 64, -64, 64, 64, 64, 64, -64, -64, 64, 64, 64, 64, -64, 64, 64, 64, -64, -64, 64, 64, 64, 64, -64, 64, 64, -64, 64, -64, -64, 64, -64, -64, 64, -64, -64, 64, -64, -64, 64, 64, -64, 64, 64, 64, 64, 64, 64, -64, 64, 64, 64, 64, -64, 64, 64, 64, 64, 64, 64, 64, -64, 64, -64, 64, 64, -64, 64, 64, 64, 64, 64, 64, -64, -64, 64, 64, 64, 64, 64, 64, 64, -64, 64, -64, -64, -64, -64, 64, -64, -64, -64, 64, 64, 64, 64, -64, 64, 64, 64, -64, -64, 64, 64, 64, 64, -64, 64, 64, -64, -64, 64, 64, 64, 64, -64, -64, -64, -64, -64, 64, 64, -64, -64, 64, 64, -64, 64, -64, -64, 64, 64, 64, 64, 64, 64, 64, 64, 64, -64, 64, 64, 64, -64, -64, -64, 64, 64, 64, -64, -64, 64, 64, 64, 64, 64, -64, 64, 64, -64, 64, 64, 64, -64, 64, -64, 64, -64, -64, -64, 64, 64, -64, -64, -64, 64, 64, 64, 64, 64, 64, 64, 64, -64, -64, -64, 64, 64, 64, -64, 64, 64, 64, 64, 64, -64, -64, -64, -64, 64, -64, 64, 64, 64, 64, 64, 64, 64, 64, 64, -64, -64, 64, -64, 64, 64, 64, -64, 64, 64, -64, 64, -64, -64, -64, -64, 64, 64, -64, 64, -64, 64, -64, 64, -64, 64, 64, 64, 64, -64, 64, 64, 64, 64, -64, 64, 64, 64, -64, -64, 64, -64, -64, -64, -64, -64, 64, -64, 64, 64, 64, 64, 64, 64, 64, 64, -64, 64, -64, 64, 64, 64, 64, 64, 64, 64, -64, 64, -64, 64, -64, -64, -64, 64, 64, -64, -64, 64, 64, -64, 64, 64, -64, 64, -64, 64, 64, 64, 64, 64, 64, 64, -64, 64, 64, -64, 64, 64, 64, 64, -64, 64, -64, 64, 64, 64, 64, -64, -64, 64, 64, -64, -64, 64, 64, -64, 64, -64, 64, 64, 64, -64, 64, -64, 64, -64, 64, 64, 64, -64, -64, -64, 64, 64, 64, 64, 64, 64, 64, 64, -64, 64, -64, 64, 64, 64, 64, 64, -64, 64, 64, 64, -64, 64, -64, -64, 64, -64, -64, 64, 64, 64, 64, 64, 64, 64, -64, 64, 64, 64, 64, -64, -64, 64, -64, 64, 64, -64, -64, 64, -64, 64, -64, -64, 64, 64, 64, -64, 64, 64, 64, 64, 64, 64, -64, -64, 64, -64, -64, 64, 64, -64, -64, 64, 64, 64, 64, -64, 64, -64, 64, 64, 64, 64, 64, 64, -64, 64, 64, -64, 64, -64, -64, -64, 64, 64, 64, 64, -64, -64, 64, 64, 64, -64, 64, 64, 64, -64, -64, -64, 64, -64, 64, 64, 64, -64, 64, 64, 64, 64, 64, 64, 64, -64, 64, 64, -64, -64, 64, 64, 64, 64, 64, 64, -64, 64, 64, -64, 64, 64, 64, 64, 64, 64, -64, 64, 64, 64, -64, 64, -64, 64, 64, 64, -64, 64, -64, 64, 64, -64, 64, 64, 64, 64, -64, 64, -64, -64, -64, 64, 64, -64, 64, 64, 64, 64, 64, 64, 64, -64, 64, 64, 64, -64, 64, -64, 64, -64, -64, 64, -64, -64, 64, -64, -64, 64, 64, -64, 64, -64, 64, -64, -64, -64, 64, -64, -64, 64, 64, -64, -64, 64, -64, 64, -64, 64, 64, 64, -64, 64, 64, 64, 64, -64, 64, -64, -64, 64, -64, 64, 64, -64, -64, 64, -64, -64, -64, -64, -64, 64, -64, 64, -64, -64, -64, -64, 64, -64, 64, -64, -64, -64, 64, 64, -64, 64, 64, 64, -64, -64, -64, -64, -64, -64, 64, 64, -64, -64, 64, 64, 64, -64, 64, -64, 64, -64, 64, 64, -64, -64, -64, 64, 64, -64, -64, 64, -64, -64, 64, 64, -64, -64, -64, -64, -64, 64, 64, -64, -64, 64, 64, -64, 64, 64, 64, 64, -64, -64, 64, 64, -64, -64, -64, 64, 64, 64, -64, -64, -64, -64, 64, -64, -64, -64, 64, 64, 64, -64, 64, 64, -64, -64, -64, 64, 64, 64, 64, 64, -64, 64, -64, 64, -64, -64, -64, 64, 64, 64, -64, -64, -64, -64, -64, -64, -64, 64, 64, 64, 64, 64, 64, 64, 64, -64, -64, 64, -64, -64, 64, -64, -64, -64, -64, -64, 64, 64, -64, 64, 64, 64, 64, 64, -64, -64, -64, -64, -64, 64, -64, -64, 64, 64, 64, 64, -64, 64, 64, 64, -64, -64, 64, 64, 64, -64, 64, -64, 64, 64, 64, 64, -64, 64, -64, -64, -64, -64, -64, 64, 64, 64, 64, 64, -64, 64, 64, -64, -64, 64, 64, 64, -64, -64, -64, -64, -64, -64, 64, -64, -64, -64, -64, -64, 64, -64, -64, -64, -64, 64, 64, 64, -64, 64, -64, 64, -64, 64, -64, -64, -64, -64, -64, 64, 64, 64, -64, -64, -64, -64, -64, -64, -64, -64, -64, 64, -64, -64, 64, -64, 64, -64, -64, -64, 64, -64, -64, -64, -64, -64, 64, 64, -64, -64, -64, -64, 64, 64, 64, -64, -64, 64, -64, 64, -64, -64, 64, 64, -64, -64, -64, -64, -64, -64, -64, 64, -64, 64, 64, -64, -64, 64, -64, -64, -64, 64, -64, -64, -64, -64, 64, 64, -64, 64, -64, -64, -64, -64, -64, -64, -64, -64, -64, 64, 64, -64, -64, -64, 64, -64, -64, -64, -64, -64, -64, -64, 64, -64, -64, -64, 64, 64, -64, -64, -64, -64, -64, 64, 64, 64, 64, 64, -64, -64, -64, -64, -64, -64, -64, -64, -64, -64, -64, 64, -64, -64, -64, -64, -64, -64, -64, 64, -64, -64, -64, -64, 64, -64, 64, -64, 64, -64, 64, -64, 64, -64, -64, -64, -64, -64, -64, -64, -64, -64, 64, -64, 64, -64, 64, 64, -64, -64, -64, -64, -64, -64, -64, 64, -64, 64, -64, -64, 64, -64, -64, -64, 64, 64, -64, -64, -64, 64, -64, -64, 64, -64, 64, -64, -64, -64, -64, 64, -64, -64, -64, -64, -64, -64, -64, -64, -64, -64, -64, -64, -64, -64, 64, -64, -64, 64, 64, 64, 64, 64, 64, 64, 64, 64, -64, -64, -64, 64, 64, 64, -64, -64, -64, -64, 64, -64, 64, -64, -64, -64, 64, -64, 64, -64, -64, 64, -64, -64, -64, -64, -64, 64, -64, -64, -64, 64, -64, -64, -64, -64, -64, -64, -64, 64, -64, -64, -64, -64, -64, 64, -64, 64, 64, -64, -64, -64, -64, -64, -64, -64, -64, -64, -64, 64, -64, -64, -64, -64, -64, -64, -64, -64, -64, -64, -64, -64, 64, -64, -64, -64, 64, 64, 64, 64, -64, -64, 64, 64, -64, -64, -64, -64, 64, -64, -64, -64, -64, -64, -64, -64, -64, -64, -64, 64, -64, 64, 64, 64, 64, 64, -64, -64, 64, -64, -64, -64, -64, -64, -64, -64, -64, -64, -64, -64, -64, 64, -64, -64, -64, -64, -64, 64, 64, -64, 64, 64, -64, -64, -64, 64, 64, -64, 64, -64, -64, -64, -64, -64, -64, -64, 64, -64, 64, -64, -64, -64, -64, 64, -64, 64, 64, -64, -64, 64, 64, 64, -64, 64, 64, 64, 64, -64, -64, -64, -64, -64, 64, 64, -64, 64, -64, -64, -64, -64, -64, 64, -64, -64, -64, -64, -64, -64, -64, -64, 64, -64, 64, -64, 64, -64, -64, -64, -64, 64, 64, 64, 64, -64, -64, -64, -64, 64, 64, -64, -64, -64, -64, -64, 64, -64, -64, 64, 64, -64, -64, -64, 64, -64, -64, -64, -64, 64, 64, 64, 64, 64, -64, 64, 64, -64, -64, 64, -64, -64, -64, 64, -64, -64, 64, 64, 64, -64, 64, -64, -64, -64, -64, -64, 64, -64, -64, -64, -64, -64, -64, 64, 64, 64, -64, -64, -64, -64, -64, 64, -64, 64, -64, -64, -64, -64, 64, -64, 64, -64, -64, 64, -64, -64, -64, 64, 64, -64, -64, -64, 64, -64, -64, -64, -64, -64, 64, 64, 64, 64, -64, 64, 64, 64, 64, -64, -64, -64, 64, -64, -64, -64, -64, 64, -64, 64, -64, -64, 64, 64, 64, 64, -64, 64, 64, -64, -64, 64, -64, -64, 64, 64, -64, -64, -64, 64, 64, 64, 64, 64, 64, 64, 64, -64, -64, 64, -64, 64, 64, 64, 64, 64, 64, -64, -64, 64, 64, -64, -64, 64, 64, -64, 64, -64, 64, -64, 64, -64, 64, -64, -64, -64, -64, 64, 64, 64, -64, -64, 64, -64, 64, 64, -64, -64, 64, -64, -64, 64, 64, 64, 64, -64, -64, -64, -64, -64, -64, 64, -64, 64, 64, 64, 64, 64, 64, -64, -64, 64, -64, 64, 64, 64, 64, -64, 64, -64, -64, -64, -64, -64, 64, 64, 64, 64, -64, 64, 64, 64, 64, 64, 64, -64, -64, -64, -64, -64, 64, -64, -64, 64, 64, -64, -64, -64, 64, 64, 64, -64, 64, 64, 64, 64, 64, 64, 64, 64, 64, 64, -64, -64, -64, -64, 64, 64, 64, -64, -64, 64, -64, -64, -64, 64, -64, -64, 64, 64, 64, 64, 64, 64, 64, 64, 64, 64, 64, 64, 64, -64, 64, 64, 64, 64, -64, -64, -64, -64, 64, 64, 64, 64, -64, -64, -64, 64, 64, 64, 64, 64, 64, 64, 64, 64, -64, -64, -64, -64, -64, 64, 64, 64, 64, 64, 64, 64, -64, 64, -64, 64, 64, 64, 64, 64, 64, 64, 64, 64, 64, 64, 64, 64, -64, -64, -64, -64, -64, 64, -64, -64, -64, -64, -64, 64, -64, -64, 64, -64, -64, -64, -64, 64, 64, 64, 64, 64, 64, 64, -64, -64, -64, -64, -64, -64, 64, 64, -64, 64, -64, -64, -64, -64, 64, 64, -64, 64, 64, -64, 64, 64, 64, 64, 64, 64, 64, -64, -64, -64, -64, -64, 64, -64, -64, -64, -64, -64, -64, -64, -64, -64, 64, 64, -64, -64, -64, 64, -64, 64, 64, 64, 64, 64, -64, -64, -64, -64, -64, -64, 64, -64, -64, -64, -64, 64, -64, -64, -64, -64, 64, -64, -64, 64, -64, 64, -64, 64, 64, -64, 64, -64, -64, -64, -64, -64, -64, 64, -64, 64, 64, 64, 64, 64, 64, 64, -64, -64, 64, 64, 64, 64, 64, 64, 64, 64, 64, -64, -64, -64, 64, -64, -64, -64, 64, 64, 64, 64, 64, 64, 64, 64, 64, 64, -64, 64, 64, 64, 64, 64, 64, 64, 64, 64, 64, 64, 64, 64, -64, -64, -64, -64, -64, -64, 64, 64, 64, 64, 64, 64, 64, 64, 64, 64, 64, 64, -64, 64, 64, 64, -64, 64, 64, -64, 64, 64, 64, -64, -64, -64, 64, 64, 64, -64, 64, 64, 64, 64, 64, 64, 64, -64, -64, -64, -64, 64, 64, 64, -64, 64, 64, -64, 64, 64, -64, -64, -64, 64, 64, 64, 64, 64, 64, -64, -64, 64, 64, 64, 64, 64, 64, 64, -64, 64, 64, 64, 64, -64, -64, 64, 64, -64, -64, -64, -64, 64, 64, 64, -64, -64, 64, -64, 64, 64, 64, 64, 64, 64, 64, 64, -64, -64, 64, 64, 64, -64, -64, -64, -64, 64, -64, 64, 64, 64, 64, -64, 64, -64, 64, -64, -64, 64, 64, 64, 64, 64, 64, 64, 64, -64, -64, 64, 64, -64, -64, 64, -64, 64, 64, 64, 64, 64, 64, -64, -64, -64, 64, 64, 64, 64, 64, 64, 64, -64, 64, -64, 64, -64, 64, 64, -64, -64, 64, 64, 64, -64, -64, 64, 64, 64, -64, -64, 64, 64, -64, 64, 64, 64, 64, -64, 64, 64, -64, -64, 64, -64, -64, 64, 64, -64, -64, 64, 64, 64, -64, -64, -64, -64, -64, 64, 64, -64, -64, 64, 64, 64, 64, -64, -64, -64, -64, 64, 64, -64, -64, 64, 64, 64, 64, -64, -64, -64, 64, -64, -64, -64, -64, -64, 64, 64, 64, 64, 64, 64, 64, 64, -64, 64, 64, 64, -64, -64, 64, 64, 64, 64, 64, -64, 64, -64, -64, -64, -64, -64, -64, -64, -64, 64, 64, 64, 64, 64, 64, -64, -64, -64, -64, -64, -64, 64, 64, 64, 64, 64, 64, -64, 64, 64, 64, -64, -64, -64, -64, -64, 64, 64, 64, 64, 64, -64, -64, -64, 64, 64, 64, 64, 64, -64, 64, 64, 64, 64, 64, 64, 64, 64, 64, -64, -64, -64, -64, -64, 64, 64, 64, 64, 64, 64, 64, -64, -64, -64, 64, 64, -64, 64, 64, -64, 64, 64, 64, 64, 64, 64, -64, -64, -64, -64, -64, 64, 64, 64, 64, 64, 64, 64, 64, -64, 64, -64, -64, -64, -64, -64, -64, 64, -64, -64, 64, 64, 64, 64, -64, -64, -64, -64, -64, -64, 64, -64, 64, 64, 64, 64, 64, -64, -64, 64, -64, 64, -64, -64, -64, 64, -64, -64, 64, 64, -64, 64, -64, -64, -64, -64, 64, -64, -64, -64, 64, 64, -64, 64, 64, 64, -64, -64, 64, -64, 64, 64, 64, 64, 64, -64, 64, -64, -64, -64, 64, 64, 64, 64, 64, -64, -64, -64, 64, 64, -64, 64, -64, 64, 64, 64, -64, 64, -64, -64, -64, -64, -64, 64, 64, 64, -64, -64, -64, -64, 64, -64, -64, 64, 64, -64, -64, -64, 64, -64, 64, 64, 64, -64, 64, -64, 64, 64, 64, -64, -64, 64, 64, -64, 64, 64, -64, 64, 64, -64, -64, 64, 64, -64, 64, -64, 64, -64, 64, 64, -64, -64, -64, -64, -64, 64, -64, 64, 64, -64, 64, -64, 64, 64, -64, 64, -64, -64, -64, -64, -64, -64, -64, 64, 64, -64, -64, 64, 64, -64, 64, -64, -64, -64, -64, 64, 64, -64, -64, 64, 64, 64, 64, 64, 64, -64, -64, -64, -64, -64, -64, -64, 64, 64, 64, 64, -64, -64, 64, -64, -64, -64, -64, -64, 64, 64, 64, 64, 64, 64, 64, 64, 64, -64, -64, -64, 64, -64, 64, -64, -64, -64, -64, 64, -64, -64, 64, 64, 64, -64, 64, -64, -64, -64, -64, 64, 64, 64, 64, 64, -64, -64, 64, 64, 64, 64, 64, -64, -64, 64, -64, -64, 64, -64, 64, -64, 64, -64, -64, 64, -64, -64, -64, 64, 64, 64, 64, -64, 64, 64, 64, 64, 64, 64, 64, 64, 64, 64, 64, 64, -64, -64, 64, 64, -64, -64, 64, 64, -64, -64, 64, -64, 64, 64, 64, -64, 64, -64, 64, 64, 64, 64, 64, 64, 64, 64, 64, 64, -64, -64, -64, 64, -64, -64, 64, 64, -64, -64, 64, -64, 64, 64, 64, -64, -64, 64, 64, -64, 64, 64, 64, -64, -64, 64, 64, 64, 64, -64, 64, -64, -64, 64, -64, 64, -64, 64, 64, 64, 64, 64, 64, 64, 64, 64, -64, -64, 64, 64, -64, 64, 64, 64, -64, -64, -64, -64, 64, -64, 64, -64, 64, -64, 64, -64, 64, 64, 64, 64, 64, 64, 64, 64, -64, -64, 64, -64, 64, 64, 64, -64, 64, -64, 64, -64, 64, 64, 64, -64, 64, 64, 64, -64, -64, 64, 64, 64, 64, 64, -64, -64, 64, 64, 64, 64, -64, 64, 64, 64, 64, 64, 64, 64, 64, 64, -64, -64, 64, 64, 64, -64, 64, 64, 64, 64, 64, 64, 64, -64, -64, -64, -64, 64, 64, 64, 64, -64, 64, 64, 64, 64, 64, 64, 64, -64, -64, 64, -64, -64, 64, 64, 64, 64, 64, -64, 64, 64, 64, 64, 64, 64, -64, 64, -64, 64, 64, 64, -64, 64, 64, 64, 64, 64, -64, 64, 64, 64, 64, 64, 64, 64, 64, 64, 64, 64, -64, 64, 64, 64, 64, 64, -64, 64, 64, 64, 64, -64, -64, -64, -64, 64, 64, -64, -64, 64, 64, 64, 64, 64, 64, 64, 64, 64, 64, 64, 64, 64, 64, 64, 64, 64, 64, 64, 64, 64, 64, -64, 64, -64, -64, -64, 64, -64, 64, -64, 64, 64, 64, 64, 64, 64, 64, -64, 64, 64, 64, 64, -64, 64, 64, -64, -64, -64, -64, -64, -64, 64, -64, 64, -64, -64, 64, 64, -64, -64, 64, 64, 64, 64, 64, 64, -64, -64, 64, -64, 64, -64, -64, 64, -64, -64, -64, 64, 64, -64, -64, 64, 64, -64, -64, -64, 64, -64, 64, -64, 64, 64, -64, -64, -64, -64, -64, -64, -64, 64, 64, 64, 64, 64, -64, 64, 64, 64, -64, -64, 64, -64, -64, 64, 64, -64, -64, 64, 64, -64, -64, 64, -64, -64, -64, 64, 64, -64, -64, -64, 64, 64, -64, 64, 64, 64, -64, -64, -64, 64, -64, -64, 64, -64, -64, -64, 64, 64, 64, -64, -64, 64, -64, -64, -64, -64, -64, 64, -64, -64, -64, 64, 64, 64, -64, 64, -64, 64, -64, -64, 64, -64, -64, 64, 64, -64, -64, 64, -64, -64, -64, -64, -64, 64, 64, 64, -64, 64, -64, 64, 64, -64, -64, -64, 64, -64, 64, 64, -64, -64, 64, 64, 64, 64, 64, 64, -64, -64, -64, -64, -64, -64, 64, -64, 64, 64, 64, -64, -64, 64, 64, 64, 64, 64, 64, -64, 64, -64, -64, -64, 64, 64, 64, -64, -64, 64, -64, -64, -64, -64, -64, -64, -64, -64, 64, 64, 64, 64, -64, -64, -64, 64, -64, 64, 64, 64, 64, 64, 64, 64, 64, 64, 64, -64, -64, 64, 64, 64, -64, 64, 64, -64, 64, 64, -64, 64, 64, 64, -64, -64, 64, 64, 64, 64, 64, 64, 64, 64, 64, 64, -64, -64, -64, -64, 64, 64, 64, -64, 64, 64, -64, -64, 64, 64, 64, 64, -64, -64, 64, 64, -64, 64, 64, -64, -64, 64, 64, 64, 64, -64, -64, 64, 64, 64, 64, -64, -64, -64, -64, 64, 64, -64, 64, 64, 64, -64, 64, 64, -64, 64, -64, -64, -64, -64, 64, -64, -64, -64, 64, 64, 64, 64, -64, -64, 64, 64, -64, -64, -64, -64, -64, -64, -64, -64, -64, -64, -64, 64, -64, -64, -64, -64, 64, 64, -64, -64, -64, -64, -64, -64, -64, 64, 64, -64, -64, -64, 64, 64, -64, -64, -64, 64, -64, -64, 64, -64, 64, 64, -64, -64, -64, -64, -64, -64, -64, -64, -64, 64, 64, 64, -64, 64, 64, 64, -64, 64, 64, -64, 64, -64, 64, 64, -64, 64, -64, -64, 64, 64, 64, -64, 64, 64, -64, -64, 64, 64, -64, 64, -64, 64, -64, -64, 64, 64, 64, 64, -64, 64, 64, -64, 64, -64, 64, 64, 64, -64, -64, -64, -64, -64, -64, -64, -64, -64, -64, -64, -64, 64, 64, 64, -64, 64, -64, -64, -64, 64, 64, 64, 64, 64, -64, -64, -64, -64, -64, -64, 64, -64, -64, -64, -64, -64, -64, -64, -64, -64, 64, 64, 64, -64, -64, 64, 64, 64, -64, -64, -64, 64, -64, -64, -64, -64, -64, -64, -64, -64, -64, -64, -64, 64, -64, 64, 64, -64, -64, -64, 64, -64, -64, 64, 64, 64, 64, -64, -64, -64, -64, -64, -64, -64, -64, -64, 64, -64, -64, -64, -64, -64, -64, -64, -64, -64, 64, -64, 64, 64, -64, -64, 64, 64, 64, 64, 64, -64, -64, -64, -64, -64, -64, 64, -64, -64, -64, 64, -64, -64, -64, -64, -64, -64, 64, -64, -64, -64, -64, -64, -64, 64, 64, -64, 64, -64, -64, -64, -64, -64, -64, 64, -64, -64, 64, -64, -64, -64, -64, -64, -64, -64, -64, 64, 64, 64, -64, 64, 64, 64, -64, -64, -64, -64, -64, -64, -64, -64, 64, 64, 64, 64, 64, -64, 64, -64, 64, -64, -64, -64, 64, 64, 64, -64, 64, -64, 64, 64, -64, -64, -64, -64, -64, -64, -64, 64, 64, 64, 64, 64, 64, -64, -64, -64, -64, -64, -64, -64, -64, 64, -64, -64, 64, -64, -64, 64, -64, -64, -64, -64, -64, -64, -64, -64, 64, 64, 64, 64, -64, 64, -64, -64, -64, -64, -64, -64, 64, -64, 64, -64, -64, -64, 64, 64, -64, -64, -64, -64, 64, -64, -64, -64, 64, 64, -64, -64, 64, 64, -64, -64, -64, -64, -64, -64, -64, -64, -64, 64, 64, -64, 64, -64, -64, -64, -64, -64, -64, 64, -64, -64, -64, -64, 64, -64, -64, -64, -64, -64, -64, -64, -64, 64, -64, 64, 64, 64, -64, -64, 64, -64, 64, -64, -64, -64, -64, -64, -64, 64, -64, -64, -64, -64, -64, -64, 64, 64, 64, -64, -64, -64, 64, -64, 64, 64, 64, 64, -64, 64, -64, -64, 64, -64, -64, -64, -64, -64, -64, 64, -64, 64, 64, 64, 64, 64, -64, -64, 64, -64, 64, 64, 64, -64, 64, -64, 64, 64, -64, -64, -64, -64, -64, -64, 64, 64, 64, -64, 64, 64, 64, -64, -64, -64, -64, -64, 64, -64, 64, -64, 64, 64, 64, 64, 64, 64, 64, -64, -64, -64, -64, -64, -64, 64, 64, -64, 64, -64, 64, 64, 64, -64, -64, -64, -64, 64, 64, 64, 64, -64, 64, 64, 64, 64, -64, -64, -64, -64, -64, -64, 64, 64, -64, -64, 64, -64, 64, -64, 64, -64, -64, -64, -64, -64, 64, -64, -64, 64, -64, 64, 64, 64, -64, -64, -64, -64, -64, -64, -64, 64, -64, -64, 64, -64, 64, -64, -64, -64, -64, 64, -64, -64, -64, -64, 64, -64, 64, 64, 64, 64, 64, -64, -64, -64, -64, -64, -64, -64, 64, -64, -64, 64, -64, -64, -64, -64, -64, -64, 64, 64, 64, 64, 64, -64, -64, 64, 64, 64, -64, -64, -64, -64, -64, -64, 64, -64, -64, -64, -64, -64, -64, -64, -64, -64, -64, -64, 64, -64, -64, -64, -64, 64, 64, 64, 64, 64, -64, -64, -64, -64, -64, -64, -64, -64, -64, 64, -64, 64, 64, -64, -64, 64, -64, -64, -64, -64, 64, 64, -64, -64, 64, -64, -64, 64, -64, -64, -64, -64, 64, -64, -64, -64, -64, 64, -64, 64, 64, -64, -64, 64, -64, 64, 64, -64, 64, 64, -64, 64, -64, 64, 64, 64, -64, -64, -64, 64, -64, -64, -64, -64, -64, -64, -64, 64, -64, -64, -64, -64, 64, 64, 64, -64, -64, -64, 64, -64, -64, -64, 64, 64, -64, 64, 64, 64, 64, -64, 64, -64, 64, 64, -64, -64, 64, 64, 64, 64, -64, 64, -64, 64, -64, 64, 64, 64, -64, 64, -64, 64, 64, 64, -64, -64, -64, -64, -64, -64, 64, -64, -64, 64, -64, -64, -64, -64, 64, 64, -64, -64, 64, 64, -64, -64, -64, 64, -64, 64, -64, 64, 64, -64, -64, 64, 64, -64, 64, 64, 64, -64, 64, -64, -64, -64, 64, -64, -64, 64, -64, 64, -64, 64, -64, 64, 64, 64, 64, -64, -64, -64, 64, 64, 64, -64, 64, 64, 64, -64, 64, 64, -64, -64, 64, -64, -64, 64, 64, -64, -64, 64, 64, -64, -64, -64, 64, -64, -64, -64, 64, 64, 64, 64, -64, 64, -64, -64, 64, 64, 64, -64, 64, -64, -64, -64, 64, -64, 64, -64, 64, -64, -64, -64, -64, -64, -64, -64, -64, 64, 64, 64, 64, 64, -64, 64, -64, 64, 64, 64, 64, -64, -64, -64, -64, 64, 64, -64, -64, 64, 64, -64, -64, -64, -64, -64, 64, -64, 64, -64, 64, 64, 64, 64, 64, 64, 64, 64, 64, 64, -64, 64, -64, 64, -64, 64, -64, 64, 64, 64, -64, -64, 64, 64, 64, 64, 64, -64, 64, -64, 64, 64, 64, -64, 64, 64, 64, 64, 64, -64, -64, 64, 64, 64, 64, -64, 64, 64, -64, 64, 64, 64, 64, 64, -64, -64, -64, -64, -64, 64, 64, -64, -64, -64, -64, 64, 64, 64, -64, 64, -64, 64, 64, 64, 64, 64, 64, 64, 64, 64, 64, -64, -64, -64, -64, -64, -64, -64, 64, 64, 64, -64, 64, 64, 64, 64, -64, 64, -64, 64, 64, 64, 64, 64, 64, 64, 64, 64, -64, -64, -64, 64, -64, -64, -64, -64, -64, -64, 64, -64, 64, -64, 64, 64, 64, -64, -64, 64, -64, 64, 64, 64, 64, -64, 64, -64, -64, -64, -64, 64, -64, -64, -64, -64, -64, -64, -64, 64, 64, -64, 64, -64, -64, -64, 64, -64, 64, 64, 64, 64, 64, 64, -64, -64, -64, 64, 64, 64, 64, -64, 64, -64, -64, -64, 64, -64, -64, -64, 64, -64, 64, -64, -64, -64, 64, 64, 64, -64, 64, 64, 64, 64, 64, 64, -64, -64, 64, -64, 64, -64, -64, 64, -64, 64, 64, -64, -64, 64, 64, 64, -64, -64, -64, 64, 64, -64, -64, 64, -64, 64, 64, -64, -64, 64, -64, 64, 64, -64, 64, 64, 64, -64, 64, -64, 64, 64, 64, 64, 64, 64, -64, -64, 64, -64, -64, 64, -64, 64, 64, -64, -64, -64, -64, -64, -64, 64, 64, 64, 64, 64, 64, -64, 64, 64, -64, -64, -64, -64, -64, 64, 64, -64, -64, 64, 64, -64, -64, -64, -64, -64, -64, -64, -64, -64, 64, 64, 64, 64, 64, -64, -64, 64, 64, -64, 64, 64, 64, 64, 64, -64, -64, 64, 64, -64, -64, -64, -64, -64, -64, -64, -64, -64, 64, 64, 64, 64, 64, -64, -64, 64, -64, -64, -64, -64, 64, 64, 64, -64, 64, 64, 64, 64, 64, 64, -64, -64, -64, -64, -64, -64, 64, 64, 64, 64, -64, -64, -64, 64, 64, 64, -64, -64, 64, 64, 64, -64, -64, 64, 64, 64, 64, 64, 64, 64, -64, -64, -64, -64, -64, 64, 64, 64, 64, -64, -64, -64, 64, 64, -64, 64, -64, -64, 64, -64, -64, 64, 64, 64, 64, 64, 64, -64, -64, 64, 64, -64, -64, 64, 64, 64, 64, 64, -64, -64, 64, 64, -64, -64, -64, 64, -64, -64, -64, 64, 64, -64, 64, 64, 64, -64, 64, 64, -64, -64, -64, -64, 64, 64, 64, 64, -64, 64, -64, 64, -64, -64, 64, 64, 64, 64, -64, -64, -64, -64, -64, 64, 64, 64, 64, 64, -64, -64, -64, -64, 64, 64, 64, 64, 64, -64, -64, 64, -64, -64, -64, -64, -64, -64, 64, 64, 64, -64, -64, -64, 64, 64, 64, -64, -64, 64, 64, 64, 64, 64, 64, 64, -64, 64, -64, -64, -64, -64, 64, -64, -64, -64, 64, 64, -64, 64, -64, -64, -64, 64, -64, -64, -64, -64, 64, 64, 64, 64, 64, 64, 64, -64, 64, 64, -64, 64, -64, -64, 64, 64, 64, 64, -64, -64, -64, 64, -64, -64, -64, -64, -64, -64, -64, -64, 64, -64, 64, 64, 64, 64, 64, -64, 64, -64, 64, 64, -64, 64, -64, -64, -64, -64, -64, -64, 64, -64, -64, -64, -64, 64, -64, 64, 64, 64, 64, 64, -64, 64, -64, -64, 64, 64, -64, 64, -64, -64, -64, -64, 64, 64, -64, -64, 64, -64, -64, -64, 64, -64, 64, 64, 64, 64, -64, 64, -64, 64, 64, -64, -64, -64, -64, -64, 64, -64, 64, -64, 64, 64, -64, -64, -64, -64, -64, -64, -64, -64, -64, -64, 64, 64, 64, -64, 64, 64, -64, 64, -64, -64, -64, -64, -64, -64, -64, -64, -64, -64, -64, -64, -64, -64, -64, -64, -64, 64, 64, 64, -64, 64, 64, -64, -64, 64, -64, 64, -64, -64, -64, 64, 64, 64, 64, -64, -64, 64, -64, -64, 64, -64, 64, -64, -64, 64, -64, 64, -64, -64, 64, 64, 64, 64, -64, 64, 64, 64, -64, 64, -64, 64, 64, -64, 64, 64, 64, -64, -64, -64, 64, 64, -64, -64, -64, -64, -64, -64, -64, 64, -64, 64, -64, -64, -64, 64, -64, -64, 64, 64, -64, -64, -64, -64, -64, -64, 64, 64, 64, -64, 64, 64, -64, -64, -64, 64, 64, -64, -64, -64, 64, 64, -64, 64, 64, 64, 64, 64, -64, 64, 64, -64, -64, -64, -64, -64, 64, 64, 64, 64, -64, -64, 64, 64, 64, -64, 64, 64, -64, 64, -64, -64, 64, 64, -64, -64, 64, 64, 64, 64, -64, -64, -64, 64, 64, 64, 64, 64, 64, -64, -64, -64, 64, 64, 64, 64, -64, 64, -64, -64, 64, 64, -64, -64, 64, 64, 64, 64, 64, 64, 64, 64, -64, 64, 64, 64, 64, 64, 64, -64, 64, 64, 64, 64, 64, 64, -64, -64, -64, -64, -64, -64, -64, -64, -64, 64, 64, 64, 64, -64, -64, -64, 64, 64, -64, -64, -64, 64, 64, 64, 64, 64, 64, -64, -64, -64, -64, -64, -64, -64, -64, 64, 64, 64, 64, -64, -64, -64, -64, -64, 64, 64, 64, -64, 64, 64, 64, 64, 64, 64, 64, -64, 64, 64, -64, -64, 64, -64, 64, 64, 64, 64, 64, 64, -64, -64, -64, -64, 64, -64, 64, -64, -64, 64, 64, 64, 64, 64, 64, -64, -64, 64, -64, 64, 64, 64, -64, 64, 64, 64, 64, 64, -64, -64, -64, -64, -64, -64, 64, 64, 64, 64, 64, 64, 64, 64, 64, -64, 64, 64, 64, 64, -64, -64, -64, 64, 64, 64, 64, 64, 64, -64, -64, -64, -64, 64, -64, -64, -64, -64, 64, 64, 64, 64, -64, -64, -64, 64, -64, -64, -64, -64, -64, 64, 64, 64, 64, 64, 64, -64, -64, -64, -64, 64, -64, -64, -64, -64, -64, 64, 64, 64, -64, 64, 64, -64, 64, -64, -64, -64, 64, 64, 64, 64, 64, 64, 64, -64, -64, -64, -64, 64, 64, -64, -64, -64, -64, 64, -64, -64, -64, -64, 64, 64, 64, -64, -64, -64, 64, 64, 64, 64, 64, 64, -64, -64, -64, -64, 64, 64, 64, -64, 64, 64, 64, 64, 64, -64, -64, 64, -64, -64, 64, 64, -64, 64, -64, 64, 64, 64, 64, 64, -64, -64, -64, 64, -64, 64, -64, 64, -64, -64, 64, 64, 64, 64, -64, 64, -64, -64, 64, -64, -64, -64, -64, -64, 64, 64, 64, -64, -64, -64, -64, 64, -64, 64, 64, 64, -64, 64, 64, -64, 64, -64, -64, -64, -64, -64, 64, 64, -64, -64, 64, 64, 64, 64, -64, -64, 64, -64, -64, 64, 64, 64, 64, 64, -64, 64, 64, -64, -64, -64, -64, 64, -64, 64, -64, 64, -64, -64, -64, 64, 64, -64, -64, -64, -64, -64, 64, 64, 64, 64, -64, -64, -64, 64, -64, -64, -64, -64, -64, -64, 64, -64, 64, -64, -64, -64, -64, 64, 64, -64, -64, -64, -64, -64, 64, 64, 64, -64, 64, 64, -64, -64, -64, -64, -64, -64, 64, 64, -64, -64, -64, -64, -64, -64, -64, 64, -64, 64, -64, -64, -64, -64, 64, 64, -64, 64, -64, -64, -64, -64, 64, -64, -64, -64, -64, -64, 64, 64, -64, -64, -64, -64, 64, 64, 64, -64, -64, -64, 64, 64, 64, -64, 64, -64, 64, 64, 64, 64, -64, 64, 64, -64, -64, -64, -64, -64, 64, -64, -64, -64, -64, -64, -64, -64, -64, 64, 64, 64, 64, 64, -64, -64, 64, 64, 64, 64, 64, 64, 64, -64, -64, -64, 64, 64, 64, 64, -64, -64, -64, -64, -64, -64, -64, -64, -64, -64, 64, 64, -64, 64, 64, 64, 64, 64, 64, -64, 64, 64, -64, -64, 64, 64, -64, -64, -64, -64, -64, -64, -64, -64, -64, -64, -64, -64, 64, 64, 64, 64, -64, 64, 64, -64, -64, -64, 64, 64, 64, -64, -64, 64, 64, 64, 64, 64, -64, -64, -64, -64, -64, -64, 64, 64, 64, -64, -64, -64, 64, 64, -64, -64, 64, -64, -64, 64, -64, 64, 64, -64, -64, 64, 64, -64, -64, -64, -64, 64, -64, -64, -64, -64, -64, 64, -64, -64, -64, -64, -64, -64, 64, 64, 64, -64, 64, -64, 64, 64, -64, 64, 64, 64, -64, -64, 64, 64, -64, -64, -64, 64, -64, 64, -64, 64, 64, 64, -64, 64, 64, -64, -64, -64, 64, 64, 64, 64, -64, -64, 64, -64, -64, 64, 64, 64, -64, 64, -64, -64, 64, -64, 64, 64, 64, -64, 64, -64, -64, -64, 64, 64, -64, 64, 64, -64, -64, 64, 64, 64, 64, 64, -64, 64, -64, -64, 64, -64, -64, -64, 64, 64, 64, -64, 64, -64, -64, 64, 64, 64, -64, -64, 64, -64, 64, 64, -64, -64, -64, -64, 64, -64, -64, -64, -64, 64, 64, -64, 64, -64, -64, 64, 64, 64, 64, -64, 64, 64, -64, -64, -64, 64, -64, -64, -64, -64, 64, -64, -64, 64, 64, -64, 64, -64, -64, 64, 64, 64, 64, -64, 64, -64, 64, -64, -64, -64, -64, 64, 64, -64, 64, 64, 64, -64, 64, 64, 64, 64, -64, 64, -64, 64, -64, -64, -64, -64, 64, -64, 64, -64, 64, -64, 64, 64, -64, -64, -64, 64, 64, 64, 64, 64, -64, 64, 64, -64, 64, -64, 64, -64, 64, -64, 64, 64, -64, 64, 64, -64, 64, -64, 64, -64, 64, 64, 64, -64, 64, -64, -64, -64, -64, -64, -64, 64, 64, 64, -64, 64, -64, 64, 64, 64, -64, 64, -64, 64, 64, 64, -64, 64, 64, 64, -64, 64, 64, -64, 64, 64, 64, -64, -64, 64, -64, 64, -64, 64, -64, 64, -64, 64, 64, -64, 64, -64, 64, -64, 64, -64, 64, 64, -64, 64, -64, 64, 64, 64, 64, 64, 64, 64, 64, 64, -64, -64, -64, 64, 64, 64, 64, 64, 64, 64, 64, -64, 64, 64, 64, 64, 64, -64, 64, 64, 64, 64, 64, 64, 64, 64, 64, -64, 64, -64, -64, 64, -64, 64, 64, 64, 64, 64, 64, 64, 64, 64, 64, 64, -64, 64, -64, -64, 64, 64, 64, 64, 64, 64, 64, -64, 64, -64, 64, 64, -64, 64, 64, 64, -64, -64, -64, 64, 64, 64, 64, -64, -64, -64, 64, 64, 64, -64, 64, -64, -64, 64, -64, 64, 64, 64, 64, 64, 64, 64, 64, -64, -64, 64, 64, -64, -64, -64, 64, -64, 64, -64, 64, -64, -64, -64, 64, 64, 64, -64, 64, 64, 64, 64, 64, 64, 64, 64, -64, -64, -64, 64, 64, -64, -64, -64, 64, 64, 64, 64, 64, 64, -64, -64, -64, -64, 64, 64, 64, 64, -64, 64, 64, 64, 64, -64, 64, 64, -64, 64, 64, 64, -64, 64, 64, 64, 64, -64, 64, -64, 64, 64, 64, 64, -64, -64, 64, 64, -64, 64, 64, -64, -64, 64, 64, 64, -64, -64, 64, -64, 64, 64, 64, -64, 64, 64, 64, 64, 64, -64, 64, 64, -64, 64, -64, 64, 64, 64, -64, -64, 64, -64, -64, 64, 64, -64, 64, -64, -64, -64, 64, -64, 64, 64, 64, -64, 64, -64, 64, -64, -64, 64, -64, 64, 64, 64, 64, -64, 64, 64, 64, 64, 64, -64, 64, -64, -64, 64, -64, -64, 64, 64, 64, -64, -64, 64, -64, 64, 64, 64, 64, 64, -64, -64, 64, 64, 64, -64, 64, -64, -64, 64, 64, 64, -64, -64, -64, -64, 64, 64, 64, 64, -64, -64, 64, 64, -64, 64, 64, -64, -64, 64, -64, 64, -64, -64, -64, 64, -64, -64, 64, 64, 64, -64, -64, -64, 64, 64, 64, 64, 64, 64, -64, 64, 64, 64, -64, -64, -64, 64, 64, 64, 64, -64, 64, 64, 64, 64, -64, -64, -64, -64, 64, 64, -64, 64, -64, 64, -64, 64, 64, 64, 64, 64, 64, 64, 64, 64, 64, 64, 64, -64, -64, 64, -64, 64, -64, 64, 64, -64, -64, 64, -64, 64, -64, 64, 64, 64, -64, -64, -64, 64, 64, -64, 64, 64, -64, 64, 64, 64, 64, 64, 64, -64, -64, -64, -64, -64, 64, -64, -64, -64, -64, -64, -64, 64, 64, 64, -64, 64, 64, 64, 64, 64, -64, 64, -64, -64, -64, -64, 64, 64, -64, 64, 64, -64, -64, -64, 64, 64, 64, 64, 64, 64, 64, -64, -64, 64, 64, 64, 64, 64, 64, 64, 64, 64, 64, 64, 64, -64, -64, 64, -64, 64, 64, -64, 64, -64, 64, 64, -64, -64, 64, -64, 64, 64, -64, 64, 64, 64, -64, 64, 64, -64, 64, -64, 64, 64, 64, 64, -64, -64, 64, -64, -64, 64, 64, 64, 64, -64, -64, -64, -64, 64, 64, -64, -64, 64, -64, 64, -64, 64, 64, 64, -64, 64, -64, -64, 64, 64, -64, -64, 64, 64, -64, 64, -64, -64, 64, -64, -64, 64, -64, 64, -64, 64, 64, 64, 64, -64, 64, -64, -64, 64, 64, -64, 64, 64, -64, -64, 64, -64, 64, 64, -64, 64, 64, 64, 64, -64, -64, 64, 64, -64, -64, 64, 64, 64, 64, 64, 64, 64, 64, -64, -64, 64, -64, 64, -64, 64, 64, 64, 64, -64, 64, -64, -64, -64, -64, 64, 64, 64, -64, 64, -64, -64, 64, 64, -64, 64, -64, 64, -64, 64, 64, 64, -64, -64, -64, 64, 64, -64, -64, 64, 64, 64, 64, 64, 64, 64, 64, 64, 64, 64, -64, -64, -64, 64, 64, 64, -64, -64, -64, 64, -64, 64, 64, -64, -64, -64, 64, -64, -64, -64, -64, 64, -64, -64, 64, -64, -64, -64, 64, 64, 64, -64, 64, 64, -64, -64, 64, 64, 64, -64, -64, 64, -64, -64, -64, -64, 64, -64, -64, -64, -64, 64, 64, 64, 64, -64, -64, 64, 64, -64, -64, 64, -64, 64, 64, -64, 64, 64, -64, -64, 64, 64, -64, -64, -64, -64, -64, -64, -64, -64, -64, 64, 64, 64, 64, -64, 64, -64, -64, -64, -64, -64, -64, 64, -64, -64, -64, 64, 64, -64, -64, -64, -64, -64, -64, -64, -64, 64, 64, 64, 64, 64, 64, 64, 64, -64, 64, 64, 64, -64, -64, 64, 64, -64, 64, 64, 64, 64, -64, -64, 64, -64, 64, -64, -64, -64, 64, 64, -64, 64, 64, 64, 64, 64, 64, 64, -64, -64, -64, 64, 64, -64, 64, -64, 64, 64, 64, 64, 64, 64, 64, 64, -64, -64, -64, 64, 64, 64, 64, 64, 64, 64, -64, -64, -64, 64, -64, -64, -64, 64, -64, 64, 64, 64, 64, 64, 64, 64, 64, 64, -64, 64, -64, 64, 64, 64, 64, 64, 64, 64, 64, 64, 64, 64, 64, -64, -64, -64, -64, -64, -64, 64, 64, 64, -64, 64, 64, -64, 64, 64, 64, 64, 64, 64, 64, 64, 64, 64, 64, 64, 64, 64, 64, 64, 64, -64, 64, -64, 64, 64, -64, 64, 64, 64, 64, 64, -64, 64, 64, -64, -64, -64, 64, 64, 64, 64, 64, 64, 64, 64, 64, 64, -64, 64, 64, 64, 64, 64, 64, 64, 64, -64, 64, 64, -64, -64, -64, -64, 64, 64, 64, -64, -64, 64, 64, 64, 64, -64, -64, 64, 64, 64, -64, -64, 64, -64, -64, -64, -64, 64, -64, 64, -64, -64, -64, 64, 64, 64, 64, 64, 64, 64, 64, 64, 64, -64, 64, 64, 64, -64, 64, 64, -64, 64, 64, -64, 64, 64, 64, 64, -64, -64, 64, 64, 64, 64, 64, 64, -64, 64, 64, -64, 64, 64, 64, 64, -64, -64, 64, 64, -64, -64, -64, -64, 64, 64, 64, -64, -64, -64, 64, 64, 64, 64, 64, 64, -64, 64, 64, -64, 64, -64, -64, -64, -64, -64, 64, -64, 64, 64, 64, -64, 64, 64, 64, -64, 64, 64, 64, 64, 64, 64, 64, 64, -64, 64, 64, 64, 64, 64, -64, -64, 64, -64, 64, -64, -64, -64, -64, -64, -64, -64, 64, -64, -64, -64, 64, 64, 64, 64, 64, 64, -64, -64, -64, 64, -64, -64, -64, 64, 64, -64, 64, 64, -64, -64, 64, 64, -64, -64, 64, -64, -64, -64, 64, 64, -64, -64, -64, -64, -64, -64, -64, -64, -64, -64, 64, 64, 64, -64, -64, 64, -64, -64, -64, -64, -64, -64, -64, -64, -64, -64, -64, -64, 64, 64, 64, -64, -64, -64, -64, -64, -64, -64, -64, 64, -64, -64, -64, -64, 64, -64, -64, -64, -64, -64, -64, -64, 64, -64, -64, 64, 64, -64, 64, -64, -64, -64, -64, -64, -64, -64, -64, -64, -64, -64, 64, -64, -64, 64, 64, 64, -64, -64, 64, 64, 64, 64, 64, 64, 64, 64, -64, -64, -64, -64, -64, -64, -64, -64, -64, -64, 64, -64, 64, -64, -64, -64, 64, 64, 64, -64, 64, 64, 64, 64, 64, 64, 64, 64, 64, 64, -64, -64, -64, -64, -64, -64, -64, 64, 64, 64, 64, -64, 64, 64, 64, 64, 64, 64, 64, 64, 64, 64, 64, 64, 64, 64, 64, 64, 64, -64, -64, -64, -64, -64, 64, 64, 64, -64, 64, 64, 64, 64, -64, -64, 64, 64, 64, 64, 64, 64, 64, 64, 64, 64, 64, 64, 64, -64, -64, -64, 64, 64, -64, -64, 64, -64, 64, -64, 64, -64, -64, 64, 64, -64, -64, 64, 64, 64, 64, 64, 64, 64, 64, 64, -64, 64, -64, -64, -64, -64, -64, 64, -64, 64, -64, 64, -64, -64, 64, 64, 64, 64, -64, 64, 64, 64, 64, 64, 64, 64, 64, 64, -64, 64, -64, -64, 64, -64, -64, -64, 64, 64, -64, 64, -64, 64, -64, 64, 64, -64, 64, 64, 64, 64, -64, 64, 64, 64, 64, 64, -64, -64, 64, -64, 64, 64, -64, 64, 64, -64, 64, -64, 64, -64, 64, -64, -64, 64, 64, -64, -64, 64, -64, 64, -64, 64, -64, 64, -64, -64, -64, -64, 64, 64, -64, 64, -64, 64, -64, 64, -64, 64, 64, 64, 64, 64, 64, -64, 64, 64, 64, 64, 64, 64, -64, 64, 64, -64, -64, -64, -64, -64, -64, 64, -64, 64, 64, -64, 64, -64, 64, 64, -64, -64, -64, -64, 64, 64, -64, 64, -64, 64, -64, 64, -64, 64, 64, 64, 64, 64, 64, 64, -64, -64, -64, -64, 64, -64, 64, 64, 64, -64, 64, -64, 64, 64, 64, 64, 64, -64, 64, -64, 64, 64, 64, -64, 64, 64, 64, 64, -64, 64, -64, -64, -64, -64, 64, 64, 64, 64, -64, -64, 64, 64, -64, -64, -64, 64, 64, 64, -64, 64, 64, 64, -64, 64, -64, -64, -64, -64, 64, 64, -64, 64, -64, 64, 64, -64, -64, -64, 64, 64, -64, 64, -64, -64, -64, 64, 64, 64, -64, 64, -64, 64, 64, -64, -64, 64, -64, 64, 64, 64, 64, 64, 64, 64, 64, 64, -64, -64, -64, -64, 64, 64, 64, 64, 64, 64, -64, -64, -64, 64, -64, 64, -64, -64, -64, -64, -64, 64, -64, 64, 64, 64, 64, -64, -64, -64, -64, 64, -64, -64, 64, 64, 64, 64, 64, 64, 64, 64, -64, 64, -64, -64, 64, -64, -64, 64, 64, 64, 64, 64, 64, 64, -64, -64, 64, -64, -64, 64, 64, 64, 64, 64, 64, 64, 64, 64, 64, -64, -64, -64, 64, -64, -64, 64, -64, 64, 64, 64, -64, 64, -64, 64, -64, 64, 64, 64, 64, 64, 64, 64, 64, 64, 64, -64, -64, -64, 64, 64, -64, -64, -64, -64, -64, -64, 64, 64, -64, 64, -64, 64, 64, 64, 64, 64, 64, 64, 64, -64, -64, -64, 64, -64, 64, 64, -64, -64, 64, 64, -64, -64, -64, 64, -64, 64, 64, 64, -64, -64, 64, 64, -64, 64, 64, 64, -64, -64, -64, -64, 64, 64, 64, 64, 64, 64, 64, -64, 64, 64, -64, 64, 64, 64, 64, -64, 64, 64, -64, -64, -64, 64, -64, -64, -64, -64, -64, -64, 64, 64, -64, 64, 64, -64, 64, 64, 64, -64, 64, -64, 64, 64, 64, 64, -64, -64, -64, -64, -64, -64, -64, -64, -64, -64, -64, -64, 64, 64, -64, 64, -64, 64, 64, 64, -64, 64, 64, 64, 64, 64, 64, -64, -64, -64, -64, -64, -64, -64, -64, -64, -64, -64, -64, 64, 64, 64, -64, 64, -64, 64, 64, 64, -64, 64, 64, 64, 64, 64, -64, -64, 64, -64, -64, -64, -64, 64, -64, -64, -64, -64, 64, 64, 64, 64, -64, -64, -64, 64, 64, -64, -64, -64, 64, -64, 64, 64, -64, -64, -64, -64, -64, -64, -64, -64, -64, -64, -64, -64, -64, 64, 64, 64, 64, -64, 64, 64, -64, -64, -64, 64, 64, -64, -64, -64, -64, -64, -64, -64, -64, -64, 64, -64, 64, 64, -64, -64, 64, 64, 64, 64, -64, -64, 64, 64, 64, -64, -64, 64, 64, 64, -64, -64, -64, -64, -64, -64, -64, 64, 64, 64, 64, 64, 64, -64, 64, 64, -64, -64, -64, 64, 64, 64, 64, -64, -64, 64, 64, -64, 64, -64, -64, -64, -64, -64, -64, 64, -64, -64, -64, 64, 64, -64, -64, 64, 64, -64, -64, 64, -64, -64, -64, -64, 64, 64, -64, -64, -64, -64, -64, -64, -64, -64, 64, 64, 64, -64, -64, -64, 64, -64, 64, 64, 64, -64, -64, -64, 64, -64, 64, -64, 64, 64, -64, 64, -64, 64, -64, -64, -64, -64, -64, -64, -64, -64, -64, -64, 64, -64, 64, 64, 64, 64, 64, 64, 64, 64, 64, -64, 64, -64, 64, -64, 64, -64, -64, -64, -64, -64, -64, 64, -64, -64, -64, 64, 64, 64, 64, -64, 64, 64, -64, -64, -64, 64, 64, -64, -64, -64, -64, -64, 64, 64, 64, 64, 64, 64, 64, -64, -64, -64, 64, 64, 64, 64, -64, -64, -64, -64, -64, 64, 64, 64, -64, -64, -64, -64, -64, -64, -64, -64, 64, 64, 64, 64, 64, 64, 64, 64, 64, 64, 64, -64, -64, -64, -64, -64, 64, 64, 64, -64, -64, -64, -64, -64, -64, -64, -64, -64, 64, 64, 64, 64, 64, 64, 64, -64, 64, -64, -64, -64, -64, -64, -64, 64, 64, -64, 64, 64, 64, 64, -64, 64, 64, -64, -64, 64, 64, 64, -64, 64, 64, -64, -64, -64, -64, -64, -64, -64, -64, -64, -64, -64, -64, -64, 64, 64, -64, -64, 64, 64, -64, 64, 64, 64, 64, 64, 64, 64, 64, 64, -64, 64, 64, 64, 64, 64, -64, 64, 64, -64, 64, 64, -64, 64, 64, -64, -64, -64, 64, 64, -64, -64, 64, -64, -64, 64, 64, 64, 64, 64, 64, 64, 64, 64, 64, -64, 64, -64, -64, -64, -64, -64, 64, 64, -64, -64, -64, 64, -64, 64, 64, 64, 64, 64, 64, 64, 64, 64, 64, 64, -64, 64, -64, -64, 64, 64, 64, -64, 
};

ring_t fc1_bias_fp[512]=
{
-2, -2, 3, -3, 1, -3, -1, 2, 2, -2, -1, 3, -4, 0, -3, 1, 0, -3, -2, 0, -3, -2, 4, 0, 1, -1, -2, -2, 1, 3, 0, -2, 1, -3, 0, 2, -2, 3, -3, -1, -1, -3, 3, 0, 1, 0, -2, -2, -2, 0, 2, 5, 0, 4, 1, -1, 3, -4, -3, -3, 0, 0, 0, 0, -5, 0, 1, 1, -3, 3, -4, 1, 2, 0, -1, 0, -1, -3, 0, -2, -3, 2, -2, -3, 1, 1, 0, 0, -3, -8, 4, 2, -1, -1, 1, -2, 2, 2, 5, 1, 1, -1, -1, 0, 2, 0, 0, -2, 1, -2, -1, -1, -1, -2, -5, 0, 3, 3, 0, 0, 2, 1, -1, -3, -3, 0, 3, 0, 2, -4, 2, 0, -2, -2, -2, -3, 0, -1, 4, -2, 1, 2, 1, 3, 2, 0, 1, 0, -2, 1, 0, 0, -1, -1, -1, 2, 3, -3, 1, -2, -2, 3, 0, 3, 0, 2, 3, -1, -1, -1, -2, 0, -3, 1, -1, -1, 0, 1, 3, -4, 0, -7, 0, -1, -1, 0, 1, 1, 2, 2, 1, 1, -2, 0, 1, 1, -3, -3, 3, 3, 2, 0, 0, -2, -2, 3, 2, -1, -2, 2, -1, 0, -1, 3, 2, 1, 0, -1, -1, 4, 4, 1, 3, 2, 1, 0, 3, -3, 0, -2, 1, -3, 2, -3, 2, 0, -4, -2, 1, 1, 0, 4, -2, 2, -2, -2, -1, -1, 3, 1, -1, -1, 1, -1, 1, -1, 1, 2, 4, -2, 1, 2, 1, 0, -4, -1, 1, -4, 0, -2, 1, 0, 1, 3, 1, 2, 0, -1, 3, 2, -2, 3, 0, -4, -4, 0, 2, 2, 4, 0, -1, -3, 0, -4, -2, 1, -2, 3, 0, -1, 0, 3, 1, -3, 1, -1, -2, -3, 1, -1, -1, 0, 2, 1, 0, -2, -3, 3, -2, -1, -1, -4, 1, -2, -2, -2, -1, -1, 2, 1, 1, -5, 4, 0, 0, -1, 2, -2, 1, 2, 1, -2, 2, -1, 2, -2, 2, 4, 3, -3, 0, -1, 0, -1, -1, 1, -2, 0, -1, 4, 3, 3, -3, -1, -2, 3, 0, 0, -3, 1, 1, -4, 3, -2, -2, 2, 3, 0, -3, -2, -4, 0, 0, 1, 1, -2, -1, 2, 2, 0, -1, 2, -2, -3, 1, 2, -3, 0, -1, 2, 0, -2, -5, 0, -1, 2, -2, -1, -2, 1, 2, -2, 1, 0, 2, 0, 0, 0, 3, 0, 5, 1, -3, -4, 0, -2, -2, 0, 0, -1, -4, 1, 1, 2, 1, 3, -3, 3, -3, -2, -3, -1, 6, 0, -2, 1, 0, 1, -4, 3, -1, 0, 3, 2, -3, -1, 1, -4, 0, -4, 3, -2, -2, -1, 3, 2, 0, -2, 4, -3, 3, 2, -1, 1, 1, -4, -1, -1, -2, 2, 2, -2, 2, 0, -3, -1, -1, 2, 0, 2, -1, -2, 0, -2, 2, -3, -3, -3, -2, -3, 1, -1, 2, 0, 0, 2, -3, -1, 1, 2, 2, 0, 
};

ring_t fc2_weight_fp[512*10]=
{
-64, -64, -64, -64, -64, -64, -64, 64, 64, 64, 64, -64, -64, 64, -64, 64, -64, -64, 64, -64, -64, -64, -64, 64, 64, 64, 64, 64, -64, 64, 64, -64, -64, 64, -64, 64, -64, -64, -64, -64, 64, 64, 64, -64, -64, 64, -64, -64, 64, 64, 64, 64, 64, 64, -64, -64, 64, -64, -64, -64, 64, 64, -64, -64, -64, -64, -64, -64, -64, 64, -64, -64, 64, -64, -64, 64, -64, -64, 64, 64, -64, -64, 64, 64, -64, 64, -64, 64, -64, 64, 64, -64, 64, 64, 64, 64, -64, -64, 64, 64, 64, 64, 64, -64, -64, -64, 64, 64, 64, -64, 64, 64, -64, 64, 64, 64, 64, 64, 64, -64, 64, -64, -64, 64, 64, 64, -64, 64, 64, -64, -64, 64, -64, 64, 64, -64, -64, -64, -64, -64, -64, 64, -64, -64, 64, -64, 64, -64, -64, 64, 64, 64, -64, 64, -64, 64, -64, -64, -64, 64, -64, -64, -64, -64, 64, -64, 64, -64, -64, 64, 64, -64, -64, 64, -64, -64, 64, -64, -64, 64, 64, 64, -64, 64, 64, -64, -64, 64, 64, 64, -64, -64, 64, 64, -64, -64, 64, -64, 64, 64, 64, 64, 64, -64, 64, 64, 64, -64, -64, 64, 64, 64, -64, -64, -64, -64, 64, -64, -64, 64, 64, -64, 64, 64, 64, -64, -64, 64, 64, -64, 64, 64, -64, 64, 64, -64, -64, 64, 64, 64, -64, -64, 64, 64, 64, -64, -64, -64, -64, -64, -64, 64, -64, 64, -64, -64, 64, 64, 64, -64, -64, -64, 64, 64, -64, -64, -64, 64, 64, 64, -64, -64, -64, -64, 64, 64, 64, 64, 64, -64, -64, -64, -64, 64, -64, -64, 64, -64, -64, -64, -64, -64, 64, 64, 64, -64, 64, -64, 64, 64, 64, -64, -64, 64, 64, 64, 64, 64, -64, 64, 64, -64, 64, -64, 64, 64, -64, -64, -64, -64, 64, -64, 64, -64, -64, 64, -64, 64, 64, 64, -64, 64, -64, -64, 64, 64, 64, 64, 64, -64, -64, -64, -64, 64, 64, -64, 64, -64, -64, -64, 64, -64, -64, -64, -64, -64, -64, 64, 64, 64, 64, -64, 64, -64, -64, -64, -64, 64, -64, 64, -64, 64, 64, 64, -64, -64, -64, -64, -64, 64, 64, -64, 64, 64, -64, 64, 64, -64, 64, 64, -64, -64, -64, 64, -64, -64, 64, 64, 64, -64, -64, 64, -64, 64, 64, -64, 64, 64, -64, -64, 64, -64, -64, -64, 64, 64, -64, -64, -64, 64, 64, 64, -64, 64, 64, 64, -64, -64, -64, 64, 64, 64, -64, -64, -64, -64, 64, 64, -64, 64, 64, -64, 64, 64, 64, -64, 64, -64, -64, -64, -64, 64, 64, -64, -64, 64, -64, 64, 64, -64, 64, -64, -64, -64, 64, 64, 64, 64, 64, 64, 64, -64, -64, -64, -64, 64, -64, 64, -64, -64, -64, -64, -64, -64, 64, 64, 64, -64, -64, 64, -64, 64, 64, 64, -64, 64, -64, -64, -64, -64, 64, -64, 64, -64, -64, -64, -64, -64, 64, 64, 64, 64, 64, 64, -64, -64, 64, -64, 64, -64, -64, -64, 64, -64, 64, 64, 64, 64, -64, -64, 64, 64, -64, 64, 64, 64, -64, 64, -64, -64, 64, -64, 64, -64, 64, -64, 64, -64, 64, 64, 64, -64, -64, -64, 64, 64, -64, -64, 64, -64, -64, -64, -64, 64, 64, 64, -64, 64, -64, -64, -64, -64, -64, -64, 64, 64, -64, -64, 64, -64, 64, -64, -64, -64, 64, 64, 64, 64, -64, 64, -64, -64, 64, 64, -64, -64, 64, -64, 64, 64, -64, -64, 64, 64, -64, 64, -64, 64, 64, 64, -64, -64, 64, 64, 64, 64, -64, -64, -64, -64, -64, 64, 64, -64, -64, -64, -64, -64, -64, 64, 64, -64, 64, -64, 64, -64, 64, -64, 64, 64, -64, 64, 64, 64, 64, -64, 64, -64, 64, -64, -64, 64, -64, -64, 64, -64, 64, 64, 64, 64, -64, -64, -64, 64, 64, 64, 64, -64, 64, 64, -64, -64, -64, 64, 64, 64, 64, -64, -64, -64, -64, -64, -64, -64, 64, 64, 64, 64, -64, 64, 64, -64, 64, 64, 64, 64, -64, 64, -64, -64, 64, 64, 64, 64, 64, -64, -64, -64, -64, 64, -64, -64, -64, 64, -64, -64, -64, 64, -64, 64, 64, -64, -64, -64, 64, 64, -64, 64, 64, 64, 64, -64, -64, 64, -64, -64, 64, 64, 64, 64, 64, 64, 64, 64, -64, -64, -64, -64, 64, -64, -64, 64, 64, 64, 64, -64, 64, -64, 64, -64, 64, -64, -64, -64, -64, 64, 64, 64, 64, -64, -64, 64, -64, 64, 64, 64, 64, 64, 64, -64, -64, 64, 64, 64, -64, -64, -64, -64, -64, -64, -64, 64, -64, 64, -64, -64, -64, 64, 64, -64, 64, 64, -64, -64, -64, -64, -64, -64, -64, 64, 64, -64, -64, 64, -64, -64, 64, 64, 64, -64, 64, 64, -64, 64, -64, 64, 64, -64, -64, -64, -64, 64, -64, -64, 64, -64, -64, -64, 64, -64, 64, 64, 64, -64, 64, 64, -64, -64, -64, -64, -64, 64, 64, 64, -64, -64, 64, 64, 64, 64, -64, -64, -64, -64, 64, 64, 64, 64, 64, 64, -64, -64, -64, -64, 64, 64, -64, 64, -64, -64, 64, -64, 64, -64, 64, -64, -64, 64, -64, -64, -64, 64, -64, 64, -64, 64, -64, -64, -64, -64, -64, 64, -64, 64, 64, -64, 64, -64, -64, 64, -64, 64, 64, 64, 64, -64, 64, -64, -64, -64, 64, 64, 64, -64, -64, 64, -64, 64, -64, 64, -64, 64, 64, 64, -64, 64, 64, -64, -64, -64, 64, 64, 64, 64, 64, 64, -64, -64, -64, -64, -64, -64, 64, -64, -64, -64, 64, 64, 64, 64, -64, 64, -64, 64, -64, -64, 64, 64, -64, -64, 64, -64, -64, 64, 64, -64, 64, -64, 64, 64, -64, -64, 64, -64, 64, 64, -64, 64, -64, -64, -64, 64, 64, -64, 64, -64, 64, -64, 64, -64, -64, 64, -64, -64, 64, -64, -64, 64, 64, -64, 64, -64, 64, -64, -64, -64, 64, -64, 64, -64, 64, 64, 64, 64, 64, 64, -64, 64, 64, -64, -64, -64, -64, -64, 64, -64, -64, -64, 64, -64, 64, 64, -64, 64, -64, -64, 64, -64, -64, -64, -64, 64, 64, 64, 64, -64, 64, 64, -64, -64, 64, 64, -64, 64, 64, 64, -64, -64, 64, -64, -64, -64, 64, 64, 64, 64, 64, -64, -64, 64, 64, 64, -64, -64, -64, 64, -64, 64, 64, 64, 64, -64, -64, -64, 64, 64, 64, 64, 64, 64, 64, -64, 64, -64, 64, 64, -64, 64, -64, 64, -64, 64, -64, 64, 64, 64, 64, -64, -64, 64, 64, -64, 64, -64, 64, 64, -64, 64, 64, 64, -64, -64, 64, 64, 64, -64, 64, -64, -64, -64, -64, -64, -64, -64, -64, 64, 64, 64, -64, 64, -64, -64, 64, -64, 64, 64, 64, -64, -64, -64, -64, -64, 64, -64, 64, -64, 64, 64, -64, 64, -64, -64, -64, -64, -64, -64, -64, 64, 64, 64, 64, -64, 64, 64, -64, -64, -64, -64, 64, 64, 64, 64, 64, -64, -64, -64, 64, 64, 64, -64, 64, 64, -64, -64, -64, 64, 64, -64, 64, 64, -64, 64, 64, 64, -64, -64, -64, -64, -64, 64, -64, 64, -64, 64, -64, 64, 64, -64, 64, -64, 64, 64, 64, 64, 64, -64, -64, -64, -64, -64, 64, 64, 64, -64, -64, -64, -64, -64, 64, -64, 64, 64, 64, 64, 64, 64, -64, -64, -64, 64, -64, 64, 64, 64, 64, 64, 64, 64, 64, 64, -64, -64, 64, 64, 64, 64, 64, -64, 64, -64, 64, 64, 64, -64, -64, -64, 64, 64, 64, 64, -64, 64, -64, 64, 64, 64, -64, 64, 64, 64, 64, -64, -64, 64, 64, -64, -64, 64, 64, 64, -64, 64, -64, -64, -64, -64, 64, -64, -64, 64, -64, 64, 64, -64, 64, -64, -64, 64, -64, 64, 64, -64, -64, 64, -64, -64, 64, -64, 64, 64, -64, 64, 64, 64, 64, -64, 64, -64, 64, -64, 64, 64, -64, 64, 64, -64, 64, 64, 64, 64, -64, 64, 64, -64, 64, 64, -64, -64, -64, -64, -64, 64, 64, 64, 64, 64, 64, -64, 64, 64, 64, 64, 64, 64, 64, -64, -64, -64, 64, -64, -64, 64, -64, 64, -64, 64, 64, -64, -64, 64, -64, 64, -64, -64, -64, -64, -64, -64, 64, 64, 64, -64, -64, 64, 64, 64, 64, -64, -64, -64, -64, 64, 64, 64, 64, -64, -64, -64, -64, -64, -64, 64, -64, 64, 64, -64, -64, -64, 64, 64, -64, 64, 64, 64, 64, 64, 64, -64, -64, 64, -64, -64, 64, 64, -64, 64, 64, -64, -64, 64, -64, 64, -64, 64, 64, -64, 64, 64, -64, -64, 64, 64, -64, 64, 64, 64, -64, 64, -64, 64, -64, 64, -64, -64, 64, 64, 64, 64, 64, 64, -64, 64, -64, -64, -64, 64, 64, -64, -64, 64, -64, -64, 64, -64, 64, -64, 64, -64, -64, 64, -64, 64, -64, -64, -64, 64, -64, -64, -64, -64, 64, -64, -64, -64, 64, 64, -64, -64, 64, 64, -64, -64, -64, 64, -64, -64, 64, 64, -64, -64, 64, -64, -64, -64, -64, 64, 64, 64, 64, 64, -64, 64, -64, -64, 64, 64, -64, 64, -64, -64, -64, -64, -64, 64, -64, -64, 64, -64, 64, -64, -64, 64, 64, 64, -64, -64, -64, 64, 64, 64, -64, -64, 64, -64, 64, -64, -64, 64, -64, -64, -64, 64, -64, -64, -64, 64, -64, 64, -64, 64, -64, 64, 64, 64, -64, 64, -64, 64, -64, 64, -64, 64, 64, -64, 64, -64, 64, 64, -64, -64, 64, 64, -64, 64, -64, -64, 64, -64, 64, 64, -64, -64, -64, 64, -64, 64, 64, 64, -64, 64, 64, 64, -64, 64, 64, -64, 64, 64, 64, -64, 64, 64, -64, 64, 64, 64, -64, -64, 64, 64, 64, 64, -64, 64, -64, -64, 64, -64, 64, -64, -64, 64, -64, -64, -64, -64, 64, -64, 64, 64, 64, 64, 64, 64, 64, -64, -64, 64, 64, 64, -64, -64, 64, 64, 64, 64, -64, 64, 64, -64, 64, 64, -64, -64, -64, -64, -64, -64, -64, -64, 64, 64, -64, -64, -64, -64, 64, -64, -64, -64, 64, -64, 64, -64, -64, 64, 64, -64, -64, -64, -64, -64, -64, -64, -64, 64, -64, 64, 64, -64, 64, -64, -64, 64, 64, -64, 64, -64, 64, -64, 64, -64, -64, 64, -64, -64, 64, -64, -64, -64, 64, 64, -64, 64, -64, 64, 64, -64, -64, 64, -64, -64, -64, -64, 64, 64, 64, -64, -64, -64, -64, 64, 64, 64, -64, -64, -64, -64, -64, -64, -64, -64, 64, -64, 64, 64, 64, 64, 64, 64, 64, -64, 64, 64, -64, 64, 64, 64, -64, 64, -64, 64, 64, -64, -64, 64, 64, 64, -64, -64, -64, 64, -64, 64, -64, 64, -64, -64, -64, -64, 64, 64, 64, 64, -64, 64, -64, 64, -64, 64, -64, -64, -64, 64, -64, -64, 64, 64, -64, -64, 64, -64, -64, -64, -64, -64, 64, -64, 64, -64, 64, -64, -64, -64, -64, -64, 64, -64, -64, -64, 64, 64, -64, -64, 64, 64, -64, 64, 64, -64, -64, -64, 64, 64, 64, -64, 64, 64, 64, -64, -64, 64, -64, -64, 64, -64, -64, 64, -64, 64, 64, -64, 64, 64, 64, -64, 64, -64, -64, 64, 64, -64, -64, 64, -64, -64, -64, 64, 64, -64, -64, -64, 64, 64, 64, -64, -64, -64, -64, -64, 64, -64, 64, 64, -64, 64, -64, -64, 64, 64, 64, 64, 64, -64, -64, 64, -64, -64, -64, 64, 64, 64, -64, 64, 64, 64, 64, 64, -64, -64, 64, -64, 64, -64, -64, 64, 64, 64, -64, 64, -64, 64, -64, -64, 64, 64, 64, -64, 64, 64, -64, 64, -64, -64, -64, 64, -64, 64, -64, -64, 64, 64, -64, 64, 64, 64, -64, 64, -64, 64, -64, 64, -64, 64, -64, -64, -64, 64, 64, -64, -64, 64, -64, 64, -64, -64, -64, 64, -64, -64, 64, 64, 64, -64, 64, -64, -64, 64, 64, 64, 64, 64, 64, 64, -64, -64, -64, 64, 64, 64, 64, -64, 64, 64, -64, -64, 64, -64, -64, 64, 64, -64, -64, -64, 64, 64, -64, 64, -64, 64, 64, 64, -64, -64, -64, 64, -64, 64, 64, 64, 64, 64, -64, 64, -64, -64, 64, -64, -64, 64, -64, -64, 64, -64, 64, -64, -64, -64, -64, -64, 64, -64, 64, 64, -64, 64, -64, -64, -64, -64, 64, 64, -64, -64, -64, -64, -64, 64, -64, -64, 64, -64, 64, -64, -64, -64, 64, 64, -64, -64, 64, 64, 64, -64, 64, -64, -64, 64, -64, -64, -64, 64, 64, 64, 64, 64, 64, -64, 64, -64, 64, 64, -64, 64, 64, -64, 64, -64, -64, 64, -64, 64, -64, -64, 64, 64, -64, 64, 64, -64, -64, 64, 64, 64, 64, -64, -64, -64, -64, -64, 64, -64, -64, 64, 64, -64, 64, 64, -64, 64, 64, 64, 64, -64, 64, -64, 64, 64, 64, -64, -64, -64, 64, -64, 64, 64, 64, -64, -64, 64, -64, -64, -64, 64, 64, -64, 64, 64, 64, 64, 64, -64, 64, 64, -64, -64, -64, 64, 64, 64, 64, 64, 64, 64, 64, -64, 64, -64, -64, 64, -64, -64, 64, 64, 64, 64, 64, 64, 64, 64, -64, 64, -64, 64, -64, -64, 64, -64, 64, 64, -64, -64, 64, 64, 64, -64, -64, -64, 64, 64, 64, -64, 64, 64, 64, -64, 64, 64, 64, -64, 64, 64, 64, 64, -64, -64, -64, -64, -64, 64, 64, -64, 64, -64, -64, -64, 64, 64, 64, 64, -64, -64, -64, -64, 64, 64, 64, 64, 64, 64, -64, -64, 64, -64, 64, 64, -64, 64, -64, 64, 64, 64, -64, 64, -64, -64, 64, 64, 64, 64, 64, 64, 64, -64, -64, 64, 64, -64, -64, -64, -64, -64, -64, -64, 64, -64, 64, -64, 64, -64, -64, -64, 64, 64, 64, -64, -64, 64, -64, -64, -64, 64, 64, -64, 64, 64, 64, -64, -64, 64, -64, 64, -64, 64, 64, -64, -64, -64, 64, 64, 64, -64, -64, 64, -64, -64, -64, 64, -64, 64, -64, -64, 64, -64, -64, -64, -64, 64, 64, -64, -64, 64, -64, -64, 64, 64, -64, 64, -64, -64, 64, 64, 64, 64, 64, -64, 64, -64, -64, -64, 64, -64, 64, -64, 64, -64, 64, -64, -64, 64, 64, -64, 64, 64, -64, -64, 64, 64, 64, 64, -64, 64, -64, -64, 64, 64, 64, -64, 64, 64, -64, 64, -64, -64, -64, 64, 64, 64, -64, 64, -64, 64, -64, -64, -64, 64, 64, 64, 64, -64, 64, 64, 64, -64, -64, 64, 64, -64, 64, 64, 64, -64, -64, -64, 64, 64, -64, -64, -64, 64, 64, 64, -64, 64, -64, 64, 64, -64, -64, -64, -64, -64, 64, 64, -64, 64, 64, -64, 64, -64, 64, 64, 64, -64, -64, -64, 64, 64, -64, -64, 64, -64, -64, -64, 64, -64, -64, 64, -64, 64, -64, 64, -64, -64, -64, -64, -64, 64, -64, 64, 64, -64, 64, -64, 64, -64, -64, 64, -64, 64, -64, 64, -64, 64, 64, -64, -64, 64, 64, -64, -64, 64, 64, -64, 64, 64, 64, 64, 64, -64, 64, 64, -64, -64, -64, -64, 64, -64, 64, -64, -64, 64, -64, 64, -64, 64, -64, -64, -64, 64, -64, -64, 64, 64, 64, -64, 64, -64, -64, -64, 64, -64, -64, -64, -64, 64, -64, 64, 64, 64, 64, 64, 64, -64, 64, 64, -64, 64, -64, 64, 64, 64, -64, 64, -64, -64, 64, 64, -64, -64, -64, -64, 64, 64, -64, -64, -64, -64, -64, 64, -64, 64, -64, 64, 64, -64, 64, -64, 64, 64, 64, -64, -64, -64, 64, -64, -64, -64, -64, -64, -64, 64, 64, 64, -64, 64, 64, 64, -64, -64, 64, -64, 64, -64, 64, -64, -64, 64, -64, -64, 64, 64, -64, -64, -64, -64, 64, 64, 64, 64, -64, -64, -64, 64, -64, -64, 64, -64, -64, -64, 64, -64, 64, 64, -64, -64, -64, 64, -64, -64, 64, -64, 64, -64, 64, 64, -64, 64, 64, -64, -64, 64, 64, 64, 64, -64, 64, 64, 64, 64, -64, 64, 64, 64, 64, -64, 64, 64, -64, -64, -64, 64, 64, -64, 64, 64, -64, -64, -64, -64, -64, -64, 64, -64, -64, -64, -64, -64, -64, 64, 64, -64, -64, 64, -64, 64, -64, -64, 64, 64, 64, 64, 64, 64, 64, 64, -64, -64, 64, 64, 64, -64, -64, -64, 64, 64, -64, -64, -64, 64, 64, 64, 64, -64, 64, 64, 64, -64, 64, -64, 64, -64, 64, -64, 64, -64, 64, -64, 64, -64, -64, 64, 64, 64, -64, -64, 64, 64, -64, 64, -64, -64, -64, 64, 64, -64, -64, -64, 64, 64, -64, -64, 64, -64, 64, 64, 64, -64, -64, 64, 64, 64, -64, -64, 64, 64, 64, -64, 64, -64, -64, -64, 64, -64, -64, -64, 64, -64, 64, 64, 64, -64, 64, -64, -64, -64, -64, -64, 64, -64, -64, 64, -64, 64, -64, 64, -64, 64, 64, -64, 64, -64, 64, 64, 64, 64, -64, 64, -64, -64, 64, 64, 64, -64, 64, -64, 64, 64, -64, 64, 64, -64, -64, -64, 64, 64, -64, 64, -64, 64, 64, 64, 64, -64, 64, -64, 64, 64, 64, -64, -64, 64, -64, -64, -64, 64, -64, -64, 64, 64, -64, 64, -64, -64, -64, 64, 64, -64, 64, 64, 64, -64, -64, -64, -64, 64, 64, -64, -64, -64, -64, -64, 64, 64, -64, 64, 64, 64, -64, -64, -64, -64, -64, -64, 64, -64, -64, 64, 64, 64, -64, 64, -64, -64, 64, 64, 64, -64, -64, 64, -64, -64, -64, 64, -64, -64, 64, -64, 64, 64, 64, 64, -64, -64, 64, -64, -64, -64, 64, 64, 64, 64, -64, 64, -64, 64, -64, -64, 64, 64, -64, 64, 64, -64, 64, -64, 64, -64, -64, 64, 64, -64, 64, 64, -64, 64, 64, -64, 64, -64, 64, 64, -64, 64, -64, 64, -64, 64, 64, 64, 64, -64, -64, -64, 64, -64, -64, 64, 64, 64, -64, 64, 64, -64, -64, 64, -64, -64, -64, 64, 64, -64, 64, -64, 64, 64, -64, -64, 64, 64, 64, 64, 64, -64, -64, -64, -64, 64, 64, 64, 64, 64, -64, -64, -64, -64, 64, 64, 64, 64, 64, 64, 64, 64, -64, 64, 64, 64, -64, 64, 64, 64, 64, -64, 64, 64, 64, 64, -64, -64, 64, 64, -64, -64, 64, -64, -64, 64, 64, -64, 64, -64, -64, -64, -64, 64, 64, 64, 64, -64, 64, 64, 64, -64, 64, -64, -64, 64, 64, -64, 64, 64, -64, -64, -64, -64, -64, -64, -64, -64, -64, 64, -64, -64, 64, 64, 64, 64, 64, 64, 64, -64, -64, -64, 64, -64, -64, 64, -64, 64, -64, 64, 64, -64, -64, 64, -64, -64, -64, -64, 64, -64, -64, 64, -64, 64, 64, -64, 64, 64, -64, 64, 64, 64, 64, 64, 64, -64, 64, 64, -64, -64, -64, 64, 64, 64, 64, -64, 64, -64, 64, -64, 64, -64, 64, -64, -64, -64, -64, 64, -64, 64, -64, -64, -64, 64, -64, -64, -64, -64, -64, -64, 64, 64, 64, -64, -64, -64, -64, 64, -64, 64, -64, 64, -64, -64, 64, -64, 64, 64, -64, 64, -64, 64, 64, 64, 64, 64, 64, 64, -64, 64, 64, 64, -64, -64, 64, -64, -64, 64, -64, -64, -64, -64, 64, -64, -64, 64, 64, -64, -64, 64, 64, -64, -64, 64, 64, 64, 64, 64, 64, 64, 64, -64, -64, 64, -64, -64, -64, -64, 64, 64, 64, 64, -64, 64, 64, -64, 64, -64, -64, -64, 64, 64, 64, 64, -64, -64, 64, 64, 64, 64, -64, -64, 64, -64, 64, -64, 64, -64, -64, -64, 64, 64, 64, 64, -64, -64, 64, 64, -64, -64, -64, 64, 64, -64, -64, 64, -64, 64, -64, 64, 64, 64, -64, -64, 64, -64, -64, 64, 64, 64, -64, -64, 64, 64, -64, -64, 64, 64, 64, -64, 64, 64, -64, 64, -64, -64, -64, -64, 64, -64, 64, 64, 64, 64, 64, 64, 64, 64, 64, -64, -64, -64, -64, 64, 64, -64, -64, -64, 64, 64, 64, 64, 64, 64, -64, 64, 64, 64, -64, 64, -64, 64, 64, -64, 64, -64, 64, 64, 64, -64, -64, -64, -64, 64, -64, 64, 64, 64, -64, 64, -64, -64, -64, -64, 64, 64, -64, -64, -64, 64, -64, -64, -64, -64, -64, 64, -64, 64, -64, 64, 64, -64, -64, 64, 64, 64, 64, 64, 64, 64, -64, 64, -64, 64, 64, 64, -64, 64, 64, -64, 64, 64, -64, 64, 64, 64, 64, 64, -64, 64, 64, 64, -64, 64, 64, 64, -64, 64, 64, -64, 64, -64, 64, 64, 64, 64, 64, 64, 64, -64, -64, -64, -64, 64, -64, 64, -64, 64, -64, 64, 64, 64, -64, 64, -64, 64, -64, 64, -64, -64, 64, -64, 64, 64, 64, -64, 64, -64, -64, -64, -64, 64, 64, 64, -64, 64, 64, -64, -64, -64, 64, 64, -64, -64, 64, -64, 64, 64, 64, 64, 64, -64, 64, 64, 64, 64, 64, 64, 64, -64, 64, 64, 64, -64, 64, -64, -64, 64, -64, 64, -64, 64, 64, -64, 64, 64, 64, -64, 64, -64, -64, -64, 64, -64, -64, 64, -64, 64, 64, -64, 64, 64, 64, -64, 64, -64, -64, -64, -64, -64, 64, 64, 64, -64, -64, 64, -64, -64, 64, 64, 64, -64, -64, 64, -64, 64, 64, 64, -64, 64, 64, -64, -64, -64, -64, -64, 64, -64, -64, 64, 64, -64, 64, 64, 64, 64, 64, 64, 64, -64, 64, -64, -64, 64, -64, 64, 64, 64, -64, 64, -64, 64, 64, 64, -64, -64, 64, -64, 64, -64, -64, -64, 64, -64, 64, 64, -64, -64, -64, -64, 64, 64, -64, -64, 64, -64, 64, 64, -64, -64, -64, -64, 64, -64, 64, -64, -64, -64, 64, 64, 64, -64, 64, 64, -64, -64, -64, -64, 64, -64, 64, -64, 64, -64, -64, 64, -64, 64, -64, 64, -64, -64, -64, -64, 64, -64, -64, -64, 64, 64, -64, 64, 64, -64, -64, 64, 64, 64, 64, -64, -64, 64, 64, 64, -64, 64, -64, -64, 64, 64, 64, -64, -64, -64, -64, 64, -64, -64, 64, 64, 64, 64, 64, 64, -64, -64, 64, 64, -64, -64, 64, -64, -64, -64, -64, 64, -64, 64, -64, 64, 64, -64, 64, -64, 64, -64, 64, -64, 64, 64, 64, 64, 64, -64, 64, -64, 64, -64, 64, -64, 64, -64, -64, 64, 64, 64, 64, 64, -64, 64, 64, -64, -64, -64, 64, 64, 64, -64, 64, 64, -64, -64, -64, 64, 64, 64, 64, 64, -64, 64, -64, -64, -64, 64, 64, -64, -64, -64, -64, -64, 64, -64, 64, -64, -64, -64, -64, 64, -64, -64, 64, -64, -64, -64, -64, -64, -64, 64, 64, 64, 64, 64, 64, 64, 64, 64, 64, 64, 64, 64, -64, -64, -64, -64, -64, 64, 64, 64, 64, 64, -64, -64, -64, 64, -64, -64, 64, 64, -64, -64, 64, 64, -64, -64, -64, -64, -64, 64, 64, 64, 64, -64, -64, -64, -64, 64, 64, 64, 64, 64, -64, -64, 64, 64, -64, -64, 64, -64, 64, 64, -64, 64, -64, -64, -64, 64, 64, -64, -64, 64, -64, 64, 64, -64, 64, 64, -64, -64, -64, 64, 64, -64, 64, -64, 64, 64, -64, -64, -64, 64, 64, 64, -64, 64, 64, 64, -64, 64, -64, -64, -64, -64, -64, 64, 64, 64, 64, -64, 64, 64, -64, -64, -64, -64, 64, -64, -64, 64, -64, -64, -64, 64, 64, 64, -64, 64, -64, 64, 64, -64, 64, 64, -64, 64, 64, -64, 64, -64, -64, -64, 64, -64, 64, -64, 64, -64, -64, 64, 64, -64, 64, 64, 64, -64, 64, 64, 64, 64, -64, 64, -64, -64, 64, 64, -64, -64, -64, -64, -64, -64, -64, -64, -64, -64, -64, 64, -64, -64, 64, 64, -64, 64, -64, -64, -64, -64, 64, -64, -64, 64, 64, 64, -64, 64, 64, -64, -64, 64, 64, 64, 64, 64, 64, 64, -64, -64, -64, -64, 64, -64, -64, -64, 64, 64, 64, -64, -64, 64, -64, 64, -64, 64, -64, -64, 64, -64, -64, 64, -64, 64, 64, 64, -64, 64, 64, -64, -64, 64, 64, 64, -64, -64, 64, 64, 64, -64, 64, 64, 64, -64, 64, 64, 64, 64, 64, 64, -64, -64, 64, -64, 64, -64, 64, -64, 64, -64, -64, 64, -64, 64, -64, 64, 64, -64, 64, -64, -64, 64, -64, -64, 64, -64, 64, -64, 64, -64, 64, -64, -64, -64, 64, 64, -64, -64, 64, 64, -64, 64, -64, -64, 64, 64, 64, -64, 64, 64, -64, -64, -64, -64, -64, 64, -64, 64, -64, 64, -64, 64, -64, -64, -64, -64, 64, 64, -64, 64, 64, -64, 64, 64, -64, -64, 64, -64, 64, -64, 64, -64, -64, -64, 64, 64, -64, -64, 64, -64, 64, -64, -64, -64, -64, 64, 64, 64, -64, 64, 64, -64, -64, 64, -64, 64, 64, -64, 64, 64, -64, 64, 64, 64, 64, 64, -64, -64, -64, 64, -64, -64, 64, 64, 64, 64, 64, -64, 64, -64, -64, 64, -64, -64, 64, -64, 64, -64, 64, -64, 64, -64, 64, 64, 64, 64, 64, -64, 64, 64, -64, 64, 64, -64, -64, 64, -64, -64, -64, 64, -64, 64, 64, 64, -64, -64, -64, -64, -64, 64, 64, -64, -64, 64, -64, 64, 64, -64, 64, 64, 64, -64, 64, -64, 64, 64, -64, 64, 64, -64, -64, 64, 64, -64, -64, 64, 64, 64, 64, 64, -64, -64, 64, -64, 64, 64, -64, 64, -64, 64, -64, -64, 64, -64, -64, 64, 64, -64, 64, 64, 64, -64, -64, 64, -64, 64, -64, 64, 64, 64, -64, -64, 64, -64, -64, 64, 64, -64, -64, 64, 64, -64, 64, 64, -64, 64, -64, -64, -64, -64, -64, -64, -64, -64, -64, -64, 64, 64, -64, -64, -64, 64, -64, 64, 64, -64, -64, -64, -64, -64, 64, 64, 64, -64, -64, -64, -64, 64, 64, 64, -64, 64, 64, -64, 64, -64, 64, 64, 64, -64, -64, -64, -64, 64, -64, 64, 64, 64, -64, 64, -64, 64, -64, -64, 64, -64, 64, 64, -64, -64, 64, -64, 64, 64, 64, 64, -64, 64, 64, 64, 64, -64, -64, 64, 64, 64, -64, 64, 64, -64, -64, -64, 64, -64, 64, -64, -64, -64, -64, -64, 64, -64, -64, 64, -64, 64, -64, -64, 64, 64, -64, -64, 64, -64, 64, -64, -64, 64, 64, -64, -64, -64, -64, 64, -64, -64, -64, 64, 64, -64, 64, -64, 64, -64, 64, -64, -64, -64, 64, -64, 64, 64, -64, 64, 64, -64, -64, -64, 64, -64, -64, 64, -64, -64, 64, 64, 64, -64, 64, -64, -64, 64, -64, -64, 64, 64, 64, 64, 64, 64, -64, 64, 64, 64, 64, 64, -64, -64, -64, 64, 64, -64, 64, -64, 64, 64, 64, -64, -64, -64, 64, 64, -64, -64, -64, -64, 64, 64, 64, 64, 64, 64, -64, 64, -64, -64, 64, 64, 64, 64, -64, -64, -64, -64, 64, 64, 64, 64, 64, 64, 64, -64, -64, -64, 64, 64, -64, -64, -64, 64, -64, -64, -64, -64, 64, -64, 64, -64, 64, 64, 64, -64, -64, -64, 64, -64, -64, -64, 64, -64, -64, 64, 64, 64, 64, 64, 64, 64, 64, -64, 64, -64, -64, -64, -64, -64, -64, -64, -64, -64, -64, 64, 64, -64, -64, -64, 64, 64, 64, 64, -64, 64, 64, 64, -64, 64, -64, 64, -64, 64, 64, 64, -64, -64, -64, 64, 64, -64, -64, -64, -64, -64, -64, 64, -64, 64, 64, 64, -64, -64, -64, 64, -64, -64, 64, 64, -64, -64, -64, -64, 64, -64, -64, 64, 64, -64, -64, 64, -64, 64, 64, -64, -64, 64, 64, -64, 64, -64, -64, -64, -64, 64, -64, -64, 64, 64, 64, 64, 64, 64, -64, 64, 64, -64, 64, 64, 64, 64, 64, -64, 64, -64, 64, -64, -64, -64, -64, 64, -64, 64, -64, 64, -64, 64, -64, -64, 64, 64, 64, 64, -64, -64, -64, 64, -64, 64, 64, -64, 64, -64, 64, -64, 64, 64, 64, -64, -64, 64, -64, 64, 64, -64, -64, 64, 64, -64, 64, -64, -64, -64, 64, -64, -64, 64, -64, -64, 64, -64, 64, -64, -64, 64, 64, 64, -64, -64, 64, 64, 64, 64, 64, -64, 64, -64, -64, 64, 64, -64, -64, 64, -64, 64, 64, -64, 64, -64, -64, -64, 64, -64, -64, -64, 64, -64, 64, 64, 64, -64, 64, -64, -64, 64, 64, -64, 64, 64, 64, -64, 64, 64, 64, 64, 64, 64, -64, 64, 64, 64, -64, -64, -64, 64, 64, -64, -64, -64, 64, -64, 64, 64, -64, 64, 64, -64, -64, 64, -64, -64, -64, -64, 64, 64, -64, -64, -64, 64, -64, 64, -64, -64, 64, 64, -64, 64, -64, 64, -64, 64, -64, -64, 64, 64, -64, -64, -64, 64, 64, -64, -64, 64, 64, 64, 64, 64, 64, 64, 64, -64, 64, -64, -64, -64, 64, -64, -64, -64, -64, 64, -64, -64, 64, -64, -64, -64, 64, -64, -64, 64, 64, -64, 64, -64, -64, -64, 64, 64, 64, -64, -64, -64, -64, -64, -64, 64, 64, 64, 64, 64, -64, -64, -64, -64, -64, -64, -64, -64, -64, 64, -64, 64, -64, 64, -64, -64, -64, 64, -64, -64, 64, 64, 64, 64, -64, -64, 64, -64, 64, 64, 64, -64, 64, -64, -64, 64, 64, -64, 64, -64, 64, 64, 64, 64, -64, 64, 64, 64, 64, -64, 64, 64, 64, 64, 64, 64, 64, -64, -64, -64, 64, -64, 64, 64, 64, -64, 64, 64, -64, 64, -64, -64, -64, -64, 64, 64, -64, 64, 64, 64, 64, -64, -64, 64, -64, -64, -64, -64, -64, 64, 64, -64, -64, 64, 64, -64, 64, -64, -64, 64, -64, 64, -64, -64, 64, -64, 64, -64, -64, 64, -64, 64, 64, -64, 64, 64, -64, -64, -64, -64, -64, -64, -64, 64, -64, -64, -64, 64, 64, -64, 64, -64, -64, -64, -64, 64, 64, 64, -64, 64, -64, -64, 64, 64, 64, -64, 64, -64, -64, -64, 64, 64, 64, -64, -64, -64, -64, 64, 64, 64, -64, 64, 64, -64, -64, 64, -64, -64, 64, 64, 64, -64, -64, 64, -64, 64, 64, -64, 64, -64, 64, -64, -64, -64, -64, -64, -64, 64, 64, 64, 64, 64, 64, 64, 64, -64, -64, 64, -64, 64, -64, -64, -64, -64, 
};

ring_t fc2_bias_fp[10]=
{
0, 0, 0, 0, 0, 1, 0, 0, -1, 0, 
};

ring_t img_fp[IN_DIM];

share fc1_weight_m[HL1_DIM * IN_DIM];
share fc2_weight_m[OUT_DIM * HL1_DIM];
share fc1_bias_m[HL1_DIM];
share fc2_bias_m[HL1_DIM];

share img_m[IN_DIM];
share hl1_m[HL1_DIM];
share out_m[OUT_DIM];

int run_mbnn(unsigned long long *rt)
{
	unsigned long long t0, t1;
	int param_inps_rnd, dense1_rnd, dense2_rnd;
	t0 = get_cycles();

	mask_a((fixed_point_t *)img_fp, IN_DIM, img_m);
	L++;
	
	mask_a((fixed_point_t *)fc1_weight_fp, HL1_DIM*IN_DIM, fc1_weight_m);
	mask_a((fixed_point_t *)fc1_bias_fp, HL1_DIM, fc1_bias_m);
	L++;

	mask_a((fixed_point_t *)fc2_weight_fp, OUT_DIM*HL1_DIM, fc2_weight_m);
	mask_a((fixed_point_t *)fc2_bias_fp, OUT_DIM, fc2_bias_m);
	L++;

	if (PROFILE_RND)
	{
		if (get_REUSE_status())
			param_inps_rnd = L;
		else
			param_inps_rnd = rnd_cnt;
		printf("rnd-cnt-inp-par:%d\t", param_inps_rnd);

	}
	TEMPLATE(dense, share)(img_m, IN_DIM,
			       fc1_weight_m, HL1_DIM, hl1_m,
			       fc1_bias_m, 1);

	if (PROFILE_RND)
	{
		if (get_REUSE_status())
			dense1_rnd = L;
		else
			dense1_rnd = rnd_cnt;
		printf("rnd-cnt-denseact1:%d\t", dense1_rnd - param_inps_rnd);

	}
	TEMPLATE(dense, share)(hl1_m, HL1_DIM,
			       fc2_weight_m, OUT_DIM, out_m,
			       fc2_bias_m, 0);
	if (PROFILE_RND)
	{
		if (get_REUSE_status())
			dense2_rnd = L;
		else
			dense2_rnd = rnd_cnt ;
		printf("rnd-cnt-dense2:%d\t", dense2_rnd - dense1_rnd);

		if (get_REUSE_status())
			printf("rnd-cnt-total:%d\t", L);
		else
			printf("rnd-cnt-total:%d\t", rnd_cnt);

	}

	t1 = get_cycles();
	*rt=t1-t0;

	share max[1];
	share label[1];
	ring_t label_res = 0;
	TEMPLATE(argmax, share)(out_m, OUT_DIM, max, label);

	reconst(&label_res, label);
	return label_res;
}



void run(int tests, double *acc, unsigned long long *avg_cycles)
{
	int label;
	double correct_guesses = 0;
	unsigned long long avg_rt = 0;
	unsigned long long rt;
	
	for (int i = 0; i < tests ; i++)
	{
		reset_PRNG();
		for (int j = 0; j < 28*28; j++)
		{
			img_fp[j]=float_to_fixed(test_image[i][j]);
		}
		rt = 0;
		label = run_mbnn(&rt);
		avg_rt += rt;
		if (label == test_label[i])
			correct_guesses++;
		
	}

	*avg_cycles = avg_rt/tests;
	*acc = (correct_guesses/tests)*100;
	return;
}


int main(int argc, char *argv[])
{
	load_mnist();
	unsigned long long avg_rt;
	double acc;
	switch (argc)
	{
	case 2:
		if (argv[1][0] == '0')
		{
			set_PRNG_OFF();
			set_REUSE_OFF();
		}
		else if (argv[1][0] == '1')
		{
			set_PRNG_ON();
			set_REUSE_OFF();
		}
		else if (argv[1][0] == '2')
		{
			set_PRNG_ON();
			set_REUSE_ON(RANDS_REUSE);
		}
		else
		{
			printf("Invalid argument.\n");
			printf("Usage: %s [NN-TYPE]\n", argv[0]);
			printf("Please select type of Masking:\n");
			printf("  0:\tPRNG_OFF,\n");
			printf("  1:\tPRNG_ON-ORIGINAL,\n");
			printf("  2:\tPRNG_ON-TIGHTENED.\n");
			return 1;
		}
		break;
	default:
		printf("Usage: %s [NN-TYPE]\n", argv[0]);
		printf("Please select type of Masking:\n");
		printf("  0:\tPRNG_OFF,\n");
		printf("  1:\tPRNG_ON-ORIGINAL,\n");
		printf("  2:\tPRNG_ON-TIGHTENED.\n");
		return 1;
	}

	char *prng, *tight;
	
	if (get_PRNG_status())
		prng="PRNG_ON";
	else
		prng="PRNG_OFF";
	if (get_REUSE_status())
		tight="TIGHTENED";
	else
		tight="ORIGINAL";
	
	printf("nn:%s\t", argv[0]+3);
	run(NUM_TEST, &acc, &avg_rt);
	printf("type:%s-%s\t", prng, tight);
	printf("accuracy:%.3f\t",acc);
	printf("avgcycles:%llu\t",avg_rt);

	set_PROFILE_RNDCNT_ON();
	run(1, &acc, &avg_rt);
	set_PROFILE_RNDCNT_OFF();

#ifdef PCNT
	reset_primop_cnt();
	run(1, &acc, &avg_rt);
	print_primop_cnt();
#endif
	
	printf("\n");

	return 0;
}

