<?xml version="1.0" encoding="UTF-8"?>
<glyph name="f_v" format="2">
	<advance width="489"/>
	<unicode hex="F2150"/>
	<outline>
		<component base="v"/>
		<component base="f-haut" xOffset="-28"/>
	</outline>
	<lib>
		<dict>
			<key>com.schriftgestaltung.Glyphs.ComponentInfo</key>
			<array>
				<dict>
					<key>alignment</key>
					<integer>-1</integer>
					<key>index</key>
					<integer>1</integer>
					<key>name</key>
					<string>f-haut</string>
				</dict>
			</array>
			<key>com.schriftgestaltung.Glyphs.leftMetricsKey</key>
			<string>v</string>
			<key>com.schriftgestaltung.Glyphs.rightMetricsKey</key>
			<string>v</string>
		</dict>
	</lib>
</glyph>
