<?xml version="1.0" encoding="UTF-8"?>
<glyph name="Ocircumflex" format="2">
	<advance width="776"/>
	<unicode hex="00D4"/>
	<outline>
		<component base="O"/>
		<component base="circumflexcomb.case" xOffset="252" yOffset="149"/>
	</outline>
</glyph>
