<?xml version="1.0" encoding="UTF-8"?>
<glyph name="Yacute" format="2">
	<advance width="597"/>
	<unicode hex="00DD"/>
	<outline>
		<component base="Y"/>
		<component base="acutecomb.case" xOffset="250" yOffset="150"/>
	</outline>
</glyph>
