<?xml version="1.0" encoding="UTF-8"?>
<glyph name="Fmasc" format="2">
	<advance width="592"/>
	<unicode hex="F8350"/>
	<outline>
		<component base="circumflexbelowcomb.case" xOffset="53"/>
		<component base="F"/>
	</outline>
</glyph>
