<?xml version="1.0" encoding="UTF-8"?>
<glyph name="Agrave" format="2">
	<advance width="645"/>
	<unicode hex="00C0"/>
	<outline>
		<component base="A"/>
		<component base="gravecomb.case" xOffset="141" yOffset="150"/>
	</outline>
</glyph>
