<?xml version="1.0" encoding="UTF-8"?>
<glyph name="asterisks" format="2">
	<advance width="354"/>
	<unicode hex="2051"/>
	<outline>
		<component base="asterisk"/>
		<component base="asterisk" yOffset="-403"/>
	</outline>
	<lib>
		<dict>
			<key>com.schriftgestaltung.Glyphs.leftMetricsKey</key>
			<string>asterisk</string>
			<key>com.schriftgestaltung.Glyphs.rightMetricsKey</key>
			<string>asterisk</string>
		</dict>
	</lib>
</glyph>
