<?xml version="1.0" encoding="UTF-8"?>
<glyph name="ifem" format="2">
	<advance width="290"/>
	<unicode hex="F8600"/>
	<outline>
		<component base="i"/>
		<component base="dotbelowcomb" xOffset="36"/>
	</outline>
</glyph>
