<?xml version="1.0" encoding="UTF-8"?>
<glyph name="ygrave" format="2">
	<advance width="497"/>
	<unicode hex="1EF3"/>
	<outline>
		<component base="y"/>
		<component base="gravecomb" xOffset="139"/>
	</outline>
</glyph>
