<?xml version="1.0" encoding="UTF-8"?>
<glyph name="acutecomb" format="2">
	<advance width="211"/>
	<unicode hex="0301"/>
	<anchor x="75" y="470" name="_top"/>
	<outline>
		<contour>
			<point x="62" y="534" type="line"/>
			<point x="246" y="715" type="line"/>
			<point x="82" y="715" type="line"/>
			<point x="35" y="549" type="line"/>
		</contour>
	</outline>
	<lib>
		<dict>
			<key>com.schriftgestaltung.Glyphs.Export</key>
			<false/>
		</dict>
	</lib>
</glyph>
