<?xml version="1.0" encoding="UTF-8"?>
<glyph name="x" format="2">
	<advance width="483"/>
	<unicode hex="0078"/>
	<anchor x="222" y="0" name="bottom"/>
	<note>
		x
	</note>
	<outline>
		<contour>
			<point x="277" y="0" type="line"/>
			<point x="483" y="0" type="line"/>
			<point x="483" y="27" type="line"/>
			<point x="466" y="31"/>
			<point x="430" y="60"/>
			<point x="393" y="110" type="curve" smooth="yes"/>
			<point x="192" y="383" type="line" smooth="yes"/>
			<point x="170" y="413"/>
			<point x="173" y="440"/>
			<point x="213" y="443" type="curve"/>
			<point x="213" y="470" type="line"/>
			<point x="14" y="470" type="line"/>
			<point x="14" y="443" type="line"/>
			<point x="37" y="441"/>
			<point x="68" y="410"/>
			<point x="92" y="377" type="curve" smooth="yes"/>
			<point x="301" y="98" type="line" smooth="yes"/>
			<point x="331" y="57"/>
			<point x="318" y="30"/>
			<point x="277" y="27" type="curve"/>
		</contour>
		<contour>
			<point x="-5" y="0" type="line"/>
			<point x="181" y="0" type="line"/>
			<point x="181" y="27" type="line"/>
			<point x="129" y="32"/>
			<point x="130" y="67"/>
			<point x="154" y="97" type="curve" smooth="yes"/>
			<point x="273" y="248" type="line"/>
			<point x="228" y="271" type="line"/>
			<point x="129" y="139" type="line" smooth="yes"/>
			<point x="96" y="94"/>
			<point x="22" y="28"/>
			<point x="-5" y="27" type="curve"/>
		</contour>
		<contour>
			<point x="257" y="214" type="line"/>
			<point x="349" y="331" type="line" smooth="yes"/>
			<point x="383" y="374"/>
			<point x="440" y="439"/>
			<point x="475" y="443" type="curve"/>
			<point x="475" y="470" type="line"/>
			<point x="305" y="470" type="line"/>
			<point x="305" y="443" type="line"/>
			<point x="351" y="441"/>
			<point x="357" y="415"/>
			<point x="333" y="385" type="curve" smooth="yes"/>
			<point x="213" y="231" type="line"/>
		</contour>
	</outline>
</glyph>
