<?xml version="1.0" encoding="UTF-8"?>
<glyph name="V" format="2">
	<advance width="642"/>
	<unicode hex="0056"/>
	<anchor x="319" y="0" name="bottom"/>
	<outline>
		<contour>
			<point x="303" y="0" type="line"/>
			<point x="341" y="0" type="line"/>
			<point x="563" y="571" type="line" smooth="yes"/>
			<point x="585" y="628"/>
			<point x="632" y="668"/>
			<point x="667" y="671" type="curve"/>
			<point x="667" y="700" type="line"/>
			<point x="421" y="700" type="line"/>
			<point x="421" y="672" type="line"/>
			<point x="495" y="670"/>
			<point x="521" y="624"/>
			<point x="494" y="554" type="curve" smooth="yes"/>
			<point x="328" y="126" type="line"/>
			<point x="359" y="125" type="line"/>
			<point x="194" y="554" type="line" smooth="yes"/>
			<point x="167" y="624"/>
			<point x="204" y="669"/>
			<point x="271" y="671" type="curve"/>
			<point x="271" y="700" type="line"/>
			<point x="-20" y="700" type="line"/>
			<point x="-20" y="673" type="line"/>
			<point x="37" y="660"/>
			<point x="59" y="629"/>
			<point x="85" y="563" type="curve" smooth="yes"/>
		</contour>
	</outline>
	<lib>
		<dict>
			<key>com.schriftgestaltung.Glyphs.leftMetricsKey</key>
			<string>=|A</string>
			<key>com.schriftgestaltung.Glyphs.rightMetricsKey</key>
			<string>=|A</string>
		</dict>
	</lib>
</glyph>
