<?xml version="1.0" encoding="UTF-8" standalone="no"?>
<!-- Created with Inkscape (http://www.inkscape.org/) -->

<svg
   xmlns:dc="http://purl.org/dc/elements/1.1/"
   xmlns:cc="http://creativecommons.org/ns#"
   xmlns:rdf="http://www.w3.org/1999/02/22-rdf-syntax-ns#"
   xmlns:svg="http://www.w3.org/2000/svg"
   xmlns="http://www.w3.org/2000/svg"
   xmlns:sodipodi="http://sodipodi.sourceforge.net/DTD/sodipodi-0.dtd"
   xmlns:inkscape="http://www.inkscape.org/namespaces/inkscape"
   width="110.70275mm"
   height="6.6668649mm"
   viewBox="0 0 110.70275 6.6668648"
   version="1.1"
   id="svg4435"
   inkscape:version="0.92.3 (2405546, 2018-03-11)"
   sodipodi:docname="logo-perspective.svg">
  <defs
     id="defs4429">
    <clipPath
       clipPathUnits="userSpaceOnUse"
       id="clipPath18">
      <path
         d="M 0,0 H 1920 V 1080 H 0 Z"
         id="path16"
         inkscape:connector-curvature="0" />
    </clipPath>
  </defs>
  <sodipodi:namedview
     id="base"
     pagecolor="#ffffff"
     bordercolor="#666666"
     borderopacity="1.0"
     inkscape:pageopacity="0.0"
     inkscape:pageshadow="2"
     inkscape:zoom="1.979899"
     inkscape:cx="311.56203"
     inkscape:cy="-53.686885"
     inkscape:document-units="mm"
     inkscape:current-layer="layer1"
     showgrid="false"
     inkscape:window-width="1920"
     inkscape:window-height="1024"
     inkscape:window-x="1920"
     inkscape:window-y="28"
     inkscape:window-maximized="1"
     fit-margin-top="0"
     fit-margin-left="0"
     fit-margin-right="0"
     fit-margin-bottom="0"
     showguides="true"
     inkscape:guide-bbox="true">
    <sodipodi:guide
       position="16.570711,6.6149204"
       orientation="0,1"
       id="guide85"
       inkscape:locked="false" />
    <sodipodi:guide
       position="23.319266,1.6704343"
       orientation="0,1"
       id="guide87"
       inkscape:locked="false" />
    <sodipodi:guide
       position="10.134486,3.3545384"
       orientation="1,0"
       id="guide89"
       inkscape:locked="false" />
    <sodipodi:guide
       position="7.8018875,4.413673"
       orientation="1,0"
       inkscape:locked="false"
       id="guide91" />
  </sodipodi:namedview>
  <metadata
     id="metadata4432">
    <rdf:RDF>
      <cc:Work
         rdf:about="">
        <dc:format>image/svg+xml</dc:format>
        <dc:type
           rdf:resource="http://purl.org/dc/dcmitype/StillImage" />
        <dc:title></dc:title>
      </cc:Work>
    </rdf:RDF>
  </metadata>
  <g
     inkscape:label="Layer 1"
     inkscape:groupmode="layer"
     id="layer1"
     transform="translate(-40.711273,-37.494049)">
    <g
       transform="matrix(0.35277777,0,0,-0.35277777,53.550898,379.52315)"
       id="g12">
      <g
         id="g14"
         clip-path="url(#clipPath18)">
        <g
           id="g20"
           transform="translate(263.4716,957.5883)">
          <path
             d="m 0,0 c -1.208,1.868 -3.66,4.486 -6.39,4.486 -1.807,0 -3.603,-1.36 -3.603,-3.638 0,-2.208 2.045,-3.582 3.825,-3.582 1.957,0 2.898,0.614 4.547,0.28 1.289,-0.261 1.982,-0.889 2.331,-1.222 0.165,-0.159 0.374,-0.176 0.519,-0.081 0.143,0.093 0.239,0.273 0.143,0.7 C 1.149,-2.058 0.618,-0.947 0,0"
             style="fill:#9a9a9a;fill-opacity:1;fill-rule:nonzero;stroke:none"
             id="path22"
             inkscape:connector-curvature="0" />
        </g>
        <g
           id="g24"
           transform="translate(273.8063,962.0764)">
          <path
             d="m 0,0 c -2.728,0 -5.182,-2.619 -6.39,-4.488 -0.614,-0.949 -1.144,-2.062 -1.374,-3.055 -0.094,-0.429 0,-0.609 0.145,-0.702 0.147,-0.095 0.356,-0.078 0.52,0.083 0.346,0.331 1.044,0.959 2.329,1.219 1.648,0.333 2.595,-0.278 4.549,-0.278 1.782,0 3.822,1.373 3.822,3.581 C 3.601,-1.363 1.808,0 0,0"
             style="fill:#9a9a9a;fill-opacity:1;fill-rule:nonzero;stroke:none"
             id="path26"
             inkscape:connector-curvature="0" />
        </g>
        <g
           id="g28"
           transform="translate(268.8712,960.8118)">
          <path
             d="m 0,0 c 0.791,0.69 1.298,1.175 1.68,1.735 0.34,0.492 0.713,1.191 0.713,2.117 0,2.113 -1.678,3.567 -3.506,3.567 -1.009,0 -1.845,-0.424 -2.313,-1.044 -0.468,0.62 -1.305,1.044 -2.316,1.044 -1.826,0 -3.5,-1.454 -3.5,-3.567 0,-0.926 0.37,-1.625 0.704,-2.117 0.387,-0.56 0.892,-1.045 1.683,-1.735 1.153,-0.999 2.102,-1.975 3.005,-3.886 0.073,-0.15 0.225,-0.323 0.424,-0.323 0.198,0 0.349,0.173 0.424,0.323 C -2.099,-1.975 -1.152,-0.999 0,0 m -3.426,-2.629 c -1.256,2.716 -2.98,3.274 -4.249,5.008 -0.323,0.44 -0.504,0.925 -0.504,1.454 0,1.392 1.13,2.542 2.525,2.542 1.21,0 1.963,-0.912 2.228,-1.563 0.263,0.651 1.017,1.563 2.229,1.563 1.391,0 2.522,-1.15 2.522,-2.542 C 1.325,3.304 1.145,2.819 0.82,2.379 -0.449,0.645 -2.169,0.087 -3.426,-2.629"
             style="fill:#9a9a9a;fill-opacity:1;fill-rule:nonzero;stroke:none"
             id="path30"
             inkscape:connector-curvature="0" />
        </g>
        <g
           id="g32"
           transform="translate(239.8777,956.3474)">
          <path
             d="m 0,0 c -0.209,0 -0.307,-0.037 -0.44,-0.037 -0.249,0 -0.324,0.134 -0.324,0.498 0,0.934 0.075,9.382 0.075,10.509 0,0.842 -0.38,1.068 -1.3,1.068 -0.991,0 -1.356,-0.363 -1.356,-1.029 V 0.326 c 0,-1.454 0.767,-2.426 2.375,-2.426 1.164,0 1.717,0.42 1.717,1.223 C 0.747,-0.306 0.498,0 0,0"
             style="fill:#9a9a9a;fill-opacity:1;fill-rule:nonzero;stroke:none"
             id="path34"
             inkscape:connector-curvature="0" />
        </g>
        <g
           id="g36"
           transform="translate(230.5176,964.6028)">
          <path
             d="m 0,0 c -3.173,0 -4.952,-2.083 -4.952,-5.006 0,-3.267 1.891,-5.332 4.932,-5.332 3.229,0 4.413,1.721 4.413,2.675 0,0.65 -0.456,0.992 -0.957,0.992 -1.392,0 -0.957,-1.544 -3.342,-1.544 -1.453,0 -2.447,0.977 -2.447,2.273 0,0.305 0.04,0.497 0.457,0.497 0.443,0 4.933,-0.019 5.467,-0.019 0.744,0 1.108,0.228 1.108,1.376 C 4.679,-1.472 2.98,0 0,0 m 1.891,-4.088 h -3.746 c -0.344,0 -0.422,0.115 -0.422,0.401 0,0.668 0.67,1.701 2.35,1.701 1.626,0 2.294,-0.957 2.294,-1.662 0,-0.308 -0.114,-0.44 -0.476,-0.44"
             style="fill:#9a9a9a;fill-opacity:1;fill-rule:nonzero;stroke:none"
             id="path38"
             inkscape:connector-curvature="0" />
        </g>
        <g
           id="g40"
           transform="translate(220.8301,960.0935)">
          <path
             d="m 0,0 c -2.162,0.382 -2.485,0.726 -2.485,1.452 0,0.688 0.609,1.031 1.702,1.031 0.914,0 1.528,-0.284 1.965,-1.031 0.156,-0.269 0.459,-0.61 0.996,-0.61 0.781,0 1.239,0.341 1.239,0.993 0,1.376 -1.239,2.657 -4.181,2.657 -2.162,0 -4.266,-1.013 -4.266,-3.232 0,-1.336 0.575,-2.541 3.328,-2.998 2.197,-0.364 2.809,-0.515 2.809,-1.184 0,-0.477 -0.362,-0.959 -1.7,-0.959 -2.561,0 -2.37,1.646 -3.594,1.646 -0.668,0 -0.956,-0.327 -0.956,-1.014 0,-0.954 1.127,-2.597 4.281,-2.597 3.19,0 4.606,1.395 4.606,3.036 C 3.744,-1.454 3.17,-0.555 0,0"
             style="fill:#9a9a9a;fill-opacity:1;fill-rule:nonzero;stroke:none"
             id="path42"
             inkscape:connector-curvature="0" />
        </g>
        <g
           id="g44"
           transform="translate(182.9904,964.6998)">
          <path
             d="m 0,0 c -2.407,0 -2.789,-1.377 -3.114,-1.377 -0.152,0 -0.192,0.078 -0.192,0.419 0,0.327 0.04,0.633 0.04,1.608 v 1.968 c 0,0.669 -0.153,1.067 -1.357,1.067 -1.09,0 -1.433,-0.341 -1.433,-1.067 0,-6.556 0.018,-10.337 0.018,-11.847 0,-0.632 0.248,-0.976 1.091,-0.976 0.648,0 1.031,0.152 1.143,0.745 0.156,0.783 0.135,0.917 0.306,0.917 0.366,0 0.346,-1.798 3.348,-1.798 2.54,0 4.105,2.162 4.105,5.239 C 3.955,-1.739 2.43,0 0,0 m -1.145,-8.294 c -1.339,0 -2.254,1.127 -2.254,3 0,2.199 1.01,2.902 2.367,2.902 1.378,0 2.239,-0.703 2.239,-2.769 0,-2.024 -0.941,-3.133 -2.352,-3.133"
             style="fill:#9a9a9a;fill-opacity:1;fill-rule:nonzero;stroke:none"
             id="path46"
             inkscape:connector-curvature="0" />
        </g>
        <g
           id="g48"
           transform="translate(246.1663,960.0935)">
          <path
             d="m 0,0 c -2.162,0.382 -2.485,0.726 -2.485,1.452 0,0.688 0.611,1.031 1.702,1.031 0.915,0 1.529,-0.284 1.968,-1.031 0.153,-0.269 0.456,-0.61 0.994,-0.61 0.782,0 1.242,0.341 1.242,0.993 0,1.376 -1.242,2.657 -4.185,2.657 -2.16,0 -4.263,-1.013 -4.263,-3.232 0,-1.336 0.574,-2.541 3.325,-2.998 2.198,-0.364 2.809,-0.515 2.809,-1.184 0,-0.477 -0.361,-0.959 -1.701,-0.959 -2.56,0 -2.369,1.646 -3.593,1.646 -0.667,0 -0.953,-0.327 -0.953,-1.014 0,-0.954 1.127,-2.597 4.278,-2.597 3.191,0 4.607,1.395 4.607,3.036 C 3.745,-1.454 3.171,-0.555 0,0"
             style="fill:#9a9a9a;fill-opacity:1;fill-rule:nonzero;stroke:none"
             id="path50"
             inkscape:connector-curvature="0" />
        </g>
        <g
           id="g52"
           transform="translate(210.9464,960.0935)">
          <path
             d="m 0,0 c -2.158,0.382 -2.482,0.726 -2.482,1.452 0,0.688 0.612,1.031 1.703,1.031 0.916,0 1.527,-0.284 1.965,-1.031 0.155,-0.269 0.457,-0.61 0.993,-0.61 0.784,0 1.244,0.341 1.244,0.993 0,1.376 -1.244,2.657 -4.186,2.657 -2.156,0 -4.261,-1.013 -4.261,-3.232 0,-1.336 0.574,-2.541 3.325,-2.998 2.195,-0.364 2.812,-0.515 2.812,-1.184 0,-0.477 -0.365,-0.959 -1.703,-0.959 -2.561,0 -2.37,1.646 -3.594,1.646 -0.669,0 -0.954,-0.327 -0.954,-1.014 0,-0.954 1.127,-2.597 4.278,-2.597 3.194,0 4.607,1.395 4.607,3.036 C 3.747,-1.454 3.175,-0.555 0,0"
             style="fill:#9a9a9a;fill-opacity:1;fill-rule:nonzero;stroke:none"
             id="path54"
             inkscape:connector-curvature="0" />
        </g>
        <g
           id="g56"
           transform="translate(193.272,964.3741)">
          <path
             d="m 0,0 c -1.968,0 -2.314,-1.681 -2.636,-1.681 -0.135,0 -0.191,0.094 -0.29,0.745 C -3.037,-0.21 -3.23,0 -4.03,0 c -0.806,0 -1.053,-0.21 -1.053,-0.839 0,-0.649 -0.077,-3.001 -0.077,-8.066 0,-0.708 0.364,-1.013 1.376,-1.013 1.09,0 1.356,0.327 1.356,1.013 v 3.553 c 0,1.932 0.842,2.887 2.447,2.887 0.976,0 1.109,0.631 1.109,1.337 C 1.128,-0.286 0.784,0 0,0"
             style="fill:#9a9a9a;fill-opacity:1;fill-rule:nonzero;stroke:none"
             id="path58"
             inkscape:connector-curvature="0" />
        </g>
        <g
           id="g60"
           transform="translate(203.1325,964.3741)">
          <path
             d="m 0,0 c -1.013,0 -1.355,-0.248 -1.355,-0.839 0,-0.612 0.036,-1.434 0.036,-3.802 0,-2.106 -0.67,-3.156 -2.027,-3.156 -1.106,0 -1.738,0.841 -1.738,2.522 0,0.976 0.042,4.073 0.042,4.415 0,0.748 -0.401,0.918 -1.379,0.918 -1.089,0 -1.358,-0.324 -1.358,-0.956 0,-3.383 0.023,-1.969 0.023,-5.028 0,-2.806 1.086,-4.201 3.323,-4.201 2.733,0 2.83,1.968 3.153,1.968 0.173,0 0.173,-0.363 0.267,-0.784 0.133,-0.592 0.383,-0.936 1.223,-0.936 0.802,0 1.147,0.383 1.147,1.013 0,0.649 0.058,6.839 0.058,7.987 C 1.415,-0.172 0.976,0 0,0"
             style="fill:#9a9a9a;fill-opacity:1;fill-rule:nonzero;stroke:none"
             id="path62"
             inkscape:connector-curvature="0" />
        </g>
        <g
           id="g64"
           transform="translate(173.8883,957.2421)">
          <path
             d="m 0,-2.661688 c -1.684,0.316 -1.424,2.50799996 0,2.68299996 2.211,0.266 2.234,-3.10299996 0,-2.68299996"
             style="fill:#9a9a9a;fill-opacity:1;fill-rule:nonzero;stroke:none"
             id="path66"
             inkscape:connector-curvature="0" />
        </g>
        <g
           id="g68"
           transform="translate(78.4075,959.6652)">
          <path
             d="m 0,0 c 0,1.754 -0.936,2.728 -2.339,2.728 -1.13,0 -2.221,-0.994 -2.221,-2.767 0,-2.241 0.896,-3.216 2.28,-3.216 C -0.897,-3.255 0,-2.436 0,0 m -4.619,-5.905 c 0,-0.507 0.039,-1.189 0.039,-1.579 0,-0.623 -0.253,-0.936 -1.384,-0.936 -0.818,0 -1.422,0.176 -1.422,0.936 0,5.204 0.058,10.894 0.058,11.557 0,0.663 0.137,0.936 1.15,0.936 0.76,0 0.935,-0.176 1.15,-1.053 0.097,-0.389 0.175,-0.506 0.312,-0.506 0.448,0 0.779,1.676 3.215,1.676 2.514,0 4.288,-1.852 4.288,-5.36 0,-3.333 -2.085,-5.203 -4.405,-5.203 -2.046,0 -2.514,1.091 -2.826,1.091 -0.116,0 -0.175,-0.078 -0.175,-0.234 z"
             style="fill:#de5945;fill-opacity:1;fill-rule:nonzero;stroke:none"
             id="path70"
             inkscape:connector-curvature="0" />
        </g>
        <g
           id="g72"
           transform="translate(88.8533,960.6397)">
          <path
             d="m 0,0 c 0.37,0 0.487,0.136 0.487,0.448 0,0.721 -0.682,1.696 -2.338,1.696 -1.716,0 -2.398,-1.053 -2.398,-1.735 C -4.249,0.117 -4.171,0 -3.82,0 Z m -1.949,-6.373 c -3.099,0 -5.028,2.105 -5.028,5.437 0,2.982 1.813,5.106 5.048,5.106 3.04,0 4.774,-1.5 4.774,-4.17 0,-1.169 -0.37,-1.403 -1.13,-1.403 -0.546,0 -5.125,0.019 -5.574,0.019 -0.428,0 -0.468,-0.195 -0.468,-0.507 0,-1.325 1.014,-2.319 2.495,-2.319 2.436,0 1.988,1.579 3.411,1.579 0.506,0 0.974,-0.351 0.974,-1.013 0,-0.975 -1.208,-2.729 -4.502,-2.729"
             style="fill:#de5945;fill-opacity:1;fill-rule:nonzero;stroke:none"
             id="path74"
             inkscape:connector-curvature="0" />
        </g>
        <g
           id="g76"
           transform="translate(95.3818,955.4947)">
          <path
             d="m 0,0 c 0,-0.702 -0.273,-1.033 -1.384,-1.033 -1.032,0 -1.403,0.312 -1.403,1.033 0,5.164 0.078,7.562 0.078,8.224 0,0.643 0.253,0.858 1.072,0.858 0.818,0 1.013,-0.215 1.13,-0.955 0.098,-0.663 0.156,-0.76 0.293,-0.76 0.331,0 0.682,1.715 2.689,1.715 0.799,0 1.15,-0.293 1.15,-1.15 C 3.625,7.211 3.488,6.568 2.495,6.568 0.857,6.568 0,5.593 0,3.625 Z"
             style="fill:#de5945;fill-opacity:1;fill-rule:nonzero;stroke:none"
             id="path78"
             inkscape:connector-curvature="0" />
        </g>
        <g
           id="g80"
           transform="translate(104.0152,956.2546)">
          <path
             d="m 0,0 c 1.364,0 1.734,0.487 1.734,0.974 0,0.682 -0.623,0.839 -2.865,1.209 -2.806,0.468 -3.39,1.695 -3.39,3.059 0,2.261 2.143,3.294 4.346,3.294 3.001,0 4.267,-1.306 4.267,-2.709 0,-0.663 -0.467,-1.013 -1.266,-1.013 -0.546,0 -0.858,0.35 -1.014,0.623 -0.448,0.761 -1.071,1.053 -2.007,1.053 -1.111,0 -1.734,-0.351 -1.734,-1.053 0,-0.74 0.331,-1.091 2.533,-1.481 3.235,-0.565 3.82,-1.481 3.82,-2.865 0,-1.676 -1.442,-3.098 -4.697,-3.098 -3.216,0 -4.366,1.676 -4.366,2.65 0,0.702 0.293,1.033 0.975,1.033 C -2.417,1.676 -2.612,0 0,0"
             style="fill:#de5945;fill-opacity:1;fill-rule:nonzero;stroke:none"
             id="path82"
             inkscape:connector-curvature="0" />
        </g>
        <g
           id="g84"
           transform="translate(116.7804,959.6652)">
          <path
             d="m 0,0 c 0,1.754 -0.936,2.728 -2.339,2.728 -1.13,0 -2.222,-0.994 -2.222,-2.767 0,-2.241 0.897,-3.216 2.281,-3.216 C -0.897,-3.255 0,-2.436 0,0 m -4.619,-5.905 c 0,-0.507 0.039,-1.189 0.039,-1.579 0,-0.623 -0.253,-0.936 -1.384,-0.936 -0.818,0 -1.422,0.176 -1.422,0.936 0,5.204 0.058,10.894 0.058,11.557 0,0.663 0.137,0.936 1.15,0.936 0.76,0 0.935,-0.176 1.15,-1.053 0.097,-0.389 0.175,-0.506 0.312,-0.506 0.448,0 0.779,1.676 3.215,1.676 2.514,0 4.288,-1.852 4.288,-5.36 0,-3.333 -2.086,-5.203 -4.405,-5.203 -2.046,0 -2.514,1.091 -2.826,1.091 -0.117,0 -0.175,-0.078 -0.175,-0.234 z"
             style="fill:#de5945;fill-opacity:1;fill-rule:nonzero;stroke:none"
             id="path86"
             inkscape:connector-curvature="0" />
        </g>
        <g
           id="g88"
           transform="translate(127.2258,960.6397)">
          <path
             d="m 0,0 c 0.37,0 0.487,0.136 0.487,0.448 0,0.721 -0.682,1.696 -2.338,1.696 -1.715,0 -2.397,-1.053 -2.397,-1.735 C -4.248,0.117 -4.17,0 -3.82,0 Z m -1.949,-6.373 c -3.098,0 -5.028,2.105 -5.028,5.437 0,2.982 1.813,5.106 5.048,5.106 3.04,0 4.774,-1.5 4.774,-4.17 0,-1.169 -0.37,-1.403 -1.13,-1.403 -0.546,0 -5.125,0.019 -5.573,0.019 -0.429,0 -0.468,-0.195 -0.468,-0.507 0,-1.325 1.013,-2.319 2.494,-2.319 2.436,0 1.988,1.579 3.411,1.579 0.506,0 0.974,-0.351 0.974,-1.013 0,-0.975 -1.208,-2.729 -4.502,-2.729"
             style="fill:#de5945;fill-opacity:1;fill-rule:nonzero;stroke:none"
             id="path90"
             inkscape:connector-curvature="0" />
        </g>
        <g
           id="g92"
           transform="translate(130.5972,959.7432)">
          <path
             d="M 0,0 C 0,2.865 1.813,5.067 5.165,5.067 8.302,5.067 9.686,3.41 9.686,1.501 9.686,0.819 9.179,0.468 8.38,0.468 7.874,0.468 7.484,0.663 7.328,1.072 6.88,2.261 6.724,2.845 5.067,2.845 c -1.462,0 -2.436,-0.896 -2.436,-3.04 0,-1.871 0.955,-3.118 2.631,-3.118 2.436,0 1.969,1.579 3.391,1.579 0.507,0 0.974,-0.351 0.974,-1.014 0,-0.974 -1.169,-2.728 -4.462,-2.728 C 1.715,-5.476 0,-3.079 0,0"
             style="fill:#de5945;fill-opacity:1;fill-rule:nonzero;stroke:none"
             id="path94"
             inkscape:connector-curvature="0" />
        </g>
        <g
           id="g96"
           transform="translate(145.2523,962.5106)">
          <path
             d="m 0,0 c -0.39,0 -0.429,-0.117 -0.429,-0.409 0,-1.072 -0.019,-4.015 -0.019,-4.619 0,-0.741 0.253,-1.111 0.877,-1.111 0.565,0 0.604,0.234 1.072,0.234 0.506,0 0.877,-0.331 0.877,-1.033 0,-0.858 -0.858,-1.325 -2.553,-1.325 -2.027,0 -2.963,1.091 -2.963,2.826 0,1.812 -0.019,3.488 -0.019,5.028 C -3.157,-0.117 -3.196,0 -3.43,0 h -0.702 c -0.37,0 -0.545,0.175 -0.545,0.877 0,0.507 0.156,0.838 0.623,0.916 0.644,0.097 0.897,0.234 0.897,0.545 0,0.546 0.019,1.443 0.019,1.949 0,0.78 0.41,1.111 1.384,1.111 0.974,0 1.345,-0.312 1.345,-1.071 V 2.378 c 0,-0.254 0.097,-0.312 0.292,-0.312 H 1.637 C 2.124,2.066 2.358,1.871 2.358,1.033 2.358,0.214 2.144,0 1.579,0 Z"
             style="fill:#de5945;fill-opacity:1;fill-rule:nonzero;stroke:none"
             id="path98"
             inkscape:connector-curvature="0" />
        </g>
        <g
           id="g100"
           transform="translate(149.9686,954.4034)">
          <path
             d="m 0,0 c -1.091,0 -1.423,0.273 -1.423,1.013 0,0.507 0.059,7.114 0.059,8.185 0,0.722 0.195,0.975 1.364,0.975 1.013,0 1.306,-0.37 1.306,-1.091 0,-1.17 0.019,-7.172 0.019,-8.147 C 1.325,0.214 1.091,0 0,0 m -0.039,11.264 c -1.052,0 -1.695,0.682 -1.695,1.618 0,0.935 0.545,1.715 1.676,1.715 1.247,0 1.754,-0.76 1.754,-1.832 0,-0.858 -0.761,-1.501 -1.735,-1.501"
             style="fill:#de5945;fill-opacity:1;fill-rule:nonzero;stroke:none"
             id="path102"
             inkscape:connector-curvature="0" />
        </g>
        <g
           id="g104"
           transform="translate(160.6284,964.5763)">
          <path
             d="m 0,0 c 0.429,0 0.643,-0.214 0.643,-0.604 0,-0.175 -0.039,-0.37 -0.117,-0.585 -0.194,-0.584 -0.351,-1.189 -1.228,-3.742 -0.837,-2.436 -0.993,-2.825 -1.227,-3.527 -0.468,-1.345 -0.955,-1.734 -2.008,-1.734 -1.305,0 -1.637,0.409 -2.104,1.773 -0.234,0.682 -0.292,0.819 -1.209,3.586 -0.37,1.111 -0.779,2.222 -0.994,2.884 -0.272,0.799 -0.331,1.053 -0.331,1.384 0,0.312 0.176,0.565 0.643,0.565 h 0.936 c 0.584,0 0.857,-0.253 0.993,-0.818 0.196,-0.643 0.39,-1.267 0.799,-2.748 0.994,-3.606 0.955,-3.723 1.326,-3.723 0.253,0 0.292,0.293 0.818,2.222 0.468,1.754 0.897,3.449 1.092,4.268 C -1.832,-0.195 -1.481,0 -0.896,0 Z"
             style="fill:#de5945;fill-opacity:1;fill-rule:nonzero;stroke:none"
             id="path106"
             inkscape:connector-curvature="0" />
        </g>
        <g
           id="g108"
           transform="translate(168.6186,960.6397)">
          <path
             d="m 0,0 c 0.37,0 0.487,0.136 0.487,0.448 0,0.721 -0.682,1.696 -2.338,1.696 -1.715,0 -2.397,-1.053 -2.397,-1.735 C -4.248,0.117 -4.17,0 -3.82,0 Z m -1.949,-6.373 c -3.098,0 -5.028,2.105 -5.028,5.437 0,2.982 1.813,5.106 5.048,5.106 3.04,0 4.774,-1.5 4.774,-4.17 0,-1.169 -0.37,-1.403 -1.13,-1.403 -0.546,0 -5.125,0.019 -5.573,0.019 -0.429,0 -0.468,-0.195 -0.468,-0.507 0,-1.325 1.013,-2.319 2.494,-2.319 2.436,0 1.988,1.579 3.411,1.579 0.506,0 0.974,-0.351 0.974,-1.013 0,-0.975 -1.208,-2.729 -4.502,-2.729"
             style="fill:#de5945;fill-opacity:1;fill-rule:nonzero;stroke:none"
             id="path110"
             inkscape:connector-curvature="0" />
        </g>
      </g>
    </g>
    <g
       id="g112"
       transform="matrix(0.35277777,0,0,-0.35277777,42.583817,40.827164)">
      <path
         d="M 0,0 -5.308,-3.064 5.749,-9.45 16.806,-3.067 11.5,-0.002 5.749,-3.321 Z"
         style="fill:#de5945;fill-opacity:1;fill-rule:nonzero;stroke:none"
         id="path114"
         inkscape:connector-curvature="0" />
    </g>
    <g
       id="g116"
       transform="matrix(0.35277777,0,0,-0.35277777,44.612497,39.656224)">
      <path
         d="m 0,0 5.75,-3.321 5.307,3.063 -11.056,6.387 -11.058,-6.383 5.306,-3.065 z"
         style="fill:#f7d1d1;fill-opacity:1;fill-rule:nonzero;stroke:none"
         id="path118"
         inkscape:connector-curvature="0" />
    </g>
    <g
       id="g120"
       transform="matrix(0.35277777,0,0,-0.35277777,42.583817,40.827164)">
      <path
         d="M 0,0 5.749,-3.321 11.5,-0.002 5.751,3.319 Z"
         style="fill:#4a2619;fill-opacity:1;fill-rule:nonzero;stroke:none"
         id="path122"
         inkscape:connector-curvature="0" />
    </g>
    <g
       id="g105"
       transform="translate(2.0045215,14.232102)">
      <path
         inkscape:connector-curvature="0"
         id="path66-7"
         style="fill:#000000;fill-opacity:1;fill-rule:nonzero;stroke:none;stroke-width:0.35277775"
         d="m 75.174778,28.621761 c -0.594077,-0.111478 -0.502355,-0.884767 0,-0.946503 0.779992,-0.09384 0.788106,1.09467 0,0.946503" />
      <g
         id="g101"
         transform="translate(0.18898809,-6.8035714)">
        <path
           id="path7"
           d="m 52.281706,32.50417 h -0.219734 c -0.04474,0 -0.0673,0.01782 -0.0673,0.05312 0,0.02256 0.02001,0.06004 0.06003,0.113504 0.04001,0.05312 0.08004,0.126966 0.119692,0.219734 0.04038,0.0935 0.06039,0.202998 0.06039,0.326689 0,0.226644 -0.04111,0.418365 -0.123693,0.576616 -0.08258,0.157887 -0.173895,0.265207 -0.273211,0.323415 -0.09969,0.05785 -0.190992,0.109132 -0.273211,0.153521 -0.08294,0.04438 -0.123692,0.08296 -0.123692,0.113505 0,0.02255 0.04474,0.04803 0.133152,0.07677 0.08877,0.02874 0.186992,0.06112 0.293947,0.09677 0.106588,0.03566 0.204453,0.114234 0.293221,0.236468 0.08913,0.122235 0.133152,0.274667 0.133152,0.456928 0,0.328871 -0.149883,0.595534 -0.449651,0.799987 -0.300132,0.204455 -0.73887,0.306681 -1.316578,0.306681 -0.507131,0 -0.90658,-0.09823 -1.200526,-0.293948 -0.293219,-0.194994 -0.440194,-0.397992 -0.440194,-0.606084 0,-0.107317 0.03238,-0.195721 0.09677,-0.266661 0.06512,-0.07093 0.152795,-0.106589 0.264117,-0.106589 0.08877,0 0.179715,0.02874 0.273574,0.08658 0.09313,0.05712 0.177533,0.120778 0.252839,0.189538 0.07567,0.06876 0.184807,0.132424 0.326324,0.189901 0.142609,0.05748 0.299769,0.08622 0.473299,0.08622 0.507495,0 0.760697,-0.140061 0.760697,-0.419457 0,-0.102228 -0.04547,-0.185899 -0.136425,-0.250292 -0.09131,-0.06439 -0.211365,-0.112418 -0.360157,-0.143335 -0.149157,-0.0313 -0.312138,-0.0622 -0.490761,-0.0935 -0.177168,-0.03128 -0.355429,-0.07931 -0.533326,-0.144063 -0.177531,-0.06439 -0.34124,-0.146247 -0.490032,-0.246654 -0.149156,-0.09969 -0.269209,-0.245563 -0.360159,-0.436555 -0.09095,-0.190993 -0.136425,-0.422367 -0.136425,-0.693396 0,-0.440192 0.144063,-0.798531 0.433282,-1.076835 0.28849,-0.277941 0.704309,-0.41691 1.246728,-0.41691 0.124422,0 0.266663,0.01347 0.426734,0.03965 0.160069,0.02655 0.277939,0.03965 0.353245,0.03965 h 0.973882 c 0.11169,0 0.18699,0.02328 0.227009,0.07022 0.03965,0.0462 0.06003,0.141152 0.06003,0.282669 0,0.137879 -0.02038,0.231739 -0.06003,0.280487 -0.04038,0.0513 -0.109132,0.07567 -0.207,0.07567 z m -0.933138,0.766518 c 0,-0.244471 -0.06985,-0.440192 -0.209909,-0.586803 -0.140425,-0.145881 -0.350336,-0.219732 -0.629731,-0.219732 -0.262661,0 -0.463476,0.07567 -0.603538,0.226645 -0.140061,0.151338 -0.209547,0.344514 -0.209547,0.580254 0,0.240105 0.06949,0.436555 0.209547,0.590076 0.140062,0.15316 0.34124,0.229921 0.603538,0.229921 0.271028,0 0.478755,-0.07677 0.623546,-0.229921 0.143699,-0.153521 0.216094,-0.350335 0.216094,-0.59044 z"
           style="fill:#000000;stroke-width:0.36379591"
           inkscape:connector-curvature="0" />
        <path
           id="path9"
           d="m 56.015342,34.390815 c 0,0.08876 -0.02874,0.184445 -0.08622,0.286672 -0.05747,0.102228 -0.143699,0.203361 -0.256476,0.303406 -0.113504,0.09967 -0.274302,0.182261 -0.483121,0.246653 -0.209182,0.06476 -0.447105,0.09713 -0.713404,0.09713 -0.529322,0 -0.948052,-0.167709 -1.256914,-0.503857 -0.309592,-0.33542 -0.463113,-0.787254 -0.463113,-1.356594 0,-0.520228 0.152067,-0.94114 0.456564,-1.263464 0.304861,-0.322688 0.727956,-0.483848 1.270012,-0.483848 0.520592,0 0.922223,0.123693 1.206711,0.370707 0.284488,0.246654 0.426733,0.598809 0.426733,1.056463 0,0.19063 -0.02984,0.31905 -0.09023,0.383806 -0.05966,0.06439 -0.158979,0.09713 -0.296131,0.09713 -0.06693,0 -0.388897,-0.0015 -0.966604,-0.004 -0.577709,-0.0022 -0.890937,-0.0033 -0.94005,-0.0033 -0.06731,0 -0.110589,0.01306 -0.12988,0.03965 -0.02001,0.02657 -0.02984,0.07093 -0.02984,0.13351 0,0.226282 0.08004,0.415819 0.240105,0.566794 0.159707,0.150975 0.36416,0.226645 0.613361,0.226645 0.156068,0 0.28667,-0.01892 0.393263,-0.05639 0.106959,-0.03785 0.186991,-0.08259 0.240105,-0.13351 0.05311,-0.05093 0.101858,-0.102958 0.146609,-0.156795 0.04403,-0.05312 0.0975,-0.09859 0.159344,-0.136783 0.06258,-0.03785 0.138241,-0.05639 0.226644,-0.05639 0.09386,0 0.172803,0.03128 0.236467,0.0935 0.06403,0.06185 0.09604,0.146247 0.09604,0.252838 z m -2.1795,-1.246729 h 1.306754 c 0.110961,0 0.166619,-0.0513 0.166619,-0.153157 0,-0.14661 -0.06876,-0.280487 -0.206273,-0.400538 -0.137879,-0.12005 -0.336147,-0.180081 -0.593715,-0.180081 -0.266662,0 -0.470023,0.06367 -0.610085,0.189902 -0.140425,0.126593 -0.20991,0.261205 -0.20991,0.403087 0,0.05312 0.0095,0.09022 0.03019,0.110231 0.01928,0.02038 0.0582,0.03055 0.116419,0.03055 z"
           style="fill:#000000;stroke-width:0.36379591"
           inkscape:connector-curvature="0" />
        <path
           id="path11"
           d="m 58.208668,35.324315 c -0.542056,0 -0.972062,-0.160798 -1.289657,-0.483119 -0.318321,-0.322324 -0.4773,-0.754514 -0.4773,-1.296934 0,-0.595534 0.145155,-1.047731 0.436191,-1.356595 0.291402,-0.308862 0.721045,-0.465294 1.290385,-0.470024 0.573342,0 1.010261,0.151339 1.310756,0.45329 0.299768,0.302315 0.449289,0.755968 0.449289,1.359869 0,0.497673 -0.15425,0.921131 -0.462748,1.270012 -0.3085,0.34888 -0.727228,0.523501 -1.256916,0.523501 z M 57.55238,34.297684 c 0.144064,0.17353 0.356157,0.260114 0.636644,0.260114 0.280122,0 0.495489,-0.0935 0.646464,-0.280123 0.150975,-0.187354 0.226646,-0.414 0.226646,-0.679934 0,-0.702854 -0.299769,-1.053554 -0.900031,-1.053554 -0.284853,0 -0.493672,0.10004 -0.627185,0.300132 -0.13351,0.200088 -0.200451,0.451107 -0.200451,0.753422 0.0011,0.292854 0.07348,0.526775 0.217913,0.699943 z"
           style="fill:#000000;stroke-width:0.36379591"
           inkscape:connector-curvature="0" />
        <path
           id="path13"
           d="m 63.843139,34.917592 c 0,0.128781 -0.03019,0.219369 -0.08986,0.269937 -0.06039,0.0513 -0.16589,0.07677 -0.316866,0.07677 -0.146609,0 -0.249563,-0.02146 -0.307044,-0.0633 -0.05747,-0.0422 -0.09569,-0.11642 -0.113505,-0.223372 -0.02255,-0.119691 -0.03784,-0.193174 -0.04693,-0.219732 -0.0091,-0.02619 -0.02655,-0.03965 -0.05312,-0.03965 -0.01819,0 -0.05276,0.0313 -0.102958,0.0935 -0.05166,0.06257 -0.109503,0.132424 -0.173895,0.209911 -0.06476,0.07785 -0.17353,0.147336 -0.326324,0.20991 -0.153522,0.06257 -0.332509,0.0935 -0.537327,0.0935 -0.475845,0 -0.844006,-0.165528 -1.106667,-0.496582 -0.262297,-0.331065 -0.393627,-0.785446 -0.393627,-1.363518 0,-0.533325 0.137879,-0.960059 0.413999,-1.280198 0.275758,-0.320505 0.622456,-0.479846 1.03973,-0.479846 0.213183,0 0.396536,0.02438 0.550422,0.07276 0.153522,0.04947 0.260114,0.102229 0.319777,0.160071 0.06039,0.05748 0.112418,0.111319 0.15716,0.159706 0.04403,0.04911 0.07749,0.07312 0.100044,0.07312 0.0393,0 0.05966,-0.02655 0.05966,-0.08004 0,-0.02255 -0.0026,-0.0815 -0.0069,-0.176804 -0.0047,-0.09531 -0.0087,-0.247382 -0.01347,-0.456928 -0.0047,-0.208819 -0.0069,-0.460202 -0.0069,-0.752694 0,-0.106959 0.03565,-0.184445 0.106959,-0.233558 0.07093,-0.04947 0.193176,-0.07385 0.366706,-0.07385 0.177532,0 0.304133,0.02328 0.380166,0.06985 0.07531,0.04693 0.113505,0.126237 0.113505,0.236832 0,0.05748 -0.0026,0.734505 -0.0069,2.029981 -0.0044,1.295477 -0.0058,2.024159 -0.0058,2.18423 z m -1.766956,-0.340149 c 0.226644,0 0.423094,-0.09568 0.589712,-0.286671 0.166983,-0.190265 0.250293,-0.463841 0.250293,-0.819997 0,-0.293583 -0.07931,-0.524958 -0.236469,-0.696668 -0.157522,-0.171349 -0.352517,-0.256841 -0.583527,-0.256841 -0.253202,0 -0.461294,0.0844 -0.623547,0.253202 -0.161889,0.169167 -0.243379,0.418003 -0.243379,0.747237 0,0.351427 0.07931,0.61518 0.236467,0.793802 0.157887,0.177534 0.361249,0.265936 0.61045,0.265936 z"
           style="fill:#000000;stroke-width:0.36379591"
           inkscape:connector-curvature="0" />
        <path
           id="path15"
           d="m 66.636365,33.257227 v -0.159705 c 0,-0.417638 -0.217915,-0.627185 -0.653378,-0.627185 -0.111318,0 -0.207727,0.01454 -0.290308,0.04328 -0.08259,0.02874 -0.146247,0.0633 -0.193176,0.103315 -0.04657,0.03965 -0.08512,0.09095 -0.11642,0.153159 -0.03128,0.06257 -0.05275,0.113504 -0.0633,0.153521 -0.01128,0.04001 -0.02146,0.08985 -0.0302,0.149883 -0.0084,0.06004 -0.01306,0.09458 -0.01306,0.103316 -0.02692,0.14661 -0.177531,0.220098 -0.45329,0.220098 -0.173531,0 -0.292855,-0.03493 -0.356157,-0.103317 -0.06476,-0.06876 -0.09713,-0.178987 -0.09713,-0.329962 0,-0.111318 0.01306,-0.21937 0.03965,-0.323416 0.02657,-0.104416 0.07677,-0.215002 0.149886,-0.329962 0.07312,-0.115691 0.169165,-0.217187 0.28667,-0.303406 0.117505,-0.08658 0.275756,-0.158251 0.473663,-0.213549 0.19754,-0.0553 0.423458,-0.08331 0.676295,-0.08331 0.515863,0 0.903306,0.118591 1.163783,0.356156 0.259751,0.237558 0.389262,0.614088 0.389262,1.12995 -0.0046,1.071015 -0.0069,1.658182 -0.0069,1.760045 0,0.106588 -0.02765,0.184444 -0.08331,0.23392 -0.0553,0.04911 -0.165528,0.07312 -0.329963,0.07312 -0.19063,0 -0.304498,-0.08876 -0.34015,-0.266299 -0.04001,-0.186991 -0.06693,-0.282305 -0.0804,-0.28667 -0.0046,-0.0046 -0.01086,-0.0069 -0.02037,-0.0069 -0.01782,0 -0.05493,0.03347 -0.113506,0.09931 -0.05785,0.0673 -0.125507,0.139333 -0.20336,0.217186 -0.07822,0.07785 -0.204455,0.149883 -0.380533,0.216823 -0.175349,0.06693 -0.379074,0.09969 -0.610084,0.09969 -0.310682,0 -0.563519,-0.07931 -0.756695,-0.236104 -0.192813,-0.158252 -0.289947,-0.361249 -0.289947,-0.610449 0,-0.19063 0.05639,-0.347426 0.169893,-0.470025 0.113505,-0.122594 0.255749,-0.203725 0.427096,-0.243743 0.170984,-0.03929 0.355794,-0.07385 0.553334,-0.102957 0.197906,-0.02874 0.381987,-0.0502 0.553334,-0.06366 0.171347,-0.01279 0.312864,-0.04874 0.427096,-0.106588 0.114961,-0.05639 0.171712,-0.138607 0.171712,-0.245563 z m -0.01965,0.653742 c 0,-0.07058 -0.02038,-0.10696 -0.06004,-0.10696 -0.02255,0 -0.05639,0.01238 -0.103315,0.03746 -0.04693,0.02365 -0.117864,0.05493 -0.213184,0.09313 -0.09604,0.03785 -0.204091,0.06985 -0.323415,0.09677 -0.03638,0.009 -0.08658,0.01965 -0.153886,0.0302 -0.06693,0.01087 -0.113861,0.02037 -0.143698,0.02655 -0.02947,0.0069 -0.06693,0.01673 -0.113506,0.02984 -0.04657,0.01347 -0.0815,0.02655 -0.102957,0.04001 -0.02219,0.01347 -0.04547,0.03128 -0.06985,0.05312 -0.02438,0.02255 -0.04074,0.04801 -0.0502,0.07677 -0.0088,0.02874 -0.01306,0.06112 -0.01306,0.09713 0,0.08839 0.03819,0.16298 0.116776,0.223007 0.0775,0.06004 0.178261,0.08985 0.303043,0.08985 0.284125,0 0.509679,-0.08623 0.676297,-0.260114 0.166982,-0.173894 0.251018,-0.349245 0.251018,-0.526777 z"
           style="fill:#000000;stroke-width:0.36379591"
           inkscape:connector-curvature="0" />
        <path
           id="path17"
           d="m 70.010208,32.50417 h -0.539873 c -0.06258,0 -0.102229,0.0095 -0.120049,0.02984 -0.01782,0.02038 -0.02655,0.05639 -0.02655,0.110231 0,0.133154 -0.0011,0.415819 -0.0033,0.846553 -0.0026,0.431462 -0.0036,0.675205 -0.0036,0.733777 0,0.253202 0.09969,0.379803 0.299767,0.379803 0.06693,0 0.131695,-0.01306 0.196814,-0.03929 0.06476,-0.02655 0.121149,-0.04001 0.170257,-0.04001 0.08876,0 0.160433,0.0302 0.216457,0.09022 0.05566,0.05966 0.08367,0.147701 0.08367,0.26339 0,0.302313 -0.291765,0.45329 -0.873473,0.45329 -0.337966,0 -0.591533,-0.08404 -0.759971,-0.253202 -0.169164,-0.169167 -0.253564,-0.406361 -0.253564,-0.713405 0,-0.213549 -0.0011,-0.510769 -0.0033,-0.893483 -0.0026,-0.38235 -0.0033,-0.657743 -0.0033,-0.82618 0,-0.0935 -0.03128,-0.140062 -0.09385,-0.140062 h -0.239756 c -0.06693,0 -0.114233,-0.02146 -0.143699,-0.06403 -0.02911,-0.04147 -0.04329,-0.120778 -0.04329,-0.236104 0,-0.186627 0.07093,-0.291036 0.213183,-0.313228 0.204455,-0.03093 0.307408,-0.0935 0.307408,-0.186627 0,-0.0622 7.28e-4,-0.174259 0.0033,-0.336875 0.0022,-0.162252 0.0033,-0.27212 0.0033,-0.329962 0,-0.133154 0.03784,-0.22992 0.113506,-0.289946 0.07531,-0.06004 0.195358,-0.09022 0.359065,-0.09022 0.1648,0 0.282305,0.02911 0.354336,0.08623 0.07058,0.05821 0.106589,0.15134 0.106589,0.280488 v 0.666474 c 0,0.07093 0.03347,0.106589 0.09931,0.106589 h 0.5999 c 0.08877,0 0.152065,0.02401 0.189536,0.07348 0.03783,0.04911 0.05639,0.142609 0.05639,0.280125 0,0.137878 -0.02,0.231736 -0.05966,0.280486 -0.03892,0.0473 -0.108046,0.07166 -0.205543,0.07166 z"
           style="fill:#000000;stroke-width:0.36379591"
           inkscape:connector-curvature="0" />
        <path
           id="path19"
           d="m 72.916937,33.257227 v -0.159705 c 0,-0.417638 -0.217913,-0.627185 -0.653377,-0.627185 -0.111318,0 -0.207364,0.01454 -0.29031,0.04328 -0.08223,0.02874 -0.146245,0.0633 -0.193174,0.103315 -0.04657,0.03965 -0.08477,0.09095 -0.116048,0.153159 -0.03128,0.06257 -0.05312,0.113504 -0.06366,0.153521 -0.01086,0.04001 -0.02146,0.08985 -0.0302,0.149883 -0.0084,0.06004 -0.01279,0.09458 -0.01279,0.103316 -0.02692,0.14661 -0.177898,0.220098 -0.45329,0.220098 -0.173895,0 -0.29322,-0.03493 -0.356521,-0.103317 -0.06476,-0.06876 -0.09677,-0.178987 -0.09677,-0.329962 0,-0.111318 0.01306,-0.21937 0.03929,-0.323416 0.02655,-0.104416 0.07677,-0.215002 0.149883,-0.329962 0.07312,-0.115691 0.169165,-0.217187 0.286672,-0.303406 0.117505,-0.08658 0.275757,-0.158251 0.473661,-0.213549 0.197543,-0.0553 0.423459,-0.08331 0.676298,-0.08331 0.515863,0 0.903669,0.118591 1.163783,0.356156 0.25975,0.237558 0.389626,0.614088 0.389626,1.12995 -0.005,1.071015 -0.0073,1.658182 -0.0073,1.760045 0,0.106588 -0.02765,0.184444 -0.08331,0.23392 -0.05566,0.04911 -0.165527,0.07312 -0.329963,0.07312 -0.190993,0 -0.304497,-0.08876 -0.340513,-0.266299 -0.03965,-0.186991 -0.06693,-0.282305 -0.0804,-0.28667 -0.0044,-0.0046 -0.01086,-0.0069 -0.02,-0.0069 -0.01782,0 -0.0553,0.03347 -0.113505,0.09931 -0.05785,0.0673 -0.125507,0.139333 -0.203362,0.217186 -0.07785,0.07785 -0.204453,0.149883 -0.380165,0.216823 -0.175714,0.06693 -0.379076,0.09969 -0.610087,0.09969 -0.311044,0 -0.563884,-0.07931 -0.756695,-0.236104 -0.193176,-0.158252 -0.290309,-0.361249 -0.290309,-0.610449 0,-0.19063 0.05639,-0.347426 0.170257,-0.470025 0.113505,-0.122594 0.255748,-0.203725 0.426732,-0.243743 0.170984,-0.03929 0.355792,-0.07385 0.553334,-0.102957 0.197904,-0.02874 0.382349,-0.0502 0.553333,-0.06366 0.171348,-0.01279 0.31323,-0.04874 0.427097,-0.106588 0.114961,-0.05639 0.17171,-0.138607 0.17171,-0.245563 z m -0.02,0.653742 c 0,-0.07058 -0.02,-0.10696 -0.06004,-0.10696 -0.02255,0 -0.05639,0.01238 -0.103315,0.03746 -0.04693,0.02365 -0.117877,0.05493 -0.213184,0.09313 -0.09604,0.03785 -0.203726,0.06985 -0.323414,0.09677 -0.03639,0.009 -0.08658,0.01965 -0.153522,0.0302 -0.0673,0.01087 -0.114233,0.02037 -0.144064,0.02655 -0.02947,0.0069 -0.06693,0.01673 -0.113504,0.02984 -0.04657,0.01347 -0.08185,0.02655 -0.103315,0.04001 -0.02146,0.01347 -0.04547,0.03128 -0.06985,0.05312 -0.02401,0.02255 -0.04038,0.04801 -0.0502,0.07677 -0.0086,0.02874 -0.01306,0.06112 -0.01306,0.09713 0,0.08839 0.03857,0.16298 0.116777,0.223007 0.0775,0.06004 0.178624,0.08985 0.303043,0.08985 0.284488,0 0.510042,-0.08623 0.67666,-0.260114 0.166983,-0.173894 0.251019,-0.349245 0.251019,-0.526777 z"
           style="fill:#000000;stroke-width:0.36379591"
           inkscape:connector-curvature="0" />
      </g>
    </g>
  </g>
</svg>
