<?xml version="1.0" encoding="UTF-8" standalone="no"?>
<!-- Created with Inkscape (http://www.inkscape.org/) -->

<svg
   version="1.1"
   id="svg2"
   xml:space="preserve"
   width="307.86667"
   height="100.17333"
   viewBox="0 0 307.86667 100.17333"
   xmlns="http://www.w3.org/2000/svg"
   xmlns:svg="http://www.w3.org/2000/svg"><defs
     id="defs6" /><g
     id="g8"
     transform="matrix(1.3333333,0,0,-1.3333333,0,100.17333)"><g
       id="g10"
       transform="scale(0.1)"><path
         d="m 172.914,552.629 c -12.508,-4.68 -25.152,-9.938 -38.387,-15.582 C 121.305,531.402 108.426,525.813 96.1016,519.918 83.7578,514.016 72.7617,508.02 63.8828,501.07 52.8984,492.465 48.4922,484.617 50.3477,477.125 c 1.8554,-7.492 10.0312,-13.719 23.9961,-17.289 11.0234,-2.906 16.7851,-4.453 28.7262,-7.695 8.918,-2.243 15.051,-6.735 18.586,-13.95 3.535,-7.23 4.383,-16.203 2.84,-27.043 -1.93,-13.539 -6.719,-23.902 -15.094,-32.914 -8.39,-9.027 -19.6598,-12.777 -33.3786,-11.636 -14.6015,1.211 -25.4218,6.937 -33.0468,16.914 -7.6289,9.961 -11.0078,19.461 -9.1211,31.32 -10.9571,0.766 -16.3008,1.211 -26.61331,2.207 -1.9336,-12.738 0.73437,-25.199 6.09371,-38.312 5.3711,-13.125 13.0977,-23.497 23.4297,-31.395 10.3203,-7.902 23.0157,-12.891 38.5235,-14.648 14.414,-1.633 27.6369,0.566 39.4259,6.894 11.765,6.317 21.414,16.133 28.582,29.742 7.156,13.578 11.277,27.668 13.437,42.961 2.668,18.867 1.551,33.914 -4.043,45.367 -5.593,11.469 -15.293,17.993 -29.461,20.707 -11.613,2.297 -17.191,3.356 -27.812,5.25 -8.0274,1.348 -12.4922,4.391 -13.2227,8.688 -0.7344,4.285 2.1289,9.344 8.6914,15.301 7.2852,6.617 16.5703,12.23 27.3833,17.336 10.789,5.086 21.816,9.449 33.328,13.015 11.718,3.641 18.679,4.668 20.879,2.285 2.207,-2.386 0.117,-8.968 -6.653,-18.464 11.899,2.625 17.981,4.004 30.305,6.875 10.32,16.922 13.816,26.988 9.973,30.355 -3.868,3.375 -14.758,0.531 -33.188,-6.367"
         style="fill:#406225;fill-opacity:1;fill-rule:nonzero;stroke:none"
         id="path12" /><path
         d="m 388.082,588.875 c -10.508,-3.75 -20.019,-10.301 -28.633,-19.512 -6.211,-6.644 -11.164,-13.98 -14.765,-22.133 -0.528,-0.148 -1.075,-0.304 -1.59,-0.441 0.34,6.066 -0.332,10.879 -2.071,14.395 -3.418,6.898 -10.636,8.281 -21.964,4.785 -10.364,-3.192 -19.805,-8.856 -28.418,-16.871 -6.231,-5.789 -11.336,-12.231 -15.235,-19.477 -0.672,-0.156 -1.386,-0.32 -2.246,-0.523 3.621,9.336 5.535,13.937 9.524,23.043 -11.555,-3.239 -17.286,-4.789 -28.633,-7.793 -36.446,-68.051 -40.879,-139.371 -46.153,-214.586 12.45,-0.039 18.758,0.011 31.485,0.234 5.176,77.184 6.531,115.109 26.98,176.422 2.754,8.262 6.848,14.883 11.973,20.117 5.117,5.215 11.211,8.75 18.234,10.504 6.993,1.746 11.649,0.856 14.039,-2.84 2.395,-3.683 2.231,-10.078 -0.379,-19.168 -17.664,-57.457 -25.144,-123.804 -26.203,-183.578 11.321,0.535 17.024,0.848 28.489,1.59 1.593,61.75 9.011,128.961 25.742,188.691 2.402,9.176 6.406,16.672 11.769,22.711 5.371,6.043 11.5,10.141 18.414,12.188 7.161,2.129 11.899,1.172 14.329,-3.074 2.414,-4.231 2.507,-11.25 0.351,-20.993 -15.312,-64.527 -19.726,-129.98 -24.453,-195.878 13.43,1.25 20.176,1.953 33.699,3.496 4.856,67.449 9.477,134.586 23.274,200.968 3.703,19.106 3.261,33.172 -1.336,41.946 -4.602,8.773 -13.203,10.425 -26.223,5.777"
         style="fill:#406225;fill-opacity:1;fill-rule:nonzero;stroke:none"
         id="path14" /><path
         d="m 620.16,471.574 c -1.324,-18.554 -8.269,-34.328 -21.148,-48.242 -12.91,-13.949 -28.977,-21.957 -48.157,-24.945 -16.789,-2.614 -29.621,-0.035 -38.542,8.058 -8.918,8.086 -13.032,19.875 -11.758,35.875 1.187,14.981 6.277,27.61 15.086,38.219 8.75,10.531 20,17.57 33.535,20.566 30.293,6.711 45.137,9.458 74.211,13.793 -1.321,-17.304 -1.977,-25.953 -3.227,-43.324 z m 27.66,190.473 c -13.761,15.051 -33.047,18.367 -59.433,8.973 -24.153,-8.606 -45.813,-24.7 -64.856,-45.778 -19.023,-21.066 -32.109,-43.574 -38.078,-67.699 16.652,6.086 24.887,8.926 41.113,14.18 2.954,12.382 9.829,23.757 20.356,34.125 10.508,10.347 22.781,18.015 36.726,22.304 15.957,4.903 27.547,3.145 35.301,-4.886 7.739,-8.024 10.957,-21.821 9.563,-40.7 -0.899,-12.218 -1.367,-18.316 -2.293,-30.511 -29.094,-5.008 -43.985,-8.149 -74.453,-15.774 -25.403,-6.363 -46.993,-20.101 -64.114,-39.293 -17.129,-19.203 -26.679,-40.992 -28.691,-66.996 -1.981,-25.722 4.336,-46.308 18.406,-59.109 14.067,-12.801 34.035,-16.903 60.102,-13.063 23.054,3.407 41.992,11.852 56.883,26.5 12.968,12.758 20.847,29.344 23.652,48.215 0.117,0.016 0.215,0.028 0.351,0.039 -1.535,-24.738 -2.539,-36.738 -4.902,-60.039 15.43,1.496 23.086,2.129 38.301,3.176 5.449,71.648 10.09,143.25 14.402,214.977 1.75,31.875 -4.597,56.32 -18.336,71.359"
         style="fill:#406225;fill-opacity:1;fill-rule:nonzero;stroke:none"
         id="path16" /><path
         d="m 771.52,378.453 c 5.261,67.473 6.914,135.957 6.433,203.613 -0.144,25.387 3.481,45.36 10.649,59.473 7.168,14.141 17.039,21.227 29.961,20.32 13.132,-0.929 23.699,-9.425 32.156,-24.664 8.469,-15.269 14.094,-54.832 15.957,-81.007 0.429,-6.036 0.637,-9.036 1.008,-15.028 12.703,-1.933 18.855,-3.023 30.8,-5.43 -0.683,7.883 -1.054,11.856 -1.847,19.829 -3.719,37.515 -13.594,88.148 -27.52,113.246 -13.906,25.093 -29.726,39.218 -48.293,40.562 -16.219,1.176 -27.965,-8.613 -35.703,-27.445 -4.246,-10.344 -7.234,-23.375 -9.051,-38.785 -0.711,22.871 -1.308,35.879 -2.84,60.644 -12.101,-0.457 -18.253,-0.886 -30.824,-2.152 1.848,-107.813 -0.066,-215.25 -8.203,-322.816 15.051,0.082 22.512,0.007 37.317,-0.36"
         style="fill:#406225;fill-opacity:1;fill-rule:nonzero;stroke:none"
         id="path18" /><path
         d="m 928.063,630.871 c 17.402,-5.793 25.632,-9.125 41.378,-16.586 14.461,-59.531 24.293,-123.281 27.704,-184.523 1.543,-24.328 5.765,-43.637 13.455,-57.692 7.71,-14.066 18.17,-21.691 31.33,-24.035 16.7,-2.969 24.75,-4.465 40.66,-7.402 0.02,13.562 -0.2,20.547 -1.19,34.98 -15.63,4.465 -23.57,6.668 -40.05,10.918 -10.97,2.828 -16.88,14.52 -18.52,36 -4.15,59.867 -15.37,122.465 -31.193,180.258 21.113,-11.898 30.913,-18.652 49.503,-33.535 -6.51,18.789 -10.08,28.434 -17.93,48.254 -17.13,16.199 -26.249,23.48 -46.015,36.176 -12.035,39.347 -17.773,58.046 -28.351,83.824 -6.914,5.902 -10.508,8.668 -17.93,13.777 9.375,-26.633 14.539,-45.586 25.449,-85.402 -14.785,7.863 -22.547,11.336 -38.957,17.277 4.739,-21.289 6.86,-31.738 10.657,-52.289"
         style="fill:#406225;fill-opacity:1;fill-rule:nonzero;stroke:none"
         id="path20" /><path
         d="m 145.941,283.18 c -11.714,-85.176 -18.296,-117.344 -9.949,-172.149 0.625,-3.738 1.348,-7.547 2.16,-11.3865 0.809,-3.7968 1.766,-7.4101 2.821,-10.7695 1.054,-3.3516 2.019,-6.1055 2.832,-8.293 -1.153,2.336 -2.649,5.293 -4.414,8.9063 -1.786,3.6445 -3.575,7.5117 -5.325,11.6407 -1.753,4.141 -3.433,8.234 -5.046,12.246 -22.481,58.73 -25.34,91.523 -31.8169,174.961 -12.1875,1.582 -18.164,2.453 -29.7929,4.355 -8.7891,-78.691 -12.8438,-107.39 3.7109,-155.3 1.082,-3.223 2.3828,-6.543 3.9062,-9.922 1.5235,-3.36 3.1524,-6.516 4.8516,-9.492 1.6914,-2.961 3.125,-5.344 4.2383,-7.168 -1.3945,2.011 -3.2109,4.609 -5.3594,7.82 -2.168,3.234 -4.375,6.699 -6.6328,10.422 -2.2461,3.738 -4.3242,7.41 -6.2578,11.015 -29.0625,53.34 -33.7813,83.243 -41.9336,160.957 -9.8633,2.196 -14.66016,3.368 -23.93750625,5.821 C 16.8906,218.863 29.4414,178.777 81.4023,106.766 90.1914,99.9492 94.8125,96.707 104.488,90.5156 74.0195,133.426 73.9219,158.453 78.6875,228.172 c 0.3828,4.851 0.7031,9.715 0.9883,14.578 0.2812,4.883 0.6719,9.504 1.1406,13.809 0.4805,4.316 0.8203,7.941 1.0274,10.761 0.2148,-2.89 0.5351,-6.621 1.0039,-11.132 0.4609,-4.5 0.9961,-9.317 1.6328,-14.403 0.625,-5.058 1.2383,-10.187 1.8554,-15.293 10.4493,-73.84 17.3711,-102.656 53.0741,-155.6365 10.813,-5.3594 16.426,-7.8985 28.028,-12.6758 -23.036,72.2583 -3.711,150.5583 7.546,222.9413 -11.785,0.692 -17.593,1.113 -29.043,2.059"
         style="fill:#406225;fill-opacity:1;fill-rule:nonzero;stroke:none"
         id="path22" /><path
         d="m 332.254,69.4883 c -0.52,-10.6445 -5.488,-18.6133 -14.555,-23.75 -9.082,-5.1563 -20.293,-6.3672 -33.922,-3.836 -11.925,2.2149 -21.308,6.629 -28.527,12.9688 -7.207,6.3281 -11.426,13.7969 -12.195,22.7031 -0.727,8.3399 1.726,14.6094 7.398,18.8203 5.637,4.1795 13.711,5.7035 24.074,4.4215 23.172,-2.8707 35.086,-4.023 59.375,-5.8082 C 333.07,84.5586 332.73,79.4609 332.254,69.4883 Z M 302.113,208.445 c -22.117,0.352 -40.73,-4.425 -55.586,-13.8 -14.832,-9.364 -23.386,-21.864 -25.855,-37.43 12.43,-1.555 18.758,-2.246 31.551,-3.477 1.621,7.899 6.582,14.032 15,18.426 8.41,4.387 18.781,6.406 31.015,5.938 14.004,-0.536 24.621,-4.266 31.563,-11.348 6.926,-7.059 9.582,-17.012 8.222,-29.297 -0.878,-7.949 -1.289,-11.855 -2.05,-19.531 -25.11,1.34 -37.422,2.277 -61.438,4.738 -20.015,2.051 -35.652,-0.754 -46.472,-8.008 -10.829,-7.265 -15.243,-18.1169 -13.204,-32.531 2.032,-14.2461 9.524,-26.1797 21.18,-36.6484 11.672,-10.4688 25.902,-17.9805 43.598,-21.9336 15.64,-3.4961 28.093,-2.7539 37.715,2.3437 8.378,4.4336 13.339,11.668 14.644,21.6406 0.102,-0.0117 0.168,-0.0195 0.277,-0.0312 -0.16,-12.8906 -0.05,-19.1211 0.68,-31.2773 11.488,-1.8086 17.309,-2.6368 29.113,-4.1719 -0.515,45.0312 2.801,69.4844 10.176,125.6561 2.727,20.809 -1.953,38.309 -14.543,51.16 -12.594,12.852 -31.402,19.2 -55.586,19.582"
         style="fill:#406225;fill-opacity:1;fill-rule:nonzero;stroke:none"
         id="path24" /><path
         d="m 552.234,306.844 c -15.879,-1.692 -23.859,-4.387 -39.875,-6.438 -4.218,-30.625 -6.601,-57.488 -11.445,-85.418 -26.926,-2.461 -42.012,-4.941 -66.973,-6.699 -2.097,-14.113 -3.171,-20.988 -5.273,-34.414 24.668,1.191 39.27,3.184 65.734,5.078 C 484.027,123.512 478.355,98.6211 469.852,52.4883 466.82,36.0625 469.82,23.7852 478.109,14.8125 486.402,5.83594 499.156,1.01172 516.852,0.59375 539.313,0.0742188 550.691,-0.03125 573.707,0.0078125 576.773,11.4609 578.363,17.3008 581.648,29.2539 558.043,29.0781 546.324,29.0781 523.16,29.293 c -15.43,0.1484 -21.582,7.6093 -18.281,22.9492 10.168,47.207 16.504,72.6678 27.91,129.2498 37.539,2.285 56.301,3.192 93.652,4.473 3.352,14.793 5,22.363 8.157,37.859 -37.657,-1.523 -56.621,-2.636 -94.7,-5.566 5.274,28.488 7.825,57.402 12.336,88.586"
         style="fill:#406225;fill-opacity:1;fill-rule:nonzero;stroke:none"
         id="path26" /><path
         d="m 829.449,150.465 c -1.457,-4.832 -2.351,-7.774 -3.601,-11.758 -41.094,-0.625 -63.274,-0.184 -105.715,-0.711 1.394,4.824 2.09,7.246 3.476,12.149 5.157,18.32 13.575,33.132 25.379,43.562 11.797,10.43 26.172,15.715 43.086,15.461 17.199,-0.254 28.762,-5.93 35.403,-16.289 6.64,-10.383 7.285,-24.68 1.972,-42.414 z m 14.903,79.797 c -11.766,8.359 -26.575,13.133 -44.559,13.562 -17.988,0.442 -34.66,-3.543 -49.98,-11.64 -15.344,-8.114 -28.442,-19.571 -39.282,-33.789 -10.867,-14.247 -18.699,-30.653 -23.64,-48.75 -6.934,-25.43 -18.457,-51.4262 -25.606,-74.813 -5.008,-16.3789 -5.793,-30.1484 -2.488,-41.582 3.301,-11.4375 10.32,-19.8555 21.023,-25.46094 10.684,-5.59375 24.571,-7.8710913 41.848,-6.953122 23.125,1.230472 45.066,6.933592 64.41,17.414062 19.34,10.4688 32.871,23.7773 41.633,40.2031 -13.508,-1.3672 -20.559,-1.8945 -35.438,-2.6367 -5.324,-9.0117 -13.578,-15.8594 -23.957,-20.5859 -10.363,-4.7149 -22.546,-7.4102 -36.562,-7.9961 -16.434,-0.6758 -27.527,2.957 -33.516,11.1133 -5.976,8.1445 -6.316,20.3711 -0.91,37.207 2.649,8.2226 11.867,26.2183 14.485,34.7073 56.535,0.957 88.308,-0.196 140.148,3.261 5.176,14.637 7.691,22.168 12.48,37.704 5.262,17.089 6.161,32.48 2.657,46.015 -3.508,13.516 -10.996,24.668 -22.746,33.02"
         style="fill:#406225;fill-opacity:1;fill-rule:nonzero;stroke:none"
         id="path28" /><path
         d="m 1026.64,249.84 c -14.58,-1.074 -27.386,-7.606 -38.214,-20.098 -5.988,-6.883 -11.321,-15.535 -16.164,-25.515 4.328,14.539 6.523,22.929 10.215,39.304 -10.918,-0.39 -16.504,-0.527 -28.075,-0.672 -19.015,-69.082 -49.281,-154.6402 -85.214,-217.1988 10.878,3.6328 16.082,5.664 26.171,10.1367 24.024,38.789 46.707,81.1251 65.125,131.1131 5.618,15.235 12.891,28.164 22.09,37.695 9.207,9.543 19.366,14.844 30.376,16.282 11.18,1.465 18.35,-1.367 21.49,-7.793 3.14,-6.426 1.9,-16.145 -4.21,-29.055 -1.41,-2.976 -2.13,-4.441 -3.58,-7.351 9.86,3.496 14.73,5.378 24.52,9.46 1.96,3.489 2.93,5.254 4.8,8.848 8.81,16.926 9.83,30.215 4.21,40.391 -5.62,10.176 -16.86,15.695 -33.54,14.453"
         style="fill:#406225;fill-opacity:1;fill-rule:nonzero;stroke:none"
         id="path30" /><path
         d="m 1409.64,458.59 c -0.56,-5.402 -1.09,-11.043 -1.6,-16.953 -0.5,-5.887 -0.91,-11.672 -1.2,-17.332 -0.3,-5.637 -0.46,-10.68 -0.46,-15.114 v -40.113 h 13.32 v 110.477 h -17.86 l -10.9,-35.575 c -0.99,-3.332 -1.9,-6.585 -2.72,-9.753 -0.8,-3.192 -1.46,-5.637 -1.96,-7.344 -0.4,1.707 -1.07,4.152 -1.98,7.344 -0.9,3.168 -1.9,6.375 -3.01,9.601 l -11.51,35.727 h -17.85 V 369.078 h 13.31 v 40.113 c 0,4.938 -0.15,10.278 -0.45,16.02 -0.31,5.762 -0.65,11.527 -1.05,17.336 -0.42,5.805 -0.87,11.293 -1.37,16.484 -0.51,5.196 -1.02,9.774 -1.52,13.699 l 18.01,-55.222 h 14.38 l 17.85,55.222 c -0.4,-4.027 -0.88,-8.757 -1.43,-14.14"
         style="fill:#406225;fill-opacity:1;fill-rule:nonzero;stroke:none"
         id="path32" /><path
         d="m 1500.51,399.645 c 0,-6.457 -1.67,-11.356 -4.99,-14.668 -3.34,-3.34 -7.97,-5.004 -13.92,-5.004 -5.86,0 -10.47,1.664 -13.85,5.004 -3.38,3.312 -5.07,8.211 -5.07,14.668 v 22.085 c 0,6.461 1.69,11.36 5.07,14.692 3.38,3.316 7.99,4.98 13.85,4.98 5.95,0 10.58,-1.664 13.92,-4.98 3.32,-3.332 4.99,-8.231 4.99,-14.692 z m -1.67,50.097 c -4.84,2.512 -10.58,3.781 -17.24,3.781 -6.66,0 -12.41,-1.269 -17.26,-3.781 -4.83,-2.531 -8.59,-6.16 -11.28,-10.914 -2.66,-4.73 -3.99,-10.426 -3.99,-17.098 v -22.085 c 0,-6.563 1.33,-12.243 3.99,-17.012 2.69,-4.793 6.45,-8.465 11.28,-10.981 4.85,-2.535 10.6,-3.773 17.26,-3.773 6.66,0 12.4,1.238 17.24,3.773 4.85,2.516 8.61,6.188 11.28,10.981 2.67,4.769 4.01,10.449 4.01,17.012 v 22.253 c 0,6.543 -1.34,12.2 -4.01,16.93 -2.67,4.754 -6.43,8.383 -11.28,10.914"
         style="fill:#406225;fill-opacity:1;fill-rule:nonzero;stroke:none"
         id="path34" /><path
         d="m 1594.48,369.078 h 13.61 v 55.988 c 0,8.887 -2.47,15.895 -7.41,21.043 -4.93,5.133 -11.59,7.707 -19.97,7.707 -6.96,0 -12.41,-1.793 -16.35,-5.363 -3.25,-2.969 -5.09,-7.019 -5.64,-12.031 h -0.26 v 15.875 h -13.61 v -83.219 h 13.61 v 52.969 c 0,6.461 1.63,11.398 4.92,14.82 3.29,3.438 7.74,5.153 13.39,5.153 5.45,0 9.76,-1.586 12.94,-4.778 3.19,-3.164 4.77,-7.742 4.77,-13.695 v -54.469"
         style="fill:#406225;fill-opacity:1;fill-rule:nonzero;stroke:none"
         id="path36" /><path
         d="m 1709.03,381.492 h -28 v 70.805 h -39.33 v -12.395 h 25.72 v -58.41 h -29.5 v -12.414 h 71.11 v 12.414"
         style="fill:#406225;fill-opacity:1;fill-rule:nonzero;stroke:none"
         id="path38" /><path
         d="m 1672.71,467.285 c 3.33,0 5.96,0.867 7.87,2.574 1.92,1.715 2.88,4.036 2.88,6.969 0,3.02 -0.96,5.406 -2.88,7.18 -1.91,1.769 -4.54,2.66 -7.87,2.66 -3.33,0 -5.95,-0.891 -7.87,-2.66 -1.91,-1.774 -2.87,-4.16 -2.87,-7.18 0,-2.933 0.96,-5.254 2.87,-6.969 1.92,-1.707 4.54,-2.574 7.87,-2.574"
         style="fill:#406225;fill-opacity:1;fill-rule:nonzero;stroke:none"
         id="path40" /><path
         d="m 1790.59,381.492 h -22.69 c -6.06,0 -9.09,3.168 -9.09,9.52 v 48.89 h 33.3 v 12.395 h -33.3 v 23.457 h -13.61 v -23.457 h -23.47 v -12.395 h 23.47 v -48.89 c 0,-6.946 1.98,-12.348 5.98,-16.192 3.97,-3.824 9.55,-5.742 16.72,-5.742 h 22.69 v 12.414"
         style="fill:#406225;fill-opacity:1;fill-rule:nonzero;stroke:none"
         id="path42" /><path
         d="m 1871.25,399.645 c 0,-6.457 -1.67,-11.356 -5,-14.668 -3.33,-3.34 -7.97,-5.004 -13.92,-5.004 -5.86,0 -10.47,1.664 -13.85,5.004 -3.38,3.312 -5.07,8.211 -5.07,14.668 v 22.085 c 0,6.461 1.69,11.36 5.07,14.692 3.38,3.316 7.99,4.98 13.85,4.98 5.95,0 10.59,-1.664 13.92,-4.98 3.33,-3.332 5,-8.231 5,-14.692 z m 9.6,-17.012 c 2.67,4.769 4.01,10.449 4.01,17.012 v 22.253 c 0,6.543 -1.34,12.2 -4.01,16.93 -2.67,4.754 -6.43,8.383 -11.27,10.914 -4.85,2.512 -10.59,3.781 -17.25,3.781 -6.66,0 -12.41,-1.269 -17.26,-3.781 -4.83,-2.531 -8.59,-6.16 -11.27,-10.914 -2.67,-4.73 -4,-10.426 -4,-17.098 v -22.085 c 0,-6.563 1.33,-12.243 4,-17.012 2.68,-4.793 6.44,-8.465 11.27,-10.981 4.85,-2.535 10.6,-3.773 17.26,-3.773 6.66,0 12.4,1.238 17.25,3.773 4.84,2.516 8.6,6.188 11.27,10.981"
         style="fill:#406225;fill-opacity:1;fill-rule:nonzero;stroke:none"
         id="path44" /><path
         d="m 1967.63,418.27 h 13.63 v 4.98 c 0,9.395 -2.6,16.824 -7.8,22.313 -5.19,5.511 -12.17,8.253 -20.95,8.253 -7.67,0 -13.45,-2.3 -17.33,-6.878 -2.16,-2.559 -3.65,-5.856 -4.62,-9.762 v 15.121 h -13.32 v -83.219 h 13.64 v 52.969 c 0,6.461 1.63,11.441 4.9,14.969 3.28,3.543 7.8,5.297 13.55,5.297 5.85,0 10.37,-1.731 13.55,-5.215 3.17,-3.485 4.75,-8.508 4.75,-15.051 v -3.777"
         style="fill:#406225;fill-opacity:1;fill-rule:nonzero;stroke:none"
         id="path46" /><path
         d="m 2041.03,467.285 c 3.32,0 5.95,0.867 7.86,2.574 1.93,1.715 2.88,4.036 2.88,6.969 0,3.02 -0.95,5.406 -2.88,7.18 -1.91,1.769 -4.54,2.66 -7.86,2.66 -3.34,0 -5.96,-0.891 -7.88,-2.66 -1.9,-1.774 -2.87,-4.16 -2.87,-7.18 0,-2.933 0.97,-5.254 2.87,-6.969 1.92,-1.707 4.54,-2.574 7.88,-2.574"
         style="fill:#406225;fill-opacity:1;fill-rule:nonzero;stroke:none"
         id="path48" /><path
         d="m 2077.34,381.492 h -27.99 v 70.805 h -39.34 v -12.395 h 25.72 v -58.41 h -29.5 v -12.414 h 71.11 v 12.414"
         style="fill:#406225;fill-opacity:1;fill-rule:nonzero;stroke:none"
         id="path50" /><path
         d="m 2153.6,423.547 v -54.469 h 13.62 v 55.988 c 0,8.887 -2.47,15.895 -7.41,21.043 -4.94,5.133 -11.6,7.707 -19.97,7.707 -6.96,0 -12.41,-1.793 -16.35,-5.363 -3.25,-2.969 -5.09,-7.019 -5.64,-12.031 h -0.27 v 15.875 h -13.61 v -83.219 h 13.61 v 52.969 c 0,6.461 1.64,11.398 4.93,14.82 3.28,3.438 7.73,5.153 13.39,5.153 5.45,0 9.76,-1.586 12.94,-4.778 3.18,-3.164 4.76,-7.742 4.76,-13.695"
         style="fill:#406225;fill-opacity:1;fill-rule:nonzero;stroke:none"
         id="path52" /><path
         d="m 2247.73,406.148 c 0,-6.25 -1.62,-11.144 -4.83,-14.671 -3.24,-3.528 -7.68,-5.297 -13.32,-5.297 -5.77,0 -10.23,1.707 -13.4,5.148 -3.18,3.418 -4.77,8.363 -4.77,14.82 v 15.899 c 0,6.461 1.59,11.398 4.77,14.82 3.17,3.438 7.63,5.153 13.4,5.153 5.64,0 10.08,-1.778 13.32,-5.297 3.21,-3.532 4.83,-8.43 4.83,-14.676 z m 13.47,-40.085 v 86.234 h -13.47 v -15.875 h -0.2 c -0.46,4.969 -2.35,9.039 -5.85,12.098 -4.03,3.523 -9.44,5.296 -16.2,5.296 -8.56,0 -15.33,-2.765 -20.27,-8.316 -4.94,-5.551 -7.41,-13.066 -7.41,-22.543 v -17.57 c 0,-9.477 2.47,-17.016 7.41,-22.606 4.94,-5.617 11.71,-8.402 20.27,-8.402 6.76,0 12.17,1.75 16.2,5.297 3.5,3.062 5.39,7.129 5.85,12.097 h 0.36 l -0.31,-15.136 v -10.574 c 0,-4.036 -0.98,-7.012 -2.95,-8.938 -1.97,-1.914 -5.07,-2.871 -9.3,-2.871 h -26.49 v -12.41 h 26.34 c 8.17,0 14.54,2.176 19.13,6.504 4.59,4.343 6.89,10.234 6.89,17.715"
         style="fill:#406225;fill-opacity:1;fill-rule:nonzero;stroke:none"
         id="path54" /><path
         d="m 1342.38,294.324 c 3.33,0 5.96,0.867 7.86,2.578 1.92,1.707 2.88,4.032 2.88,6.961 0,3.02 -0.96,5.41 -2.88,7.18 -1.9,1.777 -4.53,2.664 -7.86,2.664 -3.33,0 -5.96,-0.887 -7.87,-2.664 -1.92,-1.77 -2.87,-4.16 -2.87,-7.18 0,-2.929 0.95,-5.254 2.87,-6.961 1.91,-1.711 4.54,-2.578 7.87,-2.578"
         style="fill:#406225;fill-opacity:1;fill-rule:nonzero;stroke:none"
         id="path56" /><path
         d="m 1350.7,279.332 h -39.35 v -12.391 h 25.74 v -58.41 h -29.52 v -12.41 h 71.12 v 12.41 h -27.99 v 70.801"
         style="fill:#406225;fill-opacity:1;fill-rule:nonzero;stroke:none"
         id="path58" /><path
         d="m 1441.2,280.855 c -6.97,0 -12.41,-1.796 -16.35,-5.359 -3.25,-2.98 -5.09,-7.023 -5.64,-12.031 h -0.26 v 15.867 h -13.61 v -83.211 h 13.61 v 52.957 c 0,6.465 1.63,11.406 4.91,14.824 3.29,3.438 7.75,5.149 13.4,5.149 5.45,0 9.76,-1.582 12.94,-4.766 3.18,-3.164 4.77,-7.746 4.77,-13.703 v -54.461 h 13.61 v 55.984 c 0,8.887 -2.47,15.891 -7.41,21.047 -4.93,5.125 -11.59,7.703 -19.97,7.703"
         style="fill:#406225;fill-opacity:1;fill-rule:nonzero;stroke:none"
         id="path60" /><path
         d="m 1637.68,213.445 c -3.68,-3.379 -8.7,-5.07 -15.06,-5.07 h -18.76 v 39.336 h 18.76 c 6.36,0 11.38,-1.875 15.06,-5.684 3.68,-3.777 5.52,-8.691 5.52,-14.734 0,-5.871 -1.84,-10.469 -5.52,-13.848 z m -33.82,80.879 h 18.01 c 5.85,0 10.44,-1.562 13.76,-4.687 3.34,-3.125 5,-7.364 5,-12.707 0,-5.36 -1.69,-9.59 -5.07,-12.715 -3.38,-3.145 -8,-4.707 -13.85,-4.707 h -17.85 z m 39.27,-42.07 c -1.78,0.957 -3.73,1.668 -5.78,2.215 1.61,0.449 3.15,0.996 4.56,1.73 3.89,2 6.89,4.871 9,8.614 2.13,3.73 3.19,8.125 3.19,13.171 0,8.977 -2.85,15.977 -8.56,21.028 -5.69,5.047 -13.59,7.578 -23.67,7.578 h -31.33 V 196.121 h 33.6 c 6.75,0 12.56,1.219 17.4,3.711 4.84,2.469 8.57,6.016 11.19,10.664 2.63,4.637 3.95,10.086 3.95,16.336 0,5.949 -1.2,11.106 -3.57,15.43 -2.36,4.347 -5.69,7.668 -9.98,9.992"
         style="fill:#406225;fill-opacity:1;fill-rule:nonzero;stroke:none"
         id="path62" /><path
         d="m 1722.51,280.855 c -7.68,0 -13.45,-2.304 -17.34,-6.882 -2.16,-2.559 -3.65,-5.852 -4.61,-9.758 v 15.117 h -13.32 v -83.211 h 13.63 v 52.957 c 0,6.465 1.64,11.445 4.91,14.973 3.28,3.543 7.8,5.301 13.55,5.301 5.84,0 10.36,-1.739 13.54,-5.215 3.18,-3.485 4.76,-8.516 4.76,-15.059 v -3.777 h 13.62 v 4.988 c 0,9.395 -2.6,16.828 -7.79,22.316 -5.19,5.508 -12.18,8.25 -20.95,8.25"
         style="fill:#406225;fill-opacity:1;fill-rule:nonzero;stroke:none"
         id="path64" /><path
         d="m 1829.49,226.383 c 0,-6.27 -1.64,-11.121 -4.92,-14.61 -3.27,-3.476 -7.74,-5.203 -13.4,-5.203 -5.54,0 -9.93,1.727 -13.16,5.203 -3.23,3.489 -4.85,8.34 -4.85,14.61 v 52.949 h -13.61 v -52.949 c 0,-9.793 2.88,-17.539 8.62,-23.242 5.75,-5.692 13.42,-8.543 23,-8.543 9.59,0 17.3,2.851 23.16,8.543 5.85,5.703 8.77,13.449 8.77,23.242 v 52.949 h -13.61 v -52.949"
         style="fill:#406225;fill-opacity:1;fill-rule:nonzero;stroke:none"
         id="path66" /><path
         d="m 1912.41,244.078 -11.2,1.817 c -4.34,0.714 -7.51,1.875 -9.53,3.488 -2.03,1.621 -3.03,4.129 -3.03,7.578 0,3.816 1.18,6.687 3.55,8.613 2.37,1.914 6.13,2.871 11.28,2.871 h 5.75 c 4.13,0 7.42,-0.781 9.83,-2.343 2.43,-1.563 3.93,-3.653 4.54,-6.27 h 13.62 c -1,6.348 -3.93,11.395 -8.78,15.137 -4.84,3.711 -11.25,5.594 -19.21,5.594 h -5.75 c -9.49,0 -16.59,-2.051 -21.35,-6.153 -4.73,-4.07 -7.09,-9.851 -7.09,-17.305 0,-7.07 1.98,-12.429 5.97,-16.132 3.98,-3.672 10.06,-6.231 18.22,-7.637 l 11.21,-1.816 c 4.64,-0.704 8.15,-2.09 10.52,-4.161 2.37,-2.07 3.55,-4.851 3.55,-8.398 0,-3.633 -1.31,-6.523 -3.93,-8.699 -2.62,-2.18 -6.61,-3.254 -11.96,-3.254 h -6.36 c -4.44,0 -7.99,0.871 -10.66,2.578 -2.68,1.711 -4.31,4.035 -4.92,6.965 h -13.62 c 0.51,-4.453 1.99,-8.274 4.47,-11.504 2.47,-3.234 5.8,-5.723 9.98,-7.492 4.2,-1.758 9.11,-2.645 14.75,-2.645 h 6.36 c 9.89,0 17.28,2.195 22.17,6.57 4.9,4.387 7.34,10.422 7.34,18.086 0,7.266 -2.04,12.813 -6.13,16.661 -4.08,3.82 -10.62,6.437 -19.59,7.851"
         style="fill:#406225;fill-opacity:1;fill-rule:nonzero;stroke:none"
         id="path68" /><path
         d="m 2006.84,244.078 -11.2,1.817 c -4.34,0.714 -7.52,1.875 -9.53,3.488 -2.03,1.621 -3.03,4.129 -3.03,7.578 0,3.816 1.18,6.687 3.56,8.613 2.36,1.914 6.12,2.871 11.27,2.871 h 5.75 c 4.13,0 7.41,-0.781 9.83,-2.343 2.42,-1.563 3.94,-3.653 4.54,-6.27 h 13.63 c -1.02,6.348 -3.94,11.395 -8.78,15.137 -4.85,3.711 -11.26,5.594 -19.22,5.594 h -5.75 c -9.49,0 -16.6,-2.051 -21.34,-6.153 -4.74,-4.07 -7.11,-9.851 -7.11,-17.305 0,-7.07 1.99,-12.429 5.98,-16.132 3.98,-3.672 10.05,-6.231 18.23,-7.637 l 11.2,-1.816 c 4.64,-0.704 8.14,-2.09 10.52,-4.161 2.36,-2.07 3.55,-4.851 3.55,-8.398 0,-3.633 -1.31,-6.523 -3.93,-8.699 -2.63,-2.18 -6.61,-3.254 -11.96,-3.254 h -6.35 c -4.45,0 -7.99,0.871 -10.68,2.578 -2.66,1.711 -4.31,4.035 -4.91,6.965 h -13.62 c 0.5,-4.453 2,-8.274 4.46,-11.504 2.47,-3.234 5.81,-5.723 9.99,-7.492 4.19,-1.758 9.11,-2.645 14.76,-2.645 h 6.35 c 9.9,0 17.28,2.195 22.17,6.57 4.89,4.387 7.34,10.422 7.34,18.086 0,7.266 -2.05,12.813 -6.13,16.661 -4.08,3.82 -10.61,6.437 -19.59,7.851"
         style="fill:#406225;fill-opacity:1;fill-rule:nonzero;stroke:none"
         id="path70" /><path
         d="m 2074.77,249.078 c 0,6.543 1.67,11.594 5,15.137 3.33,3.527 8.08,5.285 14.23,5.285 6.25,0 11.02,-1.758 14.3,-5.285 3.27,-3.543 4.91,-8.594 4.91,-15.137 v -4.383 h -38.44 z m 36.4,27.852 c -4.89,2.617 -10.62,3.925 -17.17,3.925 -6.57,0 -12.29,-1.308 -17.18,-3.925 -4.89,-2.645 -8.67,-6.317 -11.36,-11.063 -2.66,-4.726 -4,-10.324 -4,-16.789 v -22.695 c 0,-6.348 1.34,-11.942 4,-16.719 2.69,-4.785 6.47,-8.504 11.36,-11.121 4.89,-2.637 10.61,-3.945 17.18,-3.945 8.77,0 16.11,2.039 22.01,6.14 5.91,4.075 9.31,9.61 10.22,16.575 h -13.63 c -0.7,-3.743 -2.66,-6.543 -5.89,-8.399 -3.24,-1.887 -7.47,-2.812 -12.71,-2.812 -6.15,0 -10.9,1.746 -14.23,5.214 -3.33,3.485 -5,8.504 -5,15.067 v 8.027 h 51.76 v 14.668 c 0,6.465 -1.34,12.063 -4.01,16.789 -2.67,4.746 -6.46,8.418 -11.35,11.063"
         style="fill:#406225;fill-opacity:1;fill-rule:nonzero;stroke:none"
         id="path72" /><path
         d="m 2183.28,211.48 c -1.93,1.965 -2.88,4.668 -2.88,8.086 v 87.024 h -41.61 v -12.414 h 27.98 v -74.61 c 0,-4.746 1.02,-8.886 3.04,-12.41 2.01,-3.527 4.84,-6.25 8.48,-8.176 3.62,-1.914 7.86,-2.859 12.7,-2.859 h 26.49 v 12.41 h -26.49 c -3.23,0 -5.81,0.969 -7.71,2.949"
         style="fill:#406225;fill-opacity:1;fill-rule:nonzero;stroke:none"
         id="path74" /><path
         d="m 2302.89,236.227 c -4.09,3.82 -10.62,6.437 -19.59,7.851 l -11.2,1.817 c -4.34,0.714 -7.51,1.875 -9.54,3.488 -2.02,1.621 -3.02,4.129 -3.02,7.578 0,3.816 1.18,6.687 3.55,8.613 2.37,1.914 6.12,2.871 11.28,2.871 h 5.75 c 4.13,0 7.42,-0.781 9.83,-2.343 2.43,-1.563 3.93,-3.653 4.54,-6.27 h 13.62 c -1,6.348 -3.93,11.395 -8.78,15.137 -4.84,3.711 -11.25,5.594 -19.21,5.594 h -5.75 c -9.49,0 -16.59,-2.051 -21.35,-6.153 -4.73,-4.07 -7.1,-9.851 -7.1,-17.305 0,-7.07 1.99,-12.429 5.98,-16.132 3.98,-3.672 10.06,-6.231 18.22,-7.637 l 11.2,-1.816 c 4.65,-0.704 8.16,-2.09 10.53,-4.161 2.36,-2.07 3.55,-4.851 3.55,-8.398 0,-3.633 -1.31,-6.523 -3.93,-8.699 -2.63,-2.18 -6.61,-3.254 -11.96,-3.254 h -6.35 c -4.44,0 -8,0.871 -10.67,2.578 -2.68,1.711 -4.31,4.035 -4.93,6.965 h -13.61 c 0.51,-4.453 1.99,-8.274 4.46,-11.504 2.47,-3.234 5.8,-5.723 9.98,-7.492 4.2,-1.758 9.12,-2.645 14.77,-2.645 h 6.35 c 9.89,0 17.28,2.195 22.17,6.57 4.9,4.387 7.34,10.422 7.34,18.086 0,7.266 -2.04,12.813 -6.13,16.661"
         style="fill:#406225;fill-opacity:1;fill-rule:nonzero;stroke:none"
         id="path76" /></g></g></svg>
