<?xml version="1.0" encoding="UTF-8" standalone="no"?>
<svg
   xmlns:dc="http://purl.org/dc/elements/1.1/"
   xmlns:cc="http://creativecommons.org/ns#"
   xmlns:rdf="http://www.w3.org/1999/02/22-rdf-syntax-ns#"
   xmlns:svg="http://www.w3.org/2000/svg"
   xmlns="http://www.w3.org/2000/svg"
   xmlns:sodipodi="http://sodipodi.sourceforge.net/DTD/sodipodi-0.dtd"
   xmlns:inkscape="http://www.inkscape.org/namespaces/inkscape"
   version="1.1"
   id="Layer_1"
   x="0px"
   y="0px"
   width="335"
   height="35.495998"
   viewBox="0 0 334.99999 35.496"
   enable-background="new 0 0 410.514 35.496"
   xml:space="preserve"
   sodipodi:docname="be-header-iris-fr.svg"
   inkscape:version="1.0.2 (1.0.2+r75+1)"><metadata
   id="metadata118"><rdf:RDF><cc:Work
       rdf:about=""><dc:format>image/svg+xml</dc:format><dc:type
         rdf:resource="http://purl.org/dc/dcmitype/StillImage" /><dc:title></dc:title></cc:Work></rdf:RDF></metadata><defs
   id="defs116" /><sodipodi:namedview
   pagecolor="#ffffff"
   bordercolor="#666666"
   borderopacity="1"
   objecttolerance="10"
   gridtolerance="10"
   guidetolerance="10"
   inkscape:pageopacity="0"
   inkscape:pageshadow="2"
   inkscape:window-width="1920"
   inkscape:window-height="1016"
   id="namedview114"
   showgrid="false"
   inkscape:zoom="2.265076"
   inkscape:cx="214.37324"
   inkscape:cy="-5.4173075"
   inkscape:window-x="1920"
   inkscape:window-y="27"
   inkscape:window-maximized="1"
   inkscape:current-layer="g91" />
<g
   id="spatial_nl">
</g>
<g
   id="g5">
	<path
   fill="#f9faf6"
   stroke="#dcdcdc"
   stroke-width="0.25"
   stroke-miterlimit="10"
   d="m 21.391,0 v 28.922 h 0.021 c 0,0.836 -0.692,1.529 -1.522,1.529 H 1.523 C 0.692,30.451 0,29.758 0,28.922 V 0"
   id="path3" />
</g>
<g
   id="g105">
	<g
   id="g91">
		<g
   enable-background="new    "
   id="g21">
			<path
   fill="#8db63c"
   d="m 36.008,16.479 h -0.604 c -0.123,0 -0.185,0.049 -0.185,0.146 0,0.062 0.055,0.165 0.165,0.312 0.11,0.146 0.22,0.349 0.329,0.604 0.111,0.257 0.166,0.558 0.166,0.898 0,0.623 -0.113,1.15 -0.34,1.585 -0.227,0.434 -0.478,0.729 -0.751,0.889 -0.274,0.159 -0.525,0.3 -0.751,0.422 -0.228,0.122 -0.34,0.228 -0.34,0.312 0,0.062 0.123,0.132 0.366,0.211 0.244,0.079 0.514,0.168 0.808,0.266 0.293,0.098 0.562,0.314 0.806,0.65 0.245,0.336 0.366,0.755 0.366,1.256 0,0.904 -0.412,1.637 -1.236,2.199 -0.825,0.562 -2.031,0.843 -3.619,0.843 -1.394,0 -2.492,-0.27 -3.3,-0.808 -0.806,-0.536 -1.21,-1.094 -1.21,-1.666 0,-0.295 0.089,-0.538 0.266,-0.733 0.179,-0.195 0.42,-0.293 0.726,-0.293 0.244,0 0.494,0.079 0.752,0.238 0.256,0.157 0.488,0.332 0.695,0.521 0.208,0.189 0.508,0.364 0.897,0.522 0.392,0.158 0.824,0.237 1.301,0.237 1.395,0 2.091,-0.385 2.091,-1.153 0,-0.281 -0.125,-0.511 -0.375,-0.688 -0.251,-0.177 -0.581,-0.309 -0.99,-0.394 -0.41,-0.086 -0.858,-0.171 -1.349,-0.257 -0.487,-0.086 -0.977,-0.218 -1.466,-0.396 -0.488,-0.177 -0.938,-0.402 -1.347,-0.678 -0.41,-0.274 -0.74,-0.675 -0.99,-1.2 -0.25,-0.525 -0.375,-1.161 -0.375,-1.906 0,-1.21 0.396,-2.195 1.191,-2.96 0.793,-0.764 1.936,-1.146 3.427,-1.146 0.342,0 0.733,0.037 1.173,0.109 0.44,0.073 0.764,0.109 0.971,0.109 h 2.677 c 0.307,0 0.514,0.064 0.624,0.193 0.109,0.127 0.165,0.388 0.165,0.777 0,0.379 -0.056,0.637 -0.165,0.771 -0.111,0.141 -0.3,0.208 -0.569,0.208 z m -2.565,2.107 c 0,-0.672 -0.192,-1.21 -0.577,-1.613 -0.386,-0.401 -0.963,-0.604 -1.731,-0.604 -0.722,0 -1.274,0.208 -1.659,0.623 -0.385,0.416 -0.576,0.947 -0.576,1.595 0,0.66 0.191,1.2 0.576,1.622 0.385,0.421 0.938,0.632 1.659,0.632 0.745,0 1.316,-0.211 1.714,-0.632 0.395,-0.422 0.594,-0.963 0.594,-1.623 z"
   id="path7" />
			<path
   fill="#8db63c"
   d="m 46.271,21.665 c 0,0.244 -0.079,0.507 -0.237,0.788 -0.158,0.281 -0.395,0.559 -0.705,0.834 -0.312,0.274 -0.754,0.501 -1.328,0.678 -0.575,0.178 -1.229,0.267 -1.961,0.267 -1.455,0 -2.606,-0.461 -3.455,-1.385 -0.851,-0.922 -1.273,-2.164 -1.273,-3.729 0,-1.43 0.418,-2.587 1.255,-3.473 0.838,-0.887 2.001,-1.33 3.491,-1.33 1.431,0 2.535,0.34 3.317,1.019 0.782,0.678 1.173,1.646 1.173,2.904 0,0.524 -0.082,0.877 -0.248,1.055 -0.164,0.177 -0.437,0.267 -0.814,0.267 -0.184,0 -1.069,-0.004 -2.657,-0.011 -1.588,-0.006 -2.449,-0.009 -2.584,-0.009 -0.185,0 -0.304,0.036 -0.357,0.109 -0.055,0.073 -0.082,0.195 -0.082,0.367 0,0.622 0.22,1.143 0.66,1.558 0.439,0.415 1.001,0.623 1.686,0.623 0.429,0 0.788,-0.052 1.081,-0.155 0.294,-0.104 0.514,-0.227 0.66,-0.367 0.146,-0.14 0.28,-0.283 0.403,-0.431 0.121,-0.146 0.268,-0.271 0.438,-0.376 0.172,-0.104 0.38,-0.155 0.623,-0.155 0.258,0 0.475,0.086 0.65,0.257 0.176,0.17 0.264,0.402 0.264,0.695 z M 40.28,18.238 h 3.592 c 0.305,0 0.458,-0.141 0.458,-0.421 0,-0.403 -0.189,-0.771 -0.567,-1.101 -0.379,-0.33 -0.924,-0.495 -1.632,-0.495 -0.733,0 -1.292,0.175 -1.677,0.522 -0.386,0.348 -0.577,0.718 -0.577,1.108 0,0.146 0.026,0.248 0.083,0.303 0.053,0.056 0.16,0.084 0.32,0.084 z"
   id="path9" />
			<path
   fill="#8db63c"
   d="m 52.3,24.231 c -1.49,0 -2.672,-0.442 -3.545,-1.328 -0.875,-0.886 -1.312,-2.074 -1.312,-3.565 0,-1.637 0.399,-2.88 1.199,-3.729 0.801,-0.849 1.982,-1.279 3.547,-1.292 1.576,0 2.777,0.416 3.603,1.246 0.824,0.831 1.235,2.078 1.235,3.738 0,1.368 -0.424,2.532 -1.272,3.491 -0.848,0.959 -1.999,1.439 -3.455,1.439 z m -1.804,-2.822 c 0.396,0.477 0.979,0.715 1.75,0.715 0.77,0 1.362,-0.257 1.777,-0.77 0.415,-0.515 0.623,-1.138 0.623,-1.869 0,-1.932 -0.824,-2.896 -2.474,-2.896 -0.783,0 -1.357,0.275 -1.724,0.825 -0.367,0.55 -0.551,1.24 -0.551,2.071 0.003,0.805 0.202,1.448 0.599,1.924 z"
   id="path11" />
			<path
   fill="#8db63c"
   d="m 67.788,23.113 c 0,0.354 -0.083,0.603 -0.247,0.742 -0.166,0.141 -0.456,0.211 -0.871,0.211 -0.403,0 -0.686,-0.059 -0.844,-0.174 -0.158,-0.116 -0.263,-0.32 -0.312,-0.614 -0.062,-0.329 -0.104,-0.531 -0.129,-0.604 -0.025,-0.072 -0.073,-0.109 -0.146,-0.109 -0.05,0 -0.145,0.086 -0.283,0.257 -0.142,0.172 -0.301,0.364 -0.478,0.577 -0.178,0.214 -0.477,0.405 -0.897,0.577 -0.422,0.172 -0.914,0.257 -1.477,0.257 -1.308,0 -2.32,-0.455 -3.042,-1.365 -0.721,-0.91 -1.082,-2.159 -1.082,-3.748 0,-1.466 0.379,-2.639 1.138,-3.519 0.758,-0.881 1.711,-1.319 2.858,-1.319 0.586,0 1.09,0.067 1.513,0.2 0.422,0.136 0.715,0.281 0.879,0.44 0.166,0.158 0.309,0.306 0.432,0.439 0.121,0.135 0.213,0.201 0.275,0.201 0.108,0 0.164,-0.073 0.164,-0.22 0,-0.062 -0.007,-0.224 -0.019,-0.486 -0.013,-0.262 -0.024,-0.68 -0.037,-1.256 -0.013,-0.574 -0.019,-1.265 -0.019,-2.069 0,-0.294 0.098,-0.507 0.294,-0.642 0.195,-0.136 0.531,-0.203 1.008,-0.203 0.488,0 0.836,0.064 1.045,0.192 0.207,0.129 0.312,0.347 0.312,0.651 0,0.158 -0.007,2.019 -0.019,5.58 -0.012,3.561 -0.016,5.564 -0.016,6.004 z m -4.857,-0.935 c 0.623,0 1.163,-0.263 1.621,-0.788 0.459,-0.523 0.688,-1.275 0.688,-2.254 0,-0.807 -0.218,-1.443 -0.65,-1.915 -0.433,-0.471 -0.969,-0.706 -1.604,-0.706 -0.696,0 -1.268,0.232 -1.714,0.696 -0.445,0.465 -0.669,1.149 -0.669,2.054 0,0.966 0.218,1.691 0.65,2.182 0.434,0.488 0.993,0.731 1.678,0.731 z"
   id="path13" />
			<path
   fill="#8db63c"
   d="M 75.466,18.549 V 18.11 c 0,-1.148 -0.599,-1.724 -1.796,-1.724 -0.306,0 -0.571,0.04 -0.798,0.119 -0.227,0.079 -0.402,0.174 -0.531,0.284 -0.128,0.109 -0.234,0.25 -0.32,0.421 -0.086,0.172 -0.145,0.312 -0.174,0.422 -0.031,0.11 -0.059,0.247 -0.083,0.412 -0.023,0.165 -0.036,0.26 -0.036,0.284 -0.074,0.403 -0.488,0.605 -1.246,0.605 -0.477,0 -0.805,-0.096 -0.979,-0.284 -0.178,-0.189 -0.267,-0.492 -0.267,-0.907 0,-0.306 0.036,-0.603 0.109,-0.889 0.073,-0.287 0.211,-0.591 0.412,-0.907 0.201,-0.318 0.465,-0.597 0.788,-0.834 0.323,-0.238 0.758,-0.435 1.302,-0.587 0.543,-0.152 1.164,-0.229 1.859,-0.229 1.418,0 2.483,0.326 3.199,0.979 0.714,0.653 1.07,1.688 1.07,3.106 -0.013,2.944 -0.019,4.558 -0.019,4.838 0,0.293 -0.076,0.507 -0.229,0.643 -0.152,0.135 -0.455,0.201 -0.907,0.201 -0.524,0 -0.837,-0.244 -0.935,-0.732 -0.11,-0.514 -0.184,-0.776 -0.221,-0.788 -0.013,-0.013 -0.03,-0.019 -0.056,-0.019 -0.049,0 -0.151,0.092 -0.312,0.273 -0.159,0.185 -0.345,0.383 -0.559,0.597 -0.215,0.214 -0.562,0.412 -1.046,0.596 -0.482,0.184 -1.042,0.274 -1.677,0.274 -0.854,0 -1.549,-0.218 -2.08,-0.649 -0.53,-0.435 -0.797,-0.993 -0.797,-1.678 0,-0.524 0.155,-0.955 0.467,-1.292 0.312,-0.337 0.703,-0.56 1.174,-0.67 0.47,-0.108 0.978,-0.203 1.521,-0.283 0.544,-0.079 1.05,-0.138 1.521,-0.175 0.471,-0.035 0.86,-0.134 1.174,-0.293 0.316,-0.155 0.472,-0.381 0.472,-0.675 z m -0.054,1.797 c 0,-0.194 -0.056,-0.294 -0.165,-0.294 -0.062,0 -0.155,0.034 -0.284,0.103 -0.129,0.065 -0.324,0.151 -0.586,0.256 -0.264,0.104 -0.561,0.192 -0.889,0.266 -0.1,0.025 -0.238,0.054 -0.423,0.083 -0.184,0.03 -0.313,0.056 -0.395,0.073 -0.081,0.019 -0.184,0.046 -0.312,0.082 -0.128,0.037 -0.224,0.073 -0.283,0.11 -0.061,0.037 -0.125,0.086 -0.192,0.146 -0.067,0.062 -0.112,0.132 -0.138,0.211 -0.024,0.079 -0.036,0.168 -0.036,0.267 0,0.243 0.105,0.448 0.321,0.613 0.213,0.165 0.49,0.247 0.833,0.247 0.781,0 1.401,-0.237 1.859,-0.715 0.459,-0.478 0.69,-0.96 0.69,-1.448 z"
   id="path15" />
			<path
   fill="#8db63c"
   d="m 84.74,16.479 h -1.484 c -0.172,0 -0.281,0.026 -0.33,0.082 -0.049,0.056 -0.073,0.155 -0.073,0.303 0,0.366 -0.003,1.143 -0.009,2.327 -0.007,1.186 -0.01,1.856 -0.01,2.017 0,0.696 0.274,1.044 0.824,1.044 0.184,0 0.362,-0.036 0.541,-0.108 0.178,-0.073 0.333,-0.11 0.468,-0.11 0.244,0 0.441,0.083 0.595,0.248 0.153,0.164 0.23,0.406 0.23,0.724 0,0.831 -0.802,1.246 -2.401,1.246 -0.929,0 -1.626,-0.231 -2.089,-0.696 -0.465,-0.465 -0.697,-1.117 -0.697,-1.961 0,-0.587 -0.003,-1.404 -0.009,-2.456 -0.007,-1.051 -0.009,-1.808 -0.009,-2.271 0,-0.257 -0.086,-0.385 -0.258,-0.385 H 79.37 c -0.184,0 -0.314,-0.059 -0.395,-0.176 -0.08,-0.114 -0.119,-0.332 -0.119,-0.649 0,-0.513 0.195,-0.8 0.586,-0.861 0.562,-0.085 0.845,-0.257 0.845,-0.513 0,-0.171 0.002,-0.479 0.009,-0.926 0.006,-0.446 0.009,-0.748 0.009,-0.907 0,-0.366 0.104,-0.632 0.312,-0.797 0.207,-0.165 0.537,-0.248 0.987,-0.248 0.453,0 0.776,0.08 0.974,0.237 0.194,0.16 0.293,0.416 0.293,0.771 v 1.832 c 0,0.195 0.092,0.293 0.273,0.293 h 1.649 c 0.244,0 0.418,0.066 0.521,0.202 0.104,0.135 0.155,0.392 0.155,0.77 0,0.379 -0.055,0.637 -0.164,0.771 -0.107,0.13 -0.297,0.197 -0.565,0.197 z"
   id="path17" />
			<path
   fill="#8db63c"
   d="M 92.73,18.549 V 18.11 c 0,-1.148 -0.599,-1.724 -1.796,-1.724 -0.306,0 -0.57,0.04 -0.798,0.119 -0.226,0.079 -0.402,0.174 -0.531,0.284 -0.128,0.109 -0.233,0.25 -0.319,0.421 -0.086,0.172 -0.146,0.312 -0.175,0.422 -0.03,0.11 -0.059,0.247 -0.083,0.412 -0.023,0.165 -0.035,0.26 -0.035,0.284 -0.074,0.403 -0.489,0.605 -1.246,0.605 -0.478,0 -0.806,-0.096 -0.98,-0.284 -0.178,-0.189 -0.266,-0.492 -0.266,-0.907 0,-0.306 0.036,-0.603 0.108,-0.889 0.073,-0.287 0.211,-0.591 0.412,-0.907 0.201,-0.318 0.465,-0.597 0.788,-0.834 0.323,-0.238 0.758,-0.435 1.302,-0.587 0.543,-0.152 1.164,-0.229 1.859,-0.229 1.418,0 2.484,0.326 3.199,0.979 0.714,0.653 1.071,1.688 1.071,3.106 -0.014,2.944 -0.02,4.558 -0.02,4.838 0,0.293 -0.076,0.507 -0.229,0.643 -0.153,0.135 -0.455,0.201 -0.907,0.201 -0.525,0 -0.837,-0.244 -0.936,-0.732 -0.109,-0.514 -0.184,-0.776 -0.221,-0.788 -0.012,-0.013 -0.03,-0.019 -0.055,-0.019 -0.049,0 -0.152,0.092 -0.312,0.273 -0.159,0.185 -0.345,0.383 -0.559,0.597 -0.214,0.214 -0.562,0.412 -1.045,0.596 -0.483,0.184 -1.042,0.274 -1.677,0.274 -0.855,0 -1.55,-0.218 -2.08,-0.649 -0.531,-0.435 -0.798,-0.993 -0.798,-1.678 0,-0.524 0.155,-0.955 0.468,-1.292 0.312,-0.337 0.703,-0.56 1.173,-0.67 0.47,-0.108 0.978,-0.203 1.521,-0.283 0.544,-0.079 1.051,-0.138 1.521,-0.175 0.471,-0.035 0.861,-0.134 1.174,-0.293 0.316,-0.155 0.472,-0.381 0.472,-0.675 z m -0.055,1.797 c 0,-0.194 -0.055,-0.294 -0.165,-0.294 -0.062,0 -0.155,0.034 -0.284,0.103 -0.129,0.065 -0.324,0.151 -0.586,0.256 -0.264,0.104 -0.56,0.192 -0.889,0.266 -0.1,0.025 -0.238,0.054 -0.422,0.083 -0.185,0.03 -0.314,0.056 -0.396,0.073 -0.081,0.019 -0.184,0.046 -0.312,0.082 -0.128,0.037 -0.225,0.073 -0.284,0.11 -0.059,0.037 -0.125,0.086 -0.192,0.146 -0.066,0.062 -0.111,0.132 -0.138,0.211 -0.024,0.079 -0.036,0.168 -0.036,0.267 0,0.243 0.106,0.448 0.321,0.613 0.213,0.165 0.491,0.247 0.833,0.247 0.782,0 1.402,-0.237 1.86,-0.715 0.459,-0.478 0.69,-0.96 0.69,-1.448 z"
   id="path19" />
		</g>
		<g
   enable-background="new    "
   id="g69"
   transform="translate(-82)">
			<path
   fill="#006f90"
   d="m 181.859,22.729 c 0,0.952 -0.513,1.43 -1.538,1.43 -0.478,0 -0.851,-0.128 -1.117,-0.385 -0.271,-0.257 -0.404,-0.604 -0.404,-1.045 0,-0.916 0.489,-1.374 1.467,-1.374 0.599,0 1.015,0.112 1.246,0.339 0.231,0.225 0.346,0.57 0.346,1.035 z"
   id="path23" />
			
			
			
			
			
			
			
			
			
			<path
   fill="#006f90"
   d="m 191.879,21.665 c 0,0.244 -0.079,0.507 -0.238,0.788 -0.158,0.281 -0.394,0.559 -0.705,0.834 -0.312,0.274 -0.754,0.501 -1.328,0.678 -0.574,0.178 -1.229,0.267 -1.961,0.267 -1.455,0 -2.605,-0.461 -3.455,-1.385 -0.85,-0.922 -1.272,-2.164 -1.272,-3.729 0,-1.43 0.418,-2.587 1.255,-3.473 0.837,-0.887 2.001,-1.33 3.491,-1.33 1.43,0 2.535,0.34 3.316,1.019 0.782,0.678 1.174,1.646 1.174,2.904 0,0.524 -0.082,0.877 -0.248,1.055 -0.164,0.177 -0.438,0.267 -0.814,0.267 -0.184,0 -1.07,-0.004 -2.658,-0.011 -1.588,-0.006 -2.448,-0.009 -2.584,-0.009 -0.184,0 -0.303,0.036 -0.356,0.109 -0.056,0.073 -0.082,0.195 -0.082,0.367 0,0.622 0.22,1.143 0.66,1.558 0.438,0.415 1.001,0.623 1.686,0.623 0.428,0 0.788,-0.052 1.081,-0.155 0.294,-0.104 0.513,-0.227 0.66,-0.367 0.146,-0.14 0.28,-0.283 0.403,-0.431 0.12,-0.146 0.268,-0.271 0.438,-0.376 0.17,-0.105 0.379,-0.155 0.623,-0.155 0.257,0 0.474,0.086 0.65,0.257 0.176,0.17 0.264,0.402 0.264,0.695 z m -5.993,-3.427 h 3.592 c 0.306,0 0.458,-0.141 0.458,-0.421 0,-0.403 -0.188,-0.771 -0.566,-1.101 -0.379,-0.33 -0.924,-0.495 -1.632,-0.495 -0.733,0 -1.292,0.175 -1.678,0.522 -0.385,0.348 -0.577,0.718 -0.577,1.108 0,0.146 0.027,0.248 0.083,0.303 0.056,0.055 0.161,0.084 0.32,0.084 z"
   id="path43" />
			<path
   fill="#006f90"
   d="m 202.142,23.168 c 0,0.33 -0.095,0.553 -0.284,0.669 -0.188,0.116 -0.527,0.174 -1.017,0.174 -0.562,0 -0.93,-0.043 -1.1,-0.128 -0.173,-0.086 -0.259,-0.306 -0.259,-0.659 0,-0.062 0.011,-0.696 0.028,-1.906 0.02,-1.209 0.027,-1.991 0.027,-2.347 0,-0.843 -0.128,-1.46 -0.385,-1.851 -0.258,-0.392 -0.703,-0.587 -1.339,-0.587 -0.562,0 -1.021,0.229 -1.374,0.688 -0.354,0.458 -0.531,1.091 -0.531,1.896 0,0.868 0.003,1.731 0.009,2.594 0.006,0.863 0.01,1.335 0.01,1.42 0,0.393 -0.089,0.64 -0.266,0.742 -0.179,0.104 -0.547,0.156 -1.109,0.156 -0.465,0 -0.791,-0.062 -0.979,-0.185 -0.189,-0.121 -0.283,-0.354 -0.283,-0.695 0,-1.431 0.002,-2.74 0.009,-3.933 0.006,-1.189 0.015,-2.106 0.027,-2.749 0.013,-0.641 0.019,-1.005 0.019,-1.09 0,-0.316 0.073,-0.537 0.22,-0.66 0.147,-0.121 0.409,-0.184 0.788,-0.184 0.354,0 0.6,0.057 0.732,0.165 0.135,0.11 0.244,0.349 0.33,0.715 0.086,0.416 0.184,0.623 0.293,0.623 0.062,0 0.153,-0.088 0.274,-0.266 0.122,-0.178 0.267,-0.376 0.432,-0.597 0.165,-0.22 0.455,-0.418 0.87,-0.596 0.416,-0.177 0.917,-0.266 1.504,-0.266 0.988,0 1.787,0.32 2.391,0.963 0.605,0.641 0.908,1.615 0.908,2.923 0,0.939 0.009,1.729 0.027,2.364 0.018,0.64 0.028,1.508 0.028,2.607 z"
   id="path45" />
			<path
   fill="#006f90"
   d="m 210.224,14.536 h 0.844 c 0.402,0 0.604,0.189 0.604,0.568 0,0.172 -0.035,0.354 -0.109,0.55 -0.037,0.099 -0.098,0.287 -0.184,0.567 -0.086,0.281 -0.207,0.666 -0.365,1.154 -0.16,0.489 -0.361,1.088 -0.604,1.797 -0.295,0.83 -0.545,1.545 -0.752,2.145 -0.209,0.599 -0.344,0.989 -0.404,1.173 -0.219,0.623 -0.463,1.052 -0.732,1.283 -0.269,0.231 -0.652,0.349 -1.154,0.349 -0.6,0 -1.02,-0.11 -1.264,-0.33 -0.246,-0.22 -0.483,-0.666 -0.715,-1.338 -0.392,-1.137 -0.771,-2.261 -1.137,-3.372 -0.123,-0.354 -0.293,-0.844 -0.515,-1.467 -0.22,-0.623 -0.359,-1.038 -0.422,-1.246 -0.207,-0.61 -0.311,-1.045 -0.311,-1.302 0,-0.354 0.201,-0.531 0.604,-0.531 h 0.88 c 0.5,0 0.813,0.257 0.936,0.771 0.279,0.929 0.532,1.789 0.75,2.583 0.574,2.09 0.898,3.195 0.973,3.317 0.062,0.122 0.152,0.183 0.273,0.183 0.098,0 0.176,-0.069 0.229,-0.21 0.057,-0.141 0.176,-0.547 0.357,-1.219 0.074,-0.281 0.135,-0.501 0.184,-0.66 0.439,-1.648 0.781,-2.986 1.027,-4.014 0.11,-0.5 0.446,-0.751 1.007,-0.751 z"
   id="path47" />
			<path
   fill="#006f90"
   d="m 215.593,12.099 c 0,0.402 -0.154,0.739 -0.467,1.008 -0.312,0.27 -0.699,0.404 -1.164,0.404 -0.488,0 -0.877,-0.142 -1.164,-0.423 -0.287,-0.28 -0.43,-0.647 -0.43,-1.1 0,-0.464 0.135,-0.851 0.402,-1.154 0.27,-0.306 0.66,-0.459 1.174,-0.459 1.102,0 1.649,0.576 1.649,1.724 z m -0.346,11.124 c 0,0.343 -0.082,0.574 -0.248,0.696 -0.164,0.122 -0.498,0.185 -0.998,0.185 -0.502,0 -0.852,-0.07 -1.045,-0.211 -0.195,-0.142 -0.293,-0.389 -0.293,-0.742 0,-0.11 0.008,-1.325 0.025,-3.647 0.02,-2.321 0.027,-3.671 0.027,-4.05 0,-0.354 0.082,-0.597 0.248,-0.724 0.164,-0.129 0.51,-0.193 1.035,-0.193 0.465,0 0.785,0.083 0.963,0.248 0.176,0.165 0.266,0.425 0.266,0.778 0,0.379 0.002,1.678 0.01,3.895 0.006,2.216 0.01,3.472 0.01,3.765 z"
   id="path49" />
			<path
   fill="#006f90"
   d="m 219.443,19.667 v 3.409 c 0,0.342 -0.092,0.59 -0.273,0.742 -0.186,0.152 -0.525,0.229 -1.027,0.229 -0.477,0 -0.814,-0.076 -1.016,-0.229 -0.203,-0.152 -0.303,-0.4 -0.303,-0.742 0,-1.43 0.006,-2.733 0.018,-3.913 0.012,-1.179 0.025,-2.086 0.037,-2.722 0.012,-0.636 0.018,-1.001 0.018,-1.101 0,-0.305 0.074,-0.516 0.221,-0.632 0.147,-0.116 0.408,-0.175 0.789,-0.175 0.377,0 0.635,0.062 0.77,0.184 0.133,0.123 0.23,0.36 0.293,0.715 0.072,0.478 0.164,0.716 0.275,0.716 0.061,0 0.148,-0.082 0.266,-0.247 0.118,-0.165 0.25,-0.353 0.402,-0.561 0.152,-0.207 0.395,-0.394 0.725,-0.559 0.33,-0.165 0.707,-0.248 1.137,-0.248 0.377,0 0.652,0.083 0.824,0.248 0.17,0.165 0.256,0.441 0.256,0.834 0,0.403 -0.068,0.718 -0.211,0.943 -0.141,0.227 -0.424,0.339 -0.852,0.339 -1.568,0.003 -2.349,0.926 -2.349,2.77 z"
   id="path51" />
			<path
   fill="#006f90"
   d="m 228.368,24.231 c -1.49,0 -2.672,-0.442 -3.545,-1.328 -0.875,-0.886 -1.312,-2.074 -1.312,-3.565 0,-1.637 0.4,-2.88 1.199,-3.729 0.801,-0.849 1.982,-1.279 3.547,-1.292 1.576,0 2.777,0.416 3.604,1.246 0.822,0.831 1.234,2.078 1.234,3.738 0,1.368 -0.424,2.532 -1.271,3.491 -0.85,0.96 -2.001,1.439 -3.456,1.439 z m -1.804,-2.822 c 0.395,0.477 0.979,0.715 1.75,0.715 0.77,0 1.361,-0.257 1.777,-0.77 0.414,-0.515 0.623,-1.138 0.623,-1.869 0,-1.932 -0.826,-2.896 -2.475,-2.896 -0.783,0 -1.357,0.275 -1.725,0.825 -0.365,0.55 -0.549,1.24 -0.549,2.071 0.001,0.805 0.202,1.448 0.599,1.924 z"
   id="path53" />
			<path
   fill="#006f90"
   d="m 243.14,23.168 c 0,0.33 -0.096,0.553 -0.283,0.669 -0.189,0.116 -0.529,0.174 -1.02,0.174 -0.561,0 -0.928,-0.043 -1.1,-0.128 -0.17,-0.086 -0.256,-0.306 -0.256,-0.659 0,-0.062 0.01,-0.696 0.027,-1.906 0.018,-1.209 0.027,-1.991 0.027,-2.347 0,-0.843 -0.129,-1.46 -0.385,-1.851 -0.258,-0.392 -0.703,-0.587 -1.338,-0.587 -0.562,0 -1.021,0.229 -1.375,0.688 -0.355,0.458 -0.531,1.091 -0.531,1.896 0,0.868 0.002,1.731 0.01,2.594 0.006,0.861 0.008,1.335 0.008,1.42 0,0.393 -0.088,0.64 -0.266,0.742 -0.178,0.104 -0.547,0.156 -1.107,0.156 -0.465,0 -0.793,-0.062 -0.98,-0.185 -0.189,-0.122 -0.285,-0.354 -0.285,-0.695 0,-1.431 0.004,-2.74 0.01,-3.933 0.006,-1.189 0.018,-2.106 0.027,-2.749 0.012,-0.641 0.018,-1.005 0.018,-1.09 0,-0.316 0.074,-0.537 0.223,-0.66 0.146,-0.121 0.408,-0.184 0.787,-0.184 0.354,0 0.6,0.057 0.732,0.165 0.135,0.11 0.244,0.349 0.33,0.715 0.086,0.416 0.184,0.623 0.293,0.623 0.061,0 0.152,-0.088 0.275,-0.266 0.121,-0.178 0.266,-0.376 0.43,-0.597 0.166,-0.22 0.455,-0.418 0.871,-0.596 0.416,-0.177 0.916,-0.266 1.502,-0.266 0.99,0 1.787,0.32 2.393,0.963 0.605,0.641 0.906,1.615 0.906,2.923 0,0.939 0.01,1.729 0.027,2.364 0.022,0.64 0.03,1.508 0.03,2.607 z"
   id="path55" />
			<path
   fill="#006f90"
   d="m 253.384,23.168 c 0,0.33 -0.096,0.553 -0.285,0.669 -0.188,0.116 -0.527,0.174 -1.016,0.174 -0.562,0 -0.93,-0.043 -1.1,-0.128 -0.172,-0.086 -0.258,-0.306 -0.258,-0.659 0,-0.062 0.01,-0.696 0.027,-1.906 0.02,-1.209 0.027,-1.991 0.027,-2.347 0,-0.843 -0.129,-1.46 -0.385,-1.851 -0.258,-0.392 -0.703,-0.587 -1.34,-0.587 -0.561,0 -1.02,0.229 -1.373,0.688 -0.353,0.459 -0.531,1.091 -0.531,1.896 0,0.868 0.004,1.731 0.01,2.594 0.006,0.863 0.01,1.335 0.01,1.42 0,0.393 -0.09,0.64 -0.268,0.742 -0.178,0.104 -0.547,0.156 -1.107,0.156 -0.465,0 -0.791,-0.062 -0.98,-0.185 -0.189,-0.121 -0.283,-0.354 -0.283,-0.695 0,-1.431 0.002,-2.74 0.008,-3.933 0.006,-1.189 0.016,-2.106 0.027,-2.749 0.014,-0.641 0.02,-1.005 0.02,-1.09 0,-0.316 0.072,-0.537 0.219,-0.66 0.148,-0.121 0.41,-0.184 0.789,-0.184 0.355,0 0.6,0.057 0.732,0.165 0.135,0.11 0.244,0.349 0.33,0.715 0.086,0.416 0.184,0.623 0.293,0.623 0.061,0 0.152,-0.088 0.275,-0.266 0.121,-0.178 0.266,-0.376 0.43,-0.597 0.166,-0.22 0.455,-0.418 0.871,-0.596 0.416,-0.177 0.916,-0.266 1.504,-0.266 0.988,0 1.787,0.32 2.391,0.963 0.605,0.641 0.908,1.615 0.908,2.923 0,0.939 0.008,1.729 0.027,2.364 0.02,0.64 0.028,1.508 0.028,2.607 z"
   id="path57" />
			<path
   fill="#006f90"
   d="m 263.501,21.665 c 0,0.244 -0.08,0.507 -0.238,0.788 -0.158,0.281 -0.395,0.559 -0.705,0.834 -0.312,0.274 -0.754,0.501 -1.328,0.678 -0.574,0.178 -1.229,0.267 -1.961,0.267 -1.455,0 -2.605,-0.461 -3.455,-1.385 -0.85,-0.922 -1.273,-2.164 -1.273,-3.729 0,-1.43 0.418,-2.587 1.256,-3.473 0.836,-0.887 2,-1.33 3.49,-1.33 1.43,0 2.535,0.34 3.318,1.019 0.781,0.678 1.172,1.646 1.172,2.904 0,0.524 -0.082,0.877 -0.248,1.055 -0.164,0.177 -0.438,0.267 -0.814,0.267 -0.184,0 -1.068,-0.004 -2.658,-0.011 -1.588,-0.006 -2.447,-0.009 -2.584,-0.009 -0.184,0 -0.303,0.036 -0.355,0.109 -0.055,0.073 -0.082,0.195 -0.082,0.367 0,0.622 0.219,1.143 0.66,1.558 0.438,0.415 1,0.623 1.686,0.623 0.428,0 0.787,-0.052 1.08,-0.155 0.295,-0.104 0.514,-0.227 0.66,-0.367 0.146,-0.14 0.281,-0.283 0.404,-0.431 0.121,-0.146 0.268,-0.271 0.438,-0.376 0.172,-0.104 0.379,-0.155 0.623,-0.155 0.258,0 0.475,0.086 0.65,0.257 0.176,0.17 0.264,0.402 0.264,0.695 z m -5.994,-3.427 h 3.592 c 0.307,0 0.459,-0.141 0.459,-0.421 0,-0.403 -0.189,-0.771 -0.566,-1.101 -0.379,-0.33 -0.924,-0.495 -1.633,-0.495 -0.732,0 -1.291,0.175 -1.678,0.522 -0.385,0.348 -0.576,0.718 -0.576,1.108 0,0.146 0.027,0.248 0.084,0.303 0.054,0.056 0.16,0.084 0.318,0.084 z"
   id="path59" />
			<path
   fill="#006f90"
   d="m 267.497,18.916 v 4.361 c 0,0.245 -0.092,0.431 -0.275,0.56 -0.184,0.128 -0.551,0.192 -1.1,0.192 -0.404,0 -0.703,-0.059 -0.898,-0.175 -0.195,-0.115 -0.293,-0.34 -0.293,-0.669 0,-1.441 0.006,-2.759 0.02,-3.949 0.012,-1.191 0.02,-2.107 0.025,-2.749 0.008,-0.643 0.01,-1.006 0.01,-1.09 0,-0.318 0.08,-0.545 0.238,-0.68 0.158,-0.134 0.439,-0.201 0.844,-0.201 0.33,0 0.557,0.062 0.678,0.184 0.123,0.123 0.227,0.361 0.312,0.715 0.072,0.33 0.178,0.495 0.312,0.495 0.049,0 0.129,-0.085 0.238,-0.257 0.109,-0.172 0.236,-0.354 0.385,-0.551 0.145,-0.194 0.4,-0.377 0.76,-0.549 0.361,-0.172 0.785,-0.256 1.275,-0.256 0.549,0 1.01,0.088 1.383,0.266 0.373,0.177 0.629,0.375 0.77,0.596 0.141,0.22 0.27,0.418 0.385,0.595 0.117,0.179 0.223,0.268 0.32,0.268 0.086,0 0.199,-0.089 0.34,-0.268 0.141,-0.177 0.293,-0.375 0.459,-0.595 0.164,-0.221 0.451,-0.419 0.861,-0.596 0.408,-0.178 0.881,-0.266 1.42,-0.266 0.939,0 1.717,0.299 2.328,0.896 0.609,0.599 0.916,1.516 0.916,2.749 0,1.111 0.008,2.16 0.027,3.144 0.018,0.983 0.025,1.609 0.025,1.878 0,0.403 -0.088,0.68 -0.266,0.825 -0.178,0.146 -0.516,0.22 -1.018,0.22 -0.514,0 -0.852,-0.066 -1.018,-0.2 -0.164,-0.136 -0.246,-0.367 -0.246,-0.697 0,-0.062 0.006,-0.678 0.018,-1.852 0.012,-1.173 0.02,-1.937 0.02,-2.291 0,-0.843 -0.129,-1.457 -0.385,-1.842 -0.258,-0.385 -0.691,-0.577 -1.303,-0.577 -0.451,0 -0.85,0.188 -1.191,0.56 -0.342,0.373 -0.512,0.889 -0.512,1.549 0,0.904 0.002,1.589 0.008,2.053 0.006,0.465 0.01,1.253 0.01,2.364 0,0.184 -0.01,0.317 -0.025,0.403 -0.02,0.085 -0.064,0.177 -0.139,0.273 -0.072,0.1 -0.203,0.165 -0.387,0.202 -0.182,0.036 -0.428,0.055 -0.732,0.055 -0.451,0 -0.77,-0.063 -0.951,-0.191 -0.184,-0.128 -0.275,-0.369 -0.275,-0.725 0,-0.062 0.006,-0.675 0.02,-1.842 0.012,-1.167 0.018,-1.928 0.018,-2.282 0,-0.854 -0.121,-1.479 -0.365,-1.868 -0.246,-0.392 -0.674,-0.587 -1.283,-0.587 -0.539,0 -0.967,0.201 -1.281,0.604 -0.323,0.405 -0.482,1.004 -0.482,1.798 z"
   id="path61" />
			<path
   fill="#006f90"
   d="m 289.433,21.665 c 0,0.244 -0.078,0.507 -0.236,0.788 -0.16,0.281 -0.396,0.559 -0.707,0.834 -0.312,0.274 -0.754,0.501 -1.328,0.678 -0.574,0.178 -1.229,0.267 -1.961,0.267 -1.453,0 -2.605,-0.461 -3.455,-1.385 -0.85,-0.922 -1.273,-2.164 -1.273,-3.729 0,-1.43 0.418,-2.587 1.256,-3.473 0.838,-0.887 2,-1.33 3.49,-1.33 1.432,0 2.535,0.34 3.318,1.019 0.781,0.678 1.172,1.646 1.172,2.904 0,0.524 -0.082,0.877 -0.246,1.055 -0.166,0.177 -0.438,0.267 -0.816,0.267 -0.184,0 -1.068,-0.004 -2.656,-0.011 -1.59,-0.006 -2.451,-0.009 -2.584,-0.009 -0.184,0 -0.303,0.036 -0.357,0.109 -0.054,0.073 -0.084,0.195 -0.084,0.367 0,0.622 0.221,1.143 0.66,1.558 0.441,0.415 1.002,0.623 1.688,0.623 0.428,0 0.787,-0.052 1.08,-0.155 0.293,-0.103 0.516,-0.227 0.66,-0.367 0.146,-0.14 0.281,-0.283 0.402,-0.431 0.123,-0.146 0.27,-0.271 0.441,-0.376 0.17,-0.104 0.377,-0.155 0.621,-0.155 0.258,0 0.475,0.086 0.652,0.257 0.173,0.17 0.263,0.402 0.263,0.695 z m -5.992,-3.427 h 3.592 c 0.307,0 0.459,-0.141 0.459,-0.421 0,-0.403 -0.189,-0.771 -0.568,-1.101 -0.379,-0.33 -0.922,-0.495 -1.631,-0.495 -0.732,0 -1.293,0.175 -1.678,0.522 -0.385,0.347 -0.576,0.718 -0.576,1.108 0,0.146 0.027,0.248 0.082,0.303 0.055,0.055 0.161,0.084 0.32,0.084 z"
   id="path63" />
			<path
   fill="#006f90"
   d="m 299.697,23.168 c 0,0.33 -0.096,0.553 -0.283,0.669 -0.189,0.116 -0.529,0.174 -1.018,0.174 -0.562,0 -0.93,-0.043 -1.102,-0.128 -0.17,-0.086 -0.256,-0.306 -0.256,-0.659 0,-0.062 0.01,-0.696 0.027,-1.906 0.018,-1.209 0.027,-1.991 0.027,-2.347 0,-0.843 -0.129,-1.46 -0.385,-1.851 -0.258,-0.392 -0.703,-0.587 -1.338,-0.587 -0.562,0 -1.021,0.229 -1.375,0.688 -0.355,0.458 -0.531,1.091 -0.531,1.896 0,0.868 0.002,1.731 0.01,2.594 0.006,0.861 0.01,1.335 0.01,1.42 0,0.393 -0.09,0.64 -0.268,0.742 -0.178,0.104 -0.547,0.156 -1.107,0.156 -0.465,0 -0.791,-0.062 -0.98,-0.185 -0.189,-0.123 -0.285,-0.354 -0.285,-0.695 0,-1.431 0.004,-2.74 0.012,-3.933 0.006,-1.189 0.016,-2.106 0.025,-2.749 0.012,-0.641 0.02,-1.005 0.02,-1.09 0,-0.316 0.072,-0.537 0.221,-0.66 0.146,-0.121 0.408,-0.184 0.787,-0.184 0.354,0 0.6,0.057 0.732,0.165 0.135,0.11 0.244,0.349 0.33,0.715 0.086,0.416 0.184,0.623 0.293,0.623 0.062,0 0.152,-0.088 0.275,-0.266 0.121,-0.178 0.266,-0.376 0.43,-0.597 0.166,-0.22 0.455,-0.418 0.871,-0.596 0.416,-0.177 0.916,-0.266 1.502,-0.266 0.99,0 1.787,0.32 2.395,0.963 0.604,0.641 0.904,1.615 0.904,2.923 0,0.939 0.012,1.729 0.027,2.364 0.022,0.64 0.03,1.508 0.03,2.607 z"
   id="path65" />
			<path
   fill="#006f90"
   d="m 306.406,16.479 h -1.486 c -0.17,0 -0.281,0.026 -0.328,0.082 -0.049,0.056 -0.074,0.155 -0.074,0.303 0,0.366 -0.004,1.143 -0.01,2.327 -0.006,1.186 -0.008,1.856 -0.008,2.017 0,0.696 0.273,1.044 0.824,1.044 0.184,0 0.363,-0.036 0.541,-0.108 0.176,-0.073 0.332,-0.11 0.467,-0.11 0.244,0 0.443,0.083 0.596,0.248 0.152,0.164 0.229,0.406 0.229,0.724 0,0.831 -0.801,1.246 -2.4,1.246 -0.928,0 -1.625,-0.231 -2.09,-0.696 -0.465,-0.465 -0.695,-1.117 -0.695,-1.961 0,-0.587 -0.004,-1.404 -0.01,-2.456 -0.006,-1.051 -0.01,-1.808 -0.01,-2.271 0,-0.257 -0.084,-0.385 -0.256,-0.385 h -0.66 c -0.184,0 -0.314,-0.059 -0.395,-0.176 -0.08,-0.114 -0.119,-0.332 -0.119,-0.649 0,-0.513 0.195,-0.8 0.588,-0.861 0.561,-0.085 0.842,-0.257 0.842,-0.513 0,-0.171 0.004,-0.479 0.01,-0.926 0.006,-0.447 0.01,-0.748 0.01,-0.907 0,-0.366 0.104,-0.632 0.312,-0.797 0.207,-0.165 0.537,-0.248 0.988,-0.248 0.451,0 0.775,0.08 0.973,0.237 0.195,0.16 0.293,0.416 0.293,0.771 v 1.832 c 0,0.195 0.092,0.293 0.273,0.293 h 1.65 c 0.244,0 0.418,0.066 0.521,0.202 0.102,0.135 0.154,0.392 0.154,0.77 0,0.379 -0.055,0.637 -0.164,0.771 -0.109,0.13 -0.299,0.197 -0.566,0.197 z"
   id="path67" />
		</g>
		<g
   enable-background="new    "
   id="g89"
   transform="translate(-82)">
			<path
   fill="#939399"
   d="m 311.407,22.729 c 0,0.952 -0.514,1.43 -1.539,1.43 -0.479,0 -0.852,-0.128 -1.117,-0.385 -0.27,-0.257 -0.404,-0.604 -0.404,-1.045 0,-0.916 0.488,-1.374 1.467,-1.374 0.598,0 1.014,0.112 1.246,0.339 0.232,0.225 0.347,0.57 0.347,1.035 z"
   id="path71" />
			<path
   fill="#939399"
   d="m 315.788,11.713 v 1.888 c 0,0.367 -0.006,0.703 -0.02,1.01 -0.014,0.305 -0.02,0.482 -0.02,0.531 0,0.269 0.061,0.402 0.184,0.402 0.062,0 0.156,-0.066 0.285,-0.201 0.127,-0.135 0.277,-0.287 0.447,-0.459 0.172,-0.171 0.459,-0.322 0.861,-0.457 0.404,-0.136 0.867,-0.203 1.395,-0.203 1.186,0 2.113,0.42 2.785,1.256 0.672,0.838 1.008,2.051 1.008,3.639 0,1.491 -0.354,2.7 -1.062,3.629 -0.707,0.929 -1.666,1.393 -2.877,1.393 -0.66,0 -1.213,-0.089 -1.658,-0.266 -0.445,-0.177 -0.746,-0.375 -0.898,-0.596 -0.152,-0.22 -0.283,-0.418 -0.393,-0.596 -0.111,-0.178 -0.197,-0.267 -0.258,-0.267 -0.062,0 -0.105,0.027 -0.129,0.083 -0.023,0.055 -0.055,0.192 -0.092,0.412 -0.012,0.049 -0.02,0.089 -0.027,0.119 -0.006,0.03 -0.014,0.07 -0.02,0.119 -0.006,0.049 -0.016,0.098 -0.025,0.146 -0.051,0.27 -0.162,0.455 -0.34,0.56 -0.178,0.104 -0.432,0.155 -0.762,0.155 -0.391,0 -0.662,-0.075 -0.814,-0.229 -0.152,-0.152 -0.229,-0.388 -0.229,-0.705 0,-0.073 -0.002,-1.359 -0.01,-3.858 -0.006,-2.498 -0.008,-5 -0.008,-7.505 0,-0.354 0.1,-0.612 0.303,-0.778 0.201,-0.164 0.559,-0.248 1.072,-0.248 0.537,0 0.889,0.08 1.053,0.238 0.167,0.159 0.249,0.422 0.249,0.788 z m 2.034,10.465 c 0.695,0 1.246,-0.263 1.648,-0.788 0.404,-0.523 0.605,-1.265 0.605,-2.217 0,-0.953 -0.184,-1.635 -0.551,-2.044 -0.365,-0.409 -0.898,-0.614 -1.594,-0.614 -1.516,0 -2.273,0.93 -2.273,2.786 0,0.893 0.199,1.596 0.596,2.107 0.399,0.514 0.922,0.77 1.569,0.77 z"
   id="path73" />
			<path
   fill="#939399"
   d="m 326.454,19.667 v 3.409 c 0,0.342 -0.092,0.59 -0.275,0.742 -0.183,0.152 -0.525,0.229 -1.025,0.229 -0.477,0 -0.816,-0.076 -1.018,-0.229 -0.202,-0.153 -0.303,-0.4 -0.303,-0.742 0,-1.43 0.006,-2.733 0.018,-3.913 0.014,-1.179 0.025,-2.086 0.037,-2.722 0.014,-0.636 0.02,-1.001 0.02,-1.101 0,-0.305 0.072,-0.516 0.219,-0.632 0.147,-0.116 0.41,-0.175 0.789,-0.175 0.379,0 0.635,0.062 0.77,0.184 0.135,0.123 0.232,0.36 0.293,0.715 0.074,0.478 0.166,0.716 0.275,0.716 0.062,0 0.148,-0.082 0.266,-0.247 0.115,-0.165 0.25,-0.353 0.402,-0.561 0.152,-0.207 0.396,-0.394 0.725,-0.559 0.33,-0.165 0.709,-0.248 1.139,-0.248 0.377,0 0.65,0.083 0.824,0.248 0.17,0.165 0.256,0.441 0.256,0.834 0,0.403 -0.07,0.718 -0.211,0.943 -0.143,0.227 -0.426,0.339 -0.854,0.339 -1.565,0.003 -2.347,0.926 -2.347,2.77 z"
   id="path75" />
			<path
   fill="#939399"
   d="m 339.54,23.039 c 0,0.648 -0.367,0.972 -1.1,0.972 -0.381,0 -0.652,-0.072 -0.816,-0.22 -0.166,-0.146 -0.285,-0.373 -0.357,-0.679 -0.012,-0.062 -0.027,-0.137 -0.045,-0.229 -0.02,-0.092 -0.031,-0.162 -0.037,-0.211 -0.006,-0.049 -0.02,-0.101 -0.037,-0.155 -0.018,-0.056 -0.037,-0.095 -0.055,-0.118 -0.02,-0.024 -0.047,-0.037 -0.082,-0.037 -0.049,0 -0.107,0.063 -0.176,0.191 -0.066,0.128 -0.158,0.284 -0.273,0.469 -0.117,0.183 -0.27,0.368 -0.459,0.559 -0.189,0.191 -0.467,0.349 -0.834,0.477 -0.365,0.128 -0.793,0.192 -1.281,0.192 -2.127,0 -3.189,-1.344 -3.189,-4.032 0,-0.953 -0.004,-1.716 -0.01,-2.291 -0.006,-0.573 -0.01,-1.417 -0.01,-2.528 0,-0.317 0.092,-0.549 0.275,-0.696 0.184,-0.146 0.525,-0.22 1.025,-0.22 0.49,0 0.832,0.062 1.027,0.184 0.193,0.122 0.293,0.354 0.293,0.695 0,0.062 -0.006,0.69 -0.02,1.889 -0.012,1.197 -0.018,1.979 -0.018,2.346 0,1.613 0.555,2.419 1.666,2.419 1.295,0 1.943,-1.008 1.943,-3.022 0,-0.904 -0.006,-1.723 -0.02,-2.456 -0.012,-0.733 -0.018,-1.13 -0.018,-1.19 0,-0.293 0.098,-0.502 0.293,-0.623 0.193,-0.123 0.531,-0.185 1.008,-0.185 0.488,0 0.838,0.06 1.045,0.175 0.207,0.116 0.312,0.34 0.312,0.669 0,0.403 -0.012,1.738 -0.027,4.004 -0.015,2.262 -0.023,3.481 -0.023,3.651 z"
   id="path77" />
			<path
   fill="#939399"
   d="m 341.718,20.786 c 0.258,0 0.488,0.082 0.697,0.247 0.207,0.165 0.387,0.346 0.541,0.541 0.152,0.195 0.42,0.376 0.807,0.541 0.385,0.165 0.854,0.247 1.4,0.247 1.088,0 1.631,-0.307 1.631,-0.916 0,-0.307 -0.17,-0.525 -0.512,-0.66 -0.342,-0.135 -1.07,-0.293 -2.182,-0.477 -1.223,-0.208 -2.059,-0.557 -2.512,-1.046 -0.451,-0.487 -0.678,-1.1 -0.678,-1.832 0,-1.002 0.398,-1.769 1.201,-2.301 0.799,-0.53 1.762,-0.797 2.887,-0.797 1.33,0 2.332,0.244 3.006,0.733 0.672,0.487 1.008,1.094 1.008,1.813 0,0.636 -0.396,0.953 -1.191,0.953 -0.416,0 -0.732,-0.195 -0.953,-0.587 -0.393,-0.66 -1.021,-0.989 -1.887,-0.989 -1.09,0 -1.633,0.329 -1.633,0.989 0,0.366 0.15,0.647 0.449,0.843 0.299,0.196 0.943,0.379 1.934,0.55 1.43,0.245 2.387,0.575 2.869,0.99 0.482,0.415 0.723,0.983 0.723,1.704 0,0.843 -0.371,1.539 -1.117,2.089 -0.746,0.55 -1.846,0.825 -3.299,0.825 -1.355,0 -2.379,-0.271 -3.07,-0.815 -0.688,-0.544 -1.035,-1.103 -1.035,-1.677 0,-0.644 0.307,-0.968 0.916,-0.968 z"
   id="path79" />
			<path
   fill="#939399"
   d="m 351.195,20.786 c 0.258,0 0.488,0.082 0.695,0.247 0.207,0.165 0.389,0.346 0.541,0.541 0.152,0.195 0.422,0.376 0.809,0.541 0.385,0.165 0.852,0.247 1.4,0.247 1.086,0 1.631,-0.307 1.631,-0.916 0,-0.307 -0.172,-0.525 -0.514,-0.66 -0.342,-0.135 -1.068,-0.293 -2.182,-0.477 -1.221,-0.208 -2.059,-0.557 -2.51,-1.046 -0.453,-0.487 -0.68,-1.1 -0.68,-1.832 0,-1.002 0.4,-1.769 1.201,-2.301 0.801,-0.53 1.762,-0.797 2.887,-0.797 1.332,0 2.334,0.244 3.006,0.733 0.672,0.487 1.008,1.094 1.008,1.813 0,0.636 -0.396,0.953 -1.191,0.953 -0.416,0 -0.73,-0.195 -0.953,-0.587 -0.391,-0.66 -1.02,-0.989 -1.887,-0.989 -1.088,0 -1.631,0.329 -1.631,0.989 0,0.366 0.148,0.647 0.449,0.843 0.299,0.196 0.943,0.379 1.934,0.55 1.428,0.245 2.385,0.575 2.867,0.99 0.482,0.415 0.725,0.983 0.725,1.704 0,0.843 -0.373,1.539 -1.119,2.089 -0.744,0.55 -1.844,0.825 -3.299,0.825 -1.354,0 -2.379,-0.271 -3.068,-0.815 -0.689,-0.544 -1.035,-1.103 -1.035,-1.677 0,-0.644 0.304,-0.968 0.916,-0.968 z"
   id="path81" />
			<path
   fill="#939399"
   d="m 368.716,21.665 c 0,0.244 -0.08,0.507 -0.238,0.788 -0.158,0.281 -0.395,0.559 -0.705,0.834 -0.312,0.274 -0.756,0.501 -1.328,0.678 -0.576,0.178 -1.229,0.267 -1.961,0.267 -1.455,0 -2.607,-0.461 -3.455,-1.385 -0.85,-0.922 -1.273,-2.164 -1.273,-3.729 0,-1.43 0.418,-2.587 1.254,-3.473 0.838,-0.887 2.002,-1.33 3.492,-1.33 1.43,0 2.535,0.34 3.316,1.019 0.781,0.678 1.174,1.646 1.174,2.904 0,0.524 -0.082,0.877 -0.248,1.055 -0.164,0.177 -0.438,0.267 -0.814,0.267 -0.184,0 -1.068,-0.004 -2.656,-0.011 -1.59,-0.006 -2.451,-0.009 -2.584,-0.009 -0.186,0 -0.305,0.036 -0.357,0.109 -0.055,0.073 -0.084,0.195 -0.084,0.367 0,0.622 0.221,1.143 0.66,1.558 0.439,0.415 1.002,0.623 1.688,0.623 0.428,0 0.787,-0.052 1.08,-0.155 0.293,-0.103 0.514,-0.227 0.66,-0.367 0.146,-0.14 0.281,-0.283 0.402,-0.431 0.123,-0.147 0.27,-0.271 0.439,-0.376 0.169,-0.105 0.379,-0.155 0.623,-0.155 0.256,0 0.475,0.086 0.65,0.257 0.175,0.17 0.265,0.402 0.265,0.695 z m -5.994,-3.427 h 3.594 c 0.305,0 0.457,-0.141 0.457,-0.421 0,-0.403 -0.189,-0.771 -0.568,-1.101 -0.379,-0.33 -0.922,-0.495 -1.631,-0.495 -0.732,0 -1.291,0.175 -1.678,0.522 -0.385,0.348 -0.576,0.718 -0.576,1.108 0,0.146 0.025,0.248 0.082,0.303 0.054,0.056 0.162,0.084 0.32,0.084 z"
   id="path83" />
			<path
   fill="#939399"
   d="M 370.273,21.922 V 11.677 c 0,-0.66 0.434,-0.99 1.303,-0.99 0.451,0 0.77,0.074 0.961,0.222 0.188,0.146 0.285,0.415 0.285,0.806 0,0.379 -0.014,2.084 -0.037,5.113 -0.025,3.03 -0.037,4.688 -0.037,4.967 0,0.318 0.104,0.478 0.311,0.478 0.037,0 0.1,-0.007 0.186,-0.02 0.084,-0.012 0.164,-0.018 0.238,-0.018 0.475,0 0.713,0.28 0.713,0.843 0,0.782 -0.549,1.173 -1.648,1.173 -0.746,0 -1.311,-0.208 -1.695,-0.623 -0.384,-0.415 -0.58,-0.984 -0.58,-1.706 z"
   id="path85" />
			<path
   fill="#939399"
   d="m 375.497,20.786 c 0.256,0 0.488,0.082 0.695,0.247 0.209,0.165 0.389,0.346 0.541,0.541 0.152,0.195 0.422,0.376 0.807,0.541 0.385,0.165 0.852,0.247 1.402,0.247 1.088,0 1.631,-0.307 1.631,-0.916 0,-0.307 -0.172,-0.525 -0.514,-0.66 -0.344,-0.135 -1.068,-0.293 -2.182,-0.477 -1.223,-0.208 -2.059,-0.557 -2.512,-1.046 -0.451,-0.487 -0.678,-1.1 -0.678,-1.832 0,-1.002 0.4,-1.769 1.201,-2.301 0.799,-0.53 1.762,-0.797 2.887,-0.797 1.33,0 2.332,0.244 3.006,0.733 0.672,0.487 1.008,1.094 1.008,1.813 0,0.636 -0.398,0.953 -1.191,0.953 -0.416,0 -0.732,-0.195 -0.953,-0.587 -0.393,-0.66 -1.02,-0.989 -1.889,-0.989 -1.088,0 -1.631,0.329 -1.631,0.989 0,0.366 0.15,0.647 0.449,0.843 0.299,0.196 0.943,0.379 1.934,0.55 1.43,0.245 2.385,0.575 2.869,0.99 0.482,0.415 0.723,0.983 0.723,1.704 0,0.843 -0.373,1.539 -1.115,2.089 -0.746,0.55 -1.848,0.825 -3.301,0.825 -1.355,0 -2.381,-0.271 -3.068,-0.815 -0.691,-0.544 -1.035,-1.103 -1.035,-1.677 0,-0.644 0.303,-0.968 0.916,-0.968 z"
   id="path87" />
		</g>
	</g>
	<g
   id="g103"
   transform="translate(-82)">
		<g
   id="g101">
			<path
   fill="#949499"
   d="m 398.718,23.817 c -0.002,0.262 -0.107,0.479 -0.367,0.479 -0.279,0 -0.594,-0.539 -1.375,-0.92 -0.701,-0.336 -1.395,-0.479 -2.014,-0.479 -0.771,0 -2.064,0.366 -3.295,0.391 -1.152,0.008 -2.189,-0.535 -2.857,-1.26 -0.498,-0.535 -0.838,-1.396 -0.838,-2.172 0.004,-0.974 0.391,-1.935 1.238,-2.648 0.637,-0.529 1.359,-0.742 2.199,-0.742 1.258,-0.01 2.521,0.644 3.326,1.277 1.178,0.934 2.25,2.184 3.004,3.529 0.436,0.76 0.981,2.043 0.979,2.545 z"
   id="path93" />
			<path
   fill="#949499"
   d="m 399.765,23.817 c 0.002,0.262 0.109,0.479 0.369,0.479 0.279,0 0.594,-0.539 1.375,-0.92 0.701,-0.336 1.395,-0.479 2.014,-0.479 0.771,0 2.064,0.366 3.295,0.391 1.15,0.008 2.188,-0.535 2.855,-1.26 0.5,-0.535 0.838,-1.396 0.838,-2.172 -0.004,-0.974 -0.389,-1.935 -1.236,-2.648 -0.639,-0.529 -1.359,-0.742 -2.199,-0.742 -1.258,-0.01 -2.521,0.644 -3.326,1.277 -1.178,0.934 -2.25,2.184 -3.004,3.529 -0.436,0.76 -0.983,2.043 -0.981,2.545 z"
   id="path95" />
			<g
   id="g99">
				<path
   fill="#949499"
   d="m 403.753,11.625 c -0.588,-0.584 -1.297,-0.978 -2.324,-0.967 -1.041,0.002 -1.711,0.364 -2.186,0.971 -0.479,-0.604 -1.146,-0.969 -2.201,-0.971 -1.014,-0.011 -1.732,0.383 -2.324,0.967 -0.627,0.627 -0.947,1.44 -0.951,2.375 -0.002,0.896 0.309,1.527 0.664,2.017 0.566,0.784 1.217,1.299 1.9,1.915 1.076,0.996 1.762,1.89 2.324,3.005 0.139,0.272 0.256,0.678 0.588,0.678 0.33,0 0.445,-0.402 0.586,-0.678 0.564,-1.115 1.238,-2.009 2.326,-3.005 0.672,-0.616 1.332,-1.131 1.898,-1.915 0.354,-0.486 0.664,-1.121 0.646,-2.017 10e-4,-0.933 -0.307,-1.748 -0.946,-2.375 z m -1.41,4.813 c -0.531,0.543 -1.037,0.821 -1.811,1.678 -0.309,0.338 -0.904,1.199 -1.291,2.008 -0.387,-0.809 -1,-1.67 -1.289,-2.008 -0.777,-0.855 -1.279,-1.135 -1.812,-1.678 -0.777,-0.797 -1.338,-1.348 -1.363,-2.379 -0.012,-0.754 0.301,-1.357 0.771,-1.814 0.42,-0.408 1.008,-0.607 1.631,-0.619 0.439,-0.01 0.891,0.156 1.234,0.418 0.355,0.256 0.605,0.59 0.828,1.025 0.221,-0.436 0.471,-0.77 0.814,-1.025 0.357,-0.262 0.809,-0.428 1.234,-0.418 0.633,0.012 1.223,0.211 1.643,0.619 0.475,0.457 0.785,1.062 0.762,1.814 -0.025,1.034 -0.585,1.583 -1.351,2.379 z"
   id="path97" />
			</g>
		</g>
	</g>
</g>
<g
   id="g111">
	<path
   fill="#76b82a"
   d="m 15.614,16.104 c 0.811,-0.619 1.357,-1.721 1.357,-2.984 0,-1.953 -1.286,-3.521 -2.854,-3.521 -0.13,0 -0.242,0.019 -0.362,0.039 -1.021,-1.494 -3.289,-1.84 -5.273,-0.699 -1.76,0.998 -2.688,2.814 -2.404,4.406 -1.473,0.547 -2.322,2.123 -1.93,3.636 0.34,1.246 1.415,2.059 2.646,2.137 0.532,0.645 1.479,1.076 2.575,1.076 0.643,0 1.251,-0.148 1.742,-0.41 l -0.645,5.295 2.293,-0.09 c 0,0 -0.058,-4.109 0.28,-6.174 0.339,0.336 0.836,0.528 1.368,0.528 1.054,0 1.929,-0.811 1.929,-1.813 0,-0.575 -0.29,-1.08 -0.722,-1.426 z"
   id="path107" />
	<path
   fill="#007a9d"
   d="m 1.253,26.916 18.902,-2.01 c -2.141,-0.195 -4.431,-0.215 -6.738,-0.09 0.018,-1.029 0.073,-3.486 0.396,-5.34 0.418,0.377 0.988,0.618 1.632,0.618 1.271,0 2.307,-0.946 2.307,-2.116 0,-0.662 -0.338,-1.25 -0.852,-1.646 0.988,-0.723 1.646,-2.008 1.646,-3.463 0,-2.252 -1.535,-4.068 -3.439,-4.068 -0.153,0 -0.289,0.023 -0.44,0.038 -1.229,-1.743 -3.949,-2.122 -6.318,-0.812 -2.101,1.15 -3.233,3.271 -2.896,5.105 -1.755,0.645 -2.799,2.456 -2.31,4.196 0.401,1.439 1.704,2.391 3.184,2.484 0.644,0.758 1.777,1.239 3.08,1.239 0.779,0 1.496,-0.182 2.083,-0.481 l -0.738,4.422 c -3.428,0.344 -6.757,0.987 -9.499,1.924 z m 10.991,-7.365 c 0,0 -3.255,2.422 -5.637,-0.307 0,0 -3.087,0.307 -2.976,-3.141 0.063,-2.005 2.139,-2.929 2.139,-2.929 0,0 -0.354,-3.619 3.521,-5 3.161,-1.109 4.771,0.65 5.115,1.252 0,0 3.401,-0.602 3.819,3.064 0.337,2.949 -2.52,3.818 -2.292,3.803 0,0 1.914,1.383 0.755,2.709 -1.173,1.32 -2.701,-0.162 -3.254,-0.723 l -0.411,6.488 c -0.683,0.047 -1.365,0.102 -2.043,0.157 z"
   id="path109" />
</g>
</svg>
