<?xml version="1.0" encoding="utf-8"?>
<!-- Generator: Adobe Illustrator 15.0.0, SVG Export Plug-In . SVG Version: 6.00 Build 0)  -->
<!DOCTYPE svg PUBLIC "-//W3C//DTD SVG 1.0//EN" "http://www.w3.org/TR/2001/REC-SVG-20010904/DTD/svg10.dtd">
<svg version="1.0" id="Layer_1" xmlns="http://www.w3.org/2000/svg" xmlns:xlink="http://www.w3.org/1999/xlink" x="0px" y="0px"
	 width="43.022px" height="37.031px" viewBox="0 0 43.022 37.031" enable-background="new 0 0 43.022 37.031" xml:space="preserve">
<path fill="#827975" d="M1.17,26.15c3.173,8.324,11.818,12.76,19.307,9.898c2.472-0.942,11.084-4.227,13.564-5.171
	c7.483-2.852,10.983-11.903,7.81-20.228C38.67,2.327,30.032-2.101,22.541,0.753C20.063,1.692,11.456,4.975,8.98,5.922
	C1.498,8.774-2.001,17.83,1.17,26.15"/>
<polygon fill="#FFFFFF" points="17.4,3.687 7.8,7.486 6.399,9.635 24.399,33.635 35.8,29.087 36.501,28.486 36.399,5.887 
	36.4,4.887 35.601,3.687 "/>
<polygon fill="none" stroke="#827975" stroke-width="1.742" stroke-linecap="round" stroke-linejoin="round" points="17.4,3.687 
	7.8,7.486 6.399,9.635 24.399,33.635 35.8,29.087 36.501,28.486 36.399,5.887 36.4,4.887 35.601,3.687 "/>
<polygon fill="#FFFFFF" points="6.731,8.918 6.731,32.017 6.8,32.687 7.482,32.977 25.643,32.977 25.643,8.918 "/>
<polygon fill="none" stroke="#827975" stroke-width="1.742" stroke-linecap="round" stroke-linejoin="round" points="6.731,8.918 
	6.731,32.017 6.8,32.687 7.482,32.977 25.643,32.977 25.643,8.918 "/>
<line fill="none" stroke="#827975" stroke-width="1.742" stroke-linecap="round" stroke-linejoin="round" x1="25.8" y1="8.88" x2="36.742" y2="4.687"/>
<polygon fill="#827975" points="15.299,14.539 18.567,14.539 16.025,18.932 18.891,18.932 14.936,26.039 16.752,20.672 
	13.483,20.672 "/>
<polyline fill="none" stroke="#827975" stroke-linecap="round" stroke-linejoin="round" points="15.299,14.539 18.567,14.539 
	16.025,18.932 18.891,18.932 14.936,26.039 16.752,20.672 13.483,20.672 15.299,14.539 "/>
</svg>
