<?xml version="1.0" encoding="UTF-8" standalone="no"?>
<!-- Created with Inkscape (http://www.inkscape.org/) -->

<svg
   xmlns:dc="http://purl.org/dc/elements/1.1/"
   xmlns:cc="http://creativecommons.org/ns#"
   xmlns:rdf="http://www.w3.org/1999/02/22-rdf-syntax-ns#"
   xmlns:svg="http://www.w3.org/2000/svg"
   xmlns="http://www.w3.org/2000/svg"
   xmlns:sodipodi="http://sodipodi.sourceforge.net/DTD/sodipodi-0.dtd"
   xmlns:inkscape="http://www.inkscape.org/namespaces/inkscape"
   width="1001pt"
   height="1000pt"
   viewBox="0 0 1251.25 1250"
   id="svg5147"
   version="1.1"
   inkscape:version="0.91 r13725"
   sodipodi:docname="lp.svg">
  <defs
     id="defs5149" />
  <sodipodi:namedview
     id="base"
     pagecolor="#ffffff"
     bordercolor="#666666"
     borderopacity="1.0"
     inkscape:pageopacity="0.0"
     inkscape:pageshadow="2"
     inkscape:zoom="0.11336545"
     inkscape:cx="830.93953"
     inkscape:cy="523.62357"
     inkscape:document-units="px"
     inkscape:current-layer="layer1"
     showgrid="false"
     units="pt"
     inkscape:window-width="1081"
     inkscape:window-height="992"
     inkscape:window-x="65"
     inkscape:window-y="25"
     inkscape:window-maximized="0" />
  <metadata
     id="metadata5152">
    <rdf:RDF>
      <cc:Work
         rdf:about="">
        <dc:format>image/svg+xml</dc:format>
        <dc:type
           rdf:resource="http://purl.org/dc/dcmitype/StillImage" />
        <dc:title></dc:title>
      </cc:Work>
    </rdf:RDF>
  </metadata>
  <g
     inkscape:label="Layer 1"
     inkscape:groupmode="layer"
     id="layer1"
     transform="translate(0,197.63778)">
    <path
       inkscape:connector-curvature="0"
       id="path4950"
       style="fill:#000000;fill-opacity:1;fill-rule:nonzero;stroke:none"
       d="m 529.321,464.01701 c -15,-39.39917 1.6,-82.29998 37,-95.79998 11.704,-4.39999 52.4,-20 64.2,-24.39999 35.4,-13.5 76.304,7.39999 91.4,46.79999 15,39.4 -1.6,82.29998 -37,95.79998 -11.696,4.496 -52.496,20 -64.2,24.5 -35.496,13.5 -76.4,-7.49601 -91.4,-46.9 m 571.336,438.37919 65.904,0 0,65.90001 -65.904,0 z M 84.689,-113.57176 l 60.408,0 0,60.407995 -60.408,0 z m 541,1019.15276 c -29.8,0.025 -59.704,-11.26639 -82.224,-33.7888 L 181.161,509.48741 c -45.064,-45.0608 -44.992,-119.27117 0,-164.25677 L 543.465,-17.074965 c 44.984,-44.9848 119.192,-45.0584 164.256,0 l 362.304,362.305605 c 45.048,45.0448 44.992,119.27037 0,164.25677 l -362.304,362.3048 c -22.496,22.4928 -52.232,33.7664 -82.032,33.7888 z m -11.52,-104.49199 c 6.32,6.344 16.456,6.4 22.848,0 L 999.321,438.78424 c 6.4,-6.392 6.32,-16.516 0,-22.8512 L 637.017,53.628235 c -6.48,-6.448 -16.456,-6.392 -22.848,0 L 251.865,415.93304 c -6.4,6.392 -6.48,16.40319 0,22.85119 l 362.304,362.30478 z" />
  </g>
</svg>
