<?xml version="1.0" encoding="UTF-8" standalone="no"?>
<!-- Created with Inkscape (http://www.inkscape.org/) -->

<svg
   xmlns:dc="http://purl.org/dc/elements/1.1/"
   xmlns:cc="http://creativecommons.org/ns#"
   xmlns:rdf="http://www.w3.org/1999/02/22-rdf-syntax-ns#"
   xmlns:svg="http://www.w3.org/2000/svg"
   xmlns="http://www.w3.org/2000/svg"
   xmlns:sodipodi="http://sodipodi.sourceforge.net/DTD/sodipodi-0.dtd"
   xmlns:inkscape="http://www.inkscape.org/namespaces/inkscape"
   width="1001pt"
   height="1000pt"
   viewBox="0 0 1251.25 1250"
   id="svg5147"
   version="1.1"
   inkscape:version="0.91 r13725"
   sodipodi:docname="ds.svg">
  <defs
     id="defs5149" />
  <sodipodi:namedview
     id="base"
     pagecolor="#ffffff"
     bordercolor="#666666"
     borderopacity="1.0"
     inkscape:pageopacity="0.0"
     inkscape:pageshadow="2"
     inkscape:zoom="0.11336545"
     inkscape:cx="830.93953"
     inkscape:cy="523.62357"
     inkscape:document-units="px"
     inkscape:current-layer="layer1"
     showgrid="false"
     units="pt"
     inkscape:window-width="1081"
     inkscape:window-height="992"
     inkscape:window-x="65"
     inkscape:window-y="25"
     inkscape:window-maximized="0" />
  <metadata
     id="metadata5152">
    <rdf:RDF>
      <cc:Work
         rdf:about="">
        <dc:format>image/svg+xml</dc:format>
        <dc:type
           rdf:resource="http://purl.org/dc/dcmitype/StillImage" />
        <dc:title></dc:title>
      </cc:Work>
    </rdf:RDF>
  </metadata>
  <g
     inkscape:label="Layer 1"
     inkscape:groupmode="layer"
     id="layer1"
     transform="translate(0,197.63778)">
    <g
       id="g4892"
       transform="matrix(100,0,0,-100,-30103.281,24209.244)">
      <path
         inkscape:connector-curvature="0"
         id="rect4896"
         transform="scale(1,-1)"
         style="opacity:1;fill:#000000;fill-opacity:1;fill-rule:evenodd;stroke:none;stroke-width:1;stroke-linecap:round;stroke-linejoin:round;stroke-miterlimit:4;stroke-dasharray:none;stroke-dashoffset:0;stroke-opacity:1"
         d="m 312.0394,-233.06848 0.659,0 0,0.659 -0.659,0 z m -10.15967,-10.15968 0.60409,0 0,0.60408 -0.60409,0 z m 5.41002,10.7231 c -0.36839,0 -0.67344,-0.24619 -0.8457,-0.54492 l -2.41407,-4.18164 c -0.10637,-0.18451 -0.1568,-0.38782 -0.15234,-0.58594 -0.005,-0.19961 0.0463,-0.40398 0.15234,-0.58789 l 2.41407,-4.18164 c 0.1722,-0.29861 0.47653,-0.54492 0.84375,-0.54492 0.36719,0 0.67281,0.24513 0.8457,0.54492 l 2.41406,4.18164 c 0.10617,0.18431 0.15674,0.38848 0.15235,0.58594 0.005,0.19934 -0.0462,0.4037 -0.15235,0.58789 l -2.41406,4.18164 c -0.17226,0.29874 -0.47536,0.54492 -0.84375,0.54492 z m 0,-1.08008 2.39258,-4.14648 c 0.0278,-0.0494 0.0251,-0.0658 0.0254,-0.0606 l -0.002,-0.0254 0.002,-0.0254 c -1.3e-4,0.003 0.003,-0.0124 -0.0254,-0.0625 l -2.39258,-4.14648 -2.39453,4.14453 0,0.002 c -0.0284,0.0504 -0.0251,0.0655 -0.0254,0.0606 l 0.002,0.0254 -0.002,0.0254 c 1.9e-4,-0.004 -0.002,0.0133 0.0254,0.0625 l 0,0.002 2.39453,4.14453 z" />
    </g>
  </g>
</svg>
