<?xml version="1.0" encoding="utf-8"?>
<!-- Generator: Adobe Illustrator 15.0.0, SVG Export Plug-In . SVG Version: 6.00 Build 0)  -->
<!DOCTYPE svg PUBLIC "-//W3C//DTD SVG 1.0//EN" "http://www.w3.org/TR/2001/REC-SVG-20010904/DTD/svg10.dtd">
<svg version="1.0" id="Layer_1" xmlns="http://www.w3.org/2000/svg" xmlns:xlink="http://www.w3.org/1999/xlink" x="0px" y="0px"
	 width="27.965px" height="24.07px" viewBox="0 0 27.965 24.07" enable-background="new 0 0 27.965 24.07" xml:space="preserve">
<path fill="#827975" d="M0.761,17.049c2.062,5.411,7.682,8.295,12.55,6.435c1.607-0.613,7.204-2.747,8.816-3.361
	c4.864-1.854,7.139-7.737,5.077-13.147c-2.068-5.41-7.683-8.288-12.552-6.434c-1.61,0.611-7.206,2.744-8.815,3.36
	C0.974,5.755-1.301,11.641,0.761,17.049"/>
<line fill="none" stroke="#FFFFFF" stroke-width="1.54" stroke-linecap="round" stroke-linejoin="round" stroke-miterlimit="10" x1="3.578" y1="11.137" x2="13.744" y2="11.137"/>
<line fill="none" stroke="#FFFFFF" stroke-width="1.54" stroke-linecap="round" stroke-linejoin="round" stroke-miterlimit="10" x1="3.578" y1="15.743" x2="13.744" y2="15.743"/>
<path fill="none" stroke="#FFFFFF" stroke-width="1.54" stroke-linecap="round" stroke-linejoin="round" d="M12.945,24.398
	c5.13-1.955,7.53-8.16,5.354-13.867c-1.174-3.073-3.434-5.371-6.071-6.533"/>
</svg>
