<?xml version="1.0" encoding="UTF-8" standalone="no"?>
<!-- Created with Inkscape (http://www.inkscape.org/) -->

<svg
   xmlns:dc="http://purl.org/dc/elements/1.1/"
   xmlns:cc="http://creativecommons.org/ns#"
   xmlns:rdf="http://www.w3.org/1999/02/22-rdf-syntax-ns#"
   xmlns:svg="http://www.w3.org/2000/svg"
   xmlns="http://www.w3.org/2000/svg"
   xmlns:sodipodi="http://sodipodi.sourceforge.net/DTD/sodipodi-0.dtd"
   xmlns:inkscape="http://www.inkscape.org/namespaces/inkscape"
   width="1001pt"
   height="1000pt"
   viewBox="0 0 1251.25 1250"
   id="svg5147"
   version="1.1"
   inkscape:version="0.91 r13725"
   sodipodi:docname="ts.svg">
  <defs
     id="defs5149" />
  <sodipodi:namedview
     id="base"
     pagecolor="#ffffff"
     bordercolor="#666666"
     borderopacity="1.0"
     inkscape:pageopacity="0.0"
     inkscape:pageshadow="2"
     inkscape:zoom="0.16032296"
     inkscape:cx="3115.5861"
     inkscape:cy="-1249.4033"
     inkscape:document-units="px"
     inkscape:current-layer="layer1"
     showgrid="false"
     units="pt"
     inkscape:window-width="1855"
     inkscape:window-height="1056"
     inkscape:window-x="65"
     inkscape:window-y="24"
     inkscape:window-maximized="1" />
  <metadata
     id="metadata5152">
    <rdf:RDF>
      <cc:Work
         rdf:about="">
        <dc:format>image/svg+xml</dc:format>
        <dc:type
           rdf:resource="http://purl.org/dc/dcmitype/StillImage" />
        <dc:title></dc:title>
      </cc:Work>
    </rdf:RDF>
  </metadata>
  <g
     inkscape:label="Layer 1"
     inkscape:groupmode="layer"
     id="layer1"
     transform="translate(0,197.63778)">
    <g
       transform="matrix(100,0,0,-100,-28675.434,24209.244)"
       id="g4880-4">
      <path
         inkscape:connector-curvature="0"
         id="rect4884-4"
         transform="scale(1,-1)"
         style="opacity:1;fill:#000000;fill-opacity:1;fill-rule:evenodd;stroke:none;stroke-width:1;stroke-linecap:round;stroke-linejoin:round;stroke-miterlimit:4;stroke-dasharray:none;stroke-dashoffset:0;stroke-opacity:1"
         d="m 297.76093,-233.06848 0.659,0 0,0.659 -0.659,0 z m -10.15967,-10.15968 0.60409,0 0,0.60408 -0.60409,0 z m 1.67284,10.04537 c -0.3788,-0.21867 -0.55664,-0.65778 -0.55664,-1.10742 l 0,-7.05665 c 0,-0.44965 0.17784,-0.88875 0.55664,-1.10742 0.3788,-0.21867 0.84701,-0.15419 1.23633,0.0703 l 6.11328,3.5293 c 0.38931,0.2245 0.67968,0.59774 0.67968,1.03516 0,0.43742 -0.29037,0.81066 -0.67968,1.03515 l -6.11328,3.53125 c -0.38932,0.22451 -0.85753,0.28899 -1.23633,0.0703 z m 0.5,-0.86524 c -3e-4,-1.7e-4 0.0516,0.0342 0.23633,-0.0723 l 6.11328,-3.5293 c 0.18469,-0.1065 0.17968,-0.17084 0.17968,-0.16992 0,9.2e-4 0.005,-0.0615 -0.17968,-0.16797 l -6.11328,-3.53125 0,0.002 c -0.18469,-0.1065 -0.23663,-0.0721 -0.23633,-0.0723 3e-4,-1.7e-4 -0.0566,0.0288 -0.0566,0.24218 l 0,7.05665 c 0,0.21335 0.0569,0.24235 0.0566,0.24218 z" />
    </g>
  </g>
</svg>
