<?xml version="1.0" encoding="utf-8"?>
<!-- Generator: Adobe Illustrator 15.0.0, SVG Export Plug-In . SVG Version: 6.00 Build 0)  -->
<!DOCTYPE svg PUBLIC "-//W3C//DTD SVG 1.0//EN" "http://www.w3.org/TR/2001/REC-SVG-20010904/DTD/svg10.dtd">
<svg version="1.0" id="Layer_1" xmlns="http://www.w3.org/2000/svg" xmlns:xlink="http://www.w3.org/1999/xlink" x="0px" y="0px"
	 width="27.965px" height="24.07px" viewBox="0 0 27.965 24.07" enable-background="new 0 0 27.965 24.07" xml:space="preserve">
<path fill="#94C354" d="M27.204,6.995c-2.068-5.409-7.683-8.287-12.552-6.433c-1.61,0.611-7.206,2.744-8.815,3.36
	c-4.863,1.854-7.138,7.74-5.076,13.147"/>
<path fill="#94C354" d="M0.761,17.07c2.062,5.411,7.682,8.294,12.55,6.435c1.607-0.613,7.204-2.747,8.816-3.361
	c4.864-1.854,7.139-7.738,5.077-13.148"/>
<line fill="none" stroke="#FFFFFF" stroke-width="1.54" stroke-linecap="round" stroke-linejoin="round" stroke-miterlimit="10" x1="3.579" y1="13.462" x2="13.745" y2="13.462"/>
<line fill="none" stroke="#FFFFFF" stroke-width="1.54" stroke-linecap="round" stroke-linejoin="round" stroke-miterlimit="10" x1="8.662" y1="18.544" x2="8.662" y2="8.379"/>
<path fill="none" stroke="#FFFFFF" stroke-width="1.54" stroke-linecap="round" stroke-linejoin="round" d="M13.067,24.42
	c5.13-1.954,7.53-8.161,5.354-13.868c-1.174-3.072-3.434-5.37-6.071-6.532"/>
</svg>
