<?xml version="1.0" encoding="UTF-8" standalone="no"?>
<!-- Created with Inkscape (http://www.inkscape.org/) -->

<svg
   xmlns:dc="http://purl.org/dc/elements/1.1/"
   xmlns:cc="http://creativecommons.org/ns#"
   xmlns:rdf="http://www.w3.org/1999/02/22-rdf-syntax-ns#"
   xmlns:svg="http://www.w3.org/2000/svg"
   xmlns="http://www.w3.org/2000/svg"
   xmlns:sodipodi="http://sodipodi.sourceforge.net/DTD/sodipodi-0.dtd"
   xmlns:inkscape="http://www.inkscape.org/namespaces/inkscape"
   width="1001pt"
   height="1000pt"
   viewBox="0 0 1251.25 1250"
   id="svg5147"
   version="1.1"
   inkscape:version="0.91 r13725"
   sodipodi:docname="t.svg">
  <defs
     id="defs5149" />
  <sodipodi:namedview
     id="base"
     pagecolor="#ffffff"
     bordercolor="#666666"
     borderopacity="1.0"
     inkscape:pageopacity="0.0"
     inkscape:pageshadow="2"
     inkscape:zoom="0.11336545"
     inkscape:cx="1844.0007"
     inkscape:cy="523.62357"
     inkscape:document-units="px"
     inkscape:current-layer="layer1"
     showgrid="false"
     units="pt"
     inkscape:window-width="1081"
     inkscape:window-height="992"
     inkscape:window-x="65"
     inkscape:window-y="25"
     inkscape:window-maximized="0" />
  <metadata
     id="metadata5152">
    <rdf:RDF>
      <cc:Work
         rdf:about="">
        <dc:format>image/svg+xml</dc:format>
        <dc:type
           rdf:resource="http://purl.org/dc/dcmitype/StillImage" />
        <dc:title></dc:title>
      </cc:Work>
    </rdf:RDF>
  </metadata>
  <g
     inkscape:label="Layer 1"
     inkscape:groupmode="layer"
     id="layer1"
     transform="translate(0,197.63778)">
    <g
       transform="matrix(100,0,0,-100,-28675.434,24209.244)"
       id="g5098">
      <path
         d="m 297.76093,-233.06848 0.659,0 0,0.659 -0.659,0 z m -10.15967,-10.15968 0.60409,0 0,0.60408 -0.60409,0 z m 2.2869,0.64264 c -0.21307,-0.0173 -0.42466,0.0204 -0.61407,0.12969 -0.3788,0.21866 -0.55624,0.65816 -0.55624,1.1078 l 0,7.05938 c 0,0.44965 0.17744,0.88758 0.55624,1.10625 0.3788,0.21864 0.84662,0.15263 1.23594,-0.0719 l 6.11406,-3.52969 c 0.38932,-0.2245 0.67969,-0.59695 0.67969,-1.03438 0,-0.43741 -0.29037,-0.81143 -0.67969,-1.03593 l -6.11406,-3.52813 c -0.19465,-0.11227 -0.40881,-0.18578 -0.62187,-0.20312 z"
         style="opacity:1;fill:#000000;fill-opacity:1;fill-rule:evenodd;stroke:none;stroke-width:1;stroke-linecap:round;stroke-linejoin:round;stroke-miterlimit:4;stroke-dasharray:none;stroke-dashoffset:0;stroke-opacity:1"
         transform="scale(1,-1)"
         id="path5100"
         inkscape:connector-curvature="0"
         sodipodi:nodetypes="ccccccccccccsscccscccc" />
    </g>
  </g>
</svg>
