<?xml version="1.0" encoding="UTF-8" standalone="no"?>
<!-- Created with Inkscape (http://www.inkscape.org/) -->

<svg
   xmlns:dc="http://purl.org/dc/elements/1.1/"
   xmlns:cc="http://creativecommons.org/ns#"
   xmlns:rdf="http://www.w3.org/1999/02/22-rdf-syntax-ns#"
   xmlns:svg="http://www.w3.org/2000/svg"
   xmlns="http://www.w3.org/2000/svg"
   xmlns:sodipodi="http://sodipodi.sourceforge.net/DTD/sodipodi-0.dtd"
   xmlns:inkscape="http://www.inkscape.org/namespaces/inkscape"
   width="1001pt"
   height="1000pt"
   viewBox="0 0 1251.25 1250"
   id="svg5147"
   version="1.1"
   inkscape:version="0.91 r13725"
   sodipodi:docname="ls.svg">
  <defs
     id="defs5149" />
  <sodipodi:namedview
     id="base"
     pagecolor="#ffffff"
     bordercolor="#666666"
     borderopacity="1.0"
     inkscape:pageopacity="0.0"
     inkscape:pageshadow="2"
     inkscape:zoom="0.11336545"
     inkscape:cx="830.93953"
     inkscape:cy="523.62357"
     inkscape:document-units="px"
     inkscape:current-layer="layer1"
     showgrid="false"
     units="pt"
     inkscape:window-width="1081"
     inkscape:window-height="992"
     inkscape:window-x="65"
     inkscape:window-y="25"
     inkscape:window-maximized="0" />
  <metadata
     id="metadata5152">
    <rdf:RDF>
      <cc:Work
         rdf:about="">
        <dc:format>image/svg+xml</dc:format>
        <dc:type
           rdf:resource="http://purl.org/dc/dcmitype/StillImage" />
        <dc:title></dc:title>
      </cc:Work>
    </rdf:RDF>
  </metadata>
  <g
     inkscape:label="Layer 1"
     inkscape:groupmode="layer"
     id="layer1"
     transform="translate(0,197.63778)">
    <g
       transform="matrix(100,0,0,-100,-30103.281,24209.244)"
       id="g4886">
      <path
         inkscape:connector-curvature="0"
         id="rect4890"
         transform="scale(1,-1)"
         style="opacity:1;fill:#000000;fill-opacity:1;fill-rule:evenodd;stroke:none;stroke-width:1;stroke-linecap:round;stroke-linejoin:round;stroke-miterlimit:4;stroke-dasharray:none;stroke-dashoffset:0;stroke-opacity:1"
         d="m 312.0394,-233.06848 0.659,0 0,0.659 -0.659,0 z m -10.15967,-10.15968 0.60409,0 0,0.60408 -0.60409,0 z m 5.40999,10.19185 c -0.29801,2.4e-4 -0.59704,-0.11267 -0.82226,-0.33789 l -3.62305,-3.62305 c -0.45061,-0.45061 -0.44988,-1.19271 0,-1.64257 l 3.62305,-3.62305 c 0.44986,-0.44985 1.19196,-0.45059 1.64257,0 l 3.62305,3.62305 c 0.45047,0.45044 0.44988,1.19271 0,1.64257 l -3.62305,3.62305 c -0.22493,0.22493 -0.5223,0.33766 -0.82031,0.33789 z m -0.11523,-1.04492 c 0.0634,0.0634 0.16456,0.064 0.22851,0 l 3.62305,-3.62305 c 0.0639,-0.0639 0.0633,-0.16516 0,-0.22851 l -3.62305,-3.62305 c -0.0645,-0.0645 -0.16456,-0.064 -0.22851,0 l -3.62305,3.62305 c -0.0639,0.0639 -0.0645,0.16403 0,0.22851 l 3.62305,3.62305 z" />
    </g>
  </g>
</svg>
