@startuml

skinparam BackgroundColor transparent

|一般性流程1.0.01|
start
|异常流程1.0.E1|
if (所请求的日期为当天&&\n当前时间晚于当天的订单截止时间) then (YES)
    :1.0.E1.1
    COS告知顾客
    当天太晚已无法下单;
    if(顾客取消订餐流程) then (YES)
        :1.0.E1.2a
        终止用例;
        end
    else (NO)
        :1.0.E1.2b
        顾客请求另一天;
|一般性流程1.0.01|
        :重新开始一般性流程;
        detach
    endif
else (NO)
endif

|异常流程1.0.E2|
if(剩余的送餐时间不足) then (YES)
    :1.0.E2.1
    COS告知顾客用餐日期当天
    已没有可用的送餐时间;
    if(顾客取消订餐流程) then (YES)
        :1.0.E2.2a
        终止用例;
        end
    else (NO)
        :1.0.E2.2b
        顾客到食堂取餐
        转至一般性流程
        **（将跳过1.0.07和1.0.08）**;
    endif
else (NO)
endif
|一般性流程1.02|
:返回执行原流程;

@enduml