@startuml

skinparam BackgroundColor transparent

|选择性流程1.1.1|
start

|异常流程1.1.E1|
if(库存不足，\n难以填满多餐订单？) then (YES)
    :1.1.E1.1
    COS根据当前可用库存
    告知顾客所能够预订
    相同饭菜的最大值;
    if(修改预订菜品数量？) then (YES)
        :1.1.E2a
        返回一般性流程1.04;
        detach
    else (NO)
        :1.1.E2b
        顾客取消订餐流程，
        终止用例;
        end
    endif
else (NO)
endif

|选择性流程1.1.2|
:当前无异常，
返回执行原流程;

@enduml