@startuml

left to right direction

actor :食堂\n工作人员: as staff

rectangle "COS System"{
    usecase (prepare_meal) as "备餐"
    usecase (gen_payment) as "生成支付请求"
    usecase (req_meal_delivery) as "请求送餐"
    usecase (gen_reports) as "生成\n系统使用报表"

    staff --> prepare_meal
    staff --> gen_payment
    staff --> req_meal_delivery
    staff --> gen_reports
}

@enduml