@startuml

left to right direction

actor :顾客: as customer

rectangle "COS System"{
    usecase (订餐) as order_meal
    usecase (变更\n订餐订单) as change_meal
    usecase (取消订餐订单) as cancel_meal
    usecase (查看菜单) as view_menu
    usecase (注册\n薪资抵扣) as reg_payroll
    usecase (撤销\n薪资抵扣) as unreg_payroll
    usecase (管理\n菜品订阅) as mgt_meal_subscribe
}
customer --> order_meal
customer --> change_meal
customer --> cancel_meal
customer --> view_menu
customer --> reg_payroll
customer --> unreg_payroll
customer --> mgt_meal_subscribe

@enduml