digraph "organization 03"{
    edge[dir="none"]
    node[shape="box"]
    splines = ortho

    test_team[label="测试经理\n测试工程师"]
    code_team[label="开发经理\n开发工程师"]
    执行经理 -> {test_team, code_team, 项目经理}

}