<?xml version="1.0" encoding="UTF-8" standalone="no"?><svg xmlns="http://www.w3.org/2000/svg" xmlns:xlink="http://www.w3.org/1999/xlink" contentScriptType="application/ecmascript" contentStyleType="text/css" height="359px" preserveAspectRatio="none" style="width:166px;height:359px;" version="1.1" viewBox="0 0 166 359" width="166px" zoomAndPan="magnify"><defs><filter height="300%" id="fr3y2jqma5sc8" width="300%" x="-1" y="-1"><feGaussianBlur result="blurOut" stdDeviation="2.0"/><feColorMatrix in="blurOut" result="blurOut2" type="matrix" values="0 0 0 0 0 0 0 0 0 0 0 0 0 0 0 0 0 0 .4 0"/><feOffset dx="4.0" dy="4.0" in="blurOut2" result="blurOut3"/><feBlend in="SourceGraphic" in2="blurOut3" mode="normal"/></filter></defs><g><ellipse cx="70.5" cy="20" fill="#000000" filter="url(#fr3y2jqma5sc8)" rx="10" ry="10" style="stroke: none; stroke-width: 1.0;"/><rect fill="#FEFECE" filter="url(#fr3y2jqma5sc8)" height="34.1328" rx="12.5" ry="12.5" style="stroke: #A80036; stroke-width: 1.5;" width="95" x="23" y="50"/><text fill="#000000" font-family="sans-serif" font-size="12" lengthAdjust="spacingAndGlyphs" textLength="75" x="33" y="71.6016">IO instruction</text><rect fill="#FEFECE" filter="url(#fr3y2jqma5sc8)" height="62.3984" rx="12.5" ry="12.5" style="stroke: #A80036; stroke-width: 1.5;" width="115" x="13" y="148.1328"/><text fill="#000000" font-family="sans-serif" font-size="12" lengthAdjust="spacingAndGlyphs" textLength="33" x="23" y="169.7344">check</text><text fill="#000000" font-family="sans-serif" font-size="12" lengthAdjust="spacingAndGlyphs" textLength="12" x="23" y="183.8672">or</text><text fill="#000000" font-family="sans-serif" font-size="12" lengthAdjust="spacingAndGlyphs" textLength="95" x="23" y="198">scheduling other</text><polygon fill="#FEFECE" filter="url(#fr3y2jqma5sc8)" points="70.5,104.1328,82.5,116.1328,70.5,128.1328,58.5,116.1328,70.5,104.1328" style="stroke: #A80036; stroke-width: 1.5;"/><polygon fill="#FEFECE" filter="url(#fr3y2jqma5sc8)" points="32,230.5313,109,230.5313,121,242.5313,109,254.5313,32,254.5313,20,242.5313,32,230.5313" style="stroke: #A80036; stroke-width: 1.5;"/><text fill="#000000" font-family="sans-serif" font-size="11" lengthAdjust="spacingAndGlyphs" textLength="77" x="32" y="246.6885">data is not ok?</text><text fill="#000000" font-family="sans-serif" font-size="11" lengthAdjust="spacingAndGlyphs" textLength="18" x="121" y="240.2109">yes</text><rect fill="#FEFECE" filter="url(#fr3y2jqma5sc8)" height="34.1328" rx="12.5" ry="12.5" style="stroke: #A80036; stroke-width: 1.5;" width="95" x="23" y="274.5313"/><text fill="#000000" font-family="sans-serif" font-size="12" lengthAdjust="spacingAndGlyphs" textLength="75" x="33" y="296.1328">read or write</text><ellipse cx="70.5" cy="338.6641" fill="#FFFFFF" filter="url(#fr3y2jqma5sc8)" rx="10" ry="10" style="stroke: #000000; stroke-width: 1.5;"/><line style="stroke: #000000; stroke-width: 2.5;" x1="64.3128" x2="76.6872" y1="332.4769" y2="344.8512"/><line style="stroke: #000000; stroke-width: 2.5;" x1="76.6872" x2="64.3128" y1="332.4769" y2="344.8512"/><line style="stroke: #A80036; stroke-width: 1.5;" x1="70.5" x2="70.5" y1="30" y2="50"/><polygon fill="#A80036" points="66.5,40,70.5,50,74.5,40,70.5,44" style="stroke: #A80036; stroke-width: 1.0;"/><line style="stroke: #A80036; stroke-width: 1.5;" x1="70.5" x2="70.5" y1="128.1328" y2="148.1328"/><polygon fill="#A80036" points="66.5,138.1328,70.5,148.1328,74.5,138.1328,70.5,142.1328" style="stroke: #A80036; stroke-width: 1.0;"/><line style="stroke: #A80036; stroke-width: 1.5;" x1="121" x2="140" y1="242.5313" y2="242.5313"/><polygon fill="#A80036" points="136,189.332,140,179.332,144,189.332,140,185.332" style="stroke: #A80036; stroke-width: 1.5;"/><line style="stroke: #A80036; stroke-width: 1.5;" x1="140" x2="140" y1="116.1328" y2="242.5313"/><line style="stroke: #A80036; stroke-width: 1.5;" x1="140" x2="82.5" y1="116.1328" y2="116.1328"/><polygon fill="#A80036" points="92.5,112.1328,82.5,116.1328,92.5,120.1328,88.5,116.1328" style="stroke: #A80036; stroke-width: 1.0;"/><line style="stroke: #A80036; stroke-width: 1.5;" x1="70.5" x2="70.5" y1="210.5313" y2="230.5313"/><polygon fill="#A80036" points="66.5,220.5313,70.5,230.5313,74.5,220.5313,70.5,224.5313" style="stroke: #A80036; stroke-width: 1.0;"/><line style="stroke: #A80036; stroke-width: 1.5;" x1="70.5" x2="70.5" y1="84.1328" y2="104.1328"/><polygon fill="#A80036" points="66.5,94.1328,70.5,104.1328,74.5,94.1328,70.5,98.1328" style="stroke: #A80036; stroke-width: 1.0;"/><line style="stroke: #A80036; stroke-width: 1.5;" x1="70.5" x2="70.5" y1="254.5313" y2="274.5313"/><polygon fill="#A80036" points="66.5,264.5313,70.5,274.5313,74.5,264.5313,70.5,268.5313" style="stroke: #A80036; stroke-width: 1.0;"/><line style="stroke: #A80036; stroke-width: 1.5;" x1="70.5" x2="70.5" y1="308.6641" y2="328.6641"/><polygon fill="#A80036" points="66.5,318.6641,70.5,328.6641,74.5,318.6641,70.5,322.6641" style="stroke: #A80036; stroke-width: 1.0;"/><!--MD5=[3ea4d65776af9a4157b0a31556421383]
@startuml

start

:IO instruction;

repeat
    :check\nor\nscheduling other;
repeat while (data is not ok?) is (yes)

:read or write;

end

@enduml

PlantUML version 1.2020.10(Sun May 17 17:35:57 CST 2020)
(GPL source distribution)
Java Runtime: Java(TM) SE Runtime Environment
JVM: Java HotSpot(TM) 64-Bit Server VM
Java Version: 1.8.0_91-b14
Operating System: Mac OS X
Default Encoding: UTF-8
Language: en
Country: US
--></g></svg>