@startuml "load module process"

start

:require("xxx");

if ("在文件模块缓存区中？") then (yes)
    :返回exports;
else (no)
    if ("是内置模块？") then (yes)
        if ("在内置模块缓存区中？") then (yes)
            :返回exports;
        else (no)
            :加载内置模块;
            :缓存内置模块;
            :返回exports;
        endif
    else (no)
        :查找文件模块;
        :根据文件扩展名载入模块;
        :缓存文件模块;
        :返回exports;
    endif
endif

stop

@enduml