@startuml

scale 1.5

package java.awt{
    interface LayoutManager
    interface LayoutManager2
    LayoutManager <|.. FlowLayout
    LayoutManager <|.. BorderLayout
    BorderLayout ..|> LayoutManager2
    LayoutManager <|.. CardLayout
    CardLayout ..|> LayoutManager2
    LayoutManager <|.. GridLayout 
}

package javax.swing{
    LayoutManager <|.. BoxLayout
    BoxLayout ..|> LayoutManager2
}

@enduml