@startuml "change student information"
|#LightGray|client web page|
start
:logon system;
if (cancel?) then (cancel)
    stop
endif
->form transmitted;

|#Gray|web server|
:receive web form;
->user id and password;

|#LightGray|mainframe|
:get\n student record;
->recode status;
if (not found?) then (not found)
    |web server|
    :display\n error message;
    |client web page|
    stop
endif
->exchange data\n place in\n message queue;

|web server|
:display\n current student\n data;
->web form sent;

|client web page|
:enter changes;
if (cancel?) then (cancel)
    stop
endif
->web form received;

|web server|
:validate changes;
->validation status;

if (invalid data?) then (invalid data received)
    :displyy\n error message;
    |client web page|
    stop
endif
|mainframe|

->valid data received;

fork
->valid data;
:update\n student\n record;
->record\n updated;
fork again
->valid data;
:create change\n student journal\n record;
->record\n updated;
end fork
->valid update;

|web server|
:display\n confirmation;
->confirmation sent;

|client web page|
stop

@enduml