<?xml version="1.0" encoding="UTF-8" standalone="no"?><svg xmlns="http://www.w3.org/2000/svg" xmlns:xlink="http://www.w3.org/1999/xlink" contentScriptType="application/ecmascript" contentStyleType="text/css" height="366px" preserveAspectRatio="none" style="width:194px;height:366px;" version="1.1" viewBox="0 0 194 366" width="194px" zoomAndPan="magnify"><defs><filter height="300%" id="fzhu4oa52heya" width="300%" x="-1" y="-1"><feGaussianBlur result="blurOut" stdDeviation="2.0"/><feColorMatrix in="blurOut" result="blurOut2" type="matrix" values="0 0 0 0 0 0 0 0 0 0 0 0 0 0 0 0 0 0 .4 0"/><feOffset dx="4.0" dy="4.0" in="blurOut2" result="blurOut3"/><feBlend in="SourceGraphic" in2="blurOut3" mode="normal"/></filter></defs><g><ellipse cx="88" cy="20" fill="#000000" filter="url(#fzhu4oa52heya)" rx="10" ry="10" style="stroke:none;stroke-width:1.0;"/><rect fill="#FEFECE" filter="url(#fzhu4oa52heya)" height="34.1328" rx="12.5" ry="12.5" style="stroke:#A80036;stroke-width:1.5;" width="82" x="47" y="94"/><text fill="#000000" font-family="sans-serif" font-size="12" lengthAdjust="spacing" textLength="62" x="57" y="115.6016">下载maven</text><rect fill="#FEFECE" filter="url(#fzhu4oa52heya)" height="34.1328" rx="12.5" ry="12.5" style="stroke:#A80036;stroke-width:1.5;" width="130" x="23" y="155.6328"/><text fill="#000000" font-family="sans-serif" font-size="12" lengthAdjust="spacing" textLength="110" x="33" y="177.2344">配置maven环境变量</text><polygon fill="#FEFECE" filter="url(#fzhu4oa52heya)" points="88,50,100,62,88,74,76,62,88,50" style="stroke:#A80036;stroke-width:1.5;"/><polygon fill="#FEFECE" filter="url(#fzhu4oa52heya)" points="32,209.7656,144,209.7656,156,221.7656,144,233.7656,32,233.7656,20,221.7656,32,209.7656" style="stroke:#A80036;stroke-width:1.5;"/><text fill="#000000" font-family="sans-serif" font-size="11" lengthAdjust="spacing" textLength="112" x="32" y="225.9229">需要更换maven版本？</text><text fill="#000000" font-family="sans-serif" font-size="11" lengthAdjust="spacing" textLength="19" x="156" y="219.4453">YES</text><rect fill="#FEFECE" filter="url(#fzhu4oa52heya)" height="34.1328" rx="12.5" ry="12.5" style="stroke:#A80036;stroke-width:1.5;" width="92" x="42" y="275.041"/><text fill="#000000" font-family="sans-serif" font-size="12" lengthAdjust="spacing" textLength="72" x="52" y="296.6426">使用mvn命令</text><ellipse cx="88" cy="339.1738" fill="#FFFFFF" filter="url(#fzhu4oa52heya)" rx="10" ry="10" style="stroke:#000000;stroke-width:1.5;"/><line style="stroke:#000000;stroke-width:2.5;" x1="81.8128" x2="94.1872" y1="332.9866" y2="345.361"/><line style="stroke:#000000;stroke-width:2.5;" x1="94.1872" x2="81.8128" y1="332.9866" y2="345.361"/><line style="stroke:#A80036;stroke-width:1.5;" x1="88" x2="88" y1="128.1328" y2="155.6328"/><polygon fill="#A80036" points="84,145.6328,88,155.6328,92,145.6328,88,149.6328" style="stroke:#A80036;stroke-width:1.0;"/><line style="stroke:#A80036;stroke-width:1.5;" x1="88" x2="88" y1="74" y2="94"/><polygon fill="#A80036" points="84,84,88,94,92,84,88,88" style="stroke:#A80036;stroke-width:1.0;"/><line style="stroke:#A80036;stroke-width:1.5;" x1="156" x2="168" y1="221.7656" y2="221.7656"/><polygon fill="#A80036" points="164,148.1328,168,138.1328,172,148.1328,168,144.1328" style="stroke:#A80036;stroke-width:1.5;"/><line style="stroke:#A80036;stroke-width:1.5;" x1="168" x2="168" y1="62" y2="221.7656"/><line style="stroke:#A80036;stroke-width:1.5;" x1="168" x2="100" y1="62" y2="62"/><polygon fill="#A80036" points="110,58,100,62,110,66,106,62" style="stroke:#A80036;stroke-width:1.0;"/><line style="stroke:#A80036;stroke-width:1.5;" x1="88" x2="88" y1="189.7656" y2="209.7656"/><polygon fill="#A80036" points="84,199.7656,88,209.7656,92,199.7656,88,203.7656" style="stroke:#A80036;stroke-width:1.0;"/><line style="stroke:#A80036;stroke-width:1.5;" x1="88" x2="88" y1="30" y2="50"/><polygon fill="#A80036" points="84,40,88,50,92,40,88,44" style="stroke:#A80036;stroke-width:1.0;"/><line style="stroke:#A80036;stroke-width:1.5;" x1="88" x2="88" y1="233.7656" y2="275.041"/><polygon fill="#A80036" points="84,265.041,88,275.041,92,265.041,88,269.041" style="stroke:#A80036;stroke-width:1.0;"/><text fill="#000000" font-family="sans-serif" font-size="11" lengthAdjust="spacing" textLength="17" x="92" y="255.2207">NO</text><line style="stroke:#A80036;stroke-width:1.5;" x1="88" x2="88" y1="309.1738" y2="329.1738"/><polygon fill="#A80036" points="84,319.1738,88,329.1738,92,319.1738,88,323.1738" style="stroke:#A80036;stroke-width:1.0;"/><!--MD5=[41a542a81f1a9e68f9bd6cff1e7f6301]
@startuml mvn

start

repeat
    :下载maven;
    :配置maven环境变量;
repeat while (需要更换maven版本？) is (YES)

->NO;

:使用mvn命令;

end

@enduml

PlantUML version 1.2021.00(Sun Jan 10 18:25:05 CST 2021)
(GPL source distribution)
Java Runtime: Java(TM) SE Runtime Environment
JVM: Java HotSpot(TM) 64-Bit Server VM
Default Encoding: UTF-8
Language: en
Country: CN
--></g></svg>