@startuml

'default is "top to bottom direction"
'there is no "bottom to top direction"
'there is no "right to left direction"

'top to bottom direction
left to right direction

scale 2

user1 --> (Usecase 1)
user2 -> (Usecase 2)

@enduml