%YAML 1.1
%TAG !u! tag:unity3d.com,2011:
--- !u!1001 &64404296147229790
PrefabInstance:
  m_ObjectHideFlags: 0
  serializedVersion: 2
  m_Modification:
    m_TransformParent: {fileID: 0}
    m_Modifications:
    - target: {fileID: 1554100012435694503, guid: 47cb56d644c70b34e9e49d57dcbedaf1,
        type: 3}
      propertyPath: m_Name
      value: PF Pixel Character - Viking
      objectReference: {fileID: 0}
    - target: {fileID: 5219961313650418416, guid: 47cb56d644c70b34e9e49d57dcbedaf1,
        type: 3}
      propertyPath: m_RootOrder
      value: 0
      objectReference: {fileID: 0}
    - target: {fileID: 5219961313650418416, guid: 47cb56d644c70b34e9e49d57dcbedaf1,
        type: 3}
      propertyPath: m_LocalPosition.x
      value: 0
      objectReference: {fileID: 0}
    - target: {fileID: 5219961313650418416, guid: 47cb56d644c70b34e9e49d57dcbedaf1,
        type: 3}
      propertyPath: m_LocalPosition.y
      value: 0
      objectReference: {fileID: 0}
    - target: {fileID: 5219961313650418416, guid: 47cb56d644c70b34e9e49d57dcbedaf1,
        type: 3}
      propertyPath: m_LocalPosition.z
      value: 0
      objectReference: {fileID: 0}
    - target: {fileID: 5219961313650418416, guid: 47cb56d644c70b34e9e49d57dcbedaf1,
        type: 3}
      propertyPath: m_LocalRotation.w
      value: 1
      objectReference: {fileID: 0}
    - target: {fileID: 5219961313650418416, guid: 47cb56d644c70b34e9e49d57dcbedaf1,
        type: 3}
      propertyPath: m_LocalRotation.x
      value: 0
      objectReference: {fileID: 0}
    - target: {fileID: 5219961313650418416, guid: 47cb56d644c70b34e9e49d57dcbedaf1,
        type: 3}
      propertyPath: m_LocalRotation.y
      value: 0
      objectReference: {fileID: 0}
    - target: {fileID: 5219961313650418416, guid: 47cb56d644c70b34e9e49d57dcbedaf1,
        type: 3}
      propertyPath: m_LocalRotation.z
      value: 0
      objectReference: {fileID: 0}
    - target: {fileID: 5219961313650418416, guid: 47cb56d644c70b34e9e49d57dcbedaf1,
        type: 3}
      propertyPath: m_LocalEulerAnglesHint.x
      value: 0
      objectReference: {fileID: 0}
    - target: {fileID: 5219961313650418416, guid: 47cb56d644c70b34e9e49d57dcbedaf1,
        type: 3}
      propertyPath: m_LocalEulerAnglesHint.y
      value: 0
      objectReference: {fileID: 0}
    - target: {fileID: 5219961313650418416, guid: 47cb56d644c70b34e9e49d57dcbedaf1,
        type: 3}
      propertyPath: m_LocalEulerAnglesHint.z
      value: 0
      objectReference: {fileID: 0}
    - target: {fileID: 5614195499488779661, guid: 47cb56d644c70b34e9e49d57dcbedaf1,
        type: 3}
      propertyPath: clipHair
      value: 1
      objectReference: {fileID: 0}
    - target: {fileID: 8199734694530587828, guid: 47cb56d644c70b34e9e49d57dcbedaf1,
        type: 3}
      propertyPath: m_RotationOffsets.Array.data[0].z
      value: 179.99992
      objectReference: {fileID: 0}
    - target: {fileID: 8199734694530587828, guid: 47cb56d644c70b34e9e49d57dcbedaf1,
        type: 3}
      propertyPath: m_TranslationOffsets.Array.data[0].x
      value: 0
      objectReference: {fileID: 0}
    - target: {fileID: 8199734694530587828, guid: 47cb56d644c70b34e9e49d57dcbedaf1,
        type: 3}
      propertyPath: m_TranslationOffsets.Array.data[0].y
      value: -0.030000031
      objectReference: {fileID: 0}
    - target: {fileID: 9121811560560874039, guid: 47cb56d644c70b34e9e49d57dcbedaf1,
        type: 3}
      propertyPath: m_Materials.Array.data[0]
      value: 
      objectReference: {fileID: 2100000, guid: f6393f5051c6b9842b8a92472f0e7ec8, type: 2}
    - target: {fileID: 9121811560560874045, guid: 47cb56d644c70b34e9e49d57dcbedaf1,
        type: 3}
      propertyPath: m_Materials.Array.data[0]
      value: 
      objectReference: {fileID: 2100000, guid: 85822fa43d955b7498318dca80c81162, type: 2}
    - target: {fileID: 9121811560560874049, guid: 47cb56d644c70b34e9e49d57dcbedaf1,
        type: 3}
      propertyPath: m_Materials.Array.data[0]
      value: 
      objectReference: {fileID: 2100000, guid: a76178a2db48f9a4da313f2efb582014, type: 2}
    - target: {fileID: 9121811560560874053, guid: 47cb56d644c70b34e9e49d57dcbedaf1,
        type: 3}
      propertyPath: m_Materials.Array.data[0]
      value: 
      objectReference: {fileID: 2100000, guid: 3c2338cfdab8dc049bf2ab1faa4ecb02, type: 2}
    - target: {fileID: 9121811560560874055, guid: 47cb56d644c70b34e9e49d57dcbedaf1,
        type: 3}
      propertyPath: m_Enabled
      value: 0
      objectReference: {fileID: 0}
    - target: {fileID: 9121811560560874055, guid: 47cb56d644c70b34e9e49d57dcbedaf1,
        type: 3}
      propertyPath: m_Materials.Array.data[0]
      value: 
      objectReference: {fileID: 2100000, guid: a76178a2db48f9a4da313f2efb582014, type: 2}
    - target: {fileID: 9121811560560874059, guid: 47cb56d644c70b34e9e49d57dcbedaf1,
        type: 3}
      propertyPath: m_Materials.Array.data[0]
      value: 
      objectReference: {fileID: 2100000, guid: a05ea07b18a3b58448c99ec62f8074ab, type: 2}
    - target: {fileID: 9121811560560874061, guid: 47cb56d644c70b34e9e49d57dcbedaf1,
        type: 3}
      propertyPath: m_Materials.Array.data[0]
      value: 
      objectReference: {fileID: 2100000, guid: f6393f5051c6b9842b8a92472f0e7ec8, type: 2}
    - target: {fileID: 9121811560560874063, guid: 47cb56d644c70b34e9e49d57dcbedaf1,
        type: 3}
      propertyPath: m_Materials.Array.data[0]
      value: 
      objectReference: {fileID: 2100000, guid: a8728809f3fc7444bb0d16f5d823881d, type: 2}
    m_RemovedComponents: []
  m_SourcePrefab: {fileID: 100100000, guid: 47cb56d644c70b34e9e49d57dcbedaf1, type: 3}
--- !u!4 &2826405102420299989 stripped
Transform:
  m_CorrespondingSourceObject: {fileID: 2872635938322795659, guid: 47cb56d644c70b34e9e49d57dcbedaf1,
    type: 3}
  m_PrefabInstance: {fileID: 64404296147229790}
  m_PrefabAsset: {fileID: 0}
--- !u!1001 &1124246349301852140
PrefabInstance:
  m_ObjectHideFlags: 0
  serializedVersion: 2
  m_Modification:
    m_TransformParent: {fileID: 2826405102420299989}
    m_Modifications:
    - target: {fileID: 6805170423116255223, guid: 4d40a02f78c47d64d9f6a7b540740a43,
        type: 3}
      propertyPath: m_Name
      value: PF Weapon - Battle Axe
      objectReference: {fileID: 0}
    - target: {fileID: 8632446899269897361, guid: 4d40a02f78c47d64d9f6a7b540740a43,
        type: 3}
      propertyPath: m_RootOrder
      value: 0
      objectReference: {fileID: 0}
    - target: {fileID: 8632446899269897361, guid: 4d40a02f78c47d64d9f6a7b540740a43,
        type: 3}
      propertyPath: m_LocalPosition.x
      value: 0
      objectReference: {fileID: 0}
    - target: {fileID: 8632446899269897361, guid: 4d40a02f78c47d64d9f6a7b540740a43,
        type: 3}
      propertyPath: m_LocalPosition.y
      value: 0
      objectReference: {fileID: 0}
    - target: {fileID: 8632446899269897361, guid: 4d40a02f78c47d64d9f6a7b540740a43,
        type: 3}
      propertyPath: m_LocalPosition.z
      value: 0
      objectReference: {fileID: 0}
    - target: {fileID: 8632446899269897361, guid: 4d40a02f78c47d64d9f6a7b540740a43,
        type: 3}
      propertyPath: m_LocalRotation.w
      value: 1
      objectReference: {fileID: 0}
    - target: {fileID: 8632446899269897361, guid: 4d40a02f78c47d64d9f6a7b540740a43,
        type: 3}
      propertyPath: m_LocalRotation.x
      value: 0
      objectReference: {fileID: 0}
    - target: {fileID: 8632446899269897361, guid: 4d40a02f78c47d64d9f6a7b540740a43,
        type: 3}
      propertyPath: m_LocalRotation.y
      value: 0
      objectReference: {fileID: 0}
    - target: {fileID: 8632446899269897361, guid: 4d40a02f78c47d64d9f6a7b540740a43,
        type: 3}
      propertyPath: m_LocalRotation.z
      value: 0
      objectReference: {fileID: 0}
    - target: {fileID: 8632446899269897361, guid: 4d40a02f78c47d64d9f6a7b540740a43,
        type: 3}
      propertyPath: m_LocalEulerAnglesHint.x
      value: 0
      objectReference: {fileID: 0}
    - target: {fileID: 8632446899269897361, guid: 4d40a02f78c47d64d9f6a7b540740a43,
        type: 3}
      propertyPath: m_LocalEulerAnglesHint.y
      value: 0
      objectReference: {fileID: 0}
    - target: {fileID: 8632446899269897361, guid: 4d40a02f78c47d64d9f6a7b540740a43,
        type: 3}
      propertyPath: m_LocalEulerAnglesHint.z
      value: 0
      objectReference: {fileID: 0}
    m_RemovedComponents: []
  m_SourcePrefab: {fileID: 100100000, guid: 4d40a02f78c47d64d9f6a7b540740a43, type: 3}
