c:\Users\asty\Desktop\LP DLIS\Integration_continue\TP2\demo\src\test\java\com\example\ContactServiceMockTest.java
c:\Users\asty\Desktop\LP DLIS\Integration_continue\TP2\demo\src\test\java\com\example\EmailValidatorTest.java
c:\Users\asty\Desktop\LP DLIS\Integration_continue\TP2\demo\src\test\java\com\example\ContactServiceTest.java
