! -------------------------
   4841.5523962825891        1.0098361245552270        2.4572572128932650E-002   1.0000000000000000     
   4841.5927704836977       0.96523010532097209        2.3961370643369072E-002   1.0000000000000000     
   4841.6331450214921       0.97031119018412881        2.4028530143371453E-002   1.0000000000000000     
   4841.6735198959777        1.0011167960217704        2.4367808470091616E-002   1.0000000000000000     
   4841.7138951071493       0.97890710660737867        2.4280859206039136E-002   1.0000000000000000     
   4841.7542706550139       0.97795024911851192        2.4496178248853369E-002   1.0000000000000000     
   4841.7946465395744       0.99720551061526175        2.4386583215757505E-002   1.0000000000000000     
   4841.8350227608380        1.0280592166113085        2.4816343344376924E-002   1.0000000000000000     
   4841.8753993187984        1.0005941054530025        2.4608155338790631E-002   1.0000000000000000     
   4841.9157762134628        1.0088843228181290        2.4655497849200902E-002   1.0000000000000000     
   4841.9561534448349        1.0111393865279423        2.5075460395566594E-002   1.0000000000000000     
   4841.9965310129210        1.0088169870507706        2.4680777460739396E-002   1.0000000000000000     
   4842.0369089177157       0.99822299522568347        2.4538384704465312E-002   1.0000000000000000     
   4842.0772871592253       0.97520708119762789        2.4203752600541709E-002   1.0000000000000000     
   4842.1176657374535       0.98177517458051822        2.4342545147202736E-002   1.0000000000000000     
   4842.1580446524076        1.0451102348578842        2.4956416865684044E-002   1.0000000000000000     
   4842.1984239040803        1.0195403855621654        2.4781127926247506E-002   1.0000000000000000     
   4842.2388034924797        1.0468950344928361        2.6271554903300121E-002   1.0000000000000000     
   4842.2791834176141        1.0293319056029822        2.5911622556205972E-002   1.0000000000000000     
   4842.3195636794762       0.96302623573412582        2.4673333723262244E-002   1.0000000000000000     
   4842.3599442780724       0.97029120695360160        2.4288320027152640E-002  0.99999999995289190     
   4842.4003252134071        1.0025399809051152        2.4817524837253666E-002  0.99999999839834108     
   4842.4407064854877       0.97625662292387949        2.4453424845405618E-002  0.99999997653328310     
   4842.4810880943069        1.0373531920515231        2.5108029905847675E-002  0.99999984303216005     
   4842.5214700398719       0.98287214905727482        2.4673738935590557E-002  0.99999946664029660     
   4842.5618523221865       0.96058126172263270        2.4470963394814318E-002  0.99999887795670539     
   4842.6022349412578       0.98871959828209466        2.4634387167438383E-002  0.99999806603145935     
   4842.6426178970796       0.99653147005491305        2.5057470749824211E-002  0.99999573676687037     
   4842.6830011896582       0.99782491644700488        2.5438118186016205E-002  0.99997767910649693     
   4842.7233848189971        1.0059958115092276        2.5188983478957930E-002  0.99984407605324144     
   4842.7637687851047        1.0104824519369315        2.5270267402135064E-002  0.99917656088188556     
   4842.8041530879736       0.98833709032644224        2.5486226557329072E-002  0.99702935468264919     
   4842.8445377276112        1.0118640075157239        2.5686885008581739E-002  0.99241618884813954     
   4842.8849227040200       0.98224317545497952        2.5298383904874482E-002  0.98378880018406356     
   4842.9253080172084       0.99186816688299340        2.5450029456404306E-002  0.96439797136098748     
   4842.9656936671690       0.92941497188744682        2.4678178594168872E-002  0.92893659647450422     
   4843.0060796539101       0.88708179131637510        2.4202495150070009E-002  0.89836559428323914     
   4843.0464659774389       0.90990939429618067        2.4324386087833202E-002  0.89574663104704888     
   4843.0868526377481       0.89102629286333657        2.4225434940951904E-002  0.90114801166436020     
   4843.1272396348459       0.91394139439433986        2.4557937375489433E-002  0.90251892848469817     
   4843.1676269687350       0.92148583003217643        2.4715947889294498E-002  0.90680608007404373     
   4843.2080146394237       0.87882978011886759        2.4276838658741896E-002  0.89950122263841825     
   4843.2484026469037       0.88965312028372456        2.4346311913377501E-002  0.88477304562746550     
   4843.2887909911833       0.89236404566550587        2.4254958598644908E-002  0.88753541250940526     
   4843.3291796722660       0.91709181065410272        2.4591277053751248E-002  0.91385117440039931     
   4843.3695686901592       0.93892256849540490        2.4938530542944263E-002  0.94794307062190941     
   4843.4099580448546        1.0090526485324678        2.5821578471473719E-002  0.97172617138531903     
   4843.4503477363623       0.98209869786462745        2.5671358265975348E-002  0.97744829366634167     
   4843.4907377646823       0.95347555510621562        2.5247801140441537E-002  0.96649374696180779     
   4843.5311281298245       0.90879504173996228        2.4765763466601649E-002  0.94440328660981798     
   4843.5715188317818       0.91998908997638085        2.4707577468627739E-002  0.91808152618417482     
   4843.6119098705603       0.93136704882431487        2.5070758391181371E-002  0.89053365400123852     
   4843.6523012461648       0.87583232842900227        2.4661963733963344E-002  0.86525985213385748     
   4843.6926929586016       0.88308559716490020        2.4963565540745941E-002  0.86797065442171117     
   4843.7330850078633       0.94722253992424865        2.5833775801572954E-002  0.91169608942821079     
   4843.7734773939592        1.0103984943129913        2.6658694141794111E-002  0.95903062744890111     
   4843.8138701168964        1.0703961086827749        3.0010738324267115E-002  0.98441411100637133     
   4843.8542631766677       0.97782921968284053        2.7214355167886568E-002  0.99454174063872636     
   4843.8946565732804        1.0100808091085822        2.6619561446581494E-002  0.99830653840521466     
   4843.9350503067380        1.0236988936445615        2.6797342474809433E-002  0.99955593886967031     
   4843.9754443770480        1.0299214552718234        2.6750395296584167E-002  0.99990071358484600     
   4844.0158387842030        1.0500693139303432        2.7021565807492730E-002  0.99997913787606119     
   4844.0562335282120        1.0296893266242007        2.6748165467315104E-002  0.99999446488662436     
   4844.0966286090761        1.0389805750382632        2.7042922415621420E-002  0.99999745655224381     
   4844.1370240268043        1.0077151634464454        2.6777891933593392E-002  0.99999821677192713     
   4844.1774197813893        1.0214254309825095        2.7231579152976141E-002   1.0000000000000000     
   4844.2178158728375        1.0396359224627787        2.7188846942319343E-002   1.0000000000000000     
   4844.2582123011543        1.0260267876584686        2.7093619383911603E-002   1.0000000000000000     
   4844.2986090663453       0.98631203121940458        2.6847364425560596E-002   1.0000000000000000     
   4844.3390061684040       0.99812491196339803        2.6938969858734039E-002   1.0000000000000000     
   4844.3794036073377        1.0330954795968599        2.7307347841324398E-002   1.0000000000000000     
   4844.4198013831510       0.99019478619770285        2.6893813731709560E-002   1.0000000000000000     
   4844.4601994958502       0.99569434495397979        2.6934768897552017E-002   1.0000000000000000     
   4844.5005979454281       0.96115353065084830        2.6623553868894149E-002   1.0000000000000000     
   4844.5409967318928        1.0091812509969906        2.7233516113737880E-002   1.0000000000000000     
   4844.5813958552471        1.0347910534336442        2.7441012619788895E-002   1.0000000000000000     
   4844.6217953154983        1.0053414445908491        2.7077526966193657E-002   1.0000000000000000     
   4844.6621951126408        1.0486147355651512        2.7778770380130661E-002   1.0000000000000000     
   4844.7025952466811        1.0231913974561146        2.7452126184311202E-002   1.0000000000000000     
   4844.7429957176219       0.97829861192136791        2.6805217459364601E-002   1.0000000000000000     
   4844.7833965254713       0.98941290155100792        2.7011254284245022E-002   1.0000000000000000     
   4844.8237976702221        1.0053356923189851        2.7224938666736625E-002   1.0000000000000000     
   4844.8641991518825       0.98590872744522451        2.6899446009292199E-002   1.0000000000000000     
   4844.9046009704598        1.0119885854317310        2.7426938527338102E-002   1.0000000000000000     
   4844.9450031259476        1.0397257497532699        2.7803019637330045E-002   1.0000000000000000     
!  ---- tick mark positions for above ----
!      4842.90836     6    18
!      4843.01487     6    19
!      4843.11933     6    20
!      4843.26717     6    21
!      4843.63051     6    22
!      4843.68850     6    23
