MgI_2852        
SiII_1526       
SiII_1808       
CrII_2056       
CrII_2066       
MnII_2576       
MnII_2594       
MnII_2606       
NiII_1709       
NiII_1741       
NiII_1751       
FeII_2382       
FeII_2600       
FeII_2344       
FeII_2586       
FeII_1608       
FeII_2374       
FeII_1611       
