7103.77832   0.99639   1.242e-02   1.000e+00
7103.83057   1.00894   1.258e-02   1.000e+00
7103.88232   1.01101   1.259e-02   1.000e+00
7103.93457   1.01221   1.251e-02   1.000e+00
7103.98682   0.99459   1.258e-02   1.000e+00
7104.03857   0.99444   1.253e-02   1.000e+00
7104.09082   1.00402   1.370e-02   1.000e+00
7104.14307   0.99307   1.253e-02   1.000e+00
7104.19531   0.99172   1.250e-02   1.000e+00
7104.24707   0.98818   1.249e-02   1.000e+00
7104.29932   0.95856   1.249e-02   1.000e+00
7104.35156   0.99139   1.251e-02   1.000e+00
7104.40332   0.98555   1.246e-02   1.000e+00
7104.45557   0.99710   1.252e-02   1.000e+00
7104.50781   0.99560   1.244e-02   1.000e+00
7104.55957   1.01726   1.257e-02   1.000e+00
7104.61182   1.01426   1.253e-02   1.000e+00
7104.66406   1.01365   1.251e-02   1.000e+00
7104.71631   1.00859   1.256e-02   1.000e+00
7104.76807   0.98222   1.249e-02   1.000e+00
7104.82031   0.96579   1.230e-02   1.000e+00
7104.87256   0.99935   1.252e-02   1.000e+00
7104.92432   0.99035   1.245e-02   1.000e+00
7104.97656   0.98197   1.237e-02   1.000e+00
7105.02881   1.00421   1.256e-02   1.000e+00
7105.08057   0.98854   1.250e-02   1.000e+00
7105.13281   1.01717   1.247e-02   1.000e+00
7105.18506   1.01191   1.255e-02   1.000e+00
7105.23730   0.99191   1.292e-02   1.000e+00
7105.28906   0.99986   1.291e-02   1.000e+00
7105.34131   1.00270   1.266e-02   1.000e+00
7105.39355   1.02542   1.259e-02   1.000e+00
7105.44531   0.99800   1.251e-02   1.000e+00
7105.49756   0.98756   1.247e-02   1.000e+00
7105.54980   0.98739   1.242e-02   1.000e+00
7105.60205   1.01232   1.263e-02   1.000e+00
7105.65381   0.98986   1.379e-02   1.000e+00
7105.70605   0.99321   1.243e-02   1.000e+00
7105.75830   0.98175   1.251e-02   1.000e+00
7105.81006   0.99710   1.253e-02   1.000e+00
7105.86230   1.00657   1.241e-02   1.000e+00
7105.91455   1.01146   1.259e-02   1.000e+00
7105.96680   0.99879   1.246e-02   1.000e+00
7106.01855   0.99202   1.233e-02   1.000e+00
7106.07080   1.02580   1.259e-02   1.000e+00
7106.12305   1.00539   1.239e-02   1.000e+00
7106.17529   0.97885   1.242e-02   1.000e+00
7106.22705   1.00047   1.246e-02   1.000e+00
7106.27930   0.97475   1.229e-02   1.000e+00
7106.33154   0.97853   1.240e-02   1.000e+00
7106.38330   1.00935   1.249e-02   1.000e+00
7106.43555   1.00405   1.242e-02   1.000e+00
7106.48779   0.99799   1.249e-02   1.000e+00
7106.54004   0.99587   1.233e-02   1.000e+00
7106.59180   0.98422   1.233e-02   1.000e+00
7106.64404   1.00036   1.252e-02   1.000e+00
7106.69629   0.98531   1.355e-02   1.000e+00
7106.74854   0.97849   1.239e-02   1.000e+00
7106.80029   1.00874   1.250e-02   1.000e+00
7106.85254   0.97826   1.233e-02   1.000e+00
7106.90479   0.97328   1.242e-02   1.000e+00
7106.95654   0.98897   1.242e-02   1.000e+00
7107.00879   1.01838   1.231e-02   1.000e+00
7107.06104   1.04562   1.259e-02   1.000e+00
7107.11328   1.00133   1.239e-02   1.000e+00
7107.16504   0.98653   1.237e-02   1.000e+00
7107.21729   0.98024   1.241e-02   1.000e+00
7107.26953   0.96486   1.225e-02   1.000e+00
7107.32178   0.97432   1.234e-02   1.000e+00
7107.37354   0.98365   1.242e-02   1.000e+00
7107.42578   1.02257   1.239e-02   1.000e+00
7107.47803   0.99570   1.240e-02   1.000e+00
7107.53027   0.98510   1.228e-02   1.000e+00
7107.58203   0.98146   1.236e-02   1.000e+00
7107.63428   0.99685   1.250e-02   1.000e+00
7107.68652   0.99324   1.233e-02   1.000e+00
7107.73877   1.00673   1.246e-02   1.000e+00
7107.79053   1.00271   1.239e-02   1.000e+00
7107.84277   0.99802   1.227e-02   1.000e+00
7107.89502   1.00694   1.243e-02   1.000e+00
7107.94727   0.99570   1.253e-02   1.000e+00
7107.99902   1.00592   1.271e-02   1.000e+00
7108.05127   1.00683   1.253e-02   1.000e+00
7108.10352   0.99453   1.233e-02   1.000e+00
7108.15576   0.98402   1.235e-02   1.000e+00
7108.20752   0.99719   1.240e-02   1.000e+00
7108.25977   0.97528   1.218e-02   1.000e+00
7108.31201   0.98009   1.232e-02   1.000e+00
7108.36426   0.97874   1.226e-02   1.000e+00
7108.41602   0.99633   1.227e-02   1.000e+00
7108.46826   0.99191   1.257e-02   1.000e+00
7108.52051   0.99641   1.234e-02   1.000e+00
7108.57275   1.00571   1.237e-02   1.000e+00
7108.62451   1.02820   1.247e-02   1.000e+00
7108.67676   0.99961   1.225e-02   1.000e+00
7108.72900   0.99005   1.229e-02   1.000e+00
7108.78125   0.97639   1.221e-02   1.000e+00
7108.83301   1.00671   1.225e-02   1.000e+00
7108.88525   0.99123   1.228e-02   1.000e+00
7108.93750   0.98317   1.214e-02   1.000e+00
7108.98975   0.98936   1.230e-02   1.000e+00
7109.04199   0.99773   1.232e-02   1.000e+00
7109.09375   0.97102   1.346e-02   1.000e+00
7109.14600   0.97010   1.221e-02   1.000e+00
7109.19824   0.98118   1.209e-02   1.000e+00
7109.25049   0.97189   1.220e-02   1.000e+00
7109.30225   0.99242   1.229e-02   1.000e+00
7109.35449   0.99492   1.217e-02   1.000e+00
7109.40674   0.99375   1.225e-02   1.000e+00
7109.45898   0.99314   1.217e-02   1.000e+00
7109.51123   1.00473   1.232e-02   1.000e+00
7109.56299   1.00028   1.225e-02   1.000e+00
7109.61523   1.01974   1.223e-02   1.000e+00
7109.66748   0.99089   1.227e-02   1.000e+00
7109.71973   1.00709   1.232e-02   1.000e+00
7109.77148   0.98259   1.217e-02   1.000e+00
7109.82373   0.97968   1.215e-02   1.000e+00
7109.87598   1.00312   1.221e-02   1.000e+00
7109.92822   1.02388   1.234e-02   1.000e+00
7109.98047   1.00334   1.218e-02   1.000e+00
7110.03223   0.98618   1.212e-02   1.000e+00
7110.08447   1.00460   1.223e-02   1.000e+00
7110.13672   1.01647   1.219e-02   1.000e+00
7110.18896   0.97871   1.214e-02   1.000e+00
7110.24072   0.98507   1.215e-02   1.000e+00
7110.29297   0.99284   1.211e-02   1.000e+00
7110.34521   1.01173   1.226e-02   1.000e+00
7110.39746   0.99148   1.207e-02   1.000e+00
7110.44971   0.98858   1.212e-02   1.000e+00
7110.50146   0.99648   1.222e-02   1.000e+00
7110.55371   0.96887   1.201e-02   1.000e+00
7110.60596   0.96279   1.206e-02   1.000e+00
7110.65820   0.93320   1.185e-02   1.000e+00
7110.71045   0.84412   1.161e-02   1.000e+00
7110.76221   0.77470   1.132e-02   1.000e+00
7110.81445   0.74213   1.107e-02   1.000e+00
7110.86670   0.77192   1.145e-02   1.000e+00
7110.91895   0.82727   1.164e-02   1.000e+00
7110.97119   0.86499   1.203e-02   1.000e+00
7111.02295   0.90521   1.221e-02   1.000e+00
7111.07520   0.94720   1.195e-02   1.000e+00
7111.12744   0.93136   1.195e-02   1.000e+00
7111.17969   0.96190   1.191e-02   1.000e+00
7111.23193   0.98860   1.332e-02   1.000e+00
7111.28369   0.97283   1.210e-02   1.000e+00
7111.33594   0.96705   1.196e-02   1.000e+00
7111.38818   0.99441   1.211e-02   1.000e+00
7111.44043   0.98214   1.201e-02   1.000e+00
7111.49268   0.97751   1.209e-02   1.000e+00
7111.54443   0.98101   1.208e-02   1.000e+00
7111.59668   0.99572   1.204e-02   1.000e+00
7111.64893   0.99574   1.216e-02   1.000e+00
7111.70117   1.02419   1.206e-02   1.000e+00
7111.75342   1.00608   1.218e-02   1.000e+00
7111.80518   1.02505   1.357e-02   1.000e+00
7111.85742   1.00183   1.249e-02   1.000e+00
7111.90967   1.00833   1.294e-02   1.000e+00
7111.96191   0.98190   1.248e-02   1.000e+00
7112.01416   0.99903   1.226e-02   1.000e+00
7112.06592   1.00933   1.221e-02   1.000e+00
7112.11816   1.01500   1.211e-02   1.000e+00
7112.17041   0.97221   1.208e-02   1.000e+00
7112.22266   0.98426   1.320e-02   1.000e+00
7112.27490   1.01813   1.224e-02   1.000e+00
7112.32666   1.00675   1.225e-02   1.000e+00
7112.37891   1.00903   1.213e-02   1.000e+00
7112.43115   0.98631   1.217e-02   1.000e+00
7112.48340   1.00038   1.285e-02   1.000e+00
7112.53564   0.97772   1.464e-02   1.000e+00
7112.58789   0.99318   1.278e-02   1.000e+00
7112.63965   1.00700   1.206e-02   1.000e+00
7112.69189   0.97613   1.206e-02   1.000e+00
7112.74414   0.99922   1.207e-02   1.000e+00
7112.79639   0.99320   1.310e-02   1.000e+00
7112.84863   1.00259   1.198e-02   1.000e+00
7112.90088   0.99382   1.214e-02   1.000e+00
7112.95264   0.98669   1.210e-02   1.000e+00
7113.00488   0.99913   1.203e-02   1.000e+00
7113.05713   0.98944   1.331e-02   1.000e+00
7113.10938   1.00513   1.207e-02   1.000e+00
7113.16162   1.00610   1.216e-02   1.000e+00
7113.21387   0.99946   1.203e-02   1.000e+00
7113.26562   1.00178   1.207e-02   1.000e+00
7113.31787   1.00612   1.215e-02   1.000e+00
7113.37012   0.98943   1.193e-02   1.000e+00
7113.42236   0.98167   1.227e-02   1.000e+00
7113.47461   1.00398   1.224e-02   1.000e+00
7113.52637   1.00364   1.205e-02   1.000e+00
7113.57861   1.01156   1.212e-02   1.000e+00
7113.63086   0.98809   1.186e-02   1.000e+00
7113.68311   1.00797   1.209e-02   1.000e+00
7113.73535   1.00812   1.199e-02   1.000e+00
7113.78760   0.99904   1.206e-02   1.000e+00
7113.83984   0.99866   1.198e-02   1.000e+00
7113.89160   0.99294   1.198e-02   1.000e+00
7113.94385   1.00875   1.218e-02   1.000e+00
7113.99609   0.98707   1.194e-02   1.000e+00
7114.04834   0.98235   1.205e-02   1.000e+00
7114.10059   0.97304   1.194e-02   1.000e+00
7114.15283   0.98553   1.203e-02   1.000e+00
7114.20459   1.01348   1.214e-02   1.000e+00
7114.25684   1.01468   1.198e-02   1.000e+00
7114.30908   1.00151   1.210e-02   1.000e+00
7114.36133   1.01595   1.200e-02   1.000e+00
7114.41357   0.99763   1.203e-02   1.000e+00
7114.46582   1.00115   1.313e-02   1.000e+00
7114.51807   0.99367   1.202e-02   1.000e+00
7114.56982   0.99914   1.205e-02   1.000e+00
7114.62207   1.00488   1.193e-02   1.000e+00
7114.67432   0.99158   1.205e-02   1.000e+00
7114.72656   0.98206   1.197e-02   1.000e+00
7114.77881   0.98841   1.209e-02   1.000e+00
7114.83105   0.98800   1.196e-02   1.000e+00
7114.88281   1.00683   1.201e-02   1.000e+00
7114.93506   1.00405   1.205e-02   1.000e+00
7114.98730   1.01269   1.202e-02   1.000e+00
7115.03955   0.99002   1.203e-02   1.000e+00
7115.09180   0.98280   1.196e-02   1.000e+00
7115.14404   1.00327   1.209e-02   1.000e+00
7115.19629   1.00227   1.197e-02   1.000e+00
7115.24805   1.00709   1.203e-02   1.000e+00
7115.30029   1.00227   1.201e-02   1.000e+00
7115.35254   0.99603   1.189e-02   1.000e+00
7115.40479   1.02233   1.214e-02   1.000e+00
7115.45703   0.99623   1.193e-02   1.000e+00
7115.50928   0.99712   1.207e-02   1.000e+00
7115.56152   1.00465   1.193e-02   1.000e+00
7115.61377   1.00506   1.215e-02   1.000e+00
7115.66553   1.00469   1.253e-02   1.000e+00
7115.71777   0.99413   1.223e-02   1.000e+00
7115.77002   1.00389   1.198e-02   1.000e+00
7115.82227   1.00691   1.191e-02   1.000e+00
7115.87451   0.99544   1.200e-02   1.000e+00
7115.92676   1.00860   1.196e-02   1.000e+00
7115.97900   1.01049   1.210e-02   1.000e+00
7116.03076   0.99196   1.324e-02   1.000e+00
7116.08301   1.01336   1.233e-02   1.000e+00
7116.13525   1.01519   1.240e-02   1.000e+00
7116.18750   1.01524   1.211e-02   1.000e+00
7116.23975   1.00791   1.289e-02   1.000e+00
7116.29199   0.97789   1.267e-02   1.000e+00
7116.34424   0.99329   1.320e-02   1.000e+00
7116.39648   0.99723   1.187e-02   1.000e+00
7116.44873   1.01408   1.199e-02   1.000e+00
7116.50049   1.00819   1.212e-02   1.000e+00
7116.55273   0.99386   1.191e-02   1.000e+00
7116.60498   0.97108   1.188e-02   1.000e+00
7116.65723   0.98519   1.182e-02   1.000e+00
7116.70947   1.00201   1.212e-02   1.000e+00
7116.76172   0.99986   1.205e-02   1.000e+00
7116.81396   0.98881   1.272e-02   1.000e+00
7116.86621   0.98849   1.213e-02   1.000e+00
7116.91797   1.01229   1.197e-02   1.000e+00
7116.97021   1.01914   1.207e-02   1.000e+00
7117.02246   1.00348   1.190e-02   1.000e+00
7117.07471   1.01584   1.196e-02   1.000e+00
7117.12695   1.02321   1.197e-02   1.000e+00
7117.17920   1.00450   1.200e-02   1.000e+00
7117.23145   1.01510   1.193e-02   1.000e+00
7117.28369   1.00573   1.196e-02   1.000e+00
7117.33594   1.00239   1.192e-02   1.000e+00
7117.38770   0.98519   1.189e-02   1.000e+00
7117.43994   1.00197   1.199e-02   1.000e+00
7117.49219   0.99794   1.188e-02   1.000e+00
7117.54443   1.00511   1.323e-02   1.000e+00
7117.59668   0.99240   1.180e-02   1.000e+00
7117.64893   0.96943   1.188e-02   1.000e+00
7117.70117   0.98317   1.181e-02   1.000e+00
7117.75342   1.00648   1.208e-02   1.000e+00
7117.80566   1.01853   1.199e-02   1.000e+00
7117.85791   1.00040   1.202e-02   1.000e+00
7117.90967   1.00240   1.200e-02   1.000e+00
