6491.21094   1.00127   1.577e-02   1.000e+00
6491.25879   0.99016   1.569e-02   1.000e+00
6491.30615   0.97189   1.551e-02   1.000e+00
6491.35400   0.97475   1.552e-02   1.000e+00
6491.40137   1.00182   1.574e-02   1.000e+00
6491.44922   0.99432   1.572e-02   1.000e+00
6491.49658   1.00637   1.572e-02   1.000e+00
6491.54443   1.00029   1.565e-02   1.000e+00
6491.59180   0.98089   1.566e-02   1.000e+00
6491.63965   0.98956   1.567e-02   1.000e+00
6491.68701   1.00598   1.564e-02   1.000e+00
6491.73486   1.01893   1.574e-02   1.000e+00
6491.78223   0.98260   1.565e-02   1.000e+00
6491.83008   0.99404   1.570e-02   1.000e+00
6491.87744   1.01571   1.572e-02   1.000e+00
6491.92529   1.00044   1.565e-02   1.000e+00
6491.97266   0.99621   1.575e-02   1.000e+00
6492.02051   0.99238   1.569e-02   1.000e+00
6492.06787   0.99830   1.566e-02   1.000e+00
6492.11572   1.03655   1.588e-02   1.000e+00
6492.16309   1.00061   1.577e-02   1.000e+00
6492.21094   0.97148   1.565e-02   1.000e+00
6492.25830   1.01307   1.580e-02   1.000e+00
6492.30615   0.99312   1.588e-02   1.000e+00
6492.35352   0.96801   1.602e-02   1.000e+00
6492.40137   0.99498   1.585e-02   1.000e+00
6492.44873   0.99820   1.567e-02   1.000e+00
6492.49658   1.02380   1.584e-02   1.000e+00
6492.54395   0.97225   1.566e-02   1.000e+00
6492.59180   0.96033   1.563e-02   1.000e+00
6492.63916   0.96970   1.562e-02   1.000e+00
6492.68701   0.98989   1.592e-02   1.000e+00
6492.73438   0.97686   1.572e-02   1.000e+00
6492.78223   0.98686   1.572e-02   1.000e+00
6492.82959   0.95728   1.549e-02   1.000e+00
6492.87744   0.99060   1.566e-02   1.000e+00
6492.92480   1.01130   1.580e-02   1.000e+00
6492.97266   1.00259   1.568e-02   1.000e+00
6493.02051   0.98415   1.566e-02   1.000e+00
6493.06787   1.00003   1.570e-02   1.000e+00
6493.11572   1.01978   1.577e-02   1.000e+00
6493.16309   0.99537   1.572e-02   1.000e+00
6493.21094   1.00012   1.579e-02   1.000e+00
6493.25830   0.99402   1.567e-02   1.000e+00
6493.30615   0.99368   1.560e-02   1.000e+00
6493.35352   1.01915   1.583e-02   1.000e+00
6493.40137   0.99306   1.584e-02   1.000e+00
6493.44873   0.99138   1.564e-02   1.000e+00
6493.49658   0.97687   1.561e-02   1.000e+00
6493.54395   0.99145   1.574e-02   1.000e+00
6493.59180   0.99024   1.573e-02   1.000e+00
6493.63916   0.97054   1.556e-02   1.000e+00
6493.68701   0.99499   1.571e-02   1.000e+00
6493.73438   0.97048   1.567e-02   1.000e+00
6493.78223   0.99975   1.576e-02   1.000e+00
6493.82959   0.98256   1.560e-02   1.000e+00
6493.87744   0.99492   1.574e-02   1.000e+00
6493.92480   0.97162   1.572e-02   1.000e+00
6493.97266   1.00596   1.576e-02   1.000e+00
6494.02051   1.03749   1.596e-02   1.000e+00
6494.06787   1.01258   1.576e-02   1.000e+00
6494.11572   0.98184   1.562e-02   1.000e+00
6494.16309   0.98432   1.575e-02   1.000e+00
6494.21094   0.97468   1.574e-02   1.000e+00
6494.25830   0.98588   1.569e-02   1.000e+00
6494.30615   1.02388   1.586e-02   1.000e+00
6494.35352   0.97863   1.587e-02   1.000e+00
6494.40137   0.99875   1.593e-02   1.000e+00
6494.44873   0.98569   1.605e-02   1.000e+00
6494.49658   1.00053   1.608e-02   1.000e+00
6494.54395   1.00408   1.588e-02   1.000e+00
6494.59180   1.01869   1.592e-02   1.000e+00
6494.63916   1.01633   1.587e-02   1.000e+00
6494.68701   0.97976   1.568e-02   1.000e+00
6494.73486   0.99565   1.579e-02   1.000e+00
6494.78223   0.97772   1.578e-02   1.000e+00
6494.83008   0.99035   1.581e-02   1.000e+00
6494.87744   0.96215   1.572e-02   1.000e+00
6494.92529   0.96283   1.580e-02   1.000e+00
6494.97266   0.97571   1.609e-02   1.000e+00
6495.02051   0.99423   1.634e-02   1.000e+00
6495.06787   1.00698   1.662e-02   1.000e+00
6495.11572   0.98634   1.648e-02   1.000e+00
6495.16309   0.99845   1.580e-02   1.000e+00
6495.21094   1.00949   1.578e-02   1.000e+00
6495.25879   1.00320   1.590e-02   1.000e+00
6495.30615   1.01662   1.590e-02   1.000e+00
6495.35400   1.00285   1.577e-02   1.000e+00
6495.40137   1.01453   1.592e-02   1.000e+00
6495.44922   1.02530   1.604e-02   1.000e+00
6495.49658   0.99250   1.690e-02   1.000e+00
6495.54443   1.01133   1.582e-02   1.000e+00
6495.59180   1.01568   1.591e-02   1.000e+00
6495.63965   1.01737   1.584e-02   1.000e+00
6495.68750   1.02015   1.599e-02   1.000e+00
6495.73486   1.00560   1.582e-02   1.000e+00
6495.78271   1.02763   1.596e-02   1.000e+00
6495.83008   1.01892   1.605e-02   1.000e+00
6495.87793   0.97895   1.586e-02   1.000e+00
6495.92529   0.98767   1.587e-02   1.000e+00
6495.97314   1.01022   1.595e-02   1.000e+00
6496.02051   0.99772   1.598e-02   1.000e+00
6496.06836   1.00271   1.590e-02   1.000e+00
6496.11621   0.98834   1.588e-02   1.000e+00
6496.16357   0.97822   1.574e-02   1.000e+00
6496.21143   0.98687   1.575e-02   1.000e+00
6496.25879   1.00894   1.597e-02   1.000e+00
6496.30664   0.98102   1.586e-02   1.000e+00
6496.35400   0.99131   1.586e-02   1.000e+00
6496.40186   0.98730   1.588e-02   1.000e+00
6496.44971   0.98334   1.585e-02   1.000e+00
6496.49707   0.96586   1.575e-02   1.000e+00
6496.54492   0.98425   1.583e-02   1.000e+00
6496.59229   0.99853   1.580e-02   1.000e+00
6496.64014   0.98827   1.576e-02   1.000e+00
6496.68750   0.99538   1.595e-02   1.000e+00
6496.73535   0.99775   1.581e-02   1.000e+00
6496.78320   1.01181   1.601e-02   1.000e+00
6496.83057   0.98842   1.582e-02   1.000e+00
6496.87842   0.99137   1.584e-02   1.000e+00
6496.92578   0.96151   1.574e-02   1.000e+00
6496.97363   0.99374   1.592e-02   1.000e+00
6497.02100   0.99811   1.590e-02   1.000e+00
6497.06885   1.03345   1.604e-02   1.000e+00
6497.11670   1.03149   1.604e-02   1.000e+00
6497.16406   1.02631   1.610e-02   1.000e+00
6497.21191   0.99312   1.595e-02   1.000e+00
6497.25928   0.96839   1.574e-02   1.000e+00
6497.30713   1.00742   1.590e-02   1.000e+00
6497.35449   1.01145   1.604e-02   1.000e+00
6497.40234   0.99654   1.587e-02   1.000e+00
6497.45020   0.95849   1.580e-02   1.000e+00
6497.49756   0.90292   1.549e-02   1.000e+00
6497.54541   0.84281   1.518e-02   1.000e+00
6497.59277   0.82996   1.516e-02   1.000e+00
6497.64062   0.83451   1.508e-02   1.000e+00
6497.68848   0.89095   1.543e-02   1.000e+00
6497.73584   0.88864   1.538e-02   1.000e+00
6497.78369   0.93357   1.567e-02   1.000e+00
6497.83105   0.93616   1.573e-02   1.000e+00
6497.87891   0.94322   1.578e-02   1.000e+00
6497.92627   0.99264   1.597e-02   1.000e+00
6497.97412   0.97522   1.581e-02   1.000e+00
6498.02197   0.96259   1.699e-02   1.000e+00
6498.06934   1.01382   1.612e-02   1.000e+00
6498.11719   0.99614   1.603e-02   1.000e+00
6498.16455   0.99788   1.599e-02   1.000e+00
6498.21240   0.96994   1.583e-02   1.000e+00
6498.26025   0.97966   1.589e-02   1.000e+00
6498.30762   0.99190   1.615e-02   1.000e+00
6498.35547   1.00419   1.643e-02   1.000e+00
6498.40283   1.00205   1.609e-02   1.000e+00
6498.45068   1.00602   1.599e-02   1.000e+00
6498.49854   1.00768   1.600e-02   1.000e+00
6498.54590   0.99010   1.605e-02   1.000e+00
6498.59375   1.01923   1.617e-02   1.000e+00
6498.64111   1.01782   1.609e-02   1.000e+00
6498.68896   0.98712   1.629e-02   1.000e+00
6498.73682   1.03012   1.675e-02   1.000e+00
6498.78418   0.98774   1.627e-02   1.000e+00
6498.83203   0.99891   1.633e-02   1.000e+00
6498.87939   0.99486   1.624e-02   1.000e+00
6498.92725   0.98136   1.621e-02   1.000e+00
6498.97510   1.01397   1.652e-02   1.000e+00
6499.02246   1.00285   1.662e-02   1.000e+00
6499.07031   1.00516   1.665e-02   1.000e+00
6499.11768   1.01645   1.653e-02   1.000e+00
6499.16553   1.01266   1.610e-02   1.000e+00
6499.21338   1.00289   1.608e-02   1.000e+00
6499.26074   0.99662   1.619e-02   1.000e+00
6499.30859   0.97250   1.603e-02   1.000e+00
6499.35596   0.98578   1.611e-02   1.000e+00
6499.40381   0.97197   1.618e-02   1.000e+00
6499.45166   0.99496   1.640e-02   1.000e+00
6499.49902   0.99971   1.649e-02   1.000e+00
6499.54688   0.98307   1.624e-02   1.000e+00
6499.59473   1.00886   1.634e-02   1.000e+00
6499.64209   1.00086   1.612e-02   1.000e+00
6499.68994   0.98854   1.610e-02   1.000e+00
6499.73730   0.97793   1.618e-02   1.000e+00
6499.78516   0.99115   1.613e-02   1.000e+00
6499.83301   0.98340   1.614e-02   1.000e+00
6499.88037   0.97036   1.602e-02   1.000e+00
6499.92822   0.99909   1.610e-02   1.000e+00
6499.97607   1.00958   1.614e-02   1.000e+00
6500.02344   1.00723   1.627e-02   1.000e+00
6500.07129   0.96747   1.610e-02   1.000e+00
6500.11865   0.97271   1.605e-02   1.000e+00
6500.16650   1.01566   1.626e-02   1.000e+00
6500.21436   0.98086   1.610e-02   1.000e+00
6500.26172   0.99373   1.622e-02   1.000e+00
6500.30957   0.98645   1.622e-02   1.000e+00
6500.35693   1.01273   1.628e-02   1.000e+00
6500.40479   1.02124   1.631e-02   1.000e+00
6500.45264   1.00384   1.623e-02   1.000e+00
6500.50000   1.02344   1.641e-02   1.000e+00
6500.54785   0.99670   1.631e-02   1.000e+00
6500.59570   0.97539   1.737e-02   1.000e+00
6500.64307   1.05892   1.951e-02   1.000e+00
6500.69092   1.07454   2.029e-02   1.000e+00
6500.73877   1.04334   1.923e-02   1.000e+00
6500.78613   0.99031   1.718e-02   1.000e+00
6500.83398   1.00247   1.642e-02   1.000e+00
6500.88135   0.99069   1.623e-02   1.000e+00
6500.92920   1.01631   1.633e-02   1.000e+00
6500.97705   0.98139   1.623e-02   1.000e+00
6501.02441   0.98428   1.635e-02   1.000e+00
6501.07227   0.97921   1.612e-02   1.000e+00
6501.12012   1.00768   1.639e-02   1.000e+00
6501.16748   1.00313   1.630e-02   1.000e+00
6501.21533   1.00439   1.630e-02   1.000e+00
6501.26318   1.02978   1.651e-02   1.000e+00
6501.31055   0.97480   1.638e-02   1.000e+00
6501.35840   0.98867   1.648e-02   1.000e+00
6501.40576   1.01770   1.642e-02   1.000e+00
6501.45361   1.01764   1.638e-02   1.000e+00
6501.50146   0.97506   1.623e-02   1.000e+00
6501.54883   1.00596   1.650e-02   1.000e+00
6501.59668   1.00155   1.637e-02   1.000e+00
6501.64453   0.97347   1.633e-02   1.000e+00
6501.69189   1.02199   1.646e-02   1.000e+00
6501.73975   1.00942   1.636e-02   1.000e+00
6501.78760   1.00058   1.633e-02   1.000e+00
6501.83496   0.99397   1.642e-02   1.000e+00
6501.88281   1.01521   1.649e-02   1.000e+00
6501.93066   0.97332   1.641e-02   1.000e+00
6501.97803   0.99043   1.649e-02   1.000e+00
6502.02588   0.99484   1.666e-02   1.000e+00
6502.07373   0.97449   1.637e-02   1.000e+00
6502.12109   1.02889   1.674e-02   1.000e+00
6502.16895   1.02559   1.665e-02   1.000e+00
6502.21631   1.01510   1.644e-02   1.000e+00
6502.26416   1.00291   1.645e-02   1.000e+00
6502.31201   0.98598   1.643e-02   1.000e+00
6502.35938   0.99141   1.653e-02   1.000e+00
6502.40723   0.99268   1.646e-02   1.000e+00
6502.45508   0.99151   1.648e-02   1.000e+00
6502.50244   0.99577   1.644e-02   1.000e+00
6502.55029   1.00459   1.648e-02   1.000e+00
6502.59814   1.00693   1.648e-02   1.000e+00
6502.64551   0.99485   1.652e-02   1.000e+00
6502.69336   0.98517   1.641e-02   1.000e+00
6502.74121   1.01288   1.662e-02   1.000e+00
6502.78857   1.00385   1.648e-02   1.000e+00
6502.83643   0.99145   1.643e-02   1.000e+00
6502.88428   0.97457   1.648e-02   1.000e+00
6502.93164   0.96960   1.651e-02   1.000e+00
6502.97949   1.00087   1.655e-02   1.000e+00
6503.02734   1.00838   1.662e-02   1.000e+00
6503.07471   0.99120   1.648e-02   1.000e+00
6503.12256   0.98831   1.646e-02   1.000e+00
6503.17041   0.98297   1.652e-02   1.000e+00
6503.21777   0.98264   1.672e-02   1.000e+00
6503.26562   1.00710   1.698e-02   1.000e+00
6503.31348   1.03056   1.699e-02   1.000e+00
6503.36084   0.96477   1.637e-02   1.000e+00
6503.40869   1.01901   1.663e-02   1.000e+00
6503.45654   0.98576   1.640e-02   1.000e+00
6503.50391   1.04157   1.676e-02   1.000e+00
6503.55176   1.03102   1.662e-02   1.000e+00
6503.59961   1.04418   1.686e-02   1.000e+00
6503.64697   1.00199   1.660e-02   1.000e+00
6503.69482   1.01233   1.669e-02   1.000e+00
6503.74268   1.00883   1.917e-02   1.000e+00
6503.79004   0.98271   1.751e-02   1.000e+00
6503.83789   1.00963   1.706e-02   1.000e+00
6503.88574   0.98936   1.670e-02   1.000e+00
6503.93311   0.98993   1.665e-02   1.000e+00
6503.98096   0.99337   1.663e-02   1.000e+00
6504.02881   0.98452   1.655e-02   1.000e+00
6504.07666   1.00631   1.662e-02   1.000e+00
6504.12402   0.98121   1.660e-02   1.000e+00
