5925.91748   1.00192   1.741e-02   1.000e+00
5925.96094   1.02727   1.838e-02   1.000e+00
5926.00439   1.01957   2.154e-02   1.000e+00
5926.04785   1.04470   2.622e-02   1.000e+00
5926.09131   1.03407   1.968e-02   1.000e+00
5926.13477   1.07028   1.978e-02   1.000e+00
5926.17822   1.05197   1.869e-02   1.000e+00
5926.22168   1.00445   1.743e-02   1.000e+00
5926.26514   0.95556   1.594e-02   1.000e+00
5926.30859   0.98710   1.643e-02   1.000e+00
5926.35205   0.99491   1.604e-02   1.000e+00
5926.39551   1.01984   1.634e-02   1.000e+00
5926.43896   0.99768   1.588e-02   1.000e+00
5926.48242   0.97100   1.552e-02   1.000e+00
5926.52588   1.02685   1.628e-02   1.000e+00
5926.56934   1.01368   1.620e-02   1.000e+00
5926.61279   0.98255   1.520e-02   1.000e+00
5926.65625   0.97014   1.860e-02   1.000e+00
5926.69971   1.00058   1.560e-02   1.000e+00
5926.74316   1.02116   1.611e-02   1.000e+00
5926.78662   1.00431   1.557e-02   1.000e+00
5926.83008   1.00645   1.917e-02   1.000e+00
5926.87354   0.97001   1.844e-02   1.000e+00
5926.91699   0.96030   1.451e-02   1.000e+00
5926.96045   0.95423   1.422e-02   1.000e+00
5927.00391   0.98068   1.510e-02   1.000e+00
5927.04736   0.99798   1.514e-02   1.000e+00
5927.09082   0.96262   1.510e-02   1.000e+00
5927.13428   0.99533   1.503e-02   1.000e+00
5927.17773   0.96746   1.781e-02   1.000e+00
5927.22119   0.99596   1.496e-02   1.000e+00
5927.26465   1.00084   1.488e-02   1.000e+00
5927.30811   0.97517   1.452e-02   1.000e+00
5927.35156   1.00168   1.498e-02   1.000e+00
5927.39502   1.02010   1.483e-02   1.000e+00
5927.43848   0.98932   1.475e-02   1.000e+00
5927.48193   1.01573   1.501e-02   1.000e+00
5927.52539   0.96188   1.440e-02   1.000e+00
5927.56885   0.96148   1.375e-02   1.000e+00
5927.61230   0.98753   1.397e-02   1.000e+00
5927.65576   0.94540   1.340e-02   1.000e+00
5927.69922   0.98403   1.392e-02   1.000e+00
5927.74316   0.94226   1.678e-02   1.000e+00
5927.78662   0.99467   1.435e-02   1.000e+00
5927.83008   1.00121   1.456e-02   1.000e+00
5927.87354   0.96502   1.365e-02   1.000e+00
5927.91699   0.95854   1.365e-02   1.000e+00
5927.96045   0.97010   1.364e-02   1.000e+00
5928.00391   0.97634   1.390e-02   1.000e+00
5928.04736   0.99702   1.403e-02   1.000e+00
5928.09082   0.98570   1.407e-02   1.000e+00
5928.13428   0.98515   1.378e-02   1.000e+00
5928.17773   0.94831   1.357e-02   1.000e+00
5928.22119   1.01703   1.385e-02   1.000e+00
5928.26465   1.00729   1.412e-02   1.000e+00
5928.30811   0.98833   1.369e-02   1.000e+00
5928.35156   0.98987   1.385e-02   1.000e+00
5928.39502   0.99607   1.381e-02   1.000e+00
5928.43848   0.99737   1.419e-02   1.000e+00
5928.48193   0.97706   1.376e-02   1.000e+00
5928.52539   1.00002   1.411e-02   1.000e+00
5928.56885   0.99221   1.382e-02   1.000e+00
5928.61230   1.03336   1.417e-02   1.000e+00
5928.65576   0.99191   1.382e-02   1.000e+00
5928.69922   0.98746   1.394e-02   1.000e+00
5928.74268   1.01577   1.401e-02   1.000e+00
5928.78613   0.99979   1.397e-02   1.000e+00
5928.82959   1.01040   1.392e-02   1.000e+00
5928.87305   1.02651   1.417e-02   1.000e+00
5928.91650   0.98960   1.385e-02   1.000e+00
5928.96045   1.01569   1.396e-02   1.000e+00
5929.00391   0.99563   1.399e-02   1.000e+00
5929.04736   1.01660   1.391e-02   1.000e+00
5929.09082   1.01363   1.399e-02   1.000e+00
5929.13428   0.99664   1.373e-02   1.000e+00
5929.17773   0.99170   1.387e-02   1.000e+00
5929.22119   0.98355   1.365e-02   1.000e+00
5929.26465   0.99195   1.378e-02   1.000e+00
5929.30811   0.98913   1.374e-02   1.000e+00
5929.35156   1.00375   1.395e-02   1.000e+00
5929.39502   1.00069   1.381e-02   1.000e+00
5929.43848   0.99624   1.386e-02   1.000e+00
5929.48193   0.98878   1.377e-02   1.000e+00
5929.52539   0.99798   1.396e-02   1.000e+00
5929.56885   0.99098   1.373e-02   1.000e+00
5929.61230   1.01210   1.405e-02   1.000e+00
5929.65576   0.99345   1.376e-02   1.000e+00
5929.69922   0.99576   1.391e-02   1.000e+00
5929.74268   0.96474   1.364e-02   1.000e+00
5929.78613   0.98694   1.386e-02   1.000e+00
5929.83008   1.03394   1.411e-02   1.000e+00
5929.87354   1.04003   1.407e-02   1.000e+00
5929.91699   1.00323   1.410e-02   1.000e+00
5929.96045   1.00026   1.385e-02   1.000e+00
5930.00391   1.03572   1.426e-02   1.000e+00
5930.04736   1.00479   1.457e-02   1.000e+00
5930.09082   1.01659   1.483e-02   1.000e+00
5930.13428   0.99379   1.438e-02   1.000e+00
5930.17773   1.04469   2.104e-02   1.000e+00
5930.22119   1.01223   2.060e-02   1.000e+00
5930.26465   0.99766   1.648e-02   1.000e+00
5930.30811   1.03654   1.552e-02   1.000e+00
5930.35156   0.98938   1.465e-02   1.000e+00
5930.39502   1.00152   1.409e-02   1.000e+00
5930.43848   1.00423   1.414e-02   1.000e+00
5930.48193   0.98722   1.378e-02   1.000e+00
5930.52588   0.99765   1.383e-02   1.000e+00
5930.56934   0.97095   1.375e-02   1.000e+00
5930.61279   1.01553   1.389e-02   1.000e+00
5930.65625   1.00207   1.396e-02   1.000e+00
5930.69971   0.99108   1.376e-02   1.000e+00
5930.74316   1.01266   1.406e-02   1.000e+00
5930.78662   0.97873   1.371e-02   1.000e+00
5930.83008   1.00257   1.403e-02   1.000e+00
5930.87354   1.00004   1.388e-02   1.000e+00
5930.91699   1.03077   1.412e-02   1.000e+00
5930.96045   1.03668   1.408e-02   1.000e+00
5931.00391   0.99567   1.396e-02   1.000e+00
5931.04736   0.99524   1.374e-02   1.000e+00
5931.09082   1.00751   1.393e-02   1.000e+00
5931.13477   1.00372   1.394e-02   1.000e+00
5931.17822   1.00528   1.386e-02   1.000e+00
5931.22168   1.02072   1.435e-02   1.000e+00
5931.26514   1.01756   1.459e-02   1.000e+00
5931.30859   1.01352   1.600e-02   1.000e+00
5931.35205   1.04150   1.651e-02   1.000e+00
5931.39551   1.01973   1.634e-02   1.000e+00
5931.43896   1.00137   1.531e-02   1.000e+00
5931.48242   0.96544   1.415e-02   1.000e+00
5931.52588   0.95739   1.378e-02   1.000e+00
5931.56934   0.97075   1.364e-02   1.000e+00
5931.61279   0.91714   1.308e-02   1.000e+00
5931.65674   0.88601   1.291e-02   1.000e+00
5931.70020   0.84432   1.528e-02   1.000e+00
5931.74365   0.68654   1.150e-02   1.000e+00
5931.78711   0.56570   1.079e-02   1.000e+00
5931.83057   0.46353   9.771e-03   1.000e+00
5931.87402   0.43381   9.627e-03   1.000e+00
5931.91748   0.47821   9.952e-03   1.000e+00
5931.96094   0.56394   1.070e-02   1.000e+00
5932.00439   0.67001   1.141e-02   1.000e+00
5932.04785   0.75967   1.222e-02   1.000e+00
5932.09131   0.78986   1.230e-02   1.000e+00
5932.13525   0.81056   1.235e-02   1.000e+00
5932.17871   0.81474   1.253e-02   1.000e+00
5932.22217   0.78837   1.224e-02   1.000e+00
5932.26562   0.78450   1.235e-02   1.000e+00
5932.30908   0.82790   1.247e-02   1.000e+00
5932.35254   0.89173   1.304e-02   1.000e+00
5932.39600   0.90536   1.559e-02   1.000e+00
5932.43945   0.95189   1.348e-02   1.000e+00
5932.48291   0.94636   1.329e-02   1.000e+00
5932.52637   0.91864   1.319e-02   1.000e+00
5932.56982   0.89801   1.297e-02   1.000e+00
5932.61377   0.89001   1.283e-02   1.000e+00
5932.65723   0.84372   1.268e-02   1.000e+00
5932.70068   0.87354   1.408e-02   1.000e+00
5932.74414   0.89446   1.679e-02   1.000e+00
5932.78760   0.94711   1.524e-02   1.000e+00
5932.83105   0.93768   1.342e-02   1.000e+00
5932.87451   0.97849   1.347e-02   1.000e+00
5932.91797   0.97733   1.369e-02   1.000e+00
5932.96143   0.99209   1.424e-02   1.000e+00
5933.00537   1.00081   1.430e-02   1.000e+00
5933.04883   0.99554   1.433e-02   1.000e+00
5933.09229   1.04922   1.403e-02   1.000e+00
5933.13574   1.00249   1.372e-02   1.000e+00
5933.17920   1.01620   1.362e-02   1.000e+00
5933.22266   0.98794   1.365e-02   1.000e+00
5933.26611   1.00683   1.369e-02   1.000e+00
5933.30957   0.98644   1.369e-02   1.000e+00
5933.35303   1.00546   1.365e-02   1.000e+00
5933.39648   0.99949   1.369e-02   1.000e+00
5933.44043   0.97817   1.358e-02   1.000e+00
5933.48389   1.01071   1.366e-02   1.000e+00
5933.52734   0.95824   1.347e-02   1.000e+00
5933.57080   0.98382   1.337e-02   1.000e+00
5933.61426   0.99073   1.360e-02   1.000e+00
5933.65771   1.00166   1.343e-02   1.000e+00
5933.70117   1.02603   1.383e-02   1.000e+00
5933.74463   1.03619   1.370e-02   1.000e+00
5933.78857   0.97921   1.335e-02   1.000e+00
5933.83203   0.99893   1.362e-02   1.000e+00
5933.87549   1.00945   1.358e-02   1.000e+00
5933.91895   0.99355   1.357e-02   1.000e+00
5933.96240   0.99664   1.347e-02   1.000e+00
5934.00586   1.00523   1.381e-02   1.000e+00
5934.04932   1.01511   1.369e-02   1.000e+00
5934.09277   1.01139   1.426e-02   1.000e+00
5934.13623   1.06681   1.549e-02   1.000e+00
5934.18018   1.00319   1.623e-02   1.000e+00
5934.22363   1.00755   1.723e-02   1.000e+00
5934.26709   1.00693   1.746e-02   1.000e+00
5934.31055   1.03219   1.694e-02   1.000e+00
5934.35400   1.02931   1.598e-02   1.000e+00
5934.39746   1.02273   1.492e-02   1.000e+00
5934.44092   1.01805   1.391e-02   1.000e+00
5934.48438   1.01771   1.366e-02   1.000e+00
5934.52832   0.99232   1.358e-02   1.000e+00
5934.57178   0.98892   1.350e-02   1.000e+00
5934.61523   0.97815   1.352e-02   1.000e+00
5934.65869   1.01539   1.360e-02   1.000e+00
5934.70215   1.02866   1.374e-02   1.000e+00
5934.74561   1.00300   1.355e-02   1.000e+00
5934.78906   1.03129   1.373e-02   1.000e+00
5934.83301   0.99036   1.349e-02   1.000e+00
5934.87646   1.00413   1.354e-02   1.000e+00
5934.91992   1.00638   1.363e-02   1.000e+00
5934.96338   1.00828   1.351e-02   1.000e+00
5935.00684   1.01060   1.376e-02   1.000e+00
5935.05029   1.00414   1.352e-02   1.000e+00
5935.09375   1.01059   1.377e-02   1.000e+00
5935.13721   1.00567   1.393e-02   1.000e+00
5935.18115   0.99840   1.357e-02   1.000e+00
5935.22461   1.01205   1.397e-02   1.000e+00
5935.26807   1.02424   1.399e-02   1.000e+00
5935.31152   1.02185   1.507e-02   1.000e+00
5935.35498   0.99730   1.498e-02   1.000e+00
5935.39844   1.00394   1.554e-02   1.000e+00
5935.44189   0.98946   1.454e-02   1.000e+00
5935.48584   1.00300   1.382e-02   1.000e+00
5935.52930   1.02220   1.384e-02   1.000e+00
5935.57275   1.00361   1.348e-02   1.000e+00
5935.61621   1.00081   1.358e-02   1.000e+00
5935.65967   1.01378   1.353e-02   1.000e+00
5935.70312   1.03140   1.380e-02   1.000e+00
5935.74658   1.01291   1.354e-02   1.000e+00
5935.79053   1.00041   1.347e-02   1.000e+00
5935.83398   1.01592   1.392e-02   1.000e+00
5935.87744   1.02084   1.391e-02   1.000e+00
5935.92090   1.01314   1.397e-02   1.000e+00
5935.96436   0.99964   1.348e-02   1.000e+00
5936.00781   1.02231   1.371e-02   1.000e+00
5936.05127   1.03361   1.365e-02   1.000e+00
5936.09521   1.03419   1.360e-02   1.000e+00
5936.13867   0.99874   1.359e-02   1.000e+00
5936.18213   1.00411   1.344e-02   1.000e+00
5936.22559   0.99038   1.352e-02   1.000e+00
5936.26904   1.00970   1.349e-02   1.000e+00
5936.31250   0.98857   1.343e-02   1.000e+00
5936.35645   0.98805   1.363e-02   1.000e+00
5936.39990   0.97617   1.344e-02   1.000e+00
5936.44336   1.01941   1.388e-02   1.000e+00
5936.48682   1.02363   1.367e-02   1.000e+00
5936.53027   1.02785   1.379e-02   1.000e+00
5936.57373   0.98193   1.328e-02   1.000e+00
5936.61768   0.98656   1.345e-02   1.000e+00
5936.66113   0.99051   1.357e-02   1.000e+00
5936.70459   1.00017   1.336e-02   1.000e+00
5936.74805   1.00560   1.367e-02   1.000e+00
5936.79150   1.01419   1.351e-02   1.000e+00
5936.83496   0.99239   1.356e-02   1.000e+00
5936.87842   0.98484   1.330e-02   1.000e+00
5936.92236   0.99382   1.342e-02   1.000e+00
5936.96582   0.99533   1.354e-02   1.000e+00
5937.00928   1.02463   1.355e-02   1.000e+00
5937.05273   1.00519   1.362e-02   1.000e+00
5937.09619   0.96667   1.332e-02   1.000e+00
5937.13965   0.98265   1.350e-02   1.000e+00
5937.18359   0.98450   1.342e-02   1.000e+00
5937.22705   0.99498   1.340e-02   1.000e+00
5937.27051   0.95553   1.664e-02   1.000e+00
5937.31396   0.97255   1.334e-02   1.000e+00
5937.35742   0.97378   1.344e-02   1.000e+00
5937.40088   0.99865   1.653e-02   1.000e+00
5937.44482   1.02399   1.355e-02   1.000e+00
5937.48828   0.97319   1.344e-02   1.000e+00
5937.53174   0.97491   1.327e-02   1.000e+00
5937.57520   1.00754   1.360e-02   1.000e+00
5937.61865   0.99490   1.333e-02   1.000e+00
5937.66260   1.00321   1.349e-02   1.000e+00
5937.70605   1.00855   1.356e-02   1.000e+00
