5674.10205   0.70337   1.282e-02   1.000e+00
5674.14355   0.81148   1.356e-02   1.000e+00
5674.18506   0.86022   1.359e-02   1.000e+00
5674.22656   0.90001   1.385e-02   1.000e+00
5674.26855   0.91892   1.396e-02   1.000e+00
5674.31006   0.93609   1.396e-02   1.000e+00
5674.35156   0.96436   1.428e-02   1.000e+00
5674.39307   0.94947   1.402e-02   1.000e+00
5674.43457   0.94546   1.414e-02   1.000e+00
5674.47656   0.93340   1.412e-02   1.000e+00
5674.51807   0.96663   1.412e-02   1.000e+00
5674.55957   0.93721   1.560e-02   1.000e+00
5674.60107   0.93048   1.399e-02   1.000e+00
5674.64307   0.93401   1.401e-02   1.000e+00
5674.68457   0.92667   1.415e-02   1.000e+00
5674.72607   0.91463   1.389e-02   1.000e+00
5674.76758   0.89908   1.505e-02   1.000e+00
5674.80908   0.89084   1.383e-02   1.000e+00
5674.85107   0.86094   1.369e-02   1.000e+00
5674.89258   0.84471   1.373e-02   1.000e+00
5674.93408   0.81166   1.339e-02   1.000e+00
5674.97559   0.77573   1.319e-02   1.000e+00
5675.01758   0.73757   1.301e-02   1.000e+00
5675.05908   0.66154   1.259e-02   1.000e+00
5675.10059   0.59401   1.237e-02   1.000e+00
5675.14209   0.53393   1.192e-02   1.000e+00
5675.18359   0.44387   1.142e-02   1.000e+00
5675.22559   0.34785   1.083e-02   1.000e+00
5675.26709   0.28216   1.033e-02   1.000e+00
5675.30859   0.22928   1.007e-02   1.000e+00
5675.35010   0.14858   9.395e-03   1.000e+00
5675.39209   0.09234   8.949e-03   1.000e+00
5675.43359   0.04946   8.820e-03   1.000e+00
5675.47510   0.03837   8.566e-03   1.000e+00
5675.51660   0.01883   9.328e-03   1.000e+00
5675.55859   0.00893   9.360e-03   1.000e+00
5675.60010   0.00606   8.844e-03   1.000e+00
5675.64160   0.01386   8.557e-03   1.000e+00
5675.68311   -0.00916   8.424e-03   1.000e+00
5675.72510   -0.01970   8.377e-03   1.000e+00
5675.76660   -0.01381   8.453e-03   1.000e+00
5675.80811   0.00247   8.400e-03   1.000e+00
5675.84961   -0.00673   8.523e-03   1.000e+00
5675.89160   -0.00878   8.528e-03   1.000e+00
5675.93311   0.01265   8.478e-03   1.000e+00
5675.97461   -0.00026   8.513e-03   1.000e+00
5676.01611   0.00619   8.446e-03   1.000e+00
5676.05811   0.02452   8.634e-03   1.000e+00
5676.09961   0.05673   8.823e-03   1.000e+00
5676.14111   0.08192   8.931e-03   1.000e+00
5676.18262   0.11972   9.355e-03   1.000e+00
5676.22461   0.15479   9.592e-03   1.000e+00
5676.26611   0.18360   9.791e-03   1.000e+00
5676.30762   0.22266   1.025e-02   1.000e+00
5676.34912   0.21404   1.020e-02   1.000e+00
5676.39111   0.20426   9.805e-03   1.000e+00
5676.43262   0.18833   9.810e-03   1.000e+00
5676.47412   0.18038   9.669e-03   1.000e+00
5676.51562   0.15817   9.537e-03   1.000e+00
5676.55762   0.15656   9.497e-03   1.000e+00
5676.59912   0.12573   9.121e-03   1.000e+00
5676.64062   0.10186   9.118e-03   1.000e+00
5676.68213   0.06307   8.878e-03   1.000e+00
5676.72412   0.03911   8.680e-03   1.000e+00
5676.76562   0.03243   8.674e-03   1.000e+00
5676.80713   0.02415   8.534e-03   1.000e+00
5676.84863   0.02553   8.508e-03   1.000e+00
5676.89062   0.01328   8.492e-03   1.000e+00
5676.93213   0.01680   8.389e-03   1.000e+00
5676.97363   0.01196   8.512e-03   1.000e+00
5677.01514   0.01203   8.363e-03   1.000e+00
5677.05713   0.02862   8.401e-03   1.000e+00
5677.09863   0.01392   8.512e-03   1.000e+00
5677.14014   0.00642   8.442e-03   1.000e+00
5677.18164   0.00783   8.586e-03   1.000e+00
5677.22363   0.00402   8.534e-03   1.000e+00
5677.26514   0.02202   8.656e-03   1.000e+00
5677.30664   0.02033   8.713e-03   1.000e+00
5677.34814   0.05467   8.687e-03   1.000e+00
5677.39014   0.08260   8.962e-03   1.000e+00
5677.43164   0.11746   9.375e-03   1.000e+00
5677.47314   0.17772   9.715e-03   1.000e+00
5677.51514   0.23431   1.002e-02   1.000e+00
5677.55664   0.32424   1.079e-02   1.000e+00
5677.59814   0.37172   1.221e-02   1.000e+00
5677.63965   0.45139   1.152e-02   1.000e+00
5677.68164   0.44867   1.150e-02   1.000e+00
5677.72314   0.47526   1.161e-02   1.000e+00
5677.76465   0.45452   1.162e-02   1.000e+00
5677.80615   0.43252   1.129e-02   1.000e+00
5677.84814   0.39453   1.109e-02   1.000e+00
5677.88965   0.34858   1.094e-02   1.000e+00
5677.93115   0.30428   1.054e-02   1.000e+00
5677.97314   0.27361   1.033e-02   1.000e+00
5678.01465   0.25484   1.030e-02   1.000e+00
5678.05615   0.23151   1.007e-02   1.000e+00
5678.09766   0.21807   9.991e-03   1.000e+00
5678.13965   0.22009   9.994e-03   1.000e+00
5678.18115   0.23304   1.005e-02   1.000e+00
5678.22266   0.22318   1.015e-02   1.000e+00
5678.26416   0.25004   1.024e-02   1.000e+00
5678.30615   0.30020   1.054e-02   1.000e+00
5678.34766   0.30822   1.194e-02   1.000e+00
5678.38916   0.37916   1.107e-02   1.000e+00
5678.43115   0.45695   1.151e-02   1.000e+00
5678.47266   0.53683   1.215e-02   1.000e+00
5678.51416   0.58343   1.230e-02   1.000e+00
5678.55566   0.67717   1.289e-02   1.000e+00
5678.59766   0.74857   1.325e-02   1.000e+00
5678.63916   0.79888   1.343e-02   1.000e+00
5678.68066   0.84913   1.378e-02   1.000e+00
5678.72266   0.88678   1.393e-02   1.000e+00
5678.76416   0.90935   1.392e-02   1.000e+00
5678.80566   0.91180   1.411e-02   1.000e+00
5678.84717   0.92305   1.410e-02   1.000e+00
5678.88916   0.94794   1.418e-02   1.000e+00
5678.93066   0.94793   1.429e-02   1.000e+00
5678.97217   0.92985   1.407e-02   1.000e+00
5679.01416   0.92526   1.410e-02   1.000e+00
5679.05566   0.94419   1.427e-02   1.000e+00
5679.09717   0.94386   1.408e-02   1.000e+00
5679.13867   0.94842   1.422e-02   1.000e+00
5679.18066   0.94478   1.423e-02   1.000e+00
5679.22217   0.93584   1.417e-02   1.000e+00
5679.26367   0.93187   1.414e-02   1.000e+00
5679.30566   0.92246   1.409e-02   1.000e+00
5679.34717   0.92881   1.410e-02   1.000e+00
5679.38867   0.88337   1.396e-02   1.000e+00
5679.43066   0.87738   1.389e-02   1.000e+00
5679.47217   0.82341   1.352e-02   1.000e+00
5679.51367   0.76688   1.341e-02   1.000e+00
5679.55518   0.67290   1.277e-02   1.000e+00
5679.59717   0.51469   1.191e-02   1.000e+00
5679.63867   0.36101   1.107e-02   1.000e+00
5679.68018   0.28011   1.036e-02   1.000e+00
5679.72217   0.28583   1.034e-02   1.000e+00
5679.76367   0.29868   1.061e-02   1.000e+00
5679.80518   0.34664   1.085e-02   1.000e+00
5679.84717   0.40748   1.116e-02   1.000e+00
5679.88867   0.46731   1.186e-02   1.000e+00
5679.93018   0.53718   1.215e-02   1.000e+00
5679.97168   0.56555   1.230e-02   1.000e+00
5680.01367   0.56159   1.226e-02   1.000e+00
5680.05518   0.53383   1.202e-02   1.000e+00
5680.09668   0.49986   1.189e-02   1.000e+00
5680.13867   0.41146   1.254e-02   1.000e+00
5680.18018   0.35651   1.093e-02   1.000e+00
5680.22168   0.29796   1.063e-02   1.000e+00
5680.26367   0.21836   1.117e-02   1.000e+00
5680.30518   0.15335   1.058e-02   1.000e+00
5680.34668   0.10028   9.155e-03   1.000e+00
5680.38867   0.06848   8.908e-03   1.000e+00
5680.43018   0.04177   8.661e-03   1.000e+00
5680.47168   -0.00124   8.702e-03   1.000e+00
5680.51318   -0.00036   8.686e-03   1.000e+00
5680.55518   0.00194   8.743e-03   1.000e+00
5680.59668   -0.00672   8.955e-03   1.000e+00
5680.63818   -0.00246   8.669e-03   1.000e+00
5680.68018   0.01030   8.522e-03   1.000e+00
5680.72168   0.01493   8.640e-03   1.000e+00
5680.76318   0.00638   8.639e-03   1.000e+00
5680.80518   -0.01389   8.622e-03   1.000e+00
5680.84668   -0.00733   8.647e-03   1.000e+00
5680.88818   -0.00095   8.558e-03   1.000e+00
5680.93018   -0.01354   8.577e-03   1.000e+00
5680.97168   0.01306   8.662e-03   1.000e+00
5681.01318   0.01293   8.617e-03   1.000e+00
5681.05518   0.03558   9.309e-03   1.000e+00
5681.09668   0.05813   9.179e-03   1.000e+00
5681.13818   0.14304   9.427e-03   1.000e+00
5681.18018   0.20701   9.872e-03   1.000e+00
5681.22168   0.27366   1.048e-02   1.000e+00
5681.26318   0.36907   1.101e-02   1.000e+00
5681.30518   0.46933   1.169e-02   1.000e+00
5681.34668   0.54159   1.219e-02   1.000e+00
5681.38818   0.59769   1.236e-02   1.000e+00
5681.43018   0.63219   1.255e-02   1.000e+00
5681.47168   0.64124   1.284e-02   1.000e+00
5681.51318   0.66679   1.277e-02   1.000e+00
5681.55518   0.65786   1.277e-02   1.000e+00
5681.59668   0.63933   1.281e-02   1.000e+00
5681.63818   0.62422   1.252e-02   1.000e+00
5681.68018   0.59098   1.228e-02   1.000e+00
5681.72168   0.55417   1.227e-02   1.000e+00
5681.76318   0.50496   1.187e-02   1.000e+00
5681.80518   0.49328   1.177e-02   1.000e+00
5681.84668   0.45541   1.162e-02   1.000e+00
5681.88818   0.38534   1.110e-02   1.000e+00
5681.93018   0.33286   1.075e-02   1.000e+00
5681.97168   0.31091   1.069e-02   1.000e+00
5682.01318   0.25749   1.018e-02   1.000e+00
5682.05518   0.23648   1.010e-02   1.000e+00
5682.09668   0.19019   9.890e-03   1.000e+00
5682.13818   0.16269   9.543e-03   1.000e+00
5682.18018   0.10863   9.245e-03   1.000e+00
5682.22168   0.09346   9.654e-03   1.000e+00
5682.26318   0.06962   8.960e-03   1.000e+00
5682.30518   0.07430   8.907e-03   1.000e+00
5682.34668   0.05106   8.823e-03   1.000e+00
5682.38818   0.04527   8.705e-03   1.000e+00
5682.43018   0.04104   8.586e-03   1.000e+00
5682.47168   0.02965   8.664e-03   1.000e+00
5682.51318   0.03161   8.636e-03   1.000e+00
5682.55518   0.03355   8.897e-03   1.000e+00
5682.59668   0.01170   9.318e-03   1.000e+00
5682.63818   0.04329   8.928e-03   1.000e+00
5682.68018   0.04517   8.664e-03   1.000e+00
5682.72168   0.03892   8.695e-03   1.000e+00
5682.76318   0.03803   8.596e-03   1.000e+00
5682.80518   0.06352   8.706e-03   1.000e+00
5682.84668   0.07815   8.834e-03   1.000e+00
5682.88818   0.08179   8.782e-03   1.000e+00
5682.93018   0.07123   8.717e-03   1.000e+00
5682.97168   0.08793   9.027e-03   1.000e+00
5683.01318   0.10680   9.066e-03   1.000e+00
5683.05518   0.11620   9.725e-03   1.000e+00
5683.09668   0.13422   1.067e-02   1.000e+00
5683.13818   0.14143   1.024e-02   1.000e+00
5683.18018   0.09492   9.406e-03   1.000e+00
5683.22168   0.07375   9.604e-03   1.000e+00
5683.26367   0.07717   8.953e-03   1.000e+00
5683.30518   0.08074   8.880e-03   1.000e+00
5683.34668   0.08133   8.867e-03   1.000e+00
5683.38867   0.08784   9.865e-03   1.000e+00
5683.43018   0.10113   1.000e-02   1.000e+00
5683.47168   0.08031   8.963e-03   1.000e+00
5683.51367   0.10045   9.117e-03   1.000e+00
5683.55518   0.14989   9.452e-03   1.000e+00
5683.59668   0.19662   9.830e-03   1.000e+00
5683.63867   0.26288   1.025e-02   1.000e+00
5683.68018   0.31104   1.169e-02   1.000e+00
5683.72168   0.37173   1.106e-02   1.000e+00
5683.76367   0.45997   1.163e-02   1.000e+00
5683.80518   0.56056   1.216e-02   1.000e+00
5683.84717   0.62994   1.252e-02   1.000e+00
5683.88867   0.70650   1.309e-02   1.000e+00
5683.93018   0.74977   1.320e-02   1.000e+00
5683.97217   0.81004   1.351e-02   1.000e+00
5684.01367   0.82415   1.379e-02   1.000e+00
5684.05518   0.79965   1.348e-02   1.000e+00
5684.09717   0.77470   1.344e-02   1.000e+00
5684.13867   0.72898   1.331e-02   1.000e+00
5684.18018   0.68599   1.287e-02   1.000e+00
5684.22217   0.61072   1.250e-02   1.000e+00
5684.26367   0.53544   1.222e-02   1.000e+00
5684.30566   0.46531   1.178e-02   1.000e+00
5684.34717   0.41862   1.143e-02   1.000e+00
5684.38867   0.34531   1.109e-02   1.000e+00
5684.43066   0.31130   1.084e-02   1.000e+00
5684.47217   0.27625   1.050e-02   1.000e+00
5684.51367   0.26437   1.041e-02   1.000e+00
5684.55566   0.24257   1.032e-02   1.000e+00
5684.59717   0.26712   1.045e-02   1.000e+00
5684.63916   0.29291   1.057e-02   1.000e+00
5684.68066   0.29834   1.077e-02   1.000e+00
5684.72217   0.31047   1.078e-02   1.000e+00
5684.76416   0.37110   1.118e-02   1.000e+00
5684.80566   0.42890   1.164e-02   1.000e+00
5684.84717   0.47075   1.176e-02   1.000e+00
5684.88916   0.52579   1.209e-02   1.000e+00
5684.93066   0.58859   1.253e-02   1.000e+00
5684.97266   0.62361   1.386e-02   1.000e+00
5685.01416   0.71793   1.318e-02   1.000e+00
5685.05566   0.73530   1.335e-02   1.000e+00
5685.09766   0.79427   1.372e-02   1.000e+00
5685.13916   0.81566   1.367e-02   1.000e+00
5685.18115   0.88718   1.404e-02   1.000e+00
5685.22266   0.91961   1.436e-02   1.000e+00
5685.26416   0.92743   1.418e-02   1.000e+00
5685.30615   0.93185   1.427e-02   1.000e+00
5685.34766   0.94370   1.456e-02   1.000e+00
5685.38916   0.94424   1.441e-02   1.000e+00
