5358.99268   0.98565   3.895e-02   1.000e+00
5359.03174   0.96270   3.871e-02   1.000e+00
5359.07129   0.95709   3.893e-02   1.000e+00
5359.11035   0.96610   3.913e-02   1.000e+00
5359.14990   0.92754   3.832e-02   1.000e+00
5359.18896   0.92553   3.836e-02   1.000e+00
5359.22852   0.96733   3.888e-02   1.000e+00
5359.26758   1.00021   3.904e-02   1.000e+00
5359.30713   0.98400   3.874e-02   1.000e+00
5359.34619   0.95158   3.853e-02   1.000e+00
5359.38574   0.96113   3.896e-02   1.000e+00
5359.42480   0.96987   3.916e-02   1.000e+00
5359.46436   0.96142   3.863e-02   1.000e+00
5359.50342   0.94632   3.818e-02   1.000e+00
5359.54297   0.96637   3.874e-02   1.000e+00
5359.58203   1.01996   3.941e-02   1.000e+00
5359.62158   0.97406   3.871e-02   1.000e+00
5359.66064   0.92155   3.808e-02   1.000e+00
5359.70020   0.95972   3.872e-02   1.000e+00
5359.73926   0.96141   3.871e-02   1.000e+00
5359.77881   1.00519   3.899e-02   1.000e+00
5359.81787   1.01321   3.916e-02   1.000e+00
5359.85742   0.97193   3.859e-02   1.000e+00
5359.89648   0.93710   3.839e-02   1.000e+00
5359.93604   0.98945   3.872e-02   1.000e+00
5359.97510   0.99908   3.878e-02   1.000e+00
5360.01465   0.97218   3.873e-02   1.000e+00
5360.05371   1.04259   3.928e-02   1.000e+00
5360.09326   0.93888   3.793e-02   1.000e+00
5360.13232   0.95047   3.828e-02   1.000e+00
5360.17188   0.91207   3.888e-02   1.000e+00
5360.21094   0.98465   3.970e-02   1.000e+00
5360.25049   0.92462   3.814e-02   1.000e+00
5360.28955   0.93662   3.810e-02   1.000e+00
5360.32910   0.89193   3.800e-02   1.000e+00
5360.36816   0.88943   3.779e-02   1.000e+00
5360.40771   0.81735   3.671e-02   1.000e+00
5360.44678   0.81174   3.675e-02   1.000e+00
5360.48633   0.80533   3.693e-02   1.000e+00
5360.52539   0.80940   3.641e-02   1.000e+00
5360.56494   0.80618   3.628e-02   1.000e+00
5360.60400   0.85710   3.681e-02   1.000e+00
5360.64355   0.76352   3.597e-02   1.000e+00
5360.68262   0.79420   3.635e-02   1.000e+00
5360.72217   0.81835   6.689e-02   1.000e+00
5360.76123   0.77545   0.000e+00   1.000e+00
5360.80078   0.78087   4.465e-02   1.000e+00
5360.83984   0.74089   3.601e-02   1.000e+00
5360.87939   0.78872   3.635e-02   1.000e+00
5360.91846   0.82918   3.681e-02   1.000e+00
5360.95801   0.82106   3.696e-02   1.000e+00
5360.99707   0.82125   3.686e-02   1.000e+00
5361.03662   0.84840   3.671e-02   1.000e+00
5361.07568   0.84826   3.667e-02   1.000e+00
5361.11523   0.85858   3.720e-02   1.000e+00
5361.15430   0.89503   3.763e-02   1.000e+00
5361.19385   0.89314   3.728e-02   1.000e+00
5361.23291   0.87305   3.706e-02   1.000e+00
5361.27246   0.91612   3.784e-02   1.000e+00
5361.31201   0.93433   3.766e-02   1.000e+00
5361.35107   0.90568   3.702e-02   1.000e+00
5361.39062   0.88305   3.704e-02   1.000e+00
5361.42969   0.89014   3.729e-02   1.000e+00
5361.46924   0.89561   3.714e-02   1.000e+00
5361.50830   0.86550   3.664e-02   1.000e+00
5361.54785   0.84511   3.671e-02   1.000e+00
5361.58691   0.86738   3.694e-02   1.000e+00
5361.62646   0.86888   3.659e-02   1.000e+00
5361.66553   0.87233   3.684e-02   1.000e+00
5361.70508   0.89652   3.751e-02   1.000e+00
5361.74414   0.92055   3.748e-02   1.000e+00
5361.78369   0.90925   3.707e-02   1.000e+00
5361.82275   0.84890   3.638e-02   1.000e+00
5361.86230   0.84053   4.001e-02   1.000e+00
5361.90137   0.86161   3.716e-02   1.000e+00
5361.94092   0.90399   3.720e-02   1.000e+00
5361.97998   0.90493   3.687e-02   1.000e+00
5362.01953   0.93785   3.759e-02   1.000e+00
5362.05859   0.91590   3.740e-02   1.000e+00
5362.09814   0.91691   3.696e-02   1.000e+00
5362.13770   0.84022   3.672e-02   1.000e+00
5362.17676   0.88904   3.704e-02   1.000e+00
5362.21631   0.92330   3.728e-02   1.000e+00
5362.25537   0.92642   3.714e-02   1.000e+00
5362.29492   0.86996   3.684e-02   1.000e+00
5362.33398   0.89026   3.692e-02   1.000e+00
5362.37354   0.84873   3.621e-02   1.000e+00
5362.41260   0.84220   3.608e-02   1.000e+00
5362.45215   0.83711   3.614e-02   1.000e+00
5362.49121   0.76080   3.529e-02   1.000e+00
5362.53076   0.79972   3.552e-02   1.000e+00
5362.56982   0.82730   3.583e-02   1.000e+00
5362.60938   0.82307   3.599e-02   1.000e+00
5362.64893   0.74488   3.497e-02   1.000e+00
5362.68799   0.75221   3.503e-02   1.000e+00
5362.72754   0.73581   3.504e-02   1.000e+00
5362.76660   0.73171   3.507e-02   1.000e+00
5362.80615   0.73664   3.474e-02   1.000e+00
5362.84521   0.70164   3.409e-02   1.000e+00
5362.88477   0.64757   3.568e-02   1.000e+00
5362.92383   0.62686   3.601e-02   1.000e+00
5362.96338   0.63037   3.428e-02   1.000e+00
5363.00244   0.65145   3.385e-02   1.000e+00
5363.04199   0.65012   3.401e-02   1.000e+00
5363.08105   0.65692   3.390e-02   1.000e+00
5363.12061   0.65180   3.346e-02   1.000e+00
5363.16016   0.63169   3.364e-02   1.000e+00
5363.19922   0.62993   3.352e-02   1.000e+00
5363.23877   0.62634   3.321e-02   1.000e+00
5363.27783   0.59001   3.289e-02   1.000e+00
5363.31738   0.54119   3.268e-02   1.000e+00
5363.35645   0.47682   3.188e-02   1.000e+00
5363.39600   0.46101   3.146e-02   1.000e+00
5363.43506   0.44516   3.112e-02   1.000e+00
5363.47461   0.40504   3.068e-02   1.000e+00
5363.51416   0.35007   2.934e-02   1.000e+00
5363.55322   0.30368   2.863e-02   1.000e+00
5363.59277   0.23987   2.795e-02   1.000e+00
5363.63184   0.23948   2.806e-02   1.000e+00
5363.67139   0.23201   2.768e-02   1.000e+00
5363.71045   0.14262   2.605e-02   1.000e+00
5363.75000   0.15445   2.653e-02   1.000e+00
5363.78906   0.15208   2.634e-02   1.000e+00
5363.82861   0.18854   2.680e-02   1.000e+00
5363.86816   0.22555   2.775e-02   1.000e+00
5363.90723   0.18552   2.716e-02   1.000e+00
5363.94678   0.23040   2.759e-02   1.000e+00
5363.98584   0.25286   2.787e-02   1.000e+00
5364.02539   0.28120   2.813e-02   1.000e+00
5364.06445   0.24659   2.755e-02   1.000e+00
5364.10400   0.29454   2.803e-02   1.000e+00
5364.14307   0.27686   2.812e-02   1.000e+00
5364.18262   0.24083   2.794e-02   1.000e+00
5364.22217   0.15875   2.639e-02   1.000e+00
5364.26123   0.11110   2.584e-02   1.000e+00
5364.30078   0.09184   2.621e-02   1.000e+00
5364.33984   0.13427   2.627e-02   1.000e+00
5364.37939   0.20497   2.732e-02   1.000e+00
5364.41846   0.32334   2.904e-02   1.000e+00
5364.45801   0.39429   3.045e-02   1.000e+00
5364.49756   0.37055   2.966e-02   1.000e+00
5364.53662   0.42978   3.053e-02   1.000e+00
5364.57617   0.39339   2.986e-02   1.000e+00
5364.61523   0.38117   2.967e-02   1.000e+00
5364.65479   0.38461   2.977e-02   1.000e+00
5364.69385   0.38193   2.976e-02   1.000e+00
5364.73340   0.36285   2.951e-02   1.000e+00
5364.77295   0.37825   2.955e-02   1.000e+00
5364.81201   0.33725   2.901e-02   1.000e+00
5364.85156   0.34449   2.936e-02   1.000e+00
5364.89062   0.39124   3.005e-02   1.000e+00
5364.93018   0.39311   3.007e-02   1.000e+00
5364.96924   0.40387   3.040e-02   1.000e+00
5365.00879   0.41701   3.060e-02   1.000e+00
5365.04834   0.43248   3.030e-02   1.000e+00
5365.08740   0.48554   3.101e-02   1.000e+00
5365.12695   0.49725   3.136e-02   1.000e+00
5365.16602   0.54784   3.185e-02   1.000e+00
5365.20557   0.56953   3.184e-02   1.000e+00
5365.24463   0.58381   3.196e-02   1.000e+00
5365.28418   0.62455   3.270e-02   1.000e+00
5365.32373   0.67454   3.302e-02   1.000e+00
5365.36279   0.71185   3.351e-02   1.000e+00
5365.40234   0.73899   3.415e-02   1.000e+00
5365.44141   0.77868   3.468e-02   1.000e+00
5365.48096   0.75983   3.431e-02   1.000e+00
5365.52002   0.78233   3.451e-02   1.000e+00
5365.55957   0.90483   3.611e-02   1.000e+00
5365.59912   0.92994   3.605e-02   1.000e+00
5365.63818   0.88979   3.549e-02   1.000e+00
5365.67773   0.91957   3.608e-02   1.000e+00
5365.71680   0.94755   3.637e-02   1.000e+00
5365.75635   0.94930   3.597e-02   1.000e+00
5365.79590   0.99327   3.681e-02   1.000e+00
5365.83496   1.03296   3.716e-02   1.000e+00
5365.87451   0.95533   3.612e-02   1.000e+00
5365.91357   0.92115   3.586e-02   1.000e+00
5365.95312   0.92756   3.606e-02   1.000e+00
5365.99268   0.92061   3.570e-02   1.000e+00
5366.03174   0.92301   3.568e-02   1.000e+00
5366.07129   0.92276   3.596e-02   1.000e+00
5366.11035   0.94833   3.659e-02   1.000e+00
5366.14990   0.90343   3.601e-02   1.000e+00
5366.18896   0.87668   3.555e-02   1.000e+00
5366.22852   0.85354   3.543e-02   1.000e+00
5366.26807   0.82793   3.464e-02   1.000e+00
5366.30713   0.78481   3.415e-02   1.000e+00
5366.34668   0.68790   3.324e-02   1.000e+00
5366.38574   0.65556   3.276e-02   1.000e+00
5366.42529   0.56435   3.111e-02   1.000e+00
5366.46484   0.57793   3.168e-02   1.000e+00
5366.50391   0.49899   3.075e-02   1.000e+00
5366.54346   0.50027   3.044e-02   1.000e+00
5366.58252   0.43882   2.921e-02   1.000e+00
5366.62207   0.34660   2.821e-02   1.000e+00
5366.66162   0.32552   2.801e-02   1.000e+00
5366.70068   0.30459   2.775e-02   1.000e+00
5366.74023   0.23667   2.694e-02   1.000e+00
5366.77930   0.23663   2.695e-02   1.000e+00
5366.81885   0.23325   2.643e-02   1.000e+00
5366.85840   0.20902   2.650e-02   1.000e+00
5366.89746   0.19724   2.655e-02   1.000e+00
5366.93701   0.18628   2.603e-02   1.000e+00
5366.97607   0.20240   2.640e-02   1.000e+00
5367.01562   0.19388   2.746e-02   1.000e+00
5367.05518   0.21560   2.831e-02   1.000e+00
5367.09424   0.26858   2.756e-02   1.000e+00
5367.13379   0.24246   2.699e-02   1.000e+00
5367.17285   0.24192   2.697e-02   1.000e+00
5367.21240   0.20973   2.602e-02   1.000e+00
5367.25195   0.23305   2.661e-02   1.000e+00
5367.29102   0.27285   2.735e-02   1.000e+00
5367.33057   0.23965   2.640e-02   1.000e+00
5367.37012   0.21199   2.609e-02   1.000e+00
5367.40918   0.17878   2.587e-02   1.000e+00
5367.44873   0.20535   2.597e-02   1.000e+00
5367.48779   0.20794   2.588e-02   1.000e+00
5367.52734   0.16296   2.575e-02   1.000e+00
5367.56689   0.14878   2.518e-02   1.000e+00
5367.60596   0.14236   2.532e-02   1.000e+00
5367.64551   0.19374   2.632e-02   1.000e+00
5367.68457   0.24291   2.682e-02   1.000e+00
5367.72412   0.16437   2.537e-02   1.000e+00
5367.76367   0.20300   2.631e-02   1.000e+00
5367.80273   0.29477   2.754e-02   1.000e+00
5367.84229   0.31080   2.800e-02   1.000e+00
5367.88135   0.29618   2.750e-02   1.000e+00
5367.92090   0.35850   2.853e-02   1.000e+00
5367.96045   0.37086   2.844e-02   1.000e+00
5367.99951   0.42024   2.899e-02   1.000e+00
5368.03906   0.47345   2.966e-02   1.000e+00
5368.07861   0.52637   2.994e-02   1.000e+00
5368.11768   0.48632   2.968e-02   1.000e+00
5368.15723   0.49086   3.016e-02   1.000e+00
5368.19629   0.52904   3.078e-02   1.000e+00
5368.23584   0.55544   3.045e-02   1.000e+00
5368.27539   0.58614   3.115e-02   1.000e+00
5368.31445   0.54445   3.072e-02   1.000e+00
5368.35400   0.54954   3.052e-02   1.000e+00
5368.39355   0.60368   3.179e-02   1.000e+00
5368.43262   0.62979   3.226e-02   1.000e+00
5368.47217   0.66239   3.234e-02   1.000e+00
5368.51123   0.71722   3.252e-02   1.000e+00
5368.55078   0.73214   3.498e-02   1.000e+00
5368.59033   0.77233   3.500e-02   1.000e+00
5368.62939   0.78112   3.314e-02   1.000e+00
5368.66895   0.78481   3.340e-02   1.000e+00
5368.70850   0.84377   3.380e-02   1.000e+00
5368.74756   0.82953   3.369e-02   1.000e+00
5368.78711   0.83520   3.521e-02   1.000e+00
5368.82617   0.87828   3.797e-02   1.000e+00
5368.86572   0.92809   3.948e-02   1.000e+00
5368.90527   0.92059   3.766e-02   1.000e+00
5368.94434   0.94228   3.542e-02   1.000e+00
5368.98389   0.94659   3.488e-02   1.000e+00
5369.02344   0.88674   3.462e-02   1.000e+00
5369.06250   0.88491   3.468e-02   1.000e+00
5369.10205   0.88675   3.423e-02   1.000e+00
5369.14160   0.82958   3.382e-02   1.000e+00
5369.18066   0.76723   3.312e-02   1.000e+00
5369.22021   0.70456   3.227e-02   1.000e+00
5369.25928   0.58544   3.065e-02   1.000e+00
5369.29883   0.46242   2.921e-02   1.000e+00
5369.33838   0.34773   2.730e-02   1.000e+00
5369.37744   0.24992   2.590e-02   1.000e+00
5369.41699   0.16431   2.475e-02   1.000e+00
5369.45654   0.12372   2.407e-02   1.000e+00
5369.49561   0.05330   2.330e-02   1.000e+00
5369.53516   0.01058   2.311e-02   1.000e+00
5369.57471   0.01907   2.289e-02   1.000e+00
5369.61377   0.00918   2.260e-02   1.000e+00
5369.65332   0.01035   2.273e-02   1.000e+00
