5925.94482   0.99287   1.178e-02   1.000e+00
5925.98828   0.97998   1.184e-02   1.000e+00
5926.03174   0.97171   1.168e-02   1.000e+00
5926.07520   0.98825   1.189e-02   1.000e+00
5926.11865   0.99036   1.177e-02   1.000e+00
5926.16211   0.99701   1.192e-02   1.000e+00
5926.20557   0.97703   1.168e-02   1.000e+00
5926.24902   0.99357   1.192e-02   1.000e+00
5926.29248   0.99359   1.183e-02   1.000e+00
5926.33594   0.99244   1.194e-02   1.000e+00
5926.37939   0.99580   1.183e-02   1.000e+00
5926.42285   0.98636   1.207e-02   1.000e+00
5926.46631   1.01233   1.221e-02   1.000e+00
5926.50977   1.01987   1.245e-02   1.000e+00
5926.55322   1.01188   1.220e-02   1.000e+00
5926.59668   0.99556   1.215e-02   1.000e+00
5926.64014   0.99719   1.310e-02   1.000e+00
5926.68359   1.00152   1.200e-02   1.000e+00
5926.72705   0.98877   1.179e-02   1.000e+00
5926.77051   0.98114   1.190e-02   1.000e+00
5926.81396   0.98235   1.178e-02   1.000e+00
5926.85742   0.98000   1.192e-02   1.000e+00
5926.90088   0.99825   1.184e-02   1.000e+00
5926.94434   1.00811   1.204e-02   1.000e+00
5926.98779   1.00137   1.187e-02   1.000e+00
5927.03125   1.00077   1.196e-02   1.000e+00
5927.07471   1.00186   1.183e-02   1.000e+00
5927.11816   1.01067   1.204e-02   1.000e+00
5927.16162   1.00511   1.183e-02   1.000e+00
5927.20508   1.00219   1.195e-02   1.000e+00
5927.24854   1.00593   1.188e-02   1.000e+00
5927.29199   1.01315   1.207e-02   1.000e+00
5927.33545   0.99399   1.181e-02   1.000e+00
5927.37891   0.99661   1.195e-02   1.000e+00
5927.42236   0.99743   1.182e-02   1.000e+00
5927.46582   1.01572   1.207e-02   1.000e+00
5927.50928   0.99607   1.184e-02   1.000e+00
5927.55273   0.98669   1.194e-02   1.000e+00
5927.59619   0.98206   1.187e-02   1.000e+00
5927.63965   0.99801   1.199e-02   1.000e+00
5927.68311   1.00158   1.185e-02   1.000e+00
5927.72656   1.00960   1.201e-02   1.000e+00
5927.77002   1.01851   1.193e-02   1.000e+00
5927.81348   1.00744   1.197e-02   1.000e+00
5927.85742   1.00335   1.192e-02   1.000e+00
5927.90088   0.99221   1.183e-02   1.000e+00
5927.94434   0.99933   1.201e-02   1.000e+00
5927.98779   0.99974   1.188e-02   1.000e+00
5928.03125   1.00514   1.203e-02   1.000e+00
5928.07471   0.99753   1.187e-02   1.000e+00
5928.11816   1.01891   1.206e-02   1.000e+00
5928.16162   0.99694   1.186e-02   1.000e+00
5928.20508   0.98911   1.198e-02   1.000e+00
5928.24854   0.98420   1.182e-02   1.000e+00
5928.29199   1.01267   1.207e-02   1.000e+00
5928.33545   1.01654   1.193e-02   1.000e+00
5928.37891   1.03065   1.213e-02   1.000e+00
5928.42236   1.03136   1.203e-02   1.000e+00
5928.46582   1.02185   1.211e-02   1.000e+00
5928.50928   1.01862   1.196e-02   1.000e+00
5928.55273   0.99101   1.197e-02   1.000e+00
5928.59619   0.99226   1.190e-02   1.000e+00
5928.63965   1.01529   1.210e-02   1.000e+00
5928.68311   0.99174   1.185e-02   1.000e+00
5928.72656   1.00270   1.203e-02   1.000e+00
5928.77002   1.01563   1.198e-02   1.000e+00
5928.81348   1.01512   1.219e-02   1.000e+00
5928.85693   0.99192   1.219e-02   1.000e+00
5928.90039   0.99148   1.219e-02   1.000e+00
5928.94385   0.99291   1.189e-02   1.000e+00
5928.98730   0.98454   1.190e-02   1.000e+00
5929.03125   0.96845   1.183e-02   1.000e+00
5929.07471   0.97276   1.182e-02   1.000e+00
5929.11816   1.00135   1.202e-02   1.000e+00
5929.16162   0.99574   1.188e-02   1.000e+00
5929.20508   1.00944   1.204e-02   1.000e+00
5929.24854   1.02656   1.200e-02   1.000e+00
5929.29199   0.99842   1.201e-02   1.000e+00
5929.33545   0.98938   1.187e-02   1.000e+00
5929.37891   1.01915   1.210e-02   1.000e+00
5929.42236   1.00624   1.188e-02   1.000e+00
5929.46582   1.00127   1.203e-02   1.000e+00
5929.50928   1.00018   1.187e-02   1.000e+00
5929.55273   0.98515   1.198e-02   1.000e+00
5929.59619   1.00780   1.192e-02   1.000e+00
5929.63965   1.01526   1.210e-02   1.000e+00
5929.68311   1.00545   1.192e-02   1.000e+00
5929.72656   0.99739   1.203e-02   1.000e+00
5929.77002   1.00000   1.187e-02   1.000e+00
5929.81348   0.99465   1.196e-02   1.000e+00
5929.85742   0.99636   1.192e-02   1.000e+00
5929.90088   0.99332   1.187e-02   1.000e+00
5929.94434   0.98911   1.196e-02   1.000e+00
5929.98779   0.99272   1.182e-02   1.000e+00
5930.03125   0.99936   1.205e-02   1.000e+00
5930.07471   0.99100   1.189e-02   1.000e+00
5930.11816   1.01669   1.209e-02   1.000e+00
5930.16162   0.99300   1.184e-02   1.000e+00
5930.20508   1.01508   1.210e-02   1.000e+00
5930.24854   1.00940   1.195e-02   1.000e+00
5930.29199   0.99951   1.203e-02   1.000e+00
5930.33545   0.99204   1.186e-02   1.000e+00
5930.37891   0.97646   1.196e-02   1.000e+00
5930.42236   0.99117   1.189e-02   1.000e+00
5930.46582   0.99592   1.201e-02   1.000e+00
5930.50928   1.00753   1.192e-02   1.000e+00
5930.55322   0.98862   1.190e-02   1.000e+00
5930.59668   0.97936   1.203e-02   1.000e+00
5930.64014   0.99697   1.188e-02   1.000e+00
5930.68359   0.98326   1.195e-02   1.000e+00
5930.72705   0.98879   1.188e-02   1.000e+00
5930.77051   0.98766   1.204e-02   1.000e+00
5930.81396   0.99092   1.188e-02   1.000e+00
5930.85742   1.01627   1.208e-02   1.000e+00
5930.90088   1.02980   1.197e-02   1.000e+00
5930.94434   1.01185   1.207e-02   1.000e+00
5930.98779   0.98955   1.186e-02   1.000e+00
5931.03125   1.00262   1.202e-02   1.000e+00
5931.07471   1.00730   1.190e-02   1.000e+00
5931.11816   1.00267   1.196e-02   1.000e+00
5931.16211   1.00189   1.195e-02   1.000e+00
5931.20557   1.00600   1.198e-02   1.000e+00
5931.24902   1.00795   1.210e-02   1.000e+00
5931.29248   1.00988   1.191e-02   1.000e+00
5931.33594   0.99786   1.202e-02   1.000e+00
5931.37939   1.00904   1.191e-02   1.000e+00
5931.42285   0.98742   1.194e-02   1.000e+00
5931.46631   0.97221   1.174e-02   1.000e+00
5931.50977   0.92171   1.167e-02   1.000e+00
5931.55322   0.94656   1.163e-02   1.000e+00
5931.59668   0.95424   1.181e-02   1.000e+00
5931.64014   0.92652   1.193e-02   1.000e+00
5931.68408   0.85163   1.196e-02   1.000e+00
5931.72754   0.74961   1.103e-02   1.000e+00
5931.77100   0.60389   1.113e-02   1.000e+00
5931.81445   0.51686   9.695e-03   1.000e+00
5931.85791   0.43605   9.150e-03   1.000e+00
5931.90137   0.42073   1.014e-02   1.000e+00
5931.94482   0.50228   9.544e-03   1.000e+00
5931.98828   0.60861   1.022e-02   1.000e+00
5932.03174   0.70067   1.057e-02   1.000e+00
5932.07520   0.77966   1.101e-02   1.000e+00
5932.11865   0.81128   1.102e-02   1.000e+00
5932.16260   0.78509   1.090e-02   1.000e+00
5932.20605   0.78531   1.106e-02   1.000e+00
5932.24951   0.78233   1.089e-02   1.000e+00
5932.29297   0.80939   1.115e-02   1.000e+00
5932.33643   0.84608   1.120e-02   1.000e+00
5932.37988   0.89444   1.154e-02   1.000e+00
5932.42334   0.94646   1.165e-02   1.000e+00
5932.46680   0.94588   1.176e-02   1.000e+00
5932.51025   0.95068   1.163e-02   1.000e+00
5932.55371   0.92952   1.168e-02   1.000e+00
5932.59717   0.89563   1.144e-02   1.000e+00
5932.64111   0.86604   1.126e-02   1.000e+00
5932.68457   0.87832   1.146e-02   1.000e+00
5932.72803   0.86050   1.126e-02   1.000e+00
5932.77148   0.88798   1.150e-02   1.000e+00
5932.81494   0.94047   1.160e-02   1.000e+00
5932.85840   0.95892   1.178e-02   1.000e+00
5932.90186   0.96248   1.169e-02   1.000e+00
5932.94531   0.98602   1.204e-02   1.000e+00
5932.98877   1.00538   1.196e-02   1.000e+00
5933.03223   0.98836   1.186e-02   1.000e+00
5933.07617   0.99646   1.186e-02   1.000e+00
5933.11963   1.01530   1.187e-02   1.000e+00
5933.16309   0.99424   1.193e-02   1.000e+00
5933.20654   1.00712   1.189e-02   1.000e+00
5933.25000   0.98646   1.190e-02   1.000e+00
5933.29346   0.99518   1.182e-02   1.000e+00
5933.33691   0.97022   1.186e-02   1.000e+00
5933.38037   0.99147   1.183e-02   1.000e+00
5933.42383   1.00103   1.193e-02   1.000e+00
5933.46777   0.98127   1.184e-02   1.000e+00
5933.51123   0.99856   1.184e-02   1.000e+00
5933.55469   1.00208   1.199e-02   1.000e+00
5933.59814   0.98978   1.180e-02   1.000e+00
5933.64160   0.99783   1.197e-02   1.000e+00
5933.68506   1.01480   1.195e-02   1.000e+00
5933.72852   0.99458   1.199e-02   1.000e+00
5933.77197   0.98999   1.181e-02   1.000e+00
5933.81592   1.00618   1.185e-02   1.000e+00
5933.85938   0.98900   1.193e-02   1.000e+00
5933.90283   0.97853   1.173e-02   1.000e+00
5933.94629   1.00228   1.199e-02   1.000e+00
5933.98975   1.01182   1.189e-02   1.000e+00
5934.03320   1.02496   1.208e-02   1.000e+00
5934.07666   1.00742   1.187e-02   1.000e+00
5934.12012   1.00189   1.200e-02   1.000e+00
5934.16357   0.98984   1.180e-02   1.000e+00
5934.20752   0.98840   1.179e-02   1.000e+00
5934.25098   0.99925   1.197e-02   1.000e+00
5934.29443   0.98638   1.177e-02   1.000e+00
5934.33789   0.99982   1.198e-02   1.000e+00
5934.38135   0.99417   1.182e-02   1.000e+00
5934.42480   1.01459   1.208e-02   1.000e+00
5934.46826   0.99413   1.180e-02   1.000e+00
5934.51172   0.96573   1.198e-02   1.000e+00
5934.55566   1.01029   1.245e-02   1.000e+00
5934.59912   0.98764   1.250e-02   1.000e+00
5934.64258   1.00405   1.281e-02   1.000e+00
5934.68604   0.99146   1.263e-02   1.000e+00
5934.72949   1.01345   1.271e-02   1.000e+00
5934.77295   1.00125   1.219e-02   1.000e+00
5934.81641   0.97831   1.187e-02   1.000e+00
5934.86035   0.98171   1.180e-02   1.000e+00
5934.90381   0.99386   1.178e-02   1.000e+00
5934.94727   1.00924   1.200e-02   1.000e+00
5934.99072   1.00495   1.187e-02   1.000e+00
5935.03418   0.98743   1.191e-02   1.000e+00
5935.07764   1.01309   1.314e-02   1.000e+00
5935.12109   1.00050   1.222e-02   1.000e+00
5935.16455   1.00038   1.184e-02   1.000e+00
5935.20850   1.00064   1.186e-02   1.000e+00
5935.25195   0.98608   1.193e-02   1.000e+00
5935.29541   0.97939   1.179e-02   1.000e+00
5935.33887   0.98266   1.192e-02   1.000e+00
5935.38232   0.99282   1.183e-02   1.000e+00
5935.42578   1.01739   1.204e-02   1.000e+00
5935.46924   1.01229   1.189e-02   1.000e+00
5935.51318   1.02756   1.194e-02   1.000e+00
5935.55664   1.01343   1.200e-02   1.000e+00
5935.60010   1.01255   1.187e-02   1.000e+00
5935.64355   0.96623   1.182e-02   1.000e+00
5935.68701   0.99645   1.177e-02   1.000e+00
5935.73047   0.99090   1.189e-02   1.000e+00
5935.77393   0.99395   1.180e-02   1.000e+00
5935.81787   1.00825   1.184e-02   1.000e+00
5935.86133   0.98551   1.189e-02   1.000e+00
5935.90479   0.98600   1.180e-02   1.000e+00
5935.94824   0.98680   1.191e-02   1.000e+00
5935.99170   0.99130   1.179e-02   1.000e+00
5936.03516   0.99117   1.184e-02   1.000e+00
5936.07910   0.99187   1.187e-02   1.000e+00
5936.12256   1.01239   1.188e-02   1.000e+00
5936.16602   0.97907   1.187e-02   1.000e+00
5936.20947   1.00745   1.185e-02   1.000e+00
5936.25293   0.99488   1.196e-02   1.000e+00
5936.29639   1.01443   1.183e-02   1.000e+00
5936.33984   0.98872   1.179e-02   1.000e+00
5936.38379   1.00941   1.187e-02   1.000e+00
5936.42725   0.99027   1.176e-02   1.000e+00
5936.47070   0.98887   1.187e-02   1.000e+00
5936.51416   1.01957   1.190e-02   1.000e+00
5936.55762   0.99346   1.190e-02   1.000e+00
5936.60107   1.01217   1.187e-02   1.000e+00
5936.64502   0.98495   1.176e-02   1.000e+00
5936.68848   0.98876   1.186e-02   1.000e+00
5936.73193   0.97811   1.182e-02   1.000e+00
5936.77539   1.00235   1.195e-02   1.000e+00
5936.81885   1.01237   1.207e-02   1.000e+00
5936.86230   0.99190   1.215e-02   1.000e+00
5936.90625   1.00703   1.187e-02   1.000e+00
5936.94971   0.99024   1.174e-02   1.000e+00
5936.99316   1.01101   1.197e-02   1.000e+00
5937.03662   1.00758   1.182e-02   1.000e+00
5937.08008   0.99830   1.191e-02   1.000e+00
5937.12354   1.00617   1.183e-02   1.000e+00
5937.16748   1.01719   1.185e-02   1.000e+00
5937.21094   1.01535   1.197e-02   1.000e+00
5937.25439   0.98876   1.172e-02   1.000e+00
5937.29785   0.99700   1.191e-02   1.000e+00
5937.34131   0.98494   1.284e-02   1.000e+00
5937.38477   0.99858   1.181e-02   1.000e+00
5937.42871   0.99607   1.177e-02   1.000e+00
5937.47217   1.00451   1.176e-02   1.000e+00
5937.51562   0.99221   1.183e-02   1.000e+00
5937.55908   0.99354   1.167e-02   1.000e+00
5937.60254   0.98761   1.177e-02   1.000e+00
5937.64600   0.97863   1.273e-02   1.000e+00
5937.68994   0.99289   1.162e-02   1.000e+00
5937.73340   0.95987   1.161e-02   1.000e+00
