name              date       exptime           blue           cent            red            sample
!--------------------------------------------------------------------------------------------------
J000322-260318    1993-11-13    3000    5107.036355    6357.106703    7607.177052    HIRES_murphy_C
J000322-260318    1993-11-13    3000    5107.041768    6357.112689    7607.183610    HIRES_murphy_C
J000322-260318    1993-11-13    2969    5145.917092    6402.671780    7659.426468    HIRES_murphy_C
J000322-260318    1993-11-13    3000    5145.921665    6402.676785    7659.431905    HIRES_murphy_C
J000520+052410    1999-10-12    4000    3306.060111    4077.092651    4848.125192    HIRES_murphy_C
J000520+052410    1999-10-12    4000    3306.060289    4077.093494    4848.126698    HIRES_murphy_C
J000520+052410    1999-10-13    4000    3339.324962    4128.301680    4917.278397    HIRES_murphy_C
J000520+052410    1999-10-13    4000    3339.330482    4128.306066    4917.281650    HIRES_murphy_C
J005758-264314    1994-10-09     600    4897.879530    6099.894789    7301.910048    HIRES_murphy_C
J005758-264314    1994-10-09    3000    4897.879133    6099.894295    7301.909457    HIRES_murphy_C
J005758-264314    1994-10-09    3000    4897.877368    6099.892096    7301.906824    HIRES_murphy_C
J005758-264314    1994-10-09    3000    4897.878802    6099.893560    7301.908318    HIRES_murphy_C
J005758-264314    1998-12-22    3000    4305.106522    5531.197378    6757.288234    HIRES_murphy_C
J005758-264314    1994-10-10    3000    4932.952081    6141.029803    7349.107526    HIRES_murphy_C
J005758-264314    1994-10-10    3000    4932.950329    6141.027622    7349.104915    HIRES_murphy_C
J005758-264314    1994-10-10    3000    4932.950108    6141.027166    7349.104223    HIRES_murphy_C
J010054+021136    1999-10-12    4000    3306.055427    4077.089298    4848.123169    HIRES_murphy_C
J010054+021136    1999-10-12    4000    3306.056936    4077.090998    4848.125060    HIRES_murphy_C
J010054+021136    1999-10-13    4000    3339.330912    4128.306089    4917.281266    HIRES_murphy_C
J010054+021136    1999-10-13    4000    3339.327463    4128.305727    4917.283992    HIRES_murphy_C
J012227-042127    1996-07-22    2575    3570.770703    4824.215878    6077.661054    HIRES_murphy_C
J012227-042127    1996-07-22    3600    3570.769395    4824.214138    6077.658882    HIRES_murphy_C
J012227-042127    1999-10-14    4000    3306.071495    4077.112931    4848.154366    HIRES_murphy_C
J012227-042127    1999-10-14    4000    3306.072981    4077.115005    4848.157029    HIRES_murphy_C
J012227-042127    1999-10-14    4000    3339.353529    4128.339291    4917.325053    HIRES_murphy_C
J015734+744243    1998-10-22    3000    3402.227036    4193.057653    4983.888269    HIRES_murphy_C
J015734+744243    1998-10-22    3000    3402.227657    4193.057462    4983.887266    HIRES_murphy_C
J015734+744243    1998-10-22    2000    3402.229400    4193.058884    4983.888368    HIRES_murphy_C
J015734+744243    1998-10-23    3000    3402.224867    4193.056021    4983.887176    HIRES_murphy_C
J015734+744243    1998-10-23    3000    3402.225314    4193.054151    4983.882988    HIRES_murphy_C
J015734+744243    1998-10-23    3000    3402.227332    4193.053447    4983.879561    HIRES_murphy_C
J015734+744243    1998-10-24    3000    3405.693809    4197.088812    4988.483814    HIRES_murphy_C
J015734+744243    1998-10-24    3000    3405.693622    4197.087915    4988.482208    HIRES_murphy_C
J015734+744243    1998-10-24    3000    3405.688354    4197.084875    4988.481397    HIRES_murphy_C
J015734+744243    1998-10-24    3000    3405.689640    4197.085396    4988.481153    HIRES_murphy_C
J015734+744243    1998-10-24    3000    3405.688148    4197.084607    4988.481066    HIRES_murphy_C
J020945+051714    1998-12-18    3000    5680.801526    6901.688174    8122.574823    HIRES_murphy_C
J020945+051714    1998-12-18    3000    5680.803065    6901.689684    8122.576304    HIRES_murphy_C
J020945+051714    1998-12-18    3000    5680.798185    6901.683988    8122.569791    HIRES_murphy_C
J020945+051714    1998-12-18    3000    5680.796538    6901.678850    8122.561162    HIRES_murphy_C
J020945+051714    1998-12-18    3000    5553.246985    6780.247422    8007.247860    HIRES_murphy_C
J020945+051714    1998-12-18    3000    5553.248650    6780.250476    8007.252302    HIRES_murphy_C
J020945+051714    1998-12-19    3000    5191.973181    6406.312041    7620.650901    HIRES_murphy_C
J020945+051714    1998-12-19    3000    5191.970847    6406.312657    7620.654466    HIRES_murphy_C
J020945+051714    1998-12-19    3000    5191.966570    6406.307603    7620.648636    HIRES_murphy_C
J020945+051714    1998-12-19    3000    5191.962177    6406.303200    7620.644223    HIRES_murphy_C
J020945+051714    1998-12-19    3000    5191.961640    6406.302412    7620.643184    HIRES_murphy_C
J020945+051714    1998-12-19    3000    5191.959842    6406.300206    7620.640569    HIRES_murphy_C
J020945+051714    1998-12-20    3000    5217.046452    6435.478682    7653.910911    HIRES_murphy_C
J020945+051714    1998-12-20    3000    5217.042622    6435.474161    7653.905700    HIRES_murphy_C
J020945+051714    1998-12-20    3000    5217.036324    6435.466844    7653.897363    HIRES_murphy_C
J020945+051714    1998-12-20    3000    5553.320696    6780.338160    8007.355625    HIRES_murphy_C
J020945+051714    1998-12-20    3000    5553.322644    6780.332542    8007.342440    HIRES_murphy_C
J021857+081727    1995-10-17    3000    5230.478058    6451.065990    7671.653922    HIRES_murphy_C
J021857+081727    1995-10-17    3000    5230.480045    6451.066957    7671.653868    HIRES_murphy_C
J021857+081727    1995-08-22    3300    5152.883196    6411.080435    7669.277674    HIRES_murphy_C
J021857+081727    1995-08-22    3300    5152.889404    6411.087266    7669.285128    HIRES_murphy_C
J021857+081727    1994-12-27    3000    4223.110735    5442.202917    6661.295099    HIRES_murphy_C
J021857+081727    1994-12-27    3000    4223.109174    5442.200906    6661.292637    HIRES_murphy_C
J021857+081727    1994-10-11    3000    4202.820395    5417.630043    6632.439691    HIRES_murphy_C
J021857+081727    1994-10-11    3000    4202.818170    5417.627247    6632.436323    HIRES_murphy_C
J024008-230915    1997-12-28    3000    3503.373774    4278.782622    5054.191471    HIRES_murphy_C
J024008-230915    1996-12-12    2249    3607.212092    4842.412695    6077.613298    HIRES_murphy_C
J024008-230915    1996-12-12    3000    3607.209826    4842.409764    6077.609702    HIRES_murphy_C
J024008-230915    1996-12-12    3000    3607.210189    4842.410052    6077.609915    HIRES_murphy_C
J024008-230915    1996-12-12    3000    3614.727566    4851.886699    6089.045832    HIRES_murphy_C
J024008-230915    1997-12-31    3000    3503.571693    4279.005755    5054.439817    HIRES_murphy_C
J024008-230915    1997-12-31    3000    3503.577105    4279.010615    5054.444125    HIRES_murphy_C
J024008-230915    1997-12-31    3000    3503.346323    4278.744049    5054.141775    HIRES_murphy_C
J024401-013403    1993-11-14    3000    5107.392092    6357.539627    7607.687162    HIRES_murphy_C
J024401-013403    1993-11-14    3000    5107.389488    6357.536459    7607.683431    HIRES_murphy_C
J024401-013403    1993-11-14    3000    5107.389328    6357.536057    7607.682786    HIRES_murphy_C
J024401-013403    1995-08-20    2400    4468.494359    5677.825432    6887.156505    HIRES_murphy_C
J024401-013403    1993-11-15    3000    5107.385745    6357.530205    7607.674664    HIRES_murphy_C
J024401-013403    1995-08-20    2400    4468.494211    5677.825121    6887.156031    HIRES_murphy_C
J024401-013403    1995-08-21    3000    4492.313537    5706.318292    6920.323047    HIRES_murphy_C
J024401-013403    1995-08-21    3600    4492.317373    5706.322579    6920.327785    HIRES_murphy_C
J024401-013403    1993-11-13    3000    5146.228464    6403.057850    7659.887237    HIRES_murphy_C
J024401-013403    1993-11-13    3000    5146.228840    6403.058047    7659.887255    HIRES_murphy_C
J024401-013403    1993-11-13    3000    5146.230999    6403.060306    7659.889612    HIRES_murphy_C
J024401-013403    1993-11-15    3000    5107.383920    6357.528323    7607.672727    HIRES_murphy_C
J030449-221151    1996-11-06    3000    3503.990983    4743.188370    5982.385758    HIRES_murphy_C
J030449-221151    1996-11-07    3000    3504.014986    4743.217603    5982.420220    HIRES_murphy_C
J045142-132033    1997-12-28    3000    3647.986428    4424.438622    5200.890815    HIRES_murphy_C
J045142-132033    1996-12-11    3000    3721.079429    4951.712005    6182.344580    HIRES_murphy_C
J045142-132033    1996-12-11    3000    3721.081821    4951.714737    6182.347654    HIRES_murphy_C
J045142-132033    1996-12-12    2546    3729.304860    4962.010680    6194.716501    HIRES_murphy_C
J045142-132033    1997-12-29    3000    3647.982236    4424.436374    5200.890513    HIRES_murphy_C
J045142-132033    1994-12-26    3000    4202.424775    5417.112881    6631.800987    HIRES_murphy_C
J045142-132033    1994-12-26    3000    4202.423355    5417.111050    6631.798745    HIRES_murphy_C
J045142-132033    1994-12-26    2000    4202.421834    5417.109090    6631.796345    HIRES_murphy_C
J045142-132033    1994-12-26    3000    4223.344208    5442.501918    6661.659628    HIRES_murphy_C
J045142-132033    1994-12-26    3000    4223.342781    5442.500080    6661.657378    HIRES_murphy_C
J045142-132033    1997-12-30    3000    3648.202959    4424.682118    5201.161277    HIRES_murphy_C
J045142-132033    1998-12-22    3000    3720.590162    4951.144148    6181.698134    HIRES_murphy_C
J045142-132033    1998-12-22    3000    3720.584764    4951.138318    6181.691873    HIRES_murphy_C
J045142-132033    1998-12-22    3000    3730.280115    4963.239430    6196.198745    HIRES_murphy_C
J045142-132033    1998-12-22    3000    3730.265058    4963.230790    6196.196522    HIRES_murphy_C
J045142-132033    1997-12-31    3000    3648.177628    4424.655713    5201.133797    HIRES_murphy_C
J045142-132033    1994-12-26    2000    4223.341515    5442.498447    6661.655380    HIRES_murphy_C
J053007-250329    1998-01-03    3000    4067.456451    5296.588733    6525.721016    HIRES_murphy_C
J053007-250329    1997-12-28    3000    3503.574610    4279.028911    5054.483213    HIRES_murphy_C
J053007-250329    1998-01-03    3000    4067.456901    5296.589114    6525.721328    HIRES_murphy_C
J053007-250329    1997-12-28    3000    3503.575860    4279.030173    5054.484485    HIRES_murphy_C
J053007-250329    1997-12-29    3000    3503.574769    4279.027080    5054.479390    HIRES_murphy_C
J053007-250329    1995-02-23    3000    4539.623719    5790.540126    7041.456532    HIRES_murphy_C
J053007-250329    1995-02-23    3000    4539.622313    5790.538332    7041.454350    HIRES_murphy_C
J053007-250329    1995-02-23    3000    6385.433321    7539.819784    8694.206247    HIRES_murphy_C
J053007-250329    1997-12-30    3000    3503.785948    4279.264406    5054.742864    HIRES_murphy_C
J053007-250329    1997-12-30    3000    3503.783481    4279.262868    5054.742255    HIRES_murphy_C
J053007-250329    1997-12-31    3000    3503.763571    4279.239291    5054.715011    HIRES_murphy_C
J053007-250329    1998-01-04    3000    4067.432110    5296.559319    6525.686528    HIRES_murphy_C
J053007-250329    1998-01-04    3000    4067.429016    5296.555490    6525.681963    HIRES_murphy_C
J053007-250329    1994-12-27    3000    4540.669539    5791.801029    7042.932519    HIRES_murphy_C
J053007-250329    1994-12-27    3000    4540.668064    5791.799148    7042.930231    HIRES_murphy_C
J053007-250329    1994-12-27    3000    6272.935315    7484.497945    8696.060575    HIRES_murphy_C
J053007-250329    1994-12-27    3000    6272.933187    7484.495406    8696.057625    HIRES_murphy_C
J053007-250329    1994-12-27    3000    6272.931143    7484.492967    8696.054790    HIRES_murphy_C
J064204+675835    1999-11-10    900    4304.079289    5529.956688    6755.834087    HIRES_murphy_C
J064204+675835    1999-11-10    3000    4304.074363    5529.954565    6755.834767    HIRES_murphy_C
J064204+675835    1999-11-10    3000    4304.077328    5529.957037    6755.836745    HIRES_murphy_C
J064204+675835    1999-11-10    3000    4304.081824    5529.961240    6755.840657    HIRES_murphy_C
J064204+675835    1999-11-11    3000    4381.516888    5585.711442    6789.905996    HIRES_murphy_C
J064204+675835    1999-11-12    3000    4381.511416    5585.704331    6789.897246    HIRES_murphy_C
J064204+675835    1999-11-12    3000    4381.516051    5585.709758    6789.903465    HIRES_murphy_C
J074521+473436    1998-01-29    3000    4420.096767    5658.874743    6897.652719    HIRES_murphy_C
J074521+473436    1998-01-29    3000    4420.099719    5658.877404    6897.655090    HIRES_murphy_C
J074521+473436    1998-01-30    3000    4420.067013    5658.833288    6897.599563    HIRES_murphy_C
J074521+473436    1998-01-30    3000    4420.061058    5658.827383    6897.593708    HIRES_murphy_C
J074521+473436    1998-01-31    3000    5903.818300    7129.227814    8354.637327    HIRES_murphy_C
J074521+473436    1998-01-31    3000    5903.823425    7129.232593    8354.641760    HIRES_murphy_C
J074521+473436    1998-01-31    3000    5903.830831    7129.236562    8354.642294    HIRES_murphy_C
J074521+473436    1998-01-04    3000    4712.319482    5941.224248    7170.129014    HIRES_murphy_C
J074521+473436    1998-02-01    3000    5903.825286    7129.230443    8354.635600    HIRES_murphy_C
J074521+473436    1998-02-01    3000    5903.822530    7129.230546    8354.638562    HIRES_murphy_C
J080117+521034    1999-04-15    1800    4020.374155    4813.328208    5606.282261    HIRES_murphy_C
J080117+521034    1998-12-21    3000    4305.645221    5531.889722    6758.134223    HIRES_murphy_C
J080117+521034    1998-12-21    3000    4305.646325    5531.891700    6758.137075    HIRES_murphy_C
J080117+521034    1998-12-21    3000    4305.644129    5531.888953    6758.133777    HIRES_murphy_C
J080117+521034    1998-12-21    3000    4223.899916    5443.253134    6662.606352    HIRES_murphy_C
J080117+521034    1998-12-21    3000    4223.900158    5443.276162    6662.652165    HIRES_murphy_C
J080117+521034    1998-12-21    3000    4223.900744    5443.251590    6662.602436    HIRES_murphy_C
J084424+124546    1996-11-05    3000    4018.978979    5270.688832    6522.398684    HIRES_murphy_C
J084424+124546    1997-12-29    3000    3370.358015    4143.369900    4916.381784    HIRES_murphy_C
J084424+124546    1998-03-02    3000    6573.655627    7785.987585    8998.319543    HIRES_murphy_C
J084424+124546    1998-03-02    3000    6573.656911    7785.989481    8998.322051    HIRES_murphy_C
J084424+124546    1998-03-30    1716    4775.509121    5972.481077    7169.453033    HIRES_murphy_C
J084424+124546    1996-10-17    3400    3642.878776    4859.155326    6075.431876    HIRES_murphy_C
J084424+124546    1998-03-03    3000    6573.633674    7785.948175    8998.262676    HIRES_murphy_C
J084424+124546    1998-03-03    3000    6573.635012    7785.947584    8998.260157    HIRES_murphy_C
J084424+124546    1998-03-31    3000    4775.502300    5972.477858    7169.453415    HIRES_murphy_C
J084424+124546    1997-12-31    3000    3370.532904    4143.571054    4916.609203    HIRES_murphy_C
J084424+124546    1997-12-31    3000    3370.531635    4143.568833    4916.606031    HIRES_murphy_C
J084424+124546    1997-12-31    3000    3370.528925    4143.566043    4916.603161    HIRES_murphy_C
J084424+124546    1997-12-31    3000    3370.527551    4143.564713    4916.601874    HIRES_murphy_C
J084424+124546    1998-03-05    3000    4773.993931    5970.740475    7167.487019    HIRES_murphy_C
J084424+124546    1998-03-05    3000    4773.994698    5970.741282    7167.487867    HIRES_murphy_C
J084424+124546    1998-03-05    3000    4773.997707    5970.744489    7167.491271    HIRES_murphy_C
J084424+124546    1997-12-30    3000    3370.554412    4143.599188    4916.643963    HIRES_murphy_C
J084424+124546    1997-12-30    3000    3370.553063    4143.598533    4916.644004    HIRES_murphy_C
J093337+284532    1997-12-28    3000    3805.287527    4580.987802    5356.688076    HIRES_murphy_C
J093337+284532    1997-12-28    3000    3805.285719    4580.986084    5356.686449    HIRES_murphy_C
J093337+284532    1996-12-11    3000    4709.895843    5938.360671    7166.825499    HIRES_murphy_C
J093337+284532    1996-12-11    3600    4709.893564    5938.357868    7166.822171    HIRES_murphy_C
J093337+284532    1997-03-14    3000    3810.630119    5057.837554    6305.044988    HIRES_murphy_C
J093337+284532    1996-11-05    1455    4710.517963    5939.130045    7167.742126    HIRES_murphy_C
J093337+284532    1996-11-07    3000    4710.556250    5939.174316    7167.792383    HIRES_murphy_C
J093337+284532    1996-11-07    3600    4710.555871    5939.173777    7167.791683    HIRES_murphy_C
J094253-110426    1998-04-01    3000    4030.831512    5285.266586    6539.701660    HIRES_murphy_C
J094253-110426    1998-04-01    3000    4030.826886    5285.260068    6539.693250    HIRES_murphy_C
J094253-110426    1998-04-01    3000    4011.504290    5261.424198    6511.344106    HIRES_murphy_C
J094253-110426    1998-04-01    3000    4011.499132    5261.422685    6511.346238    HIRES_murphy_C
J095852+120245    1999-11-10    2100    4304.403154    5530.375362    6756.347569    HIRES_murphy_C
J095852+120245    1999-11-11    2700    4381.844855    5586.129942    6790.415029    HIRES_murphy_C
J095852+120245    1999-11-11    2400    4381.847189    5586.131470    6790.415750    HIRES_murphy_C
J095852+120245    1999-11-12    2700    4357.487935    5621.831916    6886.175897    HIRES_murphy_C
J101155+294141    1996-01-24    3000    3642.890776    4859.143276    6075.395775    HIRES_murphy_C
J101155+294141    1996-01-24    1384    3642.886682    4859.138144    6075.389607    HIRES_murphy_C
J101155+294141    1996-01-24    995    3642.891344    4859.143703    6075.396063    HIRES_murphy_C
J101447+430030    1998-03-30    3000    4421.312799    5660.291575    6899.270350    HIRES_murphy_C
J101447+430030    1998-03-02    3000    6592.575668    7807.133787    9021.691906    HIRES_murphy_C
J101447+430030    1998-03-30    3000    4421.310474    5660.289174    6899.267874    HIRES_murphy_C
J101447+430030    1998-03-02    3000    6592.560229    7807.120463    9021.680698    HIRES_murphy_C
J101447+430030    1998-03-03    3000    6592.538476    7807.096323    9021.654170    HIRES_murphy_C
J101447+430030    1998-03-03    3000    6592.538778    7807.095843    9021.652908    HIRES_murphy_C
J101447+430030    1998-01-04    3000    4712.514584    5941.470523    7170.426462    HIRES_murphy_C
J101447+430030    1998-03-31    3000    4421.306696    5660.279940    6899.253185    HIRES_murphy_C
J105756+455552    1996-05-22    3000    4585.554448    5804.517667    7023.480886    HIRES_murphy_C
J105756+455552    1996-05-22    3000    4585.555880    5804.519226    7023.482572    HIRES_murphy_C
J105756+455552    1996-05-23    3000    4606.475506    5829.441403    7052.407301    HIRES_murphy_C
J105756+455552    1996-05-23    3000    4606.475396    5829.441168    7052.406939    HIRES_murphy_C
J105756+455552    1995-04-07    2700    5504.871998    6724.508729    7944.145461    HIRES_murphy_C
J105756+455552    1995-04-07    2700    5504.872704    6724.509398    7944.146091    HIRES_murphy_C
J105756+455552    1995-04-07    2100    5554.392043    6781.529470    8008.666896    HIRES_murphy_C
J105756+455552    1995-04-07    2100    5554.388812    6781.525747    8008.662681    HIRES_murphy_C
J105756+455552    1996-05-24    3000    5382.793585    6606.492922    7830.192259    HIRES_murphy_C
J105756+455552    1996-05-24    2437    5341.006493    6558.136751    7775.267008    HIRES_murphy_C
J111038+483115    1995-02-22    3000    3654.447388    4873.602342    6092.757296    HIRES_murphy_C
J111038+483115    1995-02-22    3000    3654.446450    4873.601091    6092.755733    HIRES_murphy_C
J111038+483115    1995-02-22    3000    3642.590406    4858.739423    6074.888440    HIRES_murphy_C
J111038+483115    1995-02-22    3000    3642.589447    4858.738143    6074.886840    HIRES_murphy_C
J111038+483115    1994-12-26    3000    4223.756217    5443.032862    6662.309508    HIRES_murphy_C
J111038+483115    1994-12-26    3000    4223.755289    5443.031666    6662.308043    HIRES_murphy_C
J111038+483115    1994-12-26    1000    4223.754258    5443.030337    6662.306417    HIRES_murphy_C
J111038+483115    1994-12-27    3000    4202.906774    5417.725128    6632.543481    HIRES_murphy_C
J111038+483115    1994-12-27    2000    4202.905828    5417.723909    6632.541990    HIRES_murphy_C
J111038+483115    1994-12-27    2000    4202.905143    5417.723026    6632.540908    HIRES_murphy_C
J113508+222715    1998-12-21    3000    3644.290269    4860.968451    6077.646632    HIRES_murphy_C
J113508+222715    1998-12-22    3000    3616.499700    4854.206341    6091.912981    HIRES_murphy_C
J113508+222715    1998-12-22    2500    3616.493800    4854.199650    6091.905500    HIRES_murphy_C
J113508+222715    1998-12-22    2500    3616.498438    4854.205317    6091.912196    HIRES_murphy_C
J120523-074232    1995-04-06    3000    4899.664651    6101.997694    7304.330737    HIRES_murphy_C
J120523-074232    1995-04-06    3000    4899.668109    6102.001455    7304.334801    HIRES_murphy_C
J120523-074232    1995-04-06    3000    4931.548057    6139.416183    7347.284309    HIRES_murphy_C
J120523-074232    1995-04-06    3000    4931.541803    6139.408859    7347.275916    HIRES_murphy_C
J120523-074232    1995-04-06    3000    5913.051013    7139.701455    8366.351898    HIRES_murphy_C
J120523-074232    1995-02-23    3000    6516.354451    7721.855055    8927.355658    HIRES_murphy_C
J120523-074232    1995-02-23    3000    6516.352382    7721.852603    8927.352824    HIRES_murphy_C
J120523-074232    1995-02-23    3000    6516.339257    7721.838095    8927.336934    HIRES_murphy_C
J120523-074232    1995-02-23    3000    6591.192627    7805.579893    9019.967160    HIRES_murphy_C
J120523-074232    1995-02-23    3000    6591.190117    7805.576921    9019.963725    HIRES_murphy_C
J120523-074232    1995-02-23    3000    6591.164829    7805.549242    9019.933654    HIRES_murphy_C
J120858+454035    1994-12-26    2000    4223.782673    5443.066956    6662.351239    HIRES_murphy_C
J120858+454035    1994-12-26    2000    4223.781978    5443.066060    6662.350142    HIRES_murphy_C
J120858+454035    1994-12-27    2000    4202.934304    5417.760616    6632.586927    HIRES_murphy_C
J120858+454035    1994-12-27    2000    4202.933606    5417.759715    6632.585824    HIRES_murphy_C
J122607+173650    1997-05-09    3000    6591.199235    7805.525902    9019.852569    HIRES_murphy_C
J122607+173650    1997-05-28    3000    3849.434660    5075.282982    6301.131305    HIRES_murphy_C
J122607+173650    1997-05-09    3000    6591.185169    7805.510440    9019.835710    HIRES_murphy_C
J122607+173650    1997-05-28    3000    3849.437188    5075.285890    6301.134593    HIRES_murphy_C
J122607+173650    1997-05-10    3000    6590.736611    7805.007884    9019.279158    HIRES_murphy_C
J122607+173650    1997-05-10    3600    6590.743569    7805.015180    9019.286792    HIRES_murphy_C
J122607+173650    1997-05-10    3000    6590.741542    7805.012704    9019.283866    HIRES_murphy_C
J122607+173650    1997-05-29    3000    3849.121036    5074.904458    6300.687880    HIRES_murphy_C
J122607+173650    1997-05-29    3000    3849.126876    5074.911340    6300.695803    HIRES_murphy_C
J122824+312837    1999-04-15    3000    3024.525006    3783.629951    4542.734896    HIRES_murphy_C
J122824+312837    1999-04-15    3000    3024.523723    3783.629350    4542.734977    HIRES_murphy_C
J122824+312837    1999-04-15    3000    3024.528489    3783.633091    4542.737692    HIRES_murphy_C
J122824+312837    1999-04-15    3000    3024.534851    3783.639624    4542.744397    HIRES_murphy_C
J122824+312837    1995-04-07    2400    3535.742687    4756.555724    5977.368761    HIRES_murphy_C
J122824+312837    1995-04-07    2700    3535.743868    4756.557055    5977.370241    HIRES_murphy_C
J122824+312837    1995-04-07    2700    3542.639241    4765.274217    5987.909194    HIRES_murphy_C
J122824+312837    1995-04-07    2700    3542.635955    4765.270065    5987.904174    HIRES_murphy_C
J124714+312641    1998-03-30    1241    4011.661786    5261.645846    6511.629906    HIRES_murphy_C
J124714+312641    1998-03-30    2900    4011.662841    5261.642334    6511.621827    HIRES_murphy_C
J124714+312641    1998-03-03    3000    4010.407055    5260.131531    6509.856008    HIRES_murphy_C
J124714+312641    1998-03-05    3000    4029.803286    5225.706129    6421.608973    HIRES_murphy_C
J131011+460124    1999-04-13    3000    3568.536868    4343.826521    5119.116175    HIRES_murphy_C
J131011+460124    1999-04-13    3000    3568.535316    4343.821197    5119.107077    HIRES_murphy_C
J131011+460124    1999-04-14    3000    3305.939102    4076.971589    4848.004075    HIRES_murphy_C
J131011+460124    1999-04-14    3000    3308.000141    4079.371995    4850.743848    HIRES_murphy_C
J131011+460124    1999-04-14    3000    3024.566396    3783.673232    4542.780068    HIRES_murphy_C
J131011+460124    1999-04-15    3600    3024.563898    3783.678148    4542.792399    HIRES_murphy_C
J134002+110630    1997-03-14    3000    4537.049502    5787.516405    7037.983307    HIRES_murphy_C
J134002+110630    1997-03-14    3600    4537.052683    5787.519912    7037.987141    HIRES_murphy_C
J134002+110630    1997-05-30    3000    4478.665911    5689.933887    6901.201864    HIRES_murphy_C
J134002+110630    1997-05-30    3000    4478.665021    5689.932673    6901.200326    HIRES_murphy_C
J142656+602550    1995-05-18    3000    4077.208645    5308.508859    6539.809073    HIRES_murphy_C
J142656+602550    1995-05-18    3000    4077.209787    5308.510129    6539.810472    HIRES_murphy_C
J142656+602550    1995-05-18    3000    4058.713590    5285.842009    6512.970429    HIRES_murphy_C
J142656+602550    1995-05-18    3000    4058.712915    5285.841131    6512.969346    HIRES_murphy_C
J142656+602550    1995-05-18    2400    4058.711343    5285.839189    6512.967034    HIRES_murphy_C
J142656+602550    1995-05-18    2400    3718.624270    4948.638127    6178.651985    HIRES_murphy_C
J142656+602550    1995-05-19    3000    3718.619647    4948.632900    6178.646152    HIRES_murphy_C
J142656+602550    1995-05-19    3000    3718.622208    4948.635947    6178.649685    HIRES_murphy_C
J142656+602550    1995-05-19    3000    3718.623174    4948.637047    6178.650919    HIRES_murphy_C
J142656+602550    1995-05-19    3000    3732.196779    4965.594430    6198.992081    HIRES_murphy_C
J142656+602550    1995-05-19    3000    3732.197072    4965.594706    6198.992341    HIRES_murphy_C
J142656+602550    1995-05-19    3000    3732.198104    4965.595881    6198.993657    HIRES_murphy_C
J142656+602550    1995-05-19    2400    4077.217224    5308.518634    6539.820045    HIRES_murphy_C
J143912+295448    1998-03-24    3000    3574.161768    4350.303851    5126.445934    HIRES_murphy_C
J143912+295448    1998-03-24    3000    3574.163649    4350.305111    5126.446573    HIRES_murphy_C
J143912+295448    1998-03-24    1680    3574.165619    4350.307617    5126.449615    HIRES_murphy_C
J143912+295448    1998-03-24    3000    3574.173060    4350.315947    5126.458833    HIRES_murphy_C
J143912+295448    1998-03-03    3000    4010.531306    5260.285385    6510.039463    HIRES_murphy_C
J143912+295448    1998-03-03    3000    4029.898575    5225.827028    6421.755481    HIRES_murphy_C
J143912+295448    1998-03-03    3300    4010.519570    5260.273233    6510.026895    HIRES_murphy_C
J143912+295448    1998-03-03    3300    4029.870476    5225.798782    6421.727087    HIRES_murphy_C
J144453+291905    1995-06-21    3000    3605.406636    4840.137733    6074.868831    HIRES_murphy_C
J144453+291905    1995-06-21    2400    3605.403980    4840.134315    6074.864650    HIRES_murphy_C
J144453+291905    1995-06-21    2700    3617.104662    4854.880681    6092.656700    HIRES_murphy_C
J144453+291905    1995-06-21    2400    3617.106102    4854.882326    6092.658551    HIRES_murphy_C
J144453+291905    1994-06-12    3000    3680.377016    4929.874774    6179.372531    HIRES_murphy_C
J144453+291905    1994-06-12    3000    3680.381695    4929.880310    6179.378924    HIRES_murphy_C
J144453+291905    1994-06-12    3000    3693.502255    4946.394693    6199.287131    HIRES_murphy_C
J144453+291905    1994-06-12    3000    3693.502656    4946.395044    6199.287432    HIRES_murphy_C
J155152+191104    1999-03-13    3000    3643.967182    4860.559298    6077.151414    HIRES_murphy_C
J155152+191104    1999-03-13    3000    3643.965276    4860.556271    6077.147267    HIRES_murphy_C
J155152+191104    1999-03-13    3000    3643.959066    4860.548638    6077.138211    HIRES_murphy_C
J155152+191104    1999-03-13    3000    3643.959253    4860.548566    6077.137879    HIRES_murphy_C
J155152+191104    1999-03-13    3000    3643.966112    4860.553481    6077.140850    HIRES_murphy_C
J155152+191104    1999-03-14    3000    3616.167042    4853.780832    6091.394622    HIRES_murphy_C
J155152+191104    1999-03-14    3000    3616.164619    4853.778447    6091.392276    HIRES_murphy_C
J155152+191104    1999-03-14    3000    3616.166843    4853.779782    6091.392721    HIRES_murphy_C
J155152+191104    1999-03-14    3000    3616.161418    4853.773585    6091.385753    HIRES_murphy_C
J155152+191104    1999-03-14    3000    3616.157027    4853.767304    6091.377582    HIRES_murphy_C
J155152+191104    1999-03-15    3000    3643.961926    4860.546018    6077.130110    HIRES_murphy_C
J155152+191104    1999-03-15    3000    3643.960544    4860.547007    6077.133470    HIRES_murphy_C
J155152+191104    1999-03-15    3000    3643.961109    4860.549548    6077.137986    HIRES_murphy_C
J155152+191104    1999-03-15    3000    3653.447455    4872.428604    6091.409753    HIRES_murphy_C
J155152+191104    1999-03-15    3000    3653.453663    4872.431469    6091.409275    HIRES_murphy_C
J162645+642655    2000-05-09    3000    3022.596237    3781.349549    4540.102860    HIRES_murphy_C
J162645+642655    2000-05-09    5000    3000.879279    3773.160726    4545.442173    HIRES_murphy_C
J162645+642655    1996-07-21    3000    3579.667558    4784.731838    5989.796117    HIRES_murphy_C
J162645+642655    1996-07-21    1863    3579.664235    4784.727724    5989.791213    HIRES_murphy_C
J162645+642655    1996-07-21    3000    3570.401526    4823.714622    6077.027719    HIRES_murphy_C
J162645+642655    1996-07-21    3000    3570.402164    4823.715352    6077.028540    HIRES_murphy_C
J162645+642655    1996-07-22    3000    3570.393317    4823.704708    6077.016100    HIRES_murphy_C
J162645+642655    1996-07-22    3000    3570.393179    4823.704475    6077.015772    HIRES_murphy_C
J162645+642655    1996-05-22    2400    3617.241016    4855.071262    6092.901508    HIRES_murphy_C
J162645+642655    1996-05-22    2400    3617.239795    4855.069729    6092.899662    HIRES_murphy_C
J162645+642655    1995-05-19    2400    3718.694614    4948.733463    6178.772312    HIRES_murphy_C
J163428+703132    2000-05-09    5000    3022.569853    3781.330242    4540.090631    HIRES_murphy_C
J163428+703132    2000-05-09    5000    3000.867486    3773.149842    4545.432198    HIRES_murphy_C
J163428+703132    1994-06-16    2000    4203.686024    5418.689105    6633.692186    HIRES_murphy_C
J163428+703132    1994-06-16    2000    4224.824608    5444.324661    6663.824713    HIRES_murphy_C
J185230+401906    1996-07-21    3000    3805.817963    5051.793593    6297.769222    HIRES_murphy_C
J185230+401906    1996-07-21    3000    3805.816334    5051.791489    6297.766643    HIRES_murphy_C
J185230+401906    1996-08-06    3000    5359.585113    6579.668551    7799.751989    HIRES_murphy_C
J185230+401906    1996-08-06    3000    5359.579212    6579.657578    7799.735944    HIRES_murphy_C
J194454+770552    1996-08-06    3000    3841.131831    5065.017493    6288.903155    HIRES_murphy_C
J194454+770552    1996-08-06    3000    3853.106495    5079.874927    6306.643358    HIRES_murphy_C
J194454+770552    1996-08-07    3000    3841.155893    5065.046611    6288.937329    HIRES_murphy_C
J194454+770552    1996-08-07    3000    3853.128661    5079.901678    6306.674694    HIRES_murphy_C
J194454+770552    1996-08-07    3000    3853.107290    5079.875978    6306.644665    HIRES_murphy_C
J194454+770552    1994-06-12    1830    4013.059077    5263.377503    6513.695929    HIRES_murphy_C
J194454+770552    1994-06-12    2200    4013.061024    5263.379792    6513.698560    HIRES_murphy_C
J194454+770552    1994-06-12    2000    4031.205012    5285.752182    6540.299352    HIRES_murphy_C
J194454+770552    1994-06-12    2000    4031.204237    5285.751239    6540.298242    HIRES_murphy_C
J214805+065738    1994-10-09    2000    3719.153338    4949.288828    6179.424317    HIRES_murphy_C
J214805+065738    1994-10-09    2000    3719.155318    4949.291076    6179.426834    HIRES_murphy_C
J214805+065738    1994-10-09    2000    3732.382626    4965.831889    6199.281153    HIRES_murphy_C
J214805+065738    1994-10-09    2000    3732.378882    4965.827238    6199.275593    HIRES_murphy_C
J220852-194400    1999-11-10    3000    3642.233583    4858.315700    6074.397817    HIRES_murphy_C
J220852-194400    1999-11-10    3000    3642.234941    4858.318082    6074.401223    HIRES_murphy_C
J220852-194400    1999-10-12    4000    3306.139777    4077.193387    4848.246997    HIRES_murphy_C
J220852-194400    1999-10-12    4000    3306.142614    4077.195871    4848.249128    HIRES_murphy_C
J220852-194400    1999-10-13    4000    3339.408756    4128.405191    4917.401626    HIRES_murphy_C
J220852-194400    1999-11-11    3000    3692.610884    4945.271959    6197.933034    HIRES_murphy_C
J220852-194400    1999-10-14    4000    3339.419690    4128.421907    4917.424125    HIRES_murphy_C
J220852-194400    1999-10-14    4000    3339.427114    4128.429195    4917.431276    HIRES_murphy_C
J220852-194400    1999-10-14    4000    3306.150100    4077.210277    4848.270453    HIRES_murphy_C
J220852-194400    1999-11-12    3000    3692.572274    4945.240903    6197.909532    HIRES_murphy_C
J223408+000001    1994-06-16    3000    4059.811120    5287.127699    6514.444277    HIRES_murphy_C
J223408+000001    1994-06-16    2300    4059.810720    5287.127101    6514.443482    HIRES_murphy_C
J223408+000001    1994-06-16    2300    4059.812082    5287.128633    6514.445185    HIRES_murphy_C
J223408+000001    1994-06-17    2790    4031.717583    5228.044795    6424.372007    HIRES_murphy_C
J223408+000001    1994-06-17    3000    4031.721100    5228.048666    6424.376232    HIRES_murphy_C
J223619+132620    1996-07-21    3000    4897.653795    6099.647435    7301.641074    HIRES_murphy_C
J223619+132620    1996-07-21    3000    4897.648340    6099.640996    7301.633653    HIRES_murphy_C
J223619+132620    1996-07-22    3000    4898.762901    6100.942980    7303.123060    HIRES_murphy_C
J223619+132620    1996-07-22    3000    4898.759680    6100.939142    7303.118603    HIRES_murphy_C
J223619+132620    1996-07-22    3000    4898.760055    6100.939409    7303.118763    HIRES_murphy_C
J234628+124900    1996-12-11    3000    6520.882079    7726.880277    8932.878476    HIRES_murphy_C
J234628+124900    1996-11-05    3000    6520.435834    7726.394773    8932.353713    HIRES_murphy_C
J234628+124900    1996-11-05    1889    6520.440300    7726.399394    8932.358487    HIRES_murphy_C
J234628+124900    1996-12-12    3000    6520.902513    7726.902546    8932.902578    HIRES_murphy_C
J234628+124900    1996-12-12    3000    6520.902130    7726.901907    8932.901684    HIRES_murphy_C
J234628+124900    1996-10-16    2500    6520.600684    7726.580239    8932.559795    HIRES_murphy_C
J234628+124900    1996-10-16    2500    6520.602767    7726.582301    8932.561834    HIRES_murphy_C
J234628+124900    1996-11-06    3000    6520.440307    7726.399002    8932.357696    HIRES_murphy_C
J234628+124900    1996-11-06    2500    6520.449455    7726.408702    8932.367949    HIRES_murphy_C
J234628+124900    1995-10-18    3000    3605.374539    4840.110074    6074.845609    HIRES_murphy_C
J234628+124900    1995-10-18    3000    3605.375630    4840.111272    6074.846914    HIRES_murphy_C
J234628+124900    1995-10-18    3000    3580.671843    4836.721005    6092.770168    HIRES_murphy_C
J234628+124900    1996-11-07    3000    6520.510045    7726.474339    8932.438632    HIRES_murphy_C
J234628+124900    1996-11-07    3000    6520.506247    7726.469979    8932.433711    HIRES_murphy_C
J234632+124540    1995-10-17    3000    3580.685983    4836.739287    6092.792590    HIRES_murphy_C
J234632+124540    1995-10-17    3000    3580.688138    4836.741776    6092.795414    HIRES_murphy_C
J234632+124540    1995-10-17    3000    3605.401823    4840.143716    6074.885609    HIRES_murphy_C
J234632+124540    1995-10-17    3000    3605.399142    4840.140262    6074.881383    HIRES_murphy_C
J234632+124540    1995-10-18    3000    3580.671789    4836.720776    6092.769763    HIRES_murphy_C
