{
  "description": "Panel for astrapi.os", 
  "name": "astrapi.os | Panel",
  "shell-version": [
    "46",
    "47"
  ], 
  "url": "https://gitlab.com/astrapi-os/shell-extensions/panel",
  "uuid": "panel@astrapi.os",
  "version": 4
}
