{
    "scooter": [
        {
            "name": "POS01",
            "id": "1",
            "city": "Madrid",
            "frame": "4942LCK",
            "bateryState": false,
            "scooterState": 1,
            "baterySoc": 90,
            "autonomy": 60,
            "dailyKm": 20,
            "totalkm": 200,
            "mediumSpeed" : 21,
            "maxSpeed": 50,
            "soh": "Correcto",
            "stops": 4.38,
            "driverMode" : 1,
            "coordinate": {
                "lat": "40.416573",
                "lng": "-3.703645"
            },
            "trip": {
                "origin": {
                    "lat": "40.416573",
                    "lng": "-3.703645"
                },
                "destination": {
                    "lat": "40.416001",
                    "lng": "-3.696682"
                }
            }
        },
        {
            "name": "POS02",
            "id": "2",
            "city": "Madrid",
            "frame": "4943LCK",
            "bateryState": true,
            "scooterState": 1,
            "baterySoc": 60,
            "autonomy": 70,
            "dailyKm": 30,
            "totalkm": 90,
            "maxSpeed": 50,
            "driverMode" :0,
            "mediumSpeed" : 22,
            "soh": "Correcto",
            "stops": 1.38,
            "coordinate": {
                "lat": "40.421117",
                "lng": "-3.712838"
            },
            "trip": {
                "origin": {
                    "lat": "40.421117",
                    "lng": "-3.712838"
                },
                "destination": {
                    "lat": "40.425322",
                    "lng": "-3.707403"
                }
            }
        },
        {
            "name": "POS03",
            "id": "3",
            "city": "Madrid",
            "frame": "4946LCK",
            "bateryState": false,
            "scooterState": 1,
            "baterySoc": 90,
            "autonomy": 40,
            "dailyKm": 60,
            "totalkm": 100,
            "maxSpeed": 50,
            "driverMode" : 0,
            "mediumSpeed" : 32,
            "soh": "Correcto",
            "stops": 1.58,
            "coordinate": {
                "lat": "40.424287",
                "lng": "-3.707359"
            },
            "trip": {
                "origin": {
                    "lat": "40.424287",
                    "lng": "-3.707359"
                },
                "destination": {
                    "lat": "40.424871",
                    "lng": "-3.709682"
                }
            }
        },
        {
            "name": "POS04",
            "id": "4",
            "city": "Madrid",
            "frame": "4949LCK",
            "bateryState": false,
            "scooterState": "OFF",
            "driverMode" : 0,
            "baterySoc": 90,
            "autonomy": 120,
            "dailyKm": 40,
            "mediumSpeed" : 40,
            "totalkm": 90,
            "maxSpeed": 50,
            "soh": "Correcto",
            "stops": 5.18,
            "coordinate": {
                "lat": "40.430601",
                "lng": "-3.709438"
            },
            "trip": {
                "origin": {
                    "lat": "40.423820",
                    "lng": "-3.709178"
                },
                "destination": {
                    "lat": "40.430601",
                    "lng": "-3.709438"
                }
            }
        },
        {
            "name": "POS05",
            "id": "5",
            "city": "Zaragoza",
            "frame": "4959LCK",
            "bateryState": false,
            "scooterState": 1,
            "driverMode" : 1,
            "baterySoc": 20,
            "autonomy": 30,
            "dailyKm": 50,
            "totalkm": 280,
            "maxSpeed": 50,
            "stops": 1.18,
            "soh": "Correcto",
            "coordinate": {
                "lat": "41.639545",
                "lng": "-0.898502"
            },
            "trip": {
                "origin": {
                    "lat": "41.639545",
                    "lng": "-0.898502"
                },
                "destination": {
                    "lat": "41.651512",
                    "lng": "-0.898545"
                }
            }
        },
        {
            "name": "POS06",
            "id": "6",
            "city": "Zaragoza",
            "frame": "4789LCK",
            "bateryState": true,
            "scooterState": 1,
            "baterySoc": 80,
            "autonomy": 110,
            "dailyKm": 50,
            "driverMode" : 2,
            "totalkm": 180,
            "maxSpeed": 60,
            "mediumSpeed" : 40,
            "stops": 9.68,
            "soh": "Correcto",
            "coordinate": {
                "lat": "41.638012",
                "lng": "-0.880440"
            },
            "trip": {
                "origin": {
                    "lat": "41.648703",
                    "lng": "-0.884110"
                }, 
                "destination": {
                    "lat": "41.638012",
                    "lng": "-0.880440"
                }
            }
        },
        {
            "name": "POS07",
            "id": "7",
            "city": "Barcelona",
            "frame": "4889LCK",
            "bateryState": true,
            "scooterState": 0,
            "baterySoc": 80,
            "autonomy": 100,
            "dailyKm": 40,
            "totalkm": 160,
            "maxSpeed": 80,
            "mediumSpeed" : 70,
            "driverMode" : 0,
            "stops": 14.45,
            "soh": "Correcto",
            "coordinate": {
                "lat": "41.382410",
                "lng": "2.177034"
            },
            "trip": {
                "origin": {
                    "lat": "41.382410",
                    "lng": "2.177034"
                },
                "destination": {
                    "lat": "41.384186",
                    "lng": "2.178052"
                }
            }
        },
        {
            "name": "POS08",
            "id": "8",
            "city": "Barcelona",
            "frame": "4889LCK",
            "bateryState": false,
            "scooterState": 0,
            "driverMode" : 0,
            "baterySoc": 80,
            "autonomy": 110,
            "dailyKm": 50,
            "totalkm": 180,
            "mediumSpeed" : 50,
            "maxSpeed": 60,
            "stops": 12.68,
            "soh": "Correcto",
            "coordinate": {
                "lat": "41.376424",
                "lng": "2.176727"
            },
            "trip": {
                "origin": {
                    "lat": "41.376424",
                    "lng": "2.176727"
                },
                "destination": {
                    "lat": "41.383111",
                    "lng": "2.179873"
                }
            }
        },
        {
            "name": "POS09",
            "id": "9",
            "city": "Barcelona",
            "frame": "4889LCK",
            "bateryState": false,
            "scooterState": 1,
            "baterySoc": 70,
            "autonomy": 150,
            "driverMode" : 0,
            "dailyKm": 50,
            "totalkm": 140,
            "maxSpeed": 60,
            "stops": 19.18,
            "mediumSpeed" : 40,
            "soh": "Correcto",
            "coordinate": {
                "lat": "41.382253",
                "lng": "2.178251"
            },
            "trip": {
                "origin": {
                    "lat": "41.382253",
                    "lng": "2.178251"
                },
                "destination": {
                    "lat": "41.381905",
                    "lng": "2.179827"
                }
            }
        },
        {
            "name": "POS10",
            "id": "10",
            "city": "Barcelona",
            "frame": "4879LCK",
            "bateryState": true,
            "scooterState": 1,
            "baterySoc": 20,
            "autonomy": 20,
            "dailyKm": 20,
            "totalkm": 80,
            "driverMode" : 2,
            "maxSpeed": 60,
            "mediumSpeed" : 30,
            "stops": 22.70,
            "soh": "Correcto",
            "coordinate": {
                "lat": "41.379755",
                "lng": "2.151197"
            },
            "trip": {
                "origin": {
                    "lat": "41.406868",
                    "lng": "2.1589899"
                },
                "destination": {
                    "lat": "41.412661",
                    "lng": "2.1589899"
                }
            }
        }
    ],
    "user": [
        {
            "id": "1",
            "name": "Antonio",
            "surname": "Gomez",
            "birthdate": "Enero 21, 1996",
            "phoneNumber": "666 789 432",
            "country": "España",
            "gender": "Masculino",
            "email": "antonio@gmail.com",
            "password": "123456"
        }
    ]
}