<?xml version="1.0" encoding="utf-8"?>
<!-- Generator: Adobe Illustrator 26.4.0, SVG Export Plug-In . SVG Version: 6.00 Build 0)  -->
<svg version="1.1" id="Layer_1" xmlns="http://www.w3.org/2000/svg" xmlns:xlink="http://www.w3.org/1999/xlink" x="0px" y="0px"
	 viewBox="0 0 700 700" style="enable-background:new 0 0 700 700;" xml:space="preserve">
<style type="text/css">
	.st0{fill:#EF3340;}
</style>
<path class="st0" d="M2.6,492.3L300.8,194l59.9,59.9L62.4,552.2L2.6,492.3z"/>
<path class="st0" d="M493.4,106.7L448,61.3l-43.4,28.9l59.9,59.9L493.4,106.7z"/>
<path class="st0" d="M386.8,233.3c47.4,53.1,89.3,111.2,123.6,173.4c0.3,0.6,0.6,1.1,0.9,1.7c-1.6-3,5.1-20.9,5.6-24.5
	c3.3-21.4,3.2-43.3,0.1-64.7c-12.5-87-77-155.4-140.5-211.4c-58-51.1-136.6-87.6-215.8-68.5c-2.3,0.6-12.8,5.1-14.5,4.2
	C235.4,91.6,318.6,156.9,386.8,233.3L386.8,233.3z"/>
<path class="st0" d="M369.3,367.1c-4.9,5.4-4.5,13.8,1,18.8l45.7,41.3c2.5,2.3,5.7,3.4,8.9,3.4c3.6,0,7.2-1.5,9.9-4.4
	c4.9-5.4,4.5-13.8-1-18.8L388,366.2C382.6,361.3,374.2,361.7,369.3,367.1L369.3,367.1z"/>
<path class="st0" d="M580.4,407.6c1.6,0.6,3.2,0.9,4.8,0.9c5.3,0,10.3-3.2,12.4-8.5l21.1-54.6c2.6-6.8-0.8-14.5-7.6-17.2
	c-6.8-2.6-14.5,0.8-17.2,7.6l-21.1,54.6C570.2,397.3,573.6,405,580.4,407.6L580.4,407.6z"/>
<path class="st0" d="M396.1,479.6c-0.5-7.3-7.1-12.9-14.2-12.3l-65.7,4.6c-7.3,0.5-12.8,6.9-12.3,14.2c0.5,7,6.3,12.3,13.2,12.3
	c0.3,0,0.6,0,1,0l65.7-4.6C391.1,493.3,396.6,486.9,396.1,479.6L396.1,479.6z"/>
<path class="st0" d="M667.9,499.2l-121.1,68.4l-21.9,94.3H700L667.9,499.2z"/>
<path class="st0" d="M439.9,497l94.9,46.9l112-63.2l-139.9-36.4L439.9,497z"/>
<path class="st0" d="M353.7,661.8h144l22.2-95.7L422.6,518L353.7,661.8z"/>
</svg>
