{
    "python.defaultInterpreterPath": ".venv/bin/python",
    "python.terminal.activateEnvironment": true,
    "python.testing.pytestArgs": [
        "tests"
    ],
    "python.testing.unittestEnabled": false,
    "python.testing.pytestEnabled": true,
    "python.testing.autoTestDiscoverOnSaveEnabled": true,
    "python.analysis.typeCheckingMode": "off"
}