0000000001100100
1000001000000010
0000000001100101
1000001000001000
1000001000000010
0000000001100110
1000001000001000
1000001000000010
0000000001100111
1000001000001000
1000001000000010
0000000001101000
1000001000001000
1000001000000010
0000000001101001
1000001000001000
1000001000000010
0000000001101010
1000001000001000
1000001000000010
0000000001101011
1000001000001000
1000001000000010
0000000001101100
1000001000001000
1000001000000010
0000000001101101
1000001000001000
1000001000000010
0001000011001000