[auth.ut.ac.ir_8443/cas/login7a55.html]
[backblue.gif]
[fade.gif]
[index.html]
[auth.ut.ac.ir_8443/cas/login67b5.html]
[auth.ut.ac.ir_8443/cas/login7a55.html]
[auth.ut.ac.ir_8443/cas/logincae9.html]
[auth.ut.ac.ir_8443/cas/static/css/bootstrap.min.css]
[auth.ut.ac.ir_8443/cas/static/fonts/MitraWeb-Regular.woff]
[auth.ut.ac.ir_8443/cas/static/css/fonts.css]
[auth.ut.ac.ir_8443/cas/static/img/9-01-01.jpg]
[auth.ut.ac.ir_8443/cas/static/css/login.css]
[auth.ut.ac.ir_8443/cas/static/img/ut.svg]
[auth.ut.ac.ir_8443/cas/login67b5.html]
[auth.ut.ac.ir_8443/cas/logincae9.html]
