{"type": "FeatureCollection",
"bbox" : [551238.19, 3951899.04, 557856.18, 3955972.51],
"center" : [554547.18, 3953935.78],
"features": [
{
	"type" : "Feature",
	"properties" : {"ObjectType" : "unknown(0x1181)","fname" : "","name" : "","id" : 4},
	"geometry" : {"type" : "GeometryCollection",
		"geometries" : [
			{"properties" : {"direction" : "oneway","flag" : "sideway"},"type" : "LineString","coordinates" : [[554954.53, 3953444.62],[554789.85, 3953509.75],[554733.96, 3953523.72],[554647.64, 3953534.77],[554528.41, 3953535.44],[554181.56, 3953519.44],[553856.35, 3953495.33],[553689.81, 3953473.87],[553540.47, 3953446.42],[553513.56, 3953439.28],[553313.69, 3953382.45],[553187.41, 3953341.00],[553109.99, 3953319.31],[553046.85, 3953306.68],[553002.92, 3953301.19],[552915.62, 3953297.07],[552836.55, 3953300.64],[552772.86, 3953309.70],[552673.47, 3953318.21],[552507.10, 3953324.52],[552312.18, 3953318.21],[552032.69, 3953297.89],[551967.36, 3953290.21],[551899.51, 3953279.86]]}
		]
	}
}
,
{
	"type" : "Feature",
	"properties" : {"ObjectType" : "mainstreet","fname" : "","name" : "","id" : 19},
	"geometry" : {"type" : "GeometryCollection",
		"geometries" : [
			{"properties" : {"direction" : "oneway","flag" : "sideway"},"type" : "LineString","coordinates" : [[551891.10, 3953248.55],[551947.46, 3953241.40],[552079.14, 3953240.62],[552382.59, 3953259.41],[552521.43, 3953266.57],[552646.34, 3953265.22],[552892.28, 3953244.30],[552975.81, 3953243.58],[553031.03, 3953246.96],[553082.64, 3953256.21],[553168.50, 3953278.97],[553231.82, 3953300.83],[553430.16, 3953366.64],[553597.62, 3953407.88],[553754.25, 3953438.76],[553767.16, 3953439.58]]}
		]
	}
}
,
{
	"type" : "Feature",
	"properties" : {"ObjectType" : "unknown(0x1181)","fname" : "","name" : "","id" : 87},
	"geometry" : {"type" : "GeometryCollection",
		"geometries" : [
			{"properties" : {"direction" : "oneway","flag" : "sideway"},"type" : "LineString","coordinates" : [[551621.68, 3953561.90],[551597.55, 3953544.50],[551589.67, 3953542.31],[551267.18, 3953609.15],[551226.06, 3953619.33]]}
		]
	}
}
,
{
	"type" : "Feature",
	"properties" : {"ObjectType" : "mainstreet","fname" : "","name" : "","id" : 107},
	"geometry" : {"type" : "GeometryCollection",
		"geometries" : [
			{"properties" : {"direction" : "oneway","flag" : "sideway"},"type" : "LineString","coordinates" : [[553261.18, 3953801.05],[553229.43, 3953776.54],[553193.71, 3953738.31],[553167.81, 3953722.56],[553137.23, 3953713.57],[553086.21, 3953705.07],[553042.31, 3953709.52],[553019.93, 3953713.03],[552969.66, 3953728.67],[552954.38, 3953739.43],[552924.82, 3953770.21],[552911.65, 3953788.01],[552888.98, 3953830.63],[552865.99, 3953857.06],[552850.69, 3953880.45],[552795.31, 3953933.74],[552768.38, 3953947.02],[552684.16, 3954013.76],[552653.90, 3954041.09]]}
		]
	}
}
,
{
	"type" : "Feature",
	"properties" : {"ObjectType" : "unknown(0x1181)","fname" : "","name" : "","id" : 129},
	"geometry" : {"type" : "GeometryCollection",
		"geometries" : [
			{"properties" : {"direction" : "oneway","flag" : "sideway"},"type" : "LineString","coordinates" : [[556962.07, 3954178.44],[557032.90, 3954161.05],[557109.28, 3954147.25],[557156.14, 3954134.09],[557383.35, 3954028.50],[557455.88, 3953988.07],[557496.96, 3953957.90],[557522.63, 3953929.66],[557574.68, 3953858.25]]}
		]
	}
}
,
{
	"type" : "Feature",
	"properties" : {"ObjectType" : "highway","fname" : "","name" : "","id" : 148},
	"geometry" : {"type" : "GeometryCollection",
		"geometries" : [
			{"properties" : {"direction" : "oneway","flag" : "sideway"},"type" : "LineString","coordinates" : [[552811.68, 3953756.88],[552826.39, 3953737.95],[552861.62, 3953675.75],[552877.06, 3953630.70],[552883.35, 3953598.48],[552883.48, 3953554.35],[552870.39, 3953501.19],[552842.18, 3953451.55],[552829.06, 3953432.87],[552819.16, 3953418.77],[552780.79, 3953384.82],[552742.85, 3953360.20],[552715.16, 3953347.89],[552660.11, 3953333.83],[552524.21, 3953323.87]]}
		]
	}
}
,
{
	"type" : "Feature",
	"properties" : {"ObjectType" : "unknown(0x1181)","fname" : "","name" : "","id" : 155},
	"geometry" : {"type" : "GeometryCollection",
		"geometries" : [
			{"properties" : {"direction" : "oneway","flag" : "sideway"},"type" : "LineString","coordinates" : [[552727.43, 3953910.45],[552800.44, 3953780.77],[552833.39, 3953715.57],[552842.31, 3953688.81],[552845.56, 3953672.59],[552836.63, 3953646.57],[552823.93, 3953632.35],[552765.40, 3953579.67],[552746.50, 3953544.28],[552736.63, 3953516.19],[552722.39, 3953495.88],[552709.49, 3953486.77],[552693.92, 3953481.08],[552605.39, 3953479.02],[552535.97, 3953470.47]]}
		]
	}
}
,
{
	"type" : "Feature",
	"properties" : {"ObjectType" : "unknown(0x1181)","fname" : "","name" : "","id" : 168},
	"geometry" : {"type" : "GeometryCollection",
		"geometries" : [
			{"properties" : {"direction" : "oneway","flag" : "sideway"},"type" : "LineString","coordinates" : [[557852.64, 3954310.38],[557808.25, 3954320.87],[557753.05, 3954326.64],[557690.15, 3954349.11],[557655.49, 3954367.72],[557543.81, 3954451.80],[557486.05, 3954475.87],[557387.84, 3954496.41],[557329.43, 3954506.04],[557287.86, 3954526.01],[557264.06, 3954544.14],[557249.86, 3954553.86]]}
		]
	}
}
,
{
	"type" : "Feature",
	"properties" : {"ObjectType" : "mainstreet","fname" : "","name" : "","id" : 230},
	"geometry" : {"type" : "GeometryCollection",
		"geometries" : [
			{"properties" : {"direction" : "oneway","flag" : "sideway"},"type" : "LineString","coordinates" : [[552765.97, 3953330.98],[552794.87, 3953358.16],[552849.43, 3953425.29],[552885.89, 3953502.27],[552896.84, 3953535.14],[552912.43, 3953657.76],[552898.11, 3953775.74],[552881.25, 3953825.47],[552864.68, 3953859.04]]}
		]
	}
}
,
{
	"type" : "Feature",
	"properties" : {"ObjectType" : "unknown(0x1181)","fname" : "","name" : "","id" : 241},
	"geometry" : {"type" : "GeometryCollection",
		"geometries" : [
			{"properties" : {"direction" : "oneway","flag" : "sideway"},"type" : "LineString","coordinates" : [[557590.77, 3953859.53],[557584.78, 3953979.45],[557590.30, 3954015.74],[557626.34, 3954108.42],[557657.99, 3954169.26],[557692.00, 3954211.95],[557723.89, 3954238.53],[557752.24, 3954255.89],[557825.23, 3954280.52],[557856.18, 3954291.92]]}
		]
	}
}
,
{
	"type" : "Feature",
	"properties" : {"ObjectType" : "unknown(0x1181)","fname" : "","name" : "","id" : 249},
	"geometry" : {"type" : "GeometryCollection",
		"geometries" : [
			{"properties" : {"direction" : "oneway","flag" : "sideway"},"type" : "LineString","coordinates" : [[552508.22, 3953455.69],[552567.12, 3953444.48],[552590.41, 3953430.47],[552598.18, 3953422.52],[552605.18, 3953393.73],[552603.29, 3953383.88],[552591.17, 3953363.81],[552573.75, 3953351.97],[552556.69, 3953347.43],[552301.24, 3953323.85],[552198.56, 3953310.25]]}
		]
	}
}
,
{
	"type" : "Feature",
	"properties" : {"ObjectType" : "mainstreet","fname" : "","name" : "","id" : 259},
	"geometry" : {"type" : "GeometryCollection",
		"geometries" : [
			{"properties" : {"direction" : "oneway","flag" : "sideway"},"type" : "LineString","coordinates" : [[553177.19, 3953203.35],[553184.93, 3953246.11],[553191.34, 3953257.54],[553218.77, 3953277.20],[553236.60, 3953280.86],[553404.16, 3953284.28],[553450.11, 3953292.28],[553493.31, 3953311.72],[553622.01, 3953389.67],[553650.93, 3953407.91]]}
		]
	}
}
,
{
	"type" : "Feature",
	"properties" : {"ObjectType" : "unknown(0x1181)","fname" : "","name" : "","id" : 285},
	"geometry" : {"type" : "GeometryCollection",
		"geometries" : [
			{"properties" : {"direction" : "oneway","flag" : "sideway"},"type" : "LineString","coordinates" : [[557226.88, 3954549.74],[557241.50, 3954506.36],[557245.35, 3954456.30],[557245.35, 3954430.62],[557231.23, 3954393.39],[557205.56, 3954340.12],[557181.81, 3954299.68],[557143.30, 3954258.93],[557106.06, 3954235.18],[557062.43, 3954213.36],[556960.31, 3954195.51],[556958.26, 3954195.30]]}
		]
	}
}
,
{
	"type" : "Feature",
	"properties" : {"ObjectType" : "mainstreet","fname" : "","name" : "","id" : 394},
	"geometry" : {"type" : "GeometryCollection",
		"geometries" : [
			{"properties" : {"direction" : "oneway","flag" : "sideway"},"type" : "LineString","coordinates" : [[552226.16, 3953251.01],[552327.13, 3953222.76],[552388.97, 3953201.99],[552434.91, 3953193.16],[552507.42, 3953189.24],[552571.00, 3953200.36],[552626.18, 3953223.20],[552642.09, 3953232.92],[552654.55, 3953238.91]]}
		]
	}
}
,
{
	"type" : "Feature",
	"properties" : {"ObjectType" : "mainstreet","fname" : "","name" : "","id" : 405},
	"geometry" : {"type" : "GeometryCollection",
		"geometries" : [
			{"properties" : {"direction" : "oneway","flag" : "sideway"},"type" : "LineString","coordinates" : [[552696.05, 3953450.82],[552748.56, 3953441.10],[552836.89, 3953448.37],[552931.91, 3953467.93],[552954.27, 3953474.08],[553011.84, 3953475.76],[553033.64, 3953470.17],[553092.24, 3953437.28],[553121.43, 3953421.55]]}
		]
	}
}
,
{
	"type" : "Feature",
	"properties" : {"ObjectType" : "highway","fname" : "","name" : "","id" : 409},
	"geometry" : {"type" : "GeometryCollection",
		"geometries" : [
			{"properties" : {"direction" : "oneway","flag" : "sideway"},"type" : "LineString","coordinates" : [[557410.10, 3954313.86],[557399.65, 3954352.69],[557397.87, 3954384.53],[557401.68, 3954399.30],[557417.48, 3954422.73],[557448.81, 3954440.82],[557463.57, 3954443.87],[557494.40, 3954442.09],[557511.47, 3954436.49],[557550.68, 3954414.71],[557567.76, 3954392.68],[557578.19, 3954366.44],[557576.93, 3954350.14],[557572.85, 3954333.58],[557564.69, 3954318.81],[557537.96, 3954290.79],[557510.69, 3954276.02],[557507.39, 3954274.21]]}
		]
	}
}
,
{
	"type" : "Feature",
	"properties" : {"ObjectType" : "unknown(0x1182)","fname" : "","name" : "","id" : 428},
	"geometry" : {"type" : "GeometryCollection",
		"geometries" : [
			{"properties" : {"direction" : "oneway","flag" : "sideway"},"type" : "LineString","coordinates" : [[557460.04, 3954169.12],[557462.81, 3954121.92],[557453.14, 3954083.20],[557438.37, 3954067.92],[557427.16, 3954059.77],[557408.31, 3954054.17],[557386.91, 3954051.62],[557361.94, 3954055.69],[557335.46, 3954065.88],[557311.01, 3954086.26],[557296.75, 3954107.65],[557288.09, 3954127.52],[557290.12, 3954155.03],[557295.73, 3954173.37],[557317.12, 3954195.78],[557334.94, 3954210.05],[557360.81, 3954226.06]]}
		]
	}
}
,
{
	"type" : "Feature",
	"properties" : {"ObjectType" : "unknown(0x1182)","fname" : "","name" : "","id" : 483},
	"geometry" : {"type" : "GeometryCollection",
		"geometries" : [
			{"properties" : {"direction" : "oneway","flag" : "sideway"},"type" : "LineString","coordinates" : [[557518.41, 3954256.55],[557586.35, 3954253.09],[557600.62, 3954248.76],[557627.11, 3954227.62],[557639.84, 3954201.90],[557641.63, 3954185.34],[557637.80, 3954158.34],[557625.06, 3954132.87],[557609.28, 3954121.66],[557597.56, 3954115.30],[557572.34, 3954109.31],[557553.50, 3954109.31],[557536.18, 3954114.15],[557522.17, 3954123.06],[557499.75, 3954147.77],[557482.05, 3954173.16]]}
		]
	}
}
,
{
	"type" : "Feature",
	"properties" : {"ObjectType" : "highway","fname" : "","name" : "","id" : 495},
	"geometry" : {"type" : "GeometryCollection",
		"geometries" : [
			{"properties" : {"direction" : "oneway","flag" : "sideway"},"type" : "LineString","coordinates" : [[557317.57, 3954235.90],[557273.06, 3954239.85],[557256.50, 3954244.69],[557241.47, 3954252.59],[557230.78, 3954264.30],[557220.59, 3954283.41],[557214.48, 3954314.99],[557218.30, 3954335.11],[557232.05, 3954358.80],[557255.48, 3954379.18],[557268.73, 3954384.53],[557300.31, 3954385.29],[557330.62, 3954373.57],[557346.67, 3954358.80],[557363.99, 3954335.11],[557384.13, 3954311.50]]}
		]
	}
}
,
{
	"type" : "Feature",
	"properties" : {"ObjectType" : "mainstreet","fname" : "","name" : "","id" : 609},
	"geometry" : {"type" : "GeometryCollection",
		"geometries" : [
			{"properties" : {"direction" : "oneway","flag" : "sideway"},"type" : "LineString","coordinates" : [[552996.34, 3953568.12],[552980.18, 3953601.31],[552974.42, 3953626.18],[552975.86, 3953647.08],[552980.18, 3953660.42],[552996.77, 3953678.44],[553022.71, 3953691.77],[553036.41, 3953692.49],[553063.80, 3953687.44],[553089.74, 3953666.90],[553097.67, 3953648.16],[553098.39, 3953629.78],[553094.79, 3953606.72],[553073.89, 3953577.89],[553056.59, 3953559.51],[553055.93, 3953558.26]]}
		]
	}
}
,
{
	"type" : "Feature",
	"properties" : {"ObjectType" : "mainstreet","fname" : "","name" : "","id" : 625},
	"geometry" : {"type" : "GeometryCollection",
		"geometries" : [
			{"properties" : {"direction" : "oneway","flag" : "sideway"},"type" : "LineString","coordinates" : [[552906.21, 3953462.07],[552943.92, 3953456.24],[552959.12, 3953444.83],[552968.90, 3953432.34],[552974.87, 3953411.71],[552967.81, 3953388.36],[552939.03, 3953352.52],[552904.81, 3953336.23],[552864.09, 3953336.77],[552843.46, 3953354.69],[552834.23, 3953368.81],[552836.40, 3953388.36],[552849.43, 3953425.29]]}
		]
	}
}
,
{
	"type" : "Feature",
	"properties" : {"ObjectType" : "mainstreet","fname" : "جاویدالاثر حاج احمد متوسلیان","name" : "Motevaseliyan","id" : 716},
	"geometry" : {"type" : "GeometryCollection",
		"geometries" : [
			{"properties" : {"direction" : "oneway","flag" : "bridge"},"type" : "LineString","coordinates" : [[552861.89, 3953726.37],[552954.91, 3953591.61],[553008.73, 3953529.25],[553041.18, 3953496.79],[553057.00, 3953477.57]]}
		]
	}
}
,
{
	"type" : "Feature",
	"properties" : {"ObjectType" : "highway","fname" : "","name" : "","id" : 733},
	"geometry" : {"type" : "GeometryCollection",
		"geometries" : [
			{"properties" : {"direction" : "oneway","flag" : "sideway"},"type" : "LineString","coordinates" : [[552839.25, 3953478.47],[552805.82, 3953484.56],[552789.59, 3953491.63],[552774.66, 3953506.29],[552767.06, 3953517.56],[552763.93, 3953531.70],[552767.06, 3953554.48],[552780.16, 3953572.56],[552798.23, 3953583.03],[552822.32, 3953585.39],[552834.90, 3953582.77],[552849.31, 3953575.44],[552864.76, 3953553.17],[552869.47, 3953536.67],[552864.59, 3953489.59]]}
		]
	}
}
,
{
	"type" : "Feature",
	"properties" : {"ObjectType" : "mainstreet","fname" : "جاویدالاثر حاج احمد متوسلیان","name" : "Motevaseliyan","id" : 757},
	"geometry" : {"type" : "GeometryCollection",
		"geometries" : [
			{"properties" : {"direction" : "oneway","flag" : "bridge"},"type" : "LineString","coordinates" : [[553068.96, 3953495.51],[553019.41, 3953544.20],[552963.03, 3953606.56],[552941.67, 3953636.46],[552894.68, 3953702.24],[552875.04, 3953733.00]]}
		]
	}
}
,
{
	"type" : "Feature",
	"properties" : {"ObjectType" : "mainstreet","fname" : "","name" : "","id" : 818},
	"geometry" : {"type" : "GeometryCollection",
		"geometries" : [
			{"properties" : {"direction" : "oneway","flag" : "sideway"},"type" : "LineString","coordinates" : [[552965.21, 3953243.45],[553026.52, 3953239.75],[553081.96, 3953238.40],[553108.10, 3953229.39],[553129.74, 3953217.22],[553157.03, 3953182.94],[553169.61, 3953158.90],[553194.53, 3953112.51]]}
		]
	}
}
,
{
	"type" : "Feature",
	"properties" : {"ObjectType" : "unknown(0x1181)","fname" : "","name" : "","id" : 827},
	"geometry" : {"type" : "GeometryCollection",
		"geometries" : [
			{"properties" : {"direction" : "oneway","flag" : "sideway"},"type" : "LineString","coordinates" : [[553192.85, 3953426.52],[553155.81, 3953466.13],[553143.00, 3953486.62],[553133.40, 3953521.84],[553135.96, 3953554.83],[553141.60, 3953566.92],[553152.81, 3953587.73],[553195.31, 3953648.06],[553208.53, 3953678.15]]}
		]
	}
}
,
{
	"type" : "Feature",
	"properties" : {"ObjectType" : "unknown(0x1182)","fname" : "","name" : "","id" : 1126},
	"geometry" : {"type" : "GeometryCollection",
		"geometries" : [
			{"properties" : {"direction" : "oneway","flag" : "sideway"},"type" : "LineString","coordinates" : [[554740.98, 3955747.43],[554727.11, 3955776.61],[554718.44, 3955809.89],[554722.78, 3955830.85],[554738.42, 3955844.83],[554756.06, 3955851.48],[554771.69, 3955853.48],[554791.99, 3955849.48],[554807.97, 3955838.84],[554817.62, 3955824.19],[554828.93, 3955799.90],[554829.38, 3955799.64]]}
		]
	}
}
,
{
	"type" : "Feature",
	"properties" : {"ObjectType" : "mainstreet","fname" : "","name" : "","id" : 1193},
	"geometry" : {"type" : "GeometryCollection",
		"geometries" : [
			{"properties" : {"direction" : "oneway","flag" : "sideway"},"type" : "LineString","coordinates" : [[553159.56, 3953276.60],[553255.42, 3953292.03],[553309.60, 3953291.61],[553352.93, 3953285.78],[553373.09, 3953283.40]]}
		]
	}
}
,
{
	"type" : "Feature",
	"properties" : {"ObjectType" : "unknown(0x1181)","fname" : "","name" : "","id" : 1271},
	"geometry" : {"type" : "GeometryCollection",
		"geometries" : [
			{"properties" : {"direction" : "oneway","flag" : "sideway"},"type" : "LineString","coordinates" : [[554207.36, 3955835.41],[554266.18, 3955855.07],[554319.11, 3955854.19],[554370.52, 3955846.21],[554405.31, 3955839.63]]}
		]
	}
}
,
{
	"type" : "Feature",
	"properties" : {"ObjectType" : "POI_square","fname" : "فجر","name" : "Fajr","id" : 1397},
	"geometry" : {"type" : "MultiPoint",
		"coordinates" : [[553640.88, 3954473.42]]
	}
}
,
{
	"type" : "Feature",
	"properties" : {"ObjectType" : "unknown(0x1100)","fname" : "فجر","name" : "Fajr","id" : 1399},
	"geometry" : {"type" : "GeometryCollection",
		"geometries" : [
			{"type" : "LineString","coordinates" : [[553631.42, 3954484.71],[553604.93, 3954495.92],[553601.37, 3954495.57],[553598.30, 3954493.99],[553598.78, 3954488.33],[553632.02, 3954466.17],[553664.42, 3954455.09],[553673.09, 3954455.45],[553676.69, 3954458.70],[553677.66, 3954463.13],[553675.62, 3954467.37],[553662.25, 3954477.49],[553647.92, 3954481.58],[553636.60, 3954483.51],[553634.31, 3954484.35],[553631.42, 3954484.71]]}
		]
	}
}
,
{
	"type" : "Feature",
	"properties" : {"ObjectType" : "unknown(0x1181)","fname" : "","name" : "","id" : 1481},
	"geometry" : {"type" : "GeometryCollection",
		"geometries" : [
			{"properties" : {"direction" : "oneway","flag" : "sideway"},"type" : "LineString","coordinates" : [[554083.65, 3955970.29],[554173.66, 3955905.33],[554192.87, 3955878.43],[554195.82, 3955861.58],[554195.82, 3955851.82],[554193.17, 3955843.54]]}
		]
	}
}
,
{
	"type" : "Feature",
	"properties" : {"ObjectType" : "unknown(0x1181)","fname" : "","name" : "","id" : 1573},
	"geometry" : {"type" : "GeometryCollection",
		"geometries" : [
			{"properties" : {"direction" : "oneway","flag" : "sideway"},"type" : "LineString","coordinates" : [[554788.99, 3955663.70],[554815.07, 3955673.04],[554829.73, 3955672.39],[554880.82, 3955650.58],[554912.40, 3955631.05],[554922.16, 3955628.78],[554932.25, 3955629.43],[554937.46, 3955634.96],[554938.30, 3955637.78]]}
		]
	}
}
,
{
	"type" : "Feature",
	"properties" : {"ObjectType" : "highway","fname" : "جاویدالاثر حاج احمد متوسلیان","name" : "Motevaseliyan","id" : 1632},
	"geometry" : {"type" : "GeometryCollection",
		"geometries" : [
			{"properties" : {"direction" : "oneway","flag" : "bridge"},"type" : "LineString","coordinates" : [[552911.06, 3953495.66],[552839.25, 3953478.47],[552781.49, 3953468.91],[552754.42, 3953466.65]]}
		]
	}
}
,
{
	"type" : "Feature",
	"properties" : {"ObjectType" : "highway","fname" : "جاویدالاثر حاج احمد متوسلیان","name" : "Motevaseliyan","id" : 1636},
	"geometry" : {"type" : "GeometryCollection",
		"geometries" : [
			{"properties" : {"direction" : "oneway","flag" : "bridge"},"type" : "LineString","coordinates" : [[552756.35, 3953450.86],[552857.56, 3953463.75],[552888.50, 3953470.19],[552913.00, 3953476.32]]}
		]
	}
}
,
{
	"type" : "Feature",
	"properties" : {"ObjectType" : "unknown(0x1181)","fname" : "","name" : "","id" : 1736},
	"geometry" : {"type" : "GeometryCollection",
		"geometries" : [
			{"properties" : {"direction" : "oneway","flag" : "sideway"},"type" : "LineString","coordinates" : [[551712.97, 3953515.12],[551659.68, 3953533.67],[551647.65, 3953545.05],[551647.65, 3953551.17],[551652.46, 3953569.55],[551678.93, 3953601.49],[551683.24, 3953609.60]]}
		]
	}
}
,
{
	"type" : "Feature",
	"properties" : {"ObjectType" : "mainstreet","fname" : " ","name" : " ","id" : 1763},
	"geometry" : {"type" : "GeometryCollection",
		"geometries" : [
			{"properties" : {"direction" : "oneway","flag" : "bridge"},"type" : "LineString","coordinates" : [[553185.99, 3953377.62],[553248.36, 3953343.45],[553293.63, 3953325.51],[553319.26, 3953319.53]]}
		]
	}
}
,
{
	"type" : "Feature",
	"properties" : {"ObjectType" : "mainstreet","fname" : " ","name" : " ","id" : 1770},
	"geometry" : {"type" : "GeometryCollection",
		"geometries" : [
			{"properties" : {"direction" : "oneway","flag" : "bridge"},"type" : "LineString","coordinates" : [[552654.55, 3953238.91],[552725.39, 3953288.57],[552756.62, 3953319.89],[552765.97, 3953330.98]]}
		]
	}
}
,
{
	"type" : "Feature",
	"properties" : {"ObjectType" : "highway","fname" : " ","name" : " ","id" : 2174},
	"geometry" : {"type" : "GeometryCollection",
		"geometries" : [
			{"properties" : {"direction" : "oneway","flag" : "bridge"},"type" : "LineString","coordinates" : [[557384.13, 3954311.50],[557426.38, 3954229.83],[557436.67, 3954212.95]]}
		]
	}
}
,
{
	"type" : "Feature",
	"properties" : {"ObjectType" : "highway","fname" : " ","name" : " ","id" : 2224},
	"geometry" : {"type" : "GeometryCollection",
		"geometries" : [
			{"properties" : {"direction" : "oneway","flag" : "bridge"},"type" : "LineString","coordinates" : [[557462.68, 3954220.47],[557439.78, 3954266.38],[557420.68, 3954296.03],[557410.10, 3954313.86]]}
		]
	}
}
,
{
	"type" : "Feature",
	"properties" : {"ObjectType" : "POI_square","fname" : " ","name" : "Binam","id" : 2309},
	"geometry" : {"type" : "MultiPoint",
		"coordinates" : [[554558.69, 3955424.06]]
	}
}
,
{
	"type" : "Feature",
	"properties" : {"ObjectType" : "unknown(0x1100)","fname" : " ","name" : "Binam","id" : 2326},
	"geometry" : {"type" : "GeometryCollection",
		"geometries" : [
			{"type" : "LineString","coordinates" : [[554574.10, 3955422.30],[554544.22, 3955437.36],[554540.38, 3955436.07],[554538.80, 3955432.65],[554540.54, 3955426.86],[554572.90, 3955410.28],[554576.19, 3955411.20],[554578.82, 3955416.13],[554574.34, 3955422.22],[554574.10, 3955422.30]]}
		]
	}
}
,
{
	"type" : "Feature",
	"properties" : {"ObjectType" : "POI_square","fname" : " ","name" : "Binam","id" : 2340},
	"geometry" : {"type" : "MultiPoint",
		"coordinates" : [[554071.32, 3955705.09]]
	}
}
,
{
	"type" : "Feature",
	"properties" : {"ObjectType" : "unknown(0x1100)","fname" : " ","name" : "Binam","id" : 2358},
	"geometry" : {"type" : "GeometryCollection",
		"geometries" : [
			{"type" : "LineString","coordinates" : [[554087.06, 3955704.00],[554081.39, 3955716.19],[554077.89, 3955718.42],[554066.27, 3955719.12],[554063.22, 3955717.78],[554055.81, 3955708.12],[554055.28, 3955704.22],[554055.81, 3955699.89],[554063.22, 3955690.23],[554067.05, 3955688.64],[554079.12, 3955690.23],[554082.42, 3955692.76],[554086.53, 3955699.89],[554087.01, 3955702.62],[554087.06, 3955704.00]]}
		]
	}
}
,
{
	"type" : "Feature",
	"properties" : {"ObjectType" : "unknown(0x1181)","fname" : "","name" : "","id" : 2527},
	"geometry" : {"type" : "GeometryCollection",
		"geometries" : [
			{"properties" : {"direction" : "oneway","flag" : "sideway"},"type" : "LineString","coordinates" : [[553275.77, 3953822.86],[553248.78, 3953807.63],[553224.50, 3953804.37],[553199.78, 3953811.48],[553191.14, 3953813.28]]}
		]
	}
}
,
{
	"type" : "Feature",
	"properties" : {"ObjectType" : "mainstreet","fname" : " ","name" : " ","id" : 2575},
	"geometry" : {"type" : "GeometryCollection",
		"geometries" : [
			{"properties" : {"direction" : "oneway","flag" : "bridge"},"type" : "LineString","coordinates" : [[553118.18, 3953352.63],[553144.69, 3953268.05],[553118.18, 3953352.63],[553144.69, 3953268.05]]}
		]
	}
}
,
{
	"type" : "Feature",
	"properties" : {"ObjectType" : "mainstreet","fname" : " ","name" : " ","id" : 2602},
	"geometry" : {"type" : "GeometryCollection",
		"geometries" : [
			{"properties" : {"direction" : "oneway","flag" : "bridge"},"type" : "LineString","coordinates" : [[553157.05, 3953272.17],[553131.44, 3953355.38],[553157.05, 3953272.17],[553131.44, 3953355.38]]}
		]
	}
}
,
{
	"type" : "Feature",
	"properties" : {"ObjectType" : "POI_square","fname" : "ابوذر","name" : "Abuzar","id" : 2617},
	"geometry" : {"type" : "MultiPoint",
		"coordinates" : [[551452.20, 3955749.76]]
	}
}
,
{
	"type" : "Feature",
	"properties" : {"ObjectType" : "unknown(0x1100)","fname" : "ابوذر","name" : "Abuzar","id" : 2636},
	"geometry" : {"type" : "GeometryCollection",
		"geometries" : [
			{"type" : "LineString","coordinates" : [[551457.14, 3955763.02],[551445.38, 3955761.15],[551440.72, 3955756.68],[551439.79, 3955743.80],[551445.93, 3955737.08],[551453.22, 3955735.59],[551459.56, 3955738.02],[551464.23, 3955743.99],[551464.23, 3955755.18],[551461.62, 3955759.66],[551457.14, 3955763.02]]}
		]
	}
}
,
{
	"type" : "Feature",
	"properties" : {"ObjectType" : "unknown(0x1181)","fname" : "","name" : "","id" : 2727},
	"geometry" : {"type" : "GeometryCollection",
		"geometries" : [
			{"properties" : {"direction" : "oneway","flag" : "sideway"},"type" : "LineString","coordinates" : [[551714.25, 3955736.65],[551699.69, 3955722.63],[551688.42, 3955715.57],[551672.34, 3955711.62],[551652.88, 3955717.83],[551644.80, 3955723.34]]}
		]
	}
}
,
{
	"type" : "Feature",
	"properties" : {"ObjectType" : "unknown(0x1181)","fname" : "","name" : "","id" : 2888},
	"geometry" : {"type" : "GeometryCollection",
		"geometries" : [
			{"properties" : {"direction" : "oneway","flag" : "sideway"},"type" : "LineString","coordinates" : [[553612.21, 3954451.07],[553627.72, 3954445.87],[553652.38, 3954448.17],[553676.47, 3954447.74],[553684.80, 3954448.31]]}
		]
	}
}
,
{
	"type" : "Feature",
	"properties" : {"ObjectType" : "unknown(0x1100)","fname" : "","name" : "","id" : 3146},
	"geometry" : {"type" : "GeometryCollection",
		"geometries" : [
			{"type" : "LineString","coordinates" : [[553712.05, 3954449.17],[553681.06, 3954471.39],[553679.34, 3954480.28],[553680.48, 3954490.32],[553680.57, 3954495.93]]}
		]
	}
}
,
{
	"type" : "Feature",
	"properties" : {"ObjectType" : "POI_square","fname" : "نور","name" : "Binam","id" : 3288},
	"geometry" : {"type" : "MultiPoint",
		"coordinates" : [[553758.26, 3955871.03]]
	}
}
,
{
	"type" : "Feature",
	"properties" : {"ObjectType" : "unknown(0x1100)","fname" : "نور","name" : "Binam","id" : 3310},
	"geometry" : {"type" : "GeometryCollection",
		"geometries" : [
			{"type" : "LineString","coordinates" : [[553765.12, 3955862.69],[553763.67, 3955878.65],[553746.15, 3955872.95],[553764.92, 3955862.69],[553765.12, 3955862.69]]}
		]
	}
}
,
{
	"type" : "Feature",
	"properties" : {"ObjectType" : "unknown(0x1181)","fname" : "","name" : "","id" : 3386},
	"geometry" : {"type" : "GeometryCollection",
		"geometries" : [
			{"properties" : {"direction" : "oneway","flag" : "sideway"},"type" : "LineString","coordinates" : [[552020.43, 3953863.07],[552007.81, 3953862.51],[551996.38, 3953873.95],[551996.02, 3953882.17],[551996.02, 3953895.76],[551996.23, 3953897.61]]}
		]
	}
}
,
{
	"type" : "Feature",
	"properties" : {"ObjectType" : "highway","fname" : " ","name" : " ","id" : 3524},
	"geometry" : {"type" : "GeometryCollection",
		"geometries" : [
			{"properties" : {"direction" : "oneway","flag" : "bridge"},"type" : "LineString","coordinates" : [[554782.81, 3955712.30],[554825.87, 3955692.42],[554825.96, 3955692.43]]}
		]
	}
}
,
{
	"type" : "Feature",
	"properties" : {"ObjectType" : "unknown(0x1181)","fname" : "","name" : "","id" : 3530},
	"geometry" : {"type" : "GeometryCollection",
		"geometries" : [
			{"properties" : {"direction" : "oneway","flag" : "sideway"},"type" : "LineString","coordinates" : [[553589.65, 3954489.83],[553607.07, 3954471.39],[553612.81, 3954460.78],[553612.21, 3954451.07]]}
		]
	}
}
,
{
	"type" : "Feature",
	"properties" : {"ObjectType" : "unknown(0x1100)","fname" : "","name" : "","id" : 3550},
	"geometry" : {"type" : "GeometryCollection",
		"geometries" : [
			{"type" : "LineString","coordinates" : [[553680.57, 3954495.93],[553653.24, 3954486.73],[553636.90, 3954483.58],[553636.60, 3954483.51]]}
		]
	}
}
,
{
	"type" : "Feature",
	"properties" : {"ObjectType" : "highway","fname" : " ","name" : " ","id" : 3588},
	"geometry" : {"type" : "GeometryCollection",
		"geometries" : [
			{"properties" : {"direction" : "oneway","flag" : "bridge"},"type" : "LineString","coordinates" : [[554829.29, 3955708.93],[554789.07, 3955728.02],[554829.29, 3955708.93],[554789.07, 3955728.02]]}
		]
	}
}
,
{
	"type" : "Feature",
	"properties" : {"ObjectType" : "unknown(0x1181)","fname" : "","name" : "","id" : 3606},
	"geometry" : {"type" : "GeometryCollection",
		"geometries" : [
			{"properties" : {"direction" : "oneway","flag" : "sideway"},"type" : "LineString","coordinates" : [[551389.41, 3955746.82],[551426.71, 3955750.78],[551432.77, 3955750.27]]}
		]
	}
}
,
{
	"type" : "Feature",
	"properties" : {"ObjectType" : "mainstreet","fname" : "","name" : "","id" : 3681},
	"geometry" : {"type" : "GeometryCollection",
		"geometries" : [
			{"properties" : {"direction" : "oneway","flag" : "sideway"},"type" : "LineString","coordinates" : [[553205.50, 3953776.52],[553197.55, 3953749.25],[553193.71, 3953738.31]]}
		]
	}
}
,
{
	"type" : "Feature",
	"properties" : {"ObjectType" : "unknown(0x1181)","fname" : "","name" : "","id" : 3753},
	"geometry" : {"type" : "GeometryCollection",
		"geometries" : [
			{"properties" : {"direction" : "oneway","flag" : "sideway"},"type" : "LineString","coordinates" : [[551429.68, 3955775.05],[551448.51, 3955774.58],[551454.53, 3955772.00],[551461.98, 3955766.84],[551462.69, 3955765.35]]}
		]
	}
}
,
{
	"type" : "Feature",
	"properties" : {"ObjectType" : "bystreet","fname" : " ","name" : " ","id" : 3911},
	"geometry" : {"type" : "GeometryCollection",
		"geometries" : [
			{"properties" : {"direction" : "twoway","flag" : "bridge"},"type" : "LineString","coordinates" : [[551394.69, 3954111.92],[551385.81, 3954123.81],[551380.43, 3954131.04]]}
		]
	}
}
,
{
	"type" : "Feature",
	"properties" : {"ObjectType" : "region","fname" : "حکیمیه","name" : "","id" : 4263},
	"geometry" : {"type" : "MultiPoint",
		"coordinates" : [[552475.76, 3954805.06]]
	}
}
]
}