[gd_scene load_steps=6 format=2]

[ext_resource path="res://Turret/Arrow/Arrow.gd" type="Script" id=1]
[ext_resource path="res://Turret/Arrow/arrow_.png" type="Texture" id=2]
[ext_resource path="res://Turret/Arrow/arrow.wav" type="AudioStream" id=3]

[sub_resource type="RectangleShape2D" id=5]
extents = Vector2( 16, 1.75 )

[sub_resource type="RectangleShape2D" id=4]
extents = Vector2( 3, 1.875 )

[node name="Arrow" type="KinematicBody2D"]
collision_layer = 0
collision_mask = 0
script = ExtResource( 1 )

[node name="Sprite" type="Sprite" parent="."]
texture = ExtResource( 2 )

[node name="CollisionShape2D" type="CollisionShape2D" parent="."]
position = Vector2( 0, -0.75 )
shape = SubResource( 5 )

[node name="Area2D" type="Area2D" parent="."]
modulate = Color( 1, 0, 0, 1 )
position = Vector2( 13, -1 )

[node name="CollisionShape2D" type="CollisionShape2D" parent="Area2D"]
position = Vector2( 6, 0 )
shape = SubResource( 4 )

[node name="AudioStreamPlayer2D" type="AudioStreamPlayer2D" parent="."]
stream = ExtResource( 3 )
autoplay = true

[node name="LifeTimer" type="Timer" parent="."]
one_shot = true

[connection signal="body_entered" from="Area2D" to="." method="_on_Area2D_body_entered"]
[connection signal="timeout" from="LifeTimer" to="." method="_on_LifeTimer_timeout"]
