{
    "fixed acidity": {
        "0": 7.0
    },
    "volatile acidity": {
        "0": 0.27
    },
    "citric acid": {
        "0": 0.36
    },
    "residual sugar": {
        "0": 20.7
    },
    "chlorides": {
        "0": 0.045
    },
    "free sulfur dioxide": {
        "0": 45.0
    },
    "total sulfur dioxide": {
        "0": 170.0
    },
    "density": {
        "0": 1.001
    },
    "pH": {
        "0": 3.0
    },
    "sulphates": {
        "0": 0.45
    },
    "alcohol": {
        "0": 8.8
    }
}