﻿GLOBAL = {
	every_country = {
		limit = {
			NOT = { is_country_type = decentralized }
		}

		#every_scope_state = {
		#	set_quest_target = yes
		#}
		#add_journal_entry = { type = je_shadow_over_ynnsmouth }
		#trigger_event = {
		#	id = shadow_over_ynnsmouth.1
		#}

		#setup_racial_flags = yes
	}
}
