﻿# Anbennar - removed GBR

namespace = scotland_yard

# New Police Headquarters
scotland_yard.1 = {
	type = country_event
	placement = ROOT
	
	title = scotland_yard.1.t
	desc = {
		triggered_desc = {
			desc = scotland_yard.1.d2
			trigger = {
				always = yes
			}
		}
		# first_valid = {
		# 	triggered_desc = {
		# 		desc = scotland_yard.1.d
		# 		trigger = {
		# 			exists = c:GBR
		# 			THIS = c:GBR
		# 			owns_entire_state_region = STATE_HOME_COUNTIES
		# 		}
		# 	}
		# 	triggered_desc = {
		# 		desc = scotland_yard.1.d2
		# 		trigger = {
		# 			always = yes
		# 		}
		# 	}
		# }
	}
	flavor = scotland_yard.1.f
	
	event_image = {
		video = "europenorthamerica_london_center"
	}

	on_created_soundeffect = "event:/SFX/UI/Alerts/event_appear"

	icon = "gfx/interface/icons/event_icons/event_scales.dds"
	
	duration = 3
	
	trigger = {
		# triggered by JE completion
	}

	immediate = {
		capital = {
			save_scope_as = capital_scope
		}
		law_type:law_dedicated_police = {
			save_scope_as = police_law
		}
	}

	option = {
		name = scotland_yard.1.a
		default_option = yes
		capital = {
			add_loyalists_in_state = {
				pop_type = soldiers
				value = 0.33
			}
		}
	}

	option = {
		name = scotland_yard.1.b
		capital = {
			add_modifier = { # state_radicals_from_sol_change_mult
				name = scotland_yard_effective_policing
				months = long_modifier_time
			}
		}
	}
}