﻿object={
	name="pine_sparse_generator_1_0"
	clamp_to_water_level=no
	render_under_water=no
	generated_content=yes
	layer="semidynamic"
	pdxmesh="tree_fir_001_mesh"
	count=46
	transform="2348.352051 0.000000 3236.870361 0.000000 0.121802 0.000000 0.992554 0.407354 0.407354 0.407354
4062.236816 0.000000 3272.139160 0.000000 0.281690 0.000000 0.959505 0.470743 0.470743 0.470743
6131.213867 0.000000 2475.085449 0.000000 0.477148 0.000000 0.878823 0.449724 0.449724 0.449724
6130.798340 0.000000 2465.509277 0.000000 0.292240 0.000000 0.956345 0.650342 0.650342 0.650342
4351.586426 0.000000 2764.684570 0.000000 0.192863 0.000000 0.981226 0.504019 0.504019 0.504019
4280.315430 0.000000 2804.743408 0.000000 0.116860 0.000000 0.993148 0.453246 0.453246 0.453246
4259.765137 0.000000 2850.065918 0.000000 0.353870 0.000000 0.935295 0.383881 0.383881 0.383881
4253.237305 0.000000 2857.740967 0.000000 0.349569 0.000000 0.936911 0.409284 0.409284 0.409284
4251.932617 0.000000 2844.488281 0.000000 0.274129 0.000000 0.961693 0.382051 0.382051 0.382051
4258.857422 0.000000 2853.347656 0.000000 0.120179 0.000000 0.992752 0.465609 0.465609 0.465609
4256.449219 0.000000 2850.214111 0.000000 0.131898 0.000000 0.991263 0.414628 0.414628 0.414628
4251.635742 0.000000 2847.269043 0.000000 0.270977 0.000000 0.962586 0.458070 0.458070 0.458070
4366.007324 0.000000 2798.624512 0.000000 0.046652 0.000000 0.998911 0.639138 0.639138 0.639138
4364.552734 0.000000 2793.928467 0.000000 0.383647 0.000000 0.923480 0.384190 0.384190 0.384190
4407.531250 0.000000 2778.338135 0.000000 0.404821 0.000000 0.914396 0.535943 0.535943 0.535943
4388.759766 0.000000 2789.110596 0.000000 0.321906 0.000000 0.946772 0.405210 0.405210 0.405210
4413.738281 0.000000 2795.983643 0.000000 0.391862 0.000000 0.920024 0.471346 0.471346 0.471346
4461.516602 0.000000 2782.467773 0.000000 0.431849 0.000000 0.901946 0.408875 0.408875 0.408875
4417.451172 0.000000 2779.909912 0.000000 0.386413 0.000000 0.922326 0.418968 0.418968 0.418968
4425.203613 0.000000 2803.435059 0.000000 0.125824 0.000000 0.992053 0.462213 0.462213 0.462213
4454.889160 0.000000 2791.174072 0.000000 0.316505 0.000000 0.948591 0.387040 0.387040 0.387040
4417.451660 0.000000 2777.126709 0.000000 0.445793 0.000000 0.895136 0.456306 0.456306 0.456306
4417.017578 0.000000 2850.911865 0.000000 0.171633 0.000000 0.985161 0.438391 0.438391 0.438391
4154.807129 0.000000 3226.263916 0.000000 0.455022 0.000000 0.890480 0.385686 0.385686 0.385686
4158.270020 0.000000 3224.040771 0.000000 0.070498 0.000000 0.997512 0.452345 0.452345 0.452345
4117.502930 0.000000 3267.928467 0.000000 0.089133 0.000000 0.996020 0.447439 0.447439 0.447439
4129.099609 0.000000 3253.559082 0.000000 0.445188 0.000000 0.895437 0.650561 0.650561 0.650561
4149.566895 0.000000 3232.071533 0.000000 0.384792 0.000000 0.923003 0.426175 0.426175 0.426175
4135.591309 0.000000 3261.445312 0.000000 0.304170 0.000000 0.952618 0.462314 0.462314 0.462314
4299.486816 0.000000 3228.168945 0.000000 0.392835 0.000000 0.919609 0.444384 0.444384 0.444384
4143.663086 0.000000 3286.105713 0.000000 0.236335 0.000000 0.971672 0.562703 0.562703 0.562703
4171.786133 0.000000 3281.146729 0.000000 0.051067 0.000000 0.998695 0.430919 0.430919 0.430919
4182.782715 0.000000 3283.397217 0.000000 0.198360 0.000000 0.980129 0.637029 0.637029 0.637029
6238.236816 0.000000 2424.873535 0.000000 0.330984 0.000000 0.943636 0.493176 0.493176 0.493176
6214.215332 0.000000 2421.281494 0.000000 0.321308 0.000000 0.946975 0.646751 0.646751 0.646751
6220.375000 0.000000 2427.011475 0.000000 0.329723 0.000000 0.944078 0.496699 0.496699 0.496699
6160.186523 0.000000 2447.979492 0.000000 0.576000 0.000000 0.817449 0.471990 0.471990 0.471990
6173.958984 0.000000 2439.028564 0.000000 0.327530 0.000000 0.944841 0.464587 0.464587 0.464587
6264.065918 0.000000 2454.190674 0.000000 0.044546 0.000000 0.999007 0.604525 0.604525 0.604525
6260.014648 0.000000 2437.671387 0.000000 0.288042 0.000000 0.957618 0.567732 0.567732 0.567732
6266.637207 0.000000 2455.761719 0.000000 0.498693 0.000000 0.866779 0.572632 0.572632 0.572632
6280.407715 0.000000 2436.640381 0.000000 0.137854 0.000000 0.990453 0.398703 0.398703 0.398703
6312.974609 0.000000 2440.349609 0.000000 0.294738 0.000000 0.955578 0.476357 0.476357 0.476357
6348.457520 0.000000 2480.604004 0.000000 0.288016 0.000000 0.957626 0.420844 0.420844 0.420844
6348.978516 0.000000 2486.048584 0.000000 0.575565 0.000000 0.817756 0.387331 0.387331 0.387331
6351.831543 0.000000 2489.484375 0.000000 0.363389 0.000000 0.931638 0.550684 0.550684 0.550684
"}
object={
	name="pine_sparse_generator_1_1"
	clamp_to_water_level=no
	render_under_water=no
	generated_content=yes
	layer="semidynamic"
	pdxmesh="tree_fir_002_mesh"
	count=42
	transform="2351.145508 0.000000 3237.757324 0.000000 0.760161 0.000000 0.649734 0.396662 0.396662 0.396662
6131.634277 0.000000 2471.555908 0.000000 0.872302 0.000000 0.488967 0.586301 0.586301 0.586301
4351.958008 0.000000 2788.633301 0.000000 0.911962 0.000000 0.410274 0.569929 0.569929 0.569929
4260.759766 0.000000 2845.594971 0.000000 0.896565 0.000000 0.442911 0.680114 0.680114 0.680114
4259.200195 0.000000 2837.015625 0.000000 0.849828 0.000000 0.527061 0.551378 0.551378 0.551378
4252.947754 0.000000 2854.290527 0.000000 0.870904 0.000000 0.491454 0.456309 0.456309 0.456309
4352.156738 0.000000 2766.150146 0.000000 0.789934 0.000000 0.613192 0.580165 0.580165 0.580165
4410.544434 0.000000 2808.157471 0.000000 0.863920 0.000000 0.503629 0.467385 0.467385 0.467385
4354.500488 0.000000 2787.478516 0.000000 0.881256 0.000000 0.472638 0.411167 0.411167 0.411167
4384.032227 0.000000 2804.672363 0.000000 0.592166 0.000000 0.805816 0.387227 0.387227 0.387227
4358.330566 0.000000 2779.831299 0.000000 0.948687 0.000000 0.316215 0.421435 0.421435 0.421435
4370.817383 0.000000 2798.178223 0.000000 0.678363 0.000000 0.734727 0.664521 0.664521 0.664521
4386.735840 0.000000 2807.387451 0.000000 0.913664 0.000000 0.406470 0.469468 0.469468 0.469468
4390.346680 0.000000 2821.991943 0.000000 0.739336 0.000000 0.673337 0.437303 0.437303 0.437303
4387.666992 0.000000 2804.220703 0.000000 0.776432 0.000000 0.630201 0.419550 0.419550 0.419550
4388.029297 0.000000 2786.287109 0.000000 0.682155 0.000000 0.731207 0.430342 0.430342 0.430342
4408.473633 0.000000 2775.865234 0.000000 0.896706 0.000000 0.442626 0.516075 0.516075 0.516075
4460.083496 0.000000 2787.795410 0.000000 0.906782 0.000000 0.421600 0.438711 0.438711 0.438711
4454.469727 0.000000 2794.328369 0.000000 0.896727 0.000000 0.442584 0.413584 0.413584 0.413584
4460.352051 0.000000 2784.995361 0.000000 0.799915 0.000000 0.600114 0.431428 0.431428 0.431428
4406.381836 0.000000 2853.546387 0.000000 0.726178 0.000000 0.687506 0.472270 0.472270 0.472270
4144.205566 0.000000 3276.068115 0.000000 0.815630 0.000000 0.578574 0.642512 0.642512 0.642512
4160.156738 0.000000 3274.509521 0.000000 0.668380 0.000000 0.743820 0.388441 0.388441 0.388441
4299.929688 0.000000 3231.615234 0.000000 0.676986 0.000000 0.735996 0.667769 0.667769 0.667769
4138.835938 0.000000 3282.100098 0.000000 0.929940 0.000000 0.367712 0.435880 0.435880 0.435880
4183.890625 0.000000 3295.151367 0.000000 0.617892 0.000000 0.786263 0.419697 0.419697 0.419697
4168.614258 0.000000 3289.622559 0.000000 0.757736 0.000000 0.652561 0.482502 0.482502 0.482502
4183.408203 0.000000 3287.931885 0.000000 0.794454 0.000000 0.607325 0.673480 0.673480 0.673480
6242.015137 0.000000 2449.323730 0.000000 0.700790 0.000000 0.713367 0.441915 0.441915 0.441915
6244.759766 0.000000 2450.204346 0.000000 0.707648 0.000000 0.706565 0.458781 0.458781 0.458781
6229.235840 0.000000 2448.689209 0.000000 0.885477 0.000000 0.464684 0.643365 0.643365 0.643365
6328.065918 0.000000 2454.190674 0.000000 0.842486 0.000000 0.538718 0.481650 0.481650 0.481650
6310.893555 0.000000 2448.275391 0.000000 0.929939 0.000000 0.367713 0.394961 0.394961 0.394961
6324.463867 0.000000 2443.909912 0.000000 0.739364 0.000000 0.673306 0.590767 0.590767 0.590767
6330.462402 0.000000 2445.898193 0.000000 0.895461 0.000000 0.445140 0.517902 0.517902 0.517902
6327.819336 0.000000 2447.658936 0.000000 0.847301 0.000000 0.531113 0.425268 0.425268 0.425268
6316.352051 0.000000 2446.089111 0.000000 0.879441 0.000000 0.476009 0.443368 0.443368 0.443368
6350.953125 0.000000 2482.799805 0.000000 0.939436 0.000000 0.342726 0.396060 0.396060 0.396060
6336.163086 0.000000 2463.574707 0.000000 0.906015 0.000000 0.423245 0.476717 0.476717 0.476717
6342.724121 0.000000 2462.335693 0.000000 0.941814 0.000000 0.336133 0.545412 0.545412 0.545412
6353.722656 0.000000 2481.005371 0.000000 0.780691 0.000000 0.624917 0.455235 0.455235 0.455235
6347.929688 0.000000 2497.318359 0.000000 0.745889 0.000000 0.666070 0.509944 0.509944 0.509944
"}
object={
	name="pine_sparse_generator_1_2"
	clamp_to_water_level=no
	render_under_water=no
	generated_content=yes
	layer="semidynamic"
	pdxmesh="tree_fir_003_mesh"
	count=49
	transform="2270.530029 0.000000 3243.069336 0.000000 0.999829 0.000000 0.018509 0.596533 0.596533 0.596533
2339.764893 0.000000 3188.972168 0.000000 0.984026 0.000000 -0.178025 0.447124 0.447124 0.447124
4701.392090 0.000000 2529.985840 0.000000 0.999465 0.000000 -0.032700 0.501659 0.501659 0.501659
4333.434082 0.000000 2797.463623 0.000000 0.986799 0.000000 0.161952 0.513100 0.513100 0.513100
4258.015137 0.000000 2844.714355 0.000000 0.991083 0.000000 -0.133246 0.448341 0.448341 0.448341
4258.735840 0.000000 2863.871826 0.000000 0.976789 0.000000 -0.214203 0.573246 0.573246 0.573246
4257.448730 0.000000 2847.515625 0.000000 0.983518 0.000000 0.180809 0.605406 0.605406 0.605406
4260.029297 0.000000 2842.771484 0.000000 0.980282 0.000000 -0.197603 0.465342 0.465342 0.465342
4390.893555 0.000000 2787.181641 0.000000 0.968254 0.000000 -0.249968 0.414490 0.414490 0.414490
4393.385742 0.000000 2800.652588 0.000000 0.962051 0.000000 -0.272869 0.416832 0.416832 0.416832
4413.248047 0.000000 2813.736328 0.000000 0.967904 0.000000 -0.251319 0.403387 0.403387 0.403387
4402.584961 0.000000 2795.628662 0.000000 0.974204 0.000000 0.225668 0.396943 0.396943 0.396943
4362.351562 0.000000 2788.613281 0.000000 0.998282 0.000000 0.058588 0.683158 0.683158 0.683158
4352.514160 0.000000 2783.815186 0.000000 0.999894 0.000000 0.014544 0.399801 0.399801 0.399801
4355.820801 0.000000 2781.539795 0.000000 0.963875 0.000000 -0.266355 0.500580 0.500580 0.500580
4376.795410 0.000000 2795.646484 0.000000 0.978836 0.000000 -0.204646 0.527160 0.527160 0.527160
4405.519043 0.000000 2794.359863 0.000000 0.971368 0.000000 0.237579 0.418855 0.418855 0.418855
4425.400879 0.000000 2783.853516 0.000000 0.998397 0.000000 0.056598 0.433399 0.433399 0.433399
4477.212891 0.000000 2793.126221 0.000000 0.980712 0.000000 -0.195457 0.445436 0.445436 0.445436
4419.837402 0.000000 2791.296387 0.000000 0.985049 0.000000 -0.172277 0.617897 0.617897 0.617897
4403.016113 0.000000 2845.069824 0.000000 0.998143 0.000000 -0.060909 0.411678 0.411678 0.411678
4132.276367 0.000000 3252.856201 0.000000 0.981454 0.000000 -0.191695 0.622472 0.622472 0.622472
4099.505371 0.000000 3263.035645 0.000000 0.999952 0.000000 -0.009745 0.400131 0.400131 0.400131
4141.311035 0.000000 3253.959229 0.000000 0.977658 0.000000 -0.210203 0.445687 0.445687 0.445687
4291.505371 0.000000 3206.551270 0.000000 0.983347 0.000000 0.181737 0.495252 0.495252 0.495252
4140.062988 0.000000 3285.082764 0.000000 0.999119 0.000000 0.041970 0.399440 0.399440 0.399440
4178.190430 0.000000 3285.615967 0.000000 0.995792 0.000000 0.091647 0.586671 0.586671 0.586671
6165.934570 0.000000 2427.155762 0.000000 0.963073 0.000000 -0.269241 0.552675 0.552675 0.552675
6218.072266 0.000000 2428.515869 0.000000 0.995038 0.000000 -0.099494 0.414219 0.414219 0.414219
6241.062500 0.000000 2424.417725 0.000000 0.978031 0.000000 -0.208459 0.607014 0.607014 0.607014
6158.220703 0.000000 2445.908936 0.000000 0.998574 0.000000 0.053382 0.441267 0.441267 0.441267
6176.426758 0.000000 2441.265869 0.000000 0.990424 0.000000 0.138059 0.408753 0.408753 0.408753
6144.163086 0.000000 2463.574707 0.000000 0.992991 0.000000 0.118187 0.440182 0.440182 0.440182
6159.197266 0.000000 2440.460938 0.000000 0.998224 0.000000 0.059578 0.404049 0.404049 0.404049
6146.822754 0.000000 2462.796143 0.000000 0.988881 0.000000 -0.148707 0.706573 0.706573 0.706573
6231.890625 0.000000 2447.885742 0.000000 0.999977 0.000000 0.006846 0.399911 0.399911 0.399911
6234.122559 0.000000 2439.636475 0.000000 0.996547 0.000000 -0.083030 0.583623 0.583623 0.583623
6227.007324 0.000000 2446.906494 0.000000 0.963225 0.000000 -0.268698 0.671068 0.671068 0.671068
6243.991211 0.000000 2444.554688 0.000000 0.967451 0.000000 0.253057 0.688599 0.688599 0.688599
6237.020508 0.000000 2441.658447 0.000000 0.984360 0.000000 0.176167 0.470201 0.470201 0.470201
6266.462402 0.000000 2445.898193 0.000000 0.996395 0.000000 -0.084840 0.412030 0.412030 0.412030
6218.564941 0.000000 2431.376953 0.000000 0.996631 0.000000 -0.082017 0.700145 0.700145 0.700145
6208.090332 0.000000 2432.123779 0.000000 0.997862 0.000000 -0.065362 0.470819 0.470819 0.470819
6317.375000 0.000000 2453.749756 0.000000 0.994884 0.000000 -0.101023 0.459636 0.459636 0.459636
6319.145508 0.000000 2446.976074 0.000000 0.999985 0.000000 -0.005415 0.593289 0.593289 0.593289
6281.084961 0.000000 2439.645996 0.000000 0.953485 0.000000 0.301442 0.492706 0.492706 0.492706
6282.564941 0.000000 2431.376953 0.000000 0.975147 0.000000 -0.221559 0.469764 0.469764 0.469764
6350.007324 0.000000 2459.718262 0.000000 0.987865 0.000000 -0.155315 0.444756 0.444756 0.444756
6353.664551 0.000000 2491.968506 0.000000 0.975477 0.000000 -0.220102 0.545464 0.545464 0.545464
"}
object={
	name="pine_sparse_generator_1_3"
	clamp_to_water_level=no
	render_under_water=no
	generated_content=yes
	layer="semidynamic"
	pdxmesh="tree_fir_004_mesh"
	count=63
	transform="2226.585205 0.000000 3247.503662 0.000000 0.948027 0.000000 -0.318189 0.519750 0.519750 0.519750
2248.614258 0.000000 3233.138184 0.000000 0.882770 0.000000 -0.469805 0.474613 0.474613 0.474613
4073.204590 0.000000 3256.170654 0.000000 0.752182 0.000000 -0.658956 0.484993 0.484993 0.484993
4070.581055 0.000000 3254.733887 0.000000 0.858382 0.000000 -0.513012 0.510127 0.510127 0.510127
4698.979980 0.000000 2527.145264 0.000000 0.937441 0.000000 -0.348143 0.404794 0.404794 0.404794
4703.334473 0.000000 2526.297852 0.000000 0.917533 0.000000 -0.397659 0.692045 0.692045 0.692045
6132.365234 0.000000 2468.094482 0.000000 0.913170 0.000000 -0.407580 0.621170 0.621170 0.621170
6137.910645 0.000000 2476.779053 0.000000 0.918468 0.000000 -0.395495 0.406699 0.406699 0.406699
6135.060547 0.000000 2470.427734 0.000000 0.709094 0.000000 -0.705114 0.625559 0.625559 0.625559
4275.456055 0.000000 2818.022705 0.000000 0.776822 0.000000 -0.629720 0.428950 0.428950 0.428950
4341.994141 0.000000 2789.020508 0.000000 0.789152 0.000000 -0.614198 0.409246 0.409246 0.409246
4255.758301 0.000000 2854.378418 0.000000 0.757922 0.000000 -0.652346 0.548788 0.548788 0.548788
4259.991211 0.000000 2839.945312 0.000000 0.923311 0.000000 -0.384053 0.507147 0.507147 0.507147
4256.426758 0.000000 2836.656494 0.000000 0.896544 0.000000 -0.442956 0.512535 0.512535 0.512535
4262.889160 0.000000 2847.658447 0.000000 0.783721 0.000000 -0.621113 0.409302 0.409302 0.409302
4262.581055 0.000000 2859.343262 0.000000 0.685725 0.000000 -0.727861 0.732766 0.732766 0.732766
4353.884766 0.000000 2762.302490 0.000000 0.806547 0.000000 -0.591170 0.408527 0.408527 0.408527
4410.807129 0.000000 2774.388916 0.000000 0.913211 0.000000 -0.407487 0.457214 0.457214 0.457214
4413.658691 0.000000 2803.050049 0.000000 0.893222 0.000000 -0.449616 0.406427 0.406427 0.406427
4366.220703 0.000000 2784.815186 0.000000 0.853023 0.000000 -0.521873 0.407402 0.407402 0.407402
4371.771973 0.000000 2790.359863 0.000000 0.924013 0.000000 -0.382360 0.517197 0.517197 0.517197
4358.424805 0.000000 2788.094482 0.000000 0.814941 0.000000 -0.579544 0.670464 0.670464 0.670464
4399.868652 0.000000 2816.145264 0.000000 0.845652 0.000000 -0.533734 0.469854 0.469854 0.469854
4393.322754 0.000000 2816.010010 0.000000 0.900699 0.000000 -0.434443 0.593538 0.593538 0.593538
4409.910645 0.000000 2815.685303 0.000000 0.866864 0.000000 -0.498545 0.603688 0.603688 0.603688
4390.581055 0.000000 2802.858887 0.000000 0.714358 0.000000 -0.699780 0.490166 0.490166 0.490166
4352.042480 0.000000 2767.741699 0.000000 0.935493 0.000000 -0.353346 0.609335 0.609335 0.609335
4365.099609 0.000000 2787.510986 0.000000 0.861659 0.000000 -0.507488 0.665563 0.665563 0.665563
4366.979980 0.000000 2792.574463 0.000000 0.653783 0.000000 -0.756682 0.733146 0.733146 0.733146
4391.591309 0.000000 2809.570312 0.000000 0.939213 0.000000 -0.343335 0.538444 0.538444 0.538444
4457.563477 0.000000 2794.225342 0.000000 0.935658 0.000000 -0.352909 0.422088 0.422088 0.422088
4454.893555 0.000000 2787.181641 0.000000 0.902252 0.000000 -0.431210 0.483932 0.483932 0.483932
4456.763184 0.000000 2782.856445 0.000000 0.615395 0.000000 -0.788219 0.467686 0.467686 0.467686
4416.936035 0.000000 2790.343994 0.000000 0.860961 0.000000 -0.508671 0.579440 0.579440 0.579440
4122.709961 0.000000 3256.649414 0.000000 0.907509 0.000000 -0.420032 0.621573 0.621573 0.621573
4127.334473 0.000000 3260.594727 0.000000 0.919173 0.000000 -0.393854 0.446892 0.446892 0.446892
4100.957520 0.000000 3259.456543 0.000000 0.942329 0.000000 -0.334687 0.417791 0.417791 0.417791
4144.580566 0.000000 3250.050049 0.000000 0.868420 0.000000 -0.495830 0.720626 0.720626 0.720626
4162.500488 0.000000 3295.837891 0.000000 0.919697 0.000000 -0.392629 0.405581 0.405581 0.405581
4166.330566 0.000000 3288.190674 0.000000 0.807090 0.000000 -0.590428 0.444518 0.444518 0.444518
4182.937012 0.000000 3290.520996 0.000000 0.697551 0.000000 -0.716535 0.426615 0.426615 0.426615
4160.042480 0.000000 3276.101074 0.000000 0.924570 0.000000 -0.381012 0.505062 0.505062 0.505062
4388.276367 0.000000 3252.856201 0.000000 0.797841 0.000000 -0.602868 0.506203 0.506203 0.506203
6165.502930 0.000000 2420.662842 0.000000 0.590812 0.000000 -0.806809 0.539351 0.539351 0.539351
6154.072266 0.000000 2428.515869 0.000000 0.658376 0.000000 -0.752689 0.547880 0.547880 0.547880
6214.057129 0.000000 2417.281494 0.000000 0.943541 0.000000 -0.331255 0.546198 0.546198 0.546198
6205.512207 0.000000 2428.854248 0.000000 0.595576 0.000000 -0.803299 0.659607 0.659607 0.659607
6172.431641 0.000000 2436.335938 0.000000 0.920161 0.000000 -0.391540 0.715995 0.715995 0.715995
6220.978516 0.000000 2429.564209 0.000000 0.934099 0.000000 -0.357015 0.567020 0.567020 0.567020
6210.396484 0.000000 2430.690186 0.000000 0.757617 0.000000 -0.652700 0.499252 0.499252 0.499252
6242.900879 0.000000 2428.892822 0.000000 0.951030 0.000000 -0.309100 0.425389 0.425389 0.425389
6233.237793 0.000000 2434.987061 0.000000 0.899374 0.000000 -0.437180 0.526588 0.526588 0.526588
6219.786133 0.000000 2433.881104 0.000000 0.950468 0.000000 -0.310821 0.503530 0.503530 0.503530
6210.356934 0.000000 2433.726318 0.000000 0.949734 0.000000 -0.313057 0.475506 0.475506 0.475506
6327.638184 0.000000 2444.571533 0.000000 0.910075 0.000000 -0.414443 0.562501 0.562501 0.562501
6286.007324 0.000000 2459.718262 0.000000 0.616743 0.000000 -0.787165 0.494734 0.494734 0.494734
6286.873047 0.000000 2436.875244 0.000000 0.859331 0.000000 -0.511420 0.449075 0.449075 0.449075
6313.676758 0.000000 2446.895020 0.000000 0.851568 0.000000 -0.524243 0.514478 0.514478 0.514478
6330.504395 0.000000 2452.586914 0.000000 0.730136 0.000000 -0.683302 0.568438 0.568438 0.568438
6356.968750 0.000000 2480.953125 0.000000 0.890531 0.000000 -0.454922 0.406320 0.406320 0.406320
6345.203613 0.000000 2464.528809 0.000000 0.719351 0.000000 -0.694647 0.410736 0.410736 0.410736
6347.406250 0.000000 2461.898926 0.000000 0.887472 0.000000 -0.460861 0.596377 0.596377 0.596377
6344.407715 0.000000 2493.124756 0.000000 0.697061 0.000000 -0.717012 0.411018 0.411018 0.411018
"}
object={
	name="pine_sparse_generator_1_4"
	clamp_to_water_level=no
	render_under_water=no
	generated_content=yes
	layer="semidynamic"
	pdxmesh="tree_fir_005_mesh"
	count=36
	transform="2265.283936 0.000000 3241.227051 0.000000 0.051577 0.000000 -0.998669 0.458858 0.458858 0.458858
4062.953613 0.000000 3275.861816 0.000000 0.214407 0.000000 -0.976744 0.451936 0.451936 0.451936
6135.107910 0.000000 2474.029541 0.000000 0.476828 0.000000 -0.878996 0.464254 0.464254 0.464254
6136.315430 0.000000 2465.837158 0.000000 0.104610 0.000000 -0.994513 0.494604 0.494604 0.494604
6139.000977 0.000000 2466.629150 0.000000 0.175083 0.000000 -0.984554 0.516984 0.516984 0.516984
6120.832520 0.000000 2488.813721 0.000000 0.025432 0.000000 -0.999677 0.528701 0.528701 0.528701
4339.456055 0.000000 2761.538330 0.000000 0.152230 0.000000 -0.988345 0.418550 0.418550 0.418550
4333.375000 0.000000 2792.656006 0.000000 0.282976 0.000000 -0.959127 0.527637 0.527637 0.527637
4349.032715 0.000000 2789.922363 0.000000 0.178555 0.000000 -0.983930 0.529866 0.529866 0.529866
4390.230957 0.000000 2806.263428 0.000000 0.039773 0.000000 -0.999209 0.567758 0.567758 0.567758
4406.173828 0.000000 2773.918701 0.000000 0.535912 0.000000 -0.844274 0.423444 0.423444 0.423444
4357.119141 0.000000 2784.168701 0.000000 0.220024 0.000000 -0.975495 0.526833 0.526833 0.526833
4370.190430 0.000000 2777.256592 0.000000 0.511895 0.000000 -0.859048 0.471956 0.471956 0.471956
4364.526855 0.000000 2790.780273 0.000000 0.413927 0.000000 -0.910310 0.446480 0.446480 0.446480
4438.937012 0.000000 2782.161621 0.000000 0.168655 0.000000 -0.985675 0.419032 0.419032 0.419032
4420.047852 0.000000 2776.084473 0.000000 0.480279 0.000000 -0.877116 0.432748 0.432748 0.432748
4402.842773 0.000000 2842.088623 0.000000 0.569335 0.000000 -0.822105 0.716177 0.716177 0.716177
4394.288574 0.000000 2847.366455 0.000000 0.078405 0.000000 -0.996922 0.497251 0.497251 0.497251
4151.531250 0.000000 3230.213135 0.000000 0.548010 0.000000 -0.836472 0.517346 0.517346 0.517346
4121.505859 0.000000 3273.381104 0.000000 0.174012 0.000000 -0.984743 0.482574 0.482574 0.482574
4099.510742 0.000000 3266.537354 0.000000 0.146621 0.000000 -0.989193 0.495979 0.495979 0.495979
4160.090332 0.000000 3279.389404 0.000000 0.265274 0.000000 -0.964173 0.478782 0.478782 0.478782
6245.982422 0.000000 2422.605469 0.000000 0.430946 0.000000 -0.902378 0.743754 0.743754 0.743754
6238.953613 0.000000 2428.596191 0.000000 0.390987 0.000000 -0.920396 0.555114 0.555114 0.555114
6154.564941 0.000000 2431.376953 0.000000 0.136920 0.000000 -0.990582 0.446766 0.446766 0.446766
6263.638184 0.000000 2444.571533 0.000000 0.419475 0.000000 -0.907767 0.459017 0.459017 0.459017
6238.961914 0.000000 2429.789551 0.000000 0.160359 0.000000 -0.987059 0.560606 0.560606 0.560606
6320.541992 0.000000 2451.413330 0.000000 0.494102 0.000000 -0.869404 0.487028 0.487028 0.487028
6291.007324 0.000000 2446.906494 0.000000 0.441192 0.000000 -0.897413 0.579436 0.579436 0.579436
6299.131348 0.000000 2444.949219 0.000000 0.396820 0.000000 -0.917896 0.621457 0.621457 0.621457
6274.356934 0.000000 2433.726318 0.000000 0.128971 0.000000 -0.991648 0.589703 0.589703 0.589703
6288.244141 0.000000 2458.025879 0.000000 0.187687 0.000000 -0.982229 0.495208 0.495208 0.495208
6330.637207 0.000000 2455.761719 0.000000 0.015014 0.000000 -0.999887 0.446511 0.446511 0.446511
6340.032715 0.000000 2460.439697 0.000000 0.575241 0.000000 -0.817984 0.451872 0.451872 0.451872
6353.939453 0.000000 2470.623779 0.000000 0.181466 0.000000 -0.983397 0.443932 0.443932 0.443932
6357.934570 0.000000 2483.640137 0.000000 0.030264 0.000000 -0.999542 0.524242 0.524242 0.524242
"}
