[
  {
    "id": 1,
    "titol": "Doble d'un número",
    "enunciat": "Escriu el doble del següent valor",
    "inputPublic": "16",
    "outputPublic": "32",
    "inputPrivat": "49",
    "outputPrivat": "98",
    "resolt": false,
    "intents": 0
  },
  {
    "id": 2,
    "titol": "Suma dos nombres",
    "enunciat": "Suma els següents dos nombres",
    "inputPublic": "6 + 9",
    "outputPublic": "15",
    "inputPrivat": "88 + 22",
    "outputPrivat": "110",
    "resolt": false,
    "intents": 0
  },
  {
    "id": 3,
    "titol": "Multiplicar dos nombres",
    "enunciat": "Multiplica els següents nombres",
    "inputPublic": "4 * 2",
    "outputPublic": "8",
    "inputPrivat": "16 * 3",
    "outputPrivat": "48",
    "resolt": false,
    "intents": 0
  },
  {
    "id": 4,
    "titol": "Operació matemàtica senzilla",
    "enunciat": "Suma el primer amb el segon, multiplicat per el mòdul del tercer amb el quart.",
    "inputPublic": "(2 + 5) * (10%4)",
    "outputPublic": "14",
    "inputPrivat": "(23 + 31) * (156%5)",
    "outputPrivat": "54",
    "resolt": false,
    "intents": 0
  },
  {
    "id": 5,
    "titol": "Calcular el descompte",
    "enunciat": "A partir del preu original, calcula el descompte (Amb % al final)",
    "inputPublic": "Preu original: 100€, Preu amb descompte: 80€",
    "outputPublic": "20%",
    "inputPrivat": "Preu original: 540€, Preu amb descompte: 420€",
    "outputPrivat": "22.22",
    "resolt": false,
    "intents": 0
  },
  {
    "id": 6,
    "titol": "Calcular el salari",
    "enunciat": "A un treballador li paguen per hores, a partir de 40 hores de treball la tarifa per hora s'incrementa en un 50%. Calcula el salari del treballador, tenint en compte que la tarifa per hora és de 40 €/h.",
    "inputPublic": "40 hores",
    "outputPublic": "1600€ (Cal posar € al final)",
    "inputPrivat": "55 hores",
    "outputPrivat": "2500€",
    "resolt": false,
    "intents": 0
  },
  {
    "id": 7,
    "titol": "Determinar edat per treballar",
    "enunciat": "A partir de l'edat de l'usuari, determina si té edat per treballar (l'edat mínima per treballar legalment és 16 i suposarem l'edat màxima als 65).",
    "inputPublic": "14 anys",
    "outputPublic": "false",
    "inputPrivat": "56 anys",
    "outputPrivat": "true",
    "resolt": false,
    "intents": 0
  },
  {
    "id": 8,
    "titol": "Està dins del rang?",
    "enunciat": "A partir de 5 nombres, el primer i el segon creen un rang, el tercer i el quart creen un altre rang. Mostra true si el cinquè valor està entre els dos rangs, si no false.",
    "inputPublic": "10 40 20 30 25",
    "outputPublic": "true",
    "inputPrivat": "10 40 20 30 55",
    "outputPrivat": "false",
    "resolt": false,
    "intents": 0
  },
  {
    "id": 9,
    "titol": "Número parell o senar",
    "enunciat": "Indica si un valor es parell o senar.",
    "inputPublic": "5",
    "outputPublic": "senar",
    "inputPrivat": "2",
    "outputPrivat": "parell",
    "resolt": false,
    "intents": 0
  },
  {
    "id": 10,
    "titol": "Calcular lletra DNI",
    "enunciat": "Donat un número de dni, calcula la lletra que li correspon.",
    "inputPublic": "43580155",
    "outputPublic": "P",
    "inputPrivat": "65004203",
    "outputPrivat": "Q",
    "resolt": false,
    "intents": 0
  },
  {
    "id": 11,
    "titol": "Suma de nombres enters",
    "enunciat": "Donat un nombre primer, calcula la suma de tots els enters fins a arribar a aquest.",
    "inputPublic": "5",
    "outputPublic": "15",
    "inputPrivat": "9",
    "outputPrivat": "45",
    "resolt": false,
    "intents": 0
  },
  {
    "id": 12,
    "titol": "Elevar el nombre",
    "enunciat": "Eleva el nombre",
    "inputPublic": "5^3",
    "outputPublic": "125",
    "inputPrivat": "8^6",
    "outputPrivat": "262144",
    "resolt": false,
    "intents": 0
  },
  {
    "id": 13,
    "titol": "Escriure número a l'inversa",
    "enunciat": "Donat un nombre enter, escriu el nombre a la inversa.",
    "inputPublic": "67931",
    "outputPublic": "13976",
    "inputPrivat": "0909109010",
    "outputPrivat": "0109019090",
    "resolt": false,
    "intents": 0
  },
  {
    "id": 14,
    "titol": "Número de digits",
    "enunciat": "Donat un nombre enter, escriu el nombre de dígits que té.",
    "inputPublic": "126",
    "outputPublic": "3",
    "inputPrivat": "99899432",
    "outputPrivat": "8",
    "resolt": false,
    "intents": 0
  },
  {
    "id": 15,
    "titol": "Nombre primer o no",
    "enunciat": "Donat un nombre enter, indica si aquest és primer o no.",
    "inputPublic": "126",
    "outputPublic": "false",
    "inputPrivat": "7564",
    "outputPrivat": "false",
    "resolt": false,
    "intents": 0
  },
  {
    "id": 16,
    "titol": "Calcular la mitjana",
    "enunciat": "A partir d'una seqüència, calcula la mitjana de tots els valors..",
    "inputPublic": "1 7 3 2 4 7 5 8 7",
    "outputPublic": "4.888888888888889",
    "inputPrivat": "-3 10 0 -2 8",
    "outputPrivat": "2.6",
    "resolt": false,
    "intents": 0
  },
  {
    "id": 17,
    "titol": "Valor màxim i mínim",
    "enunciat": "A partir d'una seqüència, mostra el mínim i el màxim valor dins de la seqüència.",
    "inputPublic": "2 8 19 -32 189 -1 -68 190 0 1",
    "outputPublic": "-68 190",
    "inputPrivat": "1 5 6 7 10 19 23 43 198 192 200 0",
    "outputPrivat": "0 200",
    "resolt": false,
    "intents": 0
  },
  {
    "id": 18,
    "titol": "Determinar el valor que falta",
    "enunciat": "A partir d'una seqüència, mostra el valor que falta.",
    "inputPublic": "1 2 3 4 5 6 7 9 10 11",
    "outputPublic": "8",
    "inputPrivat": "110 111 112 113 115 116",
    "outputPrivat": "114",
    "resolt": false,
    "intents": 0
  },
  {
    "id": 19,
    "titol": "Ordenar seqüència (asc)",
    "enunciat": "A partir d'una seqüència, retorna la seqüència ordenada ascendentment.",
    "inputPublic": "3 54 23 1 345 623 1 12 4",
    "outputPublic": "1 1 3 4 12 23 54 345 623",
    "inputPrivat": "12 45 78 98 65 32 34 67 94 62 0",
    "outputPrivat": "0 12 32 34 45 62 65 67 78 94 98",
    "resolt": false,
    "intents": 0
  },
  {
    "id": 20,
    "titol": "Ordenar seqüència (desc)",
    "enunciat": "A partir d'una seqüència, retorna la seqüència ordenada descendentment.",
    "inputPublic": "3 54 23 1 345 623 1 12 4",
    "outputPublic": "623 345 54 23 12 4 3 1 1",
    "inputPrivat": "12 45 78 98 65 32 34 67 94 62 0",
    "outputPrivat": "98 94 78 67 65 62 45 34 32 12 0",
    "resolt": false,
    "intents": 0
  }
]