module vc-integration-service

go 1.22.2

require (
	github.com/aws/aws-sdk-go v1.51.30
	github.com/go-playground/validator/v10 v10.19.0
	github.com/hashicorp/go-retryablehttp v0.7.5
	github.com/jinzhu/gorm v1.9.16
	github.com/labstack/echo/v4 v4.12.0
	github.com/pkg/errors v0.9.1
	gopkg.in/yaml.v2 v2.4.0
	gorm.io/gorm v1.25.9
)

require (
	github.com/KyleBanks/depth v1.2.1 // indirect
	github.com/ghodss/yaml v1.0.0 // indirect
	github.com/go-openapi/jsonpointer v0.21.0 // indirect
	github.com/go-openapi/jsonreference v0.21.0 // indirect
	github.com/go-openapi/spec v0.21.0 // indirect
	github.com/go-openapi/swag v0.23.0 // indirect
	github.com/jmespath/go-jmespath v0.4.0 // indirect
	github.com/josharian/intern v1.0.0 // indirect
	github.com/mailru/easyjson v0.7.7 // indirect
	github.com/swaggo/files/v2 v2.0.0 // indirect
	github.com/swaggo/swag v1.16.3 // indirect
	golang.org/x/tools v0.20.0 // indirect
	gopkg.in/yaml.v3 v3.0.1 // indirect
)

require (
	github.com/gabriel-vasile/mimetype v1.4.3 // indirect
	github.com/go-playground/locales v0.14.1 // indirect
	github.com/go-playground/universal-translator v0.18.1 // indirect
	github.com/hashicorp/go-cleanhttp v0.5.2 // indirect
	github.com/jinzhu/inflection v1.0.0 // indirect
	github.com/jinzhu/now v1.1.5 // indirect
	github.com/labstack/gommon v0.4.2 // indirect
	github.com/leodido/go-urn v1.4.0 // indirect
	github.com/lib/pq v1.1.1 // indirect
	github.com/mattn/go-colorable v0.1.13 // indirect
	github.com/mattn/go-isatty v0.0.20 // indirect
	github.com/swaggo/echo-swagger v1.4.1
	github.com/valyala/bytebufferpool v1.0.0 // indirect
	github.com/valyala/fasttemplate v1.2.2 // indirect
	golang.org/x/crypto v0.22.0 // indirect
	golang.org/x/net v0.24.0 // indirect
	golang.org/x/sys v0.19.0 // indirect
	golang.org/x/text v0.14.0 // indirect
)
