^C:\USERS\SEDC-PC\SOURCE\REPOS\WIN_SERIAL_COMMUNICATION5\WIN_SERIAL_COMMUNICATION5\DEBUG\PCH.OBJ|C:\USERS\SEDC-PC\SOURCE\REPOS\WIN_SERIAL_COMMUNICATION5\WIN_SERIAL_COMMUNICATION5\DEBUG\WIN_SERIAL_COMMUNICATION5.OBJ
C:\USERS\SEDC-PC\SOURCE\REPOS\WIN_SERIAL_COMMUNICATION5\DEBUG\WIN_SERIAL_COMMUNICATION5.EXE
C:\USERS\SEDC-PC\SOURCE\REPOS\WIN_SERIAL_COMMUNICATION5\DEBUG\WIN_SERIAL_COMMUNICATION5.ILK
C:\USERS\SEDC-PC\SOURCE\REPOS\WIN_SERIAL_COMMUNICATION5\DEBUG\WIN_SERIAL_COMMUNICATION5.PDB
